
##TITLE=UV1152_M3-1004-1000_6301692_qxS3JLbsuf
##JCAMPDX= 6.0         $$ Bruker NMR JCAMP-DX V2.0
##DATA TYPE= NMR SPECTRUM
##DATA CLASS= NTUPLES
##ORIGIN= BRUKER
##OWNER= Administrator
$$ 1.72 TOPSPIN		Version 2.1
$$ 2012-06-05 22:50:08.093 -0500  Administrator@TOPSPIN
$$ Compression mode = diff/dup
##.OBSERVE FREQUENCY= 400.13188235
##.OBSERVE NUCLEUS= ^1H
##.ACQUISITION MODE= SIMULTANEOUS (DQD)
##.ACQUISITION SCHEME= undefined
##.AVERAGES= 64
##.DIGITISER RES= 22
##SPECTROMETER/DATA SYSTEM= spect
##.PULSE SEQUENCE= noesygpps1d.comp
##.SOLVENT NAME= COFFEE_meoh
##.SHIFT REFERENCE= INTERNAL, COFFEE_meoh, 1, 14.96702
##AUDIT TRAIL= $$ (NUMBER, WHEN, WHO, WHERE, PROCESS, VERSION, WHAT)
$$ ##TITLE= Audit trail, TOPSPIN		Version 2.1
$$ ##JCAMPDX= 5.01
$$ ##ORIGIN= Bruker BioSpin GmbH
$$ ##OWNER= Administrator
$$ $$ C:\Bruker\TOPSPIN/data/COFFEE/nmr/UV1152_M3-1004-1000_6301692_qxS3JLbsuf/12/pdata/1/auditp.txt
$$ ##AUDIT TRAIL=  $$ (NUMBER, WHEN, WHO, WHERE, PROCESS, VERSION, WHAT)
(   1,<2012-06-05 22:50:03.000 -0500>,<Administrator>,<TOPSPIN>,<go>,<TOPSPIN 2.1>,
      <created by zg
	started at 2012-06-05 22:38:32.734 -0500,
	POWCHK enabled, PULCHK disabled,
       configuration hash MD5:
       D5 CA 7A 23 FE 6B EE E2 50 67 74 61 24 F7 5E 3B
       data hash MD5: 64K
       D7 AB 63 F2 69 F0 D2 C0 5A 7A F2 E7 B1 9D DC ED>)
(   2,<2012-06-05 22:50:05.906 -0500>,<Administrator>,<TOPSPIN>,<proc1d>,<TOPSPIN 2.1>,
      <Start of raw data processing
       efp LB = 0.3 FT_mod = 6 PKNL = 1 PHC0 = 0 PHC1 = 0 SI = 128K 
       data hash MD5: 128K
       8A A0 21 F6 0E C8 EA 1C 38 35 21 68 E7 10 60 60>)
(   3,<2012-06-05 22:50:07.281 -0500>,<Administrator>,<TOPSPIN>,<proc1d>,<TOPSPIN 2.1>,
      <pk PHC0 = 33.23914 PHC1 = 0 
       data hash MD5: 128K
       AF 5E CA F6 21 F4 28 79 55 46 11 32 C2 6E 56 B7>)
(   4,<2012-06-05 22:50:07.781 -0500>,<Administrator>,<TOPSPIN>,<proc1d>,<TOPSPIN 2.1>,
      <abs ABSG = 1 
       data hash MD5: 128K
       77 EA E2 4A E4 BC BC 8C EF FD 29 09 DF F5 75 80>)
(   5,<2012-06-05 22:50:07.859 -0500>,<Administrator>,<TOPSPIN>,<proc1d>,<TOPSPIN 2.1>,
      <abs ABSG = 2 
       data hash MD5: 128K
       AD DF 5D 85 4F 58 0E 2E 67 3C C5 04 9A 99 E8 88>)
(   6,<2012-06-05 22:50:07.906 -0500>,<Administrator>,<TOPSPIN>,<proc1d>,<TOPSPIN 2.1>,
      <abs ABSG = 3 
       data hash MD5: 128K
       6F B7 35 41 94 D8 98 F6 FA F7 60 A3 7D 8A D7 0D>)
(   7,<2012-06-05 22:50:07.953 -0500>,<Administrator>,<TOPSPIN>,<proc1d>,<TOPSPIN 2.1>,
      <abs ABSG = 4 
       data hash MD5: 128K
       20 A0 F2 DB CD 9C A7 92 97 F1 14 E0 4A 6E F8 7D>)
(   8,<2012-06-05 22:50:08.015 -0500>,<Administrator>,<TOPSPIN>,<proc1d>,<TOPSPIN 2.1>,
      <abs ABSG = 5 
       data hash MD5: 128K
       18 9E 82 7A D0 16 6D 95 FB F5 04 A3 40 21 08 DC>)
$$ ##END=
$$ 
$$ $$ hash MD5
$$ $$ F6 3E EF 84 CF 18 C6 2E A0 38 D1 F6 41 6A 7E 8C
##$RELAX= 
##$RELAX= 
##$RELAX= 
##$RELAX= 
##$RELAX= 
##$RELAX= 
##$RELAX= 
##$RELAX= 
$$ Bruker specific parameters
$$ [...]
##$TP07= 0
##$TPNAME0= <>
##$TPNAME1= <>
##$TPNAME2= <>
##$TPNAME3= <>
##$TPNAME4= <>
##$TPNAME5= <>
##$TPNAME6= <>
##$TPNAME7= <>
##$TPOAL= (0..7)
0.5 0.5 0.5 0.5 0.5 0.5 0.5 0.5
##$TPOFFS= (0..7)
0 0 0 0 0 0 0 0
##$TUNHIN= 0
##$TUNHOUT= 0
##$TUNXOUT= 0
##$USERA1= <user>
##$USERA2= <user>
##$USERA3= <user>
##$USERA4= <user>
##$USERA5= <user>
##$V9= 5
##$VALIST= <valist>
##$VCLIST= <CCCCCCCCCCCCCCC>
##$VD= 0
##$VDLIST= <DDDDDDDDDDDDDDD>
##$VPLIST= <PPPPPPPPPPPPPPP>
##$VTLIST= <TTTTTTTTTTTTTTT>
##$WBST= 2048
##$WBSW= 25
##$XGAIN= (0..3)
0 0 0 0
##$XL= 0
##$YL= 0
##$YMAX_a= 11071689
##$YMIN_a= -6858704
##$ZGOPTNS= <>
##$ZL1= 120
##$ZL2= 120
##$ZL3= 120
##$ZL4= 120
##$ABSF1= 14.96702
##$ABSF2= -5.58551
##$ABSG= 5
##$ABSL= 3
##$ALPHA= 0
##$AQORDER= 0
##$ASSFAC= 0
##$ASSFACI= 0
##$ASSFACX= 0
##$ASSWID= 0
##$AUNMP= <proc_prof1d_extract.lims>
##$AXLEFT= 0
##$AXNAME= <>
##$AXNUC= <1H>
##$AXRIGHT= 0
##$AXTYPE= 0
##$AXUNIT= <>
##$AZFE= 0.1
##$AZFW= 0.1
##$BCFW= 0
##$BC_mod= 0
##$BYTORDP= 0
##$COROFFS= 0
##$CY= 15
##$DATMOD= 1
##$DC= 0
##$DFILT= <>
##$DTYPP= 0
##$F1P= 0
##$F2P= 0
##$FCOR= 0.5
##$FTSIZE= 131072
##$FT_mod= 6
##$GAMMA= 0
##$GB= 0
##$INTBC= 1
##$INTSCL= 1
##$ISEN= 128
##$LB= 0.3
##$LEV0= 0
##$LPBIN= 0
##$MAXI= 10000
##$MC2= 0
##$MEAN= 0
##$ME_mod= 0
##$MI= 0
##$NCOEF= 0
##$NC_proc= -3
##$NLEV= 6
##$NOISF1= 0
##$NOISF2= 0
##$NSP= 0
##$NTH_PI= 0
##$NZP= 0
##$OFFSET= 14.96702
##$PC= 1
##$PHC0= 33.23914
##$PHC1= 0
##$PH_mod= 1
##$PKNL= yes
##$PPARMOD= 0
##$PPDIAG= 0
##$PPIPTYP= 0
##$PPMPNUM= 2147483647
##$PPRESOL= 1
##$PSCAL= 4
##$PSIGN= 0
##$PYNMP= <proc.py>
##$REVERSE= no
##$SF= 400.130005439044
##$SI= 131072
##$SIGF1= 0
##$SIGF2= 0
##$SINO= 400
##$SIOLD= 131072
##$SPECTYP= <>
##$SREGLST= <1H.CDCl3>
##$SSB= 0
##$STSI= 131072
##$STSR= 0
##$SW_p= 8223.68421052632
##$SYMM= 0
##$S_DEV= 0
##$TDeff= 65536
##$TDoff= 0
##$TI= <>
##$TILT= no
##$TM1= 0
##$TM2= 0
##$TOPLEV= 0
##$USERP1= <user>
##$USERP2= <user>
##$USERP3= <user>
##$USERP4= <user>
##$USERP5= <user>
##$WDW= 1
##$XDIM= 131072
##$YMAX_p= 446231142
##$YMIN_p= -358497610
##$CURPLOT= <Network HP LaserJet P1505>
##$CURPRIN= <$Network HP LaserJet P1505>
##$DFORMAT= <normdp>
##$LAYOUT= <+/1D_H.xwp>
##$LFORMAT= <normlp>
##$PFORMAT= <normpl>
##$SURQMSG= 1
$$ End of Bruker specific parameters
$$ ---------------------------------
##NTUPLES= NMR SPECTRUM
##VAR_NAME=  FREQUENCY,     SPECTRUM/REAL,   SPECTRUM/IMAG
##SYMBOL=    X,             R,               I
##VAR_TYPE=  INDEPENDENT,   DEPENDENT,       DEPENDENT
##VAR_FORM=  AFFN,          ASDF,            ASDF
##VAR_DIM=   131072,        131072,          131072
##UNITS=     HZ,            ARBITRARY UNITS, ARBITRARY UNITS
##FACTOR=    0.0627417313425165, 1,          1
##FIRST=     8223.62146879498, 2005,         -114738
##LAST=      0,             5543,            -116242
##MIN=       0,             -358497610,      0
##MAX=       8223.62146879498, 446231142,    0
$$ Real data points
##PAGE= N=1
##DATA TABLE= (X++(R..R)), XYDATA
$$ [...]
61268A222561n991q111r787j0215q943o851n896o882q036p303n524n343o833o788
$$ 1222561 1216570 1208459 1198672 1188457 1179514 1172663 1166767 1159885 1151849 1144546 1139022 1133679 1126846 1120058
61254A120058l396O89J806J58j008jJ959L522M863O371P665Q626R812J1104J1161
$$ 1120058 1116662 1117351 1119157 1119315 1118307 1118306 1120265 1123787 1128650 1135021 1142686 1151312 1161124 1172228 1183389
61239A183389R009N400J915o74k641m555o738r072j0977j1757j1150r413p122
$$ 1183389 1192398 1197798 1199713 1199039 1196398 1191843 1185105 1176033 1165056 1153299 1142149 1132736 1125614
61226A125614n165m466n016n495m656k888j557r68r2J726L824N272N895O048O192
$$ 1125614 1120449 1115983 1110967 1105472 1100816 1097928 1096371 1095403 1095311 1097037 1100861 1106133 1112028 1118076 1124268
61211A124268O993Q979J1719J4036J5376J6237J7048J7537J7644J8122J9536K1329
$$ 1124268 1131261 1140240 1151959 1165995 1181371 1197608 1214656 1232193 1249837 1267959 1287495 1308824
61199A308824K2629K3537K4761K6222K6732K5202K1805J7812J4484J2029R549
$$ 1308824 1331453 1354990 1379751 1405973 1432705 1457907 1479712 1497524 1512008 1524037 1533586
61188A533586O100J811k156m798o216p392r184j1558j3634j4560j4376j3843j3474
$$ 1533586 1539686 1541497 1539341 1534543 1528327 1520935 1511751 1500193 1486559 1471999 1457623 1443780 1430306
61175A430306j3203j3077j3495j4245j4097j2233r512p395o082m832l681l414
$$ 1430306 1417103 1404026 1390531 1376286 1362189 1349956 1340444 1333049 1326967 1322135 1318454 1315040
61163A315040l847l696k617k117l569o086p366o296m108k847l126l627k955j633
$$ 1315040 1311193 1307497 1304880 1302763 1299194 1293108 1285742 1279446 1275338 1272491 1269365 1265738 1262783 1261150
61149A261150j528l192m879m961m137l976m176l148p69J423K912M939Q197J1548
$$ 1261150 1259622 1256430 1251551 1246590 1242453 1238477 1234301 1231153 1230384 1231807 1234719 1239658 1247855 1259403
61135A259403J3878J5580J7276J8523J8885J9053J9681K0013J8709J5372J0601
$$ 1259403 1273281 1288861 1306137 1324660 1343545 1362598 1382279 1402292 1421001 1436373 1446974
61124A446974N436J520N70K499M861N344M144K843J890N17j484l425m933o154
$$ 1446974 1452410 1453930 1454500 1456999 1461860 1467204 1471348 1474191 1476081 1476598 1475114 1471689 1466756 1460602
61110A460602o840o477n330m523m970o888j0056j3704j6430j7294j6951j6775
$$ 1460602 1453762 1447285 1441955 1437432 1432462 1425574 1415518 1401814 1385384 1368090 1351139 1334364
61098A334364j6911j6257j4392j2440j1614j1737j1638j0434q112n386l260k270
$$ 1334364 1317453 1301196 1286804 1274364 1262750 1251013 1239375 1228941 1220829 1215443 1212183 1209913
61086A209913j963j623j541k830n675q542r833r697r444r517r219q348p844q145
$$ 1209913 1207950 1206327 1204786 1201956 1196281 1187739 1177906 1168209 1158765 1149248 1140029 1131681 1123837 1115692
61072A115692p959n827k356M28J863L323N800Q338R853J1106J3340J5812J6609
$$ 1115692 1107733 1101906 1099550 1099978 1101841 1105164 1110964 1119302 1129155 1140261 1153601 1169413 1186022
61059A186022J5733J5484J7402K0379K2442K3171K3470K3869K4078K3738K2870
$$ 1186022 1201755 1217239 1234641 1255020 1277462 1300633 1324103 1347972 1372050 1395788 1418658
61048A418658K1798K0964K0503J9837J8293J6293J5106J4966J4211J1037N690
$$ 1418658 1440456 1461420 1481923 1501760 1520053 1536346 1551452 1566418 1580629 1591666 1597356
61037A597356K22l675o155q598j1854j5182j7102j7322j7332j8446j9887j9771
$$ 1597356 1597578 1593903 1587748 1579150 1567296 1552114 1535012 1517690 1500358 1481912 1462025 1442254
61025A442254j7777j5517j4256j3595j2792j2052j1749j1374j0109q036o103n212
$$ 1442254 1424477 1408960 1394704 1381109 1368317 1356265 1344516 1333142 1323033 1314997 1308894 1303682
61013A303682n480n963n176k544P17K936M032N219P048R132J1534J4772J8230
$$ 1303682 1298202 1292239 1287063 1284519 1285236 1288172 1292204 1297423 1304471 1313603 1325137 1339909 1358139
61000A358139K0448K1342K2386K4102K5340K5811K7215L0625L4559L7128L8595
$$ 1358139 1378587 1399929 1422315 1446417 1471757 1497568 1524783 1555408 1589967 1627095 1665690
60989A665690M0401M2960M5957M9624N4254N9281O4007O8333P1987P4277P5648
$$ 1665690 1706091 1749051 1795008 1844632 1898886 1958167 2022174 2090507 2162494 2236771 2312419
60978B312419P7997Q2441Q8121R4141J00767J07644J13006J16455J20387J26781
$$ 2312419 2390416 2472857 2560978 2655119 2755886 2863530 2976536 3092991 3213378 3340159
60968C340159J34496J41899J49970J60264J71653J82016J91564K01643K11916
$$ 3340159 3474655 3616554 3766524 3926788 4098441 4280457 4472021 4673664 4885580
60959D885580K22017K34461K52311K74910K99356L25304L54519L86688M19804
$$ 4885580 5107597 5342058 5594369 5869279 6168635 6493939 6848458 7235146 7654950
60950G654950M54508M94218N41196N96429O63127P46231Q48567R71444J117954
$$ 7654950 8109458 8603676 9144872 9741301 10404428 11150659 11999226 12970670 14088624
60941A4088624J290656J487374J705857J950985K228251K531757K852395L195385
$$ 14088624 15379280 16866654 18572511 20523496 22751747 25283504 28135899 31331284
60933C1331284L556774L854458L904529L527173K717399J701505P96311K03916
$$ 31331284 34888058 38742516 42647045 46174218 48891617 50593122 51389433 51593349
60925E1593349n8299o5196J09822L67574N14835L14811l40846j317292k316585
$$ 51593349 51535050 51469854 51579676 51947250 52462085 52776896 52436050 51118758 48802173
60916D8802173l077432l504296l642192l579697l390722l131349k845861k561752
$$ 48802173 45724741 42220445 38578253 34998556 31607834 28476485 25630624 23068872
60908B3068872k289658k033640j797524j582850j388747j216072j067010r40093
$$ 23068872 20779214 18745574 16948050 15365200 13976453 12760381 11693371 10753278
60900A0753278q30368p35072o54586n87211n27867m73463m25520l85599l51676
$$ 10753278 9922910 9187838 8533252 7946041 7418174 6944711 6519191 6133592 5781916
60891E781916l20711k91752k64637k38643k14497j95253j82739j74769j67647
$$ 5781916 5461205 5169453 4904816 4666173 4451676 4256423 4073684 3898915 3731268
60882C731268j59821j51587j42994j34050j25627j18299j11216j03708r6850r1878
$$ 3731268 3571447 3419860 3276866 3142816 3017189 2898890 2787674 2683966 2587116 2495238
60872B495238q8004q3510p8193p3084o8318o3031n7128n1615m7127m3364m0026
$$ 2495238 2407234 2323724 2245531 2172447 2104129 2041098 1983970 1932355 1885228 1841864 1801838
60861A801838l7218l4775l2050k8705k5100k1721j8681j5785j2725r175n140j214
$$ 1801838 1764620 1729845 1697795 1669090 1643990 1622269 1603588 1587803 1575078 1565903 1560763 1559549
60849A559549J687L058L257L393M649P320J0375J2360J2821J2502J2240J2222
$$ 1559549 1561236 1564294 1567551 1570944 1575593 1582913 1593288 1605648 1618469 1630971 1643211 1655433
60837A655433J2321J2391J1877R949O513K569r73m260p762j1157j3639j5032j5978
$$ 1655433 1667754 1680145 1692022 1701971 1708484 1711053 1710080 1705820 1698058 1686901 1673262 1658230 1642252
60824A642252j7258j9379k2474k5971k8633k9623k9377k8856k8186k6784k4652
$$ 1642252 1624994 1605615 1583141 1557170 1528537 1498914 1469537 1440681 1412495 1385711 1361059
60813A361059k2663k1531k1219k1453k2046k2458k1878k0271j8654j7809j7290
$$ 1361059 1338396 1316865 1295646 1274193 1252147 1229689 1207811 1187540 1168886 1151077 1133787
60802A133787j6334j5152j4404j3785j2337j0148q649q783r852j0660j0997j1270
$$ 1133787 1117453 1102301 1087897 1074112 1061775 1051627 1042978 1034195 1024343 1013683 1002686 991416
60790I91416j1382j0915j0037r224q385p115n783n340o047p212q317r538j0899
$$ 991416 980034 969119 959082 949858 941473 934358 928575 923235 917188 909976 901659 892121 881222
60777H81222j1861j2112j2023j1855j1271j0056q645p408o074m368k579j018L33
$$ 881222 869361 857249 845226 833371 822100 812044 803399 795991 789917 785549 782970 781952 782285
60764G82285J117N66r53j417M72L115L837K441J224J505K030J357Oq01j124j653
$$ 782285 783402 783968 783015 781598 782070 785185 789022 791463 792687 794192 796222 797579 797585 796784 795660 794007
60748G94007k018j321N5P19L14mM93Q73l2j823l034l038k605k722l615m903n987
$$ 794007 791989 790668 790723 791442 791756 791752 792245 793118 793086 791263 788229 785191 782586 779864 776249 771346 765359
60731G65359o172n109l593l206m573o417o989o115n090m844n081n184n039m783
$$ 765359 759187 754078 750485 747279 742706 736289 729300 723185 718095 713251 708170 702986 697947 693164
60717F93164m553m779n832p069p067n344l195k140k231k519k556k467k031q37
$$ 693164 688611 683832 678000 670931 663864 658520 655325 653185 650954 648435 645879 643412 641381 640544
60703F40544O84J342O22n75q92J80J989L382L661L256L409M889P022Q339Q097
$$ 640544 641228 642570 643192 642617 641725 641905 643894 647276 650937 654193 657602 662491 669513 677852 685949
60688F85949O833N509M594M056L789L744L711L175J654o56k745l736l917m383
$$ 685949 692782 698291 702885 706941 710730 714474 718185 721360 723014 722358 719613 715877 711960 707577
60674G07577n610o980p811q130q144p740p080o839p146o923n304l209k504l701
$$ 707577 701967 694987 687176 679046 670902 663162 656082 649243 642097 635174 629870 626661 624157 620456
60660F20456n397o000n281m130l387l085k577j375L5P09N94O91J446J921J301
$$ 620456 615059 609059 603778 599648 596261 593176 590599 589224 589259 589968 590562 591253 592699 594620 595921
60645E95921K55k36m90j165j440k3K328L160J563o01j269n95m8k58n92j59J453
$$ 595921 596176 595940 595450 594285 592845 592822 595150 598310 599873 599272 598003 597408 597360 597102 596510 596351 597804
60628E97804L866N912O539O067N908O791P961Q418Q165P809P588P307O780O046
$$ 597804 601670 607582 614121 620188 626096 632887 640848 649266 657431 665240 672828 680135 686915 692961
60614F92961N568O097P657Q790P917N451L367K471J551l04k096k584k319k743
$$ 692961 698529 704626 712283 721073 728990 734441 737808 740279 741830 741526 739430 736846 734527 731784
60600G31784m168n752o747o733n341k904q57l18p81j134j342j921k355j619k8
$$ 731784 727616 721864 715117 708384 703043 700139 699282 698964 698183 697049 695707 693786 691431 689812 689784
60585F89784P89j09k151m334o002o596n893m689m103m051l522k467k011k438k424
$$ 689784 690573 690464 688313 683979 677977 671381 665488 660799 656696 652645 649123 646656 644645 642207 639783
60570F39783j100L83M46p09j575j365m12Q30J993K294J192m63j068k84O73R03
$$ 639783 638683 639066 639512 638803 637228 635863 635451 636281 638274 640568 641760 641297 640229 639945 640618 641521
60554F41521R18J376J900J974K139L189M644N263M894M644N085N377M682L514
$$ 641521 642439 643815 645715 647689 649828 653017 657661 662924 667818 672462 677547 682924 687606 691120
60540F91120K979L266L610L440K928K557K674L307M169M881N324N436M727K847
$$ 691120 694099 697365 700975 704415 707343 709900 712574 715881 720050 724931 730255 735691 740418 743265
60526G43265R46J327M612Q084Q306N179J997J512L366N678P590R367J1173J2832
$$ 743265 744211 745538 750150 758234 766540 771719 773716 775228 778594 784272 791862 801229 812402 825234
60512H25234J4324J5735J7007J8194J9509K0880K2082K3537K6097K9456L1722
$$ 825234 839558 855293 872300 890494 910003 930883 952965 976502 1002599 1032055 1063777
60501A063777L1304K8516K4531J9669J3785P636K516j298m517p428r513j0394
$$ 1063777 1095081 1123597 1148128 1167797 1181582 1189218 1191734 1190436 1185919 1178491 1168978 1158584
60489A158584j0061q208m459N07N091Q503J1554J5393K0148K5185L0105L4937
$$ 1158584 1148523 1140315 1135856 1136363 1141454 1149957 1161511 1176904 1197052 1222237 1252342 1287279
60477A287279L9798M4806N0049N5279N9813O2886O3966O2663N8600N1571M1751
$$ 1287279 1327077 1371883 1421932 1477211 1537024 1599910 1663876 1726539 1785139 1836710 1878461
60466A878461K9861J7245N390n014j4153k1878k7025k8875k8753k8823k9343k8498
$$ 1878461 1908322 1925567 1930957 1925943 1911790 1889912 1862887 1834012 1805259 1776436 1747093 1718595
60454A718595k5267k0999j7332j3918r385l767J493N630R478J4205K0003K6265
$$ 1718595 1693328 1672329 1654997 1641079 1631694 1627927 1629420 1635050 1644528 1658733 1678736 1705001
60442A705001L2543L9133M6927N6451O6870P6350Q3833Q9927R5440R9625J00745
$$ 1705001 1737544 1776677 1823604 1880055 1946925 2023275 2107108 2197035 2292475 2392100 2492845
60431B492845R8070R2334Q4351P4288O2342M9334L6437K5077J6982J3264J3155
$$ 2492845 2590915 2683249 2767600 2841888 2904230 2953564 2990001 3015078 3032060 3045324 3058479
60420C058479J4557J6067J7444J7794J4649N755r019k8190m9998p2258r1952j06671
$$ 3058479 3073036 3089103 3106547 3124341 3138990 3144745 3135726 3107536 3057538 2985280 2893328 2786657
60408B786657j16225j21752j23715j22079j17925j13037j07696j00603r1469q2078
$$ 2786657 2670432 2548680 2424965 2302886 2184961 2071924 1964228 1863625 1772156 1690078
60398A690078p4088o7180o0455n4357m9800m6336m2691l8689l5237l2544k9823
$$ 1690078 1615990 1548810 1488355 1433998 1384198 1337862 1295171 1256482 1221245 1188701 1158878
60387A158878k6825k4406k3153k2347k0807j8211j5184j2634j1190j0708j0122
$$ 1158878 1132053 1107647 1084494 1062147 1041340 1023129 1007945 995311 984121 973413 963291
60376I63291q282n406l145k833m014n146n451n515o202p511q684r194r347r768
$$ 963291 955009 949603 946458 943625 939611 934465 929014 923499 917297 909786 901102 891908 882561 872793
60362H72793j0426j0433r107o943n160m328l904l249k567k496l045l425k948j803
$$ 872793 862367 851934 842827 835884 830724 826396 822492 819243 816676 814180 811135 807710 804762 802959
60348H02959p37r2M95J341K022J903J236J044J692K335K228J876K125K657K511
$$ 802959 802222 802130 802625 803966 805988 807891 809127 810171 811863 814198 816426 818302 820427 823084 825595
60333H25595J747J427J975K645K871K947L034K544J208j29m61K80J661L484N336
$$ 825595 827342 828769 830744 833389 836260 839207 842241 844785 845993 845864 845403 845683 847344 850828 856164
60318H56164O199N631M745M881N619N391L899K556K363K662K632K664L260L532
$$ 856164 862363 867994 872739 877620 883239 888630 892529 895085 897448 900110 902742 905406 908666 912198
60304I12198K254R5o49J174M125O092O709P118Q007R009R815J0704J1735J2502
$$ 912198 914452 914547 913898 915072 919197 925289 931998 939116 947123 956132 965947 976651 988386 1000888
60290A000888J3174J4815J7799K0552K0976J8806J5614J2626R592N871J510l005
$$ 1000888 1014062 1028877 1046676 1067228 1088204 1107010 1122624 1135250 1144842 1150713 1152223 1149218
60278A149218p193j0356j1754j1595j1168j1364j1689j1284j0332r656r358q746
$$ 1149218 1142025 1131669 1119915 1108320 1097152 1085788 1074099 1062815 1052483 1042827 1033469 1024723
60266A024723p524o261n582n544n846o165o084n147l314j229K78J005J610L005
$$ 1024723 1017199 1010938 1005356 999812 993966 987801 981717 976570 973256 972027 972305 973310 974920 977925
60252I77925N529Q804J2237J5399J7958J9899K1988K5390L0240L5279L9531M3375
$$ 977925 983454 992258 1004495 1019894 1037852 1057751 1079739 1105129 1135369 1170648 1210179 1253554
60240A253554M6722M7022M1332L0336J8078P158l706j6202k8726l8006m2941m4739
$$ 1253554 1300276 1347298 1388630 1418966 1437044 1444202 1440496 1424294 1395568 1357562 1314621 1269882
60228A269882m4300m1673l7655l3737l0350k6870k3449k1122j9884j8293j5488
$$ 1269882 1225582 1183909 1146254 1112517 1082167 1055297 1031848 1010726 990842 972549 957061
60217I57061j2312r992q767q284q221q149p589o664n914n417m844m399m551m935
$$ 957061 944749 934757 925990 917706 909485 901336 893747 887083 881169 875752 870908 866509 861958 857023
60203H57023m696l995l774l931l304j846j035j420j526l13Q53J92j730k829k310
$$ 857023 852327 848332 844558 840627 837323 835477 834442 833022 831496 831183 832036 832228 830498 827669 825359
60188H25359j144j80O56J520K223K685K972K964K647K465K761L287L776M394N118
$$ 825359 824215 824035 824691 826211 828434 831119 834091 837055 839702 842167 844928 848215 851991 856385 861503
60173H61503N396N082M896N124M900L809L052L657M587M406L783M322N460M976
$$ 861503 866899 871981 876877 882001 886901 890710 893762 897419 902006 906412 910195 914517 919977 924953
60159I24953K472M6p36k70R31L111N483O034M509L505M986P366P941O743N898
$$ 924953 927425 927471 926735 926465 927396 930507 935990 942024 946533 950038 955024 962390 970331 977074 982972
60144I82972O182O387N714M820M459M662N256N922N780M147J787K10j39QK46Q36
$$ 982972 989154 995541 1001255 1006075 1010534 1015196 1020452 1026374 1032154 1036301 1038088 1038298 1038159 1038167 1038413 1039249
60128A039249J528J461N25l09l64m1J00R5J74M73J338L000M736N357M777M033
$$ 1039249 1040777 1042238 1042763 1042454 1042090 1042049 1042149 1042244 1042418 1042891 1044229 1047229 1051965 1057322 1062099 1066132
60112A066132L530K594J267J114L100N779O871O021M685L668K132p78m370o918
$$ 1066132 1069662 1072256 1073523 1074637 1077737 1083516 1090387 1096408 1101093 1104761 1106893 1106115 1101745 1094827
60098A094827p310o024m576m038l987l198j342O27J890K753L785M926O133P993
$$ 1094827 1087517 1081493 1076917 1072879 1068892 1065694 1064352 1064979 1066869 1069622 1073407 1078333 1084466 1092459
60084A092459J0569J2364J1833R726Q428Q890R612R001P550O737O791O629N695
$$ 1092459 1103028 1115392 1127225 1136951 1145379 1154269 1163881 1172882 1180432 1187169 1193960 1200589 1206284
60071A206284M776M768N272M945L087M02j938l559m722n235m511k892j913k494
$$ 1206284 1211060 1215828 1221100 1226045 1229132 1229534 1227596 1224037 1219315 1214080 1209569 1206677 1204764 1202270
60057A202270l618l660k422r75R2J093K298L657N423P824J0072J0967J0689J0756
$$ 1202270 1198652 1194992 1192570 1191595 1191687 1192780 1195078 1198735 1204158 1211982 1222054 1233021 1243710 1254466
60043A254466J1874J2918J2621J1178R568Q278P423P177P145O065L249k02k489
$$ 1254466 1266340 1279258 1291879 1303057 1312625 1320903 1328326 1335503 1342648 1348713 1351962 1351760 1349271
60030A349271l138l051k989l044l417m580o410p978q561q411q209q139p854p243
$$ 1349271 1346133 1343082 1340093 1337049 1333632 1329052 1322642 1314664 1306103 1297692 1289483 1281344 1273490 1266247
60016A266247o974q033j0570j3348j4808j4759j4450j4842j5426j5170j4081j3076
$$ 1266247 1259273 1251240 1240670 1227322 1212514 1197755 1183305 1168463 1153037 1137867 1123786 1110710
60004A110710j2664j2497j2053j1204j0171r460r707j0916j1953j1423r335p266
$$ 1110710 1098046 1085549 1073496 1062292 1052121 1042661 1032954 1022038 1010085 998662 989327 982061
59992I82061o692p464q192p745o081l892j946p25l32m24m23j10J9o23j626j692
$$ 982061 975369 967905 959713 951968 945887 941995 940049 939324 938992 938568 938145 938035 938054 937431 935805 934113
59976I34113k17J672K308J399J2j107k117l007l256k972l197m330n296n163m656
$$ 934113 933896 935568 937876 939275 939287 938180 936063 933056 929800 926828 923631 919301 914005 908842 904186
59961I04186m882n367m813l436k875l668m253l080n96J520K308K003J141j7j279
$$ 904186 899304 893937 889124 885688 882813 879145 874892 871812 871216 872736 875044 877047 878188 878171 876892
59946H76892k302k680k147q16P52J939K669L390M353N164N172M148K440O74n90
$$ 876892 874590 871910 869763 868947 869699 871638 874307 877697 882050 887214 892386 896534 898974 899648 899058
59931H99058j124j150j139j278j203m20R11J821J442Q2j034j148o48n6R93K930
$$ 899058 897934 896784 895645 894367 893164 892744 893655 895476 896918 897000 895966 894818 894170 894114 895107 898037
59915H98037M972N758N257M740M727M278K848J461J116J183N68l86m79N28J938
$$ 898037 903009 908767 914024 918764 923491 927769 930617 932078 933194 934377 934945 934559 934080 934608 936546
59900I36546L484N154O089N277L330K032J882J563L37o20m5J397K052J448M34
$$ 936546 940030 945184 951273 956550 959880 961912 963794 965357 965694 965074 965029 966426 968478 969926 970360
59885I70360l27r73j654j984j490j91J362K409K432J615Q23Q95J854K933L355
$$ 970360 970033 969060 967406 965422 963932 963741 965103 967512 969944 971559 972382 973277 975131 978064 981419
59870I81419L052K621K545K663K495K053J851K100K303K012J646K150L979O623
$$ 981419 984471 987092 989637 992300 994795 996848 998699 1000799 1003102 1005114 1006760 1008910 1012889 1019512
59856A019512Q890R612Q499O638N637N966O586O447N599M496L160J817J313J808
$$ 1019512 1028402 1038014 1046513 1053151 1058788 1064754 1071340 1077787 1083386 1087882 1091042 1092859 1094172 1095980
59842A095980J837P7k490l606k613q45N93J777K602K329J056K94J143K887M055
$$ 1095980 1097817 1097894 1095404 1091798 1089185 1088340 1088933 1090710 1093312 1095641 1096697 1096991 1098134 1101021 1105076
59827A105076M176L854L761M077M442M200L133J985J629J807J555Q11M70P30N95
$$ 1105076 1109252 1113106 1116867 1120944 1125386 1129586 1132719 1134704 1136333 1138140 1139695 1140506 1140976 1141706 1142301
59812A142301o36k407l793m432m245l385k723l294m766n571m966l775k693j310
$$ 1142301 1141665 1139258 1135465 1131033 1126788 1123403 1120680 1117386 1112620 1107049 1102083 1098308 1095615 1094305
59798A094305M09J218L38j050j273k61R91K217L864N943Q102J0424J3155J5953
$$ 1094305 1094714 1095932 1096270 1095220 1093947 1093686 1094677 1096894 1100758 1106701 1114803 1125227 1138382 1154335
59784A154335J8254J9852K0384J8910J5036R874N061J324j218k196j522j58P54
$$ 1154335 1172589 1192441 1212825 1231735 1246771 1256645 1261706 1263030 1261812 1259616 1258094 1257936 1258690
59771A258690R42K47k286p071j2325j5465j6101j6171j7087j8134j7886j6083
$$ 1258690 1259632 1259879 1257593 1250522 1238197 1222732 1206631 1190460 1173373 1155239 1137353 1121270
59759A121270j3673j1825j1025j0634r400o974m526l107k058k66J604J678m84
$$ 1121270 1107597 1095772 1084747 1074113 1064713 1057739 1053213 1050106 1048048 1047782 1049386 1051064 1050580
59746A050580l291n256o181o211n308m176m071m947n118l625j795j443k449l208
$$ 1050580 1047289 1042033 1035852 1029641 1024333 1020157 1016086 1011139 1006021 1002396 1000601 999158 996709 993501
59732I93501k881k120j881k349k990l192k956l110m396o248p115o271m604l206
$$ 993501 990620 988500 986619 984270 981280 978088 975132 972022 967626 961378 954263 947992 943388 940182
59718I40182k081r93o48j884m062n421n134m069l379l179l041l005l336l594k842
$$ 940182 938101 937108 936460 934576 930514 925093 919959 915890 912511 909332 906291 903286 899950 896356 893514
59703H93514j036M11J70j146j419L95K902M012L442K735L143M547O396Q458J0219
$$ 893514 892478 892889 893059 891913 890494 890889 893791 897803 901245 903980 907123 911670 918066 926524 936743
59688I36743J0528Q770O004M025L392K968J517p13k286k210r93J3R4l57q33j517
$$ 936743 947271 956041 962045 966070 969462 972430 973947 973234 970948 968738 967745 967758 967852 967495 966662 965145
59672I65145k630l490l071j478nM08N7m16r06j369j254k26J015J440J023O62R24
$$ 965145 962515 959025 955954 954476 954471 954879 954936 954520 953614 952245 950991 950765 951780 953220 954243 954905 955829
59655I55829J642K663M106N619O225N498M453M639O503R142J1393J2619J2630
$$ 955829 957471 960134 964240 969859 976084 981582 986035 990674 997177 1006319 1017712 1030331 1042961
59642A042961J1676J0700J0839J2126J3131J2455J0246P822O099N036M346L927
$$ 1042961 1054637 1065337 1076176 1088302 1101433 1113888 1124134 1131956 1138055 1143091 1147437 1151364
59630A151364L578L031K412K059J811J206M05K4j17r77k476l035j833n40j337
$$ 1151364 1154942 1157973 1160385 1162444 1164255 1165461 1165866 1165890 1165773 1164796 1162320 1159285 1157452 1156912 1155575
59615A155575l814n460n137m449n245p054p799o243l008K10J803J121r82k583
$$ 1155575 1151761 1146301 1141164 1136715 1131470 1124416 1116617 1110374 1107366 1107576 1109379 1110500 1109518 1106935
59601A106935k178J28L027N347O725P296P380P504Q204R296R537P563L490o80
$$ 1106935 1104757 1104885 1107912 1113259 1119984 1127280 1134660 1142164 1150368 1159664 1169201 1176764 1180254 1179574
59587A179574k816k809k565l802o410r115j0994j1866j1822j1289j1175j1987
$$ 1179574 1176758 1173949 1171384 1167582 1161172 1152057 1141063 1129197 1117375 1106086 1094911 1082924
59575A082924j2887j2512j0802r185q684q694q102o902o059o148o853p649q361
$$ 1082924 1070037 1057525 1046723 1037538 1028854 1020160 1012058 1005156 999097 992949 986096 978447 970086
59562I70086q920r028q397p201o047n520n861p016q647r917r685p564m757l136
$$ 970086 961166 952138 943741 936540 930493 924973 919112 912096 903449 893532 883847 876283 871526 868390
59548H68390l249l777l331k189j637k126k846l035k845k817k987k836j936n35
$$ 868390 865141 861364 858033 855844 854207 852081 849235 846200 843355 840538 837551 834715 832779 832244
59534H32244M53K61p56j362r15j65q9m57l96j1l84j851l275l469k722k355l022
$$ 832244 832697 832958 832202 830840 829925 829760 829671 829214 828818 828807 828423 826572 823297 819828 817106 814751 811729
59517H11729l964l923k552q91l76j411l077m271m659m368l270j278R61K323K289
$$ 811729 807765 803842 801290 800399 800023 798612 795535 791264 786605 782237 778967 777689 778650 780973 783262
59502G83262J293R8p97j174j008l95O53K164L789M846N225N768P192R003J0185
$$ 783262 784555 784653 783856 782682 781674 781279 781932 784096 787885 792731 797956 803724 810916 819919 830104
59487H30104J0573J0712J0699J0171R517J0005J2342J5648J8262J9266J9257J9653
$$ 830104 840677 851389 862088 872259 881776 891781 904123 919771 938033 957299 976556 996209
59475I96209K0955K1419J8284J1148L290j478k817l280m308m722l286p95J278
$$ 996209 1017164 1038583 1056867 1068015 1071305 1069827 1067010 1063730 1059422 1054700 1051414 1050619 1051897
59462A051897K609L512L735K991J745M82j141l480n879p496q542r749j1052j1759
$$ 1051897 1054506 1058018 1061753 1064744 1066489 1066971 1065830 1062350 1056471 1048975 1040433 1030684 1019632 1007873
59448A007873j1707j1240j0381r083q158q740j0595j1935j1466r867q680q265
$$ 1007873 996166 984926 974545 965462 957304 948564 937969 926034 914568 904701 896021 887756
59436H87756p591n869l565j730q45p42j142j639j484k23J387J932J221P88J859
$$ 887756 880165 874296 870731 869001 868156 867414 866272 864633 863149 862926 864313 866245 867466 868254 870113
59421H70113L540L934K650J200J010J980L124L774L890L680L222K356J135M57
$$ 870113 873653 877587 880237 881437 882447 884427 887551 891325 895215 898895 902117 904473 905608 906065
59407I06065J480L748M863L174K42q44P58L118M643N757P019P537O458M722M048
$$ 906065 907545 911293 916156 919330 919572 918728 919486 922604 927247 933004 940023 947560 954018 958740 962788
59392I62788M923O607Q359R680R943Q912P346O080M711K072j871n385o674n900
$$ 962788 967711 974318 982677 992357 1002300 1011212 1018558 1024638 1029349 1031421 1029550 1024165 1017491 1011591
59378A011591n089n828p382p617n718l137j559r98o71o19r76n61J835N058O542
$$ 1011591 1006502 1000674 993292 985675 979957 976820 975261 974263 973592 972973 971997 971436 973271 978329 984871
59363I84871N791N089O394R299J2468J5219J7105J7811J8278K0340K4307K8433
$$ 984871 990662 995751 1002145 1011444 1023912 1039131 1056236 1074047 1092325 1112665 1136972 1165405
59351A165405L1233L2404L0830K4322J3088J302o810j0888j2700j2540r658m668
$$ 1165405 1196638 1229042 1259872 1284194 1297282 1298584 1291774 1280886 1268186 1255646 1245988 1241320
59339A241320J110P402J3341J5287R809j202j1507j7050j9101k0535k1761k1410
$$ 1241320 1242430 1249832 1263173 1278460 1288269 1287067 1275560 1258510 1239409 1218874 1197113 1175703
59327A175703j8873j4717r995o116m233l871l205j311P97J909K253K817L980N539
$$ 1175703 1156830 1142113 1132118 1126002 1121769 1117898 1114693 1113382 1114179 1116088 1118341 1121158 1125138 1130677
59313A130677P330R205J0816J1751J1643J0347Q617Q074R470J1332J1595J0279
$$ 1130677 1138007 1147212 1158028 1169779 1181422 1191769 1200386 1208460 1217930 1229262 1240857 1251136
59301A251136R147Q885Q437P214O109N795N740N608N965O782O830N725N162O862
$$ 1251136 1260283 1269168 1277605 1284819 1290928 1296723 1302463 1308071 1314036 1320818 1327648 1333373 1338535 1345397
59287A345397J0253J3413J5362J6244J6203J5464J4885J5053J5156J3960J1589
$$ 1345397 1355650 1369063 1384425 1400669 1416872 1432336 1447221 1462274 1477430 1491390 1502979
59276A502979R228P334N364L172J450N12m25k243m784p117q667r769j1170j3055
$$ 1502979 1512207 1519541 1524905 1528077 1529527 1530039 1529614 1527371 1522587 1515470 1506803 1497034 1485864 1472809
59262A472809j4638j4833j3349j0941q666p261p188q497j0284j0994r948q307
$$ 1472809 1458171 1443338 1429989 1419048 1410382 1403121 1395933 1387436 1377152 1366158 1356210 1347903
59250A347903p884r097j0583j0759r353p384n976n349m871l870k198L9K925O349
$$ 1347903 1340019 1330922 1320339 1309580 1300227 1292843 1286867 1281518 1276647 1272777 1270579 1270618 1273543 1279892
59236A279892R443J1270J2183J3744J6601J8911J7576J1115J078r258j7263k2176
$$ 1279892 1289335 1300605 1312788 1326532 1343133 1362044 1379620 1390735 1391813 1382555 1365292 1343116
59224A343116k4564k5152k4437k3103k1969k1078j9326j5724j0874o534l789k210
$$ 1343116 1318552 1293400 1268963 1245860 1223891 1202813 1183487 1167763 1156889 1150355 1146566 1144356
59212A144356p43J186L454N480O631O858O872P198P362O719N650M833L638P38
$$ 1144356 1143613 1144799 1148253 1153733 1160364 1167222 1174094 1181292 1188654 1195373 1201023 1205856 1209494 1210232
59198A210232l446o546p124o507o875q595j0398j1214j0828r375p373n734m874
$$ 1210232 1206786 1200240 1193116 1186609 1179734 1171139 1160741 1149527 1138699 1129324 1121951 1116217 1111343
59185A111343m132k749r01Q10K225L196L199K333J895K687L529L018K068K844
$$ 1111343 1107211 1104462 1103561 1104371 1106596 1109792 1112991 1115324 1117219 1119906 1123435 1126453 1128521 1131365
59171A131365N357P137O672N292M876N329N310M239K425J63k095l329k864j357
$$ 1131365 1136722 1143859 1150531 1155823 1160699 1166028 1171338 1175577 1178002 1178165 1176070 1172741 1169877 1168520
59157A168520p7M73M95P6n68n41Q00K533K899J527k6j62J022K098J777j8j932
$$ 1168520 1168443 1168916 1169411 1169487 1168919 1168378 1169178 1171711 1174610 1176137 1176111 1175949 1176971 1179069 1180846 1180828 1178896
59140A178896k100j83J618O99k595n030m319j541J026K889M714N994N514L733
$$ 1178896 1176796 1176613 1178231 1178930 1176335 1171305 1166986 1165445 1166471 1169360 1174074 1180068 1185582 1189315
59126A189315K598K772K831J778P57J331L319N264O177N939M847L550K815K530
$$ 1189315 1191913 1194685 1197516 1199294 1200051 1201382 1204701 1209965 1216142 1222081 1226928 1230478 1233293 1235823
59112A235823J741K58o95k17R05J738K925N335P754P998O016L974L166K713J701
$$ 1235823 1237564 1237822 1237127 1236910 1237815 1239553 1242478 1247813 1255567 1263565 1269581 1273555 1276721 1279434 1281135
59097A281135O73J68n28k080l823n017o264q341j0519j1498j1444j1690j2712
$$ 1281135 1281808 1281976 1281448 1279368 1275545 1270528 1264264 1255923 1245404 1233906 1222462 1210772 1198060
59084A198060j3759j4248j4130j2974j0272p025n486o519q393r106q791q601q175
$$ 1198060 1184301 1170053 1155923 1142949 1132677 1125652 1120166 1113647 1105254 1096148 1087357 1078756 1070581
59071A070581n999k159J031J801J030Q65K243M747P990J1741J5055J6730J6888
$$ 1070581 1064582 1062423 1063454 1065255 1066285 1067150 1069393 1074140 1082130 1093871 1108926 1125656 1142544
59058A142544J6972J7795J8546J8312J7636J7783J8977K0292K0968K1041K0761
$$ 1142544 1159516 1177311 1195857 1214169 1231805 1249588 1268565 1288857 1309825 1330866 1351627
59047A351627K0125J9114J7875J6499J4924J3225J1745J0722R927Q741O710M001
$$ 1351627 1371752 1390866 1408741 1425240 1440164 1453389 1465134 1475856 1485783 1494524 1501234 1505235
59035A505235J240j224l571n794p171p094o212n828o292o954p795r750j2803j5143
$$ 1505235 1506475 1505251 1501680 1495886 1488715 1481621 1475409 1469581 1463289 1456335 1448540 1438790 1425987 1410844
59021A410844j5329j4410j4614j6576j9031k0801k1747k1981k1497k0635j9900
$$ 1410844 1395515 1381105 1366491 1349915 1330884 1310083 1288336 1266355 1244858 1224223 1204323
59010A204323j9127j7670j5464j3164j1255r777q765q091p045n145l310l083m499
$$ 1204323 1185196 1167526 1152062 1138898 1127643 1117866 1109101 1101010 1093965 1088820 1085510 1082427 1077928
58997A077928n899o170o012o378o685n593l040n81K97l44j166j010P8J308K394
$$ 1077928 1072029 1065859 1059847 1053469 1046784 1041191 1038151 1037570 1037867 1037523 1036357 1035347 1035425 1036733 1039127
58982A039127L746N272N751M192J475k35M24L038O227Q688R781R909J0254J1528
$$ 1039127 1042873 1048145 1053896 1058088 1059563 1059328 1059752 1062790 1069017 1077705 1087486 1097395 1107649 1119177
58968A119177J3264J4762J6120J7540J8472J8641J9049K0477K1777K1534K0727
$$ 1119177 1132441 1147203 1163323 1180863 1199335 1217976 1237025 1257502 1279279 1300813 1321540
58957A321540K1388K2910K2388J8994J5088J2190Q666L198k081m293l794k939
$$ 1321540 1342928 1365838 1388226 1407220 1422308 1434498 1443164 1446362 1444281 1439988 1436194 1433255
58945A433255k221m46K040L105J971K25q00j679l244m893n500n041m530m924o662
$$ 1433255 1431034 1430588 1432628 1435733 1437704 1437929 1437129 1435450 1432206 1427313 1421813 1416772 1412242 1407318 1400656
58930A400656r682j3401j6962j9691k1061k0484j7857j4397j2045j1678j2319
$$ 1400656 1390974 1377573 1360611 1340920 1319859 1299375 1281518 1267121 1255076 1243398 1231079
58919A231079j2378j1172q996o411l980k335j726j445k29K413N521P566P888P047
$$ 1231079 1218701 1207529 1198533 1192122 1188142 1185807 1184081 1182636 1182407 1184820 1190341 1197907 1205795 1212842
58905A212842N877M782M025M059M955N864N666M157K078J12j656l416n302p379
$$ 1212842 1218719 1223501 1227526 1231585 1236540 1242404 1248070 1252227 1254305 1254417 1252761 1249345 1244043 1236664
58891A236664r379j0595j0599r990r784j0128j0289r863r219q688q051p098o030
$$ 1236664 1227285 1216690 1206091 1196101 1186317 1176189 1165900 1156037 1146818 1138130 1130079 1122981 1116951
58878A116951n183m714m586m403l577k256j641k478l771m158m083n003o687p270
$$ 1116951 1111768 1107054 1102468 1098065 1094488 1092232 1090591 1088113 1084342 1080184 1076101 1071098 1064411 1057141
58864A057141o203n208n538o141n449l605j784n91j60n91j249p33J306L326L873
$$ 1057141 1050938 1045730 1040192 1034051 1028602 1024997 1023213 1022622 1022462 1021871 1020622 1019889 1021195 1024521 1028394
58849A028394L421L253L626M229N406P456R525J0578J0956J1715J2986J4113J4777
$$ 1028394 1031815 1035068 1038694 1042923 1048329 1055785 1065310 1075888 1086844 1098559 1111545 1125658 1140435
58836A140435J4857J3827J1676R908J0313J2911J6104J8461J9433J8978J7685
$$ 1140435 1155292 1169119 1180795 1190703 1201016 1213927 1230031 1248492 1267925 1286903 1304588
58825A304588J6872J7301J8132J8041J6920J5446J3594J0903P730M971K803Q70
$$ 1304588 1321460 1338761 1356893 1374934 1391854 1407300 1420894 1431797 1439527 1444498 1447301 1448171
58813A448171p04j695k760m679o893q087q019p580p241o802o599p572r870j2453
$$ 1448171 1447467 1445772 1443012 1438333 1431440 1423353 1415334 1407754 1400513 1393711 1387112 1379540 1369670 1357217
58799A357217j4221j4853j4707j4639j5557j7237j8126j7254j5827j5627j6482
$$ 1357217 1342996 1328143 1313436 1298797 1283240 1266003 1247877 1230623 1214796 1199169 1182687
58788A182687j6826j6192j5425j4704j3197j0841q863q218q778j0026j1282j1399
$$ 1182687 1165861 1149669 1134244 1119540 1106343 1095502 1086639 1078421 1069643 1059617 1048335 1036936
58776A036936r871q070p784q562q362o807n592n385m751k942j425j307j322rJ714
$$ 1036936 1027065 1018995 1011211 1002649 994287 987480 981888 976503 971752 968810 967385 966078 964756 964747 966461
58761I66461K016R53K1k32m41q36r85p59l03N74J811K378J430j90r03n83n22j283
$$ 966461 968477 969430 969451 969219 968778 967942 966957 966198 965895 966469 968280 970658 972088 971898 970995 970412 969890 968607
58743I68607k070k359k739l570l954k969j244l37q65j990k696k807k577j932p12
$$ 968607 966537 964178 961439 957869 953915 950946 949702 949365 948500 946510 943814 941007 938430 936498 935786
58728I35786O27J311J394K023M014O478P547O651N474O230R012J1418J1057Q296
$$ 935786 936413 937724 939118 941141 945155 951633 959180 965831 971305 977535 986547 997965 1009022 1017318
58714A017318N926N859O874O370L796J013p24k399n124p897q972q509q203q712
$$ 1017318 1023244 1029103 1035977 1042347 1046143 1047156 1046432 1044033 1038909 1031012 1022040 1013531 1005328 996616
58700I96616r090q671p933p235o122m320k382q47L12J090J150O45M17R78J961
$$ 996616 987526 978855 970922 963687 957565 953245 950863 950016 950328 951418 952568 953213 953630 954608 956569
58685I56569K969M174N650O891P537P964Q645R522J0481J1819J3517J4629J4186
$$ 956569 959538 963712 969362 976253 983790 991754 1000399 1009921 1020402 1032221 1045738 1060367 1074553
58672A074553J2480J0819J0148J0431J1138J1717J1643J0653R060P483O075M438
$$ 1074553 1087033 1097852 1108000 1118431 1129569 1141286 1152929 1163582 1172642 1180125 1186200 1190638
58660A190638K553J385J945L855N485N805N431N320N093L668J267n86j297k164
$$ 1190638 1193191 1194576 1196521 1200376 1205861 1211666 1217097 1222417 1227510 1231178 1232445 1231859 1230562 1228398
58646A228398m477p713j0488j2492j4454j6783j9208k1491k3530k5036k5706k5480
$$ 1228398 1223921 1216208 1205720 1193228 1178774 1161991 1142783 1121292 1097762 1072726 1047020 1021540
58634A021540k4158k1425j7905j5418j5135j6005j6095j4947j3509j2215j0562
$$ 1021540 997382 975957 958052 942634 927499 911494 895399 880452 866943 854728 844166
58623H44166q437o508n046l523j625J29J062J028M29L1N50J771K473J967J335
$$ 844166 835729 829221 824175 820652 819027 819156 820218 821246 821675 821706 822256 824027 826500 828467 829802
58608H29802K188M540O865Q035Q188P898P464O920O030M435K375O98m72k121m371
$$ 829802 831990 836530 843395 851430 859618 867516 874980 881900 887930 892365 894740 895438 894966 892845 888474
58593H88474n372l854j726j976m442o030n037k974j805j654j915k621l633m125
$$ 888474 883102 879248 877522 875546 871104 865074 860037 857063 855258 853604 851689 849068 845435 841310
58579H41310l884l883m656n234m497k653o86P51J414J257P13L75K08r2r3Q41K015
$$ 841310 837426 833543 828887 823653 819156 816503 815817 816568 817982 819239 819952 820327 820535 820443 820350 821191 823206
58562H23206J958P85L57J611L208L567K854K161K016K486L590M788N069M321L591
$$ 823206 825164 825949 826306 827917 831125 834692 837546 839707 841723 844209 847799 852587 857656 861977 865568
58547H65568L412L024J938J110J632L191M652N333M990L483J305k06r5J259K773
$$ 865568 868980 872004 873942 875052 876684 879875 884527 889860 894850 898333 899638 899432 899337 900596 903369
58532I03369L724L908L623L824N382P872R910J0931J1643J2407J2521J1637J0751
$$ 903369 907093 911001 914624 918448 923830 931702 941612 952543 964186 976593 989114 1000751 1011502
58519A011502J0914J1832J2448J2263J1554J0842J0470J0382J0233J0242J1362
$$ 1011502 1022416 1034248 1046696 1058959 1070513 1081355 1091825 1102207 1112440 1122682 1134044
58508A134044J3743J5767J6105J6070J7972K1509K4106K4830K5350K6601K7167
$$ 1134044 1147787 1163554 1179659 1195729 1213701 1235210 1259316 1284146 1309496 1336097 1363264
58497A363264K5971K4088K2515K0365J6838J2982R843O577K166k605o518r835
$$ 1363264 1389235 1413323 1435838 1456203 1473041 1486023 1495866 1502443 1504609 1502004 1495486 1485651
58485A485651j3109j5463j5964j5608j6059j7378j8738k0414k3047k5509k5669
$$ 1485651 1472542 1457079 1441115 1425507 1409448 1392070 1373332 1352918 1329871 1304362 1278693
58474A278693k3258k0401j9051j8997j8552j6469j3174j0476r764j0355j0334
$$ 1278693 1255435 1235034 1215983 1196986 1178434 1161965 1148791 1138315 1128551 1118196 1107862
58463A107862r050p609o687n476l521k024k073k990l589l948m578n012m559l641
$$ 1107862 1098812 1091203 1084516 1079040 1075519 1073495 1071422 1068432 1064843 1060895 1056317 1051305 1046746 1043105
58449A043105l010k481j632j112j942m002o046o838n771l207p08J79j35K96K119
$$ 1043105 1040095 1037614 1035982 1034870 1032928 1028926 1022880 1016042 1010271 1007064 1006356 1006535 1006400 1006696 1008815
58434A008815L800M228M363N281O329O638O774P415P887P626P757R488J2135J4337
$$ 1008815 1012615 1016843 1021206 1026487 1032816 1039454 1046228 1053643 1061530 1069156 1076913 1086401 1098536 1112873
58420A112873J5961J7216J7194J5239J2794J1832J2150J1850J0033P419M909K909
$$ 1112873 1128834 1146050 1163244 1178483 1191277 1203109 1215259 1227109 1237142 1244561 1249470 1252379
58408A252379J563M90j134l322n046n979p113q623q812o671l859k361j642j6K465
$$ 1252379 1253942 1254432 1253298 1249976 1244930 1238951 1231838 1223215 1214403 1207732 1203873 1201512 1199870 1199854 1202319
58393A202319M484N717O563O621N374L626K497J813J043O42Q10L28j445k750j917
$$ 1202319 1206803 1212520 1219083 1225704 1231078 1234704 1237201 1239014 1240057 1240699 1241509 1241837 1240392 1237642 1235725
58378A235725k85k52j509j840p22N96J782L433M971N425N924Q469J2223J4003
$$ 1235725 1235440 1235188 1233679 1231839 1231117 1231713 1233495 1236928 1241899 1247324 1253248 1261717 1273940 1287943
58364A287943J2874J1451J1834J2797J2223J0305Q790Q257P487N117J208k692
$$ 1287943 1300817 1312268 1324102 1336899 1349122 1359427 1368217 1376474 1383961 1389078 1390286 1387594
58352A387594m990n704o298p573q623q371p114n734m493l493l089k788j129K065
$$ 1387594 1382604 1376900 1370602 1363029 1354406 1346035 1338921 1333187 1328694 1325201 1322112 1319324 1318195 1320260
58338A320260M779N522N397N924O618O631O992Q696J0041Q646N234K776K441K737
$$ 1320260 1325039 1330561 1335958 1341882 1348500 1355131 1362123 1370819 1380860 1389506 1394740 1397516 1399957 1402694
58324A402694K210P99r70k186j558R08L097L467L407M868O994P660P217P808R745
$$ 1402694 1404904 1405703 1404733 1402547 1400989 1401897 1404994 1408461 1411868 1416736 1423730 1431390 1438607 1446415 1456160
58309A456160J1391J2097J2618J2996J2730J2616J3826J5412J5298J3579J2384
$$ 1456160 1467551 1479648 1492266 1505262 1517992 1530608 1544434 1559846 1575144 1588723 1601107
58298A601107J2604J3203J3641J4550J5850J6327J5465J4023J2778J2051J2103
$$ 1601107 1613711 1626914 1640555 1655105 1670955 1687282 1702747 1716770 1729548 1741599 1753702
58287A753702J2696J2897J2603J3281J5757J8605K0267K1295K2724K3872K3747
$$ 1753702 1766398 1779295 1791898 1805179 1820936 1839541 1859808 1881103 1903827 1927699 1951446
58276A951446K3072K2891K2855K2810K3956K6309K7539K6672K6116K7207K7047
$$ 1951446 1974518 1997409 2020264 2043074 2067030 2093339 2120878 2147550 2173666 2200873 2227920
58265B227920K3417J9554J9470K1433K1199J9296J9408K1347K1639K0229K0687
$$ 2227920 2251337 2270891 2290361 2311794 2332993 2352289 2371697 2393044 2414683 2434912 2455599
58254B455599K3898K6959K8479K9999L1974L3096L3723L5506L7644L7939L7296
$$ 2455599 2479497 2506456 2534935 2564934 2596908 2630004 2663727 2699233 2736877 2774816 2812112
58243B812112L8574M1281M2222M1227M1185M2488M2515M0972M0608M2280M4105
$$ 2812112 2850686 2891967 2934189 2975416 3016601 3059089 3101604 3142576 3183184 3225464 3269569
58232C269569M5859M9330N3906N6635N7193N8110N9870O0645O1026O3822O8749
$$ 3269569 3315428 3364758 3418664 3475299 3532492 3590602 3650472 3711117 3772143 3835965 3904714
58221C904714P2375P3880P5920P9403Q2493Q5074Q9078R3998R7183R8879J01971
$$ 3904714 3977089 4050969 4126889 4206292 4288785 4373859 4462937 4556935 4654118 4752997 4854968
58210D854968J06804J11536J17012J25401J34485J39950J43205J49945J60788
$$ 4854968 4961772 5073308 5190320 5315721 5450206 5590156 5733361 5883306 6044094
58201F044094J70484J76933J83563J91887J99243K05240K13184K23563K33174
$$ 6044094 6214578 6391511 6575074 6766961 6966204 7171444 7384628 7608191 7841365
58192G841365K42049K53994K69071K83047K95592L11241L30841L49986L67447
$$ 7841365 8083414 8337408 8606479 8889526 9185118 9496359 9827200 10177186 10544633
58183A0544633L87010M09296M30304M49930M73369N01921N30848N58245N87368
$$ 10544633 10931643 11340939 11771243 12221173 12694542 13196463 13727311 14285556 14872924
58174A4872924O18650O48832O79765P18112P64316Q11761Q58515R09046R62804
$$ 14872924 15491574 16140406 16820171 17538283 18302599 19114360 19972875 20881921 21844725
58165B1844725J013421J061860J117792J184861J257434J335013J425987J533188
$$ 21844725 22858146 23920006 25037798 26222659 27480093 28815106 30241093 31774281
58157C1774281J650000J774890J914785K069700K230586K398038K586226K801923
$$ 31774281 33424281 35199171 37113956 39183656 41414242 43812280 46398506 49200429
58149D9200429L037048L288620L567627L881595M229068M619806N078894N622417
$$ 49200429 52237477 55526097 59093724 62975319 67204387 71824193 76903087 82525504
58141H2525504O252818O988083P868905Q925516J0166205J1610069J3294735J5231006
$$ 82525504 88778322 95766405 103635310 112560826 122727031 134337100 147631835 162862841
58133A62862841J7380854J9693563K2124055K4611564K7102070K9563518L1764191
$$ 162862841 180243695 199937258 222061313 246672877 273774947 303338465 335102656
58126C35102656L2857458L1343738K5872680J6409804M644806o857001j6017860
$$ 335102656 367960114 399303852 425176532 441586336 446231142 439374141 423356281
58119D23356281k2000597k5019526k5748790k4919655k3215445k1264979j9579863
$$ 423356281 401355684 376336158 350587368 325667713 302452268 281187289 261607426
58112B61607426j8434076j7787611j7365132j6873205j6178159j5298885j4286894
$$ 261607426 243173350 225385739 208020607 191147402 174969243 159670358 145383464
58105A45383464j3169242j1985485j0806856r693144q663144p720048o875434
$$ 145383464 132214222 120228737 109421881 99728737 91065593 83345545 76470111
58098G6470111o135015n486813m918116m425577l999954l621085l278027k976714
$$ 76470111 70335096 64848283 59930167 55504590 51504636 47883551 44605524 41628810
58090D1628810k718995k491158k281955k095530j936716j797621j668362j548578
$$ 41628810 38909815 36418657 34136702 32041172 30104456 28306835 26638473 25089895
58082B5089895j439583j336582j236888j145680j066024r92506r20845q54323
$$ 25089895 23650312 22313730 21076842 19931162 18865138 17872632 16951787 16097464
58074A6097464p94996p38520o83815o38070o05462n79643n53591n28353n05835
$$ 16097464 15302468 14563948 13880133 13242063 12636601 12056958 11503367 10975014 10469179
58065A0469179m81664m52516m23256l99630l79789l59211l38300l19230l00680
$$ 10469179 9987515 9534999 9111743 8712113 8332324 7973113 7634813 7315583 7014903
58056G014903k81369k64029k50769k38942k25961k13644k03721j93804j81962
$$ 7014903 6733534 6469505 6218736 5979794 5753833 5540189 5336468 5142664 4960702
58047D960702j70778j62901j56906j51079j46883j45157j43215j39170j34946
$$ 4960702 4789924 4627023 4470117 4319038 4172155 4026998 3883783 3744613 3609667
58038C609667j31975j28212j22393j16733j12405j06828r8584r0534q4974q0050
$$ 3609667 3477692 3349480 3227087 3110354 2997949 2891121 2792537 2702003 2617029 2536979
58028B536979p4009o8538o4720o0139n3385m7221m3971m1867l9111l7420l8173
$$ 2536979 2462970 2394432 2329712 2269573 2216188 2168967 2124996 2083129 2044018 2006598 1968425
58017A968425l9114l8377l7843l9102m0036l8787l7287l7263l6662l3744l0972
$$ 1968425 1929311 1890934 1853091 1813989 1773953 1735166 1697879 1660616 1623954 1590210 1559238
58006A559238l0762l0932k8563k5245k4132k4423k3209k0556j8659j7711j6443
$$ 1559238 1528476 1497544 1468981 1443736 1419604 1395181 1371972 1351416 1332757 1315046 1298603
57995A298603j5199j5051j5174j4169j2647j1890j1525j0968j1307j3199j4784
$$ 1298603 1283404 1268353 1253179 1239010 1226363 1214473 1202948 1191980 1180673 1167474 1152690
57984A152690j4193j2418j1400j1125j0872j1143j2018j1676r227o908o977q397
$$ 1152690 1138497 1126079 1114679 1103554 1092682 1081539 1069521 1057845 1048618 1041710 1034733 1026336
57972A026336r182r915j2051j4571j5444j4995j4962j5331j4778j3223j1612j0105
$$ 1026336 1017154 1007239 995188 980617 965173 950178 935216 919885 905107 891884 880272 870167
57960H70167q593p905q580r512r614r555j0081j0066q191n276l107k206k343l759
$$ 870167 861574 853669 845089 835577 825963 816408 806327 796261 788070 782794 779687 777481 775138 771379
57946G71379o068p501p095o273o490o776n462k959r20M2J42p55k376l398l146
$$ 771379 765311 757810 750715 744442 737952 731176 725714 722755 721835 721877 722019 721264 718888 715490 712344
57931G12344k670k774k509j147O5k20j324k003k506l447m122l716k910k702k900
$$ 712344 709674 706900 704391 703244 703309 703089 701765 699762 697256 693809 689687 685971 683061 680359 677459
57916F77459l081l567m195l847k588k277l517m064k118P57K049J748J305R00j37
$$ 677459 674378 670811 666616 662769 660181 657904 654387 650323 648205 648962 651011 652759 654064 654964 654827
57901F54827j520k680l871m926m645l080k498m041n503m682k848k308k575j928
$$ 654827 653307 650627 646756 641830 637185 634105 631607 627566 622063 617381 614533 612225 609650 607722
57887F07722j061j774l182k534P04M401O960Q341Q502P412O273O390P103O951
$$ 607722 606661 604887 601705 599171 599875 604276 611236 619577 628079 635491 641764 648154 655257 662208
57873F62208O359O923Q507R403R097Q621Q372P665O433N295M012J724j225l409
$$ 662208 668567 675490 683997 693400 702497 711118 719490 727155 733588 738883 742895 744619 743394 739985
57859G39985m388n113o317p722q832r249q617p324o805p966r804j0694j0403r671
$$ 739985 735597 730484 724167 716445 707613 698364 689747 682423 675618 667652 657848 647154 636751 627080
57845F27080q637p019n158l506j828j69K72j271l525m545m061l167k577k503l195
$$ 627080 618443 611424 606266 602760 600932 600763 601035 599764 596239 591694 587633 584466 581889 579386 576191
57830E76191m079l385k77L476N482N482M722L783K732K286K892L472K893J850
$$ 576191 572112 568727 568450 571926 577408 582890 587612 591395 594127 596413 599305 602777 605670 607520
57816F07520J562J543N80j023k129k834l918n099n777o622q368r896r706q363
$$ 607520 609082 610625 611205 610182 608053 605219 601301 596202 590425 583803 575435 565539 555833 547470
57802E47470p252n897l126o5R69K09J36J389J955Q89M0J037K864L593K940K033
$$ 547470 540218 534321 531195 531130 532099 532308 532444 533833 535788 536677 536717 537754 540618 544211 547151 549184
57786E49184J764K163K575K137P83l56l34K59K63l01q26j703l604n637o006m443
$$ 549184 550948 553111 555686 557823 558606 558250 557916 558175 558438 558137 557311 555608 552004 546367 540361 535918
57770E35918k319o08P42J548J240M3j008j267o69Q21K795M122M395M841O248P030
$$ 535918 533599 532991 533733 535281 536521 536564 535556 534289 533620 534441 537236 541358 545753 550594 556842 563872
57754E63872N406K606J435K201K588J451J44k57n38j555k877l944m946n836n938
$$ 563872 569278 571884 573319 575520 578108 579559 579703 579446 578908 577353 574476 570532 565586 559750 553812
57739E53812n056l803k615j560j066j578k558l153l502l965l686j764N00O79j431
$$ 553812 548756 544953 542338 540778 539712 538134 535576 532423 528921 524956 521270 519506 520006 520685 519254
57724E19254l525l872k753q62J515L382L294J501J94R31L162N398O540N959M082
$$ 519254 515729 511857 509104 508242 509757 513139 516433 517934 518128 519059 522221 527619 534159 540118 544200
57709E44200K926M152O487O947M815K359J265O71n85j880k135j602j209j266j656
$$ 544200 547126 551278 557765 564712 569527 571886 573151 573822 573237 571357 569222 567620 566411 565145 563489
57694E63489k323k901k830k135j273k71R12J507Q32k49m18n2m39j332j440j035
$$ 563489 561166 558265 555435 553300 552027 551756 552668 554175 555007 554758 554340 554288 553849 552517 551077 550042
57678E50042j525k506k094m08K05q50j260K76J809J342k32j047r91p69k31P14
$$ 550042 548517 546011 543917 543509 543714 542864 541604 541880 543689 545031 544799 543752 542761 541992 541761 542475
57662E42475J273J275J747K651K200M3j144M54K371J035k906n370m293j689l24
$$ 542475 543748 545023 546770 549421 551621 551664 550520 550974 553345 554380 551474 546104 541811 540122 539798
57647E39798o01j190j127p41j141k862m807n139l566j754q59r4J263K000P56j402
$$ 539798 539197 538007 536880 536139 534998 532136 527329 522190 518624 516870 516011 515917 517180 519180 519936 518534
57631E18534k113p97R62J736J413M53m48j18K171N403P498P483O210N123N216
$$ 518534 516421 515624 516586 518322 519735 520188 519740 519622 521793 527196 534694 542177 548387 553510 558726
57616E58726P025J0515J4774J8723K2475K7325L4013M1318M6959M9926N1439N2780
$$ 558726 565751 576266 591040 609763 632238 659563 693576 734894 781853 831779 883218 935998
57604I35998N2188M5230K9576Q732j0456k3828l2058l7294m0099m0319l8780l6465
$$ 935998 988186 1033416 1062992 1071724 1061268 1037440 1005382 968088 927989 887670 848890 812425
57592H12425l3308k9152k4906k1523j8614j5291j1800r261q257q406q800q324
$$ 812425 779117 749965 725059 703536 684922 669631 657831 648570 640313 631907 623107 614783
57580F14783o313l602k043k343l129k863j747r50q79j059r94l73Q01J680J062
$$ 614783 608470 604868 602825 600482 597353 594490 592743 591793 590914 589855 588861 588488 589289 590969 592031
57565E92031p65j814q91P01R58k91j765k701l133k889j678J01J690K813L437L280
$$ 592031 591266 589452 588561 589262 590220 589929 588164 585463 582330 579441 577763 577864 579554 582367 585804 589084
57549E89084K377J589J593J861J433K76q53j424j334o58R5J37n92j136q81m60
$$ 589084 591461 593050 594643 596504 597937 598213 597360 595936 594602 593944 594039 594176 593584 592448 591567 591107
57533E91107p19j580k552l508m331m663m566m562m476l459j682n80o74p79l56
$$ 591107 590388 588808 586256 582748 578417 573754 569188 564626 560150 556691 555009 554429 553755 552976 552620
57518E52620p11k385l309j727O75J047l37q04L11R07k31j706k017j526j034k43
$$ 552620 551909 549524 546215 544488 545163 546210 545873 545069 545380 546287 546056 544350 542333 540807 539773 539530
57502E39530J191K337J890j54k379l181k027J12J599J812J685K160K835L029L215
$$ 539530 540721 543058 544948 544794 542415 539234 537207 537319 538918 540730 542415 544575 547410 550439 553654
57487E53654M097M808L866J625P1J30Q45J515K896N469P895Q301O517M233L184
$$ 553654 557751 562559 566425 568050 568121 568251 569096 570611 573507 578976 586871 595172 601689 605922 609106
57472F09106L677M595M602L419J906R27O08Q45J710K757K867J793J047K086M203
$$ 609106 612783 617378 621980 625399 627305 628232 628840 629685 631395 634152 637019 638812 639859 641945 646148
57457F46148N492N432M966M578L926L268L452M307M698M502M885O090O587N259
$$ 646148 651640 657072 662038 666616 670542 673810 677262 681569 686267 690769 695654 701744 708331 713590
57443G13590L121J891J909K419L021L789M413M247L063J350L0M2J592L560M369
$$ 713590 716711 718602 720511 722930 725951 729740 734153 738400 741463 742813 742843 742885 744477 748037 752406
57428G52406L839L436M178N136M761L168J984K165L046L701M287N404O677O921
$$ 752406 756245 759681 763859 768995 773756 776924 778908 781073 784119 787820 792107 797511 804188 811109
57414H11109N756M377M205N240O303O683O737O941P199P451Q033Q949R373Q517
$$ 811109 816865 821242 825447 830687 836990 843673 850410 857351 864550 872001 880034 888983 898356 906873
57400I06873O664M911M179M710N906O412N320L609L451N369P320P563P119P851
$$ 906873 913537 918448 922627 927337 933243 939655 944975 948584 952035 957404 964724 972287 979406 987257
57386I87257R138Q659O094L817L532M279M523M549N528P375Q854R264Q942Q418
$$ 987257 996395 1005054 1011148 1014965 1018497 1022776 1027299 1031848 1037376 1044751 1053605 1062869 1071811 1080229
57372A080229Q043Q278R425J0893J1441J0525Q985Q101Q202Q713R285J0121J1093
$$ 1080229 1088272 1096550 1105975 1116868 1128309 1138834 1147819 1155920 1164122 1172835 1182120 1192241 1203334
57359A203334J1501J1233J1280J2077J2315J0902R422J0457J3517J5071J3408
$$ 1203334 1214835 1226068 1237348 1249425 1261740 1272642 1282064 1292521 1306038 1321109 1334517
57348A334517J1145J1455J3919J5872J6245J5878J5271J4436J4220J5406J6894
$$ 1334517 1345662 1357117 1371036 1386908 1403153 1419031 1434302 1448738 1462958 1478364 1495258
57337A495258J6916J5854J5686J6761J7435J7022J6867J7881J9106J9611K0053
$$ 1495258 1512174 1528028 1543714 1560475 1577910 1594932 1611799 1629680 1648786 1668397 1688450
57326A688450K1227K2421K2351K0882J9014J7786J7741J8678J9544J9319J8262
$$ 1688450 1709677 1732098 1754449 1775331 1794345 1812131 1829872 1848550 1868094 1887413 1905675
57315A905675J7549J7577J7626J7339J7368J8167J9315K0392K1573K2840K3666
$$ 1905675 1923224 1940801 1958427 1975766 1993134 2011301 2030616 2051008 2072581 2095421 2119087
57304B119087K3909K4084K4240K3588K1852K0106J9598K0385K1636K2598K2890
$$ 2119087 2142996 2167080 2191320 2214908 2236760 2256866 2276464 2296849 2318485 2341083 2363973
57293B363973K2535K2169K2575K3610K4254K3988K3439K3367K3833K4668K5864
$$ 2363973 2386508 2408677 2431252 2454862 2479116 2503104 2526543 2549910 2573743 2598411 2624275
57282B624275K7029K7268K6234K4824K4299K5130K6902K8782K9862K9699K8809
$$ 2624275 2651304 2678572 2704806 2729630 2753929 2779059 2805961 2834743 2864605 2894304 2923113
57271B923113K8195K8194K8349K8267K7914K7172K6107K5564K6411K8001K8646
$$ 2923113 2951308 2979502 3007851 3036118 3064032 3091204 3117311 3142875 3169286 3197287 3225933
57260C225933K7828K6808K6689K7152K7583K8172K9077K9632K9301K8632K8499
$$ 3225933 3253761 3280569 3307258 3334410 3361993 3390165 3419242 3448874 3478175 3506807 3535306
57249C535306K9122L0442L2449L4439L4951L3485L1550L0993L1795L2453L2077
$$ 3535306 3564428 3594870 3627319 3661758 3696709 3730194 3761744 3792737 3824532 3856985 3889062
57238C889062L1044L0011K9233K8798K8732K8952K9549L0909L2983L4789L5313
$$ 3889062 3920106 3950117 3979350 4008148 4036880 4065832 4095381 4126290 4159273 4194062 4229375
57227D229375L4742L4249L4620L5623L6633L7347L7732L7718L7206L6384L5856
$$ 4229375 4264117 4298366 4332986 4368609 4405242 4442589 4480321 4518039 4555245 4591629 4627485
57216D627485L6179L7135L7787L7442L6307L4890L3325L1814L1105L1519L1924
$$ 4627485 4663664 4700799 4738586 4776028 4812335 4847225 4880550 4912364 4943469 4974988 5006912
57205E006912L0940K9029K8143K9149L0860L1897L2183L2107L1527L0406K9457
$$ 5006912 5037852 5066881 5095024 5124173 5155033 5186930 5219113 5251220 5282747 5313153 5342610
57194E342610K9210K9200K8869K8653K9261L0327L0600K9346K7045K4902K3952
$$ 5342610 5371820 5401020 5429889 5458542 5487803 5518130 5548730 5578076 5605121 5630023 5653975
57183E653975K4378K5398K6156K6800K8242L0852L4036L7247M0588M4152M7466
$$ 5653975 5678353 5703751 5729907 5756707 5784949 5815801 5849837 5887084 5927672 5971824 6019290
57172F019290N0102N2193N3882N4820N4605N3349N1514M9497M7555M5650M3329
$$ 6019290 6069392 6121585 6175467 6230287 6284892 6338241 6389755 6439252 6486807 6532457 6575786
57161F575786M0236L6745L3457L0133K5991K1029J6221J2190Q584M925J196k531
$$ 6575786 6616022 6652767 6686224 6716357 6742348 6763377 6779598 6791788 6800372 6805297 6806493 6803962
57149F803962o115q790r635q846p507n843k757K452Q950J5374K0962K5257K7942
$$ 6803962 6797847 6789057 6779422 6770576 6763069 6757226 6754469 6756921 6765871 6781245 6802207 6827464 6855406
57136F855406K9658L1846L4896L7311L7651L6513L5651L5705L5770L5006L3816
$$ 6855406 6885064 6916910 6951806 6989117 7026768 7063281 7098932 7134637 7170407 7205413 7239229
57125G239229L3286L3873L4755L4561L2915L0869K9369K7736K4413J8804J1385
$$ 7239229 7272515 7306388 7341143 7375704 7408619 7439488 7468857 7496593 7521006 7539810 7551195
57114G551195K547p439j7440k6090l3543m1282m9972n8710o6466p2821p7193p8964
$$ 7551195 7553742 7546303 7528863 7502773 7469230 7427948 7377976 7319266 7252800 7179979 7102786 7023822
57102G023822p8779p8249p8056p7723p7438p8302q0353q2267q3750q6273r0354
$$ 7023822 6945043 6866794 6788738 6711015 6633577 6555275 6474922 6392655 6308905 6222632 6132278
57091F132278r3777r3947r0847q6749q4040q4183q7493r2932r9106j06246j16111
$$ 6132278 6038501 5944554 5853707 5766958 5682918 5598735 5511242 5418310 5319204 5212958 5096847
57080E096847j29286j43881j57727j70627j83703j97743k13098k30139k48963
$$ 5096847 4967561 4823680 4665953 4495326 4311623 4113880 3900782 3670643 3421680
57071C421680k69363k91525l15907l42238l69666l97933m27234m57273F2478d58805
$$ 3421680 3152317 2860792 2544885 2202647 1832981 1435048 1007814 550541 62478 -458805
57060a017790o01322o47840p00212p60949q29623r03693r83318j072172j173301
$$ -1017790 -1619112 -2266952 -2967164 -3728113 -4557736 -5461429 -6444747 -7516919 -8690220
57051h690220j287767j418007j568886j744690j948687k186222k464266k787249
$$ -8690220 -9977987 -11395994 -12964880 -14709570 -16658257 -18844479 -21308745 -24095994
57043b4095994l157807l582561m072132m634198n271868n990605o800780p710544
$$ -24095994 -27253801 -30836362 -34908494 -39542692 -44814560 -50805165 -57605945 -65316489
57035f5316489q721306r832021j1041063j2339536j3706646j5110831j6505715
$$ -65316489 -74037795 -83869816 -94910879 -107250415 -120957061 -136067892 -152573607
57028a52573607j7823308j8985606j9932418k0628697k1035693k1079877k0643609
$$ -152573607 -170396915 -189382521 -209314939 -229943636 -250979329 -272059206 -292702815
57021b92702815j9552271j7555205j4379369r911363m396587J552468P197506
$$ -292702815 -312255086 -329810291 -344189660 -354101023 -358497610 -356945142 -349747636
57014c49747636J1980438J5663783J8262354J9899475K0714905K0844496K0430876
$$ -349747636 -337767198 -322103415 -303841061 -283941586 -263226681 -242382185 -221951309
57007b21951309J9631105J8605757J7489936J6366668J5265829J4186108J3117353
$$ -221951309 -202320204 -183714447 -166224511 -149857843 -134592014 -120405906 -107288553
57000a07288553J2051599J0988496R938357Q918786P947214P037518O200797N443922
$$ -107288553 -95236954 -84248458 -74310101 -65391315 -57444101 -50406583 -44205786 -38761864
56992c8761864M766867M164890L633399L168299K763296K410856K105635J843936
$$ -38761864 -33994997 -29830107 -26196708 -23028409 -20265113 -17854257 -15748622 -13904686
56984a3904686J620640J429735J267009J129167J011413R09019Q20216P44075
$$ -13904686 -12284046 -10854311 -9587302 -8458135 -7446722 -6537703 -5717487 -4973412
56976d973412O76790O13643N53977N00428M53645M11363L72402L38002L08946
$$ -4973412 -4296622 -3682979 -3129002 -2628574 -2174929 -1763566 -1391164 -1053162 -744216
56967g44216K84334a96456D9642K31461K18192K06238J96214J88181J82595J79674
$$ -744216 -459882 -196456 49642 281103 499295 705533 901747 1089928 1272523 1452197
56957A452197J74298J54338J10470M8170j4595o2619r3033j10390j18262j18181
$$ 1452197 1626495 1780833 1891303 1939473 1924878 1862259 1769226 1658836 1540574 1422393
56947A422393j12428j03921r4672q6154p9776p5708p2823p0769p0655p3153p7626
$$ 1422393 1309965 1206044 1111372 1025218 945442 869734 796911 726142 655487 582334 504708
56936E04708q3516r0676r8066j04103A9737i2516j13952j11347j04379r5603q6397
$$ 504708 421192 330516 232450 128347 19737 -92516 -206468 -317815 -422194 -517797 -604194
56925f04194p5699o3424n2157m3843l7375l1277k6443k4098k2954k0709j7136
$$ -604194 -679893 -743317 -795474 -839317 -876692 -907969 -934412 -958510 -981464 -1002173 -1019309
56914a019309j3666j0814p821m266n01L116O363Q921J0785J2540J4624J6950J9491
$$ -1019309 -1032975 -1043789 -1051610 -1055876 -1056377 -1053261 -1046898 -1037977 -1027192 -1014652 -1000028 -983078 -963587
56901i63587K2427K5373K7422K8263K8346K7769K6150K3708K1107J8090J3802
$$ -963587 -941160 -915787 -888365 -860102 -831756 -803987 -777837 -754129 -733022 -714932 -701130
56890g01130Q846N339M323M642M970N363O090O664O922P782R848J2455J4824J6917
$$ -701130 -692284 -686945 -682622 -677980 -673010 -667647 -661557 -654893 -647971 -640189 -630341 -617886 -603062 -586145
56876e86145J8629J9576K0294K1974K4273K5207K4091K2578K1472J8565J1673
$$ -586145 -567516 -547940 -527646 -505672 -481399 -456192 -432101 -409523 -388051 -369486 -357813
56865c57813K235o118j1528j4559j5931j5774j4634j3282j1647r326o801m832
$$ -357813 -355578 -361696 -373224 -387783 -403714 -419488 -434122 -447404 -459051 -468377 -475178 -480010
56853d80010l186j313K62P67R31K180M281N481N032M025L585L654L950M649N610
$$ -480010 -483196 -484509 -484247 -483480 -482549 -480369 -476088 -470607 -465575 -461550 -457965 -454311 -450361 -445712 -440102
56838d40102O104O049O463P935R447R680Q960Q954J0454J2460J3680J4195J4867
$$ -440102 -433998 -427949 -421486 -413551 -404104 -394424 -385464 -376510 -366056 -353596 -339916 -325721 -310854
56825c10854J5541J4957J2705J0243R112Q780P417M457J268p28j252m14J874N048
$$ -310854 -295313 -280356 -267651 -257408 -248296 -239516 -232099 -227642 -226374 -227102 -228354 -228768 -226894 -221846
56811b21846P643Q854R616J1363J4368J7886K1300K4360K6912K9241a8051A8384
$$ -221846 -214203 -205349 -195733 -184370 -170002 -152116 -130816 -106456 -79544 -50303 -18051 18384
56798E9156M3053M1157L4075K2654R961q0n443p201p614p743p461o762n768l863
$$ 59156 102209 143366 177441 200095 210056 209976 204533 197332 189718 181975 174514 167752 161984 158121
56784A58121j75N095J0602J5286J9262K3463K8788L5433M2488M8331N1780N2501
$$ 158121 157946 163041 173643 188929 208191 231654 260442 295875 338363 386694 438474 490975
56772D90975N0059M3388L2002J7315J874j2309k4034l2184l6068l6393l4728l1905
$$ 490975 541034 584422 616424 633739 635613 623304 599270 567086 531018 494625 459897 427992
56760D27992k7825k2905j8400j4815j0993n696M81N739R430J2884J7578K3072
$$ 427992 400167 377262 358862 344047 333054 327358 327839 333578 343008 355892 373470 396542
56748C96542K7293K8695K7420K4179J8637R843j726j3428k2334k7536l0207l1700
$$ 396542 423835 452530 479950 504129 522766 532609 530883 517455 495121 467585 437378 405678
56736D05678l2209l1264k8913k5953k3086k0305j7212j3780j0335o903l037J365
$$ 405678 373469 342205 313292 287339 264253 243948 226736 212956 202621 195718 192681 194046
56724A94046N619Q996J1548J3677J5081J4760J1872O362r44q345j3938j7109j9097
$$ 194046 199665 208661 220209 233886 248967 263727 275599 281961 281017 272672 258734 241625 222528
56711B22528k1235k3044k3024k1073j8861j7773j7609j7387j6377j4215j1149
$$ 222528 201293 178249 155225 134152 115291 97518 79909 62522 46145 31930 20781
56700B0781q338E585g34n586m765m991o057o130m519k944k951l631l247j872q38
$$ 20781 12443 5585 -734 -6320 -11085 -16076 -22133 -28263 -32782 -35726 -38677 -42308 -45555 -47427 -48265
56685d8265n46m22l65o94j003n66L17N39k77j438k324k875l051k699j999j374
$$ -48265 -48811 -49233 -49598 -50292 -51295 -51861 -51544 -51005 -51282 -52720 -55044 -57919 -60970 -63669 -65668 -67042
56669f7042r31m53O9L72L60L23P48J827K923K868J442J81M84J272L51j885k387
$$ -67042 -67973 -68426 -68357 -67985 -67625 -67302 -66554 -64727 -61804 -58936 -57494 -57313 -56829 -55557 -55206 -57091 -59478
56652e9478lK351J778l89p89J117L027L656L709L445K139L53O6J676L028K472
$$ -59478 -59481 -57130 -55352 -55741 -56530 -55413 -52386 -48730 -45021 -41576 -39437 -39084 -39018 -37342 -34314 -31842
56636c1842J086O79J079Q36l31j163o05J030K580L150K845K505K580K465J453
$$ -31842 -30756 -30077 -28998 -28162 -28493 -29656 -30261 -29231 -26651 -23501 -20656 -18151 -15571 -13106 -11653
56621a1653P6l13O51J928K417K036J295O89O49i11A178K192J762J768K599L594
$$ -11653 -11577 -11890 -11239 -9311 -6894 -4858 -3563 -2874 -2225 -911 1178 3370 5132 6900 9499 13093
56605A3093M029L841L276K552K083K142K159J224m34j314m64J388K891L563L749
$$ 13093 17122 20963 24239 26791 28874 31016 33175 34399 33965 32651 32187 33575 36466 40029 43778
56590D3778L745L508K900J894Q16L70Q92J619J493P60P89K103L522L802L165K634
$$ 43778 47523 51031 53931 55825 56641 57011 57903 59522 61015 61775 62564 64667 68189 71991 75156 77790
56574G7790K498K234J463L32o86r68j29J334K208J871Q79o2j048k352l456l660
$$ 77790 80288 82522 83985 84317 83631 82663 82534 83868 86076 87947 88826 88764 87716 85364 81908 78248
56558G8248l200k878k768k153q12M66R19P01N12P23J207J655J763J325M80k18
$$ 78248 75048 72170 69402 67249 66437 66903 67822 68523 69035 69758 70965 72620 74383 75708 76188 75970
56542G5970l05J7J9p82k060k909k567r52J254L021L701L544L249K937K003L36
$$ 75970 75665 75682 75701 74919 72859 69950 67383 66431 67685 70706 74407 77951 81200 84137 86140 86476
56526H6476r21o23O80J363R97Q33J670K546K317J483J318J957K522K737L073L554
$$ 86476 85555 84932 85612 86975 87972 88805 90475 93021 95338 96821 98139 100096 102618 105355 108428 111982
56510A11982L601L200L096L686M658N841P334Q542Q279O473M827M916O242P118
$$ 111982 115583 118783 121879 125565 130223 136064 143398 151940 160219 166692 171519 176435 182677 189795
56496A89795P051P109P957Q585P636N363L457L028L449L420K569J583J126J224
$$ 189795 196846 203955 211912 220497 228133 233496 236953 239981 243430 246850 249419 251002 252128 253352
56482B53352J543J657J174J63o40p31p76j849l731n002m995m570m565m733m765
$$ 253352 254895 256552 257726 257889 257249 256518 255742 253893 250162 245160 240165 235595 231030 226297 221532
56467B21532n182o180o616n399l251j925k025k703l164l440l732l869l437k128
$$ 221532 216350 210170 203554 198155 194904 192979 190954 188251 185087 181647 177915 174046 170609 168481
56453A68481k61Q58K9k003k908j793o15j332k949l115j734q95j590k648k947k797
$$ 168481 168220 169078 169107 167104 164196 162403 161788 160456 157507 154392 152658 151763 150173 147525 144578 141781
56437A41781k709k402j649p85K5J016J944J983R27m01j084q46P8J045J183M19
$$ 141781 139072 136670 135021 134236 134261 135277 137221 139204 140131 139730 138646 137800 137878 138923 140106 140525
56421A40525r5L97P84k81j848j723Q9J095j05j919k180p50J155K665L373K954
$$ 140525 140430 140827 141611 141330 139482 137759 137848 138943 138838 136919 134739 133989 135144 137809 141182 144136
56405A44136J811J155J563K283K545K666L096L334K624J139l00j153j342j000
$$ 144136 145947 147102 148665 150948 153493 156159 159255 162589 165213 166352 166052 164899 163557 162557
56391A62557m10J58P21J285J455J087J010K064L630M301L888L477L517L322K569
$$ 162557 162147 162305 163026 164311 165766 166853 167863 169927 173557 177858 181746 185223 188740 192062 194631
56376A94631J866J559J368J284J503J453N35k52O08K422K946K083K213L955M540
$$ 194631 196497 198056 199424 200708 202211 203664 204199 203947 204555 206977 209923 212006 214219 218174 222714
56361B22714K096r84j315P74K279J903Q68K18j87l40J97J138J597J387J010O20
$$ 222714 224810 223826 222511 223285 225564 227467 228335 228553 228366 228026 228223 229361 230958 232345 233355 233975
56345B33975J16l5O99J806K166J409jj515k519k114j20K072K783K062J488K032
$$ 233975 234091 234056 234755 236561 238727 240136 240135 238620 236101 233987 233867 235939 238722 240784 242272 244304
56329B44304L012L203K367J541J950L512M534L545J315P3O14J492J421R86J205
$$ 244304 247316 250519 252886 254427 256377 259889 264423 267968 269283 269356 269970 271462 272883 273869 275074
56314B75074J803J962J694J303N53o17j389j196o63n08l48L01Q73O93J90j4l41
$$ 275074 276877 278839 280533 281836 282389 281772 280383 279187 278524 278016 277668 277969 278842 279535 279725 279711 279370
56297B79370j426k660k882j930n34P75J787K251K288K457K786K636K055K039K669
$$ 279370 277944 275284 272402 270472 269938 270713 272500 274751 277039 279496 282282 284918 286973 289012 291681
56282B91681K547J157N9M27R98K52q94o10Q02J595J409J259J436J556K055L482
$$ 291681 294228 295385 295444 295871 296869 297121 296227 295617 296419 298014 299423 300682 302118 303674 305729 309211
56266C09211M663L868J735Q66K401M707N751N132L627K120J279J175J118O30K48
$$ 309211 313874 317742 319477 320343 322744 327451 333202 338334 341961 344081 345360 346535 347653 348283 348531
56251C48531N44J075J373K005L312M097L286K013K054K954K843J679J351K731
$$ 348531 349075 350150 351523 353528 356840 360937 364223 366236 368290 371244 374087 375766 377117 379848
56237C79848M862O952Q989J0214R272O458L991L397M110M932N361N202M481M069
$$ 379848 384710 391662 400651 410865 420137 426595 430586 433983 438093 443025 448386 453588 458069 462138
56223D62138N019O945Q393Q914R371J0084J0280R698R228R552J0297J0850J0886
$$ 462138 467157 474102 482495 491409 500780 510864 521144 530842 540070 549622 559919 570769 581655
56210E81655J0135Q842Q317R588J1714J2994J3654J5450J8577K0970K1147J9994
$$ 581655 591790 600632 608949 618537 630251 643245 656899 672349 690926 711896 733043 753037
56198G53037J9206J9650K1703K5569L0475L5003L8814M2789M6991N0111N1600
$$ 753037 772243 791893 813596 839165 869640 904643 943457 986246 1033237 1083348 1134948
56187A134948N2972N5987O0516O4961O7946O8936O8107O6258O4291O2340N9696
$$ 1134948 1187920 1243907 1304423 1369384 1437330 1506266 1574373 1640631 1704922 1767262 1826958
56176A826958N5594M9557M1365L1459K1125J1364K005p241j5617k2629k9552l7829
$$ 1826958 1882552 1932109 1973474 2004933 2026058 2037422 2039427 2032186 2016569 1993940 1964388 1926559
56164A926559m6332n2247n4540n4706n4153n2956n1328n0211m9768m8981m7285
$$ 1926559 1880227 1827980 1773440 1718734 1664581 1611625 1560297 1510086 1460318 1411337 1364052
56153A364052m5193m2911l9983l6696l4277l3079l1940k9857k7133k4585k2691
$$ 1364052 1318859 1275948 1235965 1199269 1164992 1131913 1099973 1070116 1042983 1018398 995707
56142I95707k1702k1300k0204j7389j3688j0894r513q771q361q457q309o963n112
$$ 995707 974005 952705 932501 915112 901424 890530 881017 872246 863885 855428 847119 840156 835044
56129H35044m233m032k978j213m10p09m84N49P88k9OJ584K706K060J402K770N373
$$ 835044 830811 826779 823801 822588 822178 821469 820985 821534 822322 822293 822299 823883 826589 828649 830051 832821 838194
56112H38194P015P050O334N637N541O681Q723J0172J0292J0211J1178J2861J4217
$$ 838194 845209 852259 858593 864230 869771 876452 885175 895347 905639 915850 927028 939889 954106
56099I54106J4942J5245J5390J6134J8366K1605K4001K4646K4758K5974K8563
$$ 954106 969048 984293 999683 1015817 1034183 1055788 1079789 1104435 1129193 1155167 1183730
56088A183730L1885L5516L9332M3400M8109N3628N9267O4412O9800P6661Q4986
$$ 1183730 1215615 1251131 1290463 1333863 1381972 1435600 1494867 1559279 1629079 1705740 1790726
56077A790726R4052J03887J14339J23399J28691J30155J28927J24353J15214J03482
$$ 1790726 1884778 1988665 2103004 2226403 2355094 2485249 2614176 2738529 2853743 2957225
56067B957225R3408Q6453Q0399P3784O7597O1736N3427M0838K5477R661n671j9441
$$ 2957225 3050633 3137086 3217485 3291269 3358866 3420602 3474029 3514867 3540344 3550005 3544334 3524893
56055C524893k9835l6971m3801n2785o3811p6164q9696j02781j12009j15670j15178
$$ 3524893 3495058 3458087 3414286 3361501 3297690 3221526 3131830 3029049 2917040 2801370 2686192
56044B686192j12028j06010r7615q8969q0741p1156n9815m9572m2637l7672l2660
$$ 2686192 2574164 2468154 2370539 2281570 2200829 2129673 2069858 2020286 1977649 1939977 1907317
56033A907317k7766k3327j8078j1772o792m553k819Q47N320Q159R392J0492J1614
$$ 1907317 1879551 1856224 1838146 1826374 1819582 1815029 1812210 1813057 1818377 1826536 1835928 1846420 1858034
56020A858034J2325J3353J5263J7096J8278K0023K2896K5077K5135K4628K5836
$$ 1858034 1870359 1883712 1898975 1916071 1934349 1954372 1977268 2002345 2027480 2052108 2077944
56009B077944K8620L1415L3455L4431L3799L2157L1381L2116L3066L3756L5420
$$ 2077944 2106564 2137979 2171434 2205865 2239664 2271821 2303202 2335318 2368384 2402140 2437560
55998B437560L8212M0470M1785M3558M5426M4948M2366M1594M4428M7840M9320
$$ 2437560 2475772 2516242 2558027 2601585 2647011 2691959 2734325 2775919 2820347 2868187 2917507
55987B917507N0599N3470N6204N7276N8621O1688O4225O4626O5772P0499P6492
$$ 2917507 2968106 3021576 3077780 3135056 3193677 3255365 3319590 3384216 3449988 3520487 3596979
55976C596979P9744Q0313Q0930Q2580Q4905Q8382R2872R6589R9257J03349J09825
$$ 3596979 3676723 3757036 3837966 3920546 4005451 4093833 4186705 4283294 4382551 4485900 4595725
55965D595725J16221J21436J28088J37342J46044J52311J59067J68342J77269
$$ 4595725 4711946 4833382 4961470 5098812 5244856 5397167 5556234 5724576 5901845
55956E901845J83949J92027K04579K18487K30118K41695K56551K72691K86899
$$ 5901845 6085794 6277821 6482400 6700887 6931005 7172700 7429251 7701942 7988841
55947G988841L00863L17382L34743L50588L67206L87207M08180M27308M46846
$$ 7988841 8289704 8607086 8941829 9292417 9659623 10046830 10455010 10882318 11329164
55938A1329164M69450M92873N15153N39975N70534O03379O34757O67680P06047
$$ 11329164 11798614 12291487 12806640 13346615 13917149 14520528 15155285 15822965 16529012
55929A6529012P47454P88721Q32458Q80801R29256R74821J023702J082739J150097
$$ 16529012 17276466 18065187 18897645 19778446 20707702 21682523 22706225 23788964 24939061
55920B4939061J223001J306902J407097J518934J636632J764169J906900K061162
$$ 24939061 26162062 27468964 28876061 30394995 32031627 33795796 35702696 37763858
55912C7763858K224030K404435K611802K842497L090713L363258L670198M012567
$$ 37763858 39987888 42392323 45004125 47846622 50937335 54300593 57970791 61983358
55904F1983358M395176M839510N367071N983807O700171P550837Q572022R776148
$$ 61983358 66378534 71218044 76585115 82568922 89269093 96819930 105391952 115168100
55896A15168100J1174212J2803415J4701190J6868998J9288356K1937434K4745276
$$ 115168100 126342312 139145727 153846917 170715915 190004271 211941705 236686981
55889B36686981K7558805L0179012L2299977L3228884L1735790K6567032J7478819
$$ 236686981 264245786 294424798 326724775 359953659 391689449 418256481 435735300
55882D35735300N824717o025131j5969860k3034186k7277900k9228856k9482227
$$ 435735300 441560017 435534886 419565026 396530840 369252940 340024084 310541857
55875C10541857k8581989k6975540k4971656k2767541k0515404j8337521j6303040
$$ 310541857 281959868 254984328 230012672 207245131 186729727 168392206 152089166
55868A52089166j4438607j2762274j1284864r992812q860402p874424p027295
$$ 152089166 137650559 124888285 113603421 103610609 94750207 86875783 79848488
55861G9848488o296426n653026n084787m591079m162551l783224l446319l150978
$$ 79848488 73552062 67899036 62814249 58223170 54060619 50277395 46831076 43680098
55853D3680098k888380k646577k424565k227573k052697j891998j745007j615388
$$ 43680098 40791718 38145141 35720576 33493003 31440306 29548308 27803301 26187913
55845B6187913j499293j389081j284960j191785j107993j028432r54518q90806
$$ 26187913 24688620 23299539 22014579 20822794 19714801 18686369 17731851 16841045
55837A6841045q34653p79418p25210o76907o34141n92521n52323n17053m85623
$$ 16841045 16006392 15226974 14501764 13824857 13190716 12598195 12045872 11528819 11043196
55828A1043196m54328m24219l98296l73763l45361l14423k86481k61735k35833
$$ 11043196 10588868 10164649 9766353 9392590 9047229 8732806 8446325 8184590 7948757
55819G948757k08621j84320j64153j46406j33115j29410j36163j49311j65839
$$ 7948757 7740136 7555816 7391663 7245257 7112142 6982732 6846569 6697258 6531419
55810F531419j84610k02133k13844k19520k22287k22781k19362k13110k07212
$$ 6531419 6346809 6144676 5930832 5711312 5489025 5266244 5046882 4833772 4626560
55801D626560k01854j94680j85846j77772j70414j61441j50880j41288j33479
$$ 4626560 4424706 4230026 4044180 3866408 3695994 3534553 3383673 3242385 3108906
55792C108906j25853j17558j09107j00549r2092q5179q0126p4519o7053o0572
$$ 3108906 2983053 2865495 2756388 2655839 2563747 2478568 2398442 2323923 2256870 2196298
55782B196298n7623n5607n0554m3440l8250l5838l4355l3775l5032l6246l4835
$$ 2196298 2138675 2083068 2032514 1989074 1950824 1914986 1880631 1846856 1811824 1775578 1740743
55771A740743l2335l2350l4621l5653l4405l2874l1848l0356k8760k8250k7947
$$ 1740743 1708408 1676058 1641437 1605784 1571379 1538505 1506657 1476301 1447541 1419291 1391344
55760A391344k6356k4807k5508k7124k6373k3061j9669j6973j4227j2410j2884
$$ 1391344 1364988 1340181 1314673 1287549 1261176 1238115 1218446 1201473 1187246 1174836 1161952
55749A161952j3728j1946q625p397q469q626o735m508k315R95M115L986R14j415
$$ 1161952 1148224 1136278 1127653 1120256 1111787 1103161 1096426 1091918 1089603 1090598 1094713 1098699 1099613 1098198
55735A098198j581j809l325m634n189o578r010j0397j0141j0312j1925j3292j3198
$$ 1098198 1096617 1094808 1091483 1086849 1081660 1075082 1066072 1055675 1045534 1035222 1023297 1010005 996807
55722I96807j2738j3008j3681j4694j6660j8950j9847j9151j8248j7500j6035
$$ 996807 984069 971061 957380 942686 926026 907076 887229 868078 849830 832330 816295
55711H16295j4083j2729j1424q676n213l428l618l929m048n508q070r311q495
$$ 816295 802212 789483 778059 769383 764170 760742 757124 753195 749147 743639 735569 726258 717763
55698G17763p593p771p994p808q361r697j0155r441r457j0962j2279j2314j2124
$$ 717763 710170 702399 694405 686597 678236 668539 658384 648943 639486 628524 616245 603931 591807
55685E91807j2296j1472q927o320n458o111p016p406o793n092l437l196l838l685
$$ 591807 579511 568039 559112 552792 547334 541223 534207 526801 520008 514916 511479 508283 504445 500760
55671E00760k643k059k066j725j738l954p761j0007r294p626o929o732o149n532
$$ 500760 498117 496058 493992 492267 490529 486575 478814 468807 459513 451887 444958 438226 432077 426545
55657D26545n036m008k787k705l544l408j912q39q46k95J516K798K282J109K38
$$ 426545 421509 417501 414714 412009 408465 405057 403145 402306 401460 401165 402681 405479 407761 408870 409108
55642D09108j397m397o987p546p093p345q034p913o949n835m718l709l398l690
$$ 409108 407711 403314 396327 388781 381688 374343 366309 358396 351447 345612 340894 337185 333787 330097
55628C30097l396k087r44q70j146q15k5P93J590J992J522R96J768L177K886M71
$$ 330097 326701 324614 323670 322800 321654 320839 320814 321607 323197 325189 326711 327707 329475 332652 335538 336009
55612C36009j725k124j873k176k282j567j203j878k062n16J293J329oq48n76J54
$$ 336009 334284 332160 330287 328111 325829 324262 323059 321181 319119 318603 319896 321225 321219 320371 319795 319949
55596C19949Q16J044M28l91J24K014L196K469J311J226J292J83j223j495j270
$$ 319949 320765 321809 322237 321846 321970 323984 327180 329649 330960 332186 333478 333661 332438 330943 329673
55581C29673k020l374l954l794l839l995l739l790m941o011n260l302k374k961
$$ 329673 327653 324279 320325 316531 312692 308697 304958 301168 296227 290216 284956 281654 279280 276319
55567B76319l361k536j332o64l44r3k12p92j383j836k489l291l657l370k981l154
$$ 276319 272958 270422 269090 268426 268082 267989 267777 266985 265602 263766 261277 257986 254329 250959 247978 244824
55551B44824m108n543o628o368m667k725j817j956k345k582k689k401j352J90
$$ 244824 240716 235173 228545 222177 217510 214785 212968 211012 208667 206085 203396 200995 199643 199833
55537A99833J468K024J942J499J050R10R43N76m00j462k028j997j376j75J006
$$ 199833 201301 203325 205267 206766 207816 208726 209669 210245 209845 208383 206355 204358 202982 202807 203813
55522B03813J120N6q43l45J117K064J735N86m67o81K75K096L873M781M681M029
$$ 203813 204933 204989 204146 203801 204918 206982 208717 209303 208836 208155 208430 210526 214399 219180 223861 227890
55506B27890L377K946K414J295j48q43l37K69l34j902l331m493n934p169p037
$$ 227890 231267 234213 236627 237922 237774 236931 236594 236863 236529 234627 231296 226803 220869 213700 206663
55491B06663n769m926n054n138m577l943l342j891M11K006J897R94N50M87J86
$$ 206663 200894 195968 190914 185776 181199 177256 173914 172023 172434 174440 176337 177331 177881 178368 178554
55476A78554l48q91j465j758j255m01l67j236j855j860k142k830k735j605r67
$$ 178554 178206 177315 175850 174092 172837 172436 172069 170833 168978 167118 164976 162146 159411 157806 156839
55461A56839j705k621k494j825j368p55J94N83K29L37J110O87j791m103m036k676
$$ 156839 155134 152513 150019 148194 146826 146071 146265 146848 147077 147414 148524 149211 147420 143317 139281 136605
55445A36605k312k673j930k08O70L13K7L38N51N00P33J107R93O49O58M94n66j617
$$ 136605 134293 131620 129690 129482 130152 130465 130492 130830 131381 131881 132614 133721 134714 135363 136021 136515 135949 134332
55427A34332j167K70P47j01o52o0O51O38N73J187J934J881R74j14p87p88l16K5
$$ 134332 133165 133435 134182 134081 133429 133369 134020 134658 135231 136418 138352 140233 141207 141093 140306 139518 139202 139227
55409A39227j39m44l97j31o8k64o81j530k691l422l312k834k306j308Q5P58L12
$$ 139227 139088 138644 138247 138116 138048 137784 137103 135573 132882 129460 126148 123314 121008 119700 119785 120543 120855
55392A20855L6P71J207L1j472j208L11P32m37j328p93K61Q07R68J006Q65R57J809
$$ 120855 120891 121662 122869 122900 121428 120220 120531 121263 120826 119498 118705 118966 119773 120741 121747 122612 123569 125378
55374A25378K703K279P46k56k29m97j797k893k367m69J549K862L247K783J954
$$ 125378 128081 130360 131106 130850 130621 130124 128327 125434 123067 122598 124147 127009 130256 133039 134993
55359A34993J322P42l07j603k243j783m79J397L323L994K619O03K14J466K077
$$ 134993 136315 137057 136750 135147 132904 131121 130642 132039 135362 139356 141975 142578 142792 144258 146335
55344A46335Q04j070k089k480k690k044k66J065L20j820l276l222k556k155j951
$$ 146335 147139 146069 143980 141500 138810 136766 136500 137565 137885 136065 132789 129567 127011 124856 122905
55329A22905j590r38j7Q79J102L23p91j172m19J050K545L295K590N80j324j752
$$ 122905 121315 120377 120360 121239 122341 122664 121873 120701 120282 121332 123877 127172 129762 130342 129018 127266
55313A27266j087r52j832k262r72J003J525L08p02j45R64J065N10O51J256P04
$$ 127266 126179 125227 123395 121133 120161 121164 122689 122997 122295 122150 123114 124179 124689 125340 126596 127300
55297A27300j169k348j457L06J006M76k20p46j441j989j660o95k38p93j670j930
$$ 127300 126131 123783 122326 122632 123638 124114 123894 123148 121707 119718 118058 117363 117125 116332 114662 112732
55281A12732j256K6J159J383P07l2k93n52j305j972j601k22J243K005J726M02
$$ 112732 111476 111502 112661 114044 114751 114719 114426 113874 112569 110597 108996 108774 110017 112022 113748 114150
55265A14150j240j789n43J480K655K542J846J175O59L25J1o54j519j745j053m27
$$ 114150 112910 111121 110578 112058 114713 117255 119101 120276 120935 121260 121271 120617 119098 117353 116300 115873
55249A15873p40j468j581r30R5J318K203J766J68p50J9R35L55p16m36N05Mj707
$$ 115873 115133 113665 112084 111154 111249 112567 114770 116536 116704 115954 115973 116908 117263 116547 116111 116616 116620 114913
55231A14913k274j096j84p66j548j117L6Q31J219J583J881K045K094J566M1j588
$$ 114913 112639 111543 111359 110593 109045 107928 107964 108795 110014 111597 113478 115523 117617 119183 119224 117636
55215A17636j898j100q52j658k120j246J01O71L13m62j064o43J197L137L113R62
$$ 117636 115738 114638 113786 112128 110008 108762 108863 109534 109847 109385 108321 107678 108875 112012 115125 116087
55199A16087j274k007j479l24J312K648K309M60q69n36J83n5m81K91J916K907
$$ 116087 114813 112806 111327 111003 112315 114963 117272 117732 116863 116327 116510 116455 115974 116265 118181 121088
55183A21088K637J514M7j243j696j282q45r37j106q97o15n12j99N04J073J212
$$ 121088 123725 125239 125286 124043 122347 121065 120220 119283 118177 117280 116665 116153 115954 116458 117531 118743
55167A18743J342J593J363M54l97o16m63k14K01M94K39k1O66J662J265l78r86
$$ 118743 120085 121678 123041 123495 123098 122482 122019 121805 122006 122500 122739 122718 123384 125046 126311 125933 124947
55150A24947L10J408M86j241j673q28R4Q90J689J589J13j234r48J4j43j045j094
$$ 124947 125257 126665 127151 125910 124237 123409 123503 124393 126082 127671 127784 126550 125602 125616 125473 124428 123334
55133A23334m82p35j761j874o89L75O58J065J903J980O04j073j601q38M49J587
$$ 123334 122852 122117 120356 118482 117793 118168 118826 119891 121794 123774 124378 123305 121704 120866 121315 122902
55117A22902K044J470K22p36p98m0J262K712L540L268K459J952J508L42j152j583
$$ 122902 124946 126416 126638 125902 125104 125064 126326 129038 132578 135846 138305 140257 141765 142107 140955 139372
55101A39372o45K63p4j190j838j550q01k05n2j63M9R42K006K380J943J329Q41
$$ 139372 138727 138990 138916 137726 135888 134338 133537 133332 133280 133117 133166 134108 136114 138494 140437 141766 142607
55084A42607J47q08j409j230o88n41j105k122k933k747j401M4J43j140k226j854
$$ 142607 142754 141946 140537 139307 138619 138078 136973 134851 131918 129171 127770 127814 127957 126817 124591 122737
55068A22737n48M32Q36J224J493Q96l67q45J95J500J509O65O34J537J631J63j206
$$ 122737 122189 122621 123457 124681 126174 127070 126703 125858 126053 127553 129062 129727 130361 131898 133529 133692 132486
55051A32486q73K27J78r23j397q02k84j45O73K269K940J620m09j414j435j519
$$ 132486 131613 131840 132018 131095 129698 128896 128612 128467 129140 131409 134349 135969 135560 134146 132711 131192
55035A31192j746j437n85K07Q29J713K882L712L615K574J222M68N04L30r19k291
$$ 131192 129446 128009 127424 127631 128460 130173 133055 136767 140382 142956 144178 144646 145150 145480 144561 142270
55019A42270j959k2J217L99j066j178J22J621K640K902J990L21m94J76N89r29
$$ 142270 140311 140289 141506 141905 140839 139661 139783 141404 144044 146946 148936 149257 148763 148939 149528 148599
55003A48599l143l377j181J338K396J958O48r33j872j574q62j091k175k725k051
$$ 148599 145456 142079 140898 142236 144632 146590 147238 146305 144433 142859 141997 140906 138731 136006 133955
54988A33955q17K39R73J328J284J234J423J285M15l72k14J07p27k262k815j995
$$ 133955 133138 133377 134350 135678 136962 138196 139619 140904 141319 140947 140733 140840 140113 137851 135036 133041
54972A33041p84O22K840N079N237K971M71o62j309k481l081j764M42J356P18L14
$$ 133041 132257 132879 135719 140798 146035 149006 149477 148815 147506 145025 141944 140180 140622 141978 142696 143010
54956A43010J272K689L036J822k46k041k679j836J91K615M207L776J297j448k290
$$ 143010 144282 146971 150007 151829 151583 149542 146863 145027 145218 147833 152040 155816 157113 155665 153375
54941A53375r50P92J338Q54L51J73n3o16j443k127j975o53R58J368L99l29M71
$$ 153375 152425 153217 154555 155409 155760 155933 155880 155264 153821 151694 149719 149066 150024 151392 151791 151462 151933
54924A51933J959K402J550P55R36J593J866J709J553J488J261Q28M16J13j89m14
$$ 151933 153892 156294 157844 158599 159535 161128 162994 164703 166256 167744 169005 169833 170249 170362 170173 169759
54908A69759k35L27O58K92l19m47k89o76j575j865j013Q6N29P15J243J564J001
$$ 169759 169524 169851 170509 170801 170482 170035 169746 169070 167495 165630 164617 164703 165232 165947 167190 168754 169755
54891A69755L76J045K571L010J632Oj74Q42J486P95q39k293k671j955r85n63o80
$$ 169755 170131 171176 173747 176757 178389 178395 178221 179063 180549 181344 180505 178212 175541 173586 172601 172038 171358
54874A71358q23o70j20R16K080K601K464K889M594O253O086M511L695M633O252
$$ 171358 170535 169865 169745 170661 172741 175342 177806 180695 185289 191542 197628 202139 205834 210467 216719
54859B16719P390Q086Q651R010R220R391Q899P008M349K202L78k345n480o821
$$ 216719 224109 232195 240846 249856 259076 268467 277366 284374 288723 290925 291303 288958 283478 276657
54845B76657o032n764p842j0290j0100p424m940m047l740k890j781j310j884l070
$$ 276657 270625 264861 257019 246729 236629 229205 224265 220218 216478 213588 211807 210497 208613 205543
54831B05543l609k287M56K460K272Q37j36m56p61o20Q68L115M595N131N819O776
$$ 205543 201934 199647 200103 202563 204835 205672 205536 205080 204319 203699 204567 207682 212277 217408 223227 230003
54815B30003O873O019N770O936Q094P469N164K480N0k242m151n137n334n534o068
$$ 230003 236876 242895 248665 255601 263695 271164 276328 278808 278858 276616 272465 267328 261994 256460 250392
54800B50392o426o172n608n273n126m717m038l717m062m405l878k635j612j188
$$ 250392 243966 237794 232186 226913 221787 217070 213032 209315 205253 200848 196970 194335 192723 191535
54786A91535j006j236k825n687p657o520k808O02J631Q47J62O27J800K503J873
$$ 191535 190529 189293 186468 180781 173124 166604 163796 164398 166029 166876 167038 167665 169465 171968 173841
54771A73841J50j404j758j319j273j769j677l73J062J134k02j651k205j903j136
$$ 173841 173991 172587 170829 169510 168237 166468 164791 164418 165480 166614 166412 164761 162556 160653 159517
54756A59517k0J247J989J528K8j428j734p31P50J770K108K222K503K771K493J368
$$ 159517 159497 160744 162733 164261 164289 162861 161127 160396 161146 162916 165024 167246 169749 172520 175013 176381
54740A76381l67k021k795k195m53J417K259J791Q96N25M18m97k179k863j208J401
$$ 176381 176014 173993 171198 169003 168550 169967 172226 174017 174913 175438 175856 175359 173180 170317 169109 170510
54724A70510K133K90j668j447O0L89o98q58J314M184N385M898M578N264N906N596
$$ 170510 172643 172933 171265 169818 169878 170267 169569 168711 170025 174209 179594 184492 189070 194334 200240 205836
54708B05836N061N465O649P507P650P766Q404R170R365Q724P320N281K968R36
$$ 205836 210897 216362 223011 230518 238168 245934 254338 263508 272873 281597 288917 294198 297166 298102
54694B98102o91k476m793p057q345q511q143p567o693n713n196n202m925l667
$$ 298102 297411 294935 290142 283085 274740 266229 258086 250519 243826 238113 232917 227715 222790 219123
54680B19123j783l00K07Q5J11P02J491J698J059K94L20J116J899K363K994L838
$$ 219123 217340 217040 217247 217332 217443 218145 219636 221334 222393 222687 223007 224123 226022 228385 231379 235217
54664B35217L928K748J723K984O548R795J0334Q612O818N815M391J632j446l426
$$ 235217 239145 241893 243616 246600 253148 262943 273277 281889 288707 294522 298913 300545 299099 295673
54650B95673m627o224p823p705n735m211m830o257o102m333l039l240l831l746
$$ 295673 291046 284822 276999 269294 263559 259348 254518 248261 242159 237826 234787 231547 227716 223970
54636B23970l557m207n442o219n848m223j732M85J083j0j277j489j132j304j798
$$ 223970 220413 216206 210764 204545 198697 194474 192742 193227 194310 194300 193023 191534 190402 189098 187300
54621A87300j477j47J030R88k30j942l426l908k833o67J179J732J462J413J778
$$ 187300 185823 185676 186706 187694 187464 185522 182096 178188 175355 174688 175867 177599 179061 180474 182252
54606A82252J898J470R42O64M16J19K89J160J871J406J06o82m30J9j28n89q05
$$ 182252 184150 185620 186562 187226 187642 187761 188050 189210 191081 192487 192593 191911 191481 191500 191372 190783 189978
54589A89978q35r36r82q43o81l23Q08K479L246K159J50j324k178k990l218j812
$$ 189978 189143 188207 187225 186382 185701 185378 186186 188665 191911 194070 194220 192896 190718 187728 184510 182698
54573A82698O57K211J923Q20J24l0J10N52J050J049N57K43L69N32N33O04O56L50
$$ 182698 183355 185566 187489 188309 188433 188403 188513 189065 190115 191164 191721 191964 192333 192865 193398 194002 194658 195008
54555A95008p8j89m13j342k026q15J790L197K365J394K279L891L790J677o63j899
$$ 195008 194930 194741 194328 192986 190960 190145 191935 195132 197497 198891 201170 205061 208851 210528 209865 207966
54539B07966k016j363m24r7p87j615j484n47M51J486K739L480K906J610Q16N64
$$ 207966 205950 204587 204163 204066 203279 201664 200180 199633 200084 201570 204309 207789 210695 212305 213121 213685
54523B13685Q0l90K41J892L028K709J707J213J389J595J277L78n60o34L96J408
$$ 213685 213765 213375 213616 215508 218536 221245 222952 224165 225554 227149 228426 228804 228244 227610 228006 229414
54507B29414J053m72j609j433n25K68R75J967K961L221K485J281L97J41K03K27
$$ 229414 230467 229995 228386 226953 226428 226696 227671 229638 232599 235820 238305 239586 239983 240124 240327 240554
54491B40554L21O51P17j55j526k028j195QR97K564M951O393N313K957J769J756
$$ 240554 240875 241526 242243 242088 240562 238534 237339 237347 238344 240908 245859 252252 257565 260522 262291 264047
54475B64047Q05j424k612j454J35j07j405j290P48K762L119K194J266R16Q11K95
$$ 264047 264852 263428 260816 259362 259497 259390 257985 256695 257443 260205 263324 265518 266784 267700 268511 268806
54459B68806j114l249n035n121l163m22J157O11j272k773k850j843p45j38M6P7
$$ 268806 267692 264443 259408 254287 251124 250702 251859 252470 251198 248425 245575 243732 242987 242849 242895 242972
54443B42972J53L25M22K83K46R87K469L544L237K067J356J468J624J354J213J803
$$ 242972 243125 243450 243872 244155 244401 245388 247857 251401 254638 256705 258061 259529 261153 262507 263720 265523
54427B65523K830L438L101K000R02O76J452K285K199J533J570K742L917L817K557
$$ 265523 268353 271791 274892 276892 277794 278470 279922 282207 284406 285939 287509 290251 294168 297985 300542
54412C00542J342J105J795K738L263L090K417J680J243J300J880K692L096K617
$$ 300542 301884 302989 304784 307522 310785 313875 316292 317972 319215 320515 322395 325087 328183 330800
54398C30800J471L34l78q04j354k399l958n324n300l352n00J500J828J104L53
$$ 330800 332271 332605 332227 331423 330069 327670 323712 318388 313088 309736 309236 310736 312564 313668 314021
54383C14021j9j85m65j063j863k390k194j413o13k20k36m81p86j022j194j379
$$ 314021 314002 313817 313352 312289 310426 308036 305842 304429 303816 303596 303360 302879 302093 301071 299877 298498
54367B98498j511j438j309j459j647j064M41J727J678O87P3K82O33N75K66p5m75
$$ 298498 296987 295549 294240 292781 291134 290070 290511 292238 293916 294603 294676 294958 295591 296166 296432 296357 295882
54350B95882p49n10J30M87J52o02j319j771j745j027J53J029R63Q0q30r96l55
$$ 295882 295133 294623 294753 295240 295392 294790 293471 291700 289955 288928 289081 290110 291073 291153 290323 289327 288972
54333B88972L53L70k04o00m01K05J078K194K935K489J379J278K623L694K982J200
$$ 288972 289325 289695 289491 288891 288490 288695 289773 291967 294902 297391 298770 300048 302671 306365 309347 310547
54317C10547k98j538k774k784n87K063K428N70j037j344j528j998j528o5M53p53
$$ 310547 310249 308711 305937 303153 302566 304629 307057 307627 306590 305246 303718 301720 300192 300127 300580 299827
54301B99827j755r17O39J154R14J059J343R76M62O36P99k74k039k664j500K52
$$ 299827 298072 297155 297794 298948 299862 300921 302264 303240 303702 304338 305137 304863 302824 300160 298660 298912
54285B98912J164O70r95k867l571k634j184o70j382k919n018o877o748l916l91
$$ 298912 300076 300746 299751 296884 293313 290679 289495 288825 287443 284524 279506 272629 265881 261965 261574
54270B61574J061J77j077j541j769k081j845j056p15r72n30J237K935K891J218
$$ 261574 262635 262812 261735 260194 258425 256344 254499 253443 252728 251756 251226 252463 255398 258289 259507
54255B59507p77k191k632j743Q6J281P05n92o12Q64K057J800Q83L72k8j010k081
$$ 259507 258730 256539 253907 252164 252250 253531 254236 253644 253032 253896 255953 257753 258636 259008 258980 257970 255889
54238B55889k281j830j767k117j873r24n72j498k539k291j004J46P35Q94L22j034
$$ 255889 253608 251778 250011 247894 246021 245097 244525 243027 240488 238197 237193 237339 238074 238968 239290 238256
54222B38256j906j077M01K13j830l228k141L18J990K225J548K01j539k512j705
$$ 238256 236350 235273 235674 235887 234057 230829 228688 229006 230996 233221 234769 234970 233431 230919 229214
54207B29214K23J626J763J218Q95J448L024M594M248J403j827k812j557k56j11
$$ 229214 229437 231063 232826 234044 234939 236387 239411 244005 248253 249656 247829 245017 243460 243204 243093
54192B43093l30k97p06j823k374j364J75N73j65p58p57r03j472j677r92K0N77
$$ 243093 242763 242466 241760 239937 237563 236199 236374 236947 236782 236024 235267 234364 232892 231215 230223 230243 230820
54175B30820O22L91r7o29n19M67J376J116o3r75j183j205j170n13O22R54j14j271
$$ 230820 231442 231833 231736 231107 230588 231055 232431 233547 233484 232509 231326 230121 228951 228438 229060 230014 229900 228629
54157B28629j023J24L84p48j973k140j500r07p08q02r73q00J26J569K620K498
$$ 228629 227606 227730 228114 227366 225393 223253 221753 220846 220138 219336 218363 217563 217689 219258 221878 224376
54141B24376J172o69j870j478K02J579J544Q24O85Q32O0j358j732n60O03N72K37
$$ 224376 225548 224879 223009 221531 221733 223312 224856 225680 226365 227197 227257 225899 224167 223607 224210 224782 225019
54124B25019R30K330L034K365P20j178k590k955k454j751r05O43K592L489K615
$$ 225019 225949 228279 231313 233678 234398 233220 230630 227675 225221 223470 222565 223208 225800 229289 231904
54109B31904J070J61k57q32j150l99R64J538P27p15j761k044k028k585m006n185
$$ 231904 232974 233135 232878 232046 230896 230497 231461 232999 233726 233011 231250 229206 227178 224593 220587 215402
54093B15402m543k078M53J808K436K866K450Q05q40j157n32PN29J344J489J11
$$ 215402 210859 208781 209234 211042 213478 216344 218794 219599 218759 217602 217070 217077 217606 218950 220439 220550
54077B20550j422r30J299K730K124Q68M47M44j69j150j414n99M78O30n84k105
$$ 220550 219128 218198 219497 222227 224351 225219 225666 226110 225941 224791 223377 222778 223256 223886 223302 221197
54061B21197k019L62L324M426L104Q69o76r96l11O77Q93k5r49n82O74J386J291
$$ 221197 219178 219540 222864 227290 230394 231263 230587 229591 229280 229957 230850 230825 229876 229294 229968 231354 232645
54044B32645J412K146K789K947K824K069M6k374l087j505M18P68p0o08m67k75
$$ 232645 234057 236203 238992 241939 244763 246832 246878 244504 241417 239912 240330 241098 241028 240420 239953 239678
54028B39678j72L00J205J976K137J852J772K321K941K479R72L68K204M936N401
$$ 239678 239506 239806 241011 242987 245124 246976 248748 251069 254010 256489 257461 257829 260033 264969 270370
54013B70370L077Q74J078K448K545J321N89J064J808K157K441K773K625J924J608
$$ 270370 273447 274321 275399 277847 280392 281713 282302 283366 285174 287331 289772 292545 295170 297094 298702
53998B98702K494M188N486N758N651O355P974Q898P430M087J373P80R80j72k475
$$ 298702 301196 305384 310870 316628 322279 328634 336608 345506 352936 357023 358396 359176 360156 359984 357509
53983C57509l487j686J616L871M063L281L016L654M729N973P427Q721R063Q380
$$ 357509 354022 352336 353952 357823 361886 365167 368183 371837 376566 382539 389966 398687 407750 416130
53969D16130P741P999Q550Q210P016O092N845N400M092K529J685J619J649J325
$$ 416130 423871 431870 440420 448630 455646 461738 467583 472983 477075 479604 481289 482908 484557 485882
53955D85882P90M03K71L5q48k308l458l683l664m580o445q171r150r708r869q867
$$ 485882 486672 487075 487346 487381 486533 484225 480767 477084 473420 468840 462395 454224 445074 435366 425497 416630
53939D16630o388l479j622j515k923n018o592o738n711m523l635k806k174k385
$$ 416630 410242 406763 405141 403626 400703 395685 389093 382355 376644 372121 368486 365680 363506 361121
53925C61121l345m017l860l434l184k828k425k657l310k858o85J382J165r59k521
$$ 361121 357776 353759 349899 346465 343281 340453 338028 335371 332061 329203 328518 329900 331065 330106 327585
53910C27585j877L53K341K682J366p6J18J953L508L310J880L62j078k322k144
$$ 327585 325708 326061 328402 331084 332450 332374 332492 334445 337953 341263 343143 343505 342427 340105 337961
53895C37961K42L325M875M877M970N377M625K524J149J978L771M553M409M952
$$ 337961 338203 341528 346403 351280 356250 361627 366252 368776 369925 371903 375674 380227 384636 389588
53881C89588O708Q305Q188O308M089L139L923N549O849P563Q122Q537Q242P114
$$ 389588 396296 404601 412789 419097 423186 426325 430248 435797 442646 450209 458331 466868 475110 482224
53867D82224N870N169N026N372O446Q047R025Q418O897O325P720J0173J2059J2795
$$ 482224 488094 493263 498289 503661 510107 518154 527179 535597 542494 548819 556539 566712 578771 591566
53853E91566J3004J3246J3432J3662J4745J7095J9549K0407J9605J8629J8029
$$ 591566 604570 617816 631248 644910 659655 676750 696299 716706 736311 754940 772969
53842G72969J6324J2169O522J459k413o034r794j2723j3864j3386j2181j1171
$$ 772969 789293 801462 807984 809443 807030 800996 791202 778479 764615 751229 739048 727877
53830G27877j1032j1813j2732j3023j2902j3049j3356j3190j2680j2553j2721
$$ 727877 716845 705032 692300 679277 666375 653326 639970 626780 614100 601547 588826
53819E88826j2314j1288j0632j0622j0281r243q629r121r459q290o472n953o951
$$ 588826 576512 565224 554592 543970 533689 524446 515817 506696 497237 488947 482475 476522 469571
53806D69571p893p924p728p818p615o805o253o590o874n768l574j998k101l225
$$ 469571 461678 453754 446026 438208 430593 423788 417535 410945 404071 398303 394729 392731 390630 387405
53792C87405m073m135l833l695l748l583k856j775j143j596k635k760j020J624
$$ 387405 383332 379197 375364 371669 367921 364338 361482 359707 358564 356968 354333 351573 350553 352177
53778C52177K996J941m87k348k815k379j523j97J339K178J915J332J214J007k48
$$ 352177 355173 357114 356627 354279 351464 349085 347562 347365 348704 350882 352797 354129 355343 356350 356102
53763C56102k013k563j349J07K33o02r32k33Q32J760K646L374L471L014K847L524
$$ 356102 354089 351526 350177 350284 350517 349915 348983 348750 349582 351342 353988 357362 360833 363847 366694 370218
53747C70218M617N432N832N976N896N763O082O989P817P908P481P033O279M714
$$ 370218 374835 380267 386099 392075 397971 403734 409816 416805 424622 432530 440011 447044 453323 458037
53733D58037L082L191N726Q980J0434R310P043N413M719M004K647J308J086J945
$$ 458037 461119 464310 470036 479016 489450 498760 505803 511216 515935 519939 522586 523894 524980 526925
53719E26925K499J529o15k526l449l973n027o722q309q998q635p791p319p605
$$ 526925 529424 530953 530338 527812 524363 520390 515363 508641 500332 491334 482699 474908 467589 459984
53705D59984q245q539q279p748p113o273n327m673m411m080l347k546k173k096
$$ 459984 451739 443200 434921 427173 420060 413787 408460 403787 399376 395296 391949 389403 387230 385134
53691C85134j824j440j685k867m099m114k767j249p25j123j536j501j312j288
$$ 385134 383310 381870 380185 377318 373219 369105 366338 365089 364364 363241 361705 360204 358892 357604
53677C57604j323j157n95N97K277L388K698M90j269j104L70J594K055K200K136
$$ 357604 356281 355124 354529 355126 357403 360791 363489 363979 362710 361606 361976 363570 365625 367825 369961
53662C69961J666J210J433K008J938J164P02J012J430J495J797K896M256M814
$$ 369961 371627 372837 374270 376278 378216 379380 380082 381094 382524 384019 385816 388712 392968 397782
53648C97782M118K613J334J441L214N331N902M530K637J577J440J938L167M812
$$ 397782 401900 404513 405847 407288 410502 415833 421735 426265 428902 430479 431919 433857 437024 441836
53634D41836N718N268M334L959L788K974J921J836K774L394K832J745J152J032
$$ 441836 447554 452822 457156 461115 464903 467877 469798 471634 474408 477802 480634 482379 483531 484563
53620D84563O09m07j347j270j9J475J900P66j055k009j177Q27K202J567n58k227
$$ 484563 485172 484765 483418 482148 482129 483604 485504 486270 485215 483206 482029 482856 485058 486625 486067 483840
53604D83840k314j732j781k139j649n41j95q41j258j039j358k703l682l138j909
$$ 483840 481526 479794 478013 475874 474225 473684 473489 472648 471390 470351 468993 466290 462608 459470 457561
53589D57561j156l46J362K921K608Q70j29L13O70j23r54k76J689L383L816L244
$$ 457561 456405 456059 457421 460342 462950 463820 463691 464004 464674 464551 463597 463321 465010 468393 472209 475453
53573D75453K320J304K81k72L93K160L460K744O82k33J190L290M010L722M142
$$ 475453 477773 479077 479358 479086 479479 481639 485099 487843 488525 488292 489482 492772 496782 500504 504646
53558E04646N472O465O878P780R235R619P968N585M364M529M874M588L922L514
$$ 504646 510118 516583 523461 531241 540476 550095 558063 563648 568012 572541 577415 582003 585925 589439
53544E89439L756M640N753O533O741O537O079N343M398L484K712K011J454J273
$$ 589439 593195 597835 603588 610121 616862 623399 629478 634821 639219 642703 645415 647426 648880 650153
53530F50153J520J889J922J264j21j693k583k406j643j021q50j196j995k621k145
$$ 650153 651673 653562 655484 656748 656627 654934 652351 649945 648302 647281 646431 645235 643240 640619 638474
53515F38474p75k27j629l737m389l244j704o04M51J476J664R48N86J533L196M361
$$ 638474 637699 637472 635843 632106 627717 624473 622769 622165 622616 624092 625756 626704 627290 628823 632019 636380
53499F36380M409L425K065J635L032N155N591L671J596J627L259M331M046L514
$$ 636380 640789 644214 646279 647914 650946 656101 661692 665363 666959 668586 671845 676176 680222 683736
53485F83736L832M993O558Q167R299R447Q816Q268Q465R543J1450J3922J6109
$$ 683736 687568 692561 699119 707286 716585 726032 734848 743116 751581 761124 772574 786496 802605
53472H02605J7001J6626J6254J7153J9445K2332K4921K6449K6346K4861K3517
$$ 802605 819606 836232 852486 869639 889084 911416 936337 962786 989132 1013993 1037510
53461A037510K4001K6292K8500K9184K9227L0620L3767L7086L9364M1154M3321
$$ 1037510 1061511 1087803 1116303 1145487 1174714 1205334 1239101 1276187 1315551 1356705 1400026
53450A400026M5337M6158M5911M5455M4745M3132M1248M1011M3253M6443M8447
$$ 1400026 1445363 1491521 1537432 1582887 1627632 1670764 1712012 1753023 1796276 1842719 1891166
53439A891166M8760M8419M8400M8812M9163M8663M6694M3720M1434M1166M2137
$$ 1891166 1939926 1988345 2036745 2085557 2134720 2183383 2230077 2273797 2315231 2356397 2398534
53428B398534M2113M0079L7473L6232L6153L5214L2427K9350K8209K9336L1161
$$ 2398534 2440647 2480726 2518199 2554431 2590584 2625798 2658225 2687575 2715784 2745120 2776281
53417B776281L2110L1415K8564K3531J7831J3803J2049J0658P756L669m01m655
$$ 2776281 2808391 2839806 2868370 2891901 2909732 2923535 2935584 2946242 2953998 2957667 2957266 2952611
53405B952611r991j5748j9978k2049k3442k5638k8375l0521l1698l2577l4023
$$ 2952611 2942620 2926872 2906894 2884845 2861403 2835765 2807390 2776869 2745171 2712594 2678571
53394B678571l6336l9013m1099m2101m2469m2822m2940m2128m0371l8668l8114
$$ 2678571 2642235 2603222 2562123 2520022 2477553 2434731 2391791 2349663 2309292 2270624 2232510
53383B232510l8927m0023l9481l6091l0914k6497k3999k2073j9275j6201j3980
$$ 2232510 2193583 2153560 2114079 2077988 2047074 2020577 1996578 1974505 1955230 1939029 1925049
53372A925049j1910q520m118j98L088O777J0722J3787J6344J9994K4505K7616
$$ 1925049 1913139 1904619 1900501 1900303 1903391 1910168 1920890 1934677 1951021 1971015 1995520 2023136
53360B023136K8817L0755L5382M0805M3844M4238M4445M6372N0055N4810N9875
$$ 2023136 2051953 2082708 2118090 2158895 2202739 2246977 2291422 2337794 2387849 2442659 2502534
53349B502534O4145O6725O7878O8763P0354P3061P6872Q1227Q5296Q8906R2706
$$ 2502534 2566679 2633404 2701282 2770045 2840399 2913460 2990332 3071559 3156855 3245761 3338467
53338C338467R6978J00948J03750J05413J06410J07023J07528J08172J08558J08035
$$ 3338467 3435445 3536393 3640143 3745556 3851966 3958989 4066517 4174689 4283247 4391282
53328D391282J06999J06605J06638J05109J00896R5501R0963Q7289Q3187P8288
$$ 4391282 4498281 4604886 4711524 4816633 4917529 5013030 5103993 5191282 5274469 5352757
53318E352757P3115O7656O1571N5332M9618M3960L7268K9449K1294J3002M099
$$ 5352757 5425872 5493528 5555099 5610431 5660049 5704009 5741277 5770726 5792020 5805022 5809121
53307E809121n521j5687k6967m0283n5321p0241q3079r2818r9386j03563j06800
$$ 5809121 5803600 5787913 5760946 5720663 5665342 5595101 5512022 5419204 5319818 5216255 5109455
53296E109455j10210j13696j16610j18918j20764j21390j19784j16426j13230
$$ 5109455 4999245 4885549 4768939 4650021 4529257 4407867 4288083 4171657 4058427
53287D058427j11480j10708j09778j08189j05990j03300j00428r7833r5478r2585
$$ 4058427 3946947 3836239 3726461 3618272 3512282 3408982 3308554 3210721 3115243 3022658
53277C022658q8491q3513p8672p4629p1110o7248o2392n6553n0314m4532m0046
$$ 3022658 2934167 2850654 2771982 2697353 2626243 2558995 2496603 2440050 2389736 2345204 2305158
53266B305158l7175l5151l2556k8889k5219k2558k0243j7056j3531j1363j0494
$$ 2305158 2267983 2232832 2200276 2171387 2146168 2123610 2103367 2086311 2072780 2061417 2050923
53255B050923q747n007r83J296K272L832O635R887J2850J5280J7009J8370K0347
$$ 2050923 2042176 2037169 2036186 2037482 2039754 2043586 2050221 2060108 2072958 2088238 2105247 2123617 2143964
53242B143964K3335K6388K8784L1299L4760L8338M0804M2599M4875M7240M8358
$$ 2143964 2167299 2193687 2222471 2253770 2288530 2326868 2367672 2410271 2455146 2502386 2550744
53231B550744M8320M8540M9427N0166N0597N1310N1648M9728M5213M0330L7189
$$ 2550744 2599064 2647604 2697031 2747197 2797794 2849104 2900752 2950480 2995693 3036023 3073212
53220C073212L5414L3358L0503K7569K4923K1974J7939J2595O438L83m843r312
$$ 3073212 3108626 3141984 3172487 3200056 3224979 3246953 3264892 3277487 3283925 3284308 3279465 3270153
53208C270153j3768j8976k5189l1950l8190m3022m6823n0914n5732o0065o2847
$$ 3270153 3256385 3237409 3212220 3180270 3142080 3099058 3052235 3001321 2945589 2885524 2822677
53197B822677o4750o7020o9376p0432o9653o7762o5605o3810o3005o3052o2627
$$ 2822677 2757927 2690907 2621531 2551099 2481446 2413684 2348079 2284269 2221264 2158212 2095585
53186B095585o0964n9408n9599o0710o0545n9017n8179n8707n8827n7375n5539
$$ 2095585 2034621 1975213 1915614 1854904 1794359 1735342 1677163 1618456 1559629 1502254 1446715
53175A446715n4470n3102m9912m5369m1206l8166l5815l3792l2057l0335k8225
$$ 1446715 1392245 1339143 1289231 1243862 1202656 1164490 1128675 1094883 1062826 1032491 1004266
53164A004266k5589k2473j9209j6796j6291j7416j8637j8972j8813j8669j8296
$$ 1004266 978677 956204 936995 920199 903908 886492 867855 848883 830070 811401 793105
53153G93105j7494j6673j6066j5430j5012j5462j6271j5759j3497j1306j0751
$$ 793105 775611 758938 742872 727442 712430 696968 680697 664938 651441 640135 629384
53142F29384j1015j0576r676r494r821r349p858o530o272o960q054q862q647p567
$$ 629384 618369 607793 598117 588623 578802 569453 561595 555065 548793 541833 533779 524917 516270 508703
53128E08703p060p990q956p910n189l171l006l430l126k485k250k011j247p76
$$ 508703 501643 493653 484697 476787 471598 468427 465421 461991 458865 456380 454130 452119 450872 450096
53114D50096j763l793n297n598n439n479n306m322k751j285k74K37P1p89j760
$$ 450096 448333 444540 439243 433645 428206 422727 417421 413099 410348 409063 408789 409026 409097 408308 406548
53099D06548k066j646j095q31p77q38r22n56O18J689J016j500l750m031l182k925
$$ 406548 404482 402836 401741 400910 400133 399295 398373 397817 398435 400124 401140 399640 395890 391859 388677 385752
53083C85752l039j999J32J556J570J461K040K248J252L38J105K885L484K041j21
$$ 385752 382713 380714 380846 382402 383972 385433 387473 389721 390973 391311 392416 395301 398785 400826 400705
53068D00705j275q17P52K388K980K085L92q51r33j22O74M78j035k928l555k170
$$ 400705 399430 398613 399365 401753 404733 406818 407210 406359 405426 405304 405978 406456 405421 402493 398938 396768
53052C96768K04J821J831N50j248k748l104j805O98K991L528J777j076k820k288
$$ 396768 396972 398793 400624 401174 399926 397178 394074 392269 392967 395958 399486 401263 400187 397367 395079
53037C95079p54o12k564m918n872n429m613l822k866j902j270p14L16J688K615
$$ 395079 394325 393713 391149 386231 380359 374930 370317 366495 363629 361727 360457 359743 360059 361747 364362
53022C64362K646K067J361P69L26j05p83j725k381k026o31Q04R88l83k024k073
$$ 364362 367008 369075 370436 371205 371531 371426 370643 368918 366537 364511 363880 364684 365672 365289 363265 361192
53006C61192j05K180K648R37j564l375l829k805q54M87r0j879k736j828o03o45
$$ 361192 361087 363267 365915 366852 365288 361913 358084 355279 354425 354912 354822 352943 350207 348379 347776 347131
52990C47131j777k828l175k805j990j494k034k928k475m89J028O78k99j62N95
$$ 347131 345354 342526 339351 336546 334556 333062 331028 328100 325625 325136 326164 326842 326543 326381 326976
52975C26976L34r27j802j905j928j744m54J599K713K059O08m93j138j630j992
$$ 326976 327310 326383 324581 322676 320748 319004 318550 320149 322862 324921 325529 325036 323898 322268 320276
52960C20276k336k746k627j269O82J638J292J125K038K836K053K57p50m45J06
$$ 320276 317940 315194 312567 311298 311980 313618 314910 316035 318073 320909 322962 323219 322469 322024 322130
52945C22130K83Q69K386L541K435p81l506l449j188P87J163Q26Q45P96j42j422
$$ 322130 322413 323282 325668 329209 331644 330863 327357 323908 322720 323507 324670 325496 326341 327137 326995 325573
52929C25573j647m28J166J940J570N27m00n81p9M91R35J743K973L530K484N85
$$ 325573 323926 323498 324664 326604 328174 328701 328301 327720 327641 328132 329067 330810 333783 337313 339797 340382
52913C40382n08j99P02J304J409J171Q35O72N57L5o02r9J882L515K958J026L7
$$ 340382 339874 339675 340377 341681 343090 344261 345096 345768 346325 346360 345758 345659 347541 351056 354014 355040 355077
52896C55077K91j68k217m198m521l816l550l898m150m088l763k835j246J60O24
$$ 355077 355368 355200 352983 348785 344264 340448 336898 333000 328850 324762 320999 318164 316918 317078 317702
52881C17702M94L84L7r35j805j380K98J932K565K294J443O4j457k194j664p04
$$ 317702 318196 318580 318617 317682 315877 314497 314795 316727 319292 321586 323029 323093 321636 319442 317778 317074
52865C17074o80j866l058l006j889q78m83j24N24P48J04l33P32K646L272J664
$$ 317074 316394 314528 311470 308464 306575 305697 305214 305090 305614 306362 306466 306133 306865 309511 312783 314447
52849C14447q38k397k457j513k26P26Q54N13N98J260J763J927K496L470L367J262
$$ 314447 313609 311212 308755 307242 307016 307742 308596 309109 309707 310967 312730 314657 317153 320623 323990 325252
52833C25252j399k407j539l88J14N51J421K141K037J397R47R32J103J192J042
$$ 325252 323853 321446 319907 319519 319633 320184 321605 323746 325783 327180 328127 329059 330162 331354 332396
52818C32396N30l03j116j411q39M41J664K026J566J078J000R32O49R09K295L800
$$ 332396 332926 332623 331507 330096 329257 329698 331362 333388 334954 336032 337032 337964 338613 339522 341817 345617
52802C45617L696J815j30p33m71o38j628k847l742m089l709k663j688j705k834
$$ 345617 349313 351128 350998 350265 349794 349156 347528 344681 340939 336850 333141 330478 328790 327085 324251
52787C24251m224m885m346k665l89J359J375m96k946m327m149l160k121r80N79
$$ 324251 320027 315142 310796 308131 307742 309101 310476 309980 307034 302707 298558 295398 293277 292297 292876
52772B92876K242L170K883J784P70M53Q07J386J822J993J793R35o96k475l365
$$ 292876 295118 298288 301171 302955 303725 304178 304985 306371 308193 310186 311979 312914 312218 309743 306378
52757C06378l077k499k487k519j334J089L023K909J266Q9O05K227L599M084L942
$$ 306378 303301 300802 298315 295796 294462 295551 298574 301483 302749 302838 303443 305670 309269 313353 317295
52742C17295L538K720J008j668m443n968n671m428l445k637q85J804L478K525
$$ 317295 320833 323553 324561 322893 318450 312482 306811 302383 298938 296301 295416 297220 300698 303223
52728C03223O9j216n02M36J2j098j421q50j84M25J184J494O81m57m45O02R78q3
$$ 303223 303292 302076 301574 302010 302022 300924 299503 298653 298469 298894 300078 301572 302253 301796 301351 301953 302931 302848
52710C02848j412j756j214l19Q92K028J955L61j295j415j81J093J690J659J024
$$ 302848 301436 299680 298466 298147 299039 301067 303022 303383 302088 300673 300492 301585 303275 304934 305958
52695C05958q5j075j577j960k323j850j62J542J984J723K063K738K458J414J261
$$ 305958 305873 304798 303221 301261 298938 297088 296926 298468 300452 302175 304238 306976 309434 310848 312109
52680C12109K509L720L727L096K705K276J142m31j551j695j002qO34P01P41J241
$$ 312109 314618 318338 322065 325161 327866 330142 331284 330853 329302 327607 326605 326597 327231 327932 328673 329914
52664C29914J673J240L44K2P6p37k388l141k119p95q78j877k076j021K05O57L04
$$ 329914 331587 332827 333171 333193 333269 332532 330144 327003 324884 324089 323211 321334 319258 318237 318442 319099 319403
52647C19403n49j601k396k621k538k562k562k052r34L60J342J808J920K103K615
$$ 319403 318854 317253 314857 312236 309698 307136 304574 302522 301588 301948 303290 305098 307018 309121 311736
52632C11736L075K864K001J218R69R90R11O90L03j75q9J224L017L359J546p35
$$ 311736 314811 317675 319676 320894 321863 322853 323764 324454 324757 324582 324493 325717 328734 332093 333639 332904
52616C32904j547j156j213k086k361j042Q43J369m5j919k229n58J485K209J788
$$ 332904 331357 330201 328988 326902 324541 323499 324342 325711 325666 323747 321518 320960 322445 324654 326442
52601C26442J701K499L196K992K285J641Q90J5j32R51K274K390J149l84j249j069
$$ 326442 328143 330642 333838 336830 339115 340756 341646 341661 341529 342480 344754 347144 348293 347909 346660 345591
52585C45591J31J666K245J241m16j348j354j145j061r66r60j202j320q81j06O48
$$ 345591 345722 347388 349633 350874 350458 349110 347756 346611 345550 344584 343624 342422 341102 340221 340115 340763
52569C40763J679L237M500M394L174K043J431P80j56r54j492k099k711k886k656
$$ 340763 342442 345679 350179 354573 357747 359790 361221 362001 361845 360891 359399 357300 354589 351703 349047
52554C49047k398j898p03N78O92l38j061p33k96o12j085r81r65k013l418l320
$$ 349047 346649 344751 344048 344626 345318 344980 343919 343186 342890 342278 341193 340212 339247 337234 333816 330496
52538C30496j190J283K120J243L13O35J757K296J826J209J124J146Q67R61K013
$$ 330496 329306 330589 332709 333952 334265 334900 336657 338953 340779 341988 343112 344258 345125 346086 348099
52523C48099K983K282J95j263r75K54J501K852M109M067K272K36m47k56p23j924
$$ 348099 351082 353364 353559 352296 351321 351575 353076 355928 360037 364104 366376 366612 366165 365909 365186 363262
52507C63262k502j786n21M04O82J44j263k814l431k973k339k082j699n22J304
$$ 363262 360760 358974 358453 358857 359539 359683 358420 355606 352175 349202 346863 344781 343082 342560 343864
52492C43864K995L712K935Q43j507k950l311l157k597j207O75J646Q74p03j409
$$ 343864 346859 350571 353506 354349 352842 349892 346581 343424 340827 339620 340295 341941 342815 342112 340703
52477C40703p36M68J206J214R04Q46J169J231L54r86j285J70K232L199K581J058
$$ 340703 339967 340435 341641 342855 343759 344605 345774 347005 347359 346373 345088 345258 347490 350689 353270 354328
52461C54328n57j450p86J136K286R39j833l070j388J759M214N030M269K625J630
$$ 354328 353771 352321 351535 352671 354957 355896 354063 350993 349605 351364 355578 360608 364877 367502 369132
52446C69132K397L580K471r13l010j415J573K213L73j200j401j548k124j918o78
$$ 369132 371529 375109 377580 376667 373657 372242 373815 376028 376401 375201 373800 372252 370128 368210 367532
52431C67532J46K0J75R77P87j175l007k668p78O89J161J311J365J095P46N47M6
$$ 367532 367678 367698 367873 368850 369637 368462 365455 362787 362009 362698 363859 365170 366535 367630 368376 368923 368969
52414C68969q86j190j01J448K041J653J065M20j72L24K476M770N250M162L167
$$ 368969 368083 366893 366792 368240 370281 371934 372999 373419 373247 373571 376047 380817 386067 390229 393396
52399C93396K638J793R80J244J743L13k841m566k976j27Q49n04k426l567l587
$$ 393396 396034 397827 398807 400051 401794 402107 399266 394700 391724 391597 392446 391942 389516 385949 382362
52384C82362k387n12M64m86k255k833j766k71N83P00K81m30q13l05P28J375J305
$$ 382362 379975 379463 379927 379441 377186 374353 372587 372316 372899 373599 373880 373450 372637 372332 373060 374435 375740
52367C75740Q98L83k69p31m22N90J447J462P93J22O8R10K380L676M014L302K098
$$ 375740 376638 377021 376752 376021 375599 376189 377636 379098 379891 380013 380081 380991 383371 387047 391061 394363 396461
52350C96461J078P58J315K272K663K215K036L395N863P544P250N671M138L032
$$ 396461 397539 398297 399612 401884 404547 406762 408798 412193 418056 425600 432850 438521 442659 445691
52336D45691J903N36q05j918k802l309l111k125p44L58O62K49j62O3N52K21j175
$$ 445691 447594 448130 447325 445407 442605 439296 436185 434060 433316 433674 434336 434585 434423 434486 435038 435259 434084
52319D34084k349j933k58J178J791K404L542M336L840K484J422J042J061J595
$$ 434084 431735 429802 429544 430722 432513 434917 438459 442795 446635 449119 450541 451583 452644 454239
52305D54239K924M357M553L226J533N30J52R5N38J396J811J404J243K471M430
$$ 454239 457163 461520 466073 469299 470832 471362 471514 471609 472147 473543 475354 476758 478001 480472 484902
52290D84902N403M900M051L669L255K297J398J371J977K442K722L332M154M346
$$ 484902 490305 495205 499256 502925 506180 508477 509875 511246 513223 515665 518387 521719 525873 530219
52276E30219L653L059L657N263O745P512Q035Q779R361R302R106R710J1093J2305
$$ 530219 533872 536931 540588 545851 552596 560108 568143 576922 586283 595585 604691 614401 625494 637799
52262F37799J3069J4281J6434J8285J8116J5915J3548J2761J3639J4945J5405
$$ 637799 650868 665149 681583 699868 717984 733899 747447 760208 773847 788792 804197
52251H04197J4640J3358J2759J3368J4453J4811J4198J3615J4250J6262J8531
$$ 804197 818837 832195 844954 858322 872775 887586 901784 915399 929649 945911 964442
52240I64442J9437J8083J5142J2414J1349J1966J3123J3432J1948Q801N557M197
$$ 964442 983879 1001962 1017104 1029518 1040867 1052833 1065956 1079388 1091336 1100137 1105694 1109891
52228A109891M981N876M871K360L93K0M57O08K93j33m03l85j62m3JO94K312L699
$$ 1109891 1114872 1120748 1125619 1127979 1128372 1128392 1128849 1129457 1129750 1129617 1129214 1128829 1128667 1128624 1128625 1129319 1131631 1135330
52210A135330L554K604K973N237P572Q367Q223Q470R004Q830P950P410P775Q561
$$ 1135330 1138884 1141488 1144461 1149698 1157270 1165637 1173860 1182330 1191334 1200164 1208114 1215524 1223299 1231860
52196A231860R094R214R304J0078J2038J4606J6141J5579J3710J2244J1802J1581
$$ 1231860 1240954 1250168 1259472 1269550 1281588 1296194 1312335 1327914 1341624 1353868 1365670 1377251
52184A377251J0739R265P504N637L942K903K560K189J079m38j216n98Q44K016
$$ 1377251 1387990 1397255 1404759 1410396 1414338 1417241 1419801 1421990 1423069 1422631 1421415 1420817 1421661 1423677
52170A423677K431K335J923J148L52L15J136J678R83j43N4J875L594L567K090
$$ 1423677 1426108 1428443 1430366 1431514 1431866 1432181 1433317 1434995 1435978 1435835 1435889 1437764 1441358 1444925 1447015
52155A447015O91K64N19Q99J376K360M113O296Q179R353R996J0172R329P257N163
$$ 1447015 1447706 1447970 1448489 1449388 1450764 1453124 1457237 1463533 1471712 1481065 1491061 1501233 1510562 1517819 1522982
52140A522982M751O111P565P879P612P805Q244P927O560M810L450K960L589M969
$$ 1522982 1527733 1533844 1541409 1549288 1556900 1564705 1572949 1580876 1587436 1592246 1595696 1598656 1602245 1607214
52126A607214N869N095K820N73k60K33P15m2k020m143n519o206o679o991o980
$$ 1607214 1613083 1618178 1620998 1621571 1621311 1621544 1622259 1622217 1620197 1616054 1610535 1604329 1597650 1590659 1583679
52111A583679o864o906o764o018n166n020n210m468k640j163j123j963k553k517
$$ 1583679 1576815 1569909 1563145 1557127 1551961 1546941 1541731 1537263 1534623 1533460 1532337 1530374 1527821 1525304
52097A525304j796j69J983L367L195K146J158J74j041j821j452l90M95J095J532
$$ 1525304 1523508 1523339 1525322 1528689 1531884 1534030 1535188 1535362 1534321 1532500 1531048 1530658 1531153 1532248 1533780
52082A533780J297K76k72O39J747J061j070k347j880j121j011m19J642L961M796
$$ 1533780 1535077 1535353 1535081 1535720 1537467 1538528 1537458 1535111 1533231 1532110 1531099 1530680 1532322 1536283 1541079
52067A541079M514N112P523J0712J3204J4518J5066J5452J6125J7208J8422J9354
$$ 1541079 1545593 1550705 1558228 1568940 1582144 1596662 1611728 1627180 1643305 1660513 1678935 1698289
52055A698289J9867K0174K0501K0807K0835K0338J9197J7410J5078J2610J0756
$$ 1698289 1718156 1738330 1758831 1779638 1800473 1820811 1840008 1857418 1872496 1885106 1895862
52044A895862J0016R972R643Q732Q031Q292R176R758R618Q897P614N745L762K421
$$ 1895862 1905878 1915850 1925493 1934225 1942256 1950548 1959724 1969482 1979100 1987997 1995611 2001356 2005118 2007539
52030B007539J811J122n85l491o821r340j0403j0665j1332j2405j2388j0301p283
$$ 2007539 2009350 2010472 2009887 2006396 1999575 1990235 1979832 1969167 1957835 1945430 1933042 1922741 1915458
52017A915458n353n113n604o034o420o654o122m517k240R9K003L034L204L351
$$ 1915458 1910105 1904992 1899388 1893354 1886934 1880280 1874158 1869641 1867401 1867500 1869503 1872537 1875741 1879092
52003A879092M210N194N097L927K980L029L605M324N523P050P678O661M955L867
$$ 1879092 1883302 1888496 1893593 1897520 1900500 1903529 1907134 1911458 1916981 1924031 1931709 1938370 1943325 1947192
51989A947192L210J827m62k631m004m976n961o557o307n897o776r463j2541j3792
$$ 1947192 1950402 1952229 1951767 1949136 1945132 1940156 1934195 1927638 1921331 1915434 1908658 1899195 1886654 1872862
51975A872862j2483j0121q784r054r936j0415j0397j0238j0112j0042j0031r907
$$ 1872862 1860379 1850258 1841474 1832420 1822484 1812069 1801672 1791434 1781322 1771280 1761249 1751342
51963A751342r438q808q611r205j0277j1163j1437j1219j1051j1370j1954j2108
$$ 1751342 1741904 1733096 1724485 1715280 1705003 1693840 1682403 1671184 1660133 1648763 1636809 1624701
51951A624701j1627j1163j1287j1750j2169j2897j4408j6262j7687j8789k0181
$$ 1624701 1613074 1601911 1590624 1578874 1566705 1553808 1539400 1523138 1505451 1486662 1466481
51940A466481k1719k2804k3691k5160k6822k7223k5964k4413k3818k3885k3699
$$ 1466481 1444762 1421958 1398267 1373107 1346285 1319062 1293098 1268685 1244867 1220982 1197283
51929A197283k2933k1622j9857j8255j7650j7683j6986j5357j4471j5441j7005
$$ 1197283 1174350 1152728 1132871 1114616 1096966 1079283 1062297 1046940 1032469 1017028 1000023
51918A000023j7369j6759j6673j7301j7305j5790j3234j0719r207r162r800r224
$$ 1000023 982654 965895 949222 931921 914616 898826 885592 874873 865666 856504 846704 837480
51906H37480o519l249j502q49J068M923Q522R737R010Q127P684O967N598M064
$$ 837480 830961 827712 826210 825361 826429 831352 839874 849611 858621 866748 874432 881399 886997 891061
51892H91061K697J168o91k146k210j106m87j548l093k491J079N291P440P668Q249
$$ 891061 893758 894926 894235 892089 889879 888773 888286 886738 883645 881154 882233 887524 894964 902632 910881
51877I10881J0189J2199J3049J3326J4153J5317J5536J4038J1121P609M298J613
$$ 910881 921070 933269 946318 959644 973797 989114 1004650 1018688 1029809 1037418 1041716 1043329
51865A043329p30l585p488j1959j5803j8018j8533j8261j8380j9081j9183j7488
$$ 1043329 1042599 1039014 1031526 1019567 1003764 985746 967213 948952 930572 911491 892308 874820
51853H74820j4348j1319r308p850o213m285k118N44L659O526Q579J0192J2217
$$ 874820 860472 849153 839845 831995 825782 821497 819379 819923 823582 830108 838687 848879 861096
51840H61096J4984J7978K0005J9607J5962R783K704m456j1966j9396k4711k6179
$$ 861096 876080 894058 914063 933670 949632 959415 962119 957663 945697 926301 901590 875411
51828H75411k4497k1958j9965j8334j6560j4574j2343r922p894o851o380n468
$$ 875411 850914 828956 808991 790657 774097 759523 747180 737258 729364 722513 716133 710665
51816G10665l951k499j197O84L175N099N685N581N465M648K171j296l916m898
$$ 710665 706714 704215 703018 703702 706877 711976 717661 723242 728707 733355 735526 734230 730314 725416
51802G25416n208n976p082p589o963n537m091l172k623j795n13L26m32k715n044
$$ 725416 720208 714232 707150 699561 692598 687061 682970 679798 677175 675380 674867 675193 674761 672046 667002
51787F67002o055n820n475n776o387o453n563m084k709j864j613j865k349k477
$$ 667002 660947 655127 649652 643876 637489 631036 625473 621389 618680 616816 615203 613338 610989 608512
51773F08512j652l1J329J429L60q39j196o13J12j9j103j893j057Q52J595R6j908
$$ 608512 606860 606829 608158 609587 609947 609108 607912 607299 607411 607392 606289 604396 603339 604191 605786 605882 603974
51756F03974k142r35m98j427j964r24O07J390J993L286M315L436Q55j613k869
$$ 603974 601832 600897 600399 598972 597008 596084 596691 598081 600074 603360 607675 611111 611966 610353 607484
51741F07484l150k701j418J01P54M07k7k71j120k764l935l500j952o49k50n99
$$ 607484 604334 601633 600215 600316 601070 601477 601450 601179 600059 597295 593360 589860 587908 587259 587009 586410
51725E86410j277j571p51O90Q79j295m258n187l239l66J118P91j26l72M82K052
$$ 586410 585133 583562 582811 583501 584380 583085 578827 573640 570401 570035 571153 571944 571818 571446 571928 573980
51709E73980L576M610N459O653P993Q623Q175P213O304N260L777K241J263O66
$$ 573980 577556 582166 587625 594278 602271 610894 619069 626282 632586 637846 641623 643864 645127 645793
51695F45793l83k253m353n720n753m563l056k543l563n020n095l288r78K20O7
$$ 645793 645410 643157 638804 633084 627331 622768 619712 617169 613606 608586 603491 600203 599225 599445 599512
51680E99512n80q53j28K021N124P541P962P042O549P035P483P195O645O094M913
$$ 599512 598932 598079 597951 599972 605096 612637 620599 627641 634190 641225 648708 655903 662548 668642 673555
51665F73555L149K419L862O043O405M411J831K15n13r53j271j775l047m772n462
$$ 673555 676704 679123 682985 689028 695433 699844 701675 701890 701377 700424 699153 697378 694331 689559 684097
51650F84097m256k253j285j861l124m305n262n828n542m277k502q17L62O31k75
$$ 684097 679841 677588 676303 674442 671318 667013 661751 655923 650381 646104 643602 642785 643147 643778 643503
51635F43503j874k863k161n5J899K253R37q14j667j372q27j091k373l985n139
$$ 643503 641629 638766 636605 636550 638449 640702 641639 640825 639158 637786 636959 635868 633495 629510 624371
51620F24371n589n339m038j299K184M600M764L644L238M157N205N413N257N470
$$ 624371 618782 613443 609405 608106 610290 614890 619654 623298 626536 630693 635898 641311 646568 652038
51606F52038N781N744N899P007Q667R680R477Q225N985K754q83m051o445q033
$$ 652038 657819 663563 669462 676469 685136 694816 704293 712518 718503 721257 720374 716323 709878 701845
51592G01845q419p492o220n513m697k598O7J189J64j441k428l348m737n862o141
$$ 701845 693426 685934 679714 674201 669504 666906 666973 668162 668326 666885 664457 661109 656372 650510 644369
51577F44369o184o296n604l997l276m643o309n622k839p39q84k150k897k720j861
$$ 644369 638185 631889 626285 622288 619012 614369 608060 602438 599599 598860 597976 595826 592929 590209 588348
51562E88348n60N39O17j03m24J41P13N11l3j85j33n29j345j896j866j723k050
$$ 588348 587788 588327 588944 588841 588417 588558 589271 589782 589749 589564 589431 588902 587557 585661 583795 582072 580022
51545E80022k682k675j247J308L854N534O334O604O582O622P059P520P197O348
$$ 580022 577340 574665 573418 574726 578580 584114 590448 597052 603634 610256 617315 624835 632032 638380
51531F38380O458Q043R276Q065M869J962M68l79j229j598j102j79Q56K233L890
$$ 638380 644838 652881 662157 670222 675091 677053 677521 677142 675913 674315 673213 673034 673890 676123 680013
51516F80013N291O399P831R794J1900J4078J6430J8041J7630J5829J5049J6203
$$ 680013 685304 691703 699534 709328 721228 735306 751736 769777 787407 803236 818285 834488
51504H34488J7200J5990J3592J2514J3412J5191J7599K1436K6314L0210L1735
$$ 834488 851688 867678 881270 893784 907196 922387 939986 961422 987736 1017946 1049681
51493A049681L1500L0649K9210K6418K1888J5894R085K326l750r317j4981k0610
$$ 1049681 1081181 1111830 1141040 1167458 1189346 1205240 1214325 1216651 1212901 1203584 1188603 1167993
51481A167993k5162k8035k9957l2010l4090l4887l3324k9767k5827k3150k2130
$$ 1167993 1142831 1114796 1084839 1052829 1018739 983852 950528 920761 894934 871784 849654
51470H49654k1701k0510j8456j6758j6245j6018j4367j0976p546n887n934o215
$$ 849654 827953 807443 788987 772229 755984 739966 725599 714623 707077 701190 695256 689041
51458F89041n973n859o381o717n948m812m930o312o931n195j952O96J771J791
$$ 689041 683068 677209 670828 664111 658163 653351 648421 642109 635178 629983 628031 628727 630498 632289
51444F32289J394P23ml65m26p09j235j305n79K65L92j50q44j704l084m621n286
$$ 632289 633683 634406 634402 634037 633611 632902 631667 630362 629783 630048 630440 630290 629446 627742 624658 620037 614751
51427F14751m784m110m220m661m332l312k825l345l734k864j263k89l08o33r13
$$ 614751 609967 605857 601637 596976 592644 589332 586507 583162 579428 576564 575301 575012 574704 574071 573158
51412E73158j473k294k835l014l326l758l597k793k440l304m668n379n200m415
$$ 573158 571685 569391 566556 563542 560216 556458 552861 550068 547628 544324 539656 534277 529077 524662
51398E24662k972j014M84Q02O91J408K900M057M349M062L260K030J478K844N506
$$ 524662 521690 520676 521160 521962 522653 524061 526961 531018 535367 539429 542689 544719 546197 549041 554547
51383E54547P478Q216R222J1248J2690J1957R899Q452P951P387O427N469M177
$$ 554547 562025 570241 579463 590711 603401 615358 625257 633709 641660 649047 655474 660943 665120
51370F65120J861q35k394k798l845o403q806q960p093n312n025n713o115n694
$$ 665120 666981 666146 663752 660954 657109 650706 641900 632940 625847 620535 615510 609797 603682 597988
51356E97988m812l982l307k573j738j141r24n14Q00K723M066M241M040M503N453
$$ 597988 593176 589194 585887 583314 581576 580435 579511 578997 579797 582520 586586 590827 594867 599370 604823
51341F04823N833N246M506M669N960P745R128R425Q521P069O214O729Q267R639
$$ 604823 610656 615902 620408 625077 631037 638782 647910 657335 665856 672925 679139 685868 694135 703774
51327G03774R981R601R552J0449J2022J3924J6429J9907K3841K7109K9364L1602
$$ 703774 713755 723356 732908 743357 755379 769303 785732 805639 829480 856589 885953 917555
51315I17555L5056L9766M4456M7519M7968M5653M0959L4340K6191J7267Q860J945
$$ 917555 952611 992377 1036833 1084352 1132320 1177973 1218932 1253272 1279463 1296730 1305590 1307535
51303A307535l964j0557j8905k8160l6266m1758m4594m5589m5438m4235m1804
$$ 1307535 1303571 1293014 1274109 1245949 1209683 1167925 1123331 1077742 1032304 988069 946265
51292I46265l8409l4939l2170l0000k7858k5619k3554k1578j9428j7512j6503
$$ 946265 907856 872917 840747 810747 782889 757270 733716 712138 692710 675198 658695
51281F58695j5912j4280j1360q852q074q024o989n166m174m418m605l864k954
$$ 658695 642783 628503 617143 608291 600217 592193 585204 580038 575864 571446 566841 562977 560023
51268E60023l047m229n544n863m655k586j334k052m040n532n580m492k856j218
$$ 560023 556976 552747 547203 541340 536685 534099 532765 530713 526673 521141 515561 511069 508213 506995
51254E06995l22m09m17P81K454K784J592O97J221K214K397J783P92o01j938j920
$$ 506995 506673 506264 505847 506628 509082 511866 513458 514155 515376 517590 519987 521770 522562 521961 520023 518103
51238E18103k60J305J128j58p76k83M12P22P28K91q53k296l142k857j451N99K061
$$ 518103 517843 519148 520276 520118 519342 519059 519471 520193 520921 521212 520359 518063 514921 512064 510613 511212 513273
51221E13273J566o25k398k283j106j32J041L001M313L226Q90K34J679K542J166
$$ 513273 514839 514214 511816 509533 508427 508295 509336 512337 516650 519876 520766 521000 522679 525221 526387
51206E26387q50j393n64N73J989L773M693L563J240l99r03j218j612j277n2Q40
$$ 526387 525537 524144 523580 524153 526142 529915 534608 538171 539411 539012 538109 536891 535279 534002 533950 534790
51190E34790M06o99r52J45J490J600K11j428j898j062n7O9o66j507j781j204J98
$$ 534790 535196 534497 533545 533690 535180 536780 536991 535563 533665 532603 532546 532615 531949 530442 528661 527457 527655
51173E27655J956L172L020J418p98k322k331j223l57o29j413j312P9J584J736
$$ 527655 529611 532783 535803 537221 536423 534101 531770 530547 530190 529561 528148 526836 526915 528499 530235
51158E30235L31j336j665l01J350J478R8o95P21L269M480L603K164J629K003K944
$$ 530235 530566 529230 527565 527264 528614 530092 530190 529495 530216 533485 537965 541568 543732 545361 547364 550308
51142E50308M629O723P804O986N322M415M191L271J289l39k40J135K039J301o44
$$ 550308 554937 561660 569464 576450 581772 586187 590378 593649 594938 594599 594359 595494 597533 598834 598190
51127E98190k520l579l993m033l475k182q19k22k89l08j98m72j013j027n17n97
$$ 598190 595670 592091 588098 584065 580590 578408 577589 577367 577078 576770 576572 576100 575087 574060 573543 572946
51111E72946j759k913k903k074j401r51k22O24J124J543K387L194L070K239J759
$$ 572946 571187 568274 565371 563297 561896 560945 560723 561347 562471 564014 566401 569595 572665 574904 576663
51096E76663J671R63l98q21N86K262K005r8j801j607k86O23O73K84m24j527k450
$$ 576663 578334 579297 578899 578078 578664 580926 582931 582833 581032 579425 579139 579762 580435 580719 580295 578768 576318
51079E76318k328j348p34j058j389p29M08P18j9p87p87j12R29K168L138L333L091
$$ 576318 573990 572642 571908 570850 569461 568732 569140 569858 569839 569052 568265 568153 569082 571250 574388 577721 580812
51062E80812L288L812L489K006P86J177K690M117N387O973Q115P360M877K667
$$ 580812 584100 587912 591401 593407 594193 595370 598060 602177 607564 614537 622652 630012 634889 637556
51048F37556K079K425K599K872M065N772O592N894M425L184K438K007J788J706
$$ 637556 639635 642060 644659 647531 651596 657368 663960 669854 674279 677463 679901 681908 683696 685402
51034F85402J446O58o92k309l691m253l719k552j655j324r15O4R36O38o66j666
$$ 685402 686848 687506 686814 684505 680814 676561 672842 670290 668635 667311 666396 666460 667396 668034 667368 665702
51018F65702j587r11k60M04R98Q27k27p91M60K891M582M755M247L786L128K222
$$ 665702 664115 663204 662944 663348 664346 665173 664946 664155 664615 667506 672088 676843 681090 684876 688004 690226
51002F90226K024L384N782P871Q850Q963Q965R418J0215J0621R975Q468P071O738
$$ 690226 692250 695634 701416 709287 718137 727100 736065 745483 755698 766319 776294 784762 791833 798571
50988G98571P823R972J2167J3269J3096J2601J2404J1736R663O683L917J282j945
$$ 798571 806394 816366 828533 841802 854898 867499 879903 891639 901302 907985 911902 913184 911239
50975I11239n086o401n677m714m811n438n928o739q109r086q988q479q150p359
$$ 911239 906153 899752 894075 889361 884550 879112 873184 866445 858336 849250 840262 831783 823633 816274
50961H16274n701m170l527k692l89K653M795N863O734P321P008O606P744J0154
$$ 816274 810573 806403 802876 800184 799795 802448 807243 813106 819840 827161 834169 840775 848519 858673
50947H58673J1589J0792R093Q418R070J0138J1061J1940J2838J3403J3058J1570
$$ 858673 870262 881054 890147 898565 907635 917773 928834 940774 953612 967015 980073 991643
50935I91643R624Q605R183J0408J0835J0265R643R516R557R421R087Q333O962
$$ 991643 1001267 1009872 1019055 1029463 1040298 1050563 1060206 1069722 1079279 1088700 1097787 1106120 1113082
50922A113082N752O203Q783J2078J4126J4263J3342J2339J1309R838Q407Q590
$$ 1113082 1118834 1125037 1133820 1145898 1160024 1174287 1187629 1199968 1211277 1221115 1229522 1238112
50910A238112J1250J4865J6880J6960J7599K0831K5682K9824L2559L4783L7011
$$ 1238112 1249362 1264227 1281107 1298067 1315666 1336497 1362179 1392003 1424562 1459345 1496356
50899A496356L9121M1478M4562M7663M9379M9268M7832M5276M1784L8682L7517
$$ 1496356 1535477 1576955 1621517 1669180 1718559 1767827 1815659 1860935 1902719 1941401 1978918
50888A978918L7861L7575L5472L2379K9532K7459K6661K7668K9906L1823L2602
$$ 1978918 2016779 2054354 2089826 2122205 2151737 2179196 2205857 2233525 2263431 2295254 2327856
50877B327856L2559L1641K9007K4604J9577J4534Q770K000m593r821j3923j7726
$$ 2327856 2360415 2392056 2421063 2445667 2465244 2479778 2488548 2490548 2485955 2476134 2462211 2444485
50865B444485k1574k5779l0833l6239m0364m2594m4483m7590n1183n3345n3495
$$ 2444485 2422911 2397132 2366299 2330060 2289696 2247102 2202619 2155029 2103846 2050501 1997006
50854A997006n2411n0511m7594m4054m0881l8488l6473l4494l2542l0517k8374
$$ 1997006 1944595 1894084 1846490 1802436 1761555 1723067 1686594 1652100 1619558 1589041 1560667
50843A560667k6537k5428k4674k3490k1718j9836j8155j6626j5305j4270j3152
$$ 1560667 1534130 1508702 1484028 1460538 1438820 1418984 1400829 1384203 1368898 1354628 1341476
50832A341476j1370q957o663n243m840m901m478k880n23J214J387O09L77J427
$$ 1341476 1330106 1321149 1314486 1309243 1304403 1299502 1295024 1292144 1291621 1292835 1294222 1294831 1295208 1296635
50818A296635L109M219M200L660L897N622Q095R882J0590J1265J2945J5484J8135
$$ 1296635 1299744 1303963 1308163 1311823 1315720 1321342 1329437 1339319 1349909 1361174 1374119 1389603 1407738
50805A407738K0520K2495K3777K4460K5449K7482L0108L2360L4271L6956M1160
$$ 1407738 1428258 1450753 1474530 1498990 1524439 1551921 1582029 1614389 1648660 1685616 1726776
50794A726776M6251N0773N3770N5703N8280O3057O9877P6956Q2671Q6878R0301
$$ 1726776 1773027 1823800 1877570 1933273 1991553 2054610 2124487 2201443 2284114 2370992 2461293
50783B461293R3327R5982R8524J01222J03708J05147J04971J03096R9631R4718
$$ 2461293 2554620 2650602 2749126 2850348 2954056 3059203 3164174 3267270 3366901 3461619
50773C461619Q8449Q0811P2126O3687N7172N2941M9584M5750M1809L9017L7863
$$ 3461619 3550068 3630879 3703005 3766692 3823864 3876805 3926389 3972139 4013948 4052965 4090828
50762D090828L8130L9867M3017M6404M8441M8814M8391M7276M4026L7054K6064
$$ 4090828 4128958 4168825 4211842 4258246 4306687 4355501 4403892 4451168 4495194 4532248 4558312
50751D558312J2043l323j8114l1216m3388n6432p0658q3947r3912j00218j04005
$$ 4558312 4570355 4567032 4548918 4517702 4474314 4417882 4347224 4263277 4169365 4069147 3965142
50740C965142j05605j04175r9406r2435q4615p6301o7374n8197m9117l9423k8091
$$ 3965142 3859537 3755362 3655956 3563521 3478906 3402605 3335231 3277034 3227917 3188494 3160403
50729C160403j5739m797K833P626J1374J4967J8044K0197K1377K1298J9628J6777
$$ 3160403 3144664 3139867 3142700 3150326 3161700 3176667 3194711 3214908 3236285 3257583 3277211 3293988
50717C293988J3470R567M400j523o535j0051j3564j8666k5062l1543l7970m5055
$$ 3293988 3307458 3317025 3321425 3319902 3313367 3303316 3289752 3271086 3246024 3214481 3176511 3131456
50705C131456n2703n9754o5237o9103p1743p3490p4374p3925p1563o7537o2995
$$ 3131456 3078753 3018999 2953762 2884659 2812916 2739426 2665052 2591127 2519564 2452027 2389032
50694B389032n8633n3967m8629m3540l9767l6699l2615k6783k0040j3511p819
$$ 2389032 2330399 2276432 2227803 2184263 2144496 2107797 2075182 2048399 2028359 2014848 2007029
50683B007029l369k85K136N113R461J5431K3009L1419L8848M3956M7481N1179
$$ 2007029 2003660 2003375 2005511 2010624 2020085 2035516 2058525 2089944 2128792 2172748 2220229 2271408
50671B271408N5281N8383N9871O0917O2610O4517O5645O5596O4142O0976N6747
$$ 2271408 2326689 2385072 2444943 2505860 2568470 2632987 2698632 2764228 2828370 2889346 2946093
50660B946093N3161N1000M8900M5193M0039L4541K8650K1661J4346Q766N781M268
$$ 2946093 2999254 3050254 3099154 3144347 3184386 3218927 3247577 3269238 3283584 3292350 3298131 3302399
50648C302399L338L856O919J1894J7142K2015K6854L1328L4182L4895L4498L4104
$$ 3302399 3305737 3309593 3316512 3328406 3345548 3367563 3394417 3425745 3459927 3494822 3529320 3563424
50636C563424L3429L1441K7800K2744J6066P472j925r812j4830j7673j9412j9658
$$ 3563424 3596853 3628294 3656094 3678838 3694904 3702376 3700451 3690639 3675809 3658136 3638724 3619066
50624C619066j7295j2453o567o86N201J1273J7329K3463L0406L8778M8524N9341
$$ 3619066 3601771 3589318 3582751 3582065 3587266 3598539 3615868 3639331 3669737 3708515 3757039 3816380
50612C816380P1114Q3397R4987J04560J11635J16561J19764J21209J20532J17414
$$ 3816380 3887494 3970891 4065878 4170438 4282073 4398634 4518398 4639607 4760139 4877553
50602D877553J11939J04807R7158R0116Q4235P9154P3657O6438N7268M7305L7824
$$ 4877553 4989492 5094299 5191457 5281573 5365808 5444962 5518619 5585057 5642325 5689630 5727454
50591E727454K8729J8872P855l095j2266j8922k3410k6301k7892k8099k6452k2424
$$ 5727454 5756183 5775055 5782910 5779815 5767549 5748627 5725217 5698916 5671024 5642925 5616473 5594049
50579E594049j6239r144k371L792R496J4169J6729J6968J5883J4212J1420O683
$$ 5594049 5577810 5568666 5566295 5570087 5579583 5593752 5610481 5627449 5643332 5657544 5668964 5675647
50567E675647L48o345j2651j8597k4096k8901l3732m0398m9972o1179p1127p7283
$$ 5675647 5675995 5669650 5656999 5638402 5614306 5585405 5551673 5511275 5461303 5400124 5328997 5251714
50555E251714p8439p4542o6622n6675m6633l7360k8934k1521j5331j0149o073
$$ 5251714 5173275 5098733 5032111 4975436 4928803 4891443 4862509 4840988 4825657 4815508 4809435
50544D809435m469o970j3355k1746l1049m1908n4666o7792p9311q8721r6462j02400
$$ 4809435 4804966 4797996 4784641 4762895 4731846 4689938 4635272 4567480 4488169 4399448 4302986 4200586
50532D200586j06071j07818j08334j07405j04232r8969r2838q6725q0506p3813
$$ 4200586 4094515 3986697 3878363 3770958 3666726 3567757 3474919 3388194 3307688 3233875
50522C233875o6719n9541n2563m5988l9794l3753k7957k2997j9031j5100j0050
$$ 3233875 3167156 3107615 3055052 3009064 2969270 2935517 2907560 2884563 2865532 2850432 2840382
50511B840382l911K274P683J2129J5722J8962K2789K7569L2222L5470L7796M1108
$$ 2840382 2836471 2838745 2846428 2858557 2874279 2893241 2916030 2943599 2975821 3011291 3049087 3090195
50499C090195M6438N3051N9868O6731P3989Q1851R0423R9483J08074J15187J21019
$$ 3090195 3136633 3189684 3249552 3316283 3390272 3472123 3562546 3662029 3770103 3885290 4006309
50488D006309J26453J31028J32718J30443J25806J21425J18417J16454J15525
$$ 4006309 4132762 4263790 4396508 4526951 4652757 4774182 4892599 5009053 5124578
50479E124578J16381J19259J23292J27366J31105J34718J38232J41151J42903
$$ 5124578 5240959 5360218 5483510 5610876 5741981 5876699 6014931 6156082 6298985
50470F298985J43630J44323J45916J48449J51552J55422J60516J66176J70595
$$ 6298985 6442615 6586938 6732854 6881303 7032855 7188277 7348793 7514969 7685564
50461G685564J72575J72524J71148J67835J61026J49689J33647J12990Q8147O0477
$$ 7685564 7858139 8030663 8201811 8369646 8530672 8680361 8814008 8926998 9015145 9075622
50451I075622L1742K642k7428n8774r0001j18698j43322j63835j80498j92641
$$ 9075622 9107364 9110006 9082578 9023804 8933803 8815105 8671783 8507948 8327450 8134809
50441H134809j99079j99337j93887j83173j67271j46881j23896j00310p6874n3635
$$ 8134809 7935730 7736393 7542506 7359333 7192062 7045181 6921285 6820975 6744101 6690466
50431F690466l1497j2432J880J0775J3905J0640N17j6195l8536o4869r2626j18827
$$ 6690466 6658969 6646537 6648417 6659192 6673097 6683737 6684254 6668059 6629523 6564654 6472028 6353201
50419F353201j41532j60500j76148j88247j96084j99524j99365j96743j92543
$$ 6353201 6211669 6051169 5875021 5686774 5490690 5291166 5091801 4895058 4702515
50410D702515j87271j81002j73465j64429j54177j43425j32832j22664j13014
$$ 4702515 4515244 4334242 4160777 3996348 3842171 3698746 3565914 3443250 3330236
50401C330236j04049r5757q7539p8587o9051o0396n3914m9019m3840l7519l1015
$$ 3330236 3226187 3130430 3042891 2964304 2895253 2834857 2780943 2731924 2688084 2650565 2619550
50390B619550k5402k0520j5880j1842q807o083k764Q32L806O372R588J3581J7275
$$ 2619550 2594148 2573628 2557748 2545906 2537099 2531016 2528252 2529084 2532890 2539262 2548850 2562431 2579706
50377B579706J9847K1339K1940K1816K1657K2332K3858K5750K8185L1751L6095
$$ 2579706 2599553 2620892 2642832 2664648 2686305 2708637 2732495 2758245 2786430 2818181 2854276
50366B854276M0239M4136M8557N3401N7697O1398O5438O9770P3233P5918P9645
$$ 2854276 2894515 2938651 2987208 3040609 3098306 3159704 3225142 3294912 3368145 3444063 3523708
50355C523708Q5083R0338R3659R5880R8766J02466J06106J09465J12192J12758
$$ 3523708 3608791 3699129 3792788 3888668 3987434 4089900 4196006 4305471 4417663 4530421
50345D530421J10241J06244J02881R9516R3701Q4964P5312O5864N5250M1866K5828
$$ 4530421 4640662 4746906 4849787 4949303 5043004 5127968 5203280 5269144 5324394 5366260 5392088
50334E392088P963j1453l1997n2396p1534q9253j05196j17738j25151j27475j26366
$$ 5392088 5400051 5388598 5356601 5304205 5232671 5143418 5038222 4920484 4795333 4667858 4541492
50323D541492j23151j17733j09426r8355q5719p2734n9768m6768l4426k4076j6229
$$ 4541492 4418341 4300608 4191182 4092827 4007108 3934374 3874606 3827838 3793412 3769336 3753107
50312C753107j0091n216k960n177j1768k0658l0095l9947n0599o1668p2084q0698
$$ 3753107 3743016 3737800 3734840 3729663 3717895 3697237 3667142 3627195 3576596 3514928 3442844 3362146
50300C362146q6516q9167q9608q9636r0188r0485q9218q6132q2108p8214p5027
$$ 3362146 3275630 3186463 3096855 3007219 2917031 2826546 2737328 2651196 2569088 2490874 2415847
50289B415847p2521p0008o6460o1401n5538n0141m5822m2133l8367l4416l0625
$$ 2415847 2343326 2273318 2206858 2145457 2089919 2039778 1993956 1951823 1913456 1879040 1848415
50278A848415k7071k3413j9624j6398j4416j3295j1837r163n289q06L172M999
$$ 1848415 1821344 1797931 1778307 1761909 1747493 1734198 1722361 1713198 1707909 1707103 1710275 1715274
50266A715274L725Q12p41J52J071p84m697p191o329l659j644p23M55K836O005
$$ 1715274 1718999 1719811 1719070 1719222 1720293 1719509 1714812 1707621 1701292 1697633 1695989 1695266 1695721 1698557 1704562
50251A704562Q911J0830J1662J1743J1586J1833J3217J5929J8835K0018J8798
$$ 1704562 1713473 1724303 1735965 1747708 1759294 1771127 1784344 1800273 1819108 1839126 1857924
50240A857924J6607J5211J4603J3741J2674J2481J3223J3609J2949J2023J1471
$$ 1857924 1874531 1889742 1904345 1918086 1930760 1943241 1956464 1970073 1983022 1995045 2006516
50229B006516J0700R236P936P782Q351Q725R352J1654J5653J8800J7554J0231
$$ 2006516 2017216 2026452 2034388 2042170 2050521 2059246 2068598 2080252 2095905 2114705 2132259 2142490
50217B142490j210j1899j7311j6739j3451j1156j0651j0282q613n561j554K847
$$ 2142490 2141280 2129381 2112070 2095331 2081880 2070724 2060073 2049791 2041178 2035617 2034063 2036910
50205B036910O417P812P253O647P328Q499Q678Q013Q125J0003J2970J5723J7575
$$ 2036910 2043327 2051139 2058392 2065039 2072367 2080866 2089544 2097557 2105682 2115685 2128655 2144378 2161953
50192B161953J8564J9308K0951K4388K9055L3205L6031L8882M3591N0281N7762
$$ 2161953 2180517 2199825 2220776 2245164 2274219 2307424 2343455 2382337 2425928 2476209 2533971
50181B533971O5624P4391Q3671R1779R8000J03846J10907J18119J22413J21753
$$ 2533971 2599595 2673986 2757657 2849436 2947436 3051282 3162189 3280308 3402721 3524474
50171C524474J16575J08599R9288Q9626Q0259P1387O2862N4567M6263L7006K5198
$$ 3524474 3641049 3749648 3848936 3938562 4018821 4090208 4153070 4207637 4253900 4290906 4316104
50160D316104R566j0032l2636n6614q0151j01706j20131j34279j42945j45698
$$ 4316104 4325670 4315638 4283002 4226388 4146237 4044531 3924400 3790121 3647176 3501478
50150C501478j43524j38118j30659j21787j12418j03631r5734q8386q1872p7339
$$ 3501478 3357954 3219836 3089177 2967390 2854972 2751341 2655607 2567221 2485349 2408010
50140B408010p5192p3897p1154o6112n9939n4305m9698m5333m0439l5386l1378
$$ 2408010 2332818 2258921 2187767 2121655 2061716 2007411 1957713 1912380 1871941 1836555 1805177
50129A805177k9045k7707k6231k4197k1907j9621j7423j5600j4402j3496j2214
$$ 1805177 1776132 1748425 1722194 1697997 1676090 1656469 1639046 1623446 1609044 1595548 1583334
50118A583334j0399q437o616n091m296m507m958m339k373m5J918L743N516O613
$$ 1583334 1572935 1564498 1557882 1552791 1548495 1543988 1539030 1534691 1532318 1532273 1534191 1537934 1543450 1550063
50104A550063O956P752R791J1784J1739R721Q064Q827J1973J6142K0153K3327
$$ 1550063 1557019 1564771 1574562 1586346 1598085 1607806 1615870 1624697 1636670 1652812 1672965 1696292
50092A696292K5239K5963K6322K7202K8616K9706K9834K9417K9421L0069L0488
$$ 1696292 1721531 1747494 1773816 1801018 1829634 1859340 1889174 1918591 1948012 1978081 2008569
50081B008569K9982K9385L0465L3854L8320M2418M6199N0625N5805O0879O5562
$$ 2008569 2038551 2067936 2098401 2132255 2170575 2212993 2259192 2309817 2365622 2426501 2492063
50070B492063P0763P7274Q4713R2362J00546J10335J22120J35306J49475J64935
$$ 2492063 2562826 2640100 2724813 2817175 2917721 3028056 3150176 3285482 3434957 3599892
50060C599892J81577J97728K11038K20294K25577K26610K22179K12005J98493
$$ 3599892 3781469 3979197 4190235 4410529 4636106 4862716 5084895 5296900 5495393
50051E495393J85486J75149J66779J58511J49039J37154J20673R7120O5711K8117
$$ 5495393 5680879 5856028 6022807 6181318 6330357 6467511 6588184 6685304 6751015 6779132
50041F779132j2805n4648r5753j34505j69007j97625k19636k35109k44355k47745
$$ 6779132 6766327 6711679 6615926 6481421 6312414 6114789 5895153 5660044 5415689 5167944
50031E167944k46062k40484k31943k20717k07061j91930j76677j62080j48081
$$ 5167944 4921882 4681398 4449455 4228738 4021677 3829747 3653070 3490990 3342909
$$ [...]
##END NTUPLES=NMR SPECTRUM
##END=
