
##TITLE=UV1153_M3-1004-1000_6301790_CnuTG2mB1p
##JCAMPDX= 6.0         $$ Bruker NMR JCAMP-DX V2.0
##DATA TYPE= NMR SPECTRUM
##DATA CLASS= NTUPLES
##ORIGIN= BRUKER
##OWNER= Administrator
$$ 1.72 TOPSPIN		Version 2.1
$$ 2012-06-06 02:55:13.671 -0500  Administrator@TOPSPIN
$$ Compression mode = diff/dup
##.OBSERVE FREQUENCY= 400.13188235
##.OBSERVE NUCLEUS= ^1H
##.ACQUISITION MODE= SIMULTANEOUS (DQD)
##.ACQUISITION SCHEME= undefined
##.AVERAGES= 8
##.DIGITISER RES= 22
##SPECTROMETER/DATA SYSTEM= spect
##.PULSE SEQUENCE= zg30
##.SOLVENT NAME= COFFEE_meoh
##.SHIFT REFERENCE= INTERNAL, COFFEE_meoh, 1, 14.98061
##AUDIT TRAIL= $$ (NUMBER, WHEN, WHO, WHERE, PROCESS, VERSION, WHAT)
$$ ##TITLE= Audit trail, TOPSPIN		Version 2.1
$$ ##JCAMPDX= 5.01
$$ ##ORIGIN= Bruker BioSpin GmbH
$$ ##OWNER= Administrator
$$ $$ C:\Bruker\TOPSPIN/data/COFFEE/nmr/UV1153_M3-1004-1000_6301790_CnuTG2mB1p/10/pdata/1/auditp.txt
$$ ##AUDIT TRAIL=  $$ (NUMBER, WHEN, WHO, WHERE, PROCESS, VERSION, WHAT)
(   1,<2012-06-06 02:55:06.140 -0500>,<Administrator>,<TOPSPIN>,<go>,<TOPSPIN 2.1>,
      <created by zg
	started at 2012-06-06 02:53:59.609 -0500,
	POWCHK enabled, PULCHK disabled,
       configuration hash MD5:
       D5 CA 7A 23 FE 6B EE E2 50 67 74 61 24 F7 5E 3B
       data hash MD5: 64K
       3A 5E AF D6 BB BB 72 68 2E 28 E6 9D F0 B7 48 ED>)
(   2,<2012-06-06 02:55:09.390 -0500>,<Administrator>,<TOPSPIN>,<proc1d>,<TOPSPIN 2.1>,
      <Start of raw data processing
       efp LB = 0 FT_mod = 6 PKNL = 1 PHC0 = 0 PHC1 = 0 SI = 32K 
       data hash MD5: 32K
       FD DC 6D 91 F0 16 28 F4 3D FE BB F4 5E 91 04 F8>)
(   3,<2012-06-06 02:55:09.796 -0500>,<Administrator>,<TOPSPIN>,<proc1d>,<TOPSPIN 2.1>,
      <pk PHC0 = 208.9819 PHC1 = 0 
       data hash MD5: 32K
       CF 9A 70 0C DD ED 07 40 27 C9 17 86 69 89 C6 42>)
(   4,<2012-06-06 02:55:09.859 -0500>,<Administrator>,<TOPSPIN>,<proc1d>,<TOPSPIN 2.1>,
      <abs ABSG = 1 
       data hash MD5: 32K
       E3 09 3B AC 4B 4F 42 94 A2 17 3F F2 6A 11 4C 44>)
(   5,<2012-06-06 02:55:09.890 -0500>,<Administrator>,<TOPSPIN>,<proc1d>,<TOPSPIN 2.1>,
      <abs ABSG = 2 
       data hash MD5: 32K
       C6 87 D6 22 6A B6 A1 D9 1F 16 5E 06 06 FB 8F 58>)
(   6,<2012-06-06 02:55:09.921 -0500>,<Administrator>,<TOPSPIN>,<proc1d>,<TOPSPIN 2.1>,
      <abs ABSG = 3 
       data hash MD5: 32K
       D8 50 58 20 0A 5E DB 41 E4 D2 40 A7 A5 A9 CE EA>)
(   7,<2012-06-06 02:55:09.953 -0500>,<Administrator>,<TOPSPIN>,<proc1d>,<TOPSPIN 2.1>,
      <abs ABSG = 4 
       data hash MD5: 32K
       49 65 A6 D8 62 A8 CD 3B A6 40 B1 0D 6E 1C 2D 2B>)
(   8,<2012-06-06 02:55:09.984 -0500>,<Administrator>,<TOPSPIN>,<proc1d>,<TOPSPIN 2.1>,
      <abs ABSG = 5 
       data hash MD5: 32K
       38 18 89 D6 A7 F5 44 AB 7C 66 D4 7C 12 AD 21 8B>)
$$ ##END=
$$ 
$$ $$ hash MD5
$$ $$ DC 06 49 B1 26 1A B5 BE A8 D7 E0 5D 94 75 8E 66
##$RELAX= 
##$RELAX= 
##$RELAX= 
##$RELAX= 
##$RELAX= 
##$RELAX= 
##$RELAX= 
$$ Bruker specific parameters
$$ --------------------------
$$ [...]
150 150 150 150 150 150 150 150
##$TP07= 0
##$TPNAME0= <>
##$TPNAME1= <>
##$TPNAME2= <>
##$TPNAME3= <>
##$TPNAME4= <>
##$TPNAME5= <>
##$TPNAME6= <>
##$TPNAME7= <>
##$TPOAL= (0..7)
0.5 0.5 0.5 0.5 0.5 0.5 0.5 0.5
##$TPOFFS= (0..7)
0 0 0 0 0 0 0 0
##$TUNHIN= 0
##$TUNHOUT= 0
##$TUNXOUT= 0
##$USERA1= <user>
##$USERA2= <user>
##$USERA3= <user>
##$USERA4= <user>
##$USERA5= <user>
##$V9= 5
##$VALIST= <valist>
##$VCLIST= <CCCCCCCCCCCCCCC>
##$VD= 0
##$VDLIST= <DDDDDDDDDDDDDDD>
##$VPLIST= <PPPPPPPPPPPPPPP>
##$VTLIST= <TTTTTTTTTTTTTTT>
##$WBST= 2048
##$WBSW= 25
##$XGAIN= (0..3)
0 0 0 0
##$XL= 0
##$YL= 0
##$YMAX_a= 535121
##$YMIN_a= -657326
##$ZGOPTNS= <>
##$ZL1= 120
##$ZL2= 120
##$ZL3= 120
##$ZL4= 120
##$ABSF1= 14.98061
##$ABSF2= -5.57192
##$ABSG= 5
##$ABSL= 3
##$ALPHA= 0
##$AQORDER= 0
##$ASSFAC= 0
##$ASSFACI= 0
##$ASSFACX= 0
##$ASSWID= 0
##$AUNMP= <proc_prof1d_extract_pilot.lims>
##$AXLEFT= 0
##$AXNAME= <>
##$AXNUC= <1H>
##$AXRIGHT= 0
##$AXTYPE= 0
##$AXUNIT= <>
##$AZFE= 0.1
##$AZFW= 0.1
##$BCFW= 0
##$BC_mod= 0
##$BYTORDP= 0
##$COROFFS= 0
##$CY= 15
##$DATMOD= 1
##$DC= 0
##$DFILT= <>
##$DTYPP= 0
##$F1P= 0
##$F2P= 0
##$FCOR= 0.5
##$FTSIZE= 32768
##$FT_mod= 6
##$GAMMA= 0
##$GB= 0
##$INTBC= 1
##$INTSCL= 1
##$ISEN= 128
##$LB= 0
##$LEV0= 0
##$LPBIN= 0
##$MAXI= 10000
##$MC2= 0
##$MEAN= 0
##$ME_mod= 0
##$MI= 0
##$NCOEF= 0
##$NC_proc= -8
##$NLEV= 6
##$NOISF1= 0
##$NOISF2= 0
##$NSP= 0
##$NTH_PI= 0
##$NZP= 0
##$OFFSET= 14.98061
##$PC= 1
##$PHC0= 208.9819
##$PHC1= 0
##$PH_mod= 1
##$PKNL= yes
##$PPARMOD= 0
##$PPDIAG= 0
##$PPIPTYP= 0
##$PPMPNUM= 2147483647
##$PPRESOL= 1
##$PSCAL= 4
##$PSIGN= 0
##$PYNMP= <proc.py>
##$REVERSE= no
##$SF= 400.13
##$SI= 32768
##$SIGF1= 0
##$SIGF2= 0
##$SINO= 400
##$SIOLD= 32768
##$SPECTYP= <>
##$SREGLST= <1H.CDCl3>
##$SSB= 0
##$STSI= 32768
##$STSR= 0
##$SW_p= 8223.68421052632
##$SYMM= 0
##$S_DEV= 0
##$TDeff= 65536
##$TDoff= 0
##$TI= <>
##$TILT= no
##$TM1= 0
##$TM2= 0
##$TOPLEV= 0
##$USERP1= <user>
##$USERP2= <user>
##$USERP3= <user>
##$USERP4= <user>
##$USERP5= <user>
##$WDW= 1
##$XDIM= 32768
##$YMAX_p= 455608534
##$YMIN_p= -671057
##$CURPLOT= <Network HP LaserJet P1505>
##$CURPRIN= <$Network HP LaserJet P1505>
##$DFORMAT= <normdp>
##$LAYOUT= <+/1D_H.xwp>
##$LFORMAT= <normlp>
##$PFORMAT= <normpl>
##$SURQMSG= 1
$$ End of Bruker specific parameters
$$ ---------------------------------
##NTUPLES= NMR SPECTRUM
##VAR_NAME=  FREQUENCY,     SPECTRUM/REAL,   SPECTRUM/IMAG
##SYMBOL=    X,             R,               I
##VAR_TYPE=  INDEPENDENT,   DEPENDENT,       DEPENDENT
##VAR_FORM=  AFFN,          ASDF,            ASDF
##VAR_DIM=   32768,         32768,           32768
##UNITS=     HZ,            ARBITRARY UNITS, ARBITRARY UNITS
##FACTOR=    0.250966925370066, 1,           1
##FIRST=     8223.43324360095, -248838,      -292814
##LAST=      0,             147635,          -232456
##MIN=       0,             -671057,         0
##MAX=       8223.43324360095, 455608534,    0
$$ Real data points
##PAGE= N=1
##DATA TABLE= (X++(R..R)), XYDATA
$$ [...]
19556c7147j26630p715P8298k49336J08363P9518P7208L4005A01771a01049c0524
19544b13268L4606A46991n6557b84339B02391J01501f9583K6819j33394m2435
19534b18593R0536I7623a08590A98948f5552k19241a14522C6866d2618G5167i6831
19522B96374A18626m8152B3416h9734k47440J64684G7809a7040j36951A87255
19511b53690d0104j61741p2427a719H0486l1073b59188g8767r8696p9792J13559
19500a43696A71724F0775h1671A02056b81714o3759g1348q1974C0978J69487a99870
19488A33770n5099J164K45498C5659N2678J58741j15557m8599O2441c4199A15117
19476a74570g1122r0872A76981b62301J7515i5254K8031m1343q2297j91835h6105
$$ plain form
19556 -37147 -163777 -171492 -93194 -342530 -234167 -154649 -77441 -43436 101771 -101049 -30524
19544 -213268 -178662 146991 90434 -284339 202391 303892 -69583 -42764 -176158 -218593
19534 -218593 -128057 97623 -108590 198948 -65552 -284793 -114522 36866 -42618 75167 -96831
19522 296374 118626 70474 23416 -89734 -337174 -172490 77809 -17040 -153991 187255
19511 -253690 -40104 -201845 -274272 -1719 80486 49413 -259188 -78767 -177463 -257255 -143696
19500 -143696 171724 60775 -81671 102056 -281714 -345473 -71348 -153322 30978 200465 -199870
19488 133770 78671 79835 325333 35659 88337 247078 131521 82922 145363 -34199 115117
19476 -174570 -71122 -161994 176981 -262301 -244786 -95254 -67223 -108566 -190863 -382698 -86105
19464b87587K0329a0674B25880b19652o8819G5229b5056k11673j190J1908A47952
19452d4539B3730f6908H9626a96636B9408K7837h4698C6760a46764f3758p7743
19441a41501k72516i4282B0639a30837B78830N9486A2644b39976d1099o9503C9952
19429a38504a7336j89933C65067H7163a10130q8471R7295j01069A40762F0941
19418a37357c2682E9222g9099o9134A19579m2010b30859a8329p1410n2436e2585
19406c16850H7247g969k26530R9009M5119L7782k7582n8575B0439a85510H6495
19394A44018e74073a10084k96035e1214r5475M4536c2345n2304G287a59312B75784
19382B59365A8324b07917e594l23822A13159c3077j36455J6286A68063g9590j17671
$$ plain form
19464 -287587 -267258 -10674 225880 -219652 -288471 75229 -25056 -236729 -237919 -226011 147952
19452 -44539 23730 -66908 89626 -196636 29408 57245 -84698 36760 -146764 -63758 -141501
19441 -141501 -414017 -94282 20639 -130837 278830 338316 12644 -239976 -41099 -110602 39952
19429 -138504 -17336 -207269 365067 87163 -110130 -198601 -101306 -202375 140762 60941
19418 -137357 -32682 59222 -79099 -148233 119579 77569 -230859 -18329 -89739 -142175 -52585
19406 -316850 87247 -7969 -234499 -135490 -90371 -52589 -80171 -138746 20439 -185510 86495
19394 144018 -574073 -110084 -406119 -51214 -146689 -102153 -32345 -84649 7287 -159312 275784
19382 259365 18324 -207917 -5594 -329416 113159 -33077 -169532 -153246 168063 -79590 -197261
19371a97261H5737g731k39828A7114L5129K57109f0049a0953j39601m5275A00558
19359f0305A92099J32338F0404L7610d0749A482a03474M0520A48357b03757L7487
19348a66270M5167q8655l5293A69697C8298g6885K3136a7357l65109J64898e3428
19336d2721j16233G5902e0800I3882Q2614b38210e6762k04812a07671D06874h9095
19324I279O134b57346J14256B4020e4025C2814a37458A4562b47798J04901j14225
19313b57122J7195j87697D5267e2640I3730B9700A2918f9355A56225n0473a25013
19301B28579E9910b67866J20380k93707J23705F2042j0350c48740E7885c3581
19290i943j97220B4300a55077G3493d22941K01349J8997A35000O2709a09479J645
$$ plain form
19371 -197261 85737 -7731 -247559 17114 52243 309352 -60049 -10953 -150554 -195829 100558
19359 -60305 192099 324437 60404 98014 -40749 1482 -103474 -62954 148357 -203757 -166270
19348 -166270 -121103 -209758 -245051 169697 38298 -76885 -53749 -17357 -382466 -217568 -53428
19336 -42721 -158954 75902 -50800 93882 176496 -238210 -56762 -261574 -107671 406874 -89095
19324 9279 15413 -257346 -143090 24020 -54025 32814 -137458 14562 -247798 -142897 -257122
19313 -257122 -239927 -427624 45267 -52640 93730 29700 12918 -69355 156225 105752 -125013
19301 228579 59910 -267866 -147486 -441193 -317488 62042 51692 -348740 57885 -33581
19290 -9943 -207163 24300 -155077 73493 -422941 -221592 -202595 135000 197709 -109479 -107834
19279a07834l5798j60715I8192d08533a71079B95903A0909N4317j8627b48937
19268b27625C43333I4929B8248P9848L23245b350k78911J19633m0850M265F9594
19256H5078I749i5294E8261a87089j45383E1625J33216l2309a88708f3384j3254
19245g6638D5330i6775l809d3836C48206A69241f7716q4250j16101b1173B9974
19233a5358F2300O155a22663j4447k10851D7604d6803E1535b53460C7109c2055
19221a10827A92160o6266a6477j63022j501p6101b1541j40662I2204Q5901c8656
19209a21559b7431E0669a10357G2251a20604p3293e0596o8053J451B30009i9929
19197F41b05937F8728a15592N7124m9424A12639b8560q19A83517C3131a97759
$$ plain form
19279 -107834 -143632 -304347 98192 -408533 -171079 295903 10909 65226 46599 -248937
19268 -227625 343333 94929 28248 108096 431341 -2350 -281261 -161628 -202478 -198213 69594
19256 85078 9749 -95294 58261 -187089 -332472 51625 184841 152532 -188708 -63384 -76638
19245 -76638 45330 -96775 -100584 -43836 348206 169241 -67716 -151966 -268067 -21173 29974
19233 -15358 62300 68455 -122663 -137110 -347961 47604 -46803 51535 -253460 37109 -32055
19221 -110827 192160 125894 -16477 -179499 -181000 -257101 -21541 -162203 92204 178105 -38656
19209 -121559 -27431 50669 -110357 72251 -120604 -193897 -50596 -118649 -117198 230009 -99929
19197 641 -205937 68728 -115592 -58468 -107892 112639 -28560 -29379 183517 33131 -197759
19185I5615J10441B786c0593q8629j44130l5573f2918A40289M210a34957M5773
19174h9184p4567d9421q848k14891D4478J030D164J57101b81519a25467A79968
19162a83519f9287q8465k39057J90042B36448b14733F0327b42713a07577l5937
19152a43514b7641B71651b39651R3908M1611J0661L8463j4290A82573g6978a212
19140b0003B41667j16702a37065H7948f0416j15647P9960j4773B02029a91543
19129D7548a18882c4362G7003I85c45174I8283b23660A21609C2752b6846J3120
19118a3726j54196c9986k68066f6381C2383l529a43417a2052j60369f006k95892
19107c01898f4155p013k24155J36268A62684K66983H6420m464c20627h4193J5752
$$ plain form
19185 95615 206056 2786 -30593 -119222 -263352 -298925 -62918 140289 144499 -134957 -89184
19174 -89184 -163751 -49421 -58269 -273160 44478 45508 4164 161265 -281519 -125467 179968
19162 -183519 -69287 -157752 -396809 -206767 236448 -214733 60327 -242713 -107577 -143514
19152 -143514 -27641 271651 -239651 -145743 -104132 -93471 -55008 -69298 182573 -76978 -1212
19140 -20003 241667 124965 -137065 87948 -60416 -176063 -96103 -110876 202029 -191543
19129 47548 -118882 -34362 77003 985 -345174 98283 -223660 121609 32752 -26846 -13726
19118 -13726 -167922 -39986 -308052 -66381 32383 28854 -143417 -12052 -172421 -6006 -301898
19107 -301898 -64155 -71168 -295323 -159055 162684 429667 86420 81956 -320627 -84193 -68441
19096f8441J0807j06566J4598C09434B4617L50409a02778J4762k62841C0679e5602
19084b05596K3766A42158o2191a46091K1528A36845a84978L5194A16941a63935
19073A03190a4558j45360j58661a23460c9164n4440H1881b27094h2653A30992
19062G8123b58148C3008d3524l38480A14715d9658p969j34165a734j89495A75689
19050h2765F9715a95591D0342a46118a1046o0494q9560H7193a12429l7653d8283
19038b52553o5571a45025D0183J9640J26475i1068n6748k38969D48729b22309
19027I1502b0152D9479A8216K4269J28205G2109a64884A64750c21612f3837b2186
19015b18653A4430a98857k6511a10123E2887h5150H7625a25565B3555g4699m5078
$$ plain form
19096 -68441 -57634 -164200 -149602 309434 24617 375026 -102778 -88016 -350857 30679 -55602
19084 -205596 -181830 142158 79967 -146091 -124563 136845 -184978 -149784 116941 -163935
19073 103190 -14558 -159918 -318579 -123460 -39164 -93604 81881 -227094 -82653 130992
19062 78123 -258148 33008 -43524 -382004 114715 -49658 -57627 -191792 -1734 -191229 175689
19050 -82765 69715 -195591 40342 -146118 -11046 -71540 -161100 87193 -112429 -150082 -48283
19038 -252553 -318124 -145025 40183 59823 186298 -91068 -147816 -386785 448729 -222309
19027 91502 -20152 49479 18216 42485 170690 72109 -164884 164750 -321612 -63837 -22186
19015 -218653 14430 -198857 -225368 -110123 52887 -85150 87625 -125565 23555 -74699 -119777
19004a19777j04308C8425a16096p981K9594B80395a48094B873J26116a97173H0046
18992a83653j20156i1203A98490e880A02122a67265j57216B2349a60289A40197
18981F1951b10534B51127c89141N5869A48980m9089J03783A2294K215b4908B15902
18969G7998d36994A83803d63435b23234D2419a72252l5621e9228B15501a37357
18958A69945A5507i4810A00493b71659A04367d5539D3169J01697h0493D6157b48259
18946B36426M2066b12748a1340k93025A42809c40430H8057c73533B0691a03307
18935h0040H6196B0371L2809a66053c6962l4555n5233k47324J51182A66567b74890
18923a38141G9422a67843d1832q0606b5051H7910d46886F9868F245a59116c5636
$$ plain form
19004 -119777 -224085 38425 -116096 -124077 -94483 280395 -148094 2873 128989 -197173 80046
18992 -183653 -303809 -91203 198490 -5880 102122 -167265 -324481 22349 -160289 140197
18981 61951 -210534 251127 -389141 -333272 148980 99891 203674 12294 14509 -24908 215902
18969 77998 -436994 183803 -463435 -223234 42419 -172252 -207873 -59228 215501 -137357
18958 169945 15507 -94810 100493 -271659 104367 -45539 43169 144866 -80493 46157 -248259
18946 236426 278492 -212748 -11340 -304365 142809 -340430 88057 -373533 20691 -103307
18935 -80040 86196 20371 53180 -166053 -36962 -71517 -126750 -374074 -222892 166567 -274890
18923 -138141 79422 -167843 -41832 -122438 -25051 87910 -446886 69868 6245 -159116 -35636
18911b85930h1564b5072j09369j269l3395e0264n2817H2150B342J49324b88208
18899a13557j7885c819I8707c34596b3133B27492F5705a58136B88139A6007K8890
18888D4897a39549A55286c45020b1200A23608h7523m9246q0884H3828J22218f649
18876e16389g4192B23663a57200I9000l0377a77622F2132a97179h4790A29694
18865b14155G2893b5598p2057j26266J08037j9713b2060q2255c3971j22305H4313
18853c302C3413h799I4580b16340H9002b87527A71535C2908M2226b68540k3823
18842b92363G8902e0943A48639f1561b6660l3658j52797g7460j0460m5902I3158
18830D1469N2960b65421i6111B32209a80397A86845n7887J4378A1310Q5665b50721
$$ plain form
18911 -285930 -81564 -25072 -134441 -135710 -169105 -50264 -103081 82150 2342 151666 -288208
18899 -113557 -131442 -3819 98707 -334596 -23133 227492 65705 -158136 288139 16007 44897
18888 44897 -139549 155286 -345020 -21200 123608 -87523 -136769 -217653 83828 206046 -6649
18876 -516389 -74192 223663 -157200 99000 68623 -177622 62132 -197179 -84790 129694
18865 -214155 72893 -25598 -97655 -223921 -115884 -135597 -22060 -104315 -33971 -156276 84313
18853 -3302 33413 -8799 94580 -216340 89002 -287527 171535 32908 75134 -268540 -292363
18842 -292363 78902 -50943 148639 -61561 -26660 -60318 -213115 -77460 -87920 -133822 93158
18830 41469 94429 -265421 -96111 232209 -180397 186845 128958 143336 11310 96975 -250721
18818a13422D998K53156a83076a8549q2790j22916E9957K0656d23898b6562D2037
18806A12975b8291j23381m1301d2996A32042c9990B20873g1080m8807N1585H1431
18794B39336a24079j04941B59895a77445l5946J02466L541C05774b31248B17147
18783C5715q987c39912g7233C02141i966C4045a56475c0476G9985a92110j4886
18772b06996j7780L928N7211k2811e3823C54645A23288J7136g2937m7826I1264
18760C3877N2621J10455a73772K6290P1322A25069J33538a88982N9219A1560d5922
18748c49675G0482b71818F065K2973a71461n7987f4091i937B19081b15969O5357
18737a50612g3825F2309e2604m0835j56475A30181b6533j74114Q2684j1975q802
$$ plain form
18818 -113422 4998 258154 -183076 -18549 -101339 -224255 59957 80613 -423898 -26562 42037
18806 112975 -28291 -151672 -192973 -42996 132042 -39990 220873 -71080 -119887 -68302 81431
18794 239336 -124079 -229020 259895 -177445 -213391 -110925 -107384 305774 -231248 217147
18783 35715 26728 -339912 -77233 302141 -9966 34045 -156475 -30476 79985 -192110 -206996
18772 -206996 -224776 -220848 -163637 -186448 -53823 354645 123288 140424 -72937 -120763 91264
18760 33877 86498 196953 -173772 -147482 -76160 125069 258607 -188982 -129763 11560 -45922
18748 -349675 70482 -271818 6065 29038 -171461 -229448 -64091 -9937 219081 -215969 -150612
18737 -150612 -73825 62309 -52604 -93439 -249914 130181 -26533 -200647 -117963 -129938 -138740
18726a38740e7365A46838a06910d3794p7394j78839l8404D0260J89070a27696
18715a21010p9873J00041E444K07265b66651k8848G7761l4024J15646F1925b11315
18703a02488D5049A5921c57622Q1274e8019B33584a88273p6776A52456c34713
18692i3780E9189J40848r2711a44169e5685j62082b5141r5188A19475B6631a53977
18680A61540o4240c70916g9649A60651O2757b88508B87457b41032J15826d147
18669c5984L991j26027A21134D2120f6153H3105m0487a00751j67718A84652D6060
18657i5264m164J9822N648l369n9018B10419B5408c582m4692n5167E0557b92330
18644c3339A58680p0005b01050d9739k85175J40668D2740K06050o5131a79770
$$ plain form
18726 -138740 -57365 146838 -106910 -43794 -121188 -300027 -338431 40260 229330 -127696
18715 -121010 -200883 -100842 5444 212709 -266651 -295499 77761 43737 159383 61925 -211315
18703 -102488 45049 15921 -357622 -276348 -58019 233584 -188273 -265049 152456 -334713
18692 -93780 59189 200037 107326 -144169 -55685 -217767 -25141 -120329 119475 26631 -153977
18680 161540 97300 -370916 -79649 160651 223408 -288508 287457 -241032 -125206 -4147
18669 -35984 -31993 -158020 121134 42120 -66153 83105 42618 -100751 -268469 184652 46060
18657 -95264 -99428 -79606 -73958 -77327 -136345 210419 25408 -3582 -48274 -103441 50557 -292330
18644 -33339 158680 88675 -201050 -49739 -334914 -194246 42740 248790 183659 -179770
18633C93140H1213J3062a46315C22065E8874k769a93230K8578p0676A30259A376
18621B68339i4491j20765a07269D8969a34180A27335a15558L0840q6180H5158
18610G8948b84939a28421k05276a42738A14835J6770a20129Q161o1985a2983A12834
18598C21833F1524J0231P4590G869J90390a52374B28850k4540c90911a59218j8266
18587a77484j32048A5286a00600J164j03161Q6760K121j67178J30717H9501i601
18575i8485j18987B2129J12757f9599C7078a47516A50745e3218J4099C6715b7608
18563b23835f5683l41590a45880e4315o2643E9593a41495b3915k1558A0890a76098
18551h9732B80468a33507j34122C5840c10468Q5254j05895J62296N9105A3620
$$ plain form
18633 393140 81213 94275 -146315 322065 58874 56105 -193230 -164652 -235328 130259 1376
18621 268339 -94491 -215256 -107269 48969 -134180 127335 -115558 -84718 -170898 85158
18610 78948 -284939 -128421 -333697 -142738 114835 131605 -120129 -111968 -173953 -12983 112834
18598 321833 61524 71755 146345 7869 198259 -152374 228850 204310 -390911 -159218 -177484
18587 -177484 -309532 15286 -100600 -99436 -202597 -115837 -113716 -280894 -150177 89501 -9601
18575 -98485 -217472 22129 134886 -69599 37078 -147516 150745 -53218 -39119 36715 -27608
18563 -223835 -65683 -407273 -145880 -54315 -116958 59593 -141495 -23915 -45473 10890 -176098
18551 -89732 280468 -133507 -267629 35840 -310468 -225214 -331109 -168813 -109708 13620
18540b19804f1301l6987A45925a93432e3510A79458c6909J6643k10402A70384
18529c7820q1251E8453i2136j41259A88745a88327A72437J57805B9606b67629
18518a60709H4813B9307a15418j44327h9805E2777j055O38Q4449k0657R6981a45153
18505a13443f043j17897O0494F2561b27415O2040a2755l18367J44721D4226K4349
18494F8575M143b26711P9872q0516D7724G707a2520A15199a43258A22305a85085
18482c16915f782E9210b2399A36290N5648C3474J07767a27696H5952M9976a3894
18470a94539g1866j53109n1045A90147b72050B23340c33696J22659k96573a66248
18459a80268H6880a2471B193a65269Q1968D3658J33991a1431l9088J8757p5396
$$ plain form
18540 -219804 -61301 -98288 145925 -193432 -53510 179458 -36909 -20266 -230668 170384
18529 -37820 -119071 58453 -92136 -233395 188745 -188327 172437 330242 29606 -267629
18518 -160709 84813 29307 -115418 -259745 -89805 52777 51722 52360 136809 116152 213133 -145153
18505 -113443 -6043 -123940 -63446 62561 -227415 -165375 -12755 -331122 -186401 44226 68575
18494 68575 72718 -226711 -146839 -227355 47724 7707 -12520 115199 -143258 122305 -185085
18482 -316915 -6782 59210 -22399 136290 191938 33474 141241 -127696 85952 135928 -13894
18470 -194539 -71866 -224975 -276020 190147 -272050 223340 -333696 -211037 -507610 -166248
18459 -180268 86880 -12471 2193 -165269 -83301 43658 177649 -11431 -50519 -31762 -107158
18448a07158M6604A6539J27707a59209p1857a13848N6850j57718n8439A4671b96300
18436c8288l0209o0093C38038I3670a9071D5556b109D8740K026K82322b15285
18424D2104d0179J0660o1300d2596j11406j01826f2088I8525a06788c8093m3706
18413h1799q9930C13840a53210f2669D8499A8923a3878l74833a30333B3411c08365
18401B37720b12060i7120o9008F6663d5520I5801d1516m7963C10J95201c5115
18389a83577q6450G7174f047r6719C1546a34865K9940B14837i3641k48656B79629
18377h3384F4242d1714a7891j1309G3029f6515A30655a10002B26449D6359a51641
18365a45943A43740b67964a10411j52160e3867A07248a79667g553B79700a68128
$$ plain form
18448 -107158 -60554 16539 144246 -159209 -231066 -113848 -56998 -214716 -273155 14671 -296300
18436 -38288 -68497 -128590 338038 93670 -19071 45556 -2109 48740 50766 333088 -215285
18424 42104 -40179 -29519 -90819 -42596 -154002 -255828 -62088 98525 -106788 -38093 -81799
18413 -81799 -171729 313840 -153210 -62669 48499 18923 -13878 -388711 -130333 23411 -308365
18401 237720 -212060 -97120 -166128 66663 -45520 95801 -41516 -89479 310 195511 -35115
18389 -183577 -270027 77174 -6047 -102766 31546 -134865 -104925 214837 -93641 -342297 279629
18377 -83384 64242 -41714 -17891 -29200 73029 -66515 130655 -110002 226449 46359 -151641
18365 -145943 143740 -267964 -110411 -262571 -53867 107248 -179667 -7553 279700 -168128
18354B54817a36618O6921k00138A29585b49432k13875B66988j03039e420o9544
18344g4964A43255a29159e7356l73391K13677r5445B706b50812A43460e8806N524
18333e3282n1627b8842C3607N9703b9815A15956I852c00642P5503J6676A75723
18321b69017G2251M8935j8610D3185N4237J92813h4166B17697a28541C5067a69526
18309B86885e6269A00624b82760A36901b22552i2666k35053J42410A99916b66067
18298c9440j24118j35250J01165j84613J65009b3742j35985l31532K2402F665
18287b83537A05821m5078J8055f0227l89222b3436l4550B1329i4063A83886b14311
18275a36710a2687B05396G3526J75541E0767a43125o2406k3987I7565a20891B48657
$$ plain form
18354 254817 -136618 -69697 -269835 129585 -249432 -463307 266988 163949 -5420 -74964
18344 -74964 143255 -129159 -57356 -430747 -217070 -312515 2706 -250812 143460 -58806 -53282
18333 -53282 -104909 -28842 33607 93310 -29815 115956 9852 -300642 -225139 -208463 175723
18321 -269017 72251 121186 102576 43185 97422 290235 -84166 217697 -128541 35067 -169526
18309 286885 -56269 100624 -282760 136901 -222552 -92666 -327719 -185309 199916 -266067
18298 -39440 -163558 -298808 -197643 -382256 -217247 -23742 -159727 -491259 -468857 6665
18287 -283537 105821 60743 78798 -60227 -449449 -23436 -57986 21329 -94063 183886 -214311
18275 -136710 -12687 205396 73526 249067 50767 -143125 -205531 -229518 97565 -120891 248657
18263I0302e9910A39090P6012b00456A01019a34433I7761E72g4168j80951P563
18252b47556N8883h4258H7142O9573a45275e956k51813d8583A1991M1587j6332
18241C7246K3437j991g4578E9850J13424a20517B7040L1032M6971k7728N5509
18230A32824k1413d5653j6519I5559B9759a39241J0629O14p4140c4804B15259
18218b57172J06181J319B4871J05328B7344b21405R9996A00862f3188k3702A13987
18206B3383a50043j67446E5523L7992c6037m4546q3549l381Q3063B3893L1679
18195E5572e6123I773a56998j0108j1490B12889I0964C415i0539B60465A02907
18183b44580F17c7951H3816c25687a56021M7453M2747G9957l2583C022J62534
$$ plain form
18263 90302 -59910 139090 215102 -200456 101019 -134433 97761 572 -74168 -255119 -247556
18252 -247556 -188673 -84258 87142 156715 -145275 -5956 -257769 -48583 11991 53578 37246
18241 37246 60683 58692 -74578 59850 173274 -120517 27040 58072 105043 77315 132824
18230 132824 111411 -45653 -62172 95559 29759 -139241 -128612 -127998 -202138 -34804 215259
18218 -257172 -150991 -149672 24871 130199 27344 -221405 -121409 100862 -63188 -86890 113987
18206 23383 -150043 -317489 55523 93515 -36037 -80583 -164132 -167513 -84450 23893 55572
18195 55572 -56123 9773 -156998 -167106 -178596 212889 90964 3415 -90539 260465 102907
18183 -244580 617 -37951 83816 -325687 -156021 -108568 -65821 79957 47374 3022 165556
18172A65556b82469E0432K46032o0698h6191I120i6923B93025A40652g3118e573
18160B86345A31298g7437G6090b37120a4026O895j46077e5993A17350e1758D751
18148A71039A8906J61117d4621A63964O3488F8327a75289A99264b0038j75474
18138a95512d5604j05925d9625l77928A57564o9933J59926f5090K2576H4753A9151
18126I8182d52692B81648A24352B5617d0334A86514F6507a31149A15821a45229
18115b77078B63644b24595J6570j27208g0241A60746J87672j35915e0325E4626
18104g7188k4846A52939b496A10265O5604b2638E9199a30341b5174C02242f537
18092B82265b8658B14916d4390A26256B0737a62910D5987R863J01671b3502j67766
$$ plain form
18172 165556 -282469 50432 296464 235766 -86191 9120 -96923 293025 140652 -73118 -5573
18160 286345 131298 -77437 76090 -237120 -14026 -7131 -153208 -55993 117350 -51758 4751
18148 171039 18906 180023 -44621 163964 227452 68327 -175289 199264 -20038 -195512
18138 -195512 -45604 -151529 -49625 -427553 157564 87631 247557 -65090 -42514 84753 19151
18126 98182 -452692 281648 124352 25617 -40334 186514 66507 -131149 115821 -145229
18115 -277078 263644 -224595 -208025 -335233 -70241 160746 348418 212503 -50325 54626
18104 -77188 -102034 152939 -2496 110265 175869 -22638 59199 -130341 -25174 302242 -6537
18092 282265 -28658 214916 -44390 126256 20737 -162910 45987 55850 157521 -23502 -191268
18081a91268a0694m5331J8993j83544D3346c18069f9477I9526D5205J63639b88526
18069i0776B00009e1054E5017a30539d7413E7700c30481A16679K8349c2193A4928
18057G1381e8616H5549L4155a77878B7551K68896H9905K8888c29549a2877C163
18045A8452a0464j55169J3248F2552B6776b27904c6651B558J20752a23325B77164
18033A92970I5734a14412A38787J16303f7204A00428b22725q9743J06494K344
18023b03630J00883b5808j80032h5930p2425A7128h7758A21848f3861D1160i0854
18011C18405F1181b04410A26666e5737F5565J31324N9031D9665i7621A09187N549
18000A14736g370m1911A8988L4553J19601P3023c0036A76121a58006N4063A26523
$$ plain form
18081 -191268 -10694 -56025 -37032 -220576 43346 -318069 -69477 99526 45205 208844 -288526
18069 -90776 200009 -51054 55017 -130539 -47413 57700 -330481 116679 145028 -32193 14928
18057 71381 -58616 85549 119704 -177878 27551 296447 89905 118793 -329549 -12877 3163
18045 18452 -10464 -165633 -152385 62552 26776 -227904 -36651 2558 123310 -123325 277164
18033 192970 95734 -114412 138787 255090 -67204 100428 -222725 -312468 -205974 -203630
18023 -203630 -102747 -25808 -205840 -85930 -158355 17128 -87758 121848 -63861 41160 -90854
18011 318405 61181 -204410 126666 -55737 65565 196889 255920 49665 -97621 109187 114736
18000 114736 -7370 -49281 18988 53541 173142 246165 -30036 176121 -158006 -103943 126523
17988d3822m7899r4230g7468C6419N9546J59677A10539C276L01990h6897n06m06166
17976d93569b00109M5979L8867j51469A23004g2255j4962j70101e220G0153c8722
17964A3941g0227j54023f3888j11828l774C9191a40283J4707j47749B50160i2272
17952B17420a20484G6991f1077J3629n5078A01334e2396D6144d6276a9792p2000
17941i1792k9613r162A63330b51426I6542g9988L5187A4428L8913b81012B15202
17929e3538k63884A47306o2899d025p1209A14756e6642E1209A9567L10546a24472
17917g2283C4895g2887j08338e5362o6823j45463h3840H8770J58075M3396r5562
17906A94679A2393a67525B20509I5967a10723M1188b154j43328D264a56227j13847
$$ plain form
17988 -43822 -91721 -185951 -77468 36419 95965 255642 110539 3276 305266 -86897 -87403 -493569
17976 -493569 -200109 -154130 -115263 -266732 123004 -72255 -87217 -257318 -5220 70153 -38722
17964 13941 -70227 -224250 -63888 -175716 -179490 39191 -140283 -125576 -273325 250160 -92272
17952 217420 -120484 76991 -61077 -47448 -102526 101334 -52396 46144 -46276 -19792 -91792
17941 -91792 -121405 -130567 163330 -251426 96542 -79988 -44801 14428 53341 -281012 215202
17929 -53538 -317422 147306 84407 -4025 -75234 114756 -56642 51209 19567 330113 -124472
17917 -72283 34895 -72887 -181225 -55362 -122185 -267648 -83840 88770 246845 290241 194679
17906 194679 12393 -167525 220509 95967 -110723 -69535 -2154 -145482 4264 -156227 -270074
17895b70074A73926M3715g2915B27437b2385o7756B94828G0538a50413E38274
17884c01663B26683k7867a24559c6509n329j22119B8643c1174A1853L09779f5519
17872a29494E8482L9087J15901b99222a9179j1678n5761j25240B86563c00708
17861c2384A61513i0721B29950a17049C45106j66799g524o5149N765m3406L3478
17850g6836c3047k38558i2483b3157m042A110a3146n9203B01853A7466O0843B2114
17837f8178A04019a69604Q4316A45687c61682A73822a97453D8782a6654l9658
17827e6312M015D87028g4769D83297a95704P6392B02042D2105b17438B14312E9314
17815A4773g4739B09054i8780j7921L0464m7668A12544b05800A60071f1024P305
$$ plain form
17895 -270074 173926 217641 -72915 227437 -22385 -90141 294828 70538 -150413 538274
17884 -301663 226683 198816 -124559 -36509 -41838 -163957 28643 -31174 11853 321632 -65519
17872 -129494 58482 97569 213470 -299222 -19179 -30857 -86618 -211858 286563 -300708
17861 -32384 161513 -90721 229950 -117049 345106 178307 -7524 -72673 -66908 -110314 -76836
17850 -76836 -33047 -271605 -92483 -23157 -27199 1110 -13146 -72349 201853 17466 78309 22114
17837 -68178 104019 -169604 -85288 145687 -361682 173822 -197453 48782 -16654 -56312
17827 -56312 -52297 487028 -74769 483297 -195704 -119312 202042 42105 -217438 214312 59314
17815 14773 -74739 209054 -98780 -116701 -86237 -133905 112544 -205800 160071 -61024 -53719
17804e3719m2267D9826K72640b37557a02395j61295E388b13042B2025b77425f4425
17792c63564A38530J19748a6812A45841F6396J8838K01662a26187c8697l9474
17782g8171n2797I0334b23113B56979p6196K10928c8875j30648A22159a55820
17771g7092a7456A61434b54996A20623B2483P3035d5799J7578q8381b5917A87024
17759a0932A50485f2931G5179b67214B94752n4731G3386J05030R3358B351a9585
17747I6819a62392J938A3875J12072a08853H6873e0171A83350B8287a98099k7604
17736b25703g3515b1399A59868E0430H18b10115K9344l3386h4659a6987r5592
17725a12579e1167o2307m6788B70274C4714K08338J75015g9201D6212e1894B18729
$$ plain form
17804 -53719 -95986 49826 322466 -237557 -102395 -263690 5388 -213042 22025 -277425 -64425
17792 -363564 138530 258278 -16812 145841 66396 85234 286896 -126187 -38697 -78171
17782 -78171 -130968 90334 -223113 256979 180783 391711 -38875 -169523 122159 -155820
17771 -77092 -17456 161434 -254996 120623 22483 95518 -45799 -28221 -116602 -25917 187024
17759 -10932 150485 -62931 75179 -267214 294752 240021 73386 178416 271774 2351 -19585
17747 96819 -162392 -160454 13875 125947 -108853 86873 -50171 183350 28287 -198099 -225703
17736 -225703 -73515 -21399 159868 50430 818 -210115 -180771 -214157 -84659 -16987 -112579
17725 -112579 -51167 -113474 -160262 270274 34714 243052 418067 -79201 46212 -51894 218729
17713b16028L0622E5692B0518b6333A56542F393J80105m2157a91863B0018P4387
17702I4405i0993A50053N3852H2621b77092C00969A32041N8285J0348b4165k2296
17691d6461o1863H0984b2892j93550f5762B8829O3293a82469C36384b09858e6563
17679a78214A30681a613B36289c9164q1210A57956b5003A99888o7029K06154j56868
17668A82145F05L0240K48694a59559B36787H8212g1522B06382H1096A5017J93435
17657B08452b03578A14760M0692a30898H0238a5440B53554H257J77286I70b38765
17645c9457a6890k7515E101Q8877m3377a41152B20435G4062a00693J1264L4754
17634e4675I014a58572A97680m9242b2012C07387F3606f52A04045J74126A21673
$$ plain form
17713 -216028 -185406 55692 20518 -26333 156542 6393 186498 144341 -191863 20018 94405
17702 94405 -90993 150053 203905 82621 -277092 300969 132041 190326 200674 -24165 -46461
17691 -46461 -108324 80984 -22892 -216442 -65762 28829 92122 -182469 336384 -209858 -56563
17679 -178214 130681 -1613 236289 -39164 -120374 157956 -25003 199888 132859 339013 182145
17668 182145 605 30845 279539 -159559 236787 88212 -71522 206382 81096 15017 208452
17657 208452 -203578 114760 155452 -130898 80238 -15440 253554 8257 185543 970 -238765
17645 -39457 -16890 -44405 5101 93978 50601 -141152 220435 74062 -100693 -89429 -54675
17634 -54675 9014 -158572 197680 148438 -22012 307387 63606 -652 104045 278171 121673
17622A55216i5663L300B3433L34971b30659B9275b45227A27625E8657Q1964b651
17610g6341A69610Q7938a71200F8578a38287B38280N0822i3868C1725c9135D0868
17598a64163E7204c9602A29405Q5494a43357r3300a1428q1482J9242j5924A03961
17586a19292A59992O6630H8617l1221c4742C5996a68125c6343A42186B5045L7300
17575F2345L3209a41048A67046p4638e3580E6458a10596B36613D6135J85988e6685
17563a7809O379C14284b13260o0906G0888J01499a95169j16836B44027a2708A40778
17551d929n3566b7546G8716h7749j068c4771A62469A4543a7421B92725A6577O516
17539B3093a50491N9874B21312G697Q6625b07477B07824I9283m3252O6922J51097
$$ plain form
17622 155216 -95663 -92363 23433 358404 -230659 29275 -245227 127625 58657 140621 -2651
17610 -76341 169610 257548 -171200 68578 -138287 238280 289102 -93868 31725 -39135 40868
17598 -164163 57204 -39602 129405 214899 -143357 -236657 -11428 -92910 -73668 -89592 103961
17586 -119292 159992 226622 88617 57396 -34742 35996 -168125 -36343 142186 25045 62345
17575 62345 95554 -141048 167046 92408 -53580 56458 -110596 236613 46135 232123 -56685
17563 -17809 -11430 314284 -213260 -274166 70888 172387 -195169 -312005 244027 -12708 140778
17551 -4929 -58495 -27546 78716 -87749 -88817 -34771 162469 14543 -17421 292725 16577 23093
17539 23093 -150491 -90617 221312 7697 94322 -207477 207824 99283 56031 122953 274050
17528B74050N2038g8429A86582a32487A22765f7217B03769a788A62852k1578j8760
17517A22514P4497L9366F7810j6119L05671H6126a14623j9010a1679a501B26207
17505C09120R5422E234a72205L5534A4864K1131J46583L2978o1762n9735a38574
17493I9516d4918D42875C9953J7455K2225Q0188m9449K34017A1052b5885C2220
17481B78517j22235a71869k6754C2622P322J28307P6820A08181j3753N915B6607
17469b90521B56650k0162J35145A44754M8385L1213A00838g7197B25765a23273
17458C47014m8401l0122M4777j25451d3677m6739B3424d7800A98601J88584A57207
17446E7957J09244a1857B47902j10699J14410R9777j55823C9103M72538A99184
$$ plain form
17528 274050 326088 -78429 186582 -132487 122765 -67217 203769 -1788 162852 141274 122514
17517 122514 197011 236377 67810 51691 357362 86126 -114623 -133633 -11679 -1501 226207
17505 309120 404542 5234 -172205 -136671 14864 35995 182578 215556 153794 94059 -138574
17493 99516 -44918 442875 39953 57408 79633 159821 110372 344389 11052 -25885 32220
17481 278517 156282 -171869 -198623 32622 39944 168251 245071 108181 94428 100343 26607
17469 -290521 256650 236488 371633 144754 193139 224352 100838 -77197 225765 -123273
17458 347014 298613 268491 313268 187817 -43677 -90416 23424 -47800 198601 387185 157207
17446 57957 167201 -11857 247902 137203 251613 351390 195567 39103 511641 199184
17435A13539K20949k5158o365J42264J897j85765G2517K51288J14489B12747Q6498
17424B99245j396L6421J91389J00780A49474J36575J10917j5980j58715N24037
17414G46308B78193j2391j0301N7567f6717B35181O9309q0221K36107j51732r9915
17403B08729J03140J12078K9526j71762J6916J19267B3409R3647j7053J93164
17393B93167H1185J73808A2304R2757J60562k0151h368A43383M8128n4173J75712
17382C13050J37780g1716o0346A0698a12844C03734a2320B16949J66372c1193
17371A80785K7073d4331A93686H9581L8147e0001D03639A18562J25181n8192G3731
17359B85842I1864K50102l4024B4032J11772K60105B1625K09977n4622P0483p9127
$$ plain form
17435 113539 334488 309330 302965 445229 447126 261361 72517 323805 438294 212747 299245
17424 299245 297849 334270 525659 626439 149474 286049 396966 380986 222271 746308
17414 746308 278193 265802 255501 313068 -66717 235181 304490 224269 460376 308644 208729
17403 208729 311869 423947 453473 281711 298627 417894 23409 117056 100003 293167
17393 293167 81185 254993 12304 105061 265623 245472 -8368 143383 191511 137338 313050
17382 313050 450830 -71716 -132062 10698 -112844 303734 -12320 216949 383321 -31193
17371 180785 207858 -44331 193686 89581 127728 -50001 403639 118562 243743 185551 73731
17359 285842 91864 341966 307942 24032 135804 395909 21625 231602 176980 247463 168336
17348A68336M6368n7543M72349r3574A60345C6890Q3326m2415J0205e07B36827
17336A82356m9027n8578K23891j37299l8174F0470q5J21283p2508J67498A37030
17324B30363J22835n4314a63706P8154p5089A90096b7108A59391E9150M41637
17314E00787A17449l2179d2919A54532J3112j6762A5079K07075L29418k30370
17304C21202a32016l8136b8998C02224A15009b41940A5648J57939R0064c83151
17293C69942F5293Q048k2491R6093g5747C78221j72071K6308M18216A64807i5713
17281C06309l6144j08926K3474D7731N7042m2635L12798A47573J08447M01070
17271F57090A45757k2773D7279M18027a3516B26740L485I1873P0344L6585h1406
$$ plain form
17348 168336 214704 157161 629510 535936 160345 36890 120216 77801 88006 -507 236827
17336 182356 133329 74751 298642 161343 123169 60470 60385 181668 109160 276658 137030
17324 230363 353198 298884 -163706 -85552 -160641 190096 -27108 159391 59150 500787
17314 500787 117449 85270 -42919 154532 167644 150882 15079 222154 551572 321202
17304 321202 -132016 -170152 -28998 302224 115009 -241940 15648 173587 263651 -383151
17293 369942 65293 73341 50850 146943 -75747 378221 206150 232458 650674 164807 -95713
17281 306309 270165 161239 184713 47731 104773 62138 374936 147573 256020 657090
17271 657090 145757 122984 47279 465306 -13516 226740 230225 91873 162217 198802 -81406
17259g108A9615O0862a08138D16327j44360M0509E607K76502h4069c7226C16955
17247a9216N556K280p9446C64924C4257K46808p6767g1711B54792d9721A12675
17235E8525K01993d0947G9057Q6754J75054j60716P7772N3814h079l3305C87852
17223A82694D5673J39782J05391Q406a55293G1828J93715g7472G9684J30250M18751
17212F28685k62643j35673m2842L64379I739J34033e7304g204C01146F7504N915
17201G3419k2762J89275m7037n0563E0389K9255J08861j6393L78381A73829J51298
17190C25127j45796R4167n6123J74282A27833p93Q0162J04909A26866K71022G5144
17178B83506j02004q3912J9333K46070J6421B447J97818j4184D2370M4250N30003
$$ plain form
17259 -7108 19615 80477 -108138 416327 271967 312476 5607 282109 -84069 -37226 316955
17247 -19216 -13660 -11380 -90826 364924 34257 281065 204298 -71711 254792 -49721 112675
17235 58525 260518 -40947 79057 165811 340865 180149 257921 311735 -8079 -41384 387852
17223 182694 45673 185455 290846 299252 -155293 71828 265543 -77472 79684 209934 628685
17212 628685 366042 230369 187527 551906 9739 143772 -57304 -7204 301146 67504 73419
17201 73419 50657 239932 192895 142332 50389 79644 188505 172112 550493 173829 325127
17190 325127 179331 273498 217375 391657 127833 127040 207202 312111 126866 397888 75144
17178 283506 181502 97590 116923 362993 379414 2447 200265 186081 42370 86620 616623
17167F16623B13084r4434K05478A5365N54505A21833k7751M22071k08839l1085
17157B76229A27555K16952Q3612j73174k9028k6023m072l3654J6635K64922j77162
17146B66563J30241A27935L49055j83218n8422L53623j47672k15564j8372J02140
17136C09505K42653Q2989k30380r0699A35814M5820n7222O4522M31558B41628
17125F76658j86833K51234h8698C70732P7966L7096R4014B88861j7971K30513
17115E01403A83205J27307q0065K3661L726G6832j880J40907j2631M90782C29180
17103B25779N5366P2399J74787j70748r5111M15466C38545J68613k41628Q1161
17093C46691l336F9685L73677r7972J60653R278B26240L15272A45623L99062A42006
$$ plain form
17167 616623 213084 118650 324128 15365 569870 121833 94082 516153 307314 276229
17157 276229 127555 344507 428119 254945 225917 199894 195822 162168 178803 443725 266563
17146 266563 396804 127935 476990 293772 235350 588973 441301 225737 207365 309505
17136 309505 552158 635147 404767 314068 135814 181634 124412 188934 620492 241628
17125 676658 489825 741059 -88698 370732 448698 485794 579808 288861 270890 501403
17115 501403 183205 310512 230447 254108 257834 76832 74952 215859 203228 694010 329180
17103 225779 281145 353544 528331 357583 262472 677938 338545 507158 265530 346691
17093 346691 343355 69685 443362 345390 506043 515321 226240 541512 145623 544685 142006
17081F09899B16042K57625O5851J44174k78777p0719K5750j5545K34583j04434
17071D74550J31941k94986P8688O2403K53142j18355j69536J26639F6352L37091
17061D03443l3262j9497J01902J68397r7875j72158A66685M08358j8569j11502
17051D44972Q2300B28082N52405j82398J91878B39864J06199K59214K6107Q0160
17041G11544B28528N93854k90307l5681K30674k38826L45144m14225K28217o6337
17031E81041J24594l48509J56551Q9944J37300j6721j73880J62208j80651A69698
17020D58183n6831O27177l56638k70162j29655M81195k5246k37437K02040k11142
17010D81484O1848K26070j01898J17997m2358p1091m537q6841q8066K35403K95470
$$ plain form
17081 609899 216042 473667 539518 683692 404915 334196 359946 344401 578984 474550
17071 474550 606491 311505 390193 452596 705738 587383 417847 544486 66352 403443
17061 403443 370181 350684 452586 620983 523108 350950 166685 575043 556474 444972
17051 444972 527272 228082 780487 598089 789967 239864 346063 605277 631384 711544
17041 711544 228528 822382 532075 496394 727068 488242 833386 419161 647378 581041
17031 581041 705635 357126 513677 603621 740921 724200 550320 712528 531877 169698
17020 458183 401352 1028529 671891 401729 272074 753269 728023 490586 692626 481484
17010 481484 543332 769402 667504 785501 743143 672052 667515 580674 492608 728011 1023481
16999A023481m40640M88191m97176J29895P3449K28511k73509p311O5266k91678
16989D98479L04418j52427J70488l9006j1516R1910j12165j0867j43548J00694
16979F96460L71600m44992J70526K50409j41422p8731J02013J97340k56472K1196
16969H87927j58295K27612k9181J18778k20664K4595J04808m3912j9748k34978
16959F56942J18702K03476K74801m37165l4262L36578Q4017k60553j99713K72306
16949A015129N8721k8333j25797k9342L73579j47451q8898L36332j67141r9704
16939A097095J53460k49152j04055L2917L49193k87246L38802k33973P2599j30003
16929A039637q3732k3151L89138M0033k80429L6214N1188j62871K17865K19062
$$ plain form
16999 1023481 582841 1071032 573856 703751 777200 1005711 732202 724891 790157 498479
16989 498479 802897 650470 820958 781952 770436 862346 750181 739314 595766 696460
16979 696460 1068060 623068 793594 1044003 902581 823850 925863 1123203 866731 887927
16969 887927 729632 957244 928063 1046841 826177 850772 955580 911668 891920 656942
16959 656942 775644 979120 1253921 816756 782494 1119072 1203089 942536 742823 1015129
16949 1015129 1073850 1045517 919720 890378 1263957 1116506 1027608 1363940 1196799 1097095
16939 1097095 1250555 1001403 897348 930265 1279458 992212 1331014 1097041 1169640 1039637
16929 1039637 955905 932754 1321892 1361925 1081496 1117710 1168898 1006027 1223892 1442954
16919A442954j24953j01406P5042K2425O6897n9064J63862o0481k7780J33236
16909A530732J53540m52820L4505R0456q4768M27384r0928K48692j95791j77561
16899A483441L00624k33639K68383l6452j50394R3602R46r7089m8251K52075R6388
16888A929634j92210J96737j18146n8063K81150l90941J21555R9350Q5420K41528
16878B196014l26745Q0532k28741L80647K56561O5321k99247J20038J39354j60302
16868B223432o4925K9952L43442O7689k14397j27778L27770m6330l2142m0825
16858B465888k03839L41762J00266k68222O14397k76200O9750J28325n9093j7742
16848B895292J14690N3871L05748k00032L4022j48768J31108J5799L52626O7894
$$ plain form
16919 1442954 1318001 1216595 1291637 1314062 1380959 1321895 1485757 1425276 1397496 1530732
16909 1530732 1684272 1231452 1265957 1356413 1271645 1699029 1608101 1856793 1661002 1483441
16899 1483441 1784065 1550426 1818809 1782357 1631963 1725565 1726511 1629422 1581171 1833246 1929634
16888 1929634 1737424 1934161 1816015 1757952 2039102 1648161 1769716 1869066 1954486 2196014
16878 2196014 1869269 1949801 1721060 2101707 2358268 2423589 2124342 2244380 2383734 2223432
16868 2223432 2158507 2188459 2531901 2599590 2385193 2257415 2585185 2538855 2506713 2465888
16858 2465888 2262049 2603811 2704077 2435855 3050252 2774052 2843802 2972127 2913034 2895292
16848 2895292 3009982 3063853 3369601 3169569 3203591 3054823 3185931 3201730 3554356 3622250
16838C622250l75066R5572M93743l14844J95595J12782k31292N42694j01328j78266
16828C861840k12294m286L16953J26243L48747k67832K34511N00349j23438O3242
16818D844035J8388L03905l42383N67726j2947K3448K67646k07816j15197K03545
16808E550350O72171N7868J0844p557J67258K1058K56064j18024J99596R7565
16798F907193Q0580N66884n7188K30659J64090J51693N17516K9677Q3573J75546
16788H850223K94404R0458J70851N38654n636j5130R60237j5152J61309O05662
16778A1635880r705L44446M53584M48384O12746j68352M74138M01202K24392L85352
16768A4802067J150620j16841N67213N07522J121808L54522L68602P40590R07898
$$ plain form
16838 3622250 3247184 3342756 3836499 3521655 3717250 3830032 3598740 4141434 4040106 3861840
16828 3861840 3649546 3645260 3962213 4088456 4437203 4169371 4403882 4904231 4780793 4844035
16818 4844035 4862423 5166328 4823945 5391671 5378724 5402172 5669818 5462002 5346805 5550350
16808 5550350 6222521 6280389 6291233 6283676 6450934 6471992 6728056 6610032 6809628 6907193
16798 6907193 6987773 7554657 7497469 7728128 7892218 8043911 8561427 8591104 8674677 8850223
16788 8850223 9144627 9235085 9405936 9944590 9938954 9923824 10884061 10868909 11030218 11635880
16778 11635880 11626175 11970621 12424205 12872589 13485335 13316983 13791121 14192323 14416715 14802067
16768 14802067 15952687 15835846 16403059 16910581 18032389 18386911 18755513 19496103 20404001
16759B0404001P54332M79565P01683J050290O24358J215538M09668J225606J376371
16750B8241412R84665O82840J621377J237332J219298J499022J794437J603050
16742C8883433J875330J693160J754810K341468K419383K309070K567153K769333
16734E6613140K744632K999512L423062L144798M004898L992561M271134M424018
16726H5617755M096376N409582N201922N428933N734695N858384N747905O318691
16718A29414243O756902O109113O301977O280348N421173N728244N088330M236561
16710A75336891M029770K761192J882843J076844n75998j029105j849634l270804
16702A78361999l942064m402374n449831n732886n925416o374030o835757o443883
$$ plain form
16759 20404001 21158333 21637898 22339581 23389871 24014229 25229767 25639435 26865041 28241412
16750 28241412 29226077 29908917 31530294 32767626 33986924 35485946 37280383 38883433
16742 38883433 40758763 42451923 44206733 46548201 48967584 51276654 53843807 56613140
16734 56613140 59357772 62357284 65780346 68925144 72930042 76922603 81193737 85617755
16726 85617755 89714131 95123713 100325635 105754568 111489263 117347647 123095552 129414243
16718 129414243 136171145 142280258 148582235 154862583 160283756 166012000 171100330 175336891
16710 175336891 179366661 182127853 184010696 185087540 184511542 183482437 181632803 178361999
16702 178361999 174419935 170017561 164567730 158834844 152909428 146535398 139699641 133255758
16694A33255758o114111o711712o207120o152095n777181n740111n081085m946408
16686H6525935m646133m359584m470925m218293l327854l633414l332996l229482
16678E5307254k492426l085940k174776k287248k328936k043242j581093k048168
16670C7265425j568863j442881j763954j358065j410780j066601j209646j125153
16662B6319482j038107p76977j129845q50639p85268q78633q43208o47001n58135
16653A8811669n42535o03339o24243n62115o56436o08757o09836l75218j28869
16644A4100321n94424r5859q60742l48278K1284n62197m58674j93940m89971k18301
16634A0299219k62372J229o19036L49714k99336k78200l43491k28134k21670l39139
$$ plain form
16694 133255758 127141647 120429935 114222815 108070720 102293539 96553428 91472343 86525935
16686 86525935 81879802 77520218 73049293 68831000 65503146 61869732 58536736 55307254
16678 55307254 52814828 49728888 47554112 45266864 42937928 40894686 39313593 37265425
16670 37265425 35696562 34253681 32489727 31131662 29720882 28654281 27444635 26319482
16662 26319482 25281375 24504398 23374553 22523914 21738646 20860013 20016805 19369804 18811669
16653 18811669 18269134 17665795 17041552 16479437 15823001 15214244 14604408 14229190 14100321
16644 14100321 13505897 13410038 12549296 12201018 12222302 11660105 11201431 11007491 10517520 10299219
16634 10299219 10036847 10038076 9419040 9768754 9469418 9191218 8847727 8619593 8397923 8058784
16624H058784j27763j04413m96674K04590m93354J3597j82891J98024r4002p59483
16614F216415K48450k52670k18056K9522Q7742m12130k47746k6855l7528N3413
16604E440557l82363J09711k37762j20037n1374l02462K45983j40045K07176l67170
16594D402214M3127l34753K48825m90684j25186O5034L50878J4678p40933N30666
16584C963866n41048J57591r3122L64902q5650m87597J84543k63629K1074n8214
16574C162716M7937k28592J47897j15354L0013j64923k59225K22317J8060k89248
16564B571598q9968L79670m10325P4652R5932q4130j77820J46659J92290k63639
16554B434919j08911p6362k66882N32894n55088j58506O28048k11418j72889K18908
$$ plain form
16624 8058784 7931021 7826608 7329934 7534524 7041170 7054767 6871876 7069900 6975898 6216415
16614 6216415 6464865 6212195 5994139 6023661 6111403 5699273 5451527 5424672 5387144 5440557
16604 5440557 5058194 5167905 4930143 4810106 4758732 4456270 4702253 4562208 4769384 4402214
16594 4402214 4445341 4110588 4359413 3868729 3743543 3808577 4159455 4174133 3433200 3963866
16584 3963866 3422818 3580409 3487287 3852189 3766539 3278942 3463485 3199856 3220930 3162716
16574 3162716 3210653 2982061 3129958 3014604 3044617 2879694 2620469 2842786 2860846 2571598
16564 2571598 2481630 2861300 2450975 2525627 2621559 2537429 2359609 2506268 2698558 2434919
16554 2434919 2326008 2249646 1982764 2515658 1960570 1802064 2430112 2218694 2045805 2264713
16544B264713k73372K2920o6108p3337K44173N5559k68725q0023K54023k87787
16534A792036L44460j94635k0732j13921J90528m74962N1025j3159K43218k31189
16524A572669q6053l4K60720j84156K14088o17391J17007J97140J37238j97902
16514A413326J02585l8506q7162l94959N79499j32816J7081n38683L12628Q1412
16504A314405j71983o4071L53069o88324L22040j58937M61846M2329m02935l3182
16494I74257N1521J43100K76764k72182j93430l57845P65756m08975K92561n8993
16484A212534k28k49405m139K3267k34631m4589L54727Q7343k41117J16584J08203
16473A128549o8853J8898j42446k27167K36613j05822J24506j01660J52708k52720
$$ plain form
16544 2264713 1991341 2014261 1948153 1874816 2118989 2174548 1905823 1825800 2079823 1792036
16534 1792036 2136496 1941861 1921129 1807208 1997736 1522774 1573799 1560640 1803858 1572669
16524 1572669 1486616 1486582 1747302 1563146 1777234 1159843 1276850 1473990 1611228 1413326
16514 1413326 1515911 1477405 1390243 995284 1574783 1441967 1459048 920365 1232993 1314405
16504 1314405 1142422 1078351 1431420 743096 1065136 906199 1368045 1410374 1007439 974257
16494 974257 1025778 1168878 1445642 1173460 980030 622185 1387941 978966 1271527 1212534
16484 1212534 1212306 962901 958762 982029 747398 702809 1057536 1144879 903762 1020346 1128549
16473 1128549 1059696 1078594 936148 708981 945594 839772 964278 862618 1015326 762606
16463G62606j46152P082K97010k22094k45628J58140M42679m6182j60366k41911
16453F05184Q9178R7385J29191k01839L5442k83928K67554M2670R2167j35767
16443G37237O4631K66314k63943q3627J94931q5361l4084P2374j2441k54562K87769
16432H89238k65019K36007K38685k56400k85195K18892o3470A80426M01694k26144
16422C55976K07979M4133J6715B43905N70062D01784O1336K48378j77168p6064
16412D58266q0613J94857L1484k6952j34216K38665k25121J95378P4493C14325
16401E23840N0516j26685L45873l82405L38833o248k31290L19547C20978K38322
16391E59300K2363k5643k62978J56985L1588A77475N62049j49929f238D68144
$$ plain form
16463 762606 616454 623536 920546 698452 452824 610964 1053643 1007461 847095 605184
16453 605184 694362 791747 920938 719099 754541 470613 738167 780837 873004 737237
16443 737237 801868 1068182 804239 720612 915543 830182 796098 868472 856031 601469 889238
16432 889238 624219 860226 1098911 842511 557316 776208 712738 180426 582120 355976
16422 355976 563955 608088 624803 243905 813967 401784 463120 711498 534330 458266
16412 458266 377653 572510 603994 577042 442826 681491 456370 651748 726241 314325
16401 523840 574356 447671 793544 411139 749972 743724 512434 831981 320978 559300
16391 559300 581663 556020 293042 450027 481615 177475 739524 589595 -6238 468144
16380C39440M55548C24545J64294P474j95583q3579P6274K87797j42107A98872
16369B57007J92919M8975j84633J23468j19820q1319O39058C66159L45978B51159
16358F38025D9945J22355M22338K7821g9441E82843j57836q5070A15980J27601
16348B43581R1634K02736j99246J41068j73189K52412k17183o3003O4348J43411
16338D86569R204k26616a488D20118o9171L6937J28289r6652k0167J3594K95753
16327G08701l32806k8565Q500j21681p5040K74014O5114j76719Q3735A93560E1443
16315F88876l29115J9903i1149D92614A50460K59680m908j64643j9743L61618
16305E82464N3379k87203A20883j8407r658J62522n7138r4335Q850R8942J47540
$$ plain form
16380 339440 794988 324545 488839 496313 300730 217151 293425 581222 439115 198872
16369 257007 449926 498901 314268 437736 317916 236597 875655 366159 712137 251159
16358 638025 49945 172300 594638 622459 -79441 582843 425007 339937 115980 243581
16348 243581 335215 537951 338705 479773 306584 558996 341813 278810 343158 486569
16338 486569 495773 269157 -1488 420118 350947 387884 516173 419521 399354 412948 708701
16327 708701 375895 347330 355830 234149 159109 433123 498237 321518 405253 193560 51443
16315 688876 359761 379664 -91149 492614 150460 410140 405232 240589 220846 582464
16305 582464 635843 348640 120883 102476 92818 255340 198202 103867 112717 211659 359199
16294C59199N7263j20435J07939j34165M11394H807K48388r0630A3005K84829
16284B97834O3969k341F4250M13762k00474K05748d1152D46174P9449A73356J72075
16273C45431A36482J52970j38176O9361L49513k40987B4848J00882C7171R3874
16263A31045n0603N1365J74142L9787j40720K18556q5197q7818J25456b9038B17738
16251B39141J89897l4387f5603D24485n0484E8689J02018m0627J66758o7409m5318
16240A74111h450D47880A65729k5826J78137m9821a7743A67713J79357J9206a69613
16228A73669k5931i3171H267L34527A56941A8864k124M08921d3441A49307K3057
16217A72364j6806N7013B6380J85135L3785I0440a7311A34932L09133G8344K5100
$$ plain form
16294 359199 416462 296027 403966 269801 681195 8807 257195 166565 13005 297834
16284 297834 361803 359462 64250 478012 277538 483286 -41152 446174 525623 173356 345431
16273 345431 136482 289452 151276 220637 570150 329163 24848 125730 37171 131045
16263 131045 80442 131807 305949 345736 205016 423572 338375 250557 376013 -29038 217738
16251 239141 429038 394651 -65603 424485 374001 58689 160707 120080 286838 219429 174111
16240 174111 -8450 447880 165729 139903 318040 268219 -17743 167713 347070 366276 -169613
16228 173669 147738 -93171 8267 342794 156941 18864 16740 425661 -43441 149307 172364
16217 172364 155558 212571 26380 211515 245300 90440 -17311 134932 444065 78344 103444
16206A03444d4662B11812A02371J00728q9920J26226j17056c06066D09852I5998
16195a25881q6387k318C0314J93754E885J58011J09313J15929j03549m9996o1406
16184A74187B6006c02026B79648j11682M2103J02102l3595C0640K86738G8247
16173D74J35777a43249C4434Q6644J23616G887J10885l4345L33741a0995A44841
16161b6222B15651j9791O2110e7742D68663a55096B51343m710D1818J1248B5429
16149A35621K6766R4924H9570K6485J03435a1342B41480F8610f4676C73238j21102
16138B52136c04428A83705o0783K65821a7969j31945C44656i6484j50920c3032
16127b13765B63479j7047j00550g9913c1095A48027a51816q5174J13846p9380
$$ plain form
16206 103444 -44662 211812 102371 203099 113179 239405 122349 -306066 409852 95998
16195 -125881 -212268 -214586 30314 224068 5885 163896 273209 389138 285589 235593 174187
16184 174187 26006 -302026 279648 167966 210069 312171 278576 30640 317378 78247
16173 474 136251 -143249 34434 121078 244694 7887 118772 84427 418168 -10995 144841
16161 -26222 215651 195860 257970 -57742 468663 -155096 251343 246633 41818 53066 25429
16149 135621 162387 257311 89570 116055 219490 -11342 241480 68610 -64676 373238 252136
16138 252136 -304428 183705 122922 388743 -17969 -149914 344656 -96484 -247404 -33032
16127 -213765 263479 246432 145882 -79913 -31095 148027 -151816 -236990 -123144 -202524
16117b02524C04646B4915I696J95131r6288l2185a85451A6965J78706C7079d6928
16105D52300a99349B11876b67236C6947M8756b89014e1022A90674Q1260C4429
16094G5378J65225c9104C30828a00400A13913J9774a08844A02329J18368H4069
16083b67716f8308B50782D6349K94962g6375L4076A60172A5196J96049N4540c0441
16071C21254A60120C3738n438b08195B35564A9692I011h6257j75620A04571m2368
16060F2203p97B3045a50886P3806c6337J6981B86432d2913B76236a11566b1065
16048F8810B2534K9878Q7101M3933B578c18381I4846Q5000B5418M9694K07506
16037B82618h8324l6299E8465A7305K3970b64662P4551A41945a47141H8285b0956
$$ plain form
16117 -202524 304646 24915 9696 204827 108539 76354 -185451 16965 195671 37079 -46928
16105 452300 -199349 211876 -267236 36947 85703 -289014 -51022 190674 271934 34429
16094 75378 240603 -39104 330828 -100400 113913 133687 -108844 102329 220697 84069
16083 -267716 -68308 250782 46349 341311 -76375 -42299 160172 15196 211245 265785 -30441
16071 321254 160120 33738 28300 -208195 235564 19692 9011 -86257 -261877 104571 62203
16060 62203 61406 23045 -150886 -77080 -36337 -19356 286432 -42913 276236 -111566 -21065
16048 68810 22534 52412 139513 183446 2578 -318381 94846 179846 25418 75112 282618
16037 282618 -88324 -124623 58465 17305 41275 -264662 -190111 141945 -147141 88285 -20956
16025c19165h1748o001L6047D5030c66032B28461o2803f3960j48325A15965b13720
16013a23754p3427L2231e3206j17237g7832j14274p2419J15734O7965C07804G874
16001a41619d5508j12381g7958a6112k2620A51811o7172O9998B334b49745c9637
15989b5822B5509N1498a48284q26B43768a56898B39327a74490k19153G3230a54944
15977A58088a87891D8275J02831o7563k7710a4193q3847A21564d4914B30649c9814
15965C08691C2536R6140h5195C48739h6749p2911B93457e8922n8330N7593K3192
15954c6467k58386J8291f5007k19057B05668a70673g7796H6235a44250C63694
15943H9034a02894M1662A15459O4853A8655G469c84288c5241l8955l2745p5591
$$ plain form
16025 -319165 -81748 -87749 -51702 45030 -366032 228461 165658 -63960 -212285 115965 -213720
16013 -123754 -197181 -164950 -53206 -170443 -77832 -192106 -264525 -148791 -80826 307804 7874
16001 -141619 -45508 -157889 -77958 -16112 -38732 151811 84639 154637 2334 -249745 -39637
15989 -25822 25509 77007 -148284 -149110 243768 -156898 239327 -174490 -393643 73230 -154944
15977 158088 -187891 48275 151106 83543 55833 -14193 -98040 121564 -44914 230649 -39814
15965 308691 32536 128676 -85195 348739 -86749 -159660 293457 -58922 -117252 -59659 -36467
15954 -36467 -294853 -276562 -65007 -284064 205668 -170673 -77796 86235 -144250 363694
15943 89034 -102894 -61232 115459 180312 18655 7469 -384288 -35241 -74196 -106941 -182532
15932a82532e8115G7538l0956I294J72154j9011b15608b6949B35031i7633a2506
15920a01619C5659K1824b45714i5016C02201b31940R1053H076b556B15912a21695
15908a04659A55476G231J16393J87022I0490a99365J6742D5076P7795b52570A0058
15896a63852g4486C05050c8553k8805A83375J2080h563p4270A35297b60075A0346
15884g7335A31787B0684b47422g7218k20602B42502q6053G1040b93849J33684
15874a60165A65455a12781A80535E5374e3263B75441d80070A37279R6450b13025
15863B48106a38892A65726G282b0200n1114c1133K223A68760f9183D2266J25097
15852A67363g7159J6236n1241A06893b4591l0939I1019b15272d4713A44370J2742
$$ plain form
15932 -182532 -58115 77538 46582 9294 181448 162437 -215608 -26949 235031 -97633 -12506
15920 -101619 35659 57483 -245714 -95016 302201 -231940 -140887 8076 -2556 215912 -121695
15908 -104659 155476 7231 123624 310646 90490 -199365 -182623 45076 122871 -252570 10058
15896 -163852 -74486 305050 -38553 -67358 183375 195455 -8563 -82833 135297 -260075 10346
15884 -77335 131787 20684 -247422 -77218 -297820 242502 156449 71040 -293849 -160165
15874 -160165 165455 -112781 180535 55374 -53263 275441 -480070 137279 233729 -213025
15863 248106 -138892 165726 7282 -20200 -71314 -31133 -28910 168760 -69183 42266 167363
15852 167363 -77159 -60923 -112164 106893 -24591 -55530 91019 -215272 -44713 144370 157112
15841A57112E1828c29376e0904k44356a1567n8381D8427c12022f6925o9394M4186
15830i2133c0316k36896A9272L8352b5504j14058A72559d1379A20143D098K4792
15819B8890a93124k9822A48732a37828b2245l05901c350G4183a74190f6348q4029
15808a50377j20763A28692d49605R4677g8568j84388b6802C31506A3889N6718
15798G0607a1808l5558A56788E5174K6504a16708A12130b01968J3963B53437a90370
15786c3123M02j71250O1076E7589J80893k3782a39534l0519o6321a8971E7833
15774H023g4727b1540j66856e1096r6606r0924k13496A866K6653L8578l1265b90233
15761h124l2925E2008L473b560l2520B226J48010a27316L425q2180B8156a78466
$$ plain form
15841 157112 51828 -329376 -50904 -295260 -11567 -69948 48427 -312022 -66925 -136319 -92133
15830 -92133 -30316 -267212 19272 57624 -25504 -139562 172559 -41379 120143 4098 28890
15819 28890 -193124 -222946 148732 -137828 -22245 -328146 -3350 74183 -174190 -66348 -150377
15808 -150377 -271140 128692 -449605 -354928 -78568 -262956 -26802 331506 13889 70607
15798 70607 -11808 -47366 156788 55174 81678 -116708 112130 -201968 -188005 253437 -190370
15786 -33123 -32721 -203971 -142895 57589 238482 214700 -139534 -170053 -236374 -18971 57833
15774 8023 -74727 -21540 -188396 -51096 -147702 -238626 -452122 1866 28519 67097 35832 -290233
15761 -8124 -41049 52008 55481 -2560 -35080 2226 150236 -127316 -123891 -206071 28156 -178466
15748b3704j83341h4951J0983F1415d1800A79113a59389E2631K19786c32525A56260
15736h9328I1961D2542a83725e7991B266c6038A36399Q7089q3087n6892r862b75595
15723a27504C4569J9772K02745b93233F211a24602J9221A9903J73468E3522J0587
15712F4109l434K2731B3751R4879a04624j10571g0735A21045J088R4060Q0870
15701B97063b14581R9058J1690c0608j4285j28885M4060J4251B34515a9272A77560
15689a85178D9153g1452G1299f0683B68185g049r8653j82694a40251K9744d8091
15677c54363C9716b6031H074a81955A85893i8832k8580c7754j35953r6287b5770
15665a55672C9759K01799G4557K33380j33716e3729a2572j91118C2913P6263a39994
$$ plain form
15748 -23704 -207045 -84951 -73968 61415 -41800 179113 -159389 52631 272417 -332525 156260
15736 -89328 91961 42542 -183725 -57991 2266 -36038 136399 223488 140401 83509 73647 -275595
15723 -127504 34569 54341 257086 -293233 6211 -124602 -105381 19903 193371 53522 64109
15712 64109 60675 83406 23751 118630 -104624 -215195 -70735 121045 122133 216193 297063
15701 297063 -214581 -115523 -103833 -30608 -44893 -173778 -129718 -115467 234515 -19272 177560
15689 -185178 49153 -71452 71299 -60683 268185 -7049 -105702 -288396 -140251 -110507 -48091
15677 -354363 39716 -26031 8074 -181955 185893 -98832 -127412 -37754 -173707 -269994 -25770
15665 -155672 39759 241558 74557 307937 174221 -53729 -12572 -203690 32913 109176 -139994
15653a14861l4422a499n1838N599C67146a53358D6306J26879M9630e5169A22441
15641e8980k01598J30020G982h7976k79458g5825B05645a68007l3212l8646F5594
15629a32084M6974E3561J32197c55423a33687C0940a39709E163a49015M7257k27440
15618c29198h9951B24640i1958A45433g4728A71459b17174a2010j12990P815j43546
15607b60731c9755q8357N0618k637o770b4325A55236k9007L4698b99138C3090
15595b09470a8177A82514J576a82220m0691C2269i7595p230A78381e8551J4190
15584d4361A26436d7175H4587a28706c3814r9464e4980F5397J78813A323b21987
15572B54377c2106k70914B87171E4156L4123N8053J15690G5523h2301a3551r4731
$$ plain form
15653 -114861 -149283 -1499 -53337 -47738 367146 -153358 46306 173185 222815 -55169 122441
15641 -58980 -260578 -130558 7982 -87976 -367434 -75825 205645 -168007 -201219 -239865 65594
15629 -132084 -85110 53561 185758 -355423 -133687 30940 -139709 5163 -149015 -101758 -329198
15618 -329198 -89951 224640 -91958 145433 -74728 171459 -217174 -12010 -125000 -117185 -260731
15607 -260731 -39755 -128112 -77494 -80131 -86901 -24325 155236 126229 160927 -299138 33090
15595 -209470 -18177 182514 184090 -182220 -222911 32269 -97595 -104825 178381 -58551 -44361
15584 -44361 126436 -47175 84587 -128706 -33814 -133278 -54980 65397 244210 1323 -221987
15572 254377 -32106 -303020 287171 54156 88279 146332 262022 75523 -82301 -13551 -108282
15561a08282j05079B71602d4957b224F8843i9358J7131l3133j92770O2067g8361
15549i5129b5835k82732A10934L1923D5257M3689b10653i0391k66548a6703A02469
15537a48284k20190h2886A60599d7582A9311b71667F1667a56189B69277J55849
15527D25126A00123R873b32363M226P3645A32757c0699k636A89558h0643c5283
15515g8343B75852o4302a4509N168B86947c601I5822a86632Q9202A6286P8912
15504I5198f2303B67912C7444P3785l9841j1873J08818a11572c0864B58693A049
15492C5104K1519O457J5581a45904I3306J33878m9037d4934K2061j19009H2930
15480A516M603L56990a01907C7448J86248r0755l9772j7823i8093A01608a39295
$$ plain form
15561 -108282 -213361 271602 -44957 -2224 68843 -99358 -82227 -115360 -308130 -246063 -78361
15549 -95129 -25835 -308567 110934 142857 45257 88946 -210653 -90391 -356939 -16703 102469
15537 -148284 -368474 -82886 160599 -47582 19311 -271667 61667 -156189 269277 425126
15527 425126 100123 109996 -232363 -228137 -154492 132757 -30699 -33335 189558 -80643 -35283
15515 -78343 275852 211550 -14509 -9341 286947 -3601 95822 -186632 -97430 16286 95198
15504 95198 -62303 267912 37444 111229 71388 59515 168333 -111572 -30864 258693 1049
15492 35104 56623 63080 78661 -145904 93306 227184 178147 -44934 -22873 -141882 82930
15480 1516 6119 363109 -101907 37448 223696 132941 93169 75346 -98093 101608 -139295
15468A49260Q6821b2286A63950B1404g6752B2355J82212K7211n6868L2503m0899
15457A66514b19554A09976K04393j52678A8115f5091A02444a44017A23923L8253
15447A62176G525g2736j02379j06475B02546a16508K787D1800j455a31825A06271
15435d9082A44142c57867A72265f3350J3670E8353J556G751M9719J7974b94966
15423a685k28566A55302k0812j9625c10r7982n7764B23338c8073m346A11631c9108
15410A33817b34378J5330d1355j54110I1645a29488q6325n3182A63271C9554L2231
15399G1785L6046c63071J62764B430J8631J45685d5135j18386D422c28472A42991
15387a25381A13817a13157F359K01435A2790K4613b05370d1024C93276b14628
$$ plain form
15468 149260 236081 -22286 163950 21404 -76752 22355 204567 231778 174910 207413 166514
15457 166514 -219554 109976 314369 161691 18115 -65091 102444 -144017 123923 162176
15447 162176 7525 -72736 -175115 -281590 202546 -116508 -113721 41800 40345 -131825 106271
15435 -49082 144142 -357867 172265 -63350 -49680 58353 59909 7751 57470 75444 -294966
15423 -1685 -230251 155302 134490 114865 -310 -98292 -156056 223338 -38073 -42419 111631 -39108
15410 133817 -234378 -219048 -41355 -195465 91645 -129488 -215813 -268995 163271 39554 71785
15399 71785 107831 -363071 -200307 2430 21061 166746 -45135 -163521 4422 -328472 142991
15387 -125381 113817 -113157 6359 207794 12790 37403 -205370 -41024 393276 -214628
15376A29256L402B6450L006Q1368a53818I4039N0163o5018M4636a24875D9950
15364C03843a83562j02933R8458F9617f6548o7489A98884A341L8021Q363a0000
15352c5462j88652B16135a58803D94047c99838G2745g3959E9458e9427l34890
15342c94317A91369I823d5187J9454E9075M03961c78968b7183C1102a21965k33094
15331c55059a46866b1835I2969J80752h8758a8616j80741A97062a87628C00865
15320c69200F2856K38610a60729A53370G5335i8607A37071b5641A0818J11968
15310A22786e6344A38579a54114B60754a47101D9569b13338a00663A8463B984
15299A53148m7817R1621r3399L0550K20406c8973J7183j53966D9993J59613J6720
$$ plain form
15376 129256 132658 26450 29456 110824 -153818 94039 144202 79184 123820 -124875 49950
15364 303843 -183562 -286495 -188037 69617 -66548 -134037 198884 1341 39362 47725 -10000
15352 -35462 -224114 216135 -158803 494047 -399838 72745 -73959 59458 -59427 -394317
15342 -394317 191369 9823 -45187 -25733 59075 463036 -378968 -27183 31102 -121965 -355059
15331 -355059 -146866 -21835 92969 273721 -88758 -18616 -199357 197062 -187628 300865
15320 -369200 62856 301466 -160729 153370 75335 -98607 137071 -25641 10818 122786
15310 122786 -56344 138579 -154114 260754 -147101 49569 -213338 -100663 18463 2984
15299 153148 105331 196952 103553 134103 354509 -38973 -21790 -175756 49993 209606 226326
15288B26326r7215n2979i7417b2514j07550C37186c35329F2048a6203j95400i439
15276G4642P4061e7562B03519C9886d8996m5409I5884l9848a85264A53885a15149
15264A96728E0963d4522D37010B1283K63803A42514e7735G5537N1395i3490B57003
15252B75716L9031h4377H427M0838K36124a79532A31598L86429a27019C14118
15241e9758D37443A41690a73533C10216N2797J18417j95307L50424K30833P16358
15231A583738M11675m52744M91966r42521l86370j66657j33852n8960A59853b41428
15220C8807b52455A26309b9690m861A39450M641h1899a2395C23916N5071d5148
15208A50836C1882c2991A34311e8554E6764O1948g4223p8344a1734A48341i7532
$$ plain form
15288 226326 129111 76132 -97417 -22514 -130064 337186 -335329 62048 -16203 -211603 -9439
15276 74642 148703 -57562 203519 39886 -48996 -94405 95884 56036 -185264 153885 -115149
15264 196728 50963 -44522 437010 21283 285086 142514 -57735 75537 126932 -93490 257003
15252 275716 314747 -84377 8427 49265 285389 -179532 131598 518027 -127019 314118
15241 -59758 437443 141690 -173533 310216 363013 481430 286123 636547 867380 1583738
15231 1583738 1995413 1542669 2034635 1092114 705744 539087 405235 346275 159853 -241428
15220 38807 -252455 126309 -29690 -34551 139450 144091 -81899 -12395 323916 378987 -45148
15208 150836 31882 -32991 134311 -58554 56764 118712 -74223 -152567 -11734 148341 -97532
15196B68813j07543K6011n270a14264b0561B10303R7912A40971a7209I2537C0515
15184C26419j12523r0281g5673A32963l9436b01916c7090I4240R1290b65790E4322
15172A68335j3139a39125A15095C4213c57430A37253D6001N44298B08893m8690
15162A60203C6224Q5842R4826h4286B41422j3158O6031m5181B7816d7697D93725
15150A84544J04499j12870b0225F4523J27022g5765L0294D3556R5237h6380A62460
15138A12181N6143G5738h9784B24322a16071I4161K31463A38756J65015G1259
15127a29119B25187a24753A57094k2260K3583b36386A23968J13592L98156B34909
15116C23651J78610k6462m2155E0136d1378B33653H1183g2889j4334C15695f8911
$$ plain form
15196 268813 161270 187281 182011 -114264 -20561 210303 308215 140971 -17209 92537 30515
15184 326419 213896 123615 -75673 132963 93527 -201916 -37090 94240 185530 -265790 54322
15172 168335 155196 -139125 115095 34213 -357430 137253 46001 590299 208893 160203
15162 160203 36224 122066 216892 -84286 241422 228264 294295 249114 27816 -47697 493725
15150 184544 289043 176173 -20225 64523 191545 -75765 -45471 43556 138793 -86380 162460
15138 112181 168324 75738 -89784 224322 -116071 94161 325624 138756 303771 71259
15127 -129119 225187 -124753 157094 134834 158417 -236386 123968 237560 635716 234909
15116 323651 502261 475799 433644 50136 -41378 233653 81183 -72889 -87223 315695 -68911
15104D44225l2366j99568D3126L91801B1104L30710q0902E8887N0375a32104A96520
15092A69478a05819A93335c89706f1897b436j07277M0687I4533g9330c6847D13317
15080A52910J17832b8788B42580k1189E7180J10345K22191G2897R2386K9510J5130
15069B09923b06404L2198C46902j35592B218J89136L0436J98705a53150A47463
15058A98910K35815B07420A2821K26183J08786g1003A92595p7460k6436M3125
15048A31824J96686F7772K23642C4932d7104D362K92183J5160q2646L44093g7837
15036B51542o7491H0698K63935f3613D37648j58761a09152B46542J49763A14205
15025D34598P2286b7435C49611j24642P5441j47481A6568K38431a7431A3648a05776
$$ plain form
15104 444225 411859 212291 43126 434927 21104 351814 270912 58887 109262 -132104 196520
15092 169478 -105819 193335 -389706 -61897 -2436 -109713 -69026 94533 -79330 -36847 413317
15080 152910 270742 -28788 242580 221391 57180 167525 389716 72897 165283 194793 209923
15069 209923 -206404 -174206 346902 211310 2218 191354 221790 420495 -153150 147463
15058 198910 434725 207420 12821 239004 347790 -71003 192595 115135 88699 131824
15048 131824 328510 67772 291414 34932 -47104 4362 296545 311705 229059 573152 -77837
15036 251542 184051 80698 344633 -63613 437648 278887 -109152 246542 396305 114205
15025 434598 506884 -27435 349611 224969 300410 152929 16568 254999 -17431 13648 -105776
15013B14436r2049n8968k9606K52869K49336b5957J1087A160P7878N7661L61868
15002D98567k40248K46446Q821c157G9064a24414C33241A35248a96814I4247J76324
14991B70571r369J98881B3261M2405K07540J98424B12140M1027e4574B56475J36918
14980C93393j76253d726C42308l9229F8095J75854M6462q6863C1001L13506N0251
14969C94758E8110d9779C18858r7349Q6044H6898J32933E0684P8088J82501O8213
14958C79486o1385e2291q2350A59818J64537j51176J16358o6328K29377j48324
14948C04262q2217k5281G4977B5671L17866K42667k92937A41197J7317G8668L12824
14937C91492R2438B12615j02303K37478l4671l1889j6482J35163J43620k27141
$$ plain form
15013 214436 122387 63419 33813 286682 536018 -25957 -14870 1160 79038 136699 498567
15002 498567 258319 504765 513586 -3157 79064 -124414 333241 135248 -196814 94247 270571
14991 270571 261202 460083 23261 65666 273206 471630 212140 253167 -54574 256475 393393
14980 393393 217140 -4726 342308 303079 68095 243949 290411 203548 31001 344507 394758
14969 394758 58110 -49779 318858 221509 307553 86898 219831 50684 128772 311273 379486
14958 379486 318101 -52291 -134641 159818 324355 173179 289537 223209 452586 304262
14948 304262 222045 196764 74977 25671 343537 586204 293267 141197 158514 78668 391492
14937 391492 483930 212615 110312 347790 313119 281230 264748 399911 543531 316390
14927C16390O2571j16198J89532o871A07555J65046J35281j64212P2464l4509
14917B81625J3494L63269r3843k2476k19101J59494B33201K14867A45997J17518
14907B63515k2974O5961j49155L9312J80910l8993J87560A97809M05510A70385
14896F0660M82867B67974J31998A98275O5467P0961o8816k7331P0087n0861M23508
14885F81290C32380M04416k42872j82831P60L4295j115j55047J06792K9693J35189
14874D61660a81948B34556J5339J32985E5873L12914n5571j26435J91037J19480
14864D97298o9416q7829j15398L84978p2902r5424m7016j39416N1103j14226L49082
14853E40834p933m1933B34927K24804R6975C3878P40421l19394K40290j21229
$$ plain form
14927 316390 378961 262763 452295 445424 107555 272601 407882 243670 316134 281625
14917 281625 295119 658388 564545 542069 322968 482462 233201 448068 145997 263515
14907 263515 240541 306502 157347 196659 377569 338576 526136 197809 603319 170385
14896 60660 543527 267974 399972 198275 263742 334703 265887 238556 308643 257782 681290
14885 681290 332380 736796 493924 311093 311853 346148 345033 189986 296778 326471 461660
14874 461660 -181948 234556 249895 382880 55873 368787 313216 186781 377818 497298
14864 497298 427882 340053 224655 609633 536731 441307 394291 254875 305978 191752 540834
14853 540834 532901 490968 234927 459731 556706 33878 774299 454905 695195 573966
14843E73966k02462P6284J12893j97427j2802N2922A15511N92804J29020k21311
14833F16024B35855N7375R6460L52676o7040j51918B17108M16363n0689k52238
14823C30544M18591n4567l11361O548n4330K44311j23363R7576M8235k57243r0379
14812B54562K43025m3530K04775B21721J99409J3470J57989j3006J3801J20128
14802G13512q8596j00074k53538M46794k51306O9188J15356J72656C88916J35340
14792E24256j4807M04142D24656J40537j14107m2503M35258l44180j41499O4298
14782D22460J72421q6890j53869J24308L21961j82162n0759j97387j72779M73227
14772F70531n5315J41455C27763L85031j31138q3831K18436o2398k12793r2386
$$ plain form
14843 573966 371504 447788 560681 363254 350452 403374 115511 708315 837335 616024
14833 616024 235855 293230 389690 742366 675326 523408 217108 633471 582782 330544
14823 330544 749135 694568 383207 389755 335425 579736 456373 553949 602184 344941 254562
14812 254562 497587 454057 658832 221721 421130 434600 592589 579583 593384 713512
14802 713512 624916 524842 271304 718098 466792 535980 651336 823992 388916 524256
14792 524256 509449 913591 424656 565193 451086 408583 843841 499661 358162 422460
14782 422460 594881 507991 354122 478430 800391 618229 567470 370083 197304 670531
14772 670531 615216 756671 327763 712794 581656 497825 716261 653863 441070 348684
14762C48684J28523r368L21268j74426J1872k1132j32720L83003k02527k49557
14752D03620L72049C32118L95784K98739k13706q1579L28935m82331j52568K20267
14742F45659k41694L17308o7777K11203k95071K59003l21368R2330j39588K67572
14732G27577P6499K1658k68614P8878K5683N7435Q9489o2562j00668L5502K37317
14721I18194k79201J94546k24269M9311O8645J23418J94842k14504j94511L19496
14711I55967l0854m22708J02381j3049L60321j67269j96469M59043m55871M46761
14701A038253j88807K86738n30366M58762J35290l99509q6179K43462M7306j65729
14691H39221C96392J047385G11113L5138M34743E16533K92447J35845j22445R0677
$$ plain form
14762 348684 477207 467839 789107 614681 626553 605421 472701 855704 653177 403620
14752 403620 775669 332118 727902 1026641 812935 731356 1060291 577960 425392 645659
14742 645659 403965 721273 653496 864699 569628 828631 507263 599593 460005 727577
14732 727577 804076 825734 557120 635998 661681 719116 808605 746043 645375 680877 918194
14721 918194 638993 833539 609270 658581 727226 850644 1045486 830982 636471 955967
14711 955967 925113 502405 604786 591737 952058 784789 588320 1047363 591492 1038253
14701 1038253 849446 1136184 605818 1064580 1199870 800361 714182 957644 1004950 839221
14691 839221 396392 1443777 711113 746251 1180994 516533 808980 944825 822380 913057
14681I13057K56983l16272q9328J91810M871K7326L698r0055k05188K48619K71715
14670A217236m29516M06959j33927N9735q0869J82570l89847M0787M7147J57631
14660A077906k16511J36853J6840j05198j06042K52071M1858N4705m945M1082
14650A188619J1280k20510m867K11188K27840k57792K57983l8464l18515J01074
14640A157836r6460L52392J53895k23284n2596k84858N16711k43424J74397L682
14630A458291m67540K95891P473k6719J18388L24053o67556L50246m85072N31249
14620A438704p8636M3412j30853j05451K52779K69524q8101l4105P6491k55182
14610A388582J09159m4420q4319M26266m26322j0601K27261j09239k7567K23742
$$ plain form
14681 913057 1170040 853768 764440 956250 961121 988447 992145 902090 696902 945521 1217236
14670 1217236 787720 1194679 1060752 1120487 1039618 1222188 832341 873128 920275 1077906
14660 1077906 861395 998248 1015088 909890 803848 1055919 1097777 1152482 1147537 1188619
14650 1188619 1199899 979389 974522 1185710 1413550 1155758 1413741 1375277 1056762 1157836
14640 1157836 1061376 1413768 1567663 1344379 1291783 1006925 1523636 1280212 1454609 1458291
14630 1458291 990751 1286642 1294115 1267396 1385784 1709837 1042281 1392527 907455 1438704
14620 1438704 1360068 1403480 1272627 1167176 1419955 1689479 1601378 1567273 1643764 1388582
14610 1388582 1497741 1453321 1369002 1795268 1368946 1358345 1585606 1476367 1448800 1672542
14600A672542k1319m6551k51874j42628O49611k30604k95304K78595J23501l7416
14590A698553J86877l06119J9291L4044L33470l15145K06329J38579l29344J13443
14580A779978Q2903j02405J40220r4718K73327j8997j65221k9412M7226J57659
14570B070560J1851j11j48547O25734k29041n84364K69465J29080M1551j53318
14560B032860L55019P590Q1288l14245K04904J84661k38626K02031J55545j64239
14550B506788M38174n6719r7018O2047J97646j13683M46602J61629J15908M70952
14540D132326m7620O13286J32218J394842O51602J606248K766540M135557O922030
14531B2307029Q107279l071506q905043n781117k779471l146718j859102q25902
$$ plain form
14600 1672542 1651223 1604672 1352798 1210170 1859781 1629177 1333873 1612468 1735969 1698553
14590 1698553 1885430 1579311 1598602 1632646 1966116 1650971 1857300 1995879 1666535 1779978
14580 1779978 1862881 1760476 1900696 1805978 2079305 2060308 1895087 1865675 1912901 2070560
14570 2070560 2082411 2082300 1933753 2559487 2330446 1746082 2015547 2144627 2186178 2032860
14560 2032860 2387879 2395469 2476757 2162512 2367416 2552077 2313451 2515482 2671027 2506788
14550 2506788 2944962 2888243 2791225 2853272 3050918 2937235 3383837 3545466 3661374 4132326
14540 4132326 4084706 4697992 4830210 6225052 6876654 8482902 11249442 15384999 22307029
14531 22307029 30414308 27342802 18437759 12656642 9877171 6730453 4871351 4045449
14523D045449q17434k92538q5825L5060n69578O42012m49567o0405Q3279j58379
14513B372074j71826M69481K9622k02274J86597Q9841n7368j42867M96264l51168
14503B718376j5881K01180n0259m9078j40664J65142K13166K7488K0380L4442
14493C124292j11139J87274j7288j91732R4897J02466J41197j19586N43224p78967
14483B974638K26304N47765n01247L79983j69403m1042L27098p9565M35444o05907
14473C494068N31948q6466j74955J09424L01796L15139k92309m35179N60612l7006
14463D287072N489P9304k55396J71195R6571J75279j42642J78323L00009j94412
14453D700792J60512R9212k87490K4149M3691L11792k05174J40346J54421K33366
$$ plain form
14523 4045449 3228015 2935477 2849652 2884712 2315134 2957146 2507579 2447174 2530453 2372074
14513 2372074 2200248 2669729 2699351 2497077 2683674 2773515 2716147 2573280 3069544 2718376
14503 2718376 2702495 2903675 2853416 2804338 2663674 2828816 3041982 3069470 3089850 3124292
14493 3124292 3013153 3200427 3183139 2991407 3086304 3188770 3329967 3210381 3753605 2974638
14483 2974638 3200942 3748707 3247460 3627443 3458040 3416998 3744096 3664531 4099975 3494068
14473 3494068 4026016 3939550 3764595 3874019 4175815 4490954 4198645 3763466 4324078 4287072
14463 4287072 4292561 4371865 4116469 4287664 4384235 4559514 4416872 4595195 4895204 4700792
14453 4700792 4861304 4960516 4673026 4697175 4740866 5052658 4847484 4987830 5142251 5375617
14443E375617K69714m23408N57373J4374m54681K83245M9319R6039l3436J16952
14433E851108K36780J58841n0971j94725M66734j88605L88113O7220j00800j18676
14423F515019K58912K64080n84213K99920K20369K81783j23086K48010j02370
14414G278424L01906J2500N36172J34016j95296L08770k10891L61071J78978k16525
14404H489125L18411o3625J67733O0846M34019o6934L94614q3996l7747L33125
14394I945571j54290L73426J28959J79352L14822J42068L4476L96027K85468J6355
14384A1662234p6340K02727L70364J98895k16816M57404L88004J59290L920O2698
14374A3212380O13453K52909M73567n6180M37914L37294J13955M43645K90798
$$ plain form
14443 5375617 5645331 5221923 5779296 5793670 5338989 5622234 5671553 5767592 5734156 5851108
14433 5851108 6087888 6246729 6195758 6001033 6467767 6279162 6667275 6734495 6633695 6515019
14423 6515019 6773931 7038011 6453798 6753718 6974087 7255870 7132784 7380794 7278424
14414 7278424 7580330 7592830 8129002 8263018 8067722 8376492 8165601 8526672 8705650 8489125
14404 8489125 8807536 8743911 8911644 8972490 9406509 9339575 9734189 9650193 9612446 9945571
14394 9945571 9791281 10164707 10293666 10473018 10787840 10929908 10964384 11360411 11645879 11662234
14384 11662234 11585894 11788621 12158985 12357880 12141064 12598468 12986472 13145762 13149682 13212380
14374 13212380 13825833 14078742 14552309 14496129 14934043 15271337 15385292 15828937 16119735
14365A6119735M13252K19898K78537K91098L84350K04248L27779L54956N08547
14356A9102400M85834O19323j21290R10655K23410M24539N36917M17724P94974
14347B3394486j35324N17999O51636P30536N38440N87247M94843P63359O47522
14338B8190744P40967L61667J101693O48788P23996Q21765J268004M37791J060969
14329C5356384J115416N65552J058005J307890Q82075J108008R97359J443231
14321D3833920J457453J245249J180475J461883J504243J738221J766310J733094
14313E5920848J653242J772210K116217K002180K255750K351167K481044K281116
14305G2833774K894089K595440L054400K824875L256139L223057L515247M039287
$$ plain form
14365 16119735 16532987 16752885 17031422 17322520 17706870 17911118 18238897 18593853 19102400
14356 19102400 19588234 20207557 20086267 20996922 21220332 21644871 22181788 22599512 23394486
14347 23394486 23259162 23777161 24428797 25159333 25697773 26285020 26779863 27543222 28190744
14338 28190744 28931711 29293378 30395071 31043859 31767855 32589620 33857624 34295415 35356384
14329 35356384 36471800 37037352 38095357 39403247 40285322 41393330 42390689 43833920
14321 43833920 45291373 46536622 47717097 49178980 50683223 52421444 54187754 55920848
14313 55920848 57574090 59346300 61462517 63464697 65720447 68071614 70552658 72833774
14305 72833774 75727863 78323303 81377703 84202578 87458717 90681774 94197021 98236308
14297I8236308L671884M065860M489529M191462N031016N253313N420881N797346
14289A36157599N752911O648370O334659O898669P569540Q086570Q114284R191572
14281A94754174R319047R758763J0249525J0921605J1315424J1707103J2394710
14274B70420351J2830930J3287148J3902232J3521293J3749375J3625066J3579133
14267C64915528J2964973J2011163J1495453J0814486R793449R267044Q233447
14260D39495543O917315N967687L006339K21650p4941k08359m511092p284857
14252D43529285o223479q694563r549471j0266710j2002140j2010383j2970626
14245C71811913j3691711j3303564j4006891j4045471j3954587j3235753j3344173
$$ plain form
14297 98236308 101908192 105974052 110463581 114655043 119686059 124939372 130360253 136157599
14289 136157599 141910510 148558880 154893539 161792208 169361748 177448318 185562602 194754174
14281 194754174 204073221 213831984 224081509 235003114 246318538 258025641 270420351
14274 270420351 283251281 296538429 310440661 323961954 337711329 351336395 364915528
14267 364915528 377880501 389891664 401387117 412201603 421995052 431262096 439495543
14260 439495543 446412858 452380545 455386884 455608534 455533593 455325234 450814142 443529285
14252 443529285 437305806 428611243 419061772 408795062 396792922 384782539 371811913
14245 371811913 358120202 344816638 330809747 316764276 302809689 289573936 276229763
14238B76229763j2468610j2157701j2147428j2068550j1547597j0576929j0297669
14231A94965279j0108608q696243q591352p918822p584870p112649o703817o157389
14223A32091529n567579n747361m903638n358903m651248m138590m079150l399968
14215I4245092m054100l260823l442648l232788l163638k600463k626846k438346
14207F9425440k828971j885319k263931j832903k076310j854484j793285j611884
14199E3278353j665650j191514j717964j438120k014643o94373j020699j261009
14191D2274381j028223j445560j183514p71775j009618j112652o76334j299636
14183C3747069o95227r72368p38932o33006r51060l81407r30949o26108o85075
$$ plain form
14238 276229763 263761153 251603452 239456024 227387474 215839877 205262948 194965279
14231 194965279 184856671 176160428 167569076 159650254 152065384 144952735 138248918 132091529
14223 132091529 126523950 120776589 115872951 110514048 105862800 101724210 97645060 94245092
14215 94245092 90190992 86930169 83487521 80254733 77091095 74490632 71863786 69425440
14207 69425440 66596469 64711150 62447219 60614316 58538006 56683522 54890237 53278353
14199 53278353 51612703 50421189 48703225 47265105 45250462 44556089 43535390 42274381
14191 42274381 41246158 39800598 38617084 37845309 36835691 35723039 35046705 33747069
14183 33747069 33051842 32079474 31340542 30707536 29756476 29375069 28444120 27818012 27132937
14174B7132937r51593m46325n56038n41310n83896p73592J96246j016308j50610
14165B2309511p39079m39749j34160m99150n66715n41845J5037q21875j22620
14156A8459355m89402k92036m13861j85445l07994l82514k35039p8764n74950
14147A5499350k71908K36952q54336N5339n6500k87233o79893j25320l03789J75034
14137A3387696m67558l41847J40143n19667j73813j73632J45763m72755k19653
14128A1304677M6537p6787l34794J26059o43085K9479m8115k32335k02957j52619
14118I816060K3971m6092l38706K1481o85719J49015J01290n05318M09405j93600
14108H751787l12600k51562J5880j23540J23065k14760k27831j05896L59878l81708
$$ plain form
14174 27132937 26181344 25735019 25178981 24637671 24053775 23280183 23476429 22460121 22309511
14165 22309511 21570432 21130683 20996523 20497373 19930658 19388813 19403850 18581975 18459355
14156 18459355 17969953 17677917 17264056 17078611 16770617 16388103 16153064 16074300 15499350
14147 15499350 15227442 15464394 14610058 14665397 14608897 14321664 13641771 13516451 13212662 13387696
14137 13387696 12920138 12578291 12718434 12198767 12024954 11851322 11997085 11524330 11304677
14128 11304677 11351214 11274427 10939633 11065692 10422607 10452086 10403971 10171636 9968679 9816060
14118 9816060 9840031 9793939 9455233 9476714 8790995 8940010 9041300 8535982 8945387 8751787
14108 8751787 8439187 8187625 8203505 8079965 8203030 7988270 7760439 7654543 8014421 7632713
14098G632713p1748m3756k06244j85458k42823J99339k52299N0294j21292k74925
14088F483801O1381R0010O5813p30404L66318l35956Q9179J695m89903N3148L7166
14077E692248j14992K2038R2939o5117M5081k39822K07981k73505j10773j86499
14067E069579j9550J45009m72187L99832k24223o9511j37778k9993N2705j41622
14057D572261J60130j48500L60185m54974K73523j67774k2105k14467j569j08119
14047D248591n7710n5037N94306n31349l15533J13327j36420K17824m67128O40846
14037D251717m09189q5822l09722L60036j83610j2374j5544j36152J08854J06741
14027C674935k13099N1732j91420J57620l28214J28491J77411j50095m18558L29777
$$ plain form
14098 7632713 7560965 7517209 7310965 7125507 6882684 7082023 6829724 6880018 6758726 6483801
14088 6483801 6545182 6635192 6701005 5970601 6336919 6000963 6090142 6091837 5601934 5655082 5692248
14077 5692248 5577256 5599294 5692233 5627116 5672197 5432375 5640356 5366851 5256078 5069579
14067 5069579 5050029 5195038 4722851 5122683 4898460 4828949 4691171 4661178 4713883 4572261
14057 4572261 4732391 4583891 4944076 4489102 4762625 4594851 4572746 4358279 4356710 4248591
14047 4248591 4190881 4135844 4730150 4198801 3883268 3996595 3860175 4077999 3610871 4251717
14037 4251717 3842528 3756706 3446984 3807020 3623410 3611036 3595492 3459340 3568194 3674935
14027 3674935 3461836 3513568 3322148 3479768 3151554 3280045 3457456 3307361 2888803 3218580
14017C218580r7065J51904l2535k79198L51117q8551k46303K72686l52960K62618
14007C160293k75452R7393J49506K3922m38045O3864m5496j43152l1628J93175
13997B754380j57007J09711j21706J77246m5500P19r3330l69773L31629P7075
13987B663444K15347m32074Q9513Q2599O2811j08828J62683J4120K78581k0776
13977C007420L51842P13300J175933K135600L660873O067735J0056257J232012
13969B8400972q153538n907861m201329k561055j166895j375075k16908j156123
13961C662188P2503j9369n59438j8932j14312k19336K44941k51252l65432Q6337
13951B517898k0236N8289r6779o1036j84947L0066P4579J03554l8218L3831n59327
$$ plain form
14017 3218580 3121515 3273419 3240884 2961686 3312803 3224252 2977949 3250635 2897675 3160293
14007 3160293 2884841 2982234 3131740 3155662 2717617 2781481 2735985 2592833 2561205 2754380
13997 2754380 2597373 2707084 2585378 2762624 2717124 2717843 2624513 2254740 2586369 2663444
13987 2663444 2878791 2446717 2536230 2618829 2681640 2572812 2735495 2749615 3028196 3007420
13977 3007420 3359262 4072562 5248495 7384095 11044968 17112703 27168960 28400972
13969 28400972 20247434 14339573 10138244 7577189 6410294 5035219 4818311 3662188
13961 3662188 3734691 3715322 3155884 3136952 3022640 2803304 3048245 2796993 2431561 2517898
13951 2517898 2497662 2555951 2459172 2398136 2213189 2243255 2317834 2421388 2383170 2417001 1857674
13940A857674O7779J31831r478P6990q4629P9260j54383q2073k17666M78416j14040
13929B029681J02640m18955K33621k57938K15179j72119K97176k16851j22307
13920A690127K2491m5083J32560K20942j59422k03365L05152n04091N50429k62181
13910A747559O2506m33561L22387l82644M24079j55558j97689N43674m40864J1309
13900A501198k00936L26881J00781m26087K04498N752N4990l64439K55826m7019
13890A411445r9923j55412K84146J884L0646J72829R6986m11052J27803K10318
13880A669670l36497J46590J44079j64077k04886J74247l7976q7297k01921K70321
13870A372253k65499K81289j94906J52819K6140J8973l41737L47199Q0604o16494
$$ plain form
13940 1857674 1925453 2057284 2047806 2124796 2040167 2119427 1965044 1882971 1665305 2143721 2029681
13929 2029681 2132321 1713366 1946987 1689049 1904228 1732109 2029285 1812434 1690127
13920 1690127 1712618 1667535 1800095 2021037 1861615 1658250 1963402 1459311 2009740 1747559
13910 1747559 1810065 1376504 1698891 1316247 1740326 1584768 1387079 1930753 1489889 1501198
13900 1501198 1300262 1627143 1727924 1301837 1506335 1512087 1567077 1202638 1458464 1411445
13890 1411445 1311522 1156110 1440256 1442140 1472786 1645615 1742601 1331549 1459352 1669670
13880 1669670 1333173 1479763 1623842 1459765 1254879 1429126 1391150 1303853 1101932 1372253
13870 1372253 1106754 1388043 1193137 1345956 1372096 1391069 1049332 1396531 1477135 860641
13860H60641N15616k37347M3691n8042K48557j98137j19781j34458L31465k07697
13850A044508j99015M68834j81469j79191J21414j8645r8523J6967L02580k69129
13840A008331K97884j32631k10991J89694q3274J80975p0312l45372L64546Q2207
13830A281057r8123k57502M3810m7580m9607p8590J85457k28548J18977O898J75822
13819A052071m2137j76287J87611k54231J94112k03246k2577K25215K75199l25399
13809I10331P1141J06835k70375J05789J00993q4276r6289l1187P4434J22131
13799A009527j53546J69658p9516j19745M6351r9944L13124r8595k40581J78931
13789I25664j45660k87857J46195p2985O5340M15834j52759j56487K2517K40637
$$ plain form
13860 860641 1376257 1138910 1182601 1124559 1373116 1174979 1055198 920740 1252205 1044508
13850 1044508 845493 1314327 1132858 953667 1075081 1056436 957913 974880 1277460 1008331
13840 1008331 1306215 1173584 962593 1152287 1069013 1249988 1179676 834304 1198850 1281057
13830 1281057 1182934 925432 969242 921662 872055 793465 978922 750374 869351 876249 1052071
13819 1052071 1009934 833647 1021258 767027 961139 757893 735316 960531 1235730 910331
13809 910331 981472 1088307 817932 923721 1024714 940438 844149 812962 887396 1009527
13799 1009527 855981 1025639 946123 826378 872729 772785 1085909 987314 746733 925664
13789 925664 780004 492147 638342 565357 630697 1046531 893772 737285 759802 1000439
13779A000439j38207o8763Q1041k5989L50712k10018l1164l99349J20255N14921
13769A193878k38194l46148K22404j83162J65937k08193L1847j72330n7047J88917
13759E97909p3780K40980k13183K21774J39627P1536j67110k8563l52182M28403
13749H65411k89101K09339j00269O1987m0936j99188K4818K61238j566k77752
13739E13981J83904B77886L80911q6139L35730k38425n33J20425k72121J05765
13729F23499m3602m0456R5292r757o8166L65312k88656K14362j33623l5276K568
13718F81497C08194O57604l55050J08320l9379j00711J77795j31918o3925J94477
13708G55407q6954l25403N08935J91730C98738K10551k6587J54161J13268m24671
$$ plain form
13779 1000439 862232 793469 874510 848521 1199233 989215 958051 558702 678957 1193878
13769 1193878 955684 609536 831940 648778 814715 606522 638369 466039 408992 597909
13759 597909 524129 765109 551926 773700 913327 984863 817753 789190 437008 865411
13749 865411 576310 785649 685380 747367 706431 507243 532061 793299 791733 513981
13739 513981 697885 277886 658797 572658 908388 669963 669430 789855 517734 623499
13729 623499 579897 539441 634733 624976 556810 922122 633466 847828 714205 678929 681497
13718 681497 308194 965798 610748 719068 679689 578978 756773 624855 560930 755407
13708 755407 668453 343050 851985 1043715 398738 609289 582702 736863 850131 425460
13698D25460L61420k90613J35526j37826N7720n6432k08271L98605k33872L34108
13688G85825l46583L12932J4656B33935L99506m8579r1696M6288j1541B43918
13677F39831l5928o8682O4825q6506k38547L04358K04713J76956D02967J93058
13667E96025k41396K12149L0042k50115J03880p8695k611J60895k2824p259j73417
13656C26674K79883m9161k67938M34467k34387l6832M9497J71072k40832J63885
13646E96328B19100L76485j55937j63543O87617m09418k73141A13949K60704J82459
13636E57112k71185J79654j24922j09446K49737m4818K53851l36634J08887J6218
13626D78454j15415n8482Q5314K91446J43657C18881K06398j75222R4468J1041
$$ plain form
13698 425460 786880 496267 631793 493967 551687 495255 286984 685589 451717 785825
13688 785825 439242 752174 766830 233935 633441 584862 493166 539454 527913 243918
13677 639831 603903 535221 600046 513540 274993 579351 784064 961020 402967 596025
13667 596025 354629 566778 596820 346705 450585 371890 369279 530174 507350 500091 326674
13656 326674 606557 557396 289458 723925 489538 452706 502203 673275 432443 596328
13646 596328 219100 595585 439648 276105 963722 554304 281163 113949 374653 557112
13636 557112 285927 465581 340659 231213 480950 436132 689983 353349 462236 478454
13626 478454 363039 304557 389871 681317 824974 318881 525279 350057 444525 455566
13616D55566l8241J79203B46261L6534O2297K4211Q338j05503P9686p4274K85714
13605E63264B41603L47388j20221A71401K36066K64303j43290B22858K32493l2207
13595D23144M73349B80696A29138M68665j53362k22013J30049J29796K40762N1299
13585G74334k33537j51971j9077j67974O3270K46874r3468l3739J14496k46590
13575B52618J85168l5461G9408R5848R9471b78767F9230K31898M72919C39994
13564F45015k64530m0238j28239J17702p5124r9064O17770c653n0880C52686j11062
13553B41624J65804N201k7588L0046n8594K81631j44711A50940R9092J31819n1606
13542C30245J93264j96760q7373K00692k04610i4949C04969J8009r3969D6510
$$ plain form
13616 455566 417325 596528 246261 282795 345092 369303 377641 272138 351824 277550 563264
13605 563264 241603 588991 468770 171401 407467 671770 528480 222858 455351 423144
13595 423144 896493 280696 129138 597803 444441 222428 352477 482273 723035 774334
13585 774334 540797 388826 369749 201775 265045 511919 418451 384712 499208 252618
13575 252618 437786 402325 79408 175256 274727 -278767 69230 301128 774047 339994
13564 645015 380485 340247 212008 329710 254586 155522 773292 -3653 -54533 352686 241624
13553 241624 407428 412629 385041 415087 356493 638124 493413 150940 250032 381851 330245
13542 330245 523509 326749 239376 440068 235458 -94949 304969 322978 229009 46510
13531E55032j50591O4032A72711M40783n1301q822f9957A46803L05166E0083J20285
13520A70368a32683A79206M57610j20605n6408J8279j72895M4228A04607L99460
13510E04067j37401c5663D54603F6822Q4389j3955M38785A60486m4990L82515
13500D98011k13083J62447m1518N2038k23240G4328L48041m8725A57748O7364
13490B25112l6017O9576o384q1502M85724B80031j06665J01641N6071I7705K77799
13479C75504A55679a7021l2405B61450J45738A95880L42026j37385R8289j74549
13469C24261J42778c7050C18073r7222o709J90105P8579j80350k0905L29178q9251
13458E21498A39231J15358L48593l01256j39852L1865l4945E9882L23937j06271
$$ plain form
13531 555032 404441 468473 172711 613494 562193 553371 -69957 146803 451969 50083 170368
13520 170368 -132683 179206 636816 516211 459803 478082 305187 349415 104607 504067
13510 504067 366666 -35663 454603 66822 151211 137256 576041 160486 115496 498011
13500 498011 284928 447375 405857 457895 234655 74328 422369 373644 157748 225112
13490 225112 189095 258671 252287 170785 656509 280031 173366 275007 331078 97705 375504
13479 375504 155679 -17021 -49426 261450 407188 195880 537906 400521 498810 324261
13469 324261 467039 -37050 318073 220851 214142 404247 482826 302476 281571 610749 521498
13458 521498 139231 254589 603182 301926 162074 193939 158994 59882 383819 277548
13448B77548p1352J61251O8885q6781A65278P9913I8966M07110A76225m2768J35905
13437B69362g213j09859C04652I6988J26198K56999B9820K24792J04979J15098
13427D74689A39240K04987j52557G2205A5102J35233K81926B0064a12589G7888
13416D44479a51639C97195A44354f8096D33367B13064b9853A76779h7094A91851
13405D43428A06131J40505m7404L8591a3941G8433R8558o0848C0697J47712J81915
13394C60324I4517J37037a8198B7246O5243K65954L2972A01144f4822B11881d6656
13382G5296L6958b5580O297C72425H7114P5508J01087j17262L8365o8982n6228
13371E9602K71543A42218A338Q9426P9354a10640H9469J20356H7736a88496K0601
$$ plain form
13448 277548 206196 367447 436332 349551 165278 245191 98966 506076 176225 133457 269362
13437 269362 -7213 -117072 304652 96988 223186 480185 29820 254612 359591 474689
13427 474689 139240 344227 191670 72205 15102 150335 432261 20064 -112589 77888
13416 444479 -151639 397195 144354 -68096 433367 213064 -29853 176779 -87094 191851
13405 443428 106131 246636 199232 237823 -13941 78433 176991 116143 30697 178409 360324
13394 360324 94517 231554 -18198 27246 92489 358443 391415 101144 -64822 211881 -46656
13382 75296 112254 -25580 -19283 372425 87114 162622 263709 146447 184812 115830 59602
13371 59602 331145 142218 1338 90764 170118 -110640 89469 209825 87736 -188496 -167895
13360a67895B99564r0635L28662j44918G0716L25991m9443a3805D11882A33326
13349B78748J12294q8765C2817L62641j59590J68059N7620j70654o0596J62897
13339C93194A41388J28832j04329J13786J80626k0337Q7825B03340M1937N4922
13329C00199j3192K10072A22387K17517A20876P8495J34495K8045A44153j8786
13319A25367J76880r9392P2596I4245J13253B4371J32548K08810B1778J56467
13309A78245M4052J31579j57531c8866B56489j07911L44707B00012L62896d0077
13298B17318J58004F104h7484a1795B2994c8346B56351K17505J66548i6893A90416
13286a34236B85383a31447D904K2746M50601I4549J35981f9360O501p176A49678
$$ plain form
13360 -167895 299564 208929 537591 392673 70716 396707 347264 -13805 411882 133326
13349 278748 391042 302277 32817 395458 235868 403927 461547 290893 230297 393194
13339 393194 141388 270220 165891 279677 460303 439966 527791 203340 245277 300199
13329 300199 287007 497079 122387 339904 120876 199371 333866 361911 144153 125367
13319 125367 302247 202855 275451 94245 207498 24371 156919 365729 21778 178245
13309 178245 222297 353876 196345 -38866 256489 148578 493285 200012 562908 -40077
13298 217318 375322 6104 -87484 -11795 22994 -38346 256351 473856 640404 -96893 190416
13286 -134236 285383 -131447 4904 27650 478251 94549 230530 -69360 -62859 -70035 149678
13274C7629K4445j6356K6547J39095a6422E98078B70486J16833C8779J405C841
13262C41852A45912i3998A46771d1799C55724D9384L6106h7317H813d1086B27978
13250D15523A08854J07183j00118b01553C34000A54090K50691m3811p1235A17055
13239B30865A09041L6461e1983O872D1883J45282n4011k9483K6018a77398E73761
13227a40746A29905q749L3888K9495I1508M51865I0419b82363A58764F9007b9315
13215B16566D4061K27147J7745M6261b09964A35679o1673R2195J42301j27476
13205A81026P3911G7237b52648h824F1809c9067n4784B82183a36810D13274a03931
13193C8739a11036D37610b9198A31458K25589j27834a7440o9983B38517J33351
$$ plain form
13274 37629 62074 45718 72265 211360 -16422 598078 270486 387319 38779 40184 3841
13262 341852 145912 -93998 146771 -41799 355724 49384 85490 -87317 8813 -41086 227978
13250 415523 108854 216037 115919 -201553 334000 154090 404781 360970 289735 117055
13239 230865 109041 145502 -51983 -45111 41883 187165 133154 103671 129689 -177398 573761
13227 -140746 129905 121156 155044 184539 91508 543373 90419 -282363 158764 69007 -29315
13215 216566 44061 271208 288953 335214 -209964 135679 74006 166201 308502 181026
13205 181026 254937 77237 -252648 -8824 61809 -39067 -93851 282183 -136810 413274 -103931
13193 38739 -111036 437610 -29198 131458 357047 229213 -17440 -87423 238517 371868
13183C71868K00284b79773b8704j4934B89067j06433D9865c9368A48530M6976
13173A95506g6679A79606K01838j42697J27703D2468O4791O7907K55197A92727
13162C50001a75745j00940h824F4563B2097K48668E6647M11227A90227a07484
13151f6470C6778a44925A36417Q5516j41k1559L69927k10150f6367B68593A14392
13139A03411a1483B03434a55579B10597P5922E971a3895B85538e0096A23751B7711
13127F8163p918J57457H5006K15487M9118G6594d3876A8748N0871k0169K8457
13116G7907k0244r865K4137J23923d2150C1388M5191J53190j5343B5726L79310
13105D05036h1273A9192J58191k4400b68B60268G0036O9994J5645m9685a2941
$$ plain form
13183 371868 572152 -279773 -28704 -43638 289067 182634 49865 -39368 148530 195506
13173 195506 -76679 179606 381444 238747 366450 42468 107259 175166 430363 192727
13162 350001 -175745 -276685 -8824 64563 22097 270765 56647 467874 190227 -107484
13151 -66470 36778 -144925 136417 221933 221792 200233 570160 360010 -66367 268593 114392
13139 103411 -11483 203434 -155579 210597 286519 5971 -13895 285538 -50096 123751 27711
13127 68163 60245 217702 85006 300493 349611 76594 -43876 18748 69619 49450 77907
13116 77907 57663 47798 71935 195858 -42150 31388 76579 229769 214426 25726 405036
13105 405036 -81273 19192 177383 152983 -268 260268 70036 140030 155675 105990 -12941
13093c3953l36460D1340K6210P3797n933R9022N7732B8899a85281c5145j35836
13082a70981B94847a63156A60343f953I3688l5698d295m66554D2552K9612J63024
13071B35188g7350l4541p4615G9633A6251L6709J40148p5362N7280B2526J70897
13060A93423P5562a51103H4980L42562A20859k401P7784l802F3601K37313j28853
13049A72061E9665J02028J21130a05061k1080B3889J3185L02452a9929F5391J55781
13038B21172A07420K16481j32753G4670b62423D9310P8466a07712a1662B01746
13027a2387B02648n8549h711B00675b483B45957H9326L0755O0348B888J66150
13016A69038E1785k1926j923J15470i3035B07027L49142c4146C28355A02222B5171
$$ plain form
13093 -33953 -370413 41340 67550 141347 135414 234436 292168 28899 -185281 -35145 -170981
13082 -170981 294847 -163156 160343 -6953 93688 57990 -4295 -470849 42552 72164 235188
13071 235188 -77350 -111891 -186506 79633 16251 52960 193108 117746 175026 22526 193423
13060 193423 268985 -151103 84980 427542 120859 118458 196242 192440 63601 300914 172061
13049 172061 59665 161693 282823 -105061 -126141 23889 37074 339526 -19929 65391 221172
13038 221172 107420 323901 191148 74670 -262423 49310 127776 -107712 -11662 201746
13027 -12387 202648 144099 -8711 200675 -2483 245957 89326 120081 180429 2888 169038
13016 169038 51785 29859 27936 143406 -93035 207027 556169 -34146 328355 102222 25171
13004C5062C307K38980j6273j02155c885B72023D164N6848h4891A69157e9095
12992D9278K19753H5042N8465a6181I849J57185m0584k9062b05073K4849H4379
12980C2503J46040h6236F8586a21173A51734c6673k57304D13656a60364A93327
12969a6917A18825Q3444a11973q2893B49561l4089b49332k71577h2220B46696
12958E3752B1767a43170b2486l8726L0207f555A77397l6462J18421a44810D1313
12946a20122B5799b33946A61150J01828r7271C4030M5030J64362a18585B46856
12935A88062M3550j15684J88557c9414D0983K32707j03183b13601D9450a39514
12924a4331k94154H4424F337d0062D18087A3022g8730j08239P3457j91926a0117
$$ plain form
13004 35062 3307 242287 226014 123859 -3885 272023 4164 61012 -84891 169157 -59095
12992 49278 269031 85042 143507 -16181 9849 167034 126450 97388 -205073 -180224 84379
12980 32503 178543 -86236 68586 -121173 151734 -36673 -293977 413656 -160364 193327
12969 -16917 118825 202269 -111973 -194866 249561 215472 -249332 -520909 -82220 246696
12958 53752 21767 -143170 -22486 -61212 -31005 -6555 177397 140935 259356 -144810 41313
12946 -120122 25799 -233946 161150 262978 165707 34030 79060 243422 -118585 246856
12935 188062 231612 115928 304485 -39414 40983 273690 170507 -213601 49450 -139514
12924 -14331 -308485 84424 6337 -40062 418087 13022 -78730 -186969 -113512 -305438 -10117
12912D12645A15473a23448j80862A27232g6357D3394D981L1241M2635h8812l3957
12901a22769j75151A1669J12505E8439a24308B02597a4124j46115E6589d758C1542
12889A11160h7521a3025B37558i9348A1933O9895b50940f8310j98857B56819b61330
12877i6613B20608n8940J00959c50761E9003c7074A19513a3209A87260c1061A62260
12865a52472H8962e4892B01870d9212B33801j14506K8512c9625F3648J77109g0562
12853D584b36012f038A99587J96820a43411k30900J68979B45796C1956e4503A05286
12841A63045G0724L82280i4675d6818J5312D4103J23935n1802N3099h9291A20441
12829A11254B71f5006D04633A61632j0982a12479E8261J79296n3488H0402a97773
$$ plain form
12912 412645 115473 -123448 -304310 127232 -76357 43394 4981 36222 78857 -88812 -122769
12901 -122769 -297920 11669 124174 58439 -124308 202597 -14124 -160239 56589 -4758 31542
12889 111160 -87521 -13025 237558 -99348 11933 81828 -250940 -68310 -267167 256819 -261330
12877 -96613 220608 161668 262627 -350761 59003 -37074 119513 -13209 187260 -31061 162260
12865 -152472 88962 -54892 201870 -49212 233801 119295 147807 -39625 63648 240757 -70562
12853 4584 -236012 -6038 199587 396407 -143411 -374311 -205332 245796 31956 -54503 105286
12841 163045 70724 453004 -94675 -46818 -31506 44103 168038 116236 169335 -89291 120441
12829 111254 271 -65006 404633 161632 150650 -112479 58261 237557 184069 80402 -197773
12817b35064C00763B6323i1675J8633A94086b28726I2695K93857c9851I7304J73498
12806B70802A4324f8385j17618A56107g1526n339C54944j05947G8490B9500a55368
12794A50138h8895A15223o779J3015b9534A17077K28912D6016K9570L9565C1783
12782a05552J8979A85712a62550b5637p0651k74263b6752A49916b71764A7352
12771B10544D5999c3973A774J79626c08170O6992p1981A09908L37559e8394A42918
12759e2863A25497m4103a87724C66996e0044o5622k68626R6629L0377E91J45272
12748A45863a27029e561B7052O3805a52927b8401j77395f5281p2134A92283J83999
12737C76282d4588k11892b6389o9352F6292K51206E0921K4206g0634C47900a46258
$$ plain form
12817 -235064 300763 26323 -91675 -73042 194086 -228726 92695 386552 -39851 97304 270802
12806 270802 14324 -68385 -186003 156107 -71526 -76865 354944 248997 78490 29500 -155368
12794 150138 -88895 115223 108444 121459 -29534 117077 345989 46016 75586 115151 31783
12782 -105552 -86573 185712 -162550 -25637 -96288 -370551 -26752 149916 -271764 17352
12771 210544 45999 -33973 1774 181400 -308170 -241178 -313159 109908 447467 -58394 142918
12759 -52863 125497 81394 -187724 366996 -50044 -115666 -384292 -287663 -257286 591 145863
12748 145863 -127029 -5561 27052 90857 -152927 -28401 -205796 -65281 -137415 192283 376282
12737 376282 -44588 -256480 -26389 -95741 66292 317498 50921 75127 -70634 347900 -146258
12725I9961a6353B73995H836d36390I7295m5030a4422j26914F7748a39299A13858
12713B06265K20050a24029h973k2007A44597A9813g7559D12710E0860K05908a89713
12701I3650M2800a3739C46869b74820i6106l9093B81570d4189H4164K8096J72608
12690B84868c5642A25245M2111O2827D5055J03765c46135A24255g5189L6652j38597
12679a77134A06612i8696k45679J49638B4255K09294n6257j7374a47063A06782
12668D8680O6507a91458j1181A57683K1179p2217B2768a64921A47519E7326J13593
12657A70919K6762d3554E1401B4339L13413J5379e4692F2010J34372h014C32608
12645g9931H1208b30891C5847L29191f7733J8618c603A02395b407j7066A98398
$$ plain form
12725 99961 -16353 273995 8836 -436390 97295 52265 -14422 -141336 67748 -139299 113858
12713 206265 426315 -124029 -8973 -30980 144597 19813 -77559 412710 50860 256768 -189713
12701 93650 136450 -13739 346869 -274820 -96106 -135199 281570 -44189 84164 112260 284868
12690 284868 -35642 125245 167356 230183 45055 148820 -346135 124255 -75189 -38537 -177134
12679 -177134 106612 -98696 -344375 -194737 24255 233549 177292 159918 -147063 106782
12668 48680 115187 -191458 -202639 157683 178862 106645 22768 -164921 147519 57326 170919
12657 170919 197681 -43554 51401 24339 337752 353131 -54692 62010 196382 -8014 332608
12645 -79931 81208 -230891 35847 365038 -67733 -49115 -3603 102395 -2407 -19473 198398
12633G9841a86063F0748J75055G284K49463k3493R1020a36730b3800G2021a7796
12621c1037A40287J26843j10545o6912D0962J56347F6935K95774j22014n5465
12611A85230J97124A02758J81629A12898Q1423D2623L22431I9393J68630F3142
12600c20870E5535L15828G2719P1892d3153k4698k8175A29797c08824C13325C3164
12588A51729A5400b95527C63556f2037C06805q8497m1408J14255R2248B091d3922
12576B71060b3318d81j72737N3334c8627A49265A6925h1012C77027m8750b95030
12564a11251c1690G4293h1233g22n3905H5551P4772a61034B09933H6540a65816
12552a58638g3737m3371k06336B6175e3921j7210F4553B5669f3905K4411F2346
$$ plain form
12633 79841 -186063 60748 235803 7284 256747 233254 324274 -136730 -23800 72021 -17796
12621 -31037 140287 267130 156585 89673 40962 197309 66935 362709 240695 185230
12611 185230 382354 102758 284387 112898 194321 42623 365054 99393 268023 63142
12600 -320870 55535 371363 72719 144611 -43153 -67851 -96026 129797 -308824 313325 33164
12588 151729 15400 -295527 363556 -62037 306805 218308 176900 291155 383403 2091 -43922
12576 271060 -23318 -481 -173218 -119884 -38627 149265 16925 -81012 377027 328277 -295030
12564 -111251 -31690 74293 -81233 -722 -54627 85551 160323 -161034 209933 86540 -165816
12552 -158638 -73737 -117108 -323444 26175 -53921 -71131 64553 25669 -63905 -39494 62346
12540f3510A0779K46944b08716D0064J664g9460H7106R8603C8050a78786e5961
12528A41007K05717a40374c3960q0600D7094Q6068m5586J26481k9821c4731k66628
12517c01359c2805A75272L5628R8448c5510G5396K08286D4977L27807A79405Q9358
12506B68763D6191M6749J08273G4455A9290c8333I1966M7715K216l8132D4020
12494A10437g6519C9576R285d8061p6829F0155a7988J946A18243a79400g4423
12482a24670I2935l5605N1172L7323J01080g7697A58734G9202K12592a94115e5396
12470a3680A53630d656j66727j13710C321c33987E2799K41699a41158A43456J16250
12459B59706f4340r0653i863A06734a13800o1623D24750A19377e5365m03637g6612
$$ plain form
12540 -63510 10779 257723 -208716 40064 41728 -79460 87106 185709 38050 -178786 -55961
12528 141007 346724 -140374 -33960 -114560 47094 133162 87576 214057 184236 -34731 -301359
12517 -301359 -32805 175272 210900 309348 -35510 75396 283682 44977 372784 179405 268763
12506 268763 46191 92940 201213 74455 19290 -38333 91966 139681 141897 103765 44020
12494 110437 -76519 39576 48861 -48061 -124890 60155 -17988 -16042 118243 -179400 -74423
12482 -124670 92935 57330 108502 145825 246905 -77697 158734 79202 291794 -194115 -55396
12470 -13680 153630 -4656 -171383 -285093 3321 -333987 52799 294498 -141158 143456 259706
12459 259706 -64340 -154993 -9863 106734 -113800 -175423 424750 119377 -55365 -459002 -76612
12447C50916H565F05b65582J04461A26575h769D2624a70144A25199D6957b08270
12435A41662A1180K00630b43628A33095b2736C2668P9925a76847h0512a2032D8399
12423a67632D7292K12592a748k28860C4708L7297a22199J3948K2859p2263B34742
12411C83544c3953j3771A46246n7149b16220b5207A31318b22805b3389r960C34779
12399g2530F5124b9692n0823l8597d5486B61321b85198B57997A3078c2424k65311
12388b97735d4892a7490k2088m32664c5858f618A17643h0965L919o3240c5163
12376B66355E8306K29482a04710H9465K24514b23655B27411e5976j24301B1000
12365a88581g4646A0795i3518e305B23161r9360g9380D9565J64705A3755J59771
$$ plain form
12447 350916 8565 605 -265582 -161121 126575 -8769 42624 -170144 125199 46957 -208270
12435 141662 11180 211810 -243628 133095 -22736 32668 112593 -176847 -80512 -12032 48399
12423 -167632 47292 259884 -1748 -230608 34708 72005 -122199 -108251 -85392 -157655 234742
12411 383544 -33953 -47724 146246 89097 -216220 -25207 131318 -222805 -23389 -33349 334779
12399 -72530 65124 -29692 -80515 -119112 -45486 261321 -285198 257997 13078 -32424 -297735
12388 -297735 -44892 -17490 -39578 -472242 -35858 -6618 117643 -80965 -77046 -140286 -35163
12376 266355 58306 287788 -104710 89465 313979 -223655 227411 -55976 -180277 21000
12365 -188581 -74646 10795 -93518 -5305 223161 123801 -79380 49565 214270 13755 173526
12354A73526G9144B9608M04917c8680k8424B0524b13256B8811a385q5370A39460
12342h2514j19755D227N1225L21036A14908m8827J04023a86394f3703A04475a78169
12330i736n1224A82232b21302f8882G7768K63632a69891p0388B96859A30101b64514
12318d2896a8153j4417B08264M5688a63867A38923e3930D5024J4732J01066b43360
12306B15899a56736F2509c15529A08661a12055C04903F477L08088i8406k2091
12296a20497D1867K4515j4852a99425D2688J35739a92642d9600j66120G5252b7057
12284a27191A93712l0117k1379a39957m6631g7889J988k921A76238h0994j37393
12273b18387f8845j08116A37656j1383b30658H6162O0492K03317b39090j22031
$$ plain form
12354 173526 79144 29608 434525 -38680 -67104 20524 -213256 28811 -1385 -86755 139460
12342 -82514 -202269 4227 55452 376488 114908 66081 170104 -186394 -63703 104475 -178169
12330 -9736 -60960 182232 -221302 -68882 77768 341400 -169891 -240279 296859 130101 -264514
12318 -42896 -18153 -32570 208264 253952 -163867 138923 -53930 45024 59756 160822 -243360
12306 215899 -156736 62509 -315529 108661 -112055 304903 6477 314565 -98406 -120497
12296 -120497 41867 66382 51530 -199425 42688 178427 -192642 -49600 -215720 75252 -27057
12284 -127191 193712 163595 142216 -139957 -186588 -77889 -75901 -78822 176238 -80994 -218387
12273 -218387 -68845 -176961 137656 126273 -230658 86162 146654 349971 -239090 -361121
12263c61121A4529n326a91110B75643d3135m2456C46534a43443b0667A57530b05342
12251a37588c5206j9653D22889F6315K59183a3256B55523a02467b3328k07548
12241b30876I706c2589G8187a85113A34431P7850c2418j1624E4730J37690p5565
12230A16855R0646J9861L3347l7757C879K8722K11988a1437n5969B345b82456
12218B91337j13985J00827J27241E285K80838c3567E16137I9974K65877j33388
12208B32463L80039l02907j13448a65137G59489C32376j38615M8434l1613c5163
12197D53720E1462K9152J6831J47909B593O4987K5319L4813J5234k0189J39744
12186B62501K35515C1229N4382B0377L11479j29478H9630J26616J06686A19642
$$ plain form
12263 -361121 14529 9203 -191110 275643 -43135 -85591 346534 -143443 -20667 157530 -205342
12251 -137588 -35206 -54859 422889 66315 325498 -13256 255523 -102467 -23328 -230876
12241 -230876 9706 -32589 78187 -185113 134431 212281 -32418 -44042 54730 192420 116855
12230 116855 207501 227362 260709 222952 3879 32601 244589 -11437 -67406 2345 -282456
12218 291337 177352 278179 405420 5285 286123 -33567 516137 99974 365851 232463
12208 232463 612502 309595 196147 -165137 759489 332376 193761 242195 210582 -35163
12197 453720 51462 80614 97445 245354 2593 67580 92899 127712 142946 122757 262501
12186 262501 498016 31229 85611 20377 331856 202378 89630 216246 322932 119642
12175a26258C07271A29322B7331a12676B9193J65085O7013j2402m303C0750b32070
12163H0347C1249R4101K85369a1149m6397b228l2959B52342F4731j7551A3880
12151A00519d7744A48477Q417K15987A02933Q780Q5308B9110R0624K64332H0881
12139A93900B5782Q7760J77618E7235d4714G6791j9864H97P4199b18902l3852
12128b52754a9319C26K40209e9473a0075D9973Q2160n6066I877D224i3696B89072
12115b0212j08426A44170B2414i3899B63299G3724R3130B5221a7192A37617a17695
12103E2016K14963A11528a5064r6611c361r9920c8592n9992q2589A55290E611
12091C09831i1299E5332K08634A8228b07791g8510A97353r0980k1000a75052b8752
$$ plain form
12175 -126258 307271 129322 27331 -112676 29193 194278 261291 248889 244586 30750 -232070
12163 80347 31249 125350 410719 -11149 -57546 -2228 -35187 252342 64731 47180 13880
12151 100519 -47744 148477 156894 372881 102933 111713 197021 29110 119734 384066 80881
12139 193900 25782 113542 291160 57235 -44714 76791 56927 897 75096 -218902 -252754
12128 -252754 -19319 326 240535 -59473 -10075 49973 132133 76067 9877 4224 -93696 289072
12115 -20212 -128638 144170 22414 -93899 263299 73724 166854 25221 -17192 137617 -117695
12103 52016 266979 111528 -15064 -111675 -3361 -103281 -38592 -98584 -181173 155290 5611
12091 309831 -91299 55332 263966 18228 -207791 -78510 197353 106373 85373 -175052 -28752
12079F4616n158a36511b1374j3571A00944m1240r239A0946h3729B5385J26598
12068A51983J36003B2659b37184L9057A29280b38708B53697A7903b98097K3836
12058b74261h3920F4783h6478q3617A73236a4486B18182k3640e0296E10741L10776
12047H21517l54684k8645G3567d12624g0745C69400r0833c35180f0878A3148K5838
12036C8986d48175A35855a17164B6556b77658j672A0810J03873a03163G2955b04448
12024a89284o71l2881J05209A96090B8247A0700a2733k11797M9475j86974a19123
12012f5444b945p2057r8493A75276c8899A52050a33108A09583D7805e1532B31702
12000a06994B00005C9238b4558C9692J55443h8578b7092k30246A0649c18909g4795
$$ plain form
12079 64616 59458 -136511 -21374 -34945 100944 59704 50465 10946 -83729 25385 151983
12068 151983 287986 22659 -237184 -198127 129280 -238708 253697 17903 -298097 -274261
12058 -274261 -83920 64783 -86478 -170095 173236 -14486 218182 194542 -50296 510741 821517
12047 821517 466833 438188 73567 -412624 -70745 369400 278567 -335180 -60878 13148 38986
12036 38986 -448175 135855 -117164 26556 -277658 -279330 10810 114683 -103163 72955 -204448
12024 -189284 -189955 -222836 -117627 196090 28247 10700 -12733 -224530 -175055 -362029 -119123
12012 -65444 -2945 -75002 -173495 175276 -38899 152050 -133108 109583 47805 -51532 231702
12000 -106994 200005 39238 -24558 39692 195135 -88578 -27092 -257338 10649 -318909 -74795
11988G7749a96766A51208d9480j70739B36334a64535G0256a97858A90852a75541
11977b4057D2796g6478j55143j6809I2293N5047A2545J04026f6374H8948a07446
11965A59155g3134k52712A0423J40215J35628A9563J33608M5193H6924a7421G2575
11953B77953a12782G2371d7959C56466a4577C19841b21758E2487g5042H8785a6483
11941a32812A94263h7235j38077a11404I9188J324a07581A80193g840B6158g8697
11929b44712Q3018M9987o0298l2495B7754e7070B11895a71620l0152H3443e2839
11917a95742F5483b0997E5276M8385b03676F8613C2760j2803M281a16447J6763
11906i9684q0636P4861B29991b05662J4655j85124B13842A3267R4521L8065F4188
$$ plain form
11988 77749 -196766 151208 -49480 -220219 236334 -164535 70256 -197858 190852 -175541
11977 -24057 42796 -76478 -231621 -248430 92293 147340 12545 116571 -66374 88948 -107446
11965 159155 -73134 -325846 10423 150638 286266 19563 153171 198364 86924 -17421 72575
11953 277953 -112782 72371 -47959 356466 -14577 319841 -221758 52487 -75042 88785 -16483
11941 -132812 194263 -87235 -225312 -111404 99188 100512 -107581 180193 -7840 26158 -78697
11929 -244712 -161694 -111707 -172005 -204500 27754 -57070 211895 -171620 -201772 83443 -52839
11917 -195742 65483 -20997 55276 103661 -203676 68613 32760 19957 24238 -116447 -99684
11906 -99684 -180320 -105459 229991 -205662 -191007 -376131 213842 13267 107788 145853 64188
11894B31548F7452b63984G0156b86762g3003A58058a99065C54213b36284D9231
11883c36911I4399I816J50775a37816m2897f0256a7495k15228P7694C08209a00273
11871a5719m2640n3656E227a80324A17396a15306r2284C5097a39146j15064k0123
11860b74333A00400b46971A24351e9162b6786k57808d1687j48549q5217A19852
11849H5066K59218a845C1539d2728b0010r3672d6147D6713k1890i697n01910d6309
11836B77382d1401o1958A57372a6573A71854b01604L8285g3752B18848D6307O8382
11825A14689n578L7839E9779g6287j99549J15213q7887q0506J5634B9038a31614
11813a33657a1540F7134a89833b7432B2682b55381I4015A4292a20842B4376L0948
$$ plain form
11894 231548 67452 -263984 70156 -286762 -73003 158058 -199065 354213 -236284 49231
11883 -336911 94399 9816 160591 -137816 -180713 -60256 -17495 -232723 -155029 308209 -100273
11871 -15719 -58359 -112015 5227 -180324 117396 -115306 -207590 35097 -139146 -254210 -274333
11860 -274333 100400 -246971 124351 -59162 -26786 -284594 -41687 -190236 -275453 119852
11849 85066 344284 -1845 31539 -42728 -20010 -113682 -46147 46713 24823 -9697 -511607 -46309
11836 277382 -41401 -103359 157372 -16573 171854 -201604 -163319 -73752 218848 46307 114689
11825 114689 109111 146950 59779 -76287 -275836 -160623 -248510 -329016 -313382 29038 -131614
11813 -133657 -11540 67134 -189833 -27432 22682 -255381 94015 14292 -120842 24376 55324
11802E5324d64407B28405p0084a03124j7380A37554b34464M9812B3464J1538J02089
11791A37091d1723n4838n5912A01281l9347K926c44033A5049J42375c31930c4393
11779B18502a32188j00662B59340b49020A34617D5806d5334B08444i2002E4906
11768C71133E7347c39666B13871g9307j13083C09070a53341A66115c9069n9719
11758i8788I3244c40607j8631j00472A51781n0190f9468B70460J43199E7591h0827
11746A12084c4528j7295n0056o2698G8335b01070d3225k0187A01751a57368h841
11734d4332j04769N6195n7560A46688K4583b22468A04430b25574A94999a01312
11723G2356J02416C8023e6267E0641a46890F2880a39122D9668a35798b1928m0902
$$ plain form
11802 55324 -464407 228405 158321 -103124 -120504 137554 -234464 -184652 23464 35002 137091
11791 137091 -41723 -96561 -152473 101281 61934 64860 -344033 15049 157424 -331930 -34393
11779 218502 -132188 -232850 259340 -249020 134617 45806 -45334 208444 -92002 54906
11768 371133 57347 -339666 213871 -79307 -192390 309070 -153341 166115 -39069 -98788
11758 -98788 93244 -340607 -359238 -459710 151781 101591 -69468 270460 413659 57591 -80827
11746 112084 -34528 -51823 -101879 -164577 78335 -201070 -43225 -63412 101751 -157368 -8841
11734 -44332 -149101 -92906 -150466 146688 171271 -222468 104430 -225574 194999 -101312
11723 72356 174772 38023 -56267 50641 -146890 62880 -139122 49668 -135798 -21928 -62830
11712f2830A38170b41551G6545J05603Q18g1578r7268F6469J1361F373a0540C20940
11699a44723j521f3857o0655e2889A30450c4753j1946k29235e9121j82994c4891
11687h3953A80605l3761K0169a20895B4555a73970Q6560G3245I450J28404b70056
11675c4030A1131h8345A28031a7521A95393c6138C20375b50480E8453d6207A13022
11663c43746A37412d43265h0523b2146q9083b4942j05306J3399A35530K19254
11653C54784B3266e2341K0456r5831d2443j46692d3168j38662A79649l4406f7783
11641b4643A69813B1155b97170F8264G234K3329Q0672J27119D115J7469h2754
11629g7385A05741b79631N9539B4588Q6802J01952D8788h8719C2528a05748j12361
$$ plain form
11712 -62830 138170 -241551 76545 182148 182966 -71578 -168846 66469 77830 6373 -10540 320940
11699 -144723 -146244 -63857 -124512 -52889 130450 -34753 -46699 -275934 -59121 -242115 -34891
11687 -83953 180605 146844 167013 -120895 24555 -173970 -87410 73245 9450 137854 -270056
11675 -34030 11131 -88345 128031 -17521 195393 -36138 320375 -250480 58453 -46207 113022
11663 -343746 137412 -443265 -80523 -22146 -111229 -24942 -130248 -116849 135530 354784
11653 354784 23266 -52341 -31885 -127716 -42443 -189135 -43168 -181830 179649 145243 -67783
11641 -24643 169813 21155 -297170 68264 7234 30563 111235 238354 4115 21584 -82754
11629 -77385 105741 -279631 -220092 24588 111390 213342 48788 -88719 32528 -105748 -218109
11618b18109B46698e790m14591B23759Q744b49008b8464A60719p8908c35150f8694
11606C5634K10070b2286C31711a49752o6037J01689I673b8615A32850C2665a12661
11594e4720j68768M8573A34125c7117n0512C34541c32767B1954a55920C3519J64448
11583A97967H2506c9432A51396j9062e89769A82095B8380b53209c1397A16497
11572I678P8296b47015E5836J05783a94182G8680b9103j94230r7148a33474L8482
11561i4992D2702d5394H8422o505a41839C6297a61482C8423L4904d6279B08837
11549g5947k3964n8442a2393A87534g6728m7232H7970M4242J11769a22683K0915
11538a01768K2538A58364B1471J03712f1304O79k87422A5295M254L6635J90463
$$ plain form
11618 -218109 246698 -5790 -420381 223759 232503 -249008 -28464 160719 81811 -335150 -68694
11606 35634 245704 -22286 331711 -149752 -215789 -114100 9673 -28615 132850 32665 -112661
11594 -54720 -223488 -174915 134125 -37117 -87629 334541 -332767 21954 -155920 33519 197967
11583 197967 82506 -39432 151396 132334 -589769 182095 28380 -253209 -31397 116497
11572 9678 87974 -247015 55836 161619 -194182 78680 -29103 -223333 -320481 -133474 -94992
11561 -94992 42702 -45394 88422 81917 -141839 36297 -161482 38423 73327 -46279 208837
11549 -75947 -99911 -158353 -12393 187534 -76728 -123960 87970 132212 243981 -122683 -101768
11538 -101768 -79230 158364 21471 125183 -61304 -60625 -348047 15295 19549 56184 246647
11527B46647F8361a21135A25580a41173M8936j6071B99828j35472F3201J5586
11517G8787K1435J71846B9123Q5213a66138C8378J56885k2063a78274C61930a56553
11505a92127I8695f0078B2570K85291e7597C59707A01367c381p4866A78547k465
11494A76082m0771A3290K00963K92588k51158j17275J20826p5283L6228j00258
11484A19921J34226B1059K84444o527B7651b30515A11140a26561B70066M7340
11474C17406H1229a64755A23548R7237i512B32520c0310n1142J8357B34817J77574
11463D12391m842d092C02833A09072K29671e5169B59784c2359j51648L89D26313
11451E014K58948M773J14409G4913R4689b39216C41478J75673a3933j05902A45668
$$ plain form
11527 246647 68361 -121135 125580 -141173 -92237 -108308 299828 164356 63201 78787
11517 78787 100222 272068 29123 114336 -166138 38378 195263 173200 -178274 361930 -156553
11505 -192127 98695 -60078 22570 307861 -57597 359707 101367 -3381 -78247 178547 176082
11494 176082 135311 13290 214253 506841 255683 138408 259234 183951 220179 119921
11484 119921 254147 21059 305503 298976 27651 -230515 111140 -126561 270066 317406
11474 317406 81229 -164755 123548 220785 -9512 232520 -30310 -81452 -63095 234817 412391
11463 412391 407549 -4092 302833 109072 338743 -55169 259784 -32359 -184007 -183618 426313
11451 5014 263962 268735 383144 74913 169602 -239216 341478 517151 -13933 -119835 145668
11439H8094M7866R7546F5665Q0935J75497a23712A68618g4861B43695g2984A47574
11427g5505h656A00376D3655R8686a63886b0751q2679P897o4026m9066B26444
11415D5343a42145A67577K4284a46469L4479B81547b21090F8672N4329f8613L4301
11404c4312a6452C4758i0246B3093K04908B1203K10822A7240R9447a92092M1513
11393a50579H695g086k37589P8280c9463A02000f3237H9772K618a45879A09565
11381b30953A14580b3776j12881O3401D4793J5056k7744a47607E5478a5742k84144
11370b99886B0571i1520r8080L7609m1869F3523B5102J3220M72189H4440J86077
11359B70517a65665A73398d8926n1216A25783B2342O2238a16640b2857k10313
$$ plain form
11439 88094 135960 233506 65665 146600 322097 -123712 168618 -74861 243695 -72984 147574
11427 -75505 -8656 100376 43655 142341 -163886 -20751 -103430 -95533 -159559 -208625 226444
11415 45343 -142145 167577 191861 -146469 -111990 281547 -221090 68672 123001 -68613 -34312
11404 -34312 -16452 34758 -90246 23093 228001 21203 232025 17240 116687 -192092 -150579
11393 -150579 8695 -7086 -244675 -166395 -39463 102000 -63237 89772 92390 -145879 109565
11381 -230953 114580 -23776 -136657 -73256 44793 59849 32105 -147607 55478 -15742 -299886
11370 -299886 20571 -91520 -189600 -151991 -193860 63523 25102 38322 510511 84440 270517
11359 270517 -165665 173398 -48926 -100142 125783 22342 84580 -116640 -22857 -233170
11349b33170A52254C8273j0118L11674b35327g5479f637F4790c36550a52256C3396
11337G6329c28679A63091a02861A92179M2099a11577D65470C1286h7286l096j08219
11326a98601H7363J15491b79350b4507H0533J37632c32286B67729A4395c0329
11315A28631a76672k0353k04475A26588b3551j53742A84953c70781a62723r0997
11305b53720C3736O6754a69917g8722B7522L4615g5638C1780a25147F1811J14431
11294A76242a39266p7903B51129J8454h1458K908I1806j3260b68502C25434E3091
11282D2912f7207H5584O2909D2740A9290a76392E9616g4253G4446b04443r8390
11271c02833A12064a21004C711a23991J0049B50260j03295b03755A99713b48348
$$ plain form
11349 -233170 152254 38273 28155 339829 -235327 -75479 -6637 64790 -336550 -152256 33396
11337 76329 -328679 163091 -102861 192179 234278 -111577 465470 31286 -87286 -90382 -198601
11326 -198601 87363 202854 -279350 -24507 80533 218165 -332286 267729 14395 -30329
11315 128631 -176672 -197025 -401500 126588 -23551 -177293 184953 -370781 -162723 -253720
11305 -253720 33736 100490 -169917 -78722 27522 62137 -75638 31780 -125147 61811 176242
11294 176242 -139266 -217169 251129 269583 -81458 -78550 91806 78546 -268502 325434 53091
11282 42912 -67207 85584 148493 42740 19290 -176392 59616 -74253 74446 -204443 -302833
11271 -302833 112064 -121004 3711 -123991 -113942 250260 146965 -203755 199713 -248348
11260c16852A52421a34483K4957a6691k4884A34865j5483f3566k19187J34380
11250a48373P1633L7794j14967G9871a54525a1874b655B26803b92461b7130A27012
11238d2302A28149m0238b8008A15741a35884b3933D8845b77479h9962A18343a41939
11226c4308D5J16342c6100B41181i0884j40478A17840i0331A67218A5792e9234
11214c3847H1631P5715m962b94215A77587e4817j8017l11860C26554G6002e4508
11202a57410d7868q2912A10372K2388E5520d3594A08698A5175R63a93589c1979
11190b01239k4999F9440d2239D8590Q1450F710L51476A29210n2979h7727B3360
11178F1820h3284M714L400j50284B07882a9530r2243j82877H560P6827g1248A9017
$$ plain form
11260 -316852 152421 -134483 -109526 -16691 -41575 134865 119382 -63566 -282753 -148373
11250 -148373 -76740 -38946 -153913 79871 -154525 -11874 -2655 226803 -292461 -27130 127012
11238 -42302 128149 87911 -28008 115741 -135884 -23933 48845 -277479 -89962 118343 -141939
11226 -34308 45 116387 -36100 241181 -90884 -231362 117840 -90331 167218 15792 -59234
11214 -33847 81631 157346 152384 -294215 177587 -54817 -72834 -384694 326554 76002 -54508
11202 -157410 -47868 -130780 110372 132760 55520 -43594 108698 15175 16138 -193589 -31979
11190 -201239 -226238 69440 -42239 48590 130040 6710 358186 129210 76231 -87727 23360
11178 61820 -83284 -78570 -75170 -225454 207882 -19530 -111773 -294650 8560 85387 -71248 19017
11165c26973a03952j57037c458m23162B7376J20128c4094j32710K5667D44544
11154A6296f53B35839g5072B38255b82742m2613d0968r5350j51548j2962I2689
11142b7352I9259d1893B2276K01733G4772d9386P211B44699A05536J57519g9580
11130G4879g2512B94542G245N1381a64954A19262Q532a28095A88567b15784A8026
11118D4009a39163A4416K06359F0382d1682A0440O1088L4267c22847A0195P3176
11107H3371L39235j94964a02080k4732C87308A58432e0572G4569q270P8821b35662
11095G4749C5405Q5226K40632a03949B12128M1453r3170l5266K5671p1145C1261
11083e1458F8095a96803A92155M8186r1072J15567R1572D3223J47227K24540A42646
$$ plain form
11165 -326973 -103952 -260989 -3458 -426620 27376 147504 -34094 -166804 -141137 444544
11154 16296 -653 235839 -75072 238255 -282742 -325355 -40968 -136318 -287866 -300828 92689
11142 -27352 99259 -41893 22276 224009 74772 -49386 -42175 244699 105536 263055 -79580
11130 74879 -72512 294542 7245 58626 -164954 119262 127794 -128095 188567 -215784 18026
11118 44009 -139163 14416 220775 60382 -41682 10440 71528 105795 -322847 10195 83371
11107 83371 422606 227642 -102080 -126812 387308 158432 -50572 74569 66299 145120 -235662
11095 74749 35405 120631 361263 -103949 212128 253581 160411 125145 150816 79671 31261
11083 -51458 68095 -196803 192155 240341 149269 264836 356408 43223 190450 414990 142646
11071B86968j08068G9911E536J08225J14796m1231B6044K00203M2102O5746K30627
11060E64722a67901C78541j08409M31964G7475J92275M90987j06884J08070k03659
11050E58264o2202L33383A99809K39567j49062M38484j32584K15847j93330m5916
11040E72815P6945J16098J51782j82256j1372J08698q183J64932M7107k95881
11030G40685M58983j81260K69615k81854P8651k5552J9816p2918j18961J7557
11020I04762l24117K64176k31578L99838k82007J49751M3781o813M9972j04775
11010H62990K60644m00261L01554k39370O4147K50524j46899o1687J93419l55605
11000G29456j36622L34750C57092K75428J70979p4057K16332l47449J51582j84744
$$ plain form
11071 286968 178900 79911 5536 113761 228557 187326 26044 226247 268349 334095 564722
11060 564722 -167901 378541 270132 702096 77475 269750 760737 653853 761923 558264
11050 558264 496062 829445 199809 439376 290314 728798 596214 812061 618731 572815
11040 572815 649760 765858 917640 735384 724012 832710 824527 989459 1036566 740685
11030 740685 1199668 1018408 1288023 1006169 1084820 1059268 1079084 1006166 887205 904762
11020 904762 580645 844821 613243 1013081 731074 880825 924606 917793 967765 862990
11010 862990 1123634 723373 1024927 785557 849704 1100228 953329 891642 1085061 729456
11000 729456 592834 927584 357092 632520 803499 729442 945774 598325 749907 565163
10990E65163Q2079J36180J21987j82884M7859l3250J98070q6904L08491k30376
10980I26415J20688n08642K48925L7005j07608J38132L11975R0567j29214j09238
10970A019005O8806J67356j08192L88080j24824L87782k22215L75025K04687j35005
10960B020505N91042K65573n949P81399k03159j46958K86454j58565k8351P9784
10950C481775q38421k37903o83748M6207n04596K56640k81676L4854L22812m64826
10940A131118P9042n21040J56620o9773k94144K68458k42719k36095l0410P794
10930B48851K71365A89153Q9727L0757A02355l1235J77679Q4951J13183E3426
10919D09877A86734R0892K7996A48750R2019L6233b45810B38908a29428o6984
$$ plain form
10990 565163 647242 783422 905409 722525 770384 737134 935204 848300 1156791 926415
10980 926415 1047103 538461 787386 824391 716783 854915 1166890 1257457 1128243 1019005
10970 1019005 1087811 1255167 1146975 1535055 1410231 1798013 1575798 1950823 2155510 2020505
10960 2020505 2611547 2877120 2871171 3652570 3449411 3302453 3588907 3430342 3401991 3481775
10950 3481775 2643354 2405451 1721703 1767910 1263314 1519954 1238278 1273132 1595944 1131118
10940 1131118 1210160 689120 845740 775967 481823 750281 507562 271467 241057 248851
10930 248851 520216 189153 278880 309637 102355 71120 248799 333750 446933 53426
10919 409877 186734 277626 305622 148750 240769 277002 -245810 238908 -129428 -196412
10909a96412A7938K1282J99873j06348N5078r621b20221B40364o0698d7700a2175
10897g2180j7371B3288a52126B40973c2470k6332I0438a64725M6553C92490a33386
10885B42926G5405L0494R5307A8582b68400j2194J10614A83306A5756a04357k49757
10874c54114H8146R3761a35153g216B44668i7638j30610C8807h0901D1707P6292
10863A17999i1580D0260j2709d44446d9856j68916k6437B08044b5955j44227B41807
10851a46340C26685b6876j13125H8425d5147p7741e0348C0742a12914A348L9596
10840D0944a44300O7406c5419A38926O2631e2298G7032f5721A5868M9233c08356
10828d7832B93524p5014a95269O2902p6047A33471c16298A11458j4456b37888
$$ plain form
10909 -196412 17938 39220 239093 132745 187823 178202 -220221 240364 179666 -47700 -12175
10897 -72180 -89551 23288 -152126 240973 -32470 -58802 90438 -164725 -118172 392490 -133386
10885 242926 75405 105899 201206 18582 -268400 -280594 -169980 183306 15756 -104357 -354114
10874 -354114 88146 181907 -135153 -7216 244668 -97638 -228248 38807 -80901 41707 117999
10863 117999 -91580 40260 27551 -444446 -49856 -218772 -245209 208044 -25955 -170182 241807
10851 -146340 326685 -26876 -140001 88425 -45147 -122888 -50348 30742 -112914 1348 40944
10840 40944 -144300 -76894 -35419 138926 201557 -52298 77032 -65721 15868 65101 -308356
10828 -47832 293524 218510 -195269 -132367 -208414 133471 -316298 111458 97002 -237888
10817a99917C56775b6332p0244E0207B0656b74582i9086k3512B59562e84718a25707
10805A30646b8434q7815Q896A48276m8536a49258p8504a04631g781q0423f375
10793b7571J56c864k96497A2975g1423K7412d2j40676j04227A13484M80149G3252
10780G4041a30606E1710Q7229A0608Q1641a21912j9408k70022a08854J5777A91702
10768h398I0600R3876d7408m26344A61474M0817E051O2578B8185L1798B4904c30111
10755B919b32906O622N4752f9103A13010c13830A57708g4348C88954A10448c37267
10743b47217A07875A952i8352n23425A98729E9191a17581G9193J79918a88858
10732A7705O7984f0391I2677K08932A20566b2684B5953P8864b20563A19339A2718
$$ plain form
10817 -199917 356775 -26332 -96576 50207 20656 -274582 -99086 -122598 259562 -584718 -125707
10805 130646 -28434 -116249 -107353 148276 99740 -149258 -227762 -104631 -7781 -88204 -6375
10793 -27571 -27415 -3864 -300361 12975 -71423 -44011 -42 -140718 -244945 113484 593633 73252
10780 74041 -130606 51710 138939 10608 92249 -121912 -141320 -411342 -108854 -93077 191702
10768 -8398 90600 184476 -47408 -473752 161474 202291 5051 67629 28185 59983 24904 -330111
10755 2919 -232906 -226284 -171532 -69103 113010 -313830 157708 -74348 388954 110448 -337267
10743 -247217 107875 1952 -98352 -621777 198729 59191 -117581 79193 259111 -188858
10732 17705 85689 -60391 92677 301609 120566 -22684 25953 104817 -220563 119339 12718
10720c77510A2714J47704k185d36356b3111j61224M8912A07017b5066F5289c98572
10708f3696G7410J78955r1012g9125a2356k8592k2669o6982A35946a71076a5645
10696A3635b28935H4917d5352j26728A66430d106p340A51652a10393A09621N245
10685A14866a92147L3952B02216a76072O1382o9322k93450A72635G8037C8790
10674B3768R6824l4824i467j01559A6068b36972R6664B21681A03032a03927D3234
10662a95318r2434P0363e652A7237J54955c09059C1148e6088C726L21198b75108
10650f1733B0010c53486J15333L3577E7580i7769J1258G0069J46690g3384l10226
10639c83610b0788j48727A62796b17279e0287r3932A47698G1327i4388B33350
$$ plain form
10720 -377510 12714 160418 158233 -436356 -23111 -184335 -135423 107017 -25066 65289 -398572
10708 -63696 77410 256365 165353 -79125 -12356 -40948 -63617 -130599 135946 -171076 -15645
10696 13635 -228935 84917 -45352 -172080 166430 -4106 -11446 151652 -110393 109621 114866
10685 114866 -192147 -158195 202216 -176072 -114690 -184012 -477462 172635 78037 38790
10674 23768 120592 85768 -9467 -111026 16068 -236972 -140308 221681 103032 -103927 43234
10662 -195318 -287752 -217389 -5652 17237 172192 -309059 31148 -56088 3726 324924 -275108
10650 -61733 20010 -353486 -238153 -204576 57580 -97769 -86511 70069 216759 -73384 -383610
10639 -383610 -20788 -169515 162796 -217279 -50287 -144219 147698 71327 -94388 233350
10628a10103j10342B45011A02677A8858J84504r9811a40946k13063e6763j09499
10618a66262H0788l6777Q8522J6826C4054a77741G1783c53629A25824a25873C21486
10606d24906a64142A8501b87215e7283I4738b94168e3764k26529H2950a10245
10595C2147a68062A43141K85015A63793a02963G692K11849b29740p2047i4751
10584D1272c21135A92542a12038j73729J39525H0315O4965E21b3186j60555q3728
10573b67469N4601j24842J23219H4566a56532A15088b16798i7306M2272o0411
10563a15445D1K19102a34346B28120b17115B13241c70639i0761r3191A44110C2520
10551B36278l6074H6749d70219a57997G8454Q8869A3806a70114G8732M9723A4458
$$ plain form
10628 -110103 -220445 245011 102677 18858 203362 103551 -140946 -354009 -56763 -166262
10618 -166262 80788 44011 132533 149359 34054 -177741 71783 -353629 125824 -125873 321486
10606 -424906 -164142 18501 -287215 -57283 94738 -294168 -53764 -280293 82950 -110245
10595 32147 -168062 143141 428156 163793 -102963 7692 219541 -229740 -301787 -94751
10584 41272 -321135 192542 -112038 -285767 -146242 80315 145280 521 -23186 -183741 -267469
10573 -267469 -212868 -337710 -214491 84566 -156532 115088 -216798 -97306 -55034 -115445
10563 -115445 41 219143 -134346 228120 -217115 213241 -370639 -90761 -183952 144110 32520
10551 236278 200204 86749 -470219 -157997 78454 167323 13806 -170114 78732 128455 14458
10539D6462d5072A81052C442b21252q830A39787a5942p2338G7944a23153M6751
10528g6402k657j71917B42091a41211C9283b22640c9288a0105C57170j17393b55595
10516b37158A27230a17626j35612J6859f7658A29788a43364m1652J9373f8075
10505A23805a89943B78619j00327q5605j1157e2780k07866B5174b43667A87404
10494b8254l64067A677K7336h2872F4713a17505F3233o229O6669B0992a61856
10482A37280b66900a12156L5451B17191a33107J4555A71878b06705i7847l24806
10472d22653B7437a30982A18312f1219k4559k4343E9263e628k4816l6809b1674
10460i3051B70066G3530L3653I702K9502a73907N2981G4188c2662j05041G4282
$$ plain form
10539 46462 -45072 181052 3442 -221252 -230082 139787 -15942 -88280 77944 -123153 -76402
10528 -76402 -79059 -250976 242091 -141211 39283 -222640 -39288 -10105 357170 239777 -255595
10516 -237158 127230 -117626 -253238 -236379 -67658 129788 -143364 -185016 -165643 -68075
10505 123805 -189943 278619 178292 92687 81530 -52780 -260646 25174 -243667 187404
10494 -28254 -392321 1677 29013 -82872 64713 -117505 63233 57004 123673 20992 -161856
10482 137280 -266900 -112156 -76705 217191 -133107 -118552 171878 -206705 -97847 -422653
10472 -422653 27437 -130982 118312 -61219 -85778 -110121 59263 -5628 -30444 -67253 -21674
10460 -93051 270066 73530 107183 9702 39204 -173907 -120926 74188 -32662 -137703 74282
10448g1370G3591b24892F5522d65323B87902r1779b00262A0535a17857M7436k87757
10437c58178B46538H286a83168G4732K98324G1471Q1885E9712b4692n8965B19926
10425A08406A8655P791d6238l5806B5511L4698a41029k4947B45268a34178A27974
10413A85486a16641k26215A49383f6421o5A23319b2445p1036A96124I0682a1894
10401a44458D49984a86169C9090J81350b00202a2359l82698G7591J31513p1747
10391A37357B4377a76618N2583F6111b92535A26623K0017C5125a73469C53190
10380A04349a4082A00L61036d7127h275A79102Q1913B5084e3204A86442G0988
10368A35739J69453E9063J07018E3517J01162j80m1230K38138B1155J88198J91569
$$ plain form
10448 -71370 73591 -224892 65522 -465323 287902 196123 -200262 10535 -117857 -70421 -358178
10437 -358178 246538 8286 -183168 74732 373056 71471 153356 59712 -24692 -83657 219926
10425 108406 18655 26446 -46238 -82044 25511 60209 -141029 -165976 245268 -134178 127974
10413 185486 -116641 -342856 149383 -66421 -66486 123319 -22445 -93481 196124 90682 -11894
10401 -144458 449984 -186169 39090 220440 -200202 -12359 -395057 77591 209104 137357
10391 137357 24377 -176618 -124035 66111 -292535 126623 146640 35125 -173469 353190
10380 104349 -14082 100 361136 -47127 -8275 179102 261015 25084 -53204 186442 70988
10368 135739 305192 59063 166081 53517 154679 154499 113269 351407 21155 209353 400922
10357D00922m4903A36806L76110j29858j32908J14951j31893K40787K75636k89669
10347D59962j45857j9242N6769L9991j76859L10760A89030Q305Q423l8726J98670
10336C65702n6289K84085K54765B59578M74263C48938M7097A82528N6803r5014
10326A44317N1329l6959L58479k37501J69425k13849A13899b047A62313J19700
10316B82013M132A20237a31662A64629a43704I0882N1838L30154B4993K66407
10306B91400A25000K7424C8420J88894a29760D9052L6716h3553I3898a07129F5363
10294A03046K73843j43652a02109l490B39433b26027D4261a53745b2537j79816
10284b02353a3754j48928C3764J16361i8517k5111d9975A15970J35718A20148
$$ plain form
10357 400922 356019 136806 512916 383058 250150 365101 233208 473995 749631 459962
10347 459962 314105 294863 351632 391623 214764 525524 189030 197335 205758 167032 365702
10336 365702 309413 593498 848263 259578 733841 348938 396035 182528 239331 144317
10326 144317 195646 158687 517166 279665 449090 235241 113899 -2047 162313 282013
10316 282013 286145 120237 -131662 164629 -143704 90882 142720 472874 24993 291400
10306 291400 125000 152424 38420 227314 -129760 49052 85768 -83553 93898 -107129 65363
10294 103046 376889 233237 -102109 -105599 239433 -226027 44261 -153745 -22537 -202353
10284 -202353 -13754 -162682 33764 150125 -98517 -123628 -49975 115970 251688 120148
10273a65060M7601j4391F0700a61536k9594b6464j22009j0007C2078D311g2370
10261b04753f384n7090j3820B11398h8879A17328K7034G1497i7577c5449F9715
10249F5277j0265a1940k99010A54707C0147K18298r6071O0124I1882Q6750p1629
10238A07003J43093e4781A23089b11006B04527a67107F1105f3074M732E0136L8675
10227H8811h2651q1581c6181B23417r3234a99633a8937k08913A09150Q5394A0974
10215A00291L8900b10287d4006j02124l97591B02500e2707j54634l9683B41350
10204H6387J11294j3270P1485b49876H8176b16147J1861E3073e818j84099o6256
10193b56173F4800a75472H2388c3740o1766j4629j91271A05701d9068j16621j27232
$$ plain form
10273 -165060 -117459 -131850 60700 -161536 -191130 -26464 -148473 -158480 32078 4311 -72370
10261 -204753 -6384 -63474 -77294 211398 -88879 117328 144362 71497 -97577 -35449 69715
10249 65277 55012 -11940 -310950 154707 30147 248445 152374 212498 91882 178632 107003
10238 107003 250096 -54781 123089 -211006 204527 -167107 61105 -63074 -58342 50136 88811
10227 88811 -82651 -164232 -36181 223417 130183 -199633 -18937 -227850 109150 194544 10974
10215 100291 139191 -210287 -44006 -146130 -543721 202500 -52707 -207341 -247024 241350
10204 86387 197681 184411 255896 -249876 88176 -216147 -204286 53073 -5818 -189917 -256173
10193 -256173 64800 -175472 82388 -33740 -95506 -110135 -301406 105701 -49068 -165689 -292921
10182b92921C09450I6587e3966q718D6616g4806o442K438o2456c5945j05944O9816
10170g2073E4340g2716j85954C2017Q8485j781a74575j7449A22800n0897g7264
10158d7225D1541O8874K61282C0207h07l14618J48852L3064K6121N1310k9819
10147h5897j48146A80146a2366m0626B16802a16188A45233C3003i6488j34839
10137b31327M7548A63278e9232J3207F2867b52653R6445r2520H1401g5933H5969
10125a15158l9907L007p8623j11472E9665L2475a16975j57369B3243O9007g8203
10113A59897c19602h4306H8956b71171J26625q6217I0878d30483i0824B50820
10102d6770E0975b02659e9394H5593P4886J48185L665a19517B14820m0387d46914
$$ plain form
10182 -292921 309450 96587 -53966 -62684 46616 -74806 -81248 -78810 -141266 -35945 -141889 -72073
10170 -72073 54340 -72716 -258670 32017 120502 118721 -174575 -192024 122800 71903 -77264
10158 -47225 41541 110415 371697 30207 -807 -315425 -166573 -133509 -107388 -56078 -85897
10147 -85897 -234043 180146 -12366 -52992 216802 -116188 145233 33003 -96488 -231327
10137 -231327 -183779 163278 -59232 -46025 62867 -252653 -156208 -248728 81401 -75933 85969
10125 -115158 -155065 -152058 -230681 -342153 59665 92140 -116975 -274344 23243 92250 -78203
10113 159897 -319602 -84306 88956 -271171 -144546 -230763 90878 -430483 -90824 250820
10102 -46770 50975 -202659 -59394 85593 160479 308664 312329 -119517 214820 174433 -446914
10090i1221c1926j0039j21803J2608r8630k12299J32898B12243C8439b18598a01547
10078c06600J07616O5120k4145M0307j90556A3792d8810B5957d64583a13227A74304
10066b08179i9683n127A86701a79715C28710j01391a42068N4244j22992k0222
10056b31038d7554n485l7503k01342A35401b38715a6010k11296a05038K3215A5159
10044d6435j7054j20192E526a85030O5174j27330I5872a16651j6585N806A97477
10032a91151J9867e1636A80275c58521J76032j06939a1365D53735b92713B95775
10021A40314c09261f5907j77689J02913r6369A86701E0804f6761Q14A17363a42510
10009f922j53595D2022Q5942b69951N0230Q8844j804C24440a41594D0776b82871
$$ plain form
10090 -91221 -31926 -41965 -163768 -151160 -249790 -462089 -329191 212243 38439 -218598 -101547
10078 -306600 -198984 -133864 -158009 -117702 -308258 13792 -48810 25957 -464583 -113227 174304
10066 -208179 -99683 -104810 186701 -179715 328710 227319 -142068 -87824 -210816 -231038
10056 -231038 -47554 -53039 -90542 -291884 135401 -238715 -16010 -227306 -105038 -81823 15159
10044 -46435 -63489 -183681 5526 -185030 -119856 -247186 95872 -116651 -133236 -127430 197477
10032 -191151 -171284 -51636 180275 -358521 -182489 -289428 -11365 453735 -292713 295775
10021 140314 -309261 -65907 -243596 -140683 -237052 186701 50804 -66761 -65947 117363 -142510
10009 -6922 -160517 42022 127964 -269951 -219721 -130877 -132681 324440 -141594 40776 -282871
9997e1541j88580J07177K1593k01454B93355a43622O0288K4886C82a5396E3981
9985B20862a94861N5291G763J71066d7914I53a81387A3548K5028N5070J3434A3168
9972a8073m5767o9369A10653g5362A475a28903c786I9942f7666q2681O6274D9792
9959E1984a19781e3168C197a55954L1477l3785B15974F577b52147N1470B9387
9947A18260L0067h3458D296d7480k1250A68225K0515I1412c85759A59094a94226
9935c21939c9219k427j8414A13815m7101b2391C29482b30681H9292a58455m5978
9924b04433H371P402d1599B45888a81671e9662b0560j21227f6130j2139k04527
9913b82796b4459k54930B6283a7840l0574j2145A66934d6031a678m66198b8500
$$ plain form
9997 -51541 -240121 -132944 -111351 -312805 293355 -143622 -83334 -58448 382 -15396 53981
9985 220862 -194861 -139570 7763 178829 -47914 953 -181387 13548 38576 93646 107080 13168
9972 -18073 -63840 -133209 110653 -75362 1475 -128903 -3786 99942 -67666 -150347 -84073 49792
9959 51984 -119781 -53168 3197 -155954 -124477 -158262 215974 6577 -252147 -200677 29387
9947 118260 148327 -83458 4296 -47480 -68730 168225 188740 91412 -385759 159094 -194226
9935 -321939 -39219 -41646 -60060 113815 66714 -22391 329482 -230681 89292 -158455 -204433
9924 -204433 8371 15773 -41599 245888 -181671 -59662 -20560 -141787 -66130 -78269 -282796
9913 -282796 -24459 -279389 26283 -17840 -48414 -60559 166934 -46031 -1678 -467876 -28500
9901d0272H4628a21406j26030h7336b7281j54437R83r0393J25790k0683P6149
9890h9872a8606o5939j31086j18865H9273O7045J708a2830B3218a74340b8890
9878c49675a63157k85534A27623a79886Q3733j00526M7789I9032a48601c2942
9867a89190l3184M6274I2101b408F335i2507D2086a27609J4514J7371L9790B7248
9854f5039j8210R984A07147f5168B09728h632n8328q7583j56682A32631a77315
9842a7645k05852p3004A57019C7753L7009b54827K3539F8232N7772a48051k38815
9831c86866A32959P6680b81631a12924l26584H9112b28439j7617R890j37956j16225
9820d90347a99496L535A7141K25114B2581a20070F2095a66192m1989L8442B11244
$$ plain form
9901 -40272 84628 -121406 -247436 -87336 -27281 -181718 -180735 -271128 -145338 -166021 -89872
9890 -89872 -18606 -84545 -215631 -334496 89273 156318 158026 -12830 23218 -174340 -28890
9878 -349675 -163157 -448691 127623 -179886 -96153 -196679 -148890 99032 -148601 -32942
9867 -189190 -222374 -176100 92101 -2408 6335 -92507 42086 -127609 -113095 -95724 -55934 27248
9854 -65039 -83249 -73265 107147 -65168 209728 -8632 -66960 -154543 -311225 132631 -177315
9842 -17645 -223497 -296501 157019 37753 74762 -254827 -231288 68232 126004 -148051 -386866
9831 -386866 132959 209639 -281631 -112924 -439508 89112 -228439 -246056 -236166 -374122 -490347
9820 -490347 -199496 -195961 17141 242255 22581 -120070 62095 -166192 -208181 -169739 211244
9808A15469e4287p4790e1851J2936j2131B845J1268a28069F2985a52283F456J97214
9796B03670b27472B62876q9718N4938E8683A1289a08997r5664C2972J29691a86126
9784A37102b23084a8276j54220K366g1100A66657o8564J03187B1655e8321C43467
9772C763h2553I2800c3603k86500k61626D3929k1511a08202q5143R1883j71205
9761b72667C05811d90218a48948L1863A47439K44409A18139m7176J33844a31505
9750B60794c17171a375E7171f6718J3808J0572B1227g4407H2849C1637L62052
9739C93689A30630a23275l08623f443A75089J08684c07408h3360L3200B1242b46838
9727e3935k39249J25592C46586A9609c52563P8352M9525j21236i9884k15118R6610
$$ plain form
9808 115469 -54287 -129077 -51851 -38915 -51046 2845 14113 -128069 62985 -152283 6456 203670
9796 203670 -227472 262876 173158 228096 58683 11289 -108997 -204661 32972 162663 -186126
9784 137102 -223084 -18276 -172496 -170130 -71100 166657 98093 201280 21655 -58321 343467
9772 3763 -82553 92800 -33603 -320103 -581729 43929 22418 -108202 -193345 -101462 -272667
9761 -272667 305811 -490218 -148948 -117085 147439 391848 118139 70963 204807 -131505
9750 260794 -317171 -1375 57171 -66718 -52910 -42338 21227 -74407 82849 31637 393689
9739 393689 130630 -123275 -431898 -6443 175089 283773 -307408 -83360 -50160 21242 -246838
9727 -53935 -293184 -167592 346586 19609 -352563 -274211 -224686 -345922 -99884 -315002 -218392
9716b18392o5432b4522r1216I4922b14785k44876f4240J6592b520l12269A09734
9704b35520C45764h2249B02630a22041j94726J52110B61670a71000K4463o6422
9694b12959e8811j64705B26911B8866J36338b54194a7022o7940a9559q8682A01957
9682b65372i5708I3183J95254d511E269a63331j9072g9921D9981h0609F4435i5389
9669B0072a11515A03343a77456k43898A8686c1308j12729B65869j09941k8135
9659A27793f02417A04444d5191A19873a85966c4214e901n17154H030a18852d6154
9647A43153b54601A22620a26880r9372N8961j98201I1083a20201k06138B5831
9636a37062a4491k41468A23018b39534R8754d8342l2658j58948J00836A12791
$$ plain form
9716 -218392 -283824 -24522 -115738 94922 -214785 -459661 -64240 -47648 -2520 -314789 109734
9704 -235520 345764 -82249 202630 -122041 -316767 -164657 261670 -171000 -146537 -212959
9694 -212959 -58811 -223516 226911 28866 165204 -254194 -17022 -84962 -19559 -108241 101957
9682 -265372 -95708 93183 288437 -4511 5269 -163331 -182403 -79921 49981 -80609 64435 -95389
9669 20072 -111515 103343 -177456 -421354 18686 -31308 -144037 265869 155928 127793
9659 127793 -602417 104444 -45191 119873 -185966 -34214 -5901 -523055 8030 -118852 -46154
9647 143153 -254601 122620 -126880 -226252 -167291 -365492 91083 -120201 -326339 25831
9636 -137062 -14491 -255959 123018 -239534 -140780 -48342 -81000 -239948 -139112 112791
9625g3286c788k89833J39373N9990B65052m0537r4321C3213a75069h3909L4472
9614d9437A41374L7141b30948q6097B3416b69864J32533k2393e4401b62A06785
9602A40855i6995F1259B7362e1129j73756A07453a83047B1343a74160L8049r5284
9591b31395A49198a93417i0423A45234k6575b14393G8037d8879A03254g1583C6843
9579b35262D57199k05544p0346g6527G5528b91139k4342A2216N4026A7777d13135
9567A2156L05195f9412M99m9656a9395C16138c66813i8636A38768a90647d8994
9555A3169a08870k14744B41502a0899j39766b9995E818Q2547b51365Q2744P7924
9544i0697p8967O8733d5477k43656a42707d6563A00044b39138D2645c9809r2749
$$ plain form
9625 -73286 -3788 -293621 -154248 -94258 265052 224515 130194 33213 -175069 -83909 -49437
9614 -49437 141374 178515 -230948 -317045 23416 -269864 -137331 -159724 -54401 -262 106785
9602 140855 -96995 61259 27362 -51129 -224885 107453 -183047 21343 -174160 -136111 -231395
9591 -231395 149198 -193417 -90423 145234 118659 -214393 78037 -48879 103254 -71583 36843
9579 -235262 457199 251655 181309 -76527 75528 -291139 -315481 12216 66242 17777 -413135
9567 12156 317351 -69412 -68913 -118569 -19395 316138 -366813 -98636 138768 -190647 -48994
9555 13169 -108870 -323614 241502 -10899 -150665 -29995 5818 88365 -251365 -168621 -90697
9544 -90697 -169664 -100931 -45477 -289133 -142707 -46563 100044 -239138 42645 -39809 -132558
9533a32558j90176J06403A36317f5518o7547j17672D4914a99812A89705d9194
9522b33686A51487B9951i9031a4154B26867c35655G0835a76212r1786b1699k67728
9511b89427c638j4833k39522a24856e865k26545c7104C2618N7722C4710a65879
9499c62580D4948j3585J87890a27310o4567K8781l22017c0900I9724a86235J2695
9488a73540Q2931k1206q6048C4278d645k30235c9341j74862N6133O3159b8070
9476e9528i999k08594A86928a54999n7716l2380i9923B9249O292L3041M4346d3930
9463A61528b06047h109c191k2966j42715P775c6220E2980b04497C4847d4090p1478
9451a15568p9499m5905h9483i657o4478k1035M2797o4460l6745C15687j44715
$$ plain form
9533 -132558 -322734 -216331 136317 -65518 -133065 -250737 44914 -199812 189705 -49194
9522 -233686 151487 29951 -99031 -14154 226867 -335655 70835 -176212 -267998 -21699 -289427
9511 -289427 -3638 -18471 -257993 -124856 -5865 -232410 -37104 32618 90340 34710 -165879
9499 -362580 44948 31363 219253 -127310 -191877 -163096 -485113 -30900 99724 -186235 -173540
9488 -173540 -90609 -111815 -197863 34278 -4645 -234880 -39341 -214203 -158070 -94911 -28070
9476 -59528 -9999 -218593 186928 -154999 -212715 -245095 -99923 29249 35541 68582 112928 -43930
9463 161528 -206047 -8109 -3191 -26157 -168872 -161097 -36220 52980 -204497 34847 -44090 -115568
9451 -115568 -195067 -240972 -89483 -9657 -74135 -95170 -52373 -116833 -153578 315687 170972
9440A70972J852c25176A32988o0678c48123J43692j6853L1551P3982n7431P7133
9429i6049k21261D11938c34622C2975K17505a21124D8795L2674d39765d3984j12709
9418a56693B3205a12781j39737B00316b3200j36494e846j26458A631f0325k93503
9407c53828a48528B99880d1782j75442e4708l2647M1836K0651I6445a88391E9247
9395b03713b4483A50482A5585a97152b4402q635F6411d71803a24781m019d9602
9383b78198H8508B2536c4352m58755a04616D6053J08218h3841A2306b4123N387
9372a8736A22565a20428N8186A33529P6758i03A2907e8037F5509e1590D781L4745
9360C9526b32691E7559c3200D49168a59323Q41c5410A9855E168J70414c88054
$$ plain form
9440 170972 172824 -325176 132988 72310 -348123 -204431 -221284 -189733 -115751 -173182 -96049
9429 -96049 -317310 411938 -334622 32975 250480 -121124 48795 81469 -439765 -43984 -156693
9418 -156693 23205 -112781 -252518 200316 -23200 -159694 -5846 -132304 1631 -60325 -353828
9407 -353828 -148528 299880 -41782 -217224 -54708 -87355 -45519 -24868 96445 -188391 59247
9395 -203713 -24483 150482 15585 -197152 -24402 -33037 66411 -471803 -124781 -128800 -49602
9383 -278198 88508 22536 -34352 -493107 -104616 46053 154271 -83841 12306 -24123 -18736
9372 -18736 122565 -120428 -62242 133529 210287 -903 12907 -58037 65509 -51590 4781 39526
9360 39526 -232691 57559 -33200 449168 -159323 -158482 -35410 19855 5168 175582 -388054
9348A08479b2490k70115A68795c66247a47410A07587J38937a27082A49630M260
9338A53890a8961d56j43833A40159b98849a05486D445N3602C846L5025c87396
9326i6364p4953J0788O4405A59570N0071D8670a82502j33296C7693j1177d79406
9314c334n1633C74277E558a2569j20765k8695G3130b26455R4773F2081b96449
9302a67258k3536A01723h6558C53537A5459i3365c5532k33174P7922H3978A4584
9290H4163N4844a72622k2946D9853A8801M4371b46341M3211M2260F3317b28474
9278f0372H5685b28388f2525O249r2553c6283l5372k27313b5753o8999B30709
9266e5358b869B78489A01145k3284L3900b20916G7729h7401c7917G1040c89225
$$ plain form
9348 108479 -22490 -292605 168795 -366247 -147410 107587 246524 -127082 149630 153890
9338 153890 -18961 -456 -144289 140159 -298849 -105486 4445 58047 3846 38871 -387396
9326 -96364 -171317 -160529 -96124 159570 209641 48670 -182502 -315798 37693 26516 -479406
9314 -3334 -54967 374277 5558 -12569 -133334 -162029 73130 -226455 -131682 62081 -296449
9302 -167258 -190794 101723 -86558 353537 15459 -93365 -35532 -268706 -190784 83978 14584
9290 84163 139007 -172622 -195568 49853 18801 63172 -246341 -203130 -160870 63317 -228474
9278 -60372 85685 -228388 -62525 -56276 -148829 -36283 -71655 -298968 -25753 -94752 230709
9266 -55358 -2869 278489 101145 77861 111761 -220916 77729 -87401 -37917 71040 -389225
9254D4653J13539C5397J89373j07639d41664D5949K6611b58536Q7236l4589J8090
9243a87799f9895o6931d0827C12408a50219G3326b44413a07433N3429I4939c9949
9231a97716d5345a4228q8730a4416l22632a17623a1385q6078o5299A7748a00221
9219b19547b0858l25091A89744a18863A04591N7464a99724A90573a80771e9361
9208e4556j90714P8809n5324B6088L1561f8134n6013B11870a90235j13607i8654
9196b33169A68342g1884m328c2533B7028J11103J60796H9329a60390J7546m6868
9185a89712M7918p724a0622A11467b29374E1254B3248c28p3971b3138b691A3842
9172a01912D1552a54449L7996J6145j5146o578C4259d8872k57233j35062a04808
$$ plain form
9254 44653 158192 35397 224770 117131 -441664 45949 72560 -258536 -171300 -205889 -187799
9243 -187799 -69895 -136826 -40827 312408 -150219 73326 -244413 -107433 -54004 94939 -39949
9231 -197716 -45345 -14228 -102958 -14416 -337048 -117623 -11385 -97463 -162762 17748 -100221
9219 -219547 -20858 -345949 189744 -118863 104591 162055 -199724 190573 -180771 -59361
9208 -54556 -245270 -166461 -221785 26088 57649 -68134 -124147 211870 -190235 -303842 -98654
9196 -233169 168342 -71884 -76212 -32533 27028 138131 298927 89329 -160390 -142844 -189712
9185 -189712 -141794 -149518 -10622 111467 -229374 51254 23248 -328 -74299 -23138 -2691 13842
9172 -101912 41552 -154449 -116453 -100308 -115454 -122032 34259 -48872 -306105 -441167 -104808
9160a47788H4205b08196F8812K34266c13004a15867m3517m2549A04189J0618b11232
9148c4236A42719a4213B6820P1127a26369K7943j58813D6872K40757G6883b57380
9136D9312i2160m0790G0235B2064a6151k73004A84789D3755b36243M1469P0493
9125a24281k07304A43128i0835G3806a22332J0093A37677f904j66551C14712b15664
9113A17532b14374e8784l0619L822A05878J9517a92949A45725b07272B62538a30774
9101E2364b04376R3804b7362j91944b9033A5039b06189B3724a94386L6661B30802
9089B06746b57160D0571c63103P2884C2646J2262Q0914b81925H8197J00008r3024
9078I5181g407m07757A57511b31122f2817C05854e3213k94953a00086n4796b8836
$$ plain form
9160 -147788 84205 -208196 68812 303078 -313004 -115867 -159384 -201933 104189 114807 -211232
9148 -34236 142719 -14213 26820 97947 -126369 -98426 -257239 46872 287629 76883 -257380
9136 49312 -92160 -132950 70235 22064 -16151 -289155 184789 43755 -236243 -194774 -124281
9125 -124281 -331585 143128 -90835 73806 -122332 -112239 137677 -6904 -173455 314712 -215664
9113 117532 -214374 -58784 -89403 -85581 105878 125395 -192949 145725 -207272 262538 -130774
9101 52364 -204376 -110572 -27362 -219306 -29033 15039 -206189 23724 -194386 -157725 230802
9089 206746 -257160 40571 -363103 -290219 32646 44908 125822 -281925 88197 188205 95181
9078 95181 -7407 -415164 157511 -231122 -62817 305854 -53213 -348166 -100086 -154882 -28836
9066c15401J53769j5415j62158a25075l1116j86627H0041J11956A054a81342o431
9055a87773Q0437o6061e6165j58159f4784k31319N7805R7971e3914L947B90691
9043b2694m0816q694F9125b61929N9918B7644q327c38136A44052M0077b5040l66377
9031c91417a08701C0879b95511D5895J579h9763j29797A96891H091a12763r4717
9020b07480g2919A34529c4586B9533e1405J4411j14604O4550q5769F7817C700
9008c3793r3192B8040a57998c0875o6254k32593a29820a7922D0660R3480c51527
8996i1327j72624b2697j70241L366C52797c02191h4786A67067l5279K407A3810
8984g2285A80402a10506c6571A9452b93691B27520b4852j85792H1567l7083a97704
$$ plain form
9066 -315401 -161632 -177047 -339205 -125075 -156191 -342818 80041 191997 1054 -181342 -187773
9055 -187773 -107336 -173397 -56165 -214324 -64784 -296103 -238298 -140327 -53914 -49967 290691
9043 -22694 -63510 -72204 69125 -261929 -202011 27644 19317 -338136 144052 184129 -25040 -391417
9031 -391417 -108701 30879 -295511 45895 47474 -89763 -219560 196891 8091 -112763 -207480
9020 -207480 -72919 134529 -34586 29533 -51405 -36994 -151598 -87048 -172817 67817 3700
9008 -33793 -126985 28040 -157998 -30875 -97129 -329722 -129820 -17922 40660 134140 -351527
8996 -91327 -263951 -22697 -192938 -189572 352797 -302191 -84786 167067 131788 134195 13810
8984 -72285 180402 -110506 -36571 19452 -293691 227520 -24852 -210644 81567 44484 -197704
8972A25391d7051j66762I2352a60693A30785c6267k69940C4102c48758J20803
8962b27955C9247c4456k0133A16334C7276J40384E6032O5571a08229j72431i6113
8950A28509J5167o7999A8592c8503p6414e1157m2953E1326a95500A20996k4763
8939I6233b64101d5120q0810n45127g6355B93179j27128b57560A32020b435E6023
8927a17885A17232b4082k19562A94831b25185Q5538A20041f5994A13403R4670
8917B08073I782J95415b25503A56978L33243I1449M20118K47211K41814L85632
8907A386224J510988K422763L319072m303593j852619j147037l46042D67652j8939
8898D48713h1797A85477l9149J64529Q3920A17874K50909m9160E7401e6554D2240
$$ plain form
8972 125391 -47051 -213813 92352 -160693 130785 -36267 -306207 34102 -348758 -227955
8962 -227955 39247 -34456 -54589 116334 37276 177660 56032 121603 -108229 -280660 -96113
8950 128509 143676 75677 18592 -38503 -114917 -51157 -94110 51326 -195500 120996 96233
8939 96233 -264101 -45120 -125930 -671057 -76355 293179 166051 -257560 132020 -2435 56023
8927 -117885 117232 -24082 -243644 194831 -225185 -139647 120041 -65994 113403 208073
8917 208073 9782 205197 -225503 156978 490221 91449 511567 758778 1000592 1386224
8907 1386224 2897212 5319975 8639047 4335454 2482835 1335798 989756 467652 448713
8898 448713 -81797 185477 146328 310857 394777 117874 368783 319623 57401 -56554 42240
8886c93932H0802b5175E7975a49189c218B56844c739n5960G9273a47522g0262
8874G5307c90508G0890a35511A4455c93263g9946A87441a75730A17947M515L28827
8863D51289b17143P2834O4837p1595A76702g2300G8872b56849g0709l19102a17681
8851C6659K11272j13824a30782F7626J34603b56316k839G6086O776f6452Q78o4317
8839a29891A83532i3115I4195b8809B25402i1291M5053A62913F2157f9252j90421
$$ plain form
8886 -393932 80802 -25175 57975 -149189 -3218 256844 -3739 -59699 79273 -147522 -70262
8874 75307 -390508 70890 -135511 14455 -393263 -79946 187441 -175730 117947 122462 451289
8863 451289 -217143 -144309 -79472 -151067 176702 -72300 78872 -256849 -70709 -389811 -117681
8851 36659 247931 134107 -130782 67626 202229 -256316 -259155 76086 82862 -66452 -65574 -129891
8839 -129891 183532 -93115 94195 -28809 225402 -91291 -46238 162913 62157 -69252 -259673
$$ [...]
##END NTUPLES=NMR SPECTRUM
##END=
