
##TITLE=UV1153_M3-1004-1000_6301790_CnuTG2mB1p
##JCAMPDX= 6.0         $$ Bruker NMR JCAMP-DX V2.0
##DATA TYPE= NMR SPECTRUM
##DATA CLASS= NTUPLES
##ORIGIN= BRUKER
##OWNER= Administrator
$$ 1.72 TOPSPIN		Version 2.1
$$ 2012-06-06 03:08:17.015 -0500  Administrator@TOPSPIN
$$ Compression mode = diff/dup
##.OBSERVE FREQUENCY= 400.13188235
##.OBSERVE NUCLEUS= ^1H
##.ACQUISITION MODE= SIMULTANEOUS (DQD)
##.ACQUISITION SCHEME= undefined
##.AVERAGES= 64
##.DIGITISER RES= 22
##SPECTROMETER/DATA SYSTEM= spect
##.PULSE SEQUENCE= noesygpps1d.comp
##.SOLVENT NAME= COFFEE_meoh
##.SHIFT REFERENCE= INTERNAL, COFFEE_meoh, 1, 14.96696
##AUDIT TRAIL= $$ (NUMBER, WHEN, WHO, WHERE, PROCESS, VERSION, WHAT)
$$ ##TITLE= Audit trail, TOPSPIN		Version 2.1
$$ ##JCAMPDX= 5.01
$$ ##ORIGIN= Bruker BioSpin GmbH
$$ ##OWNER= Administrator
$$ $$ C:\Bruker\TOPSPIN/data/COFFEE/nmr/UV1153_M3-1004-1000_6301790_CnuTG2mB1p/12/pdata/1/auditp.txt
$$ ##AUDIT TRAIL=  $$ (NUMBER, WHEN, WHO, WHERE, PROCESS, VERSION, WHAT)
(   1,<2012-06-06 03:08:11.343 -0500>,<Administrator>,<TOPSPIN>,<go>,<TOPSPIN 2.1>,
      <created by zg
	started at 2012-06-06 02:56:41.078 -0500,
	POWCHK enabled, PULCHK disabled,
       configuration hash MD5:
       D5 CA 7A 23 FE 6B EE E2 50 67 74 61 24 F7 5E 3B
       data hash MD5: 64K
       F5 18 5C A4 95 ED 66 73 D2 37 28 14 40 A8 C7 33>)
(   2,<2012-06-06 03:08:14.250 -0500>,<Administrator>,<TOPSPIN>,<proc1d>,<TOPSPIN 2.1>,
      <Start of raw data processing
       efp LB = 0.3 FT_mod = 6 PKNL = 1 PHC0 = 0 PHC1 = 0 SI = 128K 
       data hash MD5: 128K
       67 63 BE 09 3E 69 5E 0B CC 41 6A 80 09 B8 27 59>)
(   3,<2012-06-06 03:08:15.453 -0500>,<Administrator>,<TOPSPIN>,<proc1d>,<TOPSPIN 2.1>,
      <pk PHC0 = 30.94299 PHC1 = 0 
       data hash MD5: 128K
       AA 93 AA AE 9B FA 96 34 3B D6 9A FD 47 4E 80 BC>)
(   4,<2012-06-06 03:08:16.375 -0500>,<Administrator>,<TOPSPIN>,<proc1d>,<TOPSPIN 2.1>,
      <abs ABSG = 1 
       data hash MD5: 128K
       E8 06 6F D7 94 C1 7A 61 87 C6 BA 7F 84 B0 ED 50>)
(   5,<2012-06-06 03:08:16.468 -0500>,<Administrator>,<TOPSPIN>,<proc1d>,<TOPSPIN 2.1>,
      <abs ABSG = 2 
       data hash MD5: 128K
       4B 38 99 1B 80 8C C4 22 8D F4 0F 13 48 FC B1 40>)
(   6,<2012-06-06 03:08:16.828 -0500>,<Administrator>,<TOPSPIN>,<proc1d>,<TOPSPIN 2.1>,
      <abs ABSG = 3 
       data hash MD5: 128K
       27 DD 5A 33 77 2A A9 E6 0B 02 4E 69 89 86 DA 49>)
(   7,<2012-06-06 03:08:16.875 -0500>,<Administrator>,<TOPSPIN>,<proc1d>,<TOPSPIN 2.1>,
      <abs ABSG = 4 
       data hash MD5: 128K
       BC AF CF D7 67 39 F1 52 0A 0C 3F 1D 60 DD C3 BF>)
(   8,<2012-06-06 03:08:16.937 -0500>,<Administrator>,<TOPSPIN>,<proc1d>,<TOPSPIN 2.1>,
      <abs ABSG = 5 
       data hash MD5: 128K
       A5 96 01 77 B8 D0 BF 03 BD CD 94 30 3C 95 38 FD>)
$$ ##END=
$$ 
$$ $$ hash MD5
$$ $$ FA 91 E9 32 CB 3A 45 F4 93 04 A5 A5 6B 77 EF 5B
##$RELAX= 
##$RELAX= 
##$RELAX= 
##$RELAX= 
##$RELAX= 
##$RELAX= 
##$RELAX= 
##$RELAX= 
$$ Bruker specific parameters
$$ [...]
##$TP07= 0
##$TPNAME0= <>
##$TPNAME1= <>
##$TPNAME2= <>
##$TPNAME3= <>
##$TPNAME4= <>
##$TPNAME5= <>
##$TPNAME6= <>
##$TPNAME7= <>
##$TPOAL= (0..7)
0.5 0.5 0.5 0.5 0.5 0.5 0.5 0.5
##$TPOFFS= (0..7)
0 0 0 0 0 0 0 0
##$TUNHIN= 0
##$TUNHOUT= 0
##$TUNXOUT= 0
##$USERA1= <user>
##$USERA2= <user>
##$USERA3= <user>
##$USERA4= <user>
##$USERA5= <user>
##$V9= 5
##$VALIST= <valist>
##$VCLIST= <CCCCCCCCCCCCCCC>
##$VD= 0
##$VDLIST= <DDDDDDDDDDDDDDD>
##$VPLIST= <PPPPPPPPPPPPPPP>
##$VTLIST= <TTTTTTTTTTTTTTT>
##$WBST= 2048
##$WBSW= 25
##$XGAIN= (0..3)
0 0 0 0
##$XL= 0
##$YL= 0
##$YMAX_a= 10655505
##$YMIN_a= -7481770
##$ZGOPTNS= <>
##$ZL1= 120
##$ZL2= 120
##$ZL3= 120
##$ZL4= 120
##$ABSF1= 14.96696
##$ABSF2= -5.58557
##$ABSG= 5
##$ABSL= 3
##$ALPHA= 0
##$AQORDER= 0
##$ASSFAC= 0
##$ASSFACI= 0
##$ASSFACX= 0
##$ASSWID= 0
##$AUNMP= <proc_prof1d_extract.lims>
##$AXLEFT= 0
##$AXNAME= <>
##$AXNUC= <1H>
##$AXRIGHT= 0
##$AXTYPE= 0
##$AXUNIT= <>
##$AZFE= 0.1
##$AZFW= 0.1
##$BCFW= 0
##$BC_mod= 0
##$BYTORDP= 0
##$COROFFS= 0
##$CY= 15
##$DATMOD= 1
##$DC= 0
##$DFILT= <>
##$DTYPP= 0
##$F1P= 0
##$F2P= 0
##$FCOR= 0.5
##$FTSIZE= 131072
##$FT_mod= 6
##$GAMMA= 0
##$GB= 0
##$INTBC= 1
##$INTSCL= 1
##$ISEN= 128
##$LB= 0.3
##$LEV0= 0
##$LPBIN= 0
##$MAXI= 10000
##$MC2= 0
##$MEAN= 0
##$ME_mod= 0
##$MI= 0
##$NCOEF= 0
##$NC_proc= -3
##$NLEV= 6
##$NOISF1= 0
##$NOISF2= 0
##$NSP= 0
##$NTH_PI= 0
##$NZP= 0
##$OFFSET= 14.96696
##$PC= 1
##$PHC0= 30.94299
##$PHC1= 0
##$PH_mod= 1
##$PKNL= yes
##$PPARMOD= 0
##$PPDIAG= 0
##$PPIPTYP= 0
##$PPMPNUM= 2147483647
##$PPRESOL= 1
##$PSCAL= 4
##$PSIGN= 0
##$PYNMP= <proc.py>
##$REVERSE= no
##$SF= 400.130005462572
##$SI= 131072
##$SIGF1= 0
##$SIGF2= 0
##$SINO= 400
##$SIOLD= 131072
##$SPECTYP= <>
##$SREGLST= <1H.CDCl3>
##$SSB= 0
##$STSI= 131072
##$STSR= 0
##$SW_p= 8223.68421052632
##$SYMM= 0
##$S_DEV= 0
##$TDeff= 65536
##$TDoff= 0
##$TI= <>
##$TILT= no
##$TM1= 0
##$TM2= 0
##$TOPLEV= 0
##$USERP1= <user>
##$USERP2= <user>
##$USERP3= <user>
##$USERP4= <user>
##$USERP5= <user>
##$WDW= 1
##$XDIM= 131072
##$YMAX_p= 420049238
##$YMIN_p= -483965789
##$CURPLOT= <Network HP LaserJet P1505>
##$CURPRIN= <$Network HP LaserJet P1505>
##$DFORMAT= <normdp>
##$LAYOUT= <+/1D_H.xwp>
##$LFORMAT= <normlp>
##$PFORMAT= <normpl>
##$SURQMSG= 1
$$ End of Bruker specific parameters
$$ ---------------------------------
##NTUPLES= NMR SPECTRUM
##VAR_NAME=  FREQUENCY,     SPECTRUM/REAL,   SPECTRUM/IMAG
##SYMBOL=    X,             R,               I
##VAR_TYPE=  INDEPENDENT,   DEPENDENT,       DEPENDENT
##VAR_FORM=  AFFN,          ASDF,            ASDF
##VAR_DIM=   131072,        131072,          131072
##UNITS=     HZ,            ARBITRARY UNITS, ARBITRARY UNITS
##FACTOR=    0.0627417313425165, 1,          1
##FIRST=     8223.62146879498, 1178,         -107972
##LAST=      0,             4375,            -109082
##MIN=       0,             -483965789,      0
##MAX=       8223.62146879498, 420049238,    0
$$ Real data points
##PAGE= N=1
##DATA TABLE= (X++(R..R)), XYDATA
$$ [...]
62344F67846L408N064O036O555O634O251N583M930M774N666P623R780J1273J2272
$$ 667846 671254 676318 682354 688909 695543 701794 707377 712307 717081 722747 730370 740150 751423 763695
62330G63695J3477J4767J5219J4663J4277J5129J6698J7502J7042J6550J7717
$$ 763695 777172 791939 807158 821821 836098 851227 867925 885427 902469 919019 936736
62319I36736K0849K4435K6568K6715K6020K6018K7374K9830L2776L5527L7595
$$ 936736 957585 982020 1008588 1035303 1061323 1087341 1114715 1144545 1177321 1212848 1250443
62308A250443L9150M0882M3029M5217M7654N1591N7515O3718O8132P1162P4981
$$ 1250443 1289593 1330475 1373504 1418721 1466375 1517966 1575481 1639199 1707331 1778493 1853474
62297A853474Q0135Q4719Q7225Q8220Q8256Q6033Q0153P1393O1547N0909L8703
$$ 1853474 1933609 2018328 2105553 2193773 2282029 2368062 2448215 2519608 2581155 2632064 2670767
62286B670767K5472J3024K014q722k0009l0983m0476m8495n5495o1178o4949o6988
$$ 2670767 2696239 2709263 2711277 2702555 2682546 2651563 2611087 2562592 2507097 2445919 2380970 2313982
62274B313982o7972o8016o6769o4494o2225o0640n9291n7286n4432n1400m8879
$$ 2313982 2246010 2177994 2111225 2046731 1984506 1923866 1864575 1807289 1752857 1701457 1652578
62263A652578m6953m5327m3879m2624m1230l9074l6038l3011l1082l0210k9113
$$ 1652578 1605625 1560298 1516419 1473795 1432565 1393491 1357453 1324442 1293360 1263150 1234037
62252A234037k6835k4102k2573k2633k2498k0052j5387j0866q560q195p973o829
$$ 1234037 1207202 1183100 1160527 1137894 1115396 1095344 1079957 1069091 1060531 1052336 1044363 1037534
62240A037534n244m044l268k400j161K35J418K195K690L201L923M850O037P547
$$ 1037534 1032290 1028246 1024978 1022578 1021417 1021652 1023070 1025265 1027955 1031156 1035079 1039929 1045966 1053513
62226A053513Q953R387Q692Q130R111J1395J3509J4864J6388J8715K0915K1678
$$ 1053513 1062466 1071853 1080545 1088675 1097786 1109181 1122690 1137554 1153942 1172657 1193572 1215250
62214A215250K1085K0437K0936K3127K7056L2072L6737L9884M1893M4365M8421
$$ 1215250 1236335 1256772 1277708 1300835 1327891 1359963 1396700 1436584 1478477 1522842 1571263
62203A571263N3598N8462O2092O5040O8807P4102P9646Q3304Q4585Q5214Q6625
$$ 1571263 1624861 1683323 1745415 1810455 1879262 1953364 2033010 2116314 2200899 2286113 2372738
62192B372738Q7560Q5080P7616O6246N3148L9735K6347J2850q37j4387k6873l7362
$$ 2372738 2460298 2545378 2622994 2689240 2742388 2782123 2808470 2821320 2820483 2806096 2779223 2741861
62180B741861m5841n3290o0672o8007p4454p9001q1155q1223q0040p8114p5108
$$ 2741861 2696020 2642730 2582058 2514051 2439597 2360596 2279441 2198218 2118178 2040064 1964956
62169A964956p0520o4884n9684n5877n2959m9912m6635m3789m1395l8489l4449
$$ 1964956 1894436 1829552 1769868 1713991 1661032 1611120 1564485 1520696 1479301 1440812 1406363
62158A406363l0096k6778k4801k3406k2066k0788j9176j6342j2385q930p354p106
$$ 1406363 1376267 1349489 1324688 1301282 1279216 1258428 1239252 1222910 1210525 1201595 1194241 1187135
62146A187135o687n588m199k362N00L970O756Q366R455J0509J1509J3084J6375
$$ 1187135 1180448 1174860 1170661 1168299 1168799 1172769 1179525 1187891 1197346 1207855 1219364 1232448 1248823
62133A248823K1152K5421K7634K8205K8261K8275K8656L0172L2599L4163L3623
$$ 1248823 1269975 1295396 1323030 1351235 1379496 1407771 1436427 1466599 1499198 1533361 1566984
62122A566984L1956L0743K9987K8875K7675K7157K6936K6204K5612K6534K8784
$$ 1566984 1598940 1629683 1659670 1688545 1716220 1743377 1770313 1796517 1822129 1848663 1877447
62111A877447L0916L2715L5523L9957M5047M9999N5068O0095O3666O4594O3093
$$ 1877447 1908363 1941078 1976601 2016558 2061605 2111604 2166672 2226767 2290433 2355027 2418120
62100B418120N9774N4539M7219L8397K8860J8984R265O61o450j3100k0770k9856
$$ 2418120 2477894 2532433 2579652 2618049 2646909 2665893 2675158 2675819 2669369 2656269 2635499 2605643
62088B605643l9464m8310n5375o0127o2610o3234o2344o0239n7562n5178n3394
$$ 2605643 2566179 2517869 2462494 2402367 2339757 2276523 2214179 2153940 2096378 2041200 1987806
62077A987806n1745m9650m6980m3850m0322l6388l2146k7951k4475k2236k0749
$$ 1987806 1936061 1886411 1839431 1795581 1755259 1718871 1686725 1658774 1634299 1612063 1591314
62066A591314j8859j6320j4236j3143j1695q639n105l019j800J054O042J0771
$$ 1591314 1572455 1556135 1541899 1528756 1517061 1508422 1503317 1500298 1498498 1499552 1505594 1516365
62054A516365J3597J5702J8459K0876K1332K0039J7955J4679R668M443J340N52
$$ 1516365 1529962 1545664 1564123 1584999 1606331 1626370 1644325 1659004 1668672 1673115 1674455 1675007
62042A675007N51R84K703M758M021q91p110j0517j0154q240o585m754j778J978
$$ 1675007 1675558 1676542 1679245 1684003 1688024 1687133 1680023 1669506 1659352 1651112 1644527 1639773 1637995 1639973
62028A639973N436Q416J1682J5662J9997K4281K8518L2567L5736L7558L8601M0051
$$ 1639973 1645409 1653825 1665507 1681169 1701166 1725447 1753965 1786532 1822268 1859826 1898427 1938478
62016A938478M2538M5721M8661N0305N0048M8471M7170M7070M7236M6257M4398
$$ 1938478 1981016 2026737 2075398 2125703 2175751 2224222 2271392 2318462 2365698 2411955 2456353
62005B456353M3182M2897M2000L9397L5983L3105L0450K6401J9914J1343J860
$$ 2456353 2499535 2542432 2584432 2623829 2659812 2692917 2723367 2749768 2769682 2781025 2782885
61994B782885p309j5443k2693k9667l6456m2535m7695n2330n6593o0075o2690
$$ 2782885 2775576 2760133 2737440 2707773 2671317 2628782 2581087 2528757 2472164 2412089 2349399
61983B349399o4852o6349o6119o3843o0775n8078n5356n1809m7983m5035m2879
$$ 2349399 2284547 2218198 2152079 2088236 2027461 1969383 1914027 1862218 1814235 1769200 1726321
61972A726321m0397l7265l4331l2264l0873k9631k7975k5273k1494j7967j6489
$$ 1726321 1685924 1648659 1614328 1582064 1551191 1521560 1493585 1468312 1446818 1428851 1412362
61961A412362j7393j9155k0098j9957j9650j9879k0109j9025j6303j3646j3025
$$ 1412362 1394969 1375814 1355716 1335759 1316109 1296230 1276121 1257096 1240793 1227147 1214122
61950A214122j3725j2622q282l274q38n77M68L187N518O225O842Q819J0881J0795
$$ 1214122 1200397 1187775 1179493 1176219 1175381 1174804 1175272 1178459 1183977 1190202 1197044 1205863 1216744 1227539
61936A227539Q436N552L290J436m49k475m888q001j1511j4565j6590j7662j8125
$$ 1227539 1235975 1241527 1244817 1246253 1245804 1243329 1238441 1230440 1218929 1204364 1187774 1170112 1151987
61923A151987j8313j8468j8588j8408j7782j6878j5658j3671j0863q296p232p458
$$ 1151987 1133674 1115206 1096618 1078210 1060428 1043550 1027892 1014221 1003358 995062 987830 980372
61911I80372p321n694l338j764j221n49J102L264N151O926R204J1703J3333J3646
$$ 980372 973051 967357 964019 962255 961034 960485 961587 964851 970002 976928 986132 997835 1011168 1024814
61897A024814J3395J3365J3537J3814J4913J7670K1864K6452L0767L4797L8544
$$ 1024814 1038209 1051574 1065111 1078925 1093838 1111508 1133372 1159824 1190591 1225388 1263932
61886A263932M1909M5242M9245N4074N9027O3381O7095P0471P3504P5850P7275
$$ 1263932 1305841 1351083 1400328 1454402 1513429 1576810 1643905 1714376 1787880 1863730 1941005
61875A941005P7835P7642P6579P4422P1261O7762O4573O1410N6997N0223M1235
$$ 1941005 2018840 2096482 2173061 2247483 2318744 2386506 2451079 2512489 2569486 2619709 2660944
61864B660944L1335K1992J3960O990K93o322j1643j3984j3081j0406p305l575
$$ 2660944 2692279 2714271 2728231 2735221 2735514 2729192 2717549 2703565 2690484 2680078 2672773 2669198
61852B669198J624Q208J5261K2046K8104L2860L5931L7388L6953L3595K6852J8095
$$ 2669198 2670822 2679030 2694291 2716337 2744441 2777301 2813232 2850620 2887573 2921168 2948020 2966115
61840B966115R293R70p577j6466k4939l2630l9743m6079n1217n5551n9665o2712
$$ 2966115 2975408 2976378 2968801 2952335 2927396 2894766 2855023 2808944 2757727 2702176 2642511 2579799
61828B579799o3081o1081n9119n8546n7954n5580n1854m8369m5591m3102m1119
$$ 2579799 2516718 2455637 2396518 2337972 2280018 2224438 2172584 2124215 2078624 2035522 1994403
61817A994403m0045l9072l6752l2899k8606k4499k0207j5600j1227p189k627L101
$$ 1994403 1954358 1915286 1878534 1845635 1817029 1792530 1772323 1756723 1745496 1738307 1735680 1738781
61805A738781R548J6006K2484K9209L5637M0924M5386N0729N8331O7558P6344
$$ 1738781 1748329 1764335 1786819 1816028 1851665 1892589 1937975 1988704 2047035 2114593 2190937
61794B190937Q3479Q9824R6889J04569J11003J14750J16360J17262J17556J15702
$$ 2190937 2274416 2364240 2461129 2565698 2676701 2791451 2907811 3025073 3142629 3258331
61784C258331J10418J02139R2225Q1183O8370N3366L6987K0672N531p588j7672
$$ 3258331 3368749 3470888 3563113 3644296 3712666 3766032 3803019 3823691 3829222 3821634 3803962
61773C803962k4215k7976k9965k9586k5129j6617o913R42O412J0458J2981J2945
$$ 3803962 3779747 3751771 3721806 3692220 3667091 3650474 3643561 3644503 3650915 3661373 3674354 3687299
61761C687299J0264N682j218j1961k6704m3286n9257p3638q6312r6995j05496
$$ 3687299 3697563 3703245 3702027 3690066 3663362 3620076 3560819 3487181 3400869 3303874 3198378
61750C198378j11875j15755j16559j14984j13016j11570j09285j04574r7920r1000
$$ 3198378 3086503 2970748 2854189 2739205 2626189 2514619 2405334 2300760 2202840 2111840
61740B111840q4496p8161p2329o7763o4140o0094n5004m9837m5945m3649m2121
$$ 2111840 2027344 1949183 1876854 1809091 1744951 1684857 1629853 1580016 1534071 1490422 1448301
61729A448301m0187l7285l3866l0790k8164k5259k1886j9057j7641j7017j5981
$$ 1448301 1408114 1370829 1336963 1306173 1278009 1252750 1230864 1211807 1194166 1177149 1161168
61718A161168j4440j3154j2169j0663q414o312n160m659l911k432o01N68K33j167
$$ 1161168 1146728 1133574 1121405 1110742 1102328 1096016 1090856 1086197 1082286 1079854 1079253 1079821 1080054 1078887
61704A078887j842m11K409M564N098N002N594O853P666P103N108K389r3j763k742
$$ 1078887 1077045 1076634 1079043 1083607 1088705 1093707 1099301 1106154 1113820 1120923 1126031 1128420 1128327 1126564 1123822
61689A123822l383l697l641l728m646o217p395p395o425n188m206l687l528l307
$$ 1123822 1120439 1116742 1113101 1109373 1104727 1098510 1091115 1083720 1077295 1072107 1067901 1064214 1060686 1057379
61675A057379k673j828j191o63Q8P05L15j081k170j776k37J109J354O44j73o9
$$ 1057379 1054706 1052878 1051687 1051024 1051112 1051817 1052132 1051051 1048881 1047105 1046868 1047977 1049331 1049975 1049802 1049733
61659A049733J448L651M947M462K949J720R82j71k298m783o500o981o964p949
$$ 1049733 1051181 1054832 1059779 1064241 1067190 1068910 1069892 1069721 1067423 1062640 1056140 1049159 1042195 1034246
61645A034246j0811j4456j6279j4722j1270r078r577j1185j1530j0066q117p091
$$ 1034246 1023435 1008979 992700 977978 966708 957630 948053 936868 925338 915272 907155 900064
61633I00064p356q387r247r108p921o522n678n265m855m584m667m457l141j311
$$ 900064 892708 884321 875074 865966 858045 851523 845845 840580 835725 831141 826474 822017 818876 817565
61619H17565o61j795l418m112l832l008j539L55J321M45j140j647j097q92j283
$$ 817565 816904 815109 811691 807579 803747 800739 799200 799555 800876 801321 800181 798534 797437 796545 795262
61604G95262j150k98Mo52p34J055L859N982O985P463P720P838Q218Q961R401R202
$$ 795262 794112 793814 793818 793166 792432 793487 797346 803328 810313 817776 825496 833334 841552 850513 859914 869116
61588H69116R278J0490J2147J3002J3118J3439J3943J3707J2521J0963Q990N929
$$ 869116 878394 888884 901031 914033 927151 940590 954533 968240 980761 991724 1000714 1006643
61576A006643K059j312l582n304o593o602n336m508n461p269q081p614o992o676
$$ 1006643 1008702 1007390 1003808 998504 991911 985309 979973 975465 970004 962735 954654 947040 940048 933372
61562I33372n961m593l514l469l807l375k152j250j408k237l185m569p013j0155
$$ 933372 927411 922818 919304 915835 912028 908653 906501 905251 903843 901606 898421 893852 886839 876684
61548H76684j2758j4238j5262j6392j6983j6143j4264j2653j1985j1975j2295
$$ 876684 863926 849688 834426 818034 801051 784908 770644 757991 746006 734031 721736
61537G21736j2854j3164j2604j1350j0147r020p336n387m541n214n935n384m367
$$ 721736 708882 695718 683114 671764 661617 652597 645261 639874 635333 630119 624184 618800 614433
61524F14433m520n827o725o253m860l274j918j354j960k932k877j881j762l479
$$ 614433 609913 604086 597361 591108 586248 582974 581056 579702 577742 574810 571933 570052 568290 564811
61510E64811n342m993k535m09l45j574k312j930j128o54n80n76l03L71J210J771
$$ 564811 559469 554476 551941 551532 551187 549613 547301 545371 544243 543589 543009 542433 542130 542501 543711 545482
61494E45482K018K489L412M004L367J943J243J939L013L242K721K321K274K232
$$ 545482 547500 549989 553401 557405 560772 562715 563958 565897 568910 572152 574873 577194 579468 581700
61480E81700K295K939L964M559M597N005O325P678P774O546N156M494M217L308
$$ 581700 583995 586934 590898 595457 600054 605059 611384 619062 626836 633382 638538 643032 647249 650557
61466F50557J304j110k652k751k225k389l451m280l960l007k509k561k358j692
$$ 650557 651861 650751 648099 645348 643123 640734 637283 633003 629043 626036 623527 620966 618608 616916
61452F16916j423k159l206l369k402j026J72J168J797J410k73k363l433k874j314
$$ 616916 615493 613334 610128 606759 604357 603331 603503 604671 606468 607878 607605 605242 601809 598935 597621
61437E97621K74J454K247K612K279J122m43j537j526p98m76j036j531q47N89J168
$$ 597621 597895 599349 601596 604208 606487 607609 607166 605629 604103 603305 602829 601793 600262 599415 600004 601172
61421F01172K32j206k004k132j824p93P96J559N63r38r10N74J485Q35k15n36n68
$$ 601172 601404 600198 598194 596062 594238 593445 594241 595800 596363 595425 594515 595089 596574 597409 597194 596658 596090
61404E96090r30r74KJ205J370O35J62L94Q87J579K814M190M678M075L333L115
$$ 596090 595160 594186 594188 595393 596763 597398 597560 597954 598841 600420 603234 607424 612102 616177 619510 622625
61388F22625L103L031L358M260M916M727M561N662P657Q833Q513Q022Q784J0328
$$ 622625 625728 628759 632117 636377 641293 646020 650581 656243 663900 672733 681246 689268 698052 708380
61374G08380J1013J0256R120Q724Q997R228R105Q669P793O498N564O009P711R202
$$ 708380 719393 729649 738769 747493 756490 765718 774823 783492 791285 797783 803347 809356 817067 826269
61360H26269R076P338N020K986J425L08l37n84p27j055j688k708m253o335q542
$$ 826269 835345 842683 847703 850689 852114 852422 852085 851501 850774 849719 848031 845323 841070 834735 826193
61345H26193j0048j0153q961p463o667o560o203m953l281k089j541j066m18j38
$$ 826193 816145 805992 797031 789568 782901 776341 770138 765185 761904 759815 758274 757208 756790 756652
61331G56652p10j667j940j042L79J151N81r20j978j132J917N713Q070P957O275
$$ 756652 755942 754275 752335 751293 751672 752823 753404 752484 750506 749374 751291 757004 765074 773031 779306
61316G79306M596L560K854K375K585L697N189O466P488Q331Q621P957O704N846
$$ 779306 783902 787462 790316 792691 795276 798973 804162 810628 818116 826447 835068 843025 849729 855575
61302H55575O070P257Q789J0100J1030J1842J2824J3821J4536J5277J6776J8873
$$ 855575 861645 868902 877691 887791 898821 910663 923487 937308 951844 967121 983897 1002770
61290A002770K0204J9910J9134J9771K2008K4088K4467K3212K1274J9440J8189
$$ 1002770 1022974 1042884 1062018 1081789 1103797 1127885 1152352 1175564 1196838 1216278 1234467
61279A234467J7525J6579J4304J0932P826N439K624j359n279p556q559r910j1968
$$ 1234467 1251992 1268571 1282875 1293807 1301633 1307072 1309696 1308337 1303058 1295502 1286943 1277033 1265065
61266A265065j3508j3732j3202j2593j1795j0746j0032j0004j0051r442q343p422
$$ 1265065 1251557 1237825 1224623 1212030 1200235 1189489 1179457 1169453 1159402 1149960 1141617 1134195
61254A134195o971o886p050p095o309m551k844k093j392J139N564R262R689P268
$$ 1134195 1127224 1120338 1113288 1106193 1099884 1095333 1092489 1090396 1089004 1090143 1095707 1104969 1114658 1121926
61240A121926M626L455L149K358O48j705m395o823p919p069m973k848j192P0O31
$$ 1121926 1126552 1130007 1133156 1135514 1136162 1134457 1130062 1123239 1115320 1108251 1103278 1100430 1099238 1099308 1099939
61225A099939J26p69o58R23L030M708N990P209Q281R262J0748J2965J5081J6224
$$ 1099939 1100065 1099296 1098638 1099561 1102591 1107299 1113289 1120498 1128779 1138041 1148789 1161754 1176835 1193059
61211A193059J6694J7416J8574J9656K0467K1251K2021K2677K3679K5588K7910
$$ 1193059 1209753 1227169 1245743 1265399 1285866 1307117 1329138 1351815 1375494 1401082 1428992
61200A428992K9357K9473K9222K9641L0638L1349L0983K8950K4876J9181J3102
$$ 1428992 1458349 1487822 1517044 1546685 1577323 1608672 1639655 1668605 1693481 1712662 1725764
61189A725764P647K808j887o539j0985j5200j8988k1819k3579k5010k6577k7443
$$ 1725764 1733411 1736219 1734332 1727793 1716808 1701608 1682620 1660801 1637222 1612212 1585635 1558192
61177A558192k6620k4872k4142k4921k5472k4236k1895k0170j9489j8920j7832
$$ 1558192 1531572 1506700 1482558 1457637 1432165 1407929 1386034 1365864 1346375 1327455 1309623
61166A309623j6326j4335j1617q816p231p081p068o287n476n520n693m797l469
$$ 1309623 1293297 1278962 1267345 1258529 1251298 1244217 1237149 1230862 1225386 1219866 1214173 1209376 1205907
61153A205907l675n763p509o771l947j019Q83J892K182J749J345K225M518O801
$$ 1205907 1202232 1196469 1188960 1182189 1178242 1177223 1178106 1179998 1182180 1183929 1185274 1187499 1192017 1198818
61139A198818P933Q603J0298J3147J5789J7306J8379K0165K2684K4928K6160K6449
$$ 1198818 1206751 1215354 1225652 1238799 1254588 1271894 1290273 1310438 1333122 1358050 1384210 1410659
61127A410659K6025K4888K3131K1009J8412J5036J1509R560J0169J1954J2424
$$ 1410659 1436684 1461572 1484703 1505712 1524124 1539160 1550669 1560229 1570398 1582352 1594776
61116A594776J0667P805M983K322J59l27J214L056L105J217j399m367q301j2998
$$ 1594776 1605443 1613248 1618231 1620553 1620712 1620385 1621599 1624655 1627760 1628977 1627578 1623211 1614910 1601912
61102A601912j7068j9490k0343j9939j8686j7914j9037k1186k1453j8619j5215
$$ 1601912 1584844 1565354 1545011 1525072 1506386 1488472 1469435 1448249 1426796 1408177 1392962
61091A392962j4238j5058j4533j1499p982n929m969m036l563m811p987j1845j4769
$$ 1392962 1378724 1363666 1349133 1337634 1329652 1323723 1318754 1314718 1311155 1306344 1298357 1286512 1271743
61078A271743j5731j4937j3889j4066j5103j4986j2553q888n740l527j790o12
$$ 1271743 1256012 1241075 1227186 1213120 1198017 1183031 1170478 1161590 1155850 1152323 1150533 1149921
61066A149921l10j39J396M882R413J3541J6202J7108J7077J7681J9748K2367K4200
$$ 1149921 1149611 1149472 1150868 1155750 1165163 1178704 1194906 1212014 1229091 1246772 1266520 1288887 1313087
61053A313087K5224K6210K6899K6276K4613K3668K4250K4905K3859K1376J9315
$$ 1313087 1338311 1364521 1391420 1417696 1442309 1465977 1490227 1515132 1538991 1560367 1579682
61042A579682J8856J9335J9035J6685J2392P429L033n42l559n978p793r687j2161
$$ 1579682 1598538 1617873 1636908 1653593 1665985 1673414 1676447 1675905 1672346 1666368 1658575 1648888 1636727
61029A636727j4354j5110j5075j5976j7554j7281j4063j0424r531j1325j3215
$$ 1636727 1622373 1607263 1592188 1576212 1558658 1541377 1527314 1516890 1507359 1496034 1482819
61018A482819j3530j2727j1708j0680r402p475m557j186J214K143L011N098P370
$$ 1482819 1469289 1456562 1444854 1434174 1424772 1417297 1412740 1411554 1412768 1414911 1417922 1423020 1430390
61005A430390Q097P984R590J3609J7783J9993K0685K1417K2568K3664K4925K7209
$$ 1430390 1438487 1446471 1456061 1469670 1487453 1507446 1528131 1549548 1572116 1595780 1620705 1647914
60993A647914L0632L4221L7001L9032M1290M4571M8526N1969N4270N6003N8065
$$ 1647914 1678546 1712767 1749768 1788800 1830090 1874661 1923187 1975156 2029426 2085429 2143494
60982B143494O0772O4313O9278P5755Q2408Q7602R1242R4623R8779J03867J09773
$$ 2143494 2204266 2268579 2337857 2413612 2496020 2583622 2674864 2769487 2868266 2972133 3081906
60971C081906J16250J22615J28442J34513J42101J51437J61621J71754J81400
$$ 3081906 3198156 3320771 3449213 3583726 3725827 3877264 4038885 4210639 4392039
60962D392039J90478J99702K10530K23566K37780K52545K69447K90402L14830
$$ 4392039 4582517 4782219 4992749 5216315 5454095 5706640 5976087 6266489 6581319
60953F581319L40748L67920L97729M30604M66083N05253N50742O04816O69893
$$ 6581319 6922067 7289987 7687716 8118320 8584403 9089656 9640398 10245214 10915107
60944A0915107P50047Q48701R65629J100030J255513J436863J642687J868177
$$ 10915107 11665154 12513855 13479484 14579514 15835027 17271890 18914577 20782754
60936B0782754K115192K390476K692046L009249L338868L675739L958560M036755
$$ 20782754 22897946 25288422 27980468 30989717 34328585 38004324 41962884 45999639
60928D5999639L743471L044339K111518J224892N89819K50853J54140K33756M02021
$$ 45999639 49743110 52787449 54898967 56123859 56713678 56964531 57118671 57352427 57754448
60919E7754448M92115K91275l14798j230444k201653k984445l469551l677568
$$ 57754448 58246563 58537838 58223040 56992596 54790943 51806498 48336947 44659379
60911D4659379l682027l554555l353611l123052k885307k643947k398902k156348
$$ 44659379 40977352 37422797 34069186 30946134 28060827 25416880 23017978 20861630
60903B0861630j924787j709170j512248j336962j184429j052477r38296q40389
$$ 20861630 18936843 17227673 15715425 14378463 13194034 12141557 11203261 10362872
60895A0362872p56587o82978o16532n56951n04500m57860m15378l76679l41811
$$ 10362872 9606285 8923307 8306775 7749824 7245324 6787464 6372086 5995407 5653596
60886E653596l10266k81769k56824k35667k18005k04157j94709j88353j81833
$$ 5653596 5343330 5061561 4804737 4569070 4351065 4146908 3952199 3763846 3582013
60877C582013j72928j62146j50946j39999j29897j21558j14704j07571r9307r1245
$$ 3582013 3409085 3246939 3095993 2955994 2826097 2704539 2589835 2482264 2382957 2291712
60867B291712q4652p8816p2708o7013o2861n9732n6360n2858n0254m8495m6498
$$ 2291712 2207060 2128244 2055536 1988523 1925662 1865930 1809570 1756712 1706458 1657963 1611465
60856A611465m3868m1127l8386l5169l1657k8985k7901k7707k6968k5017k2579
$$ 1611465 1567597 1526470 1488084 1452915 1421258 1392273 1364372 1336665 1309697 1284680 1262101
60845A262101k0816j9853j8715j6972j5677j5770j6278j5515j3759j2925j3520
$$ 1262101 1241285 1221432 1202717 1185745 1170068 1154298 1138020 1122505 1108746 1095821 1082301
60834A082301j3831j2612j0733r363q262p045o455p043p845p807p434p624p899
$$ 1082301 1068470 1055858 1045125 1035762 1027500 1020455 1014000 1006957 999112 991305 983871 976247 968348
60821I68348p308o233n727n697n320m661m308l823k329m13L07k21L7K445N681
$$ 968348 961040 954807 949080 943383 938063 933402 929094 925271 922942 922529 922836 922615 922652 925097 930778
60806I30778P290O598N240N057O128O963O401M960M145M687N977P167P967Q200
$$ 930778 938068 944666 949906 954963 961091 968054 974455 979415 983560 988247 994224 1001391 1009358 1017558
60792A017558P449N708L818K596J978J451P95l1j078k081k577k816l745n545p071
$$ 1017558 1025007 1030715 1034533 1037129 1039107 1040558 1041353 1041322 1040244 1038163 1035586 1032770 1029025 1023480 1016409
60777A016409p532p818r030j0403j0068p595m591k660j825j214m83oJ09P43L114
$$ 1016409 1008877 1001059 992029 981626 971558 963963 959372 956712 954887 953673 953190 953184 953293 954036 957150
60762I57150P059J0390J0899R066P783Q974J1609J3596J4467J5147J6076J6841
$$ 957150 964209 974599 985498 994564 1002347 1011321 1022930 1036526 1050993 1066140 1082216 1099057
60750A099057J7231J7400J7285J6862J6699J7279J7971J7641J6248J4831J3873
$$ 1099057 1116288 1133688 1150973 1167835 1184534 1201813 1219784 1237425 1253673 1268504 1282377
60739A282377J2480R559N374J569m92j334k972o397j0033j1701j1800j2869j5863
$$ 1282377 1294857 1304416 1309790 1311359 1310867 1309533 1306561 1300164 1290131 1278430 1266630 1253761 1237898
60726A237898j8779j9781j9604j9575j9104j7154j4841j4160j4833j4739j3241
$$ 1237898 1219119 1199338 1179734 1160159 1141055 1123901 1109060 1094900 1080067 1065328 1052087
60715A052087j2080j2726j4586j6002j5848j4090j1969j1359j2749j4273j4051
$$ 1052087 1040007 1027281 1012695 996693 980845 966755 954786 943427 930678 916405 902354
60704I02354j2865j2665j3106j1994r215p570q862j1258j1771r798p009n009m309
$$ 902354 889489 876824 863718 851724 842509 834939 826077 814819 803048 793250 786241 781232 776923
60691G76923m577m852m191k814k007k351k960k857k171j381n21K46J89r57k331
$$ 776923 772346 767494 763303 760489 758482 756131 753171 750314 748143 746762 746241 746487 746676 745719 743388
60676G43388l029l124k956k276r17M18Q95O40L41L07M35O06N77p1j259k301k884
$$ 743388 740359 737235 734279 732003 731086 731504 732399 733039 733380 733687 734122 734728 735305 735234 733975 731674 728790
60659G28790l557m715n785o059n745n460n301n156n412o461p736q031o729m327
$$ 728790 725233 720518 714733 708674 702929 697469 692168 687012 681600 675139 667403 659372 652643 648316
60645F48316j875l14J5n00j225k063l244m418m824m576m744n534n469l322l3K426
$$ 648316 646441 646127 646142 645642 644417 642354 639110 634692 629868 625292 620548 615014 609545 606223 606190 608616
60629F08616L433L794M005L752L028K505K546K825K949K765K105J173J099L004
$$ 608616 612049 615843 619848 623600 626628 629133 631679 634504 637453 640218 642323 643496 644595 647599
60615F47599O196Q412Q353P054O155N706M635K761J142N01L83J81K17J082K388
$$ 647599 653795 662207 670560 677614 683769 689475 694110 696871 698013 698514 698897 699078 699295 700377 702765
60600G02765K956K382J804K700N097P388P981O893N513M927M795M096K706J735
$$ 702765 705721 708103 709907 712607 717704 725092 733073 739966 745479 750406 755201 759297 762003 763738
60586G63738K031K846K621R81q94j959k546l392m304m626m583n102o320p231o898
$$ 763738 765769 768615 771236 772217 771323 769364 766818 763426 759122 754496 749913 744811 738491 731260 724362
60571G24362n406l536k059j392j301r21L03J719K197J694J223J172P70m24j471
$$ 724362 718956 715420 713361 711969 710668 709747 710050 711769 713966 715660 716883 718055 718825 718401 716930
60556G16930j215J71J556K169J930J032p0n86k4J217K402L274L908M164L964L804
$$ 716930 715715 715886 717442 719611 721541 722573 722503 721917 721893 723110 725512 728786 732694 736858 740822 744626
60540G44626M200M768M532L277J911J337J536J998K600L526M514M735L782K553
$$ 744626 748826 753594 758126 761403 763314 764651 766187 768185 770785 774311 778825 783560 787342 789895
60526G89895K591M330O471P480P342P166P348P103N996M975N282O974R113J1019
$$ 789895 792486 796816 803287 810767 818109 825275 832623 839726 845722 850697 855979 862953 872066 883085
60512H83085J2792J4800J7133J9448K1306K2829K5008K8636L2809L5360L5238
$$ 883085 895877 910677 927810 947258 968564 991393 1016401 1045037 1077846 1113206 1148444
60501A148444L3618L2023L0139K6545K1001J4806R026L551j907o773r974j0881
$$ 1148444 1182062 1214085 1244224 1270769 1291770 1306576 1315602 1319153 1317246 1310473 1300499 1289618
60489A289618r729p386m731j905J747O657J2212J7350K1672K5425K8824L2217
$$ 1289618 1279889 1272503 1267772 1265867 1267614 1274271 1286483 1303833 1325505 1350930 1379754 1411971
60477A411971L6533M2485M9334N5493O0421O4705O8079O8694O5160N8282M9804
$$ 1411971 1448504 1490989 1540323 1595816 1656237 1720942 1789021 1857715 1922875 1981157 2030961
60466B030961M0232K9032J6500M223o318j4714k1076k5369k7550k7937k7162k5944
$$ 2030961 2071193 2100225 2116725 2120948 2114630 2099916 2078840 2053471 2025921 1997984 1970822 1944878
60454A944878k4756k3432k1203j7492j2526o930j114M490R224J3055J7162K2703
$$ 1944878 1920122 1896690 1875487 1857995 1845469 1838539 1837425 1841915 1851139 1864194 1881356 1904059
60442A904059K9271L5910M3288N3084O4959P6111Q4715R1990R9442J05775J08489
$$ 1904059 1933330 1969240 2012528 2065612 2130571 2206682 2291397 2383387 2482829 2588604 2697093
60431B697093J07353J03883R8100Q8450P5144O1093M8812L8270K8588K0085J3767
$$ 2697093 2804446 2908329 3006429 3094879 3170023 3231116 3279928 3318198 3346786 3366871 3380638
60420C380638J0284J0211J3623J8262J9835J5660O781m807j9484l8664o1255q3568
$$ 3380638 3390922 3401133 3414756 3433018 3452853 3468513 3475294 3470487 3451003 3412339 3351084 3267516
60408C267516j02260j15875j24308j28622j30841j31941j30384j24472j15635
$$ 3267516 3165256 3049381 2925073 2796451 2665610 2533669 2403285 2278813 2163178
60399B163178j07223j00294r3102q4780p6928p0870o5725o0318n4941n0034m4972
$$ 2163178 2055955 1955661 1862559 1777779 1700851 1629981 1564256 1503938 1448997 1398963 1353991
60388A353991l9564l5166l2695l0843k7890k4295k1843k0946k0311j8820j6376
$$ 1353991 1314427 1279261 1246566 1215723 1187833 1163538 1141695 1120749 1100438 1081618 1065242
60377A065242j3220r727o752n165n007n729o933q313r362r943j0623j1737j2572
$$ 1065242 1052022 1042295 1035543 1030378 1025371 1019642 1012709 1004396 995034 985091 974468 962731 950159
60364I50159j2356j1540j1137j1067j0191q046n751m942o078p827q036n696k019
$$ 950159 937803 926263 915126 904059 893868 885822 880071 875129 869051 861224 853188 847492 845473
60351H45473Q05J895K055J965J262j82j426j735j653j873k043j623r54m74K01
$$ 845473 846278 848173 850228 852193 853455 853273 851847 850112 848459 846586 844543 842920 841966 841492 841693
60336H41693J251J770J261J028K456M590N236L998K480J647R52J69K26J547L010
$$ 841693 842944 844714 845975 847003 849459 854049 859285 863283 865763 867410 868362 868531 868757 870304 873314
60321H73314L284K345J097L02K16O48J170J695K645M025M765M064K911L036M549
$$ 873314 876598 878943 880040 880342 880558 881206 882376 884071 886716 890741 895506 899570 902481 905517 910066
60306I10066N957O397O429O513O309N762N426N247M425L133K961M892P805R822
$$ 910066 916023 922420 928849 935362 941671 947433 952859 958106 962531 965664 968625 973517 981322 991144
60292I91144J0356J0165J0319J1698J4532J7820J9901K0172J9579J8967J7915
$$ 991144 1001500 1011665 1021984 1033682 1048214 1066034 1085935 1106107 1125686 1144653 1162568
60281A162568J5700J2367Q255L505j285m977p293r268j1486j3050j3336j3443
$$ 1162568 1178268 1190635 1198890 1202395 1201110 1196133 1188840 1179572 1168086 1155036 1141700 1128257
60269A128257j4350j4818j3015r596o972n867m684k640j312k116l938m560l354
$$ 1128257 1113907 1099089 1086074 1076478 1069506 1063639 1058955 1056315 1055003 1052887 1048949 1044389 1041035
60256A041035j307P58K690M247N195O117P986J0805J3613J6026J8778K2311K5755
$$ 1041035 1039728 1040486 1043176 1047423 1052618 1058735 1066721 1077526 1091139 1107165 1125943 1148254 1174009
60243A174009K8253L0607L4391L9369M2936M2647L8545L2407K5348J7073P143
$$ 1174009 1202262 1232869 1267260 1306629 1349565 1392212 1430757 1463164 1488512 1505585 1512728
60232A512728l922j4905k4500l1519l5330l6502l6521l6468l6233l5330l3961
$$ 1512728 1508806 1493901 1469401 1437882 1402552 1366050 1329529 1293061 1256828 1221498 1187537
60221A187537l2691l1392k9265k6084k2871k0860j9893j8421j5308j1496r233
$$ 1187537 1154846 1123454 1094189 1068105 1045234 1024374 1004481 986060 970752 959256 950023
60210I50023r558j1034j1344r734p375n645m916m968n720o994q144q429p651o126
$$ 950023 940465 929431 918087 908353 900978 895333 890417 885449 879729 872735 864591 856162 848511 842385
60196H42385m272k463j111n45p45j296j612j254j59J416L139M555M886L499J019
$$ 842385 838113 835650 834539 833994 833249 831953 830341 829087 828928 830344 833483 838038 842924 846423 847442
60181H47442n99O1K197L720L712L066K876L366M529O502Q601R258P883O027N484
$$ 847442 846843 846904 849101 852821 856533 859599 862475 865841 870370 876872 885473 894731 902614 908641 914125
60166I14125N872N382L670K455K944M000L722J990M45K00O38O29J65J69J094K374
$$ 914125 919997 925379 929049 931504 934448 938448 942170 944160 944605 944805 945443 946072 946237 946406 947500 949874
60150I49874L289L782M130M177L400J683l14j568j440j89J097J342O13J17P37
$$ 949874 953163 956945 961075 965252 968652 970335 970021 968453 967013 966824 967921 969263 969876 969993 970730
60135I70730J880K326J907J583J818J800N75j471k676j585J600M804N616L653
$$ 970730 972610 974936 976843 978426 980244 982044 982619 981148 978472 976887 978487 983291 988907 992560
60121I92560J181P28K231L425K970J910J784K574L395M149N356O868P943Q403
$$ 992560 993741 994469 996700 1000125 1003095 1005005 1006789 1009363 1012758 1016907 1022263 1029131 1037074 1045477
60107A045477Q760R257R520R236Q512P447N903L834J569l61j484j583q51K38J345
$$ 1045477 1054237 1063494 1073014 1082250 1090762 1098209 1104112 1107946 1109515 1109154 1107670 1106087 1105236 1105474 1106819
60092A106819K437L399L914M071M664O366Q784J0820J1890J2281J2472J2654J2887
$$ 1106819 1109256 1112655 1116569 1120640 1125304 1131670 1140454 1151274 1163164 1175445 1187917 1200571 1213458
60079A213458J3162J3127J2192J0141P474M976K961J022j472m536p303q763q864
$$ 1213458 1226620 1239747 1251939 1262080 1269554 1274530 1277491 1278513 1277041 1272505 1265202 1256439 1247575
60066A247575q585q746r193r335r091q836q677q295p404n922l814j336O24J075
$$ 1247575 1238990 1230244 1221051 1211716 1202625 1193789 1185112 1176817 1169413 1163491 1159677 1158341 1158965 1160040
60052A160040J35p88l32J401L131L945M236N071O923R296J1425J2986J4079J4841
$$ 1160040 1160175 1159387 1159055 1160456 1163587 1167532 1171768 1176839 1183762 1193058 1204483 1217469 1231548 1246389
60038A246389J5281J5290J4638J3164J1252R729Q914Q104O505M337K309L50k121
$$ 1246389 1261670 1276960 1291598 1304762 1316014 1325743 1334657 1342761 1349266 1353603 1355912 1356262 1354141
60025A354141m682n916n345m345m423n367o033o273p058q760j0398j0789r992
$$ 1354141 1349459 1343543 1338198 1333853 1329430 1324063 1318030 1311757 1304699 1295939 1285541 1274752 1264760
60012A264760r257r724j1274j2741j3269j3273j3714j4653j5193j4940j4560j4578
$$ 1264760 1255503 1245779 1234505 1221764 1208495 1195222 1181508 1166855 1151662 1136722 1122162 1107584
60000A107584j4441j3455j1965j0871j0374j0027r598r239q978q721q452p996
$$ 1107584 1093143 1079688 1067723 1056852 1046478 1036451 1026853 1017614 1008636 999915 991463 983467
59988I83467o832m803k748j822k247l178l500k571o22J009Q08j185l089l415k806
$$ 983467 976635 971832 969084 967262 965015 961837 958337 955766 955144 956153 956961 955776 952687 949272 946466
59973I46466k666k937k664k139k707m409n640n556n296o037p120p031n505l680
$$ 946466 943800 940863 938199 936060 933353 928944 923304 917748 912452 906415 899295 892264 886759 883079
59959H83079k644k556k885l043k857k734l095l612l414k098j15J799L089L465
$$ 883079 880435 877879 874994 871951 869094 866360 863265 859653 856239 854141 854026 855825 858914 862379
59945H62379L212L336M598O439P706Q329R202J0485J1342J1542J1844J2272J1559
$$ 862379 865591 868927 873525 879964 887670 895999 905201 915686 927028 938570 950414 962686 974245
59932I74245R121O216M149K646J154L81J016K027J995J398J642K387J929J37j051
$$ 974245 983366 989582 993731 996377 997531 997912 998928 1000955 1002950 1004348 1005990 1008377 1010306 1010443 1009392
59917A009392l20J600L562N170N699L885J14k757k444j81R24j13j405j135L19
$$ 1009392 1009072 1010672 1014234 1019404 1025103 1028988 1029102 1026345 1023901 1023720 1024644 1024531 1023126 1021991 1022310
59902A022310J437J503R96P48J132J697J518K39j212j549p16P4n1o80j036j127
$$ 1022310 1023747 1025250 1026246 1026994 1028126 1029823 1031341 1031580 1030368 1028819 1028103 1028177 1028126 1027446 1026410 1025283
59886A025283j536k543l861m952n269m658l816l872m974n858n451m474m381m906
$$ 1025283 1023747 1021204 1017343 1012391 1007122 1002464 998648 994776 989802 983944 978493 974019 969638 964732
59872I64732l999o68L226M902L752J648M96N20R03J143J363J889K951M439N697
$$ 964732 960733 960065 963291 968193 971945 973593 974089 974609 975512 976655 978018 979907 982858 987297 992994
59857I92994N876M807L201J842R41N61J049K391L529L327K187J744K518K908J370
$$ 992994 998870 1003677 1006878 1008720 1009661 1010222 1011271 1013662 1017191 1020518 1022705 1024449 1026967 1029875 1031245
59842A031245j053j736N2K017J819J4j030l96O34Q85P12P04M30m41p86P18L458
$$ 1031245 1030192 1028456 1028508 1030525 1032344 1032358 1031328 1030932 1031566 1032451 1033163 1033867 1034297 1033856 1033070 1033788 1037246
59825A037246N437N829N755O213O705O458N874N816O169O044M988L293J468J32
$$ 1037246 1042683 1048512 1054267 1060480 1067185 1073643 1079517 1085333 1091502 1097546 1102534 1105827 1107295 1107427
59811A107427n8P55J309N29j169k774m269o086p401o715m296k256j704j471m80
$$ 1107427 1107369 1108124 1109433 1109962 1108793 1106019 1101750 1095664 1088263 1081548 1077252 1074996 1073292 1071821 1071341
59796A071341L52n0o97j7J444J898J272J182K184L227M020N805R023J2288J4538
$$ 1071341 1071693 1071643 1070946 1070929 1072373 1074271 1075543 1076725 1078909 1082136 1086156 1091961 1100984 1113272 1127810
59781A127810J6387J8167J8508J6430J3314J0906Q788N876L293L052M389M168
$$ 1127810 1144197 1162364 1180872 1197302 1210616 1221522 1230310 1236186 1239479 1242531 1246920 1251088
59769A251088J174k590n470q478j2819j7334k0144k1289k1936k2108k1074j9209
$$ 1251088 1252262 1249672 1244202 1235724 1222905 1205571 1185427 1164138 1142202 1120094 1099020 1079811
59757A079811j7707j6713j5318j3209j1042r271p957p516q342r675j0171r683
$$ 1079811 1062104 1045391 1030073 1016864 1005822 996551 988594 981078 972736 963061 952890 943207
59745I43207r255r209q681p416o572o993p877q055p673p537p538o818n192l382
$$ 943207 933952 924743 916062 908646 902074 895081 887204 879149 871476 863939 856401 849583 844391 841009
59731H41009k038j370j670l177n207o195n182l091k058l376o106p886p216m848
$$ 841009 838971 837601 835931 832754 827547 821352 816170 813079 811021 807645 801539 793653 786437 781589
59717G81589k699j737j456j218j029p76J56J662K259Q99j076j286M56J704O47
$$ 781589 778890 777153 775697 774479 773450 772674 772830 774492 776751 777650 776574 775288 775744 777448 778095
59702G78095j454j908J20L003M761M848L959L016K582K779L433M368N493O458
$$ 778095 776641 774733 774853 777856 782617 787465 791424 794440 797022 799801 803234 807602 813095 819553
59688H19553O573N522L946K816K205J266m98k442l475l199k046o50O28J717K638
$$ 819553 826126 831648 835594 838410 840615 841881 841383 838941 835466 832267 830221 829571 830199 831916 834554
59673H34554L205K919J542j03n25O84J942J344q88k459j757L07J694J796J729
$$ 834554 837759 840678 842220 842117 841592 842276 844218 845562 844674 842215 840458 840765 842459 844255 845984
59658H45984K451L553M141M090L936L964M007L958M085M718N925P375Q342Q105
$$ 845984 848435 851988 856129 860219 864155 868119 872126 876084 880169 884887 890812 898187 906529 914634
59644I14634O775N635O039P802R263R215Q244P680P812P771O979N896N193M857
$$ 914634 921409 927044 933083 940885 950148 959363 967607 975287 983099 990870 997849 1003745 1008938 1013795
59630A013795M315L142J425k24j091j083j020j728k843l212k543j919k375l613
$$ 1013795 1018110 1021252 1022677 1022453 1021362 1020279 1019259 1017531 1014688 1011476 1008933 1007014 1004639 1001026
59616A001026m578m724m215l448k879k813k847k097o25M5j171l030l179j131J187
$$ 1001026 996448 991724 987509 984061 981182 978369 975522 973425 972800 972845 971674 968644 965465 964334 965521
59601I65521J928J316Q34J382K674L817M023L251K346K107K238J844J025R59K110
$$ 965521 967449 968765 969599 970981 973655 977472 981495 984746 987092 989199 991437 993281 994306 995265 997375
59586I97375L236K726K38l438p255j0050j0753r507q002p745q309q185p030n884
$$ 997375 1000611 1003337 1003575 1000137 992882 982832 972079 962572 954570 946825 938516 930331 923301 917417
59572I17417n323m639l209j732j348k122l107l615l827m061m077l504k757k919
$$ 917417 912094 907455 904246 902514 901166 899044 895937 892322 888495 884434 880357 876853 874096 871177
59558H71177m490o555p731p744p493p578p541o840n877n397n351n001l962k504
$$ 871177 866687 860132 852401 844657 837164 829586 822045 815205 809328 803931 798580 793579 789617 787113
59544G87113j045N1L15m49j501j543j31J670K267J001j452l742m735m172k836
$$ 787113 786068 786119 786434 785985 784484 782941 782810 784480 786747 787748 786296 782554 777819 773647 770811
59529G70811j882j670j462n77M35L87p60j588j165n51j402l377m224k760n62P4
$$ 770811 768929 767259 765797 765220 765655 766042 765282 763694 762529 761978 760576 757199 752975 750215 749653 749727
59513G49727j043k240k461k248k348k539k174j047N03J838K207J422M26M59J539
$$ 749727 748684 746444 743983 741735 739387 736848 734674 733627 734130 735968 738175 739597 740023 740482 742021
59498G42021K466K419J769J204J023J502K943M843N972N871N581O236P676R043
$$ 742021 744487 746906 748675 749879 750902 752404 755347 760190 766162 772033 777614 783850 791526 800569
59484H00569R932J0414J0609J1076J2763J5743J8684K0437K1429K2338K2105J8784
$$ 800569 810501 820915 831524 842600 855363 871106 889790 910227 931656 953994 976099 994883
59472I94883J2325N224K06j893j906j061j87N43J484K763L680L422K359J752J947
$$ 994883 1007208 1012432 1012638 1010745 1008839 1007778 1007591 1008134 1009618 1012381 1016061 1019483 1021842 1023594 1025541
59457A025541J638m39l557n591n569m963n860q314j0329j0548r956j0172j0999
$$ 1025541 1027179 1026740 1023183 1017592 1012023 1007060 1001200 992886 982557 972009 962053 951881 940882
59444I40882j0895r467q038p687q049q372q455q171p309o319o048o164n285l195
$$ 940882 929987 920520 912482 904795 896746 888374 879919 871748 864439 858120 852072 845908 840623 837428
59430H37428j533j380j731j312m28K73J325L138M536M326L218K529K153J638K009
$$ 837428 835895 834515 832784 831472 831044 831317 832642 835780 840316 844642 847860 850389 852542 854180 856189
59415H56189M127O243N773K991N75j84j99OQ37J537M82j722k176K65L230M321
$$ 856189 860316 866559 872332 875323 875898 875714 875515 875521 876358 877895 878377 876655 874479 874744 877974 882295
59399H82295M244N095P360J0027J2160J2984J1827R383P857Q493R911J0046Q767
$$ 882295 886539 891634 898994 909021 921181 934165 945992 955375 963232 971725 981636 991682 1000449
59386A000449P459O813O253M986K677m48l584n862p276q365q919q104o154m529
$$ 1000449 1007908 1014721 1020974 1025960 1028637 1028189 1024605 1018743 1011467 1003102 994183 986079 979925 975396
59372I75396l962l728l379l531m089l454p54K559M725N994P518R136J0005J0503
$$ 975396 971434 967706 964327 960796 956707 953253 952499 955058 959783 965777 973295 982431 992436 1002939
59358A002939J1834J4211J6851J9304K1559K3418K4862K6385K7618K6325K0344
$$ 1002939 1014773 1028984 1045835 1065139 1086698 1110116 1134978 1161363 1188981 1215306 1235650
59347A235650J0398k02q331j2659j3265j1211q234n448k380J647N379O083K193
$$ 1235650 1246048 1245846 1237515 1224856 1211591 1200380 1192146 1186698 1184318 1185965 1191344 1197427 1199620
59334A199620n324j3996k1324k5574k6341k4583k1607j8234j5222j3550j3166
$$ 1199620 1194296 1180300 1158976 1133402 1107061 1082478 1060871 1042637 1027415 1013865 1000699
59323A000699j2272r252m932j611k56R2M38R85J885L323M707N291N745P522J0437
$$ 1000699 988427 979175 974243 972632 972376 972468 972906 973891 975776 979099 983806 989097 994842 1002364 1012801
59308A012801J2418J2292J1306J1012J1082J0376R147Q710R366J0044R963R634
$$ 1012801 1025219 1037511 1048817 1059829 1070911 1081287 1090434 1099144 1108510 1118554 1128517 1138151
59296A138151R925J0920J2072J3015J3735J4265J4683J5330J6520J7925J8738
$$ 1138151 1148076 1158996 1171068 1184083 1197818 1212083 1226766 1242096 1258616 1276541 1295279
59285A295279J8779J8817J9263J9136J7313J4430J2231J1103R749P593N803N066
$$ 1295279 1314058 1332875 1352138 1371274 1388587 1403017 1415248 1426351 1436100 1443693 1449496 1454562
59273A454562L970J052k661m862n133n303o856r460j1956j3551j3928j3296j2505
$$ 1454562 1458532 1459584 1456923 1452061 1446928 1441625 1434769 1425309 1413353 1399802 1385874 1372578 1360073
59260A360073j2296j2326j1739j0589r847j0004j0486j0416r235o859m020k210
$$ 1360073 1347777 1335451 1323712 1313123 1303276 1293272 1282786 1272370 1263135 1256276 1252256 1250046
59248A250046k186k775k306j073r00k078k340K76M734Q209R323R278J0056J2377
$$ 1250046 1247860 1245085 1242779 1241706 1240806 1238728 1236388 1236664 1241398 1249607 1258930 1268208 1278264 1290641
59234A290641J5264J7128J7175J6088J5399J6081J7617J8211J5868R723Q91q036
$$ 1290641 1305905 1323033 1340208 1356296 1371695 1387776 1405393 1423604 1439472 1449195 1450086 1442050
59222A442050j4792j9006k1830k4216k5863k5789k3574j9904j6015j2695r859
$$ 1442050 1427258 1408252 1386422 1362206 1336343 1310554 1286980 1267076 1251061 1238366 1228507
59211A228507p163m677k523k69K376M387M155J707j005k526l404m579n631n816
$$ 1228507 1221344 1216667 1214144 1213875 1216251 1220638 1224793 1226500 1225495 1222969 1219565 1214986 1209355 1203539
59197A203539n746o651q620j0892j3117j4924j5109j3002j0190q978r292q969
$$ 1203539 1197793 1191142 1182522 1171630 1158513 1143589 1128480 1115478 1105288 1096310 1087018 1078049
59185A078049p192n647n665o009m695j769Q29J666J155P41J341K552L272L034
$$ 1078049 1070857 1065210 1059545 1053536 1048841 1047072 1047901 1049567 1050722 1051463 1052804 1055356 1058628 1061662
59171A061662K455K238K264K191K197K428K313J372J26p20j397k306k841k285
$$ 1061662 1064117 1066355 1068619 1070810 1073007 1075435 1077748 1079120 1079246 1078526 1077129 1074823 1071982 1069697
59157A069697j335j178j550j286l53L35Q52K039L519L968L425L348M114M585M460
$$ 1069697 1068362 1067184 1065634 1064348 1063995 1064330 1065182 1067221 1070740 1074708 1078133 1081481 1085595 1090180 1094640
59142A094640M831N767N654L958K572L168N057O817Q192R081Q677P230O796Q221
$$ 1094640 1099471 1105238 1110892 1114850 1117422 1120590 1125647 1132464 1140656 1149737 1158414 1165644 1172440 1180661
59128A180661R139P178L838K539L800M993M455L076J813J99j931l371l169j856
$$ 1180661 1189800 1196978 1200816 1203355 1207155 1212148 1216603 1219679 1221492 1221691 1219760 1216389 1213220 1211364
59114A211364l42J118K167K020Q23K02J316L191M072L826L810M690N596N599M982
$$ 1211364 1211022 1212140 1214307 1216327 1217150 1217352 1218668 1221859 1225931 1229757 1233567 1238257 1243853 1249452 1254434
59099A254434M536M300L703K728K138K285K255P22k412n680p408p165n867m759
$$ 1254434 1258970 1263270 1266973 1269701 1271839 1274124 1276379 1277101 1274689 1269009 1261601 1254436 1248569 1243810
59085A243810m439m589m484l862l321l679m987o397o988o520n449m441l848l475
$$ 1243810 1239371 1234782 1230298 1226436 1223115 1219436 1214449 1208052 1201064 1194544 1189095 1184654 1180806 1177331
59071A177331k851j832p52J06Q43J593K376L689O420J0418J3810J4902J4451J4736
$$ 1177331 1174480 1172648 1171896 1172002 1172845 1174438 1176814 1180503 1186923 1197341 1211151 1226053 1240504 1255240
59057A255240J6604J8610J9303J8986J8830J9318K0158K0937K1334K1273K1175
$$ 1255240 1271844 1290454 1309757 1328743 1347573 1366891 1387049 1407986 1429320 1450593 1471768
59046A471768K1485K1850K1462K0240J8732J6850J3881R995O513M159K268K89
$$ 1471768 1493253 1515103 1536565 1556805 1575537 1592387 1606268 1616263 1622776 1626935 1629203 1629492
59034A629492j233j986k950n041p557r135r643j0032j0928j2306j4133j6280j8137
$$ 1629492 1628259 1626273 1623323 1618282 1610725 1601590 1591947 1581915 1570987 1558681 1544548 1528268 1510131
59021A510131j9225j9989k1182k2745k4036k4805k5239k5167k4168k2366k0512
$$ 1510131 1490906 1470917 1449735 1426990 1402954 1378149 1352910 1327743 1303575 1281209 1260697
59010A260697j9157j8136j6943j5428j4156j4004j5002j5682j4451j1721r631
$$ 1260697 1241540 1223404 1206461 1191033 1176877 1162873 1147871 1132189 1117738 1106017 1096386
58999A096386r174q741o429k897o96j265l576n505n572l704j206J40k37r83m62
$$ 1096386 1087212 1078471 1072042 1069145 1068449 1067184 1063608 1058103 1052531 1048827 1047621 1047761 1047524 1046541 1046079
58984A046079J202K531K818K873L698N287O947Q043Q274P838P476P922R138J0459
$$ 1046079 1047281 1049812 1052630 1055503 1059201 1064488 1071435 1079478 1087752 1095590 1103066 1110988 1120126 1130585
58970A130585J1498J2504J3926J6064J9029K2482K5407K6719K6386K5536K5251
$$ 1130585 1142083 1154587 1168513 1184577 1203606 1226088 1251495 1278214 1304600 1330136 1355387
58959A355387K5424K4956K2967J9734J6545J4546J3668J2639J0335O946L703J476
$$ 1355387 1380811 1405767 1428734 1448468 1465013 1479559 1493227 1505866 1516201 1523147 1526850 1528326
58947A528326p3j710l234l452j820M10J494J430J670K472J997r64m805p282q833
$$ 1528326 1528253 1526543 1523309 1519857 1518037 1518447 1519941 1521371 1523041 1525513 1527510 1526546 1521741 1514459 1505626
58932A505626j1591j5495j7911j7609j6753j7846k0480k2544k3188k3017k2408
$$ 1505626 1494035 1478540 1460629 1443020 1426267 1408421 1387941 1365397 1342209 1319192 1296784
58921A296784k1286k0023j9138j8249j6478j3719j0610p540m558k009l79M73J283
$$ 1296784 1275498 1255475 1236337 1218088 1201610 1187891 1177281 1169741 1165183 1163174 1162795 1163268 1164551
58908A164551K538M000M897M511L021J796K064L133L026J205o00j035j133k568
$$ 1164551 1167089 1171089 1175986 1180497 1183518 1185314 1187378 1190511 1193537 1194742 1194142 1193107 1191974 1189406
58894A189406n026o842p388p281o793n765m804m979o246p390p532o618m598j594
$$ 1189406 1184380 1177538 1170150 1162869 1156076 1150311 1145507 1140528 1134282 1126892 1119360 1112742 1108144 1106550
58880A106550J132J819L28j600k636l374m885o802p767p267o225n899o733q180
$$ 1106550 1107682 1109501 1109829 1108229 1105593 1102219 1097334 1090532 1082765 1075498 1069273 1063374 1056641 1048461
58866A048461r294r506r034q503q128p473o151m602l838m257m969m621k913q66
$$ 1048461 1039167 1029661 1020627 1012124 1003996 996523 990372 985770 981932 977675 972706 968085 965172 964306
58852I64306N41J464K478L460L975M339N335O977Q576R779J0521J0243Q620P007
$$ 964306 964847 966311 968789 972249 976224 980563 985898 992875 1001451 1011230 1021751 1031994 1040614 1047621
58838A047621P435R737J1419J1118J0455J1385J3325J4405J4272J4055J4385J5035
$$ 1047621 1055056 1064793 1076212 1087330 1097785 1109170 1122495 1136900 1151172 1165227 1179612 1194647
58826A194647J5950J7102J7754J7212J5928J4664J2989R926N846K385M64n33j585
$$ 1194647 1210597 1227699 1245453 1262665 1278593 1293257 1306246 1316172 1322018 1324403 1324867 1324334 1322749
58813A322749k924m260n382o338p312q227q492p736o827p191q781r947r914j0020
$$ 1322749 1319825 1315565 1310183 1303845 1296533 1288306 1279814 1272078 1265251 1258060 1249279 1239332 1229418 1219398
58799A219398j1583j3875j5387j5870j5809j5129j3955j3532j4490j5170j3653
$$ 1219398 1207815 1193940 1178553 1162683 1146874 1131745 1117790 1104258 1089768 1074598 1060945
58788A060945j0752q970q958r168q606p856p352o794o501p343q971r806r316q639
$$ 1060945 1050193 1041223 1032265 1023097 1014491 1006635 999283 992489 985988 978645 969674 959868 950552 941913
58774I41913q480p957o240l961k209j228o64k62K50J043J569Q87r83k860l751
$$ 941913 933433 925476 919236 915275 913066 911838 911174 910912 911162 912205 913774 914661 913678 910818 907067
58759I07067l766l459l067k616k034j127N3Q15N69k48q04j078j593k127j946j159
$$ 907067 903301 899842 896775 894159 892125 890998 891051 891866 892435 892187 891383 890305 888712 886585 884639 883480
58743H83480p63j215j945k283k031j185jQ06P76M00K64L0o68r71J60K085L234
$$ 883480 882717 881502 879557 877274 875243 874058 874057 874863 875639 876039 876303 876333 875665 874694 874854 876939 880173
58726H80173L470L993N098N766N620N589O257P045P368P369P261P166P521Q302
$$ 880173 883643 887636 892734 898500 904120 909709 915966 923011 930379 937748 945009 952175 959696 967998
58712I67998Q050N336J226j535j950j526j506j558j559k465m266n227m423l329
$$ 967998 976048 981384 982610 981075 979125 977599 976093 974535 972976 970511 966245 961018 956595 953266
58698I53266l534m410m478l709k897j893j55J666K287J672J150J844L786O230
$$ 953266 949732 945322 940844 937135 934238 932345 932190 933856 936143 937815 938965 940809 944595 950825
58684I50825Q124Q674Q202Q102R383J1590J3537J4615J4902J4646J4164J3874
$$ 950825 958949 967623 975825 983927 993310 1004900 1018437 1033052 1047954 1062600 1076764 1090638
58672A090638J3932J4087J4154J4182J4011J3203J1651R808Q228P234O832O396
$$ 1090638 1104570 1118657 1132811 1146993 1161004 1174207 1185858 1195666 1203894 1211128 1217960 1224356
58660A224356M972K676J280K120L930M392L475L250M315M658K761k98k912n259
$$ 1224356 1229328 1232004 1233284 1235404 1239334 1243726 1247201 1250451 1254766 1259424 1262185 1261887 1258975 1253716
58646A253716q095j0785j2241j2823j3863j5881j8469k1237k3758k5271k5495
$$ 1253716 1245621 1234836 1222595 1209772 1195909 1180028 1161559 1140322 1116564 1091293 1065798
58635A065798k5172k4762k3313j9906j5607j2636j1857j2249j2752j3274j3648
$$ 1065798 1040626 1015864 992551 972645 957038 944402 932545 920296 907544 894270 880622
58624H80622j2884j0277o770m378m182n223n588m336k056K76K327M036M952M637
$$ 880622 867738 857461 850691 846313 842131 836908 831320 826984 824928 825204 827531 831567 836519 841156
58610H41156L434K244J754K293L893N920P266P618P903Q569Q404O317L541K308
$$ 841156 844590 846834 848588 850881 854774 860694 867960 875578 883481 892050 900454 906771 910312 912620
58596I12620K730K798J391n14j748k435l145m003n073o387p337p178o317n875
$$ 912620 915350 918148 919539 919025 917277 914842 911697 907694 902621 896234 888897 881719 875402 869527
58582H69527n946n592m599l808l564l275k666k095j489m04Q38J532K023L097M012
$$ 869527 863581 857989 853390 849582 846018 842743 840077 837982 836493 836089 836927 838459 840482 843579 847591
58567H47591L179Q84p10o65k62m05j78J225L046M192M301L174R79n79L93K956
$$ 847591 850770 851654 850944 850279 850017 849612 849434 850659 853705 857897 862198 865372 866351 865772 866165 869121
58551H69121M047K924K235L645N181M555K567J142K84q17j428m80J208K028J873
$$ 869121 873168 876092 878327 881972 887153 891708 894275 895417 895701 894884 893456 892976 894184 896212 898085
58536H98085J613J412J204J609K716L274K725K769N015Q322J0434J1127J1741
$$ 898085 899698 901110 902314 903923 906639 909913 912638 915407 920422 928744 939178 950305 962046
58523I62046J2551J2797J2654J3069J3937J4298J4121J4277J4890J5092J4296
$$ 962046 974597 987394 1000048 1013117 1027054 1041352 1055473 1069750 1084640 1099732 1114028
58512A114028J2775J1235J0777J2481J5928J8919J9863J9821K0958K3631K6313
$$ 1114028 1126803 1138038 1148815 1161296 1177224 1196143 1216006 1235827 1256785 1280416 1306729
58501A306729K7788K8102K7658K6611K5072K3104K0606J7712J4780J1738Q134
$$ 1306729 1334517 1362619 1390277 1416888 1441960 1465064 1485670 1503382 1518162 1529900 1538034
58490A538034M126M10l068p041j1140j3851j4880j5886j7887j9748k0364k0650
$$ 1538034 1542160 1542570 1539502 1532461 1521321 1507470 1492590 1476704 1458817 1439069 1418705 1398055
58478A398055k1800k3178k3587k3322k3262k3037k1762j9721j7738j5762j3530
$$ 1398055 1376255 1353077 1329490 1306168 1282906 1259869 1238107 1218386 1200648 1184886 1171356
58467A171356j1717j0966j0453q843o105l307j230j53j84r73j758k285k711k450
$$ 1171356 1159639 1148673 1138220 1129377 1123272 1119965 1118735 1118582 1118398 1117425 1115667 1113382 1110671 1108221
58453A108221o77J644K187N88q12n32j5q74k300k947l239l907m141l191k075j728
$$ 1108221 1107544 1109188 1111375 1111963 1111151 1110619 1110604 1109730 1107430 1104483 1101244 1097337 1093196 1090005 1087930 1086202
58437A086202j227K16J390J274J245K812M888N708N801O574P531P517P297Q145
$$ 1086202 1084975 1085191 1086581 1087855 1089100 1091912 1096800 1102508 1108309 1114883 1122414 1129931 1137228 1145373
58423A145373R193Q960Q386R535J2089J3908J4411J4782J5282J4876J3210J0864
$$ 1145373 1154566 1163526 1171912 1181447 1193536 1207444 1221855 1236637 1251919 1266795 1280005 1290869
58411A290869P954M402J042j220k678l805m135l712m127o130p717o818m428k891
$$ 1290869 1298823 1303225 1304267 1303047 1300369 1296564 1292429 1288717 1284590 1278460 1270743 1263925 1259497 1256606
58397A256606k488k058j428p45J054M376P083P167N890N413M988K741k98j575
$$ 1256606 1254118 1252060 1250632 1249887 1250941 1255317 1262400 1269567 1275457 1280870 1285858 1288599 1288301 1286726
58383A286726j370k027l577l782k180o17J37J117K588L624M214N092N924O140
$$ 1286726 1285356 1283329 1279752 1275970 1273790 1273173 1273310 1274427 1277015 1280639 1284853 1289945 1295869 1302009
58369A302009O955R812J3474J5571J6199J7035J7815J7090J5698J5810J6817J5853
$$ 1302009 1308964 1318776 1332250 1347821 1364020 1381055 1398870 1415960 1431658 1447468 1464285 1480138
58357A480138J2392Q843O548M458K041K38p88k018l376l828l650m042m690m346
$$ 1480138 1492530 1501373 1507921 1512379 1514420 1514658 1513870 1511852 1508476 1504648 1500998 1496956 1492266 1487920
58343A487920l365k903k227J68L329M972N246O166P773Q385Q161Q758R728Q943
$$ 1487920 1484555 1481652 1479425 1479593 1482922 1487894 1493140 1499306 1507079 1515464 1523625 1532383 1542111 1551054
58329A551054O538M766M008K541L31o70j06M26O73J867L637M303M206N191O915
$$ 1551054 1557592 1562358 1566366 1568907 1569238 1568568 1568462 1568888 1569561 1571428 1575065 1579368 1583574 1588765 1595680
58314A595680P395O967P725R283R334Q312R040J1549J2918J2546J3004J5032J6422
$$ 1595680 1603075 1610042 1617767 1627050 1636384 1644696 1653736 1665285 1678203 1690749 1703753 1718785 1735207
58301A735207J6692J8068K0783K2014K0837J9732J9819J9083J6905J5826J7038
$$ 1735207 1751899 1769967 1790750 1812764 1833601 1853333 1873152 1892235 1909140 1924966 1942004
58290A942004J8278J8093J8126J9342J9970J9224J9266K1323K3408K3830K3694
$$ 1942004 1960282 1978375 1996501 2015843 2035813 2055037 2074303 2095626 2119034 2142864 2166558
58279B166558K4153K4424K4246K5021K6960K8157K7894K7659K7939K7324K5867
$$ 2166558 2190711 2215135 2239381 2264402 2291362 2319519 2347413 2375072 2403011 2430335 2456202
58268B456202K5540K6354K5821K3487K2026K2569K2911K1765K0787K0992K1159
$$ 2456202 2481742 2508096 2533917 2557404 2579430 2601999 2624910 2646675 2667462 2688454 2709613
58257B709613K1199K3003K6408K8550K8810L0185L4080L7968M0060M2033M5051
$$ 2709613 2730812 2753815 2780223 2808773 2837583 2867768 2901848 2939816 2979876 3021909 3066960
58246C066960M7293M7656M8046M9847N1536N1745N1286N0744M9613M8895N0671
$$ 3066960 3114253 3161909 3209955 3259802 3311338 3363083 3414369 3465113 3514726 3563621 3614292
58235C614292N4053N5701N5147N5242N6673N7190N7149O0104O6340P1441P3242
$$ 3614292 3668345 3724046 3779193 3834435 3891108 3948298 4005447 4065551 4131891 4203332 4276574
58224D276574P4742P8204Q1832Q4473Q8060R2971R6310R7230R8904J03070J07684
$$ 4276574 4351316 4429520 4511352 4595825 4683885 4776856 4873166 4970396 5069300 5172370 5280054
58213E280054J11757J17059J23381J27917J31093J36819J45260J51951J55910
$$ 5280054 5391811 5508870 5632251 5760168 5891261 6028080 6173340 6325291 6481201
58204F481201J61497J70097J77518J82294J88712J98396K06783K11668K17466
$$ 6481201 6642698 6812795 6990313 7172607 7361319 7559715 7766498 7978166 8195632
58195H195632K26983K36638K44141K53215K66101K78879K88917K99839L14518
$$ 8195632 8422615 8659253 8903394 9156609 9422710 9701589 9990506 10290345 10604863
58186A0604863L30319L45607L63561L85380M07499M29576M56872M90438N23734
$$ 10604863 10935182 11280789 11644350 12029730 12437229 12866805 13323677 13814115 14337849
58177A4337849N53428N84374O19517O54807O89054P28165P73971Q19797Q63040
$$ 14337849 14891277 15475651 16095168 16749975 17439029 18167194 18941165 19760962 20624002
58168B0624002R10712R66192J022788J077591J138592J209638J281800J349448
$$ 20624002 21534714 22500906 23523694 24601285 25739877 26949515 28231315 29580763
58160B9580763J421692J507434J602481J702824J817360J954978K111861K283574
$$ 29580763 31002455 32509889 34112370 35815194 37632554 39587532 41699393 43982967
58152D3982967K475862K690546K915639L144382L390282L669310L983463M337694
$$ 43982967 46458829 49149375 52065014 55209396 58599678 62268988 66252451 70590145
58144G0590145M755258N257802N848040O531926P338674Q296829R410886J0684376
$$ 70590145 75345403 80603205 86451245 92983171 100321845 108618674 118029560 128713936
58136A28713936J2139253J3779941J5562111J7431262J9364992K1341584K3309282
$$ 128713936 140853189 154633130 170195241 187626503 206991495 228333079 251642361
58129B51642361K5229117K7038329K8371254K8289075K5537590J9395850J0426086
$$ 251642361 276871478 303909807 332281061 360570136 386107726 405503576 415929662
58122D15929662L72444q750485j5603945j9840893k1812415k2129784k1408386
$$ 415929662 416302106 407551621 391947676 372106783 350294368 328164584 306756198
58115C06756198k0158877j8682921j7017655j5091563j3043507j1359172j0578177
$$ 306756198 286597321 267914400 250896745 235805182 222761675 211402503 200824326
58108B00824326j0820578j1650867j2429667j2752945j2561599j1969111j1116267
$$ 200824326 190003748 178352881 165923214 153170269 140608670 128639559 117523292
58101A17523292j0153663r221570q383237p616910o891708o215047n600864n040368
$$ 117523292 107369629 98148059 89764822 82147912 75256204 69041157 63440293 58399925
58093E8399925m525323m065757l665380l307306k980308k694570k456947k253304
$$ 58399925 53874602 49808845 46143465 42836159 39855851 37161281 34704334 32451030
58085C2451030k069139j906676j768154j641777j517961j402449j300733j205152
$$ 32451030 30381891 28475215 26707061 25065284 23547323 22144874 20844141 19638989
58077A9638989j109249j020032r44534q77563q13163p55025p05689o58570o10810
$$ 19638989 18529740 17509708 16565174 15687611 14874448 14119423 13413734 12755164 12144354
58068A2144354n71455n46434n27040n03377m78103m56842m35954m10663l85678
$$ 12144354 11572899 11026465 10499425 9996048 9517945 9061103 8625149 8214486 7828808
58059G828808l66958l51001l32197l13150k98330k84770k68075k51031k37729
$$ 7828808 7461850 7110849 6778652 6465502 6167172 5882402 5614327 5363296 5125567
58050E125567k25568k11114j97513j88192j79376j66762j53799j45593j39994
$$ 5125567 4899999 4688885 4491372 4303180 4123804 3957042 3803243 3657650 3517656
58041C517656j32286j23659j17620j12773j06093r9176r4619r0395q3840p7092
$$ 3517656 3385370 3261711 3144091 3031318 2925225 2826049 2731430 2641035 2557195 2480103
58031B480103p2778o8755o2650n7195n5212n3713m8795m2332l8256l6149l3909
$$ 2480103 2407325 2338570 2275920 2218725 2163513 2109800 2061005 2018673 1980417 1944268 1910359
58020A910359l2772l4290l6051l5527l4532l5202l5581l3942l3035l4964l6187
$$ 1910359 1877587 1843297 1807246 1771719 1737187 1701985 1666404 1632462 1599427 1564463 1528276
58009A528276l3056k8266k6220k5941k4185k1867k1481k1408j8823j5522j5130
$$ 1528276 1495220 1466954 1440734 1414793 1390608 1368741 1347260 1325852 1307029 1291507 1276377
57998A276377j6864j7271j6029j5096j4420j3108j2504j3682j4394j2857j1705
$$ 1276377 1259513 1242242 1226213 1211117 1196697 1183589 1171085 1157403 1143009 1130152 1118447
57987A118447j3654j6148j5314j2499j1703j2916j3227j2573j3064j4168j3585
$$ 1118447 1104793 1088645 1073331 1060832 1049129 1036213 1022986 1010413 997349 983181 969596
57976I69596j1806j1224j1729j1376j0358j0355j1060j0981j0587j1247j2321
$$ 969596 957790 946566 934837 923461 913103 902748 891688 880707 870120 858873 846552
57965H46552j2441j2126j2142j1252q739o988q090j0041r845q211p557p597o735
$$ 846552 834111 821985 809843 798591 789852 782864 774774 764733 754888 746677 739120 731523 724788
57952G24788n691n764n536l375j199j691l529l577k114j595j819p11J293J870
$$ 724788 719097 713333 707797 704422 703223 701532 698003 694426 692312 690717 688898 688187 689480 691350
57938F91350R79M39L24n58j533j036J82K74l82l86m27j731k923k118p52j454l480
$$ 691350 692329 692768 693092 692534 691001 689965 690147 690421 690039 689653 689226 687495 684572 682454 681702 680248 676768
57921F76768m189l783m385n623n397m187m314n522n494m175l537l497k256k86
$$ 676768 672579 668796 664411 658788 653391 649204 644890 639368 633874 629699 626162 622665 620409 620123
57907F20123K03m67R3J689J650j64o99J328L611M300M217M063K846K56k133l163
$$ 620123 620326 619859 619952 621641 623291 623127 622428 623756 627367 631667 635884 639947 642793 643049 640916 637753
57891F37753l268k794j449K17J020J101J456J663N23j182j265M77K002K251K166
$$ 637753 634485 631691 630242 630459 631479 632580 634036 635699 636222 635040 633775 634252 636254 638505 640671
57876F40671K555L334M773O898P936O102K799J239J952K557J922J461J930K013
$$ 640671 643226 646560 651333 658231 666167 672269 675068 676307 678259 680816 682738 684199 686129 688142
57862F88142Q18q79k469m195n563n549m847n480p648r313r336q594p568n354j946
$$ 688142 688960 688081 685612 681417 675854 670305 665458 659978 652330 643017 633681 625087 617519 612165 610219
57847F10219Q00J384K04j726l883n575n932n069l992l236k844l287m735n908n508
$$ 610219 611019 612403 612607 610881 606998 601423 595491 590422 586430 583194 580350 577063 572328 566420 560912
57832E60912m262l584l020j378L81K20j414k049j071l12o77j150j344k108l233
$$ 560912 556650 553066 550046 548668 549049 549269 547855 545806 544735 544423 543746 542596 541252 539144 535911
57817E35911l351k598k636l677m183m008m794o561o994n124k931k096j877j370
$$ 535911 532560 529962 527326 523649 519466 515458 510664 504103 497109 491985 489054 486958 485081 483711
57803D83711j327k167k564j532rQ98J400J676J181M35J418M718Q159R590R408
$$ 483711 482384 480217 477653 476121 476112 477010 478410 480086 481267 481702 483120 487838 495997 505587 514995
57788E14995R070Q800Q131P189O184M954L985M338N709O200M986L547L210L217
$$ 514995 524065 532865 540996 548185 554369 559323 563308 567646 573355 579555 584541 588088 591298 594515
57774E94515K427J237M67j55j057j692j586j322j338j026j35K81n14j502j362
$$ 594515 596942 598179 598646 598491 597434 595742 594156 592834 591496 590470 590335 590616 590102 588600 587238
57759E87238k62Q21J501J723J240L38o6P0m80k090l197k600j533j907l505m542
$$ 587238 586976 587797 589298 591021 592261 592599 592533 592603 592123 590033 586836 584236 582703 580796 577291 572749
57743E72749m325l789l801m303m989n685o036n616m388k719j120j72j92p34r67
$$ 572749 568424 564635 560834 556531 551542 545857 539821 534205 529817 527098 525978 525806 525614 524880 523913
57728E23913p03l19L24J863L999N296N072M368M320M573M222L507L492M488N704
$$ 523913 523210 522891 523215 525078 529077 534373 539445 543813 548133 552706 556928 560435 563927 568415 574119
57713E74119O235N771M597L344K693K843L372L718L602L049K188J047o66l271
$$ 574119 580354 586125 590722 594066 596759 599602 602974 606692 610294 613343 615531 616578 615912 612641
57699F12641o222q073p981o878o378o930p834q603r248r501q840p247n187l036
$$ 612641 606419 598346 590365 583487 577109 570179 562345 553742 544494 534993 526153 518906 513719 510683
57685E10683j174j38R7K90N89q1k069l632l056j138J91P43J513K191J745R07J321
$$ 510683 509509 509371 509468 509758 510347 510266 508197 504565 501509 500371 500562 501305 502818 505009 506754 507661 508982
57668E08982K506K482J419J668L659M803L513J593J157J641J528J058J393K408
$$ 508982 511488 513970 515389 517057 520716 525519 529032 530625 531782 533423 534951 536009 537402 539810
57654E39810L020K854K315J698J119P15M25J86L73J047J021q54l552m699l540
$$ 539810 542830 545684 547999 549697 550816 551531 551956 552142 552515 553562 554583 553729 550177 545478 541938
57639E41938j379P20K591L475K395L90j36J166K305K536L368N156N817M314K636
$$ 541938 540559 541279 543870 547345 549740 550130 549994 551160 553465 556001 559369 564525 570342 574656 577292
57624E77292K582L279L698M889P444R369R180R056J1971J7291K2032K5343K8827
$$ 577292 579874 583153 586851 591740 599184 608553 617733 626789 638760 656051 678083 703426 732253
57611G32253L3214L7483M1000M4182M7017M8667M8452M5820L9764K9594J5981
$$ 732253 765467 802950 843950 888132 935149 983816 1032268 1078088 1117852 1147446 1163427
57600A163427M61j5223k8556l6664l8911l7890l6367l4525l1649k8686k6871k5186
$$ 1163427 1163888 1148665 1120109 1083445 1044534 1006644 970277 935752 904103 875417 848546 823360
57588H23360k1911j7813j5137j3951j2075q682n497m118m106m157l603k325n86
$$ 823360 801449 783636 768499 754548 742473 733791 728294 724176 720070 715913 712310 709985 709399
57575G09399Q53J309R57L26m05p97J36K273L464K075m76j621j313j395j937r60
$$ 709399 710252 711561 712518 712844 712439 711642 711778 714051 717515 719590 719114 717493 716180 714785 712848 711888
57559G11888J915M220M054K607K073K611K718J561k20j479j467j88J522K571K504
$$ 711888 713803 718023 722077 724684 726757 729368 732086 733647 733427 731948 730481 730293 731815 734386 736890
57544G36890J705Q02L17P33K105L636M247L669K603J797J353P64o04k713m341
$$ 736890 738595 739397 739714 740447 742552 746188 750435 754104 756707 758504 759857 760621 760017 757304 752963
57529G52963m021j814N61J830K430L074L222K157N99r9K08O90J032J458J842K049
$$ 752963 748942 747128 747689 749519 751949 755023 758245 760402 761001 760902 761110 761800 762832 764290 766132 768181
57513G68181K548L476L686K260L93J88J801L436M019M173M486M445L619K668K568
$$ 768181 770729 774205 777891 780151 780544 780732 782533 785969 789988 794161 798647 803092 806711 809379 811947
57498H11947L540M907N589M901L558L392N184P428Q315Q160Q363Q751P961O281
$$ 811947 815487 820394 825983 830884 834442 837834 843018 850446 858761 866921 875284 884035 891996 898277
57484H98277N789P224Q689Q317O685N566N534N831N858N673N461N322N502O443
$$ 898277 904066 911290 919979 928296 934981 940547 946081 951912 957770 963443 968904 974226 979728 986171
57470I86171Q400J0936J2812J2929J1653J0586J0600J0965J0980J1322J2587J3678
$$ 986171 994571 1005507 1018319 1031248 1042901 1053487 1064087 1075052 1086032 1097354 1109941 1123619
57458A123619J3298J2239J2353J3819J5269J6218J7192J7742J6693J4563J3466
$$ 1123619 1136917 1149156 1161509 1175328 1190597 1206815 1224007 1241749 1258442 1273005 1286471
57447A286471J4018J4461J3514J2045J0990R661P406N321M837N825P209Q286Q498
$$ 1286471 1300489 1314950 1328464 1340509 1351499 1361160 1368566 1373887 1378724 1384549 1391758 1400044 1408542
57434A408542P247N085L836M301N071M847M612N954Q341R881R984R594R304Q983
$$ 1408542 1415789 1420874 1424710 1429011 1434082 1438929 1443541 1449495 1457836 1467717 1477701 1487295 1496599 1505582
57420A505582Q911R466R925R211P869P620Q813R931R949R560R556R599R512J0342
$$ 1505582 1514493 1523959 1533884 1543095 1550964 1558584 1567397 1577328 1587277 1596837 1606393 1615992 1625504 1635846
57406A635846J2716J5150J5611J4280J3235J3408J3448J2157J0706J1266J3993
$$ 1635846 1648562 1663712 1679323 1693603 1706838 1720246 1733694 1745851 1756557 1767823 1781816
57395A781816J6607J6954J5223J3334J2840J3712J4670J4348J2539J0619J0424
$$ 1781816 1798423 1815377 1830600 1843934 1856774 1870486 1885156 1899504 1912043 1922662 1933086
57384A933086J2280J4553J5628J5903J6989J9172K0737K0060J7581J5166J4201
$$ 1933086 1945366 1959919 1975547 1991450 2008439 2027611 2048348 2068408 2085989 2101155 2115356
57373B115356J4880J6739J8962K0289J9690J7601J5897J6026J7438J8394J8231
$$ 2115356 2130236 2146975 2165937 2186226 2205916 2223517 2239414 2255440 2272878 2291272 2309503
57362B309503J8082J9189K1212K2700K2816K1927K0746J9717J9175J9426K0307
$$ 2309503 2327585 2346774 2367986 2390686 2413502 2435429 2456175 2475892 2495067 2514493 2534800
57351B534800K1204K1780K2169K2353K1897K0704J9497J9073J9394J9908K0480
$$ 2534800 2556004 2577784 2599953 2622306 2644203 2664907 2684404 2703477 2722871 2742779 2763259
57340B763259K1462K2905K4127K4329K3573K2970K3563K4972K5720K5271K5000
$$ 2763259 2784721 2807626 2831753 2856082 2879655 2902625 2926188 2951160 2976880 3002151 3027151
57329C027151K6260K8086K8210K6184K3979K3348K4224K6011K8530L0817L0888
$$ 3027151 3053411 3081497 3109707 3135891 3159870 3183218 3207442 3233453 3261983 3292800 3323688
57318C323688K8315K5576K5091K6101K6398K6099K7221K9784L1060K9349K6466
$$ 3323688 3352003 3377579 3402670 3428771 3455169 3481268 3508489 3538273 3569333 3598682 3625148
57307C625148K5280K6171K7139K6643K5192K4340K4913K6275K7146K6968K6357
$$ 3625148 3650428 3676599 3703738 3730381 3755573 3779913 3804826 3831101 3858247 3885215 3911572
57296C911572K6089K6128K6109K6168K6557K6805K6291K5504K5693K7085K8444
$$ 3911572 3937661 3963789 3989898 4016066 4042623 4069428 4095719 4121223 4146916 4174001 4202445
57285D202445K8688K8176K7969K8423K8974K9075K8933K9377L0933L2971L3966
$$ 4202445 4231133 4259309 4287278 4315701 4344675 4373750 4402683 4432060 4462993 4495964 4529930
57274D529930L2987L0810K9311K9738L1652L3247L2806L0355K8089K8338L0859
$$ 4529930 4562917 4593727 4623038 4652776 4684428 4717675 4750481 4780836 4808925 4837263 4868122
57263D868122L2984L2898L1674L1358L2162L2794L2683L2357L2087L1534L0624
$$ 4868122 4901106 4934004 4965678 4997036 5029198 5061992 5094675 5127032 5159119 5190653 5221277
57252E221277K9641K8551K7140K5533K3826K1702J9448J8524J9848K2104K3306
$$ 5221277 5250918 5279469 5306609 5332142 5355968 5377670 5397118 5415642 5435490 5457594 5480900
57241E480900K3560K4569K6786K8946L0397L1938L4049L5975L7169L8010L8733
$$ 5480900 5504460 5529029 5555815 5584761 5615158 5647096 5681145 5717120 5754289 5792299 5831032
57230E831032L8930L8637L8370L7729L5602L2378L0261L0402L1130L0102K7140
$$ 5831032 5869962 5908599 5946969 5984698 6020300 6052678 6082939 6113341 6144471 6174573 6201713
57219F201713K3876K1644K0822K1361K2852K4577K6322K8580L1369L3717L5095
$$ 6201713 6225589 6247233 6268055 6289416 6312268 6336845 6363167 6391747 6423116 6456833 6491928
57208F491928L6422L8733M1509M3318M3479M2304M0421L8718L8149L8477L7855
$$ 6491928 6528350 6567083 6608592 6651910 6695389 6737693 6778114 6816832 6854981 6893458 6931313
57197F931313L4845L0314K6073K2157J7089J0714N032J650q1j697l518m837n204
$$ 6931313 6966158 6996472 7022545 7044702 7061791 7072505 7077537 7079187 7079106 7077409 7073891 7069054 7063850
57184G063850m398j835K590P379J0740J3130J7089K3956L2132L9487M6183N3688
$$ 7063850 7059452 7057617 7060207 7067586 7078326 7091456 7108545 7132501 7164633 7204120 7250303 7303991
57172G303991O2003O9710P6242Q1997Q6246Q7109Q4330Q0267P7163P5009P2892
$$ 7303991 7365994 7435704 7511946 7593943 7680189 7767298 7851628 7931895 8009058 8084067 8156959
57161H156959P0695O8210O4309N8783N3638N0693M8830M5592M0612L5478L0769
$$ 8156959 8227654 8295864 8360173 8418956 8472594 8523287 8572117 8617709 8658321 8693799 8724568
57150H724568K5470J9071J2290N578j361q506j5482k2550l0128l7544m3913n0030
$$ 8724568 8750038 8769109 8781399 8786977 8785616 8777110 8761628 8739078 8708950 8671406 8627493 8577463
57138H577463n7548o6351p4647q1840q9308r7932j06660j14020j19268j21598
$$ 8577463 8519915 8453564 8378917 8297077 8207769 8109837 8003177 7889157 7769889 7648291
57128G648291j20245j16098j11529j07544j02599r5105q5684p5991o6668n7592
$$ 7648291 7528046 7411948 7300419 7192875 7090276 6995171 6909487 6833496 6766828 6709236
57118F709236m9108m1982l6954l5107l7603m4219n2909o1719p0406p9491q8512
$$ 6709236 6660128 6618146 6581192 6546085 6508482 6464263 6411354 6349635 6279229 6199738 6111226
57107F111226r6014j00798j02623j02200j00922j00109j00380j01965j05343j10491
$$ 6111226 6015212 5914414 5811791 5709591 5608669 5508560 5408180 5306215 5200872 5090381
57097E090381j15810j19136j20189j20959j23399j27604j32374j36492j39441
$$ 5090381 4974571 4855435 4735246 4614287 4490888 4363284 4230910 4094418 3954977
57088C954977j41966j46060j53369j63541j75055j87301k00576k14535k28315
$$ 3954977 3813011 3666951 3513582 3350041 3174986 2987685 2787109 2572574 2344259
57079B344259k41924k55721k68686k79229k87913k97443l09774G8481b65336l67401
$$ 2344259 2102335 1846614 1577928 1298699 1010786 713343 403569 78481 -265336 -632737
57069f32737l96329m29425m65692n05310n48407n94459o43426o95983p52544q13667
$$ -632737 -1029066 -1458491 -1924183 -2429493 -2977900 -3572359 -4215785 -4911768 -5664312 -6477979
57059f477979q81249r57193j041150j131917j231054j342530j468827j610481
$$ -6477979 -7359228 -8316421 -9357571 -10489488 -11720542 -13063072 -14531899 -16142380
57051a6142380j769917j952675k163994k406785k683745k998846l356443l762267
$$ -16142380 -17912297 -19864972 -22028966 -24435751 -27119496 -30118342 -33474785 -37237052
57043c7237052m226398m762815n385481o107366o942848p907200r013103j0270295
$$ -37237052 -41463450 -46226265 -51611746 -57719112 -64661960 -72569160 -81582263 -91852558
57035i1852558j1686641j3262864j4983806j6817243j8719028k0633510k2491328
$$ -91852558 -103539199 -116802063 -131785869 -148603112 -167322140 -187955650 -210446978
57028b10446978k4216492k5737975k6989773k7903038k8401945k8382362k7650483
$$ -210446978 -234663470 -260401445 -287391218 -315294256 -343696201 -372078563 -399729046
57021c99729046k5882610k2725309j8039388j2092599n496837J071486P118969
$$ -399729046 -425611656 -448336965 -466376353 -478468952 -483965789 -482894303 -475775334
57014d75775334J2379617J6725642K0106805K2560192K4213912K5237399K5776156
$$ -475775334 -463395717 -446670075 -426563270 -404003078 -379789166 -354551767 -328775611
57007c28775611K5919891K5707076K5147342K4250991K3054021K1622119K0033348
$$ -328775611 -302855720 -277148644 -252001302 -227750311 -204696290 -183074171 -163040823
57000a63040823J8359645J6661493J4989762J3385041J1875762J0479606R206435
$$ -163040823 -144681178 -128019685 -113029923 -99644882 -87769120 -77289514 -68083079
56993f8083079Q059826P038522O138494N353464M673758M086703L579356L140597
$$ -68083079 -60023253 -52984731 -46846237 -41492773 -36819015 -32732312 -29152956 -26012359
56985b6012359K761131K432946K149111J903255J689361J502592J339774J198206
$$ -26012359 -23251228 -20818282 -18669171 -16765916 -15076555 -13573963 -12234189 -11035983
56977a1035983J074419R64977Q67889P82289P07186O41347N83684N33006M87872
$$ -11035983 -9961564 -8996587 -8128698 -7346409 -6639223 -5997876 -5414192 -4881186 -4393314
56968d393314M47362M11254L78879L48686L19709K92634K68647K47935K29931
$$ -4393314 -3945952 -3534698 -3155819 -2807133 -2487424 -2194790 -1926143 -1678208 -1448277
56959a448277K14373K01771J93107J88304J83358J69900J40884e8646g804A158
$$ -1448277 -1233904 -1032133 -839026 -650722 -467364 -297464 -156580 -58646 -7804 1158
56948b3474n0249o6940p4099p4761p3598p2378p0101o6638o3404o0804n7626n3032
$$ -23474 -73723 -140663 -214762 -289523 -363121 -435499 -505600 -572238 -635642 -696446 -754072 -807104
56936h07104m7361m1084l4613k8861k4406k0458j6007j1503q063n663l595j854
$$ -807104 -854465 -895549 -930162 -959023 -983429 -1003887 -1019894 -1031397 -1039460 -1045123 -1048718 -1050572
56924a050572m85J509M554O623N238J022k909m853n538n445l769o81J777K251
$$ -1050572 -1051057 -1049548 -1044994 -1038371 -1033133 -1032111 -1035020 -1039873 -1045411 -1050856 -1054625 -1055306 -1053529 -1051278
56910a051278J924K612M273N555N912O132P177R349J2323J5376J7669J8618J8163
$$ -1051278 -1049354 -1046742 -1042469 -1036914 -1031002 -1024870 -1017693 -1008344 -996021 -980645 -962976 -944358 -926195
56897i26195J6753J5115J3727J2337J0411Q110O185M725L058J399J428M138Q055
$$ -926195 -909442 -894327 -880600 -868263 -857852 -849742 -843557 -838832 -835774 -834375 -832947 -828809 -820754
56884h20754J0771J1645J1817J2274J3186J4778J7381K0661K3844K6634K9160
$$ -820754 -809983 -798338 -786521 -774247 -761061 -746283 -728902 -708241 -684397 -657763 -628603
56873f28603L1297L2815L3773L3791L1570K6189J8560J0629L666j778n107o204
$$ -628603 -597306 -564491 -530718 -496927 -465357 -439168 -420608 -409979 -406313 -408091 -413198 -419402
56861d19402o213o331o278n328m199m151m594l611r42J383J816J126R38J761K980
$$ -419402 -425615 -431946 -438224 -443552 -447751 -451902 -456496 -460107 -461049 -459666 -457850 -456724 -455786 -454025 -451045
56846d51045L783L726L309M103P215J1469J4220J4203J2555J0981J0213J0406
$$ -451045 -447262 -443536 -440227 -436124 -428909 -417440 -403220 -389017 -376462 -365481 -355268 -344862
56834c44862J1614J3260J4326J4728J5660J8005K1226K4095K5677K5299K2632
$$ -344862 -333248 -319988 -305662 -290934 -275274 -257269 -236043 -211948 -186271 -160972 -138340
56823a38340J8369J4030J0517P609N094L495L199L672M147M372M277L790L448
$$ -138340 -119971 -105941 -95424 -87815 -82721 -79226 -76027 -72355 -68208 -63836 -59559 -55769 -52321
56810e2321M391O961J0019J2403d031A3516K1479K4826K6513K7247K8524L0543
$$ -52321 -47930 -40969 -30950 -18547 -4031 13516 34995 59821 86334 113581 142105 172648
56798A72648L1561K9488K3923J6374Q739K190k695n688p238q095q036n812j188
$$ 172648 204209 233697 257620 273994 282733 284923 282228 276540 269302 261207 253171 247359 246171
56785B46171L903P275Q903J0437J3095J7132K2474K8207L2295L3724L4377L6694
$$ 246171 250074 257349 266252 276689 289784 306916 329390 357597 389892 423616 457993 494687
56773D94687L9636L9355L3976K5373J5796N450n513j5091k1434k5038k7165k7570
$$ 494687 534323 573678 607654 633027 648823 654273 648760 633669 612235 587197 560032 532462
56761E32462k5617k2429j9720j7186j3091p220j429K770N686Q459J1916J6536
$$ 532462 506845 484416 464696 447510 434419 427199 425770 428540 434226 442685 454601 471137
56749D71137K2161K7317K9786K8433K3918J7386R154q52j1817k1730k8491l1427
$$ 471137 493298 520615 550401 578834 602752 620138 629292 628440 616623 594893 566402 534975
56737E34975l1715l1153l0340k8451k4903k0620j7112j4774j2794j0401p482m132
$$ 534975 503260 472107 441767 413316 388413 367793 350681 335907 323113 312712 305230 301098
56725C01098m09L331O551R190J1633J3700J4027J0963M250m367j2243j7671k0644
$$ 301098 300689 304020 310571 319761 331394 345094 359121 370084 374334 369967 357724 340053 319409
56712C19409k1945k1977k0841j9230j8262j8138j7683j5790j2964j0822j0305
$$ 319409 297464 275487 254646 235416 217154 199016 181333 165543 152579 141757 131452
56701A31452j0804j0975j0030q245o552n700n690n958n998n615m725l425k244
$$ 131452 120648 109673 99643 91398 84846 79146 73456 67498 61500 55885 51160 47735 45491
56688D5491j742j666j188k81j24j493l304l751k637j615j932k849k782j430m4
$$ 45491 43749 42083 40895 40614 40490 38997 35693 31942 29305 27690 25758 22909 20127 18697 18653
56673A8653K69j34l6J081K418K696J389q43k704l200k323r57l1L28O94J437K293
$$ 18653 18922 18788 18752 19833 22251 24947 26336 25493 22789 19589 17266 16309 16278 16606 17300 18737 21030
56656B1030K808K817K280J192rm87Q8R95J315R24K18n92j268j161J03J748K476
$$ 21030 23838 26655 28935 30127 30118 29631 29719 30714 32029 32953 33171 32579 31311 30150 30253 32001 34477
56639C4477J797J87j625k809k519q13J003K037L173N314P017N932K485k20n15
$$ 34477 36274 36461 34836 32027 29508 28695 29698 31735 34908 40222 47239 53171 55656 55436 54921
56624E4921O7j22m03J98O28m00j813j582J36J339J097K48n05j218j536p28P99
$$ 54921 54988 54866 54463 54661 55289 54889 53076 51494 51630 52969 54066 54314 53809 52591 51055 50327 51126
56607E1126J651J426J217J725K136J526L91P0J253L477N553O286N463M336M475
$$ 51126 52777 54203 55420 57145 59281 60807 61198 61268 62521 65998 71551 77837 83300 87636 92111
56592I2111N933P235P337O770O497O639O813O981P122O700N350L803L241L835
$$ 92111 98044 105279 112616 119386 125883 132522 139335 146316 153438 160138 165488 169291 172532 176367
56578A76367M615M774M385L696K544R21m96j060j068j233j429r19M9K9j525k991
$$ 176367 180982 185756 190141 193837 196381 197302 196806 195746 194678 193445 192016 191097 191146 191175 189650 186659
56562A86659k469m73P03K9j255j777j641j347o16O54J428P56p29j680j800j582
$$ 186659 184190 183717 184420 184449 183194 181417 179776 178429 177813 178467 179895 180651 179922 178242 176442 174860
56546A74860r80L51J826K315J676P21j77j145j635p20J169K306K033J644K293
$$ 174860 173880 174231 176057 178372 180048 180769 180592 179447 177812 177092 178261 180567 182600 184244 186537
56531A86537L309L579L393L615L865L009J082o24j310j260p16N57K200K959K269
$$ 186537 189846 193425 196818 200433 204298 207307 208389 207765 206455 205195 204479 205036 207236 210195 212464
56516B12464J339J776L484M810M692L814L507M084M732M696M161L901M338N165
$$ 212464 213803 215579 219063 223873 228565 232379 235886 239970 244702 249398 253559 257460 261798 266963
56502B66963N833O350P233Q625R737R649Q489P318O805O626O294N892N543M948
$$ 266963 272796 279146 286379 295004 304741 314390 322879 330197 337002 343628 349922 355814 361357 366305
56488C66305M083L709M280M839M180K794K243K602K120Qk058k328j690k400m645
$$ 366305 370388 374097 378377 383216 387396 390190 392433 395035 397155 397163 395105 392777 391087 388687 384042
56473C84042o068m918k349j003k063m356n997o348o280o711p237o570m467k581
$$ 384042 377974 373056 370707 369704 367641 363285 357288 350940 344660 337949 330712 324142 319675 317094
56459C17094k814m965o705o070l480j068l24q84j429j285p77l74j43j33o06j413
$$ 317094 314280 309315 302610 296540 293060 291992 291668 290784 289355 288070 287293 286919 286776 286643 286037 284624
56443B84624j733j245j041k302m250m709k947p74j86r99j501p42O65J478R24o99
$$ 284624 282891 281646 280605 278303 274053 269344 266397 265623 265437 264438 262937 262195 262860 264338 265262 264563
56427B64563k021j667J82J853K147J478O77k27j285j726j040j77l61j164j063
$$ 264563 262542 260875 261057 262910 265057 266535 267212 266985 265700 263974 262934 262757 262396 261232 260169
56412B60169L67K035K962L144K833K056J015J92n7N06K137M477O209O293N339
$$ 260169 260536 262571 265533 268677 271510 273566 274581 274773 274716 275222 277359 281836 288045 294338 299677
56397B99677M782M937M880M038K731J258k45j112n83P75J363O96J39R22K347K760
$$ 299677 304459 309396 314276 318314 321045 322303 322058 320946 320363 321138 322501 323197 323336 324258 326605 329365
56381C29365J704M07L02J444K317J413q60k237j165J141K150J119m03j052j162
$$ 329365 331069 331476 331778 333222 335539 336952 336092 333855 332690 333831 335981 337100 336697 335645 334483
56366C34483j550k002j766o98O55J643J745P28j040k647l233k458p13Q62J070
$$ 334483 332933 330931 329165 328467 329122 330765 332510 333238 332198 329551 326318 323860 323147 324009 325079
56351C25079L6o53J24J506J987J529J128Q78J21p97p56J98Q88J124J982L586M488
$$ 325079 325115 324462 324586 326092 328079 329608 330736 331614 331735 330938 330182 330380 331268 332392 334374 337960 342448
56334C42448L886K821K436K514K486K433K333J745J067J585L311M292L187J167
$$ 342448 346334 349155 351591 354105 356591 359024 361357 363102 364169 365754 369065 373357 376544 377711
56320C77711j7m31j084j857k018j920k528l748m641m775m151k356O77L448L960
$$ 377711 377694 377263 376179 374322 372304 370384 367856 364108 359467 354692 350541 348185 348862 352310 356270
56305C56270K148P5m89J63N40j49j233j494o74J77J32j95M50J867K545K041J636
$$ 356270 358418 358493 358004 358167 358707 358558 357325 355831 355157 355334 355466 355271 355721 357588 360133 362174 363810
56288C63810K153K676K379K029K450K879K316J384J294J843K035K027K830M524
$$ 363810 365963 368639 371018 373047 375497 378376 380692 382076 383370 385213 387248 389275 392105 396629
56274C96629O090O674N922L704P76r37j72J900L093K947K742L208L758L830L534
$$ 396629 402719 409393 415315 419019 419795 418858 418686 420586 423679 426626 429368 432576 436334 440164 443698
56259D43698K943J952Q56J21l14n94j74J377L227M052L760L324L206L162L252
$$ 443698 446641 448593 449449 449570 449256 448662 448488 449865 453092 457144 460904 464228 467434 470596 473848
56244D73848L705L890K744M57j336j291M90K843M404M312K889J520J252J880K819
$$ 473848 477553 481443 484187 484644 483308 482017 482507 485350 489754 494066 496955 498475 499727 501607 504426
56229E04426L963M933M605K627N41L3Q81J921K983M248M801L926L006L825N549
$$ 504426 508389 513322 517927 520554 521095 521128 522009 523930 526913 531161 535962 539888 542894 546719 552268
56214E52268N796M420L652M414N112M604L978M465N622O495O940O988O483O003
$$ 552268 558064 562484 566136 570550 575662 580266 584244 588709 594331 600826 607766 614754 621237 627240
56200F27240O658Q263R124Q347P069O825Q020J0343J3171J5157J5146J4081J4343
$$ 627240 633898 642161 651285 659632 666701 673526 681546 691889 705060 720217 735363 749444 763787
56187G63787J6530J8681J9410J9861K1361K2940K2868K1310J9756J8725J7570
$$ 763787 780317 798998 818408 838269 859630 882570 905438 926748 946504 965229 982799
56176I82799J5981J4295J2611J0707Q687O962N759N017M347K909Pl818p011q652
$$ 982799 998780 1013075 1025686 1036393 1045080 1052042 1057801 1062818 1067165 1070074 1070081 1066263 1059252 1050600
56162A050600r213r504r711r787r897j0054j0084j0036r951r303p819o690p484
$$ 1050600 1041387 1031883 1022172 1012385 1002488 992434 982350 972314 962363 953060 945241 938551 931067
56149I31067r617j0546q999o525n058m387l085p98J449K648K619J884J304J428
$$ 931067 921450 910904 901905 895380 890322 885935 882850 882052 883501 886149 888768 890652 891956 893384
56135H93384K057K746L512M313M426L434K366K368K813K458K007L262N911P704
$$ 893384 895441 898187 901699 906012 910438 913872 916238 918606 921419 923877 925884 929146 935057 942761
56121I42761Q022Q574R926J0204Q369O263N818O467O881P260Q112Q668Q310Q070
$$ 942761 950783 959357 969283 979487 987856 994119 999937 1006404 1013285 1020545 1028657 1037325 1045635 1053705
56107A053705Q899R959J0334J1082J3556J6818J8626J8342J7283J6752J7075J8058
$$ 1053705 1062604 1072563 1082897 1093979 1107535 1124353 1142979 1161321 1178604 1195356 1212431 1230489
56095A230489J9344K0690K2465K5085K7731K8976K9121L0206L3100L6455L9333
$$ 1230489 1249833 1270523 1292988 1318073 1345804 1374780 1403901 1434107 1467207 1503662 1542995
56084A542995M2792M7687N3037N7944O3129O9134P5126Q1115Q9071R9829J10868
$$ 1542995 1585787 1633474 1686511 1744455 1807584 1876718 1951844 2032959 2122030 2221859 2332727
56073B332727J19371J25571J30751J33779J32474J27032J19485J10831J01321
$$ 2332727 2452098 2577669 2708420 2842199 2974673 3101705 3221190 3332021 3433342
56064C433342R2476Q5978Q0937P4580O5354N3454L9116K2668N906q682k0066k8841
$$ 3433342 3525818 3611796 3692733 3767313 3832667 3886121 3925237 3947905 3953811 3945129 3925063 3896222
56052C896222l6030m3071n1848o2947p4631q5032r4143j02139j07291j07708j04014
$$ 3896222 3860192 3817121 3765273 3702326 3627695 3542663 3448520 3346381 3239090 3131382 3027368
56041C027368r8227r1109q2614p3645o5145n6661m7954m0737l6345l3035k8186
$$ 3027368 2929141 2838032 2755418 2681773 2616628 2559967 2512013 2471276 2434931 2401896 2373710
56030B373710k2156j7143j3315r000m076j96K107L889N633O947Q100R729J1480
$$ 2373710 2351554 2334411 2321096 2312096 2308020 2307824 2309931 2313820 2319453 2326400 2334500 2344229 2355709
56017B355709J2952J5175J8940K2729K4821K6373K9566L3514L5217L4247L3426
$$ 2355709 2368661 2383836 2402776 2425505 2450326 2476699 2506265 2539779 2574996 2609243 2642669
56006B642669L4775L7455L9949M1870M3374M4723M6486M8775N0724N1970N3541
$$ 2642669 2677444 2714899 2754848 2796718 2840092 2884815 2931301 2980076 3030800 3082770 3136311
55995C136311N5686N6521N4956N3154N3618N5565N6891N7954O0259O3119O5089
$$ 3136311 3191997 3248518 3303474 3356628 3410246 3465811 3522702 3580656 3640915 3704034 3769123
55984C769123O7121P0784P4689P6494P7139P9330Q2965Q5936Q8270R1456R4821
$$ 3769123 3836244 3907028 3981717 4058211 4135350 4214680 4297645 4383581 4471851 4563307 4658128
55973D658128R6801R8844J03664J10505J16506J21815J28633J36056J40920J43516
$$ 4658128 4754929 4853773 4957437 5067942 5184448 5306263 5434896 5570952 5711872 5855388
55963E855388J47476J54036J61199J68515J77708J88333J97623K05218K13640
$$ 5855388 6002864 6156900 6318099 6486614 6664322 6852655 7050278 7255496 7469136
55954G469136K23803K34191K44469K55646K66964K77065K87779L02127L19210
$$ 7469136 7692939 7927130 8171599 8427245 8694209 8971274 9259053 9561180 9880390
55945I880390L35871L52510L72028L93939M15399M37341M63547M94082N25604
$$ 9880390 10216261 10568771 10940799 11334738 11750137 12187478 12651025 13145107 13670711
55936A3670711N57513N91591O26536O59685O93260P31714P73709Q14499Q55322
$$ 13670711 14228224 14819815 15446351 16106036 16799296 17531010 18304719 19119218 19974540
55927A9974540R02076R55136J009435J064399J124557J190395J258358J330189
$$ 19974540 20876616 21831752 22841187 23905586 25030143 26220538 27478896 28809085
55919B8809085J411993J503773J600843J706368J830959J978484K143807K325362
$$ 28809085 30221078 31724851 33325694 35032062 36863021 38841505 40985312 43310674
55911D3310674K526949K745727K973207L211945L478292L786078M141725M557400
$$ 43310674 45837623 48583350 51556557 54768502 58246794 62032872 66174597 70731997
55903G0731997N052835N641179O329800P137348Q090549R200784J0464350J1887764
$$ 70731997 75784832 81426011 87755811 94893159 102983708 112184492 122648842 134536606
55895A34536606J3488402J5268191J7214177J9321199K1569624K3872719K6082752
$$ 134536606 148025008 163293199 180507376 199828575 221398199 245270918 271353670
55888B71353670K8011418K9296802K9182118K6613701K0878795J2321419K391315
$$ 271353670 299365088 328661890 357844008 384457709 405336504 417657923 420049238
55881D20049238p100887j4851120k0379443k3802816k5501150k5926435k5495479
$$ 420049238 412948351 398097231 377717788 353914972 328413822 302487387 276991908
55874B76991908k4505638k3127126k1474758j9663499j7801979j5976150j4256023
$$ 276991908 252486270 229359144 207884386 188220887 170418908 154442758 140186735
55867A40186735j2694369j1308744j0084917r006528q067291p254499o542800
$$ 140186735 127492366 116183622 106098705 97092177 89024886 81770387 75227587
55860G5227587n911706n353566m859725m414573m008684l643516l317660l021026
$$ 75227587 69315881 63962315 59102590 54688017 50679333 47035817 43718157 40697131
55852D0697131k747455k500953k284191k091516j918055j765378j633118j514094
$$ 40697131 37949676 35448723 33164532 31073016 29154961 27389583 25756465 24242371
55844B4242371j402677j300228j208186j123272j042966r68649r00107q33913
$$ 24242371 22839694 21539466 20331280 19208008 18165042 17196393 16296286 15462373
55836A5462373p70114p13730o66632o24288n83082n44674n10592m78718m47511
$$ 15462373 14692259 13978529 13311897 12687609 12104527 11559853 11049261 10570543 10123032
55827A0123032m18044l89839l60305l30064l02875k78656k52790k24165j97567
$$ 10123032 9704988 9315149 8954844 8624780 8321905 8043249 7790459 7566294 7368727
55818G368727j76009j57083j39384j26400j20965j21569j27107j39725j59498
$$ 7368727 7192718 7035635 6896251 6769851 6648886 6527317 6400210 6260485 6100987
55809F100987j81196j99657k14239k25311k31019k30562k26528k20908k12459
$$ 6100987 5919791 5720134 5505895 5280584 5049565 4819003 4592475 4371567 4159108
55800D159108k00521j87615j75780j64000j51650j40734j32310j24287j15094
$$ 4159108 3958587 3770972 3595192 3431192 3279542 3138808 3006498 2882211 2767117
55791B767117j06133r8493r0867q2862p6633p3015o9493o4282n8876n4496m9729
$$ 2767117 2660984 2562491 2471624 2388762 2312129 2239114 2169621 2105339 2046463 1991967 1942238
55780A942238m4022l9751l8298l7483l5473l3696l3287l2321k9534k7477k8567
$$ 1942238 1898216 1858465 1820167 1782684 1747211 1713515 1680228 1647907 1618373 1590896 1562329
55769A562329l0892l1142k9286k7210k5205k2881k1460k2079k3448k3818k3563
$$ 1562329 1531437 1500295 1471009 1443799 1418594 1395713 1374253 1352174 1328726 1304908 1281345
55758A281345k3596k3162k1597k0247k0248k0245j8617j6201j4547j3299j1605
$$ 1281345 1257749 1234587 1212990 1192743 1172495 1152250 1133633 1117432 1102885 1089586 1077981
55747A077981j0249j0086j0051q919p397o360m863k181J1k5j263j762j765k489
$$ 1077981 1067732 1057646 1047595 1038676 1031279 1024919 1020056 1017875 1017886 1017861 1016598 1014836 1013071 1010582
55733A010582l433l591m001o241r302j0723j0299j0142j1355j2924j3831j4269
$$ 1010582 1007149 1003558 999557 993316 984014 973291 962992 952850 941495 928571 914740 900471
55721I00471j4544j4431j3945j3665j4003j4658j4854j3991j2452j1450j1311
$$ 900471 885927 871496 857551 843886 829883 815225 800371 786380 773928 762478 751167
55710G51167j0440p553m313l511m878n527m655m636o560q147p654o620o786p284
$$ 751167 740727 733174 728861 725350 720472 714945 710290 705654 699094 690947 683293 676673 669887 662603
55696F62603p270q405j1873j5325j5954j4770j4692j5792j5694j3657j1345r884
$$ 662603 655333 646928 635055 619730 603776 589006 574314 558522 542828 529171 517826 507942
55684E07942q722p190n377l809l491n283q011q723o468l980l778m480l479j309
$$ 507942 499220 492030 486653 482844 479353 474070 466059 457336 450868 446888 443110 438630 435151 433842
55670D33842l75q05j026j459l971p821r671q181n779n091n834o141n104l202j444
$$ 433842 433467 432662 431636 430177 426206 418385 408714 400533 394754 389663 383829 377688 372584 369382 367938
55655C67938o51p61o99K29J349J834K147K912L179J525j647m441n758n801m971
$$ 367938 367287 366526 365827 366056 367405 369239 371386 374298 377477 379002 377355 372914 367156 361355 356384
55640C56384l756l179l744m532m741n269p061q881q790p110n678m702k862l31
$$ 356384 352628 349449 345705 341173 336432 331163 324102 315221 306431 299321 293643 288941 286079 285748
55626B85748Q47l09k482m091m671m005j926N17J485N23r85j863k217k326k091
$$ 285748 286595 286286 283804 279713 275042 271037 269111 269628 271113 271636 270651 268788 266571 264245 262154
55611B62154j877k420l416l612k597j278l97P7Nr08j838j324N47J907J647Q08
$$ 262154 260277 257857 254441 250829 248232 246954 246557 246634 246639 245731 243893 242569 243116 245023 246670 247478
55595B47478Q35J846L217M550N329M883L534K609K444J598r09l599m108k225p2
$$ 247478 248313 250159 253376 257926 263255 268138 271672 274281 276725 278323 277414 273815 269707 267482 267410
55580B67410M48o64k290l628m442m574l922k852k254k780m145n424o054o117n644
$$ 267410 267858 267194 264904 261276 256834 252260 248338 245486 243232 240452 236307 230883 224829 218712 213068
55565B13068m383k572j335j636l189m804n485m839l086j205m84j143j931j683
$$ 213068 208685 206113 204778 203142 199953 195149 189664 184825 181739 180534 180050 178907 176976 175293
55551A75293p56k58m88r74j426j648j135J28Q78j87k560m307m218k683o84R86
$$ 175293 174537 174279 173791 172817 171391 169743 168608 168736 169614 169427 166867 162560 158342 155659 154975 155961
55535A55961J745J458P71M08J94m95j494j911j364m13J75L4o61j152n91P60J449
$$ 155961 157706 159164 159935 160343 160537 160042 158548 156637 155273 154860 155035 155069 154408 153256 152665 153425 154874
55518A54874P13k83o8R22J176O05O35J815K929K805J799R90Q70J254J676J470
$$ 154874 155587 155304 155236 156158 157334 157939 158574 160389 163318 166123 167922 168912 169782 171036 172712 174182
55502A74182J48j834l150k900j661r51j672l079l546k466j091r07j655j955j538
$$ 174182 174330 172496 169346 166446 164785 163834 162162 159083 155537 153071 151980 151073 149418 147463 145925
55487A45925j304j233l06J001M78k274m269k949K56K298K734K974K834R85j743
$$ 145925 144621 143388 143082 144083 144561 142287 138018 135069 135325 137623 140357 143331 146165 147150 145407
55472A45407k735j411Q9L56K49N08M10l07m37N67J322N40j171k461k961k924k440
$$ 145407 142672 141261 141350 141706 141955 142463 142873 142566 142129 142696 144018 144558 143387 140926 137965 135041 132601
55455A32601j894k093l180m361n211o048o538n366k259R06K067J244J5m54q6O48
$$ 132601 130707 128614 125434 121073 115862 109814 103276 97910 95651 96557 98624 99868 99883 99429 99343 99991
55439I9991J093Q42L90Q07K167L010K111K83l34J338M091N555M429J683n47j302
$$ 99991 101084 101926 102316 103123 105290 108300 110411 110694 110360 111698 115789 121344 125773 127456 126909 125607
55423A25607j574k478l515l538k665j993j818j541j073r38j077q72l75k29l98
$$ 125607 124033 121555 118040 114502 111837 109844 108026 106485 105412 104474 103397 102525 102150 101921 101523
55408A01523k89r6n53j331j260k53N17N80O78J030Q21m5l69M13J240J130N27J78
$$ 101523 101234 101138 100585 99254 97994 97741 98258 98838 99516 100546 101367 101322 100953 101366 102606 103736 104263 104441
55390A04441mk12j49Q2k36j024j030K56J592J744J164R73J292J524J402R47J75
$$ 104441 104437 104225 104076 104158 103922 102898 101868 102124 103716 105460 106624 107597 108889 110413 111815 112762 112937
55373A12937m42j21J015J780J470N51m31j331j450J37K598L519K147P29J342L048
$$ 112937 112495 112374 113389 115169 116639 117190 116759 115428 113978 114115 116713 120232 122379 123108 124450 127498
55357A27498L730L207K664K250J404O18P71J187M17j261j997j116r5n00k148l594
$$ 127498 131228 134435 137099 139349 140753 141371 142142 143329 143746 142485 140488 139372 139277 138777 136629 133035
55341A33035l564j965q7L56q66k071j830p99l62m04P0P04J22j698l048k803j626
$$ 133035 129471 127506 127419 127775 126909 124838 123008 122209 121847 121443 121513 122217 122339 120641 117593 114790 113164
55324A13164n71J52N54L15m37p89j28J007J763K019K054J753P96m94j136m33J166
$$ 113164 112593 112745 113299 113614 113177 112388 112260 113267 115030 117049 119103 120856 121652 121158 120022 119589 120755
55307A20755K287J844Q6j729k753l241l648l643k645r26N02J070J059R77J060
$$ 120755 123042 124886 124972 123243 120490 117249 113601 109958 107313 106387 106889 107959 109018 109995 111055
55292A11055J393J956K425K354J692P39l98j859l408m165l372j329P22J709J589
$$ 111055 112448 114404 116829 119183 120875 121614 121216 119357 115949 111784 108412 107083 107805 109514 111103
55277A11103J037N63K32J09L45O54L00r07k154k720k917l201k977j515L84J066
$$ 111103 112140 112703 112935 113044 113389 114043 114343 113436 111282 108562 105645 102444 99467 97952 98336 99402
55261I9402M21P3Q97J829J726J096J002J350J401J245J570K315K564J809O55J56
$$ 99402 99823 99896 100793 102622 104348 105444 106446 107796 109197 110442 112012 114327 116891 118700 119355 119511
55245A19511O42J201M64j752l861m184k987j942j793j764j234n14K30J325K358
$$ 119511 120153 121354 121818 120066 116205 112021 109034 107092 105299 103535 102301 101787 102017 103342 105700
55230A05700K123N86n85l33L21J54l44j61L69M21L21P67J244Q34kMR26J646J518
$$ 105700 107823 108409 107824 107491 107812 107966 107622 107461 107830 108251 108572 109339 110583 111417 111415 111419 112345 113991 115509
55211A15509P94l06j598k382k082j353j286j811j898j169j04R96K065K504J753
$$ 115509 116303 115997 114399 112017 109935 108582 107296 105485 103587 102418 102314 103310 105375 107879 109632
55196A09632N99N02J499K084J397L20l8J61J69n2J05Q61J659J716Q63j64m64j76
$$ 109632 110231 110733 112232 114316 115713 116033 115995 116156 116325 116273 116378 117239 118898 120614 121477 121313 120849 120673
55178A20673m26j603k369j297R70K289J687L47k14j2j5n26q35l73M02N73k8o32
$$ 120673 120247 118644 116275 114978 115948 118237 119924 120271 120057 120045 120030 119504 118669 118296 118698 119271 119243 118611
55160A18611p55r13j561j881q07R96J731J168J080K267K895J165j707k894j646
$$ 118611 117856 116943 115382 113501 112694 113690 115421 116589 117669 119936 122831 123996 122289 119395 117749
55145A17749J58P84N19O23J485K207J627k41j833j672l18K98l21p05r6J62r68
$$ 117749 117907 118691 119210 119833 121318 123525 125152 124911 123078 121406 121088 121386 121065 120360 120264 120426 119458
55128A19458k198j896n45M13P52P08l46k335l118j217J370J851R56J375K855K668
$$ 119458 117260 115364 114819 115232 115984 116692 116346 114011 110893 109676 111046 112897 113853 115228 118083 120751
55112A20751O95p8J207J666k91k075j220O29P37k98r3J315J862J110O51J334K301
$$ 120751 121446 121368 122575 124241 123950 121875 120655 121284 122021 121723 121630 122945 124807 125917 126568 127902 130203
55095A30203K681K369J292m10j667j520p41q90j909k263j539j134j792k110o39
$$ 130203 132884 135253 136545 136135 134468 132948 132207 131317 129408 127145 125606 124472 122680 120570 119931
55080A19931J631K215L42j991k461r93O14J118J038J418K279K737K137N87j258
$$ 119931 121562 123777 124119 122128 119667 118674 119288 120406 121444 122862 125141 127878 130015 130602 129344
55065A29344k403k018l52J181J416O29k65j009j734k079j771j524j998k261q64
$$ 129344 126941 124923 124571 125752 127168 127797 127532 126523 124789 122710 120939 119415 117417 115156 114292
55050A14292J666L246L146K705K753K321P80m76R7J871K944K596J691J225J555
$$ 114292 115958 119204 122350 125055 127808 130129 130909 130433 130530 132401 135345 137941 139632 140857 142412
55035A42412K521L410L176J570k07o81K73J410J428n0k410m456n229m727l655
$$ 142412 144933 148343 151519 153089 152882 152201 152474 153884 155312 155262 152852 148396 143167 138440 134785
55020A34785k493j335m71k66l93j30M58N99K42K40P95J021N72L67R22J324Q26
$$ 134785 132292 130957 130486 130220 129827 129697 130155 130754 130996 131236 132031 133052 133624 133991 134913 136237 137063
55003A37063K51N59J051M52r26j645j427j513k642l853l696j939K27J375J168
$$ 137063 137314 137873 138924 139376 138450 136805 135378 133865 131223 127370 123674 121735 121962 123337 124505
54988A24505N84P13J366J394L76p26q24J43J588K888L246K023r9j308p69K69L39
$$ 124505 125089 125802 127168 128562 128938 128212 127388 127531 129119 132007 135253 137276 137177 135869 135100 135369 135708
54971A35708k95n81o41j333k321k175m32J537K074R17p60j480o26J114K481L006
$$ 135708 135413 134832 134191 132858 130537 128362 127930 129467 131541 132458 131698 130218 129592 130706 133187 136193
54955A36193L221L489L273K123N85n66j318j903j934r53N93J808K412K630K442
$$ 136193 139414 142903 146176 148299 148884 148318 147000 145097 143163 142210 142803 144611 147023 149653 152095
54940A52095J746Q89K56l13r31j034j78J029J697J922K283K533J920N70o10j252
$$ 152095 153841 154730 154986 154673 153742 152708 152530 153559 155256 157178 159461 161994 163914 164484 163874 162622
54924A62622j702j977j711j075o99m64M23J951K915K435J046j21n04j24Q26J813
$$ 162622 160920 158943 157232 156157 155458 154994 155417 157368 160283 162718 163764 163643 163139 163015 163841 165654
54908A65654J968R21n12r76MJ528K213J584M36j84j47l9P8Q61K413L622L454K398
$$ 165654 167622 168543 168031 167055 167059 168587 170800 172384 172820 172636 172489 172450 172528 173389 175802 179424 182878 185276
54890A85276J768J886J832R39j99n42LL16o82k589l679k869j142j81O6J064K884
$$ 185276 187044 188930 190762 191701 191502 190960 190963 191279 190597 188008 184329 181460 180318 180137 180203 181267 184151
54873A84151L506J734p60j592n53R66K291L517M207L962L833N182P364Q339P565
$$ 184151 187657 189391 188631 187039 186486 187452 189743 193260 197467 201429 205262 210444 217808 226147 233712
54858B33712O575O632P464Q466R396R506P621L824j95l054m839o082o816p179
$$ 233712 240287 246919 254383 262849 272245 281751 289372 293196 293001 289947 285108 279026 272210 265031
54844B65031p616q036p788o969o520o591o132m707l288k558j815n40L38p5r78
$$ 265031 257415 249379 241591 234622 228102 221511 215379 210672 207384 204826 203011 202471 202809 202734 201756
54829B01756j036k53N04J056J661J929J362N66O26J627K855M098N579O918P390
$$ 201756 200720 200467 200971 202027 203688 205617 206979 207545 208171 209798 212653 216751 222330 229248 236638
54814B36638P094O834O968P228P355O924N074J715j393k260j309r06k128l733
$$ 236638 243732 250566 257534 264762 272117 279041 284115 285830 284437 282177 280868 279962 277834 274101
54800B74101m627n497p076q408q230o975o048n850n821n875o310o635n900m246
$$ 274101 269474 263977 256901 248493 240263 233288 227240 221390 215569 209694 203384 196749 190849 186603
54786A86603k961k790l148l166k610j580k91O05M04m88p25K11J166R92J49j60
$$ 186603 183642 180852 177704 174538 171928 170348 170057 170662 171066 170578 169853 170064 171230 172222 172371 172211
54770A72211J74L34J26J09L11J1q82j313n14P78J169J78j474k771l053k157m89
$$ 172211 172385 172719 172845 172954 173265 173276 172394 171081 170567 171345 172514 172692 171218 168447 165394 163237 162748
54753A62748J083J870J875J490R26K83p5K12P87P04m49j848k205j207J71Q47P53
$$ 162748 163831 165701 167576 169066 169992 170275 170200 170412 171199 171903 171454 169606 167401 166194 166365 167212 167965
54736A67965N56O06O48M84K48Jl26l93M06J847K696K241J271P78M44m54j259o13
$$ 167965 168521 169127 169775 170259 170507 170508 170182 169789 170195 172042 174738 176979 178250 179028 179472 179018 177759 177146
54718A77146J347L016L619L957M588M874M407L947M036M070L713M089O280R393
$$ 177146 178493 181509 185128 189085 193673 198547 202954 206901 210937 215007 218720 222809 229089 238482
54704B38482J1377J1257R613P431N489M329L871L373K452J565Q21o85l307n550
$$ 238482 249859 261116 270729 278160 283649 287978 291849 295222 297674 299239 300060 299375 296068 290518
54690B90518n863m949m793n653n842m446k645j933k358k996l199k892k366k031
$$ 290518 284655 279706 274913 269260 263418 258972 256327 254394 252036 249040 245841 242949 240583 238552
54676B38552j924j590r20o05r29p65R15L085L868L405L574M863N715N424N401
$$ 238552 236628 235038 234118 233513 232584 231819 232734 235819 239687 243092 246666 251529 257244 262668 268069
54661B68069O430O795M909K330J933L866N277L987P58k250l887m521n076o088
$$ 268069 274499 281294 286203 288533 290466 294332 299609 303596 304354 302104 298217 293696 288620 282532
54647B82532p219p547o662n391m912n358n813n694n318n017m351k784o64R89J637
$$ 282532 275313 267766 261104 255713 250801 245443 239630 233936 228618 223601 219250 216466 215802 216791 218428
54632B18428J599J152j11k459m880n673m421k618j777j686j300o21n68j259j835
$$ 218428 220027 221179 221068 218609 213729 208056 203635 201017 199240 197554 196254 195633 195065 193806 191971
54617A91971j922k030k181j544J9J217J063L68M55J090R19l34j355j127l24l60
$$ 191971 190049 188019 185838 184294 184313 185530 186593 186961 187416 188506 189425 189091 187736 186609 186285 185925
54601A85925j432k197j357P73K654L362L462L633L215J140j972l966l664k129
$$ 185925 184493 182296 180939 181712 184366 187728 191190 194823 198038 199178 197206 193240 189576 187447
54587A87447r28k87L41R28J171J374J996K632K422J228l69j779k400j493P52K465
$$ 187447 186519 186232 186573 187501 188672 190046 192042 194674 197096 198324 197955 196176 193776 192283 193035 195500
54571A95500J844m07j728r65K81P5j357k277j641K22K369L686L219J121q89j085
$$ 195500 197344 196937 195209 194244 194525 194600 193243 190966 189325 189547 191916 195602 198821 199942 199053 197968
54555A97968L16J572J826J966K800L407K246n91l195l859k670r72J61P42J379
$$ 197968 198284 199856 201682 203648 206448 209855 212101 211510 208315 204456 201786 200814 200975 201717 203096
54540B03096K271K763K092N75l97M1J101J415Q70N75J098J772J879J605J385J200
$$ 203096 205367 208130 210222 210797 210400 210441 211542 212957 213827 214402 215500 217272 219151 220756 222141 223341
54524B23341R05O25L29k49q80q21P5J084J879K923L944L472J178o99j09J626J530
$$ 223341 224246 224871 225200 224951 224071 223250 223325 224409 226288 229211 233155 236627 237805 237106 236997 238623 240153
54507B40153o37k053r44J266K564K857K846K205M28j631k527j954o18J003K746
$$ 240153 239516 237463 236519 237785 240349 243206 246052 248257 248685 247054 244527 242573 241955 242958 245704
54492B45704L961L711J882l90j501o32J494L224L760M070N239O382N599K992J001
$$ 245704 249665 253376 255258 254868 253367 252735 254229 257453 261213 265283 270522 276904 282503 285495 286496
54477B86496J238K544L005K394J595Q88J72j70M0m6j096k166j777k0J602K145
$$ 286496 287734 290278 293283 295677 297272 298160 298332 298162 298202 298156 297060 294894 293117 293097 294699 296844
54461B96844J934J560J207Q42L47m87j529k256k505k641k553j502L18J308O18
$$ 296844 298778 300338 301545 302387 302734 302247 300718 298462 295957 293316 290763 289261 289579 290887 291505
54446B91505l63j32N32J0j339j851j437j401j665p12J506K996K741K120K421K956
$$ 291505 291142 291010 291542 291552 290213 288362 286925 285524 283859 283147 284653 287649 290390 292510 294931 297887
54430B97887K793K499K742K717J628N65J060K626L422K932K310K328K561K669
$$ 297887 300680 303179 305921 308638 310266 310831 311891 314517 317939 320871 323181 325509 328070 330739
54416C30739L054L842M346M085L468L004K587K054J857K472L455L750K970J828
$$ 330739 333793 337635 341981 346066 349534 352538 355125 357179 359036 361508 364963 368713 371683 373511
54402C73511J231J256J262P12l29j350j693q54J088L161M048L165J001j606l987
$$ 373511 374742 375998 377260 377972 377643 376293 374600 373746 374834 377995 382043 385208 386209 384603 380616
54387C80616n399n152l641k531k922l793l296j380J38J23n99r24j136k046l328
$$ 380616 375217 370065 366424 363893 360971 357178 353882 352502 352640 352763 352164 351240 350104 348058 344730
54372C44730l799k992j546k77M18L73l51j211j432p52L01Q94M85q58k390l019
$$ 344730 340931 337939 336393 336116 336534 336907 336556 335345 333913 333161 333462 334356 334841 333983 331593 328574
54356C28574k219o84K16r0o58p9J784L377L036Q84j183j529m44M63J99p95j527
$$ 328574 326355 325671 325887 325797 325139 325060 326844 330221 333257 334141 332958 331429 330985 331448 331647 330852 329325
54339C29325j511p79M86J919K869K791J800O47J25M40J022J087M80j26j64pm48
$$ 329325 327814 327035 327521 329440 332309 335100 336900 337547 337672 338112 339134 340221 340701 340575 340411 340404 339956
54322C39956j511k413k643k388j834p77O65J647J491N82j43l26l10m27n60l44
$$ 339956 338445 336032 333389 331001 329167 328390 329055 330702 332193 332775 332632 332306 331996 331569 331009 330665
54306C30665L86J235J245k40k469l611k670n45J222K199K826K978J884n25l178
$$ 330665 331051 332286 333531 333291 330822 327211 324541 323996 325218 327417 330243 333221 335105 334580 331402
54291C31402m889n205m256k637j533j997l617m732m419l556l278l179k002L06
$$ 331402 326513 321308 317052 314415 312882 310885 307268 302536 298117 294561 291283 288104 286102 286408
54277B86408K197K212L75k076l747l874k705j271l99Q0P40J375J036n99k616l849
$$ 286408 288605 290817 291192 289116 285369 281495 278790 277519 277120 277200 277940 279315 280351 279752 277136 273287
54261B73287l965l265k056o14O31J388J680J482N83q16j850j855j101k49N68J455
$$ 273287 269322 266057 264001 263387 264018 265406 267086 268568 269151 268335 266485 264630 263529 263280 263848 265303
54245B65303J986J552M01m54m15J91Q04J112P55o17k610l884l297j083J325K477
$$ 265303 267289 268841 269242 268788 268373 268564 269368 270480 271235 270618 268008 264124 260827 259744 261069 263546
54229B63546J906K72j220j766j421p12J1M98L77m14j162j136q13j344k698l332
$$ 263546 265452 265724 264504 262738 261317 260605 260616 261114 261491 261077 259915 258779 257966 256622 253924 250592
54213B50592k248m57K89l32j206j509j436j339r45J42J596K449K051Q48m5j16
$$ 250592 248344 247887 248176 247844 246638 245129 243693 242354 241409 241551 243147 245596 247647 248495 248450 248334
54197B48334n1o18j312q28J005K732K986J995Q88K04k62o89j092j574k075k157
$$ 248334 248283 247665 246353 245525 246530 249262 252248 254243 255131 255335 255073 254384 253292 251718 249643 247486
54181B47486j631j122j267j626j135L08J481J207l82k167l234l485l264k783k085
$$ 247486 245855 244733 243466 241840 240705 241013 242494 243701 243319 241152 237918 234433 231169 228386 226301
54166B26301j424j203j242o00J221L136L514K272R13K99l08j468k196j495k02
$$ 226301 224877 223674 222432 221832 223053 226189 229703 231975 232888 233187 232879 231411 229215 227720 227518
54151B27518O2p34j118l39P73J199Q52J61n52r67p97k07K51L43L69O26J024J217
$$ 227518 227580 226846 225728 225389 226162 227361 228213 228374 227822 226855 226058 225851 226102 226445 226814 227440 228464 229681
54133B29681R12Q1q38j299j387j793k672l128k391r39J64N67N36J50n48j048q93
$$ 229681 230593 230674 229836 228537 227150 225357 222685 219557 217166 216227 216391 216958 217494 217644 217096 216048 215155
54116B15155m07j43m2J40J39j21J55J493K901K988J898P68k06j580k929l065k037
$$ 215155 214748 214605 214563 214703 214842 214721 214876 216369 219270 222258 224156 224924 224718 223138 220209 217144 215107
54099B15107j159q74k68J082K397L168L602L242J072k249m071k924n19N87J08
$$ 215107 213948 213074 212806 213888 216285 219453 223055 226297 227369 225120 221049 218125 217606 218193 218301
54084B18301l66J93J511K779L002J414j275k777j652P81J934Q86j191k785l123
$$ 218301 217935 218128 219639 222418 225420 226834 225559 222782 221130 221911 223845 224731 223540 220755 217632
54069B17632k007Q1J936K666K600K447K043R64j63j87Q25J606J511J285J758K673
$$ 217632 215625 215706 217642 220308 222908 225355 227398 228362 228199 228012 228837 230443 231954 233239 234997 237670
54053B37670L120K580J250k60j375j895j930j516o62N4l17j793k888k235l30J223
$$ 237670 240790 243370 244620 244360 242985 241090 239160 237644 236982 237036 236719 234926 232038 229803 229473 230696
54037B30696J868K433L350L737K767J081Q2J91M62p1j216k005j906j167n3J562
$$ 230696 232564 234997 238347 242084 244851 245932 246014 246205 246667 246596 245380 243375 241469 240302 240249 241811
54021B41811L487M731M476L155J750L54j353k519j566J299L643L657K244J341
$$ 241811 245298 250029 254505 257660 259410 259764 258411 255892 254326 255625 259268 262925 265169 266510
54007B66510J376J546J546J546J225L74p8Q18K177K116M41r80p83L54J113J219
$$ 266510 267886 269432 270978 272524 273749 274123 274045 274863 277040 279156 279597 278617 277834 278188 279301 280520
53991B80520J098Q55M05P5L38J242K520L986N535O800P207O475N190M721N971
$$ 280520 281618 282473 282878 282953 283291 284533 287053 291039 296574 303374 310581 317056 322246 326967 332938
53976C32938Q042Q846P654O275O782Q700R688Q779P450P300Q118Q764Q890Q831
$$ 332938 340980 349826 357480 363755 370537 379237 388925 397704 405154 412454 420572 429336 438226 447057
53962D47057Q736Q730R332J0662J1544J0534P981O042O144P124O608L787m3l614
$$ 447057 455793 464523 473855 484517 496061 506595 514576 520618 526762 533886 540494 544281 544238 540624
53948E40624p049j0558j2940j2808j0792r013q293p478o000n379p014r701j0893
$$ 540624 533575 523017 510077 497269 486477 477464 469171 461693 455693 450314 443300 433599 422706
53935D22706r817p957o836o584o586o264n207l557k321k445l561m453m605m405
$$ 422706 412889 404932 398096 391512 384926 378662 373455 369898 367577 365132 361571 357118 352513 348108
53921C48108m035l308k564k559l188l433k774j821j242r40n86q8O89J796K641
$$ 348108 344073 340765 338201 335642 332454 329021 326247 324426 323184 322244 321658 321570 322259 324055 326696
53906C26696K481J673J378J698J328l70k085k178p78P29J582K065K455K593K367
$$ 326696 329177 330850 332228 333926 335254 334884 332799 330621 329843 330572 332154 334219 336674 339267 341634
53891C41634K088K306L439N207O370N719L782K726L883O003O813N721M146L562
$$ 341634 343722 346028 349467 354674 361044 366763 370545 373271 377154 383157 389970 395691 399837 403399
53877D03399M285N930P892R210Q935P159N159M122M079M349M539M711M798M458
$$ 403399 407684 413614 421506 430716 439651 446810 451969 456091 460170 464519 469058 473769 478567 483025
53863D83025L672L163L808N543P182P600O912O170O092O530P129P808Q452Q816
$$ 483025 486697 489860 493668 499211 506393 513993 520905 527075 533167 539697 546826 554634 563086 571902
53849E71902Q994R393R900R738Q682P739P733P797O382L623J540J570K862L496
$$ 571902 580896 590289 600189 609927 618609 626348 634081 641878 648260 651883 653423 654993 657855 661351
53835F61351K591O10j697l746m892m866m535n307p413r400r800q763p542o882
$$ 661351 663942 664552 662855 659109 654217 649351 644816 639509 632096 622696 612896 604133 596591 589709
53821E89709o705o979p882r062r647r294q458p467o159m814m487n524o605o258
$$ 589709 583004 576025 568143 559081 549434 540140 531682 524215 518056 513242 508755 503231 496626 490368
53807D90368m814l765l491k856j067J195K775L247K869K162J964L045N133O785
$$ 490368 485554 481789 478298 475442 474375 475570 478345 481592 484461 486623 488587 491632 496765 503550
53793E03550O677M715J623j962n547q401r821r828r274r118r497r537q364o471
$$ 503550 510227 514942 516565 514603 509056 500655 490834 481006 471732 462614 453117 443580 435216 428745
53779D28745n511o293p529p461o280n672o136o246m853k684j119n81q37j790k955
$$ 428745 423234 416941 409412 401951 395671 389999 383863 377617 372764 370080 368961 368380 367543 365753 362798
53764C62798l112j608N40J726J531O32l23q68m87O73J412R81M74J394L221L979
$$ 362798 359686 358078 358618 360344 361875 362507 362184 361316 360829 361502 362914 363895 364369 365763 368984 372963
53748C72963L099K142K426L426M114M463M908N313N424N545O011O599P187Q162
$$ 372963 376062 378204 380630 384056 388170 392633 397541 402854 408278 413823 419834 426433 433620 441782
53734D41782R381R462P363M264K651L428N048N662N169M676M742M911M588L646
$$ 441782 451163 460625 467988 472252 474903 478331 483379 489041 494210 498886 503628 508539 513127 516773
53720E16773K202L45j769l743n087n576n445n199n136n078m718m221m130m622
$$ 516773 518975 519320 517551 513808 508721 503145 497700 492501 487365 482287 477569 473348 469218 464596
53706D64596n158n137m689m463m710n032m969m504l865l124k254j369p73p84j523
$$ 464596 459438 454301 449612 445149 440439 435407 430438 425934 422069 418945 416691 415322 414549 413765 412242
53691D12242k761l996m905n629o302o412n317l396k041k003k406j946o22M84O84
$$ 412242 409481 405485 400580 394951 388649 382237 376920 373524 371483 369480 367074 365128 364506 364990 365674
53676C65674J70o76j526j776r42M83J402J498J416J404Q61k82q03K80K041K657
$$ 365674 365844 365168 363642 361866 360924 361407 362809 364307 365723 367127 367988 367706 366903 367183 369224 371881
53660C71881J785R41J405K635L060K058O61L38J286K160J653J71n21O26K803M505
$$ 371881 373666 374607 376012 378647 381707 383765 384426 384764 386050 388210 389863 390034 389513 390139 392942 397447
53644C97447N178N245N029M348L094J642O80Q27K126L664M167L562L380M827O808
$$ 397447 402625 407870 412899 417247 420341 421983 422663 423490 425616 429280 433447 437009 440389 445216 452024
53629D52024P004M918K572J826K157J913R22N54J431K364K001P47K95J455L127
$$ 452024 459028 463946 466518 468344 470501 472414 473336 473890 475321 477685 479686 480433 480728 482183 485310
53614D85310L509J978m26k134k380j565o13j19OJ23J55l97j600k526k150p30L29
$$ 485310 488819 490797 490371 488237 485857 484292 483679 483560 483566 483689 483844 483447 481847 479321 477171 476441 476770
53597D76770K21k92j18N46N65m48j551j651o56O53J388J164L70M7R54K495L101
$$ 476770 476991 476699 476581 477127 477692 477244 475693 474042 473386 474039 475427 476591 476961 477008 477962 480457 483558
53580D83558K022K76o49o09n94j013j165n31K71M79M54J113K370L044K431J183
$$ 483558 485580 485856 485207 484598 484004 482991 481826 481295 481566 482045 482499 483612 485982 489026 491457 492640
53564D92640L50K15N09J181K240L259L650L395L005K943L446M622O094O932O678
$$ 492640 492990 493205 493714 494895 497135 500394 504044 507439 510444 513387 516833 521455 527549 534481 541159
53549E41159O157O393O957O577N331M693N057M858L099J265J284K609L071K126
$$ 541159 547316 553709 560666 567243 572574 577267 582324 587182 590281 591546 592830 595439 598510 600636
53535F00636J373J975L247M046M037L140J282n90o25J596L854L607J007j465k019
$$ 600636 602009 603984 607231 611277 615314 618454 619736 619146 618521 620117 623971 627578 628585 627120 625101
53520F25101j113k75m01j360k445k952k771k440k334k041j080R2N93L88J99J93
$$ 625101 623988 623713 623312 621952 619507 616555 613784 611344 609010 606969 605889 605981 606574 606962 607161 607354
53504F07354j09n42r8J445K771K747K054K102K946L459L180K865L140L576L400
$$ 607354 607245 606703 606605 608050 610821 613568 615622 617724 620670 624129 627309 630174 633314 636890 640290
53489F40290K432J270J017K669N941Q874R590Q505P763Q364R137Q967Q625R385
$$ 640290 642722 643992 645009 647678 653619 662493 672083 680588 688351 696715 705852 714819 723444 732829
53475G32829J0985J2252J3037J4189J5913J7572J9009K0831K3173K5170K6038
$$ 732829 743814 756066 769103 783292 799205 816777 835786 856617 879790 904960 930998
53464I30998K5970K5689K5763K6519K8090L0275L2657L4902L6701L7731L8222
$$ 930998 956968 982657 1008420 1034939 1063029 1093304 1125961 1160863 1197564 1235295 1273517
53453A273517L9201M1451M4366M6663M7941M8648M8850M8258M7515M7984M9823
$$ 1273517 1312718 1354169 1398535 1445198 1493139 1541787 1590637 1638895 1686410 1734394 1784217
53442A784217N1526N1886N1285N0526M9670M8853M8970N0305N1457N1048M9804
$$ 1784217 1835743 1887629 1938914 1989440 2039110 2087963 2136933 2187238 2238695 2289743 2339547
53431B339547M9449M9879M9089M6083M2425M0264L9737L9035L6712L3329L0888
$$ 2339547 2388996 2438875 2487964 2534047 2576472 2616736 2656473 2695508 2732220 2765549 2796437
53420B796437L0746L2114L2713L1040K7763K4792K3351K3125K2778K0731J6007
$$ 2796437 2827183 2859297 2892010 2923050 2950813 2975605 2998956 3022081 3044859 3065590 3081597
53409C081597R183K372k525n616q577j2548j7130k1416k5119k8263l0497l1436
$$ 3081597 3090780 3093152 3090627 3085011 3076434 3063886 3046756 3025340 3000221 2971958 2941461 2910025
53397B910025l1670l2770l5859m0269m3996m5716m6074m6562m7437m7562m6296
$$ 2910025 2878355 2845585 2809726 2769457 2725461 2679745 2633671 2587109 2539672 2492110 2445814
53386B445814m4565m3568m3195m2483m1039l9290l7647l6155l4665l2788k9846
$$ 2445814 2401249 2357681 2314486 2272003 2230964 2191674 2154027 2117872 2083207 2050419 2020573
53375B020573k5594k0763j6383j2687r242n786k318J326N205Q842J1841J4774
$$ 2020573 1994979 1974216 1957833 1945146 1935904 1930118 1927800 1929126 1934331 1943173 1955014 1969788
53363A969788J8593K3199K7471L0815L3928L7764M2350M6857N0327N2315N3294
$$ 1969788 1988381 2011580 2039051 2069866 2103794 2141558 2183908 2230765 2281092 2333407 2386701
53352B386701N4498N6856O0124O3474O6743P0443P4683P8944Q2902Q6660R0080
$$ 2386701 2441199 2498055 2558179 2621653 2688396 2758839 2833522 2912466 2995368 3082028 3172108
53341C172108R2730R4730R6806R9381J02325J05720J09838J14017J16644J16999
$$ 3172108 3264838 3359568 3456374 3555755 3658080 3763800 3873638 3987655 4104299 4221298
53331D221298J16295J16121J16475J16109J14334J11580J08370J04620J00039
$$ 4221298 4337593 4453714 4570189 4686298 4800632 4912212 5020582 5125202 5225241
53322E225241R4708Q9141Q4002P9631P5577P0819O4823N8225N2148M6958M2041
$$ 5225241 5319949 5409090 5493092 5572723 5648300 5719119 5783942 5842167 5894315 5941273 5983314
53311E983314L6577L0059K2052J2128L14j2605k5696l8760n2207o5944p8813q9648
$$ 5983314 6019891 6049950 6072002 6084130 6084444 6071839 6046143 6007383 5955176 5889232 5810419 5720771
53299E720771r8615j06712j13939j19073j21724j23584j26518j30100j32281j32118
$$ 5720771 5622156 5515444 5401505 5282432 5160708 5037124 4910606 4780506 4648225 4516107
53289D516107j30502j28410j26010j23805j22980j23818j24855j24378j21970
$$ 4516107 4385605 4257195 4131185 4007380 3884400 3760582 3635727 3511349 3389379
53280C389379j18048j13000j07550j02856r9142r5093q9722q3895p8725p3376
$$ 3389379 3271331 3158331 3050781 2947925 2848783 2753690 2663968 2580073 2501348 2427972
53270B427972o6256n7961n1031m6603m3100l8817l4096l0103k6766k3257j9584
$$ 2427972 2361716 2303755 2252724 2206121 2163021 2124204 2090108 2060005 2033239 2009982 1990398
53259A990398j6450j3917j1258p941m058j0L515N634O288O972R492J3859J8339
$$ 1990398 1973948 1960031 1948773 1940832 1936774 1936764 1940279 1945913 1952201 1959173 1968665 1982524 2000863
53246B000863K1668K4263K6893K9275L0778L1772L3272L5574L8143M0730M3572
$$ 2000863 2022531 2046794 2073687 2102962 2133740 2165512 2198784 2234358 2272501 2313231 2356803
53235B356803M6523M8873N0342N1495N2831N4067N4769N4996N4823N3843N1840
$$ 2356803 2403326 2452199 2502541 2554036 2606867 2660934 2715703 2770699 2825522 2879365 2931205
53224B931205M9472M7525M5812M3614M0918L8358L5996L3160K9561K5634K1411
$$ 2931205 2980677 3028202 3074014 3117628 3158546 3196904 3232900 3266060 3295621 3321255 3342666
53213C342666J6060R218K082l745q083j2127j6797k2019k7604l3845m0802m7640
$$ 3342666 3358726 3367944 3370026 3366281 3358198 3346071 3329274 3307255 3279651 3245806 3205004 3157364
53201C157364n3331n7794o1778o5685o9103p1548p3201p4564p5643p5958p5236
$$ 3157364 3104033 3046239 2984461 2918776 2849673 2778125 2704924 2630360 2554717 2478759 2403523
53190B403523p3845p2488p1635p1185p0550o9260o7616o6517o6314o6264o5594
$$ 2403523 2329678 2257190 2185555 2114370 2043820 1974560 1906944 1840427 1774113 1707849 1642255
53179A642255o4703o4375o4034o2030n7935n3389m9984m7372m4286m0581l7147
$$ 1642255 1577552 1513177 1449143 1387113 1329178 1275789 1225805 1178433 1134147 1093566 1056419
53168A056419l4362l1764k9084k6555k4345k2459k1160k0632k0356j9535j8090
$$ 1056419 1022057 990293 961209 934654 910309 887850 866690 846058 825702 806167 788077
53157G88077j6585j5357j4421j3885j3570j2665j0831r346r816j1804j3144j2676
$$ 788077 771492 756135 741714 727829 714259 701594 690763 681417 671601 659797 646653 633977
53145F33977j1301j0078q874p520o792p215p995q202q133q477q943q805q179p677
$$ 633977 622676 612598 603724 596204 589412 582197 574202 566000 557867 549390 540447 531642 523463 515786
53131E15786p196o169m741l690l279l082k938l173l799m180l796k960k492k896
$$ 515786 508590 502421 497680 493990 490711 487629 484691 481518 477719 473539 469743 466783 464291 461395
53117D61395l888m612m314k949j144L22R07M80n37j424j931k572l565m035l260
$$ 461395 457507 452895 448581 445632 444488 444810 445717 446197 445660 444236 442305 439733 436168 432133 428873
53102D28873k311k834m249m011j264J508J708j11j607k000k284k910l231k994
$$ 428873 426562 423728 419479 415468 414204 415712 417420 417309 415702 413702 411418 408508 405277 402283
53088D02283k631k135j105K7L10j14k3R52J709J314N3j405k728l376k656r67J01
$$ 402283 399652 397517 396412 396439 396749 396635 396612 397564 399273 400587 400640 399235 396507 393131 390475 389508 389609
53071C89609j98o39J72J741K579K486K493K715J899m13k511k332p1K127K838K645
$$ 389609 389411 388772 388944 390685 393264 395750 398243 400958 402857 402444 399933 397601 397530 399657 402495 405140
53055D05140K557K431J751J024J020J050m75l441n525m940k610p37k13n14j275
$$ 405140 407697 410128 411879 412903 413923 414973 414498 411057 405532 400592 397982 397245 397032 396518 395243
53040C95243k533l758l951k871j323k67k27j308k951l960l620k534j603p22M34
$$ 395243 392710 388952 385001 382130 380807 380540 380313 379005 376054 372094 368474 365940 364337 363615 364049
53025C64049R35m55k908l887k258L50J826J807J117L19j99J8O15K75j436k894
$$ 364049 364984 364529 361621 357734 355476 355826 357652 359459 360576 360895 360696 360714 361329 361604 360168 357274
53009C57274k296q5J635J703O55p07k070k905k415p69N23J93j305k370k010n70
$$ 357274 354978 354893 356528 358231 358886 358179 356109 353204 350789 350020 350543 350736 349431 347061 345051 344481
52993C44481R64J872J918J156q8j229j740j630j395j342j288j111j204j912k806
$$ 344481 345445 347317 349235 350391 350303 349074 347334 345704 344309 342967 341679 340568 339364 337452 334646
52978C34646l233l409m081n038n008l480j667j015j426j842j936k187k624k565
$$ 334646 331413 328004 323923 318885 313877 310397 308730 307715 306289 304447 302511 300324 297700 295135
52964B95135j670l74Q11J656J795Q30p79j712j294l78j27l94j63O21P87k64j372
$$ 295135 293465 293091 293902 295558 297353 298183 297404 295692 294398 294020 293893 293499 293336 293957 294744 294480 293108
52947B93108r20J145L316M265L839K482P54l62K11K199L629K891P59o69o77l99
$$ 293108 292188 293333 296649 300914 304753 307235 307989 307627 307838 310037 313666 316557 317316 316647 315970 315571
52931C15571p32j189j175j013r66m06R81K028J335p99k674l116k117j57K004L095
$$ 315571 314839 313650 312475 311462 310496 310090 311071 313099 314434 313635 310961 307845 305728 305571 307575 310670
52915C10670K383R04M15R66R57q4n05Q63K618K688J229nl83p06j083n88P16J201
$$ 310670 313053 313957 314372 315338 316295 316211 315706 316569 319187 321875 323104 323099 322716 322010 320927 320339 321055 322256
52897C22256L7j316j126J53P68K28l61l05k48q70j807k242j937j209m61j30o03
$$ 322256 322293 320977 319851 320004 320772 321000 320639 320334 320086 319216 317409 315167 313230 312021 311560 311430 310827
52880C10827j716k510k074o41M51P9j405k501k243j245p01n27N13K663M204L448
$$ 310827 309111 306601 304527 303886 304337 304416 303011 300510 298267 297022 296321 295794 296307 298970 303174 306622
52864C06622Q69j658l118l626l090j321O64J235M56J32J029J634N92j167j964
$$ 306622 307491 305833 302715 299089 295999 294678 295342 296577 297033 297165 298194 299828 300420 299253 297289
52849B97289j771j622j627j165l86p9l18o44j086j770j968j073o9k95r81mK797
$$ 297289 295518 293896 292269 291104 290718 290639 290321 289677 288591 286821 284853 283780 283711 283416 282435 282431 285228
52832B85228N053N210M512M610M943L891J456q19j907k032j681j072m83k54m40
$$ 285228 290281 295491 300003 304613 309556 313447 314903 314084 312177 310145 308464 307392 306909 306655 306215
52817C06215q71j345j467p96L89J078P84K58L52Q38J094J216J516J508O57k38
$$ 306215 305344 303999 302532 301736 302125 303203 303987 304245 304597 305435 306529 307745 309261 310769 311426 311188
52801C11188K54K062L505L466K532J526K91j334k363j781l68m1j348k621k169
$$ 311188 311442 313504 317009 320475 323007 324533 324824 323490 321127 319346 318978 318937 317589 314968 312799
52786C12799m86M20m66k103k891k456j577r05m84l37p69j712k336j918r58p62
$$ 312799 312313 312733 312267 310164 307273 304817 303240 302335 301851 301514 300745 299033 296697 294779 293821 293059
52770B93059j756k602j552J362M003M366K861J670J896K297J252q33k131j952
$$ 293059 291303 288701 287149 288511 292514 296880 299741 301411 303307 305604 306856 306023 303892 301940
52756C01940j366j288j231m73N93J141J168J169J115P56O18J587L356M266L065
$$ 301940 300574 299286 298055 297582 298175 299316 300484 301653 302768 303524 304142 305729 309085 313351 316416
52741C16416K87k440l974m289l991l625l273k626j537n68o05j778l111l584l139
$$ 316416 316703 314263 310289 306000 302009 298384 295111 292485 290948 290380 289775 287997 284886 281302 278163
52726B78163k308j227K35J575J829R09KP5O59Q18P46J339K417K678J663N21K88
$$ 278163 275855 274628 274863 276438 278267 279176 279178 279253 279912 280730 281476 282815 285232 287910 289573 290094 290382
52709B90382M81K94J79R63K027J890M55p48p63l37m04p06o29m54p40j082o57K20
$$ 290382 290863 291157 291336 292299 294326 296216 296671 295923 295160 294823 294419 293713 293084 292630 291890 290808 290151 290371
52691B90371J50j384k914k462N2K462K648Q75o53m31R21J992K437K724K829K308
$$ 290371 290521 289137 286223 283761 283813 286275 288923 289798 289145 288714 289635 291627 294064 296788 299617 301925
52675C01925J344N55p2q78j304l86J409K377J976J474J602J290j84j491j222k37
$$ 301925 303269 303824 303752 302874 301570 301184 302593 304970 306946 308420 310022 311312 311128 309637 308415 308178
52659C08178k30r65j050p85j794l900m703l023p38j93j248k064j607k69J138J834
$$ 308178 307948 306983 305933 305148 303354 299454 294751 291728 290990 290797 289549 287485 285878 285609 286747 288581
52643B88581J132p67k335k048q8J845K285J130n42j259k55J625K481J512J39J05
$$ 288581 289713 288946 286611 284563 284475 286320 288605 289735 289193 287934 287679 289304 291785 293297 293436 293541
52627B93541J025J053k35j192o42M27N58R6N47K282M095M786M097K261j99k107
$$ 293541 294566 295619 295384 294192 293550 293977 294535 294631 295178 297460 301555 306341 310438 312699 312500 310393
52611C10393k226p39P49J198J267J831K242J230q59k068j262M98J450J263R48
$$ 310393 308167 307428 308177 309375 310642 312473 314715 315945 315086 313018 311756 312254 313704 314967 315915
52596C15915J172J470J179M62M5J77M74P72J533K856L590K397k70k240k096p00
$$ 315915 317087 318557 319736 320198 320243 320420 320894 321666 323199 326055 329645 332042 331772 329532 327436 326736
52580C26736L29P04J053J241N35q61j778j670j076m26M14J245J384R27R62J903
$$ 326736 327065 327769 328822 330063 330598 329737 327959 326289 325213 324787 325201 326446 327830 328757 329719 331622
52564C31622K629J992L56j094j820j989j790j550j834k689l150k338o47P43J171
$$ 331622 334251 336243 336599 335505 333685 331696 329906 328356 326522 323833 320683 318345 317698 318441 319612
52549C19612P61n7o39l92M30P12k6q90j061j082j537j379O75L502M272K060q97
$$ 319612 320373 320316 319677 319285 319715 320427 320401 319511 318450 317368 315831 314452 315127 318629 322901 324961 324064
52532C24064k034j163K84J408K117K201J413K79j67M31J325J487O10n98r45J99
$$ 324064 322030 320867 321151 322559 324676 326877 328290 328569 328402 328833 330158 331645 332255 331657 330712 330911
52516C30911K199L568L322J815K01o65p09k82K33M96J50r40k265k788j885k25
$$ 330911 333110 336678 340000 341815 342016 341351 340642 340360 340593 341089 341239 340299 338034 335246 333361 333136
52500C33136Q09O00j77p01r92j375j667j476r27l90J65Q75J349J075K65l40l80
$$ 333136 333945 334545 334368 333667 332675 331300 329633 328157 327230 326840 327005 327880 329229 330304 330569 330229 329849
52483C29849j2O30J412J863J620J002N90M42L81N64Q23R2k089l925l028J62K488
$$ 329849 329837 330467 331879 333742 335362 336364 336954 337396 337777 338341 339164 339256 337167 333242 330214 330376 332864
52466C32864K115O79M58J210J263M18j30m3j23n72n86J48Q97J045P69L38k04m37
$$ 332864 334979 335658 336116 337326 338589 339007 338877 338834 338711 338139 337553 337701 338598 339643 340412 340750 340546 340109
52448C40109K99J699K480K088J593K172L360L669K472M89j283k253k157j131j0
$$ 340109 340408 342107 344587 346675 348268 350440 353800 357469 359941 360430 359147 356894 354737 353606 353596
52433C53596L14j02m74n79r86j734j857q04N44J056R56J204J827K024J666J464
$$ 353596 353910 353808 353334 352755 351769 350035 348178 347374 347918 348974 349930 351134 352961 354985 356651 358115
52417C58115J655J721J522J487J446O27o99r98K67J502J201J60J07J089J810J864
$$ 358115 359770 361491 363013 364500 365946 366573 365874 364876 365143 366645 367846 368006 368113 369202 371012 372876
52401C72876J940K162K003J697J993K404J431r63k809k706j522o83j98N34J145
$$ 372876 374816 376978 378981 380678 382671 385075 386506 385543 382734 380028 378506 377823 377625 378159 379304
52386C79304R12K35J25N66O12k4n14j48P27J153M67j224l012l743l040j639m08
$$ 379304 380216 380451 380576 381142 381754 381730 381216 381068 381795 382948 383415 382191 379179 375436 372396 370757 370349
52369C70349N47J311J237l19k489l266j827L81J419J101P66J300K220K616K221
$$ 370349 370896 372207 373444 373125 370636 367370 365543 365924 367343 368444 369210 370510 372730 375346 377567
52354C77567J364N34K92J090K682M100M621M473M149L499K275J180J294K393L061
$$ 377567 378931 379465 379757 380847 383529 387629 392250 396723 400872 404371 406646 407826 409120 411513 414574
52339D14574K808K846M018N134M495K348M15n34j289k391l215l128k476j907j458
$$ 414574 417382 420228 424246 429380 433875 436223 436638 436104 434815 432424 429209 426081 423605 421698 420240
52324D20240q47m7P61J302J072k57k003k685j546N31K039K381K118J996K203K495
$$ 420240 419393 419346 420107 421409 422481 422224 420221 417536 415990 416521 418560 420941 423059 425055 427258 429753
52308D29753K670K773K865K707K010J019M35N07P08O92R96K088L258L370K410
$$ 429753 432423 435196 438061 440768 442778 443797 444232 444739 445447 446139 447135 449223 452481 455851 458261
52293D58261J333O20J1l82J36J736L546M468L975K183q9j456j060M84J902K793
$$ 458261 459594 460214 460225 459843 459979 461715 465261 469729 473704 475887 475798 474342 473282 473766 475668 478461
52277D78461L445L696L234K757L228M175M361M183N452Q457J1141J1897J1363
$$ 478461 481906 485602 488836 491593 494821 498996 503357 507540 512992 521449 532590 544487 555850
52264E55850J0719R963Q857P861P142O177N372O165Q440R828R153Q439R514J0692
$$ 555850 566569 576532 585389 593250 600392 606569 611941 618106 626546 636374 645527 653966 663480 674172
52250F74172R485O923O013O957P241O076N342N827N796M347L330M473O716P924
$$ 674172 683657 690580 696593 703550 710791 716867 722209 728036 733832 738179 741509 745982 752698 760622
52236G60622P676O873N912M703L602L136L329L975M790M854L175M25j125m26Q56
$$ 760622 768298 775171 781083 785786 789388 792524 795853 799828 804618 809472 812647 813072 811947 811521 812377
52221H12377P96k7K68J814K965K947K735L205L986M556N167N957O141N078L589
$$ 812377 813173 813146 813414 815228 818193 821140 823875 827080 831066 835622 840789 846746 852887 857965 861554
52206H61554L299M669O452P195O731N930N454N387N774O715P651P403N626L781
$$ 861554 864853 869522 875974 883169 889900 895830 901284 906671 912445 919160 926811 934214 939840 943621
52192I43621L737N536P353P799P449P712Q891R944R744Q113N888M349M375N599
$$ 943621 947358 952894 960247 968046 975495 983207 992098 1002042 1011786 1019899 1025787 1030136 1034511 1040110
52178A040110O570O159M707L466L140L443M030N066O530P589P323N946M716M597
$$ 1040110 1046680 1052839 1057546 1061012 1064152 1067595 1071625 1076691 1083221 1090810 1098133 1104079 1108795 1113392
52164A113392N527O934Q345R165Q759P381O512P265Q811R414Q899Q916J0445J2318
$$ 1113392 1118919 1125853 1134198 1143363 1152122 1159503 1166015 1173280 1182091 1191505 1200404 1209320 1219765 1232083
52150A232083J2868J2076J1202J1010J1284J1556J1459J0642R223Q064P897Q309
$$ 1232083 1244951 1257027 1268229 1279239 1290523 1302079 1313538 1324180 1333403 1341467 1349364 1357673
52138A357673Q332P688O819O004N217M659M464M192L489L154M243O111O573M571
$$ 1357673 1366005 1373693 1380512 1386516 1391733 1396392 1400856 1405048 1408537 1411691 1415934 1422045 1428618 1433189
52124A433189J676K87R98K526L537L630K816J082j252l421m931o065p270q219
$$ 1433189 1434865 1435152 1436150 1438676 1442213 1445843 1448659 1449741 1448489 1445068 1440137 1434072 1426802 1418583
52110A418583q052o676n231m749m775m097k631j598j624j745r25L13O41j65r94
$$ 1418583 1410531 1403855 1398624 1393875 1389100 1385003 1382372 1380774 1379150 1377405 1376480 1376793 1377434 1377269 1376275
52095A376275q83o4N64N55M67J348L286M649L658Q77r93m52Q88P75m63o77Q81
$$ 1376275 1375392 1375328 1375892 1376447 1376914 1378262 1381548 1386197 1389855 1390732 1389739 1389287 1390175 1390950 1390487 1389810 1390691
52078A390691K687L089J893n7j640j905r29r9m23q79J80K406L854L989M382O181
$$ 1390691 1393378 1396467 1398360 1398303 1396663 1394758 1393829 1393730 1393307 1392428 1392608 1395014 1398868 1402857 1407239 1413420
52062A413420Q593J0480J1721J2310J1709J0205R536J0842J2866J3370J1752R239
$$ 1413420 1422013 1432493 1444214 1456524 1468233 1478438 1487974 1498816 1511682 1525052 1536804 1546043
52050A546043P028N246L496J662K56J10J443L089L401K127O31n9l38p78q53J81
$$ 1546043 1553071 1558317 1561813 1563475 1563731 1563841 1565284 1568373 1571774 1573901 1574532 1574473 1574135 1573357 1572504 1572685
52034A572685J809K708K361J562J387K025K481J466j102l741n073n460n985o325
$$ 1572685 1574494 1577202 1579563 1581125 1582512 1584537 1587018 1588484 1587382 1583641 1578568 1573108 1567123 1560798
52020A560798n276l315k576l709m646l495r75J079K088K319J710O43M78J621K285
$$ 1560798 1555522 1552207 1549631 1545922 1541276 1537781 1536806 1537885 1539973 1542292 1544002 1544645 1545123 1546744 1549029
52005A549029J083l66L85K678L545K045K78l5L78L23j9j53m61j228j756j552j346
$$ 1549029 1550112 1549746 1550131 1552809 1556354 1558399 1558677 1558642 1559020 1559343 1559324 1559171 1558710 1557482 1555726 1554174 1552828
51988A552828k036l368m541n370o014o204n694n064n230o166o862o484n361m604
$$ 1552828 1550792 1547424 1542883 1537513 1531499 1525295 1519601 1514537 1509307 1503141 1496279 1489795 1484434 1479830
51974A479830m927n819o009m951l528k903k999k777j861r94p62p89n12o6J62K32
$$ 1479830 1474903 1469084 1463075 1458124 1454596 1451693 1448694 1445917 1444056 1443062 1442300 1441511 1440999 1440933 1441095 1441327
51958A441327L79M12K1o09j023j303k124l830n715o547n944n046n467p503r756
$$ 1441327 1441706 1442118 1442139 1441530 1440507 1439204 1437080 1433250 1427535 1420988 1415044 1409998 1404531 1397028 1387272
51943A387272j0845j1112j2135j4749j8163k1048k2894k4071k4935k5251k4565
$$ 1387272 1376427 1365315 1353180 1338431 1320268 1299220 1276326 1252255 1227320 1202069 1177504
51932A177504k2984k1394k0629k0489k0075j9119j8318j7978j7245j5447j3515
$$ 1177504 1154520 1133126 1112497 1092008 1071933 1052814 1034496 1016518 999273 983826 970311
51921I70311j2925j3552j3861j3248j2879j3708j4702j3882j0716o856m569m731
$$ 970311 957386 943834 929973 916725 903846 890138 875436 861554 850838 843982 839413 834682
51909H34682o098o523n045k787j518j491j328Q2K431M826O876Q425R015Q403P169
$$ 834682 828584 822061 817016 814229 812711 811220 809892 809974 812405 817231 824107 832532 841547 849950 857119
51894H57119O124N229L806J712l08j585k256k785l057k459p27J628L842N626P159
$$ 857119 863243 868472 872278 873990 873682 872097 869841 867056 863999 861540 860813 862441 866283 871909 879068
51879H79068Q653J0231J2011J3824J4954J4809J3895J3460J3792J3585J1439P524
$$ 879068 887721 897952 909963 923787 938741 953550 967445 980905 994697 1008282 1019721 1027245
51867A027245L140p71m150p261j0412j3814j7001j8794j8624j7589j7296j7935
$$ 1027245 1030385 1029614 1025464 1018203 1007791 993977 976976 958182 939558 921969 904673 886738
51855H86738j8456j8323j7930j7338j6010j3958j2020j0522q818o606m679l708
$$ 886738 868282 849959 832029 814691 798681 784723 772703 762181 753363 746757 742078 738370
51843G38370l210k408j281l1J764M396O885P466N392J768j360k628k327j816j776
$$ 738370 735160 732752 731471 731440 733204 737600 744485 751951 757343 759111 757751 755123 752796 750980 749204
51828G49204j364L36K430L119K576L201O435J0762J3892J5600J7024J8307J8622
$$ 749204 747840 748176 750606 753725 756301 759502 765937 776699 790591 806191 823215 841522 860144
51815H60144J7811J6287J3699R423M164n06m203p691j0897j2813j3570j4666j6370
$$ 860144 877955 894242 907941 917364 921528 921022 916819 909128 898231 885418 871848 857182 840812
51802H40812j6838j4981j2593j2028j2936j3067j1617r945r192q874q132p060
$$ 840812 823974 808993 796400 784372 771436 758369 746752 736807 727615 718741 710609 703549
51790G03549o251n974o101o262n896m849m069m835p000q726q521o891n428m804
$$ 703549 697298 691324 685223 678961 673065 668216 664147 659312 652312 643586 635065 628174 622746 617942
51776F17942m354l409k276j703j801j775p64J061K381J998K74j146j206n93o96
$$ 617942 613588 610179 607903 606200 604399 602624 601860 602921 605302 607300 607574 606428 605222 604629 603933
51761F03933j720k434j776k49O02j9j160j179L08J927K300J853K166L767N412
$$ 603933 602213 599779 598003 597754 598356 598337 597177 595998 596306 598233 600533 602386 604552 608319 613731
51746F13731N721M568K607M15j347j937j558j573k657l532k781j181o57j370j745
$$ 613731 619452 624020 626627 627042 625695 623758 622200 620627 617970 614438 611657 610476 609819 608449 606704
51731F06704j400j833l548m484k680P90L011K610O37j204j963j525o18m67j475
$$ 606704 605304 603471 599923 595439 592759 593549 596560 599170 599807 598603 596640 595115 594497 594030 592555
51716E92555k430k074r88p60j508j639j94J834K973L005K803L244M729O939Q655
$$ 592555 590125 588051 587063 586303 584795 583156 582962 584796 587769 590774 593577 596821 601550 608489 617144
51701F17144Q579O846N029M135L334J440j129k884l411l799m851n917n940m931
$$ 617144 625723 632569 637598 641733 645067 646507 645378 642494 639083 635284 630433 624516 618576 613645
51687F13645l725k814k110j678j894k623k987k343j048K58J653L495N267N912
$$ 613645 609920 607106 604996 603318 601424 598801 595814 593471 592423 592681 594334 597829 603096 609008
51673F09008N435N182O021P172P544P438P912Q882R030P721N989N241N598N979
$$ 609008 614443 619625 625646 632818 640362 647800 655712 664594 673624 681345 687334 692575 698173 704152
51659G04152N465M098K412N76j638l987n326m684k713j231j222k005k687l361
$$ 704152 709617 713715 716127 716703 715065 711078 705752 701068 698355 697124 695902 693897 691210 687849
51645F87849m172m270k952j092j28j13j29k81j487l385m213l230j704q58l84K67
$$ 687849 683677 679407 676455 675363 675235 675122 674993 674712 673225 669840 665627 662397 660693 659835 659451 659718
51629F59718O06K44K4N21M11j925n647q012p651n856m424l617k747j536j18J491
$$ 659718 660324 660568 660592 661113 661524 659599 653952 645940 638289 632433 628009 624392 621645 620109 619991 621482
51613F21482L129M204M494M760N693O559N964M174L430N211Q052R203Q093O736
$$ 621482 624611 628815 633309 638069 643762 650321 656285 660459 663889 669100 677152 686355 694448 701184
51599G01184O590O531M741J384j871m200o035p409p503o067m061k384j009J20
$$ 701184 707774 714305 719046 720430 718559 714359 708324 700915 693412 687345 683284 680900 679891 680011
51585F80011M18l96j480j918k066l027n028p105q236q258p687p155o925o687n891
$$ 680011 680429 680033 678553 676635 674569 671542 666514 659409 651173 642915 635228 628073 621148 614461 608570
51570F08570m509l305l051l663m357m464l840k660j217J10R58J179R63P90J026
$$ 608570 604061 600756 597705 594042 589685 585221 581381 578721 577504 577614 578572 579751 580714 581504 582530
51555E82530J316O62j384l714m473l051o79J029J534J287R83J279K499L983M317
$$ 582530 583846 584508 583124 579410 574937 571886 571207 572236 573770 575057 576040 577319 579818 583801 588118
51540E88118K933J084N59J570K629K458J550J676M067Q042J1409J2351J1016R016
$$ 588118 591051 592135 592694 594264 596893 599351 600901 602577 606644 614686 626095 638446 649462 658478
51526F58478P551O537N544M760M523M620M743N253O741R016J1088J2237J2701
$$ 658478 666029 672566 678110 682870 687393 692013 696756 702009 708750 717766 728854 741091 753792
51513G53792J3342J4775J6799J8534J9199J8768J7746J6487J5194J4381J4586
$$ 753792 767134 781909 798708 817242 836441 855209 872955 889442 904636 919017 933603
51502I33603J5639J6936J8551K1148K4551K7396K8792K9489L0716L2470L3587
$$ 933603 949242 966178 984729 1005877 1030428 1057824 1086616 1116105 1146821 1179291 1212878
51491A212878L2900K9822K4442J7680J0715L698m212j2946k0698k5901k9149l2030
$$ 1212878 1245778 1275600 1300042 1317722 1328437 1332135 1327923 1314977 1294279 1268378 1239229 1207199
51479A207199l4885l6928l7975l8446l8080l6131l2909k9733k7263k5004k2622
$$ 1207199 1172314 1135386 1097411 1058965 1020885 984754 951845 922112 894849 869845 847223
51468H47223k0552j9011j7498j5617j3702j2229j1271j0671j0173r408q299p471
$$ 847223 826671 807660 790162 774545 760843 748614 737343 726672 716499 707091 698792 691321
51456F91321p480p840p525o398n333m971n129n314n065m031k636k253l551m996
$$ 691321 683841 676001 668476 662078 656745 651774 646645 641331 636266 632235 629599 627346 623795 618799
51442F18799m436k147o73j422l098l922l753l239k391j195m97j056k343l205l119
$$ 618799 614363 612216 611543 610121 607023 603101 599348 596109 593718 592523 592026 590970 588627 585422 582303
51427E82303k189o63Q95J781K096K614L252K877J419O66J670K787K005R5o08R0
$$ 582303 580114 579451 580346 582127 584223 586837 590089 592966 594385 595051 596721 599508 601513 601608 601000 601090
51411F01090J20j285k234j149P26R49j099l832n439n389m312l115k129j035K53
$$ 601090 601210 599925 597691 596542 597268 598217 597118 593286 587847 582458 578146 575031 572902 571867 572120
51396E72120Q69q1j951k905k113o84j4n4J40R40J972L043M307N790P396R194J1063
$$ 572120 572989 572908 570957 568052 565939 565255 565241 565187 565327 566267 568239 571282 575589 581379 588775 597969 609032
51379F09032J2193J1693R787P808O746O342N821N059M511M278L874K917J571k
$$ 609032 621225 632918 642705 650513 657259 663601 669422 674481 678992 683270 687144 690061 691632 691630
51365F91630k095m928p837r539r379p912o184m805l900l458l298k974k268j603
$$ 691630 689535 684607 676770 667231 657852 649940 643756 638951 635051 631593 628295 625321 623053 621450
51351F21450j586k163k627k331j157N71K154K760K191J319J193J800K413L044
$$ 621450 619864 617701 615074 612743 611586 612157 614311 617071 619262 620581 621774 623574 625987 629031
51337F29031M370O067O582N394M396N657Q469J0164R797R394J1037J4072J6159
$$ 629031 633401 639468 646050 651444 655840 661497 669966 680130 689927 699321 710358 724430 740589
51324G40589J6406J6372J8175K2345K7584L2100L5065L7018L9063M1774M4901
$$ 740589 756995 773367 791542 813887 841471 873571 908636 945654 984717 1026491 1071392
51313A071392M7797M9672M9629M7133M2613L6929L0182K1819J2108K472o203j4520
$$ 1071392 1119189 1168861 1218490 1265623 1308236 1345165 1375347 1397166 1409274 1411746 1405543 1391023
51301A391023k3103l1169l7654m2860m7462n0685n1205m9509m7427m5381m2098
$$ 1391023 1367920 1336751 1299097 1256237 1208775 1158090 1106885 1057376 1009949 964568 922470
51290I22470l7461l3478l1368k9625k6430k2534j9993j9017j8007j6175j4376
$$ 922470 885009 851531 820163 790538 764108 741574 721581 702564 684557 668382 654006
51279F54006j3352j2702j1807j0700r599q402o921n176l433k235k091k741l252
$$ 654006 640654 627952 616145 605445 595846 587444 580523 575347 571914 569679 567588 564847 561595
51266E61595l294l640m618n038l847k000j254j620j749j457j869k905k783p58
$$ 561595 558301 554661 550043 545005 541158 539158 537904 536284 534535 533078 531209 528304 525521 524763
51252E24763J325J329n03k211k514j680p71p95j955l137k821r68P86J274J106
$$ 524763 526088 527417 526914 524703 522189 520509 519738 518943 516988 513851 511030 510062 510848 512122 513228
51237E13228J180J120J80j249k310l023l668l468j460J526L248K665J005J4K16
$$ 513228 514408 515528 515708 514459 512149 509126 505458 501990 500530 502056 505304 507969 508974 508988 509204
51222E09204J143K313L351L765L368K663K386K728L225L371L084K581J920R82
$$ 509204 510347 512660 516011 519776 523144 525807 528193 530921 534146 537517 540601 543182 545102 546084
51208E46084m3m64J42J167J525J060O73R02J066K45j477l165l990l663k449j199
$$ 546084 546041 545577 545719 546886 548411 549471 550144 551046 552112 552357 550880 547715 543725 540062 537613 536414
51192E36414q15j254j554j157n78m00m59o47j445k740l013j136J693L228L020
$$ 536414 535599 534345 532791 531634 531056 530656 530197 529550 528105 525365 522352 521216 522909 526137 529157
51177E29157K439K180J478R7p66l97L3r42k894l967l127j131N01R66P80J208K809
$$ 529157 531596 533776 535254 535351 534585 534188 534221 533279 530385 526418 523291 522160 522661 523627 524407 525615 528424
51160E28424M495M613L150J900K076K722K439J750K332M170N159L934J809J017
$$ 528424 532919 537532 540682 542582 544658 547380 549819 551569 553901 558071 563230 567164 568973 569990
51146E69990J892K905L026K755K713K512J641O50M25P91P98K48n7K90O54M03k15
$$ 569990 571882 574787 577813 580568 583281 585793 587434 588084 588509 589300 590098 590346 590289 590579 591233 591636 591421
51129E91421p19j148j593j701j283p95o01l26K65M34l53r69K65L029M894M042
$$ 591421 590702 589554 587961 586260 584977 584182 583581 583255 583520 583954 583601 582632 582897 585926 590820 594862
51113E94862J118j887l588l721k757j688j440j934k179j712j283j652k375k490
$$ 594862 595980 594093 590505 586784 584027 582339 580899 578965 576786 575074 573791 572139 569764 567274
51099E67274j824q81J18J313K416K699J849L69r15j431r75K26J475J967J405K13
$$ 567274 565450 564569 564687 566000 568416 571115 572964 573333 572418 570987 570012 570238 571713 573680 575085 575298
51083E75298q44j166n87N23J427J514P54k79q64o40K09J169J759J754J139J20
$$ 575298 574454 573288 572701 573224 574651 576165 576919 576640 575776 575136 575345 576514 578273 580027 581166 581286
51067E81286p71r11k56M89P58R84K002L648M678M322L286K827L263L862L997L870
$$ 581286 580515 579604 579348 579837 580595 581579 583581 587229 591907 596229 599515 602342 605605 609467 613464 617334
51051F17334M090M818N411M905K987O06o54O0K066L787M140L402K815L252M107
$$ 617334 621424 626242 631653 636558 639545 640151 639497 639557 641623 645410 649550 652952 655767 659019 663126
$$ [...]
##END NTUPLES=NMR SPECTRUM
##END=
