
##TITLE=UV1154_M4-1010-1000_6301887_lp42QUdC8l
##JCAMPDX= 6.0         $$ Bruker NMR JCAMP-DX V2.0
##DATA TYPE= NMR SPECTRUM
##DATA CLASS= NTUPLES
##ORIGIN= BRUKER
##OWNER= Administrator
$$ 1.72 TOPSPIN		Version 2.1
$$ 2012-06-06 01:54:43.078 -0500  Administrator@TOPSPIN
$$ Compression mode = diff/dup
##.OBSERVE FREQUENCY= 400.13188235
##.OBSERVE NUCLEUS= ^1H
##.ACQUISITION MODE= SIMULTANEOUS (DQD)
##.ACQUISITION SCHEME= undefined
##.AVERAGES= 64
##.DIGITISER RES= 22
##SPECTROMETER/DATA SYSTEM= spect
##.PULSE SEQUENCE= noesygpps1d.comp
##.SOLVENT NAME= COFFEE_meoh
##.SHIFT REFERENCE= INTERNAL, COFFEE_meoh, 1, 14.96686
##AUDIT TRAIL= $$ (NUMBER, WHEN, WHO, WHERE, PROCESS, VERSION, WHAT)
$$ ##TITLE= Audit trail, TOPSPIN		Version 2.1
$$ ##JCAMPDX= 5.01
$$ ##ORIGIN= Bruker BioSpin GmbH
$$ ##OWNER= Administrator
$$ $$ C:\Bruker\TOPSPIN/data/COFFEE/nmr/UV1154_M4-1010-1000_6301887_lp42QUdC8l/12/pdata/1/auditp.txt
$$ ##AUDIT TRAIL=  $$ (NUMBER, WHEN, WHO, WHERE, PROCESS, VERSION, WHAT)
(   1,<2012-06-06 01:54:37.718 -0500>,<Administrator>,<TOPSPIN>,<go>,<TOPSPIN 2.1>,
      <created by zg
	started at 2012-06-06 01:43:07.468 -0500,
	POWCHK enabled, PULCHK disabled,
       configuration hash MD5:
       D5 CA 7A 23 FE 6B EE E2 50 67 74 61 24 F7 5E 3B
       data hash MD5: 64K
       C5 93 D1 BC B4 53 AE 88 00 CB BF 18 B9 9D DA C4>)
(   2,<2012-06-06 01:54:40.687 -0500>,<Administrator>,<TOPSPIN>,<proc1d>,<TOPSPIN 2.1>,
      <Start of raw data processing
       efp LB = 0.3 FT_mod = 6 PKNL = 1 PHC0 = 0 PHC1 = 0 SI = 128K 
       data hash MD5: 128K
       1F 90 BA 1D 3B 0A 28 D7 75 21 7C 68 55 E1 47 98>)
(   3,<2012-06-06 01:54:42.000 -0500>,<Administrator>,<TOPSPIN>,<proc1d>,<TOPSPIN 2.1>,
      <pk PHC0 = 31.89331 PHC1 = 0 
       data hash MD5: 128K
       D4 75 85 37 FE C4 F9 05 79 BC EB CE 38 5F DE C8>)
(   4,<2012-06-06 01:54:42.734 -0500>,<Administrator>,<TOPSPIN>,<proc1d>,<TOPSPIN 2.1>,
      <abs ABSG = 1 
       data hash MD5: 128K
       42 68 CB AB DE 55 50 A1 5C B1 EB DA D8 50 68 C5>)
(   5,<2012-06-06 01:54:42.812 -0500>,<Administrator>,<TOPSPIN>,<proc1d>,<TOPSPIN 2.1>,
      <abs ABSG = 2 
       data hash MD5: 128K
       76 D9 10 35 7C 59 4A FA 0E 40 5B 6E 03 18 2F 26>)
(   6,<2012-06-06 01:54:42.875 -0500>,<Administrator>,<TOPSPIN>,<proc1d>,<TOPSPIN 2.1>,
      <abs ABSG = 3 
       data hash MD5: 128K
       87 AA C7 AD E0 DA D8 D9 40 FE 20 90 4C 50 E0 E1>)
(   7,<2012-06-06 01:54:42.953 -0500>,<Administrator>,<TOPSPIN>,<proc1d>,<TOPSPIN 2.1>,
      <abs ABSG = 4 
       data hash MD5: 128K
       52 38 0E F8 02 58 92 03 CD A0 BA BD FA 6E C0 51>)
(   8,<2012-06-06 01:54:43.000 -0500>,<Administrator>,<TOPSPIN>,<proc1d>,<TOPSPIN 2.1>,
      <abs ABSG = 5 
       data hash MD5: 128K
       27 50 B6 D5 23 8B 6C EC 71 3A 2D FF 42 3A 1C BF>)
$$ ##END=
$$ 
$$ $$ hash MD5
$$ $$ EE 85 AA 72 D1 2F AE BB A0 A5 9A 48 21 ED 02 15
##$RELAX= 
##$RELAX= 
##$RELAX= 
##$RELAX= 
##$RELAX= 
##$RELAX= 
##$RELAX= 
##$RELAX= 
$$ Bruker specific parameters
$$ [...]
##$TP07= 0
##$TPNAME0= <>
##$TPNAME1= <>
##$TPNAME2= <>
##$TPNAME3= <>
##$TPNAME4= <>
##$TPNAME5= <>
##$TPNAME6= <>
##$TPNAME7= <>
##$TPOAL= (0..7)
0.5 0.5 0.5 0.5 0.5 0.5 0.5 0.5
##$TPOFFS= (0..7)
0 0 0 0 0 0 0 0
##$TUNHIN= 0
##$TUNHOUT= 0
##$TUNXOUT= 0
##$USERA1= <user>
##$USERA2= <user>
##$USERA3= <user>
##$USERA4= <user>
##$USERA5= <user>
##$V9= 5
##$VALIST= <valist>
##$VCLIST= <CCCCCCCCCCCCCCC>
##$VD= 0
##$VDLIST= <DDDDDDDDDDDDDDD>
##$VPLIST= <PPPPPPPPPPPPPPP>
##$VTLIST= <TTTTTTTTTTTTTTT>
##$WBST= 2048
##$WBSW= 25
##$XGAIN= (0..3)
0 0 0 0
##$XL= 0
##$YL= 0
##$YMAX_a= 10489787
##$YMIN_a= -7181835
##$ZGOPTNS= <>
##$ZL1= 120
##$ZL2= 120
##$ZL3= 120
##$ZL4= 120
##$ABSF1= 14.96686
##$ABSF2= -5.58567
##$ABSG= 5
##$ABSL= 3
##$ALPHA= 0
##$AQORDER= 0
##$ASSFAC= 0
##$ASSFACI= 0
##$ASSFACX= 0
##$ASSWID= 0
##$AUNMP= <proc_prof1d_extract.lims>
##$AXLEFT= 0
##$AXNAME= <>
##$AXNUC= <1H>
##$AXRIGHT= 0
##$AXTYPE= 0
##$AXUNIT= <>
##$AZFE= 0.1
##$AZFW= 0.1
##$BCFW= 0
##$BC_mod= 0
##$BYTORDP= 0
##$COROFFS= 0
##$CY= 15
##$DATMOD= 1
##$DC= 0
##$DFILT= <>
##$DTYPP= 0
##$F1P= 0
##$F2P= 0
##$FCOR= 0.5
##$FTSIZE= 131072
##$FT_mod= 6
##$GAMMA= 0
##$GB= 0
##$INTBC= 1
##$INTSCL= 1
##$ISEN= 128
##$LB= 0.3
##$LEV0= 0
##$LPBIN= 0
##$MAXI= 10000
##$MC2= 0
##$MEAN= 0
##$ME_mod= 0
##$MI= 0
##$NCOEF= 0
##$NC_proc= -3
##$NLEV= 6
##$NOISF1= 0
##$NOISF2= 0
##$NSP= 0
##$NTH_PI= 0
##$NZP= 0
##$OFFSET= 14.96686
##$PC= 1
##$PHC0= 31.89331
##$PHC1= 0
##$PH_mod= 1
##$PKNL= yes
##$PPARMOD= 0
##$PPDIAG= 0
##$PPIPTYP= 0
##$PPMPNUM= 2147483647
##$PPRESOL= 1
##$PSCAL= 4
##$PSIGN= 0
##$PYNMP= <proc.py>
##$REVERSE= no
##$SF= 400.130005500806
##$SI= 131072
##$SIGF1= 0
##$SIGF2= 0
##$SINO= 400
##$SIOLD= 131072
##$SPECTYP= <>
##$SREGLST= <1H.CDCl3>
##$SSB= 0
##$STSI= 131072
##$STSR= 0
##$SW_p= 8223.68421052632
##$SYMM= 0
##$S_DEV= 0
##$TDeff= 65536
##$TDoff= 0
##$TI= <>
##$TILT= no
##$TM1= 0
##$TM2= 0
##$TOPLEV= 0
##$USERP1= <user>
##$USERP2= <user>
##$USERP3= <user>
##$USERP4= <user>
##$USERP5= <user>
##$WDW= 1
##$XDIM= 131072
##$YMAX_p= 447799488
##$YMIN_p= -455824886
##$CURPLOT= <Network HP LaserJet P1505>
##$CURPRIN= <$Network HP LaserJet P1505>
##$DFORMAT= <normdp>
##$LAYOUT= <+/1D_H.xwp>
##$LFORMAT= <normlp>
##$PFORMAT= <normpl>
##$SURQMSG= 1
$$ End of Bruker specific parameters
$$ ---------------------------------
##NTUPLES= NMR SPECTRUM
##VAR_NAME=  FREQUENCY,     SPECTRUM/REAL,   SPECTRUM/IMAG
##SYMBOL=    X,             R,               I
##VAR_TYPE=  INDEPENDENT,   DEPENDENT,       DEPENDENT
##VAR_FORM=  AFFN,          ASDF,            ASDF
##VAR_DIM=   131072,        131072,          131072
##UNITS=     HZ,            ARBITRARY UNITS, ARBITRARY UNITS
##FACTOR=    0.0627417313425165, 1,          1
##FIRST=     8223.62146879498, 1403,         -102477
##LAST=      0,             4678,            -103649
##MIN=       0,             -455824886,      0
##MAX=       8223.62146879498, 447799488,    0
$$ Real data points
##PAGE= N=1
##DATA TABLE= (X++(R..R)), XYDATA
$$ [...]
62449A233496M1075M0495L9347L7804L5627L2669K9384K6256K2837J8211J2486
62438A569687P050L041L31j551k471k277j641j294p89J158N137J0311J5138J8468
62424A620298K0245K1528K3578K6608K9724L2106L3499L3266L0074K3527J5440
62413A909893Q266K562l078r866j7759k6309l5203m3611n0153n4255n6822n8988
62401A564677o0656o0906n9363n6477n2714m8294m3800m0178l7526l4600l0337
62390A039826k5638k2484k1143j9562j6269j2694j1256j1858j1995j0134p252
62379H69541m813k980j522q69j224j727j631j369j539j740j492j424k396m092
62365H40723n603o762p783q215p558o415n727n294m363l298l172l814l886k968
$$ plain form
62449 1233496 1274571 1315066 1354413 1392217 1427844 1460513 1489897 1516153 1538990 1557201 1569687
62438 1569687 1576737 1579778 1580109 1578558 1576087 1573810 1572169 1570875 1570086 1571244 1576381 1586692 1601830 1620298
62424 1620298 1640543 1662071 1685649 1712257 1741981 1774087 1807586 1840852 1870926 1894453 1909893
62413 1909893 1918159 1920721 1917643 1907777 1890018 1863709 1828506 1784895 1734742 1680487 1623665 1564677
62401 1564677 1504021 1443115 1383752 1327275 1274561 1226267 1182467 1142289 1104763 1070163 1039826
62390 1039826 1014188 991704 970561 950999 934730 922036 910780 898922 886927 876793 869541
62379 869541 864728 861748 860226 859357 858133 856406 854775 853406 851867 850127 848635 847211 844815 840723
62365 840723 835120 828358 820575 812360 804802 798387 792660 787366 783003 779705 776533 772719 768833 765865
62351G65865k133k081k050j237j90M0m81n45P73L078M964N351M661M404N373O721
62335G92513P253P113P387Q480R724J0466J0710J0808J1119J1787J2366J2204
62323I11930J1754J2650J5533J8684K0157K0528K1868K4408K6194K6087K5358
62312A135151K5801K7783L0514L3109L4984L6351L8444M2200M6747N0575N4013
62301A555672N8690O4462O9065P1540P3893P8027Q2736Q5335Q5020Q2931P9751
62290B387122P4750O6924N6024M2767K8762J5788M505n745j5661k5403l5386m6125
62278B548322n6562o4080o7421o8372o9269p0032o9146o6468o3237n9978n6427
62267A837330n3131n1092m9780m7359m3336l9487l7488l6876l6057l4336l2227
$$ plain form
62351 765865 763732 761651 759601 758364 758174 758214 757733 757188 757961 761039 766003 771354 776015 780419 785792 792513
62335 792513 799766 806879 814266 822746 832470 842936 853646 864454 875573 887360 899726 911930
62323 911930 923684 936334 951867 970551 990708 1011236 1033104 1057512 1083706 1109793 1135151
62312 1135151 1160952 1188735 1219249 1252358 1287342 1323693 1362137 1404337 1451084 1501659 1555672
62301 1555672 1614362 1678824 1747889 1819429 1893322 1971349 2054085 2139420 2224440 2307371 2387122
62290 2387122 2461872 2528796 2584820 2627587 2656349 2672137 2676642 2670897 2655236 2629833 2594447 2548322
62278 2548322 2491760 2427680 2360259 2291887 2222618 2152586 2083440 2016972 1953735 1893757 1837330
62267 1837330 1784199 1733107 1683327 1635968 1592632 1553145 1515657 1478781 1442724 1408388 1376161
62256A376161l0426k9209k8472k7799k6698k5024k3029k0913j8676j6456j4653
62245A114806j3451j2488j1245r624q001o662n362l603j337Q38K428L613M723
62232A054635N564N947O443P620Q740Q504P250P004Q834J1490J3371J4549J5875
62219A175826J7271J8129J8535J8852J8844J8436J8564J9972K1942K3627K5874
62208A395872K9839L4369L6983L7574L8984M3185M8827N3617N7558O2296O8251
62197A907355P3924P7933Q0390Q2124Q3244Q3026Q0856P6755P0716O1888M9241
62186B727452L3382J6931K274j0535k2820l4756m5110n3350o0443o7146p2849
62175B413030p6863p9719q2125q3363q2000p8018p3088o8552o3932n8061n1131
$$ plain form
62256 1376161 1345735 1316526 1288054 1260255 1233557 1208533 1185504 1164591 1145915 1129459 1114806
62245 1114806 1101355 1088867 1077622 1067998 1059997 1053335 1047973 1044370 1043033 1043871 1046299 1049912 1054635
62232 1054635 1060199 1066146 1072589 1080209 1088949 1097453 1104703 1111707 1120541 1132031 1145402 1159951 1175826
62219 1175826 1193097 1211226 1229761 1248613 1267457 1285893 1304457 1324429 1346371 1369998 1395872
62208 1395872 1425711 1460080 1497063 1534637 1573621 1616806 1665633 1719250 1776808 1839104 1907355
62197 1907355 1981279 2059212 2139602 2221726 2304970 2387996 2468852 2545607 2616323 2678211 2727452
62186 2727452 2760834 2777765 2780039 2769504 2746684 2711928 2666818 2613468 2553025 2485879 2413030
62175 2413030 2336167 2256448 2174323 2090960 2008960 1930942 1857854 1789302 1725370 1667309 1616178
62164A616178m4922m0856l8403l5860l2422k8780k5661k2758j9522j6316j3927
62153A296751j2307j0694q745o794n124l717k611j684l31J834M095N492O442Q278
62139A270885J1105J3460J4617J5762J8069K0791K2505K3356K4717K7092K9645
62128A492004L1615L2856L3015L1489K8620K5990K4879K4886K4482K2569J9265
62117A791670J5702J3366J3222J4905J7003J8438J9435K0896K3270K6485L0690
62106B005082L6251M2954M9643N4951N8014N8442N6022N0806M3335L4469K5048
62095B515017J5661O475k655j1617j9659k6150l1692l7741m4777n1619n6952o0655
62083B193636o2879o2890o0058n5510n1331m8244m5341m2010l8662l5455l1742
$$ plain form
62164 1616178 1571256 1530400 1491997 1456137 1423715 1394935 1369274 1346516 1326994 1310678 1296751
62153 1296751 1284444 1273750 1265005 1258211 1253087 1249370 1246759 1245075 1244744 1246578 1250673 1256165 1262607 1270885
62139 1270885 1281990 1295450 1310067 1325829 1343898 1364689 1387194 1410550 1435267 1462359 1492004
62128 1492004 1523619 1556475 1589490 1620979 1649599 1675589 1700468 1725354 1749836 1772405 1791670
62117 1791670 1807372 1820738 1833960 1848865 1865868 1884306 1903741 1924637 1947907 1974392 2005082
62106 2005082 2041333 2084287 2133930 2188881 2246895 2305337 2361359 2412165 2455500 2489969 2515017
62095 2515017 2530678 2537153 2534498 2522881 2503222 2477072 2445380 2407639 2362862 2311243 2254291 2193636
62083 2193636 2130757 2067867 2007809 1952299 1900968 1852724 1807383 1765373 1726711 1691256 1659514
62072A659514k7414k3432k0536j8407j6642j5371j4350j2681j0183p859o181m142
62060A482316j068J912L595M849P397J1109J4051J4855J3663J1134P990N317L922
62047A581042L339K586J675J334J489J269L27j080l047n699q110q936q137o723
62033A551329n006k625j80J122J802M094Q895J4375J8510K1401K4118K6674K8571
62020A693080L0248L2556L5482L8521M1672M4900M7228M7667M6771M5998M5654
62009B149777M4641M2509M0601M0475M1750M2353M1029L8832L7557L7009L4913
61998B591446K9744K2509J4925O976k294j2300k1093k7873l3592l8956m3618m7697
61986B438177n2226n7385o1926o5140o7742o9835o9832o6782o2316n8612n5654
$$ plain form
62072 1659514 1632100 1608668 1588132 1569725 1553083 1537712 1523362 1510681 1500498 1492639 1486458 1482316
62060 1482316 1481248 1483160 1486755 1491604 1499001 1510110 1524161 1539016 1552679 1563813 1571803 1577120 1581042
62047 1581042 1584381 1586967 1588642 1589976 1591465 1592734 1593061 1591981 1588934 1583235 1575125 1566189 1558052 1551329
62033 1551329 1546323 1543698 1543518 1544640 1546442 1550536 1559431 1573806 1592316 1613717 1637835 1664509 1693080
62020 1693080 1723328 1755884 1791366 1829887 1871559 1916459 1963687 2011354 2058125 2104123 2149777
62009 2149777 2194418 2236927 2277528 2318003 2359753 2402106 2443135 2481967 2519524 2556533 2591446
61998 2591446 2621190 2643699 2658624 2665600 2663306 2651006 2629913 2602040 2568448 2529492 2485874 2438177
61986 2438177 2385951 2328566 2266640 2201500 2133758 2063923 1994091 1927309 1864993 1806381 1750727
61975A750727n2235m8498m5536m3129m0038l6229l2837k9963k6457k2175j8674
61964A354956j7045j6513j5922j5444j5865j7067j8170j8806j9407k0204k0502
61953A160011j9284j6532j3601j1896j1210j0027p533m493j726J056M093O282
61941A075140O487N561N478O602P232N962L198J67k380m097m882n321o387q280
61927A084480j0240j1837j3428j5014j5683j4986j3963j3772j3858j2554r369
61916I39776n904m257m937o484o930n571l333j441m2J547L521N245O249O794P255
61901I31488P698Q393J0047J2754J5324J6411J6151J5967J6857J8490K0052K1346
61889A110978K2869K5253K8877L3609L8622M2625M4797M5662M6848M9760N4297
$$ plain form
61975 1750727 1698492 1649994 1604458 1561329 1521291 1485062 1452225 1422262 1395805 1373630 1354956
61964 1354956 1337911 1321398 1305476 1290032 1274167 1257100 1238930 1220124 1200717 1180513 1160011
61953 1160011 1140727 1124195 1110594 1098698 1087488 1077461 1069928 1065435 1063709 1064765 1068858 1075140
61941 1075140 1081627 1087188 1092666 1099268 1106500 1112462 1115660 1115827 1113447 1109350 1104468 1099147 1092760 1084480
61927 1084480 1074240 1062403 1048975 1033961 1018278 1003292 989329 975557 961699 949145 939776
61916 939776 933872 929615 924678 918194 911264 905693 902360 900919 900877 902424 905945 911190 917439 924233 931488
61901 931488 939186 947579 957626 970380 985704 1002115 1018266 1034233 1051090 1069580 1089632 1110978
61889 1110978 1133847 1159100 1187977 1221586 1260208 1302833 1347630 1393292 1440140 1489900 1544197
61878A544197N8864O1754O2587O2452O2558O2803O1833N8603N3737M9005M5510
61867B183903M2625L8842L3294K6279J8657J1270M711r01n877j0265j3309j4190
61855B315039j3228j1588r614o277p29O231J2784J7795K1438K4528K7598L0251
61843B414228L0990K8166K1645J3165M731l092j0870j8953k7015l4453m0616m5009
61831B332917m7852n0020n1843n2473n1196m8721m6315m4182m1750l9078l6719
61820A822768l4485l1764k9003k7434k7045k6240k4031k1321j9337j7763j5262
61809A549083j1145n897n48M049P850J1878J7140K3032K7727L0689L3777L9053
61797A726688M6293N3596N9805O5217P0299P4980P9293Q3762Q8626R3179R6140
$$ plain form
61878 1544197 1603061 1664815 1727402 1789854 1852412 1915215 1977048 2035651 2089388 2138393 2183903
61867 2183903 2226528 2265370 2298664 2324943 2343600 2354870 2359581 2358680 2352803 2342538 2329229 2315039
61855 2315039 2301811 2290223 2280609 2274332 2273603 2279834 2292618 2310413 2331851 2356379 2383977 2414228
61843 2414228 2445218 2473384 2495029 2508194 2512925 2509833 2498963 2480010 2452995 2418542 2377926 2332917
61831 2332917 2285065 2235045 2183202 2130729 2079533 2030812 1984497 1940315 1898565 1859487 1822768
61820 1822768 1788283 1756519 1727516 1700082 1673037 1646797 1622766 1601445 1582108 1564345 1549083
61809 1549083 1537938 1532041 1531493 1535542 1543392 1555270 1572410 1595442 1623169 1653858 1687635 1726688
61797 1726688 1772981 1826577 1886382 1951599 2021898 2096878 2176171 2259933 2348559 2441738 2537878
61786B537878R6607R4639R1014Q6309Q0206P1914O1230M8767L5184K0961P134
61775C231843m680j3658k0431k5653k8549k7873k3905j8347j2341n769J419Q173
61763C060229J3180J5926J6336J3865P747j883j3653k6034l8510n1349o4178p5317
61751B856359q3091q7634r0669r3339r4982r4399r1634q7763q3432p8487p2920
61740A898009o7426o2831n9403n6634n3551m9431m4619m0299l7128l4556l2007
61729A360124k9980k9122k8670k7114k4216k1229j9012j7151j5180j3473j2410
61718A122567j1689j1070j0888j1253j1444j0803r552q163o649n087m024l615
61706A018330l093j921p05n5O27K021L316L272K391K259K857K471N48j174j290
$$ plain form
61786 2537878 2634485 2729124 2820138 2906447 2986653 3058567 3119797 3168564 3203748 3224709 3231843
61775 3231843 3227163 3213505 3193074 3167421 3138872 3110999 3087094 3068747 3056406 3050637 3052056 3060229
61763 3060229 3073409 3089335 3105671 3119536 3127283 3125400 3111747 3085713 3047203 2995854 2931676 2856359
61751 2856359 2773268 2685634 2594965 2501626 2406644 2312245 2220611 2132848 2049416 1970929 1898009
61740 1898009 1830583 1767752 1708349 1651715 1598164 1548733 1504114 1463815 1426687 1392131 1360124
61729 1360124 1330144 1301022 1272352 1245238 1221022 1199793 1180781 1163630 1148450 1134977 1122567
61718 1122567 1110878 1099808 1088920 1077667 1066223 1055420 1045868 1037705 1031056 1025969 1021945 1018330
61706 1018330 1015237 1013316 1012611 1012556 1013183 1015204 1018520 1021792 1024183 1026442 1029299 1031770 1032318 1031144 1029854
61691A029854p42j042j776j533m52j75j374k795l068k340j735j898k582l231l658
61676A001453m204n246o392o422m511j381J301K685L411M367N396N612M786L891
61662A004746M041N086N622M618K725J434J137Q12k44j306j448j038j246k599
61648A022340m847p661j0461j2087j1837j0607r830r542q730p396o649o775o934
61635I08984p052q076r692r898q019o306o754q001p510n579m620n097m970l320
61621H14090j829j884k492k305j878k362l321l453k628j736j048k09M87K32q56
61606G88808j617j310l40O04J282J624J578J463J877K911L977M587M874N095N327
61591H20740N817O934Q349Q955Q321P632Q355J0261J1675J1574J0459R030P156
$$ plain form
61691 1029854 1029112 1028070 1026294 1024761 1024309 1024134 1022760 1019965 1016897 1014557 1012822 1010924 1008342 1005111 1001453
61676 1001453 997249 992003 985611 979189 974678 973297 974598 977283 980694 985061 990457 996069 1000855 1004746
61662 1004746 1008787 1013873 1019495 1024113 1026838 1028272 1029409 1030221 1029977 1028671 1027223 1026185 1024939 1022340
61648 1022340 1017493 1009832 999371 987284 975447 964840 955010 945468 936738 929342 922693 915918 908984
61635 908984 901932 893856 884164 874266 866247 859941 853187 845186 837676 832097 827477 822380 817410 814090
61621 814090 812261 810377 807885 805580 803702 801340 798019 794566 791938 790202 789154 788945 789432 789664 788808
61606 788808 787191 785881 785541 786145 787427 789051 790629 792092 793969 796880 800857 805444 810318 815413 820740
61591 820740 826557 833491 841840 850795 859116 866748 875103 885364 897039 908613 919072 928102 935258
61578I35258M712K545J636J623J051r12l584n619o427o563o962p769q099p256
61564H93634o112o320p936q844p518n268m399m934m924l737k843l055l202k578
61550H21964k694m999q273j0275j0979j2200j4289j5368j4133j1839j0763j1665
61538F94487j3289j3795j2310r536p103o092o258o757p056o746n376l372k320
61525E94477l136m497m559l623l395l962l623j947p54j202j885j143L76J018O96
61510E62841M63M11j72r59p85K18L86j142l063l630k718j411k17J249K906L628
61494E58005K561N09p81o02J06L83M69R34J364J092O79J330K871L711L185K584
61478E78400L297N004O448P039O787N565L586K016J871K520K292O38j234k044
$$ plain form
61578 935258 939970 942515 944151 945774 946825 945913 942329 936710 930283 923720 916758 908989 900890 893634
61564 893634 887522 881202 873266 864422 856904 851636 847237 842303 837379 833642 830799 827744 824542 821964
61550 821964 819270 814271 805998 795723 784744 772544 758255 742887 728754 716915 706152 694487
61538 694487 681198 667403 655093 645557 638454 632362 626104 619347 612291 605545 600169 596797 594477
61525 594477 591341 586844 582285 578662 575267 571305 567682 565735 564981 563779 561894 560751 561127 562145 562841
61510 562841 563304 563715 563543 562584 561799 562017 562403 561261 558198 554568 551850 550439 550222 551471 554377 558005
61494 558005 560566 561075 560294 559692 559798 560181 560650 561584 562948 564040 564719 566049 568920 572631 575816 578400
61478 578400 581697 586701 593149 600188 606975 612540 616126 618142 620013 622533 624825 625463 624229 622185
61464F22185k035k410l541m333l589j725m84p07j195n52N37K19j655l224l295
61449E94196k660k166j278L80J703J724J226J211R30o40k351k057O4J533R77m22
61433E92370j143j158q76J02K154M517N861N440L351L95j990k627j889j338j576
61418F01593j411L15K909M651M827M077L116K017P67k12m16J10O83N70l34j446
61402F21816k080j944j013O14K456L660L760L176K560K039J566J540K244L158
61388F43552L673M089M930N622N137L804L137L678M358M336M227M981O587Q371
61374G10482R633R661Q162O177N384N960O353N705N037N082M565K308j20l4K600
61359G86955N022N335M458M028M063L641K714K070J937J593L22j749l775m922
$$ plain form
61464 622185 620150 617740 614199 609866 606277 604552 604068 603361 602166 601614 602151 602370 600715 597491 594196
61449 594196 591536 589370 588092 588472 590175 591899 593125 594336 595266 594626 592275 590218 590282 591815 592792 592370
61433 592370 591227 590069 589193 589295 591449 595966 601827 607267 610618 611013 609023 606396 604507 603169 601593
61418 601593 600182 600497 603406 608057 612884 616961 620077 622094 622861 622649 622233 622343 623026 623596 623262 621816
61402 621816 619736 617792 616779 617393 619849 623509 627269 630445 633005 635044 636610 638150 640394 643552
61388 643552 647225 651314 656244 661866 667003 670807 673944 677622 681980 686316 690543 695524 702111 710482
61374 710482 720115 729776 737938 744115 749499 755459 761812 767517 772554 777636 782201 784509 784389 784355 786955
61359 786955 791977 797312 801770 805798 809861 813502 816216 818286 820223 821816 822138 820389 816614 811692
61345H11692n060m783m705m810m709m373m146l982l280j719R7J208J358J118R72
61330G74878P15m4j036j497j233j023j522k029j006K035N638P596O810M032J147
61315G93461j21O26K250L262L353L337L620L506K518J548J879L444M978N701N952
61300H39314O103N882N319N581P868J1520J4157J4221J2913J2892J5067J7567
61288I68404J8301J7633J7648J9183K0839K1042J9892J8450J7059J5240J2849
61277A166540J0564R178Q713Q232O585L702R67k34k85q25k509m400n761p085q613
61262A184769r298q396p076o865p346o900n371m221m061l739k184J64K292L858
61248A125626M972N703O263O952P544P486P058P280Q165Q077N771K339j9p83j568
$$ plain form
61345 811692 806632 801849 797144 792334 787625 783252 779106 775124 771844 770125 770222 771430 772788 773906 774878
61330 774878 775593 775549 774513 773016 771783 770760 769238 767209 766203 768238 773876 781472 788282 792314 793461
61315 793461 793340 793966 796216 799478 802831 806168 809788 813294 815812 817360 819239 822683 827661 833362 839314
61300 839314 845417 851299 856618 862199 870067 881587 895744 909965 922878 935770 950837 968404
61288 968404 986705 1004338 1021986 1041169 1062008 1083050 1102942 1121392 1138451 1153691 1166540
61277 1166540 1177104 1186282 1194995 1203227 1209812 1213514 1214481 1214247 1213962 1213137 1210628 1206228 1200467 1193382 1184769
61262 1184769 1175471 1167075 1159999 1153134 1145788 1138888 1133517 1129296 1125235 1121496 1119312 1119476 1121768 1125626
61248 1125626 1130598 1136301 1142564 1149516 1157060 1164546 1171604 1178884 1187049 1195126 1200897 1203236 1203217 1202434 1200866
61233A200866l746o534q036p687o917p253q305q287o423m001k675k466k287j682
61219A124567q87M15K792N433O501N694N096O489R003J0630J1014J1288J1773
61206A209808J1683J0975J0899J2164J3970J5450J7028J9420K2137K3910K4258
61195A391702K3646K2452K0699J8782J7311J5951J3343Q886L983O27r47k385n139
61182A528911r109j3362j7129j9701k0299j8927j6936j5893j5949j5941j4864
61171A350801j2748j0259q066o634n986n496m285k053N51K470L105K861K768L171
61157A310200K938Q69k023l012j109J355J862J071J183K028J383j073k890k518
61143A310264j309p88j91J636L829M936N445O886R309J1504J3202J5147J7334
$$ plain form
61233 1200866 1197120 1190586 1182550 1174863 1167946 1160693 1152388 1144101 1137678 1133677 1131002 1128536 1126249 1124567
61219 1124567 1123680 1124095 1126887 1132320 1138821 1144515 1149611 1156100 1165103 1175733 1186747 1198035 1209808
61206 1209808 1221491 1232466 1243365 1255529 1269499 1284949 1301977 1321397 1343534 1367444 1391702
61195 1391702 1415348 1437800 1458499 1477281 1494592 1510543 1523886 1532772 1536755 1537382 1536435 1534050 1528911
61182 1528911 1519802 1506440 1489311 1469610 1449311 1430384 1413448 1397555 1381606 1365665 1350801
61171 1350801 1338053 1327794 1319728 1313094 1307108 1301612 1297327 1295274 1295825 1298295 1301400 1304261 1307029 1310200
61157 1310200 1313138 1314007 1311984 1308972 1307863 1309218 1311080 1312151 1313334 1315362 1316745 1315672 1312782 1310264
61143 1310264 1308955 1308167 1307976 1309612 1313441 1318377 1323822 1330708 1340017 1351521 1364723 1379870 1397204
61130A397204J8798J8974J8022J5977J2994J0079Q185O880N231L710L463M038
61118A523555L706K160Q92M78l94k366l851l451k429l102n734q543j0131j0495
61104A480295j0098r489r689j1527j4297j6187j6470j6335j7103j8317j8399j6826
61092A305558j4720j3146j1566q760m992k249j918l082l883m060m986p354r995
61079A214847j1253j0706r114p431o270n719n341m710l994l382k143O22M179O501
61065A156086O961P300R155J1960J4401J6594J9138K1208K1608K1244K2276K4750
61053A352681K6219K5355K3983K4424K6266K7169K5877K3101J9998J7222J5271
61042A607566J4461J4290J3622J1771Q877N232R79l364o895r313j1417j4125j7351
$$ plain form
61130 1397204 1416002 1434976 1452998 1468975 1481969 1492048 1500233 1507113 1512344 1516054 1519517 1523555
61118 1523555 1527261 1529421 1530313 1530791 1530397 1528031 1524180 1520729 1518300 1515198 1509464 1500921 1490790 1480295
61104 1480295 1470197 1460708 1451019 1439492 1425195 1409008 1392538 1376203 1359100 1340783 1322384 1305558
61092 1305558 1290838 1277692 1266126 1257366 1252374 1250125 1248207 1245125 1241242 1237182 1232196 1224842 1214847
61079 1214847 1203594 1192888 1183774 1176343 1170073 1164354 1159013 1154303 1150309 1146927 1144784 1145406 1149585 1156086
61065 1156086 1163047 1170347 1179502 1191462 1205863 1222457 1241595 1262803 1284411 1305655 1327931 1352681
61053 1352681 1378900 1404255 1428238 1452662 1478928 1506097 1531974 1555075 1575073 1592295 1607566
61042 1607566 1622027 1636317 1649939 1661710 1670587 1675819 1676798 1673434 1666539 1657226 1645809 1631684 1614333
61029A614333k0215k2041k2577k1707j9716j7786j7188j7773j8000j6874j5063
61018A405393j3608j2441j1083j0013j0001j0394r515o847l620r48J323L519N164
61005A326929N953O697Q429J1204J4495J7993K1254K3369K3971K4135K5322K7906
60993A537657L1397L5413L9548M3094M6080M9900N5553O1800O6524O9624P3010
60982B109600P7883Q3700Q9823R6469J03503J09913J15230J20327J26196J32876
60972C165520J40090J47929J56329J64879J73619J83155J93577K04345K15498
60963D744941K27702K40561K52495K63165K74773K89898L09109L31707L57512
60954G291863L86767M19377M55506M95921N40642N88824O41567P03296P78132
$$ plain form
61029 1614333 1594118 1572077 1549500 1527793 1508077 1490291 1473103 1455330 1437330 1420456 1405393
61018 1405393 1391785 1379344 1368261 1358248 1348247 1337853 1328338 1321491 1317871 1316923 1318246 1321765 1326929
61005 1326929 1332882 1339579 1348008 1359212 1373707 1391700 1412954 1436323 1460294 1484429 1509751 1537657
60993 1537657 1569054 1604467 1644015 1687109 1733189 1783089 1838642 1900442 1966966 2036590 2109600
60982 2109600 2187483 2271183 2361006 2457475 2560978 2670891 2786121 2906448 3032644 3165520
60972 3165520 3305610 3453539 3609868 3774747 3948366 4131521 4325098 4529443 4744941
60963 4744941 4972643 5213204 5465699 5728864 6003637 6293535 6602644 6934351 7291863
60954 7291863 7678630 8098007 8553513 9049434 9590076 10178900 10820467 11523763 12301895
60945A2301895Q66311R66856J082537J218601J377213J557263J759840J988915
60937B3119431K245332K525864K829312L149065L439450L588146L449112K940268
60929D7285980K129528J221578M46347n4907k59028k19356l1929J58693J67893
60920E0844799j53995q20870j683508k514068l131549l468704l553517l454282
60912C2064306l240099k966287k670946k376265k094767j835469j604428j402597
60904A3873448j227043j074561r42834q29337p31615o48579n79495n21610m70603
60895F847771m23777l81334l44071l11292k81556k54162k28979k05935j85653
60886D231012j69633j58497j50607j43584j36781j30915j25579j18849j09979
$$ plain form
60945 12301895 13168206 14135062 15217599 16436200 17813413 19370676 21130516 23119431
60937 23119431 25364763 27890627 30719939 33869004 37308454 40896600 44345712 47285980
60929 47285980 49415508 50637086 51083433 51028526 50769498 50550142 50518213 50676906 50844799
60920 50844799 50690804 49869934 48186426 45672358 42540809 39072105 35518588 32064306
60912 32064306 28824207 25857920 23186974 20810709 18715942 16880473 15276045 13873448
60904 13873448 12646405 11571844 10629010 9799673 9068058 8419479 7839984 7318374 6847771
60895 6847771 6423994 6042660 5698589 5387297 5105741 4851579 4622600 4416665 4231012
60886 4231012 4061379 3902882 3752275 3608691 3471910 3340995 3215416 3096567 2986588
60877B986588j01002r4584r1013q8310q4749q0213p5309p0464o6159o2959o0628
60866B111198n7883n3823m9279m5858m3764m1410l7521l2825k9150k7222k6222
60855A666241k5213k4014k2484j9974j6247j2324r416p276m531p63K713M433M465
60842A535610L981L837M230N371P553J0438J2947J4184J4255J3988J3982J4059
60830A654435J3653J2678J1757J1447J1335J0375Q252N874M212L060J562m38k332
60817A745870m004o241r536j3098j5689j7168j8576k0612k2668k3659k3443k2947
60805A548229k2981k3487k4064k4608k5019k4815k3686k2210k1309k1110k1103
60794A293837k1347k2538k4508k5664k4545k1374j7554j4308j2400j2323j3742
$$ plain form
60877 2986588 2885586 2791002 2699989 2611679 2526930 2446717 2371408 2300944 2234785 2171826 2111198
60866 2111198 2053315 1999492 1950213 1904355 1860591 1819181 1781660 1748835 1719685 1692463 1666241
60855 1666241 1641028 1617014 1594530 1574556 1558309 1545985 1536569 1529293 1524762 1523999 1526712 1531145 1535610
60842 1535610 1539591 1543428 1547658 1553029 1560582 1571020 1583967 1598151 1612406 1626394 1640376 1654435
60830 1654435 1668088 1680766 1692523 1703970 1715305 1725680 1733932 1739806 1744018 1747078 1748640 1748202 1745870
60817 1745870 1741866 1735625 1726089 1712991 1697302 1680134 1661558 1640946 1618278 1594619 1571176 1548229
60805 1548229 1525248 1501761 1477697 1453089 1428070 1403255 1379569 1357359 1336050 1314940 1293837
60794 1293837 1272490 1249952 1225444 1199780 1175235 1153861 1136307 1121999 1109599 1097276 1083534
60783A083534j5193j5366j4498j3822j3987j4794j6027j7379j7918j6846j4792
60772I12912j3188j2347j1346r798q350p209n754m093l438m073m413l317j937
60759H23649j842k459k185j144o90o66N45K944M248L173J462J274K096J925M53
60744H32783q19j181j421j830j386K71J534P14j586l305l616l518l822l955l290
60729H05573k519k751l893m870n221n505o111o592o498o163o205o681p249p744
60715G27571q023p618o255m667m115m796n323m277j996k23o6q21j028k40P01R30
60699F79754N94M32P51J147J123O88K98M21J155K227L242L964M297M204L865L878
60683G12040M832O358P024N672K702l70k519l823m584m731m356m211m978o357
$$ plain form
60783 1083534 1068341 1052975 1038477 1024655 1010668 995874 979847 962468 944550 927704 912912
60772 912912 899724 887377 876031 866233 857883 850674 844920 840827 837389 833316 828903 825586 823649
60759 823649 821807 819348 817163 816019 815329 814663 815208 818152 822400 825573 827035 828309 830405 832330 832783
60744 832783 831964 830783 829362 827532 826146 826417 827951 828665 827079 823774 820158 816640 812818 808863 805573
60729 805573 803054 800303 796410 791540 786319 780814 774703 768111 761613 755450 749245 742564 735315 727571
60715 727571 719548 711930 705675 701008 696893 692097 686774 682497 680501 680278 680212 679391 678363 678123 678824 679754
60699 679754 680348 680780 681531 682678 683801 684489 684787 685208 686363 688590 691832 695796 700093 704297 708162 712040
60683 712040 716872 723230 730254 735926 738628 738258 735739 731916 727332 722601 718245 714034 709056 702699
60669G02699p419p724p564p130o145m574l182k891l724m808n436n593n388m536
60655F26585k960j590j653l038m021l082o04J622K179R42j244l140l634k560j028
60640F02774l20m14k80L59N28m18j533j380R3J608K272K475K932L539L627L137
60624F18999K970L968N688O571N610L723L061M756P621R416R214Q119P643P868
60610G05227P681O504N053M159L515K290O12l75J1J201K124K090P99j573l858
60595G35460m443l075j463j279k161k537j790o87j37n69k114m287n816n953n497
60580F93652n425n047l184p94l03k164m151m611m371m473m148k523o78j45m75
60565F51160j63Q36J297R33O41P51O62K65L37J233K304K860K892K667K352K170
$$ plain form
60669 702699 695280 687556 679992 672862 666717 662143 658961 656070 652346 647538 642102 636509 631121 626585
60655 626585 623625 622035 620382 617344 613323 610241 609637 611259 613438 614380 613136 609996 606362 603802 602774
60640 602774 602454 602040 601760 602119 602647 602229 600696 599316 599409 601017 603289 605764 608696 612235 615862 618999
60624 618999 621969 625937 631625 638196 643806 647529 650590 655346 662967 672383 681597 689716 697359 705227
60610 705227 712908 719412 724465 728624 732139 734429 735041 734666 734677 735878 738002 740092 740891 739318 735460
60595 735460 731017 727942 726479 725200 723039 720502 718712 718025 717888 717319 715205 710918 705102 699149 693652
60580 693652 688227 683180 679996 679202 678899 676735 672584 667973 663602 659129 654981 652458 651780 651635 651160
60565 651160 650997 651833 653130 654063 654704 655455 656117 656382 656719 657952 660256 663116 666008 668675 671027 673197
60549F73197K353K914L804M997N962N712M180K902L278M582M928L924L046L406
60535G29185M546N580O203O160M913K634O69L55J682L523M784N066M721M492M844
60520G89357N496N887O048O537P656R231J1075J3076J4905J6260J7357J8656K0237
60507I41778K1962K4026K6500K8540K8958K7561K5146K2271J8936J5286J1586
60496A192550P432K208l478p843r644q994o503k791J022L724N489P813J1558J6054
60482A208597K0572K5244K9934L3694L6388L9599M4706N0896N6204N9555O0552
60471A665941N8322N2334M3861L4931K5929J5806M632n651j3405j8870k2967k5661
60459A815202k6406k5517k4179k3116k1805j9070j4372q448k758J834N633R458
$$ plain form
60549 673197 675550 678464 682268 687265 693227 698939 703119 706021 709299 713881 718809 722733 725779 729185
60535 729185 733731 739311 745514 751674 756587 759221 759890 760245 761927 765450 770234 775300 780021 784513 789357
60520 789357 794853 800740 806788 813325 820981 830212 841287 854363 869268 885528 902885 921541 941778
60507 941778 963740 987766 1014266 1042806 1071764 1099325 1124471 1146742 1165678 1180964 1192550
60496 1192550 1199982 1202190 1198712 1190869 1181225 1172231 1165728 1162937 1163959 1167683 1173172 1180985 1192543 1208597
60482 1208597 1229169 1254413 1284347 1318041 1354429 1394028 1438734 1489630 1545834 1605389 1665941
60471 1665941 1724263 1776597 1820458 1855389 1881318 1897124 1901756 1896105 1882700 1863830 1840863 1815202
60459 1815202 1788796 1763279 1739100 1715984 1694179 1675109 1660737 1652289 1649531 1651365 1656998 1666456
60447A666456J3662J8102K2683K7536L2752L8275M4012M9947N6387O3990P2978
60436B106780Q2103Q9194R3209R5016R5606R4346Q9915Q2257P2381O0777M7456
60425C009040L3546K1463J3087Q553O836O344M800j75r607k2856l8936n7103p5876
60412B899116r2763j05942j15350j21389j23551j21426j16215j09823j02792r4492
60402A795373q5228p6684o9996o4546n9123n3382m7656m2236l7512l4110l2150
60391A192750l0633k8273k4768k0906j7720j5881j5386j5401j4706j2941j1113
60380I85022j0329j0336j0019q971p748o746n890n392n729o520o543n419m430
60367H90950m866o275p161o920o228n802n609n196m255k964k171k797m504n438
$$ plain form
60447 1666456 1680118 1698220 1720903 1748439 1781191 1819466 1863478 1913425 1969812 2033802 2106780
60436 2106780 2188883 2278077 2371286 2466302 2561908 2656254 2746169 2828426 2900807 2961584 3009040
60425 3009040 3042586 3064049 3077136 3085689 3092525 3098869 3103669 3103494 3093887 3071031 3032095 2974992 2899116
60412 2899116 2806353 2700411 2585061 2463672 2340121 2218695 2102480 1992657 1889865 1795373
60402 1795373 1710145 1633461 1563465 1498919 1439796 1386414 1338758 1296522 1259010 1224900 1192750
60391 1192750 1162117 1133844 1109076 1088170 1070450 1054569 1039183 1023782 1009076 996135 985022
60380 985022 974693 964357 954338 945367 937619 930873 924983 919591 913862 907342 900799 895380 890950
60367 890950 886084 879809 872648 865728 859500 853698 848089 842893 838638 835674 833503 830706 826202 820764
60353H20764m127j337Q08J251O39j46q81j398j318p87m77l81L07J567J843o2k935
60336H13330m125k469O27K979L783L720L607L497L105K499J979J467P12J26P05
60321H35542K557M248M427L547K968K808K097R26P68K278M219N273N690O204O509
60306H90061O021N230M995N063M564L638L318L940M817N487O258P352Q497R577
60292I68818J0930J2629J4109J4785J4671J4222J3961J4237J4830J4695J2663
60281A120550Q634L787n45l882o456q545j0174j1185j1382j0688r386q084p357
60268A045287p291p284o532m992l803m093n241n214l134p39k85j445j510J294
60254I95018N795R483J1223J1749J2308J3534J5394J7522J9642K2103K5847L1321
$$ plain form
60353 820764 816637 815300 816108 817359 817998 817852 816971 815573 814255 813468 812991 812610 812917 814484 816327 816265 813330
60336 813330 809205 806736 807363 810342 814125 817845 821452 824949 828054 830553 832532 833999 834711 834837 835542
60321 835542 838099 842347 846774 850321 853289 856097 858194 859120 859888 862166 866385 871658 877348 883552 890061
60306 890061 896082 901312 906307 911370 915934 919572 922890 926830 931647 937134 943392 950744 959241 968818
60292 968818 979748 992377 1006486 1021271 1035942 1050164 1064125 1078362 1093192 1107887 1120550
60281 1120550 1129184 1132971 1132426 1128544 1122088 1113543 1103369 1092184 1080802 1070114 1060728 1052644 1045287
60268 1045287 1037996 1030712 1024180 1019188 1015385 1011292 1006051 1000837 997703 996964 996679 995234 993724 995018
60254 995018 1000813 1010296 1021519 1033268 1045576 1059110 1074504 1092026 1111668 1133771 1159618 1190939
60242A190939L7343M1581M2336L9631L4282K6512J6155L994q120j8856k8290l6605
60230A340902m2631m4832m3399m0236l6864l3438k9895k6653k3751k0505j6854
60219I81844j3976j2598j1736j0200q584q339r361r931q908o824m799l558l492
60206H69538m524n650n675m645l731l544l506l144k862k956k826j881n48J80j60
60191H24066j267k327k169n6L142N198M730K678J027O35J118K103L457M556M654
60176H51545M137M278N401O320O093N266M692M032K692J565K261M560O180N595
60162I14617L808K493J717P54J10R23K672L436K669K043K866M288M950M990N122
60147I57458M936L841K950M084O914Q758P758M984K850K473L263M224M700M291
$$ plain form
60242 1190939 1228282 1269863 1312199 1351830 1386112 1412624 1428779 1432773 1424653 1405797 1377507 1340902
60230 1340902 1298271 1253439 1210040 1169804 1132940 1099502 1069607 1042954 1019203 998698 981844
60219 981844 967868 955270 943534 933334 924750 916411 907050 897119 888211 881387 876588 873030 869538
60206 869538 865014 859364 853689 849044 845313 841769 838263 835119 832257 829301 826475 824594 824046 824226 824066
60191 824066 822799 820472 818303 818247 821389 826587 831317 833995 835022 835657 836775 838878 842335 846891 851545
60176 851545 855682 859960 865361 871681 877774 883040 887732 891764 894456 896021 898282 902842 909022 914617
60162 914617 918425 920918 922635 923389 923499 924422 927094 930530 933199 935242 938108 942396 947346 952336 957458
60147 957458 962394 966235 969185 973269 980183 988941 996699 1001683 1004533 1007006 1010269 1014493 1019193 1023484
60133A023484L050J767J353J634J375j6j295p54J150J814k05k891l203j152M52
60118A026563J98k17Q22K193K131J232J371K698L825M265M667M941M325L143K631
60103A064788K783K231M91j292k125k133j546m62J42q68k592k601l69J844K564
60088A060855L352N955R219J0896J1093J1555J2475J2367J0834R224Q545Q511
60076A174881Q896R959J1173J1056R013O161L686J438j131l612n115n517n440
60063A215448n315n132m934m759m181k600k26J721K354K326L111N006O600O646
60049A216065N784N608O519P504P937Q281Q734Q475O993N267M594M830M680L361
60035A304632J074j789m895p354p904o154l298j227r63j973k916l027k762k998
$$ plain form
60133 1023484 1026534 1028301 1029654 1031288 1032663 1032647 1031352 1030598 1031748 1033562 1033357 1030466 1027263 1026111 1026563
60118 1026563 1026761 1026544 1027366 1029559 1031690 1032922 1034293 1036991 1040816 1045081 1049748 1054689 1059014 1062157 1064788
60103 1064788 1067571 1069802 1070293 1069001 1066876 1064743 1063197 1062735 1062877 1062009 1059417 1056816 1056447 1058291 1060855
60088 1060855 1064207 1070162 1079381 1090277 1101370 1112925 1125400 1137767 1148601 1157825 1166370 1174881
60076 1174881 1183777 1193736 1204909 1215965 1224978 1231139 1234825 1236263 1235132 1231520 1226405 1220888 1215448
60063 1215448 1210133 1205001 1200067 1195308 1191127 1188527 1188301 1190022 1192376 1194702 1197813 1202819 1209419 1216065
60049 1216065 1221849 1227457 1233976 1241480 1249417 1257698 1266432 1274907 1281900 1287167 1291761 1296591 1301271 1304632
60035 1304632 1305706 1303917 1299022 1291668 1283764 1277610 1274312 1273085 1272122 1270149 1267233 1264206 1261444 1258446
60021A258446l874m777n279n397n065m323m150n920r465j2681j3866j3580j3345
60008A156724j3462j3287j2937j3173j3832j3815j2791j1694j1318j1390j1326
59997A017699j0999j0427r475q315p555p504p610o988n241k730l32J065J225P57
59983I43570L36p0p56j295p64R34K683L298K628J395M16R8K75K81n17k211m418
59966I45883o664q257q229o216l435j930k537m160n280n634n989o832p643p372
59952H65705n325j816J865M256M668L401J385j81k56J246L125L982L671L165L119
59937H92010L278L239K901J996J43k171l565l333k416k038k042j421j76N34J82
59922H87121j23J075L669N946O351M908K769P11j293l044l516j999N10K089K010
$$ plain form
60021 1258446 1254572 1249795 1244516 1239119 1234054 1229731 1225581 1219661 1210196 1197515 1183649 1170069 1156724
60008 1156724 1143262 1129975 1117038 1103865 1090033 1076218 1063427 1051733 1040415 1029025 1017699
59997 1017699 1006700 996273 986798 978483 970928 963424 955814 948826 943585 940855 940523 941588 942813 943570
59983 943570 943906 943836 943080 941785 941021 941955 944638 947936 950564 951959 952375 952473 952748 953029 952512 950301 945883
59966 945883 939219 930962 922733 916517 913082 911152 908615 904455 899175 893541 887552 880720 873077 865705
59952 865705 860380 858564 860429 864685 869353 872754 874139 873958 873702 874948 878073 882055 885726 888891 892010
59937 892010 895288 898527 901428 903424 903567 901396 897831 894498 892082 890044 888002 886581 886405 886939 887121
59922 887121 886998 888073 891742 897688 904039 908947 911716 912427 911134 908090 904574 902575 903085 905174 907184
59907I07184J273R11Q05O34R22K274M194N665O500P225P915P984P049N187K507
59892I68229o26l028l397j883j25N98N04L02ko22j094q05o6J86l75j189j629j496
59874I53482p43N03J596J619L42j393k446k303j248%P59R64J373K793M961O625
59858I66884O908O123N144M496M458N321O968Q398Q495P235N707M847M560M096
59844A049640L065J918J426J691J798R15l73n51P64K092K046J280J468K816L766
59829A073761L207J872J276K008L434M435M166K623Q42J36Q78K244L206L379K993
59814A110460K486K179J872Q01j438m086n877o401o142n427m298l221k724k256
59800A075928q05J124J618J09j460j181L86J564K230L550N738P802R352J1098
$$ plain form
59907 907184 908457 909368 910173 910807 911729 914003 918197 923862 930362 937587 945502 953486 960535 965722 968229
59892 968229 967603 964575 961178 959295 959170 959768 960272 960574 960572 959950 958856 958051 957985 958171 957796 956607 954978 953482
59874 953482 952739 953242 954838 956457 956799 955406 952960 950657 949409 949409 950168 951132 952505 955298 960259 966884
59858 966884 973792 979915 985059 989555 994013 999334 1006302 1014700 1023195 1030430 1036137 1040984 1045544 1049640
59844 1049640 1052705 1054623 1056049 1057740 1059538 1060453 1060080 1059529 1060293 1062385 1064431 1065711 1067179 1069995 1073761
59829 1073761 1076968 1078840 1080116 1082124 1085558 1089993 1094159 1096782 1097624 1097760 1098638 1100882 1104088 1107467 1110460
59814 1110460 1112946 1115125 1116997 1117798 1116360 1112274 1106397 1099996 1093854 1088427 1084129 1080908 1078184 1075928
59800 1075928 1075123 1076247 1077865 1077974 1076514 1075333 1075719 1077283 1079513 1083063 1088801 1096603 1105955 1117053
59786A117053J3395J5515J6744J7209J7180J6251J3742R598M685M19k071k698
59774A237022k350j885j530j620l193o918j1675j5226j6537j6721j7423j8860
59762A123084j9756j8905j6475j3933j2656j2616j2469j1043q452n669l506k275
59750I85329j911j927j633r57o99j432k503k864k540k504l224m129m571m658m894
59735I44883n420n812n485m313k824j628p06L02J043N04j530l847n211n683n878
59720H98395n746m946l908l504l976m869n658n767m666k734j346j251j574j372
59706H47078j306k404l945m182k704n71J416L028L733L367L327M995P147P155
59692H66134M868K979L130M101M580N164O253O422M748K978L195M635M891L323
$$ plain form
59786 1117053 1130448 1145963 1162707 1179916 1197096 1213347 1227089 1236687 1241372 1241791 1239720 1237022
59774 1237022 1234672 1232787 1231257 1229637 1226444 1219526 1207851 1192625 1176088 1159367 1141944 1123084
59762 1123084 1103328 1084423 1067948 1054015 1041359 1028743 1016274 1005231 996779 991110 987604 985329
59750 985329 983418 981491 979858 978901 978202 976770 974267 971403 968863 966359 963135 959006 954435 949777 944883
59735 944883 939463 933651 928166 923853 921029 919401 918695 918997 920040 920544 919014 915167 909956 904273 898395
59720 898395 892649 887703 883795 880291 876315 871446 865788 860021 855355 852621 851275 850024 848450 847078
59706 847078 845772 843368 839423 835241 832537 831966 833382 836410 840143 843510 846837 851832 858979 866134
59692 866134 871002 873981 877111 881212 885792 890956 897209 903631 908379 911357 914552 919187 924078 927401
59678I27401J279l50j750k765k729j788p77K07J654L072L114J517k89r59o18j41
59662I26078ml44j257k413k897k131p23P3k52r04p27M52J699K389L249N320P969
59645I35577R032P480N020M268N786P888Q923Q753Q077P412O961O755O507N767
59631A034206M543L339K403J321k74j885k498j707k73N87K65r14k203l009l081
59616A030820k583k055k021k499l217m263n826p131o702m390k214k061l294l887
59602I78677l310k590k012p32J216K573L066L943N562O408N721N117N998O960
59588A016597N821K961M86j074k906n180o543o490o159o319o422o151o195o777
59574I65649o978o406o031o403o295m600k481k083l589n144n542n446n657n662
$$ plain form
59678 927401 928680 928330 926580 923815 921086 919298 918521 918728 920382 923454 926568 928085 927796 926837 926219 926078
59662 926078 926074 925730 924473 922060 919163 917032 916309 916382 916130 915226 914499 914951 916650 919039 922288 927608 935577
59645 935577 944609 952089 957109 961377 967163 975051 983974 992727 1000804 1008216 1015177 1021932 1028439 1034206
59631 1034206 1038749 1042088 1044491 1045812 1045538 1043653 1041155 1039448 1039175 1039762 1040027 1039113 1036910 1033901 1030820
59616 1030820 1028237 1026182 1024161 1021662 1018445 1014182 1008356 1001225 994523 990133 987919 985858 982564 978677
59602 978677 975367 972777 970765 970033 971249 973822 976888 980831 986393 992801 998522 1003639 1009637 1016597
59588 1016597 1022418 1025379 1025865 1024791 1021885 1016705 1010162 1003672 997513 991194 984772 978621 972426 965649
59574 965649 958671 952265 946234 939831 933536 928936 926455 924372 920783 915639 910097 904651 898994 893332
59560H93332m777l698l760n019o109n976m910l744k818k163j974k353k930l316
59546H39785l606l883l654k548j223o66p74n55K29O80K35n15q36q45r75j185j193
59529H18471q63l6J349K643K754J449l91k038l472m301l525j274M71J38j380k199
59513H07796k105k280k913k926j920q28l95k81NK58O8n91j435j873j036J309L809
59496G94662M509L072J254Q41J933L540N042O356P234P314O854O808P827R405
59482H66651J0413J0585J0969J2500J4578J5957J6688J7893J9356J8865J4814
59471A029269Q403K306j850l761l498j813n49r38j862j360N73K226K801K884K479
59456A035310P46j865l251k423j133j701m394p838j0831j2815j3505j3219j2977
$$ plain form
59560 893332 888555 884857 881097 876078 869969 863993 859083 855339 852521 850358 848384 846031 843101 839785
59546 839785 836179 832296 828642 826094 824871 824205 823431 822876 823105 823785 824020 823505 822669 821824 820849 819664 818471
59529 818471 817608 817572 818921 821564 824318 825767 825376 823338 819866 815565 812040 810766 811237 811375 809995 807796
59513 807796 805691 803411 800498 797572 795652 794824 794429 794148 794153 794411 794479 793888 792453 790580 789544 790853 794662
59496 794662 799171 802243 803497 804338 806271 809811 814853 821209 828443 835757 842611 849419 857246 866651
59482 866651 877064 887649 898618 911118 925696 941653 958341 976234 995590 1014455 1029269
59471 1029269 1037672 1039978 1038128 1034367 1030869 1029056 1028507 1027569 1025707 1024347 1024920 1027146 1029947 1032831 1035310
59456 1035310 1036056 1034191 1030940 1028517 1027384 1025683 1021289 1013451 1002620 989805 976300 963081 950104
59443I50104j3327j3519j2536j0534q633p585p228o860n779l900k087j402j704
59430H55010j733q01L43Q40R56J261J508J325J375K602M473N216M072K400K095
59415H80942L480N282O373O798O929O302M098P76j684j837m44O25P85J080K363
59400I21868M271O048P308P644O629M839M032N441Q250J0412J0732R734Q735Q415
59386A024358Q217P032M599K013M07n03j754l289m019l787l905n152o575p013
59372A010629o615n884m327j532J301K539K567L393N763Q120Q923Q648Q771R685
59358A051981J0734J1825J3822J7211K1184K4652K7635L0785L3368L2653K6291
59347A302141J5141K999o532j2236j4536j3826j0374n081O92N886R645J0652P498
$$ plain form
59443 950104 936777 923258 910722 900188 891555 883970 876742 869882 864103 860203 858116 856714 855010
59430 855010 853277 852476 852819 853659 854615 855876 857384 858709 860084 862686 867159 872375 876447 878847 880942
59415 880942 884422 889704 896077 902875 909804 916106 920204 920980 919296 917459 917015 917640 918425 919505 921868
59400 921868 926139 932187 939495 947139 953768 958607 962639 968080 976330 986742 997474 1007208 1015943 1024358
59386 1024358 1032575 1039607 1044206 1046219 1046626 1046123 1044369 1041080 1037061 1033274 1029369 1024217 1017642 1010629
59372 1010629 1004014 998130 993803 992271 993572 996111 998678 1002071 1007834 1015954 1024877 1033525 1042296 1051981
59358 1051981 1062715 1074540 1088362 1105573 1126757 1151409 1179044 1209829 1243197 1275850 1302141
59347 1302141 1317282 1320281 1313749 1301513 1286977 1273151 1262777 1257696 1258388 1264274 1273919 1284571 1292069
59334A292069Pj0085j9872k6596k8737k6621k2312j8353j6104j5054j3766j1465
59322A083111q688o404m617k296J072M284N583N003M581N807P651P976O472N145
59308A114680N846Q206J0358J1163J1037J0890J0889J0536R541Q225P122O638
59296A225131P004Q160R483J0115R879R532R774J0415J0884J1111J1411J1891
59284A344790J2665J4152J6233J7514J6498J3567J0703R178Q436P341N434K730
59272A479241n46l531n148n531o048p357q494q705r016j0810j3548j5155j4416
59259A370936j2038r668q626r221j0411j0400q448n860m488m601n105n347n528
59246A271195n510m472k117P20K984M316M973N506O586Q503J0702J2453J3901
$$ plain form
59334 1292069 1292076 1281991 1262119 1235523 1206786 1180165 1157853 1139500 1123396 1108342 1094576 1083111
59322 1083111 1074423 1068019 1063402 1061106 1062178 1066462 1072045 1077048 1081629 1087436 1095087 1103063 1109535 1114680
59308 1114680 1120526 1128732 1139090 1150253 1161290 1172180 1183069 1193605 1203146 1211371 1218493 1225131
59296 1225131 1232135 1240295 1249778 1259893 1269772 1279304 1289078 1299493 1310377 1321488 1332899 1344790
59284 1344790 1357455 1371607 1387840 1405354 1421852 1435419 1446122 1455300 1463736 1471077 1476511 1479241
59272 1479241 1478695 1475164 1470016 1464485 1458437 1451080 1442586 1433881 1424865 1414055 1400507 1385352 1370936
59259 1370936 1358898 1349230 1340604 1331383 1320972 1310572 1302124 1296264 1291776 1287175 1282070 1276723 1271195
59246 1271195 1265685 1261213 1259096 1259816 1262800 1267116 1272089 1277595 1284181 1292684 1303386 1315839 1329740
59233A329740J5583J6895J6108J2364O595Mp353j5418k2506k6383k6838k5942
59221A272849k5388k4678k2502j8955j5405j2556r834o703l661j453M4J533L264
59208A136555M860N938O355O076N386N110N773O432N251J631k834o052p542q247
59194A164692q793q881q288p505p010o593n889n168m926m892m160k481q66m40
59180A088800j040j376m60J549L703M954M771L712L186L812M254K940Q80R74L826
59165A124485O218N202K095L70P02P12q65k518k790k255j721p55P46J353J74j271
59149A129882q38J435L757N016N296M572K563j77k226k657j782o27j89q65j948
59134A141212k006l88J836K959K406J059K06N06J558K155J515N15Q16K526L821
$$ plain form
59233 1329740 1345323 1362218 1378326 1390690 1397285 1397289 1389936 1374518 1352012 1325629 1298791 1272849
59221 1272849 1247461 1222783 1200281 1181326 1165921 1153365 1143531 1136828 1133167 1131714 1131758 1133291 1136555
59208 1136555 1141415 1147353 1153708 1159784 1165170 1170280 1176053 1182485 1187736 1189367 1186533 1180481 1172939 1164692
59194 1164692 1155899 1147018 1138730 1131225 1124215 1117622 1111733 1106565 1101639 1096747 1092587 1090106 1089240 1088800
59180 1088800 1087760 1086384 1085924 1087473 1091176 1096130 1100901 1104613 1107799 1111611 1115865 1118805 1119685 1120659 1124485
59165 1124485 1130703 1135905 1138000 1138370 1139072 1139784 1138919 1136401 1133611 1131356 1129635 1128880 1129626 1130979 1131153 1129882
59149 1129882 1129044 1130479 1134236 1139252 1144548 1149120 1151683 1151506 1149280 1146623 1144841 1144214 1144025 1143160 1141212
59134 1141212 1139206 1138818 1140654 1143613 1146019 1147078 1147284 1147790 1149348 1151503 1153018 1153533 1154349 1156875 1160696
59119A160696L477K480K242K478K167J520J404J617J410J216K072L498L765K460
59105A192502J234J625L371N290O782P852Q486Q525P753N948L229L20j985l541
59091A247391m599n287n841o821q262r191q913q222q256q699q592q288q879r889
59077A137652r497p388n477n205n738n593m655l622k719j933j449r13O97L463
59063A087623N765O319O205P595J0972J4849J7833J9718K0679K0660J9883J8970
59051A257071J8286J7733J7356J7419J7651J7212J5879J4695J4677J5220J4617
59040A437816J2240R388P573O613N140K681K22j292k033k611l216l997n400p330
59026A455794q760r102r366j0834j3079j4612j5288j6476j8694k0600k0935k0207
$$ plain form
59119 1160696 1164173 1166653 1168895 1171373 1173540 1175060 1176464 1178081 1179491 1180707 1182779 1186277 1190042 1192502
59105 1192502 1193736 1195361 1198732 1204022 1210804 1218656 1227142 1235667 1243420 1249368 1252597 1252917 1250932 1247391
59091 1247391 1242792 1237505 1231664 1224843 1216581 1207390 1198477 1190255 1181999 1173300 1164708 1156420 1147541 1137652
59077 1137652 1128155 1120767 1115290 1110085 1104347 1098754 1094099 1090477 1087758 1085825 1084376 1083463 1084160 1087623
59063 1087623 1093388 1099707 1105912 1113507 1124479 1139328 1157161 1176879 1197558 1218218 1238101 1257071
59051 1257071 1275357 1293090 1310446 1327865 1345516 1362728 1378607 1393302 1407979 1423199 1437816
59040 1437816 1450056 1459444 1467017 1473630 1478770 1481451 1481673 1480381 1478348 1475737 1472521 1468524 1463124 1455794
59026 1455794 1447034 1437932 1428566 1417732 1404653 1390041 1374753 1358277 1339583 1318983 1298048 1277841
59014A277841j9589j9153j8246j6922j5908j5442j5077j4574j4145j3749j2834
59003A102202j1118r175p834p130o370n315m756n389o342n768l244o93k43j722
58989A027103l095k928j403P22K929M550M776L630K253J815K577M221O341Q311
58975A061802R313R023Q043P357P614Q978J1095J3025J3837J3613J3474J4325
58963A191499J6005J7900J9873K2129K4454K6034K6134K4729K2396J9584J6117
58952A426854J1773P305M167K729J529q80l838n402m885l371j821j27J762L115
58938A438910L412K960J994K06k222m272n637p574j1017j4595j5917j4618j2855
58925A358775j2698j4026j5264j5384j4616j3599j2472j0962r116p584o774n991
$$ plain form
59014 1277841 1258252 1239099 1220853 1203931 1188023 1172581 1157504 1142930 1128785 1115036 1102202
59003 1102202 1091084 1081909 1074075 1066945 1060575 1055260 1050504 1045115 1038773 1033005 1029761 1029068 1028825 1027103
58989 1027103 1024008 1021080 1019677 1020399 1023328 1027878 1032654 1036284 1038537 1040352 1042929 1047150 1053491 1061802
58975 1061802 1071115 1080138 1088181 1095538 1103152 1112130 1123225 1136250 1150087 1163700 1177174 1191499
58963 1191499 1207504 1225404 1245277 1267406 1291860 1317894 1344028 1368757 1391153 1410737 1426854
58952 1426854 1438627 1445932 1450099 1452828 1454357 1453477 1449639 1444237 1439352 1435981 1434160 1434033 1435795 1438910
58938 1438910 1442322 1445282 1447276 1447482 1445260 1440988 1435351 1427777 1416760 1402165 1386248 1371630 1358775
58925 1358775 1346077 1332051 1316787 1301403 1286787 1273188 1260716 1249754 1240638 1233054 1226280 1220289
58913A220289m001p01K376L723L620L692M861O356O838O002M774M159M281M557
58899A270826M509M081L259J865j10k235m045n513o981q679j0477j1789j1843
58886A222868j0505q977q831r998j0585r352p452o681o831o195m271k453j930
58873A128807k453l354m433n343n313m283l425l871n410o949p679p477o649n657
58859A056511m724l659k448j742j952k082o79K008M036M244L505L122L279L740
58845A063159M791O499Q043Q825R571J1293J3675J5480J6168J6183J6010J5693
58833A205390J5164J4375J3277J2205J2045J3429J5873J8127J9268J9210J8349
58822A376712J6998J5169J2776J0182Q191P040N655K795j158m513o438p777r411
$$ plain form
58913 1220289 1216288 1215587 1217963 1221686 1225306 1228998 1233859 1240215 1247053 1253055 1257829 1261988 1266269 1270826
58899 1270826 1275335 1279416 1282675 1284540 1284430 1282195 1278150 1272637 1265656 1256977 1246500 1234711 1222868
58886 1222868 1212363 1203386 1194555 1184557 1173972 1164620 1157168 1150487 1143656 1137461 1133190 1130737 1128807
58873 1128807 1126354 1123000 1118567 1113224 1107911 1103628 1100203 1096332 1090922 1083973 1076294 1068817 1062168 1056511
58859 1056511 1051787 1048128 1045680 1043938 1041986 1039904 1039225 1041233 1045269 1049513 1053018 1056140 1059419 1063159
58845 1063159 1067950 1074449 1082492 1091317 1100888 1112181 1125856 1141336 1157504 1173687 1189697 1205390
58833 1205390 1220554 1234929 1248206 1260411 1272456 1285885 1301758 1319885 1339153 1358363 1376712
58822 1376712 1393710 1408879 1421655 1431837 1440028 1447068 1452723 1455518 1454360 1449847 1443409 1435632 1426221
58809A426221j0984j1789j1812j1266r993q202o953p068q130r379j0957j3330
58797A306358j5925j7378j7107j5940j5123j5112j5347j4937j3603j1993j0947
58786A142946j0586j0478j0378j0232r762q980q779r853j1102j0611q312o303
58774A027570o016o537o433n742n270n047m516l472k053o03M1q65k572l354k893
58759I72238k684l325l200j066J683K893K430J513N23o75j284m43R92J292P1j680
58743I69278l214m275m471l949l943n067n842m698k686k130l131l642k850k098
58729I17282k264k397j554j86R58J793K319K426K787M482P158Q877Q460O915N885
58714I62941N658N340M245K544Q96k84j473l602o418q035p222n433m985n633n029
$$ plain form
58809 1426221 1415237 1403448 1391636 1380370 1370377 1362175 1355222 1348154 1340024 1330645 1319688 1306358
58797 1306358 1290433 1273055 1255948 1240008 1224885 1209773 1194426 1179489 1165886 1153893 1142946
58786 1142946 1132360 1121882 1111504 1101272 1091510 1082530 1073751 1063898 1052796 1042185 1033873 1027570
58774 1027570 1021554 1015017 1008584 1002842 997572 992525 988009 984537 982484 981881 981922 981057 978485 975131 972238
58759 972238 969554 966229 963029 961963 963646 966539 968969 970482 971005 970330 969046 968603 969595 970887 970958 969278
58743 969278 966064 961789 957318 953369 949426 944359 938517 933819 931133 929003 925872 922230 919380 917282
58729 917282 915018 912621 911067 910881 911839 913632 915951 918377 921164 925646 932804 941681 950141 957056 962941
58714 962941 968599 973939 978184 980728 981624 981340 979867 976265 969847 961812 954590 949157 944172 938539 933510
58699I33510k552n16r22k805l779k825o66J496K663K492J868K255L934N720O714
58684I46587P292P929Q398Q767R803J1424J2081J0906R432R788J1843J3600J3962
58671A081812J3674J3656J3733J3335J2506J1704J1126J0536R552P967N992M209
58659A209802L082K569K356K371K822L719M628N053M926M459L479J318k134n651
58645A242799p817q931j0762j4123j7752k0246k1802k3052k3324k1795j9568j8695
58633A034932j9254j9317j8058j7016j7560j8622j8096j5513j2252r659p921o644
58621H55020n754n617o315o988o311m043j610m66l27O7Q69J085N24M35J835M304
58605H26708O799Q721R861J0113R662Q800P418N314L002J304J89r35j888j887
$$ plain form
58699 933510 930958 930442 929520 926715 922936 920111 919445 920941 923604 926096 927964 930219 934153 939873 946587
58684 946587 953879 961808 970206 978973 988776 1000200 1012281 1023187 1032619 1042407 1054250 1067850 1081812
58671 1081812 1095486 1109142 1122875 1136210 1148716 1160420 1171546 1182082 1191634 1199601 1205593 1209802
58659 1209802 1212884 1215453 1217809 1220180 1223002 1226721 1231349 1236402 1241328 1245787 1249266 1250584 1248450 1242799
58645 1242799 1234982 1226051 1215289 1201166 1183414 1163168 1141366 1118314 1094990 1073195 1053627 1034932
58633 1034932 1015678 996361 978303 961287 943727 925105 907009 891496 879244 869585 861664 855020
58621 855020 849266 843649 837334 830346 824035 819992 818382 817916 817589 817656 818525 819610 820134 820569 822404 826708
58605 826708 833507 842228 852089 862202 871864 880664 888082 893396 896398 897702 897891 896956 895068 893181
58591H93181j284j549l112m513m381l132k066j867k626m222n822o070m736l401
58577H44400l543m647n029l837j441J347L508M024K941J787J822K307J573m57
58563H44755j975j499N07K393K962K204J029N29J090K059K612K803L278L942L648
58548H70337J737n87j196N36K953M170M189M223M453L814K141R87J562L035L853
58533I06207L777L431K866J994J794L311N745P245P497P969R487J1245J2487J3535
58519I98590J4656J5352J5373J5203J5032J4398J3309J2482J2068J1531J1326
58508A149320J3031J6901K0644K1954K1332K1181K2782K5256K7001K7154K6048
58497A392604K4892K4704K5013K4164K1268J7222J3320R623N366L07m982r621
$$ plain form
58591 893181 891897 890348 887236 882723 878342 875210 873144 871277 868651 864429 858607 852537 847801 844400
58577 844400 840857 836210 831181 827344 825903 827250 830758 834782 837723 839510 841332 843639 845212 844755
58563 844755 842780 841281 841788 844181 847143 849347 850376 850905 851995 854054 856666 859469 862747 866689 870337
58548 870337 872074 871487 870291 870827 873780 877950 882139 886362 890815 894629 896770 897757 899319 902354 906207
58533 906207 909984 913415 916281 918275 920069 923380 929125 936370 943867 951836 961323 972568 985055 998590
58519 998590 1013246 1028598 1043971 1059174 1074206 1088604 1101913 1114395 1126463 1137994 1149320
58508 1149320 1162351 1179252 1199896 1221850 1243182 1264363 1287145 1312401 1339402 1366556 1392604
58497 1392604 1417496 1442200 1467213 1491377 1512645 1529867 1543187 1552810 1558176 1558483 1553501 1543880
58485A543880j2741j3949j4054j4766j7078k0376k3375k5325k6013k5438k3991
58474A326774k2392k1110k0392k0780k2392k3604k2024j7570j3122j1184j1049
58463A121155j0404q544o539n026l509j694j79L67r8j188k336k946k839k531k707
58448A070982l465m209m199l163j697q43q19n63O97J839J144r70k098j026Q66
58433A052476J866J984J899J553R82J379L696O925R109R685R845J0872J2911J5102
58419A140284J6329J6186J5552J5714J6632J6861J5477J3144J0883Q694O046K885
58407A294687m53l607o196q087r701j1134j1144q502m286j051M20J574K994L364
58393A238878K401K207M127O486P224O769O347N335K671o83l105m896p041q515
$$ plain form
58485 1543880 1531139 1517190 1503136 1488370 1471292 1450916 1427541 1402216 1376203 1350765 1326774
58474 1326774 1304382 1283272 1262880 1242100 1219708 1196104 1174080 1156510 1143388 1132204 1121155
58463 1121155 1110751 1102207 1095668 1090642 1087133 1085439 1085260 1085627 1085529 1084341 1082005 1079059 1076220 1073689 1070982
58448 1070982 1067517 1063308 1059109 1055946 1054249 1053406 1052587 1052024 1052721 1054560 1055704 1054734 1052636 1051610 1052476
58433 1052476 1054342 1056326 1058225 1059778 1060760 1062139 1065835 1072760 1081869 1091554 1101399 1112271 1125182 1140284
58419 1140284 1156613 1172799 1188351 1204065 1220697 1237558 1253035 1266179 1277062 1285756 1291802 1294687
58407 1294687 1294234 1290627 1284431 1276344 1266643 1255509 1244365 1235863 1231577 1230526 1230946 1232520 1235514 1238878
58393 1238878 1241279 1243486 1247613 1254099 1261323 1268092 1274439 1279774 1282445 1281762 1278657 1273761 1266720 1258205
58379A258205p507m681k635k279k232j650j315j572j325L08K792N189P159Q658
58365A257115R631J0170J0326R998R652J0492J2810J4729J3926J0204N294O19
58353A374966l491o837q994r879r725q792p674p213p285o617m735k868j896q45
58339A288115J014K312J896J631M079Q210J0339R198P241O700O942O491N346M296
58325A363810L482K644J618R0k029l738l693k103n58J85Q97K115L196L712M472
58310A374100O350Q960J1202J2456J2826J2825J3123J4129J5435J6111J5754J4970
58298A528241J4809J5844J7572J8640J8101J6563J5477J5205J4862J4152J4012
58287A703478J4837J5633J5765J6051J7041J7761J7468J7210J8150J9695K0905
$$ plain form
58379 1258205 1250698 1246017 1243382 1241103 1238871 1237221 1235906 1234334 1233009 1233317 1236109 1241298 1248457 1257115
58365 1257115 1266746 1276916 1287242 1297240 1306892 1317384 1330194 1344923 1358849 1369053 1374347 1374966
58353 1374966 1371475 1364638 1355644 1345765 1336040 1327248 1319574 1312361 1305076 1298459 1293724 1290856 1288960 1288115
58339 1288115 1289129 1291441 1293337 1294968 1299047 1307257 1317596 1326794 1334035 1340735 1347677 1354168 1359514 1363810
58325 1363810 1367292 1369936 1371554 1371644 1369615 1365877 1362184 1360081 1359523 1359708 1360605 1362720 1365916 1369628 1374100
58310 1374100 1380450 1389410 1400612 1413068 1425894 1438719 1451842 1465971 1481406 1497517 1513271 1528241
58298 1528241 1543050 1558894 1576466 1595106 1613207 1629770 1645247 1660452 1675314 1689466 1703478
58287 1703478 1718315 1733948 1749713 1765764 1782805 1800566 1818034 1835244 1853394 1873089 1893994
58276A893994K2247K4183K5423K4716K3279K3129K3970K3953K2756K1600K0786
58265B150036J9569J8187J7796J8457J9012J8827J8092J6756J4938J3860J4673
58254B340203J6776J8809K0635K2624K3930K3556K2466K2472K3627K4712K5765
58243B585575K7877L0894L3435L4964L5988L6657L6863L7264L8407L9522L9855
58232B977301M0319M2028M4219M5644M6875M9118N1792N3519N4415N5324N6143
58221C516697N7016N9477O3965O8139P0521P3595P9875Q7142R1659R4293R8723
58210D361102J05030J10095J13647J18750J26276J33725J39954J46604J54372
58201E509555J61929J69181J77680J87411J96662K05271K14437K23703K32077
$$ plain form
58276 1893994 1916241 1940424 1965847 1990563 2013842 2036971 2060941 2084894 2107650 2129250 2150036
58265 2150036 2169605 2187792 2205588 2224045 2243057 2261884 2279976 2296732 2311670 2325530 2340203
58254 2340203 2356979 2375788 2396423 2419047 2442977 2466533 2488999 2511471 2535098 2559810 2585575
58243 2585575 2613452 2644346 2677781 2712745 2748733 2785390 2822253 2859517 2897924 2937446 2977301
58232 2977301 3017620 3059648 3103867 3149511 3196386 3245504 3297296 3350815 3405230 3460554 3516697
58221 3516697 3573713 3633190 3697155 3765294 3835815 3909410 3989285 4076427 4168086 4262379 4361102
58210 4361102 4466132 4576227 4689874 4808624 4934900 5068625 5208579 5355183 5509555
58201 5509555 5671484 5840665 6018345 6205756 6402418 6607689 6822126 7045829 7277906
58192G277906K41615K55512K73039K91123L10588L35502L66247L98663M30740
58183A0180935M64671N01314N38007N73397O09350O46474O82579P17358P54095
58174A5668180P94996Q38875Q84706R33359R84764J037424J091635J149243J210066
58165B4593248J272945J340187J415999J500638J591183J687592J792239J904411
58157C7098442K022078K148665K290798K449615K621808K808708L015993L245029
58149E7701136L494292L769775M083987M443848M849776N307272N828075O419093
58141I5897254P082802P830561Q683479R659604J0774047J2050299J3511108J5153439
58133A80642593J6950544J8884965K0968226K3232453K5701606K8282127L0516148
$$ plain form
58192 7277906 7519521 7775033 8048072 8339195 8649783 8985285 9351532 9750195 10180935
58183 10180935 10645606 11146920 11684927 12258324 12867674 13514148 14196727 14914085 15668180
58174 15668180 16463176 17302051 18186757 19120116 20104880 21142304 22233939 23383182 24593248
58165 24593248 25866193 27206380 28622379 30123017 31714200 33401792 35194031 37098442
58157 37098442 39120520 41269185 43559983 46009598 48631406 51440114 54456107 57701136
58149 57701136 61195428 64965203 69049190 73493038 78342814 83650086 89478161 95897254
58141 95897254 102980056 110810617 119494096 129153700 139927747 151978046 165489154 180642593
58133 180642593 197593137 216478102 237446328 260678781 286380387 314662514 345178662
58126C45178662L1374344K9468270K3802372J4586015L389825p560829j6420106
58119D23818553k2350249k5465603k6367149k5715927k4086751k2028806k0093619
58112B57710449j8693086j7908822j7486509j7060168j6396712j5459377j4318331
58105A40387444j3063497j1780579j0541587r386343q325682p367340o524419
58098G3397997n798984n175624m635824m166561l754380l385522l055621k768313
58090D0657168k521589k304801k110268j937885j786590j650638j526519j415326
58082B5403552j316299j225393j141503j066697r99145r33050q66927q05121p49955
58073A6299462o99302o53287o16269n89737n69057n49221n28757n06705m81443
$$ plain form
58126 345178662 376553006 406021276 429823648 444409663 447799488 440238659 423818553
58119 423818553 401468304 376002701 349635552 323919625 299832874 277804068 257710449
58112 257710449 239017363 221108541 203622032 186561864 170165152 154705775 140387444
58105 140387444 127323947 115543368 105001781 95615438 87289756 79922416 73397997
58098 73397997 67599013 62423389 57787565 53621004 49866624 46481102 43425481 40657168
58090 40657168 38135579 35830778 33720510 31782625 29996035 28345397 26818878 25403552
58082 25403552 24087253 22861860 21720357 20653660 19654515 18721465 17854538 17049417 16299462
58073 16299462 15600160 14946873 14330604 13740867 13171810 12622589 12093832 11587127 11105684
58064A1105684m54272m29070m06626l83878l59994l38316l20825l05483k90542
58055G816678k76950k64735k51496k36467k22302k11020k01456j92097j83188
58046E776967j74804j66178j57973j52015j47942j43233j37237j31890j27856
58037D437839j23612j18982j15831j14154j11195j05737r9977r5898r2967r0596
58027C368890q9565q9580q8417q5016q0944p7742p5346p3823p3748p3951p1903
58016B488855o7500o3593o1748o0366n8130n6133n5160n3787n0996m8136m6480
58005A866826m5129m3072m1159m0328l9671l7900l5237l2604l0349k8676k7845
57994A464856k7269k6006k4563k4255k4523k3307k0607j9000j9599k0158j8501
$$ plain form
58064 11105684 10651412 10222342 9815716 9431838 9071844 8733528 8412703 8107220 7816678
58055 7816678 7539728 7274993 7023497 6787030 6564728 6353708 6152252 5960155 5776967
58046 5776967 5602163 5435985 5278012 5125997 4978055 4834822 4697585 4565695 4437839
58037 4437839 4314227 4195245 4079414 3965260 3854065 3748328 3648351 3552453 3459486 3368890
58027 3368890 3279325 3189745 3101328 3016312 2935368 2857626 2782280 2708457 2634709 2560758 2488855
58016 2488855 2421355 2357762 2296014 2235648 2177518 2121385 2066225 2012438 1961442 1913306 1866826
58005 1866826 1821697 1778625 1737466 1697138 1657467 1619567 1584330 1551726 1521377 1492701 1464856
57994 1464856 1437587 1411581 1387018 1362763 1338240 1314933 1294326 1275326 1255727 1235569 1217068
57983A217068j5445j2858j1129j0134j0557j2415j3961j3804j2730j2050j1642
57972A080343j0980j0644j1365j2732j3973j4844j4914j3520j1324j0351j1266
57961I44430j2119j1017q643o912o439o558o644o296n247m101m094n341o430o383
57947H48206n676m737l092r74N1o10j273l65J166J411L15o80r04q94j057j280
57931H29607j611k307l285m135m416l812k584j906k828m849o488p289p883q128
57917G68086p100n300m829o416q029p552n330k933j006M07Q28K49j63L38P61k3
57901G21988j422k215k469k804k737j562k81p16k769m299l881k347j193p06k97
57886F92290J51J41l85o16K74K108L975N394O589P464P274O006N207O288Q399
$$ plain form
57983 1217068 1201623 1188765 1177636 1167502 1156945 1144530 1130569 1116765 1104035 1091985 1080343
57972 1080343 1069363 1058719 1047354 1034622 1020649 1005805 990891 977371 966047 955696 944430
57961 944430 932311 921294 912651 905739 899300 892742 886098 879802 874555 870454 866360 861019 854589 848206
57947 848206 842530 837793 834701 833727 833778 833168 831895 831530 832696 834107 834422 833742 832838 831944 830887 829607
57931 829607 827996 825689 822404 818269 813853 810041 807457 805551 802723 797874 791386 784097 776214 768086
57917 768086 760986 755686 750857 744441 736412 728860 723530 720597 719591 719998 720826 721075 720912 721250 722011 721988
57901 721988 720566 718351 715882 713078 710341 708779 708498 707782 705013 700714 696833 694486 693293 692587 692290
57886 692290 692441 692582 692197 691581 691855 693963 697938 703332 709921 717385 724659 730665 735872 742160 750559
57871G50559R281P921N305K846J345J201K191L040K477O51j540l999o830q870
57857G65578q897q072q773j0963j2110j1063r541r011q638p452o323o256o602
57844F51877o382n903n778n741n592n822o283n818m274l166l169k796r53J003
57830E91203J484J190J575K278K153J650J989K824K770J731Q44N21J38o49j578
57815F10123k482l195l205k379j522j403j950l053n066p570q956q393o960n756
57801E48233m299k158n40m02l96J130L225L701K616K069K959M118M532M332L694
57786E72814K561J501J263J496J362J103J428J641K85k395m410m695m208m114
57772E65632m289m138l562k668j447p9J059J799K110J850J216R00J154J345J230
$$ plain form
57871 750559 759840 767761 773066 775912 777257 778458 780649 783689 786166 786817 785277 781278 774448 765578
57857 765578 756681 748609 739836 728873 716763 705700 696159 687148 678510 671058 664735 658479 651877
57844 651877 645495 639592 633814 628073 622481 616659 610376 604558 600284 597118 593949 591153 590200 591203
57830 591203 592687 593877 595452 597730 599883 601533 603522 606346 609116 610847 611691 612212 612350 611701 610123
57815 610123 607641 604446 601241 598862 597340 595937 593987 590934 585868 578298 569342 560949 553989 548233
57801 548233 543934 541776 541236 540834 540438 541568 544793 548494 551110 553179 556138 560256 564788 569120 572814
57786 572814 575375 576876 578139 579635 580997 582100 583528 585169 585454 583059 578649 573954 569746 565632
57772 565632 561343 557205 553643 550975 549528 549449 550508 552307 554417 556267 557483 558383 559537 560882 562112
57757E62112J626K736K995J285o91l36K103L916L704K563J507Kk317m491n594
57742E71120n832n617m915m014l665l855l665k856k380k820l442l391k859k386
57728E19423j955j442j149j289j466j218o14k9L13L64L13O16J554K866M184N485
57712E25956O554O537M985K864J525R78L03o73j340j664k232k961l145k774k632
57697E32281k994l350l371l021j931m0J396R70o86j487q12j86q38k274l708n147
57681E04802o376o463n232m002l941m697n289n340m854l870k917k782l238l084
57667D42717j992j179j553k357k359j408j75P34Q41R8m77L22J895K071R1k225
57651D35044l122l078l096k515l59K216K833Q52j998l687l412j641K51P79m5m90
$$ plain form
57757 562112 563738 566474 569469 570754 570063 569727 571830 575746 579450 582013 583520 583522 581205 576714 571120
57742 571120 565288 559671 554756 550742 547077 543222 539557 536701 534321 531501 528059 524668 521809 519423
57728 519423 517468 516026 514877 513588 512122 510904 510290 510261 510574 510938 511251 511867 513421 516287 520471 525956
57712 525956 532510 539047 544032 546896 548421 549399 549702 549029 547689 546025 543793 540832 537687 534913 532281
57697 532281 529287 525937 522566 519545 517614 517574 518970 519940 519254 517767 516955 516769 515931 513657 509949 504802
57681 504802 498426 491963 486731 482729 478788 474091 468802 463462 458608 454738 451821 449039 445801 442717
57667 442717 440725 439546 437993 435636 433277 431869 431694 432428 433269 433367 432890 433212 435107 437178 437269 435044
57651 435044 431922 428844 425748 423233 422874 425090 427923 428775 426777 423090 419678 418037 418288 419067 419022 418532
57635D18532N47J754J318j39k92J548L573M015L062J932J358J412J896K546L451
57620D46513N148P706J0049J1275J2130J3934J6352J8035J9436K2887K9142L5727
57608F48334L9930M1917M3408M4347M2529L6009K4447Q748q897k4871l5873m1470
57596H18558m3738m4229m2575l8484l3419k9163k5754k2201j8435j5208j2570
57585D92782r923p463o175o208o525o404o109n763m790l071j486o80l24k52j140
57570D26469l078m651m591l446k294q73J364L165K589N9j759j460m76o33j853
57555D08532l025l736m081l820k797j513n42R1L91N9q28j543j790k293l611n135
57539C74359n934n830m910k892n3J908J313j406m136n453n573n173m506l848l657
$$ plain form
57635 418532 419079 420833 422151 422012 421720 423268 426841 430856 433918 435850 437208 438620 440516 443062 446513
57620 446513 451661 459367 469416 480691 492821 506755 523107 541142 560578 583465 612607 648334
57608 648334 688264 730181 773589 817936 860465 896474 920921 929669 920772 895901 860028 818558
57596 818558 774820 730591 688016 649532 616113 586950 561196 538995 520560 505352 492782
57585 492782 482859 475396 469221 463013 456488 450084 443975 438212 433422 430351 428865 428185 427861 427609 426469
57570 426469 423391 418740 414149 410703 408409 407536 408900 412065 414654 414713 412954 411494 411018 410385 408532
57555 408532 405507 401771 397690 393870 391073 389560 389018 389109 389500 389559 388731 387188 385398 383105 379494 374359
57539 374359 368425 362595 357685 354793 354740 356648 357961 356555 352419 346966 341393 336220 331714 327866 324209
57524C24209l773l341k138j311k026l779m783l939j872K6R35R08L73j95m40l81
57508B98473m77j004j602j817j846k092k172j266M17J589J638J374J420J092j68
57493B93559j269q61N25J238R45P05P79L22o79r80j56M95m6j007j244r57q80q07
57475B89682j44P19Q50K76O9R09K370L558L961L620K883K072J409J290K263M228
57459C20015N886N848M280K710K170K428K890L143K543O72j430j923p09J43o72
57444C47994j771j279L26J156P80M54Q69J222N44j162l153m489m479l385k410
57429C31217k272k181j135L27P76M8n67k79K30J13l79l53N73J997L180L555L095
57412C37945K269J439M82p11j636j609o82L43P23K91n41j015n49N38J262J307
$$ plain form
57524 324209 320436 317095 314957 313646 311620 307841 303058 299119 297247 297273 298208 299116 299489 299294 298854 298473
57508 298473 297996 296992 295390 293573 291727 289635 287463 286197 286614 288203 289841 291215 292635 293727 293559
57493 293559 292290 291429 291954 293192 294137 294842 295621 295943 295264 294284 294128 294623 294577 293570 292326 291369 290489 289682
57475 289682 289538 290257 291107 291383 291452 292361 294731 298289 302250 305870 308753 310825 312234 313524 315787 320015
57459 320015 325901 331749 336029 338739 340909 343337 346227 349370 351913 352585 351155 349232 348523 348666 347994
57444 347994 346223 344944 345270 346426 347206 347660 348529 349751 350295 349133 345980 341491 337012 333627 331217
57429 331217 328945 326764 325629 325956 326732 326780 326213 325934 326164 326277 325898 325545 326118 328115 331295 334850 337945
57412 337945 340214 341653 342135 341424 339788 338179 337497 337840 338563 338854 338313 337298 336749 337287 338549 339856
57396C39856J482K299K879K256J124R56J656J626L35p00k52O44J68j481k114l85
57380C50349K477M216M006K782J593O57J00M72J817K922K638J586J428K428K991
57365C82462J948J83o22pJ254K364K994L090K945L116L750M310M246L523K236
57350D17792N40p53n07J203K820L312L428M128M789M268K937K210K394K475J929
57335D52965J568K293L890N280N516M577L450L191L601L479K454J664K084L243
57321D99255M452N965P743Q236O291L502K702M386O430P184O909O135M575K426
57307E76191J124J688L266M160L853L376L871N114N581M263K328K041L658M771
57293F25285L674J992K371M642O400O645O468O464N889M649L853L830L637L098
$$ plain form
57396 339856 341338 343637 346516 348772 349896 350852 352508 354134 354469 353769 353517 354161 354329 352848 350734 350349
57380 350349 352826 357042 361048 363830 365423 366080 366180 366652 368469 371391 374029 375615 377043 379471 382462
57365 382462 384410 384593 383971 383964 385218 387582 390576 393666 396611 399727 403477 407787 412033 415556 417792
57350 417792 418332 417579 417072 418275 421095 424407 427835 431963 436752 441020 443957 446167 448561 451036 452965
57335 452965 454533 456826 460716 465996 471512 476089 479539 482730 486331 489810 492264 493928 496012 499255
57321 499255 503707 509672 517415 525651 531942 535444 538146 542532 548962 556146 563055 569190 573765 576191
57307 576191 577315 579003 582269 586429 590282 593658 597529 602643 608224 612487 614815 616856 620514 625285
57293 625285 628959 630951 633322 637964 644364 651009 657477 663941 669830 674479 678332 682162 685799 688897
57279F88897L409M968O458O891O847O875O415N317M809N761P333Q410R025R370
57265G80785Q884P569O878P796R139R208Q174P442P527Q003Q753R801J0427R986
57251I00372R189R326J0444J1434J1677J1483J1218J0977J0935J1026J0675R756
57239A028512R434J0841J3109J4038J2871J1362J1702J4135J6993J8616J8826
57228A180439J8688J9118J9958K0592K1152K2351K4125K5376K5418K4845K4511
57217A426573K4473K4519K4797K5108K4476K2473K0354J9783K0824K2104K2524
57206A678008K1871K0133J7393J4375J2214J1479J1939J2993J3862J3748J2606
57195A840621J1458J1222J1540J1473J0919J0514J0508J0724J1318J2492J3508
$$ plain form
57279 688897 692306 697274 703732 710623 717470 724345 730760 736077 740886 746647 753980 762390 771415 780785
57265 780785 789669 797238 804116 811912 821051 830259 838433 845875 853402 861405 870158 879959 890386 900372
57251 900372 909561 918887 929331 940765 952442 963925 975143 986120 997055 1008081 1018756 1028512
57239 1028512 1037946 1048787 1061896 1075934 1088805 1100167 1111869 1126004 1142997 1161613 1180439
57228 1180439 1199127 1218245 1238203 1258795 1279947 1302298 1326423 1351799 1377217 1402062 1426573
57217 1426573 1451046 1475565 1500362 1525470 1549946 1572419 1592773 1612556 1633380 1655484 1678008
57206 1678008 1699879 1720012 1737405 1751780 1763994 1775473 1787412 1800405 1814267 1828015 1840621
57195 1840621 1852079 1863301 1874841 1886314 1897233 1907747 1918255 1928979 1940297 1952789 1966297
57184A966297J3236J1954J1540J3323J6309J8132J7579J5833J5176J6559J8612
57173B134550J9317J8422J7497J7529J7552J6278J4044J2079J0571Q897P344P081
57161B301161Q210R160Q593P063O176O656P867R018J0267J2451J5851J9497K2182
57148B444152K3946K5922K8522L0669L1452L1652L2637L4295L5173L4465L2759
57137B785644L0898K9135K7597K6582K5987K5097K3318K0722J7865J5636J5288
57126C043769J7762K2479K7347L0464L1566L1615L1307L0470K8738K6244K3354
57115C345115J9905J5163Q736J250o263j3466k0758k8321l5773m2879m9906n6931
57103C135872o3235o7791p0176p0897p1167p2175p4027p5539p5838p5866p7246
$$ plain form
57184 1966297 1979533 1991487 2003027 2016350 2032659 2050791 2068370 2084203 2099379 2115938 2134550
57173 2134550 2153867 2172289 2189786 2207315 2224867 2241145 2255189 2267268 2277839 2286736 2294080 2301161
57161 2301161 2309371 2318531 2327124 2334187 2340363 2347019 2354886 2363904 2374171 2386622 2402473 2421970 2444152
57148 2444152 2468098 2494020 2522542 2553211 2584663 2616315 2648952 2683247 2718420 2752885 2785644
57137 2785644 2816542 2845677 2873274 2899856 2925843 2950940 2974258 2994980 3012845 3028481 3043769
57126 3043769 3061531 3084010 3111357 3141821 3173387 3205002 3236309 3266779 3295517 3321761 3345115
57115 3345115 3365020 3380183 3388919 3390169 3383906 3370440 3349682 3321361 3285588 3242709 3192803 3135872
57103 3135872 3072637 3004846 2934670 2863773 2792606 2720431 2646404 2570865 2495027 2419161 2341915
57092B341915p9733q1203q0371p7939p4671p0243o4901o0298n7048n3023m6014
57081A596471l7052k9199k3993k1070k0631k3852l1013m1447n5625p5304j00993
57070A136292j31002j63678j99156k38086A24486a98836l68240m15621m66429
57061a449126n20767n78274o39160p04881p77719q59564r51381j053946j168527
57052h703345j296643j440060j601809j786648j999899k246421k531270k860725
57044b4466820l242160l683800m194928m785353n464389o241978p131188q147276
57036f7357892r302682j0603797j2052096j3644456j5369366j7202916j9106858
57029a64640063k1027098k2897880k4657516k6255404k7612959k8548189k8748859
$$ plain form
57092 2341915 2262182 2180979 2100608 2022669 1947998 1877755 1812854 1752556 1695508 1642485 1596471
57081 1596471 1559419 1530220 1506227 1485157 1464526 1440674 1409661 1368214 1312589 1237285 1136292
57070 1136292 1005290 841612 642456 404370 124486 -198836 -567076 -982697 -1449126
57061 -1449126 -1969893 -2548167 -3187327 -3892208 -4669927 -5529491 -6480872 -7534818 -8703345
57052 -8703345 -9999988 -11440048 -13041857 -14828505 -16828404 -19074825 -21606095 -24466820
57044 -24466820 -27708980 -31392780 -35587708 -40373061 -45837450 -52079428 -59210616 -67357892
57036 -67357892 -76660574 -87264371 -99316467 -112960923 -128330289 -145533205 -164640063
57029 -164640063 -185667161 -208565041 -233222557 -259477961 -287090920 -315639109 -344387968
57022c44387968k7867188k5684947k2205948j7603856j2109171n965808N22718
57015d55302168O951900J2859948J7839770K1645111K4234234K5737283K6368689
57008c19665233K6333013K5777145K4804129K3512580K2013985K0416477J8800128
57001a58007776J7208945J5661623J4167622J2736988J1381552J0112056Q936424
56994f7802566P860215O886829O016702N247260M574032L991007L489891L060609
56986b6676021K693546K380932K115820J890818J698603J533156J389935J265192
56978a1708019J155602J058342R71307Q93186Q23092P59943P02535O50407O04059
56969d089546N63784N28763M97687M69543M43443M18693L95584L74709d2699B89331
$$ plain form
57022 -344387968 -372255156 -397940103 -420146051 -437749907 -449859078 -455824886 -455302168
57015 -455302168 -448350268 -435490320 -417650550 -396005439 -371771205 -346033922 -319665233
57008 -319665233 -293332220 -267555075 -242750946 -219238366 -197224381 -176807904 -158007776
57001 -158007776 -140798831 -125137208 -110969586 -98232598 -86851046 -76738990 -67802566
56994 -67802566 -59942351 -53055522 -47038820 -41791560 -37217528 -33226521 -29736630 -26676021
56986 -26676021 -23982475 -21601543 -19485723 -17594905 -15896302 -14363146 -12973211 -11708019
56978 -11708019 -10552417 -9494075 -8522768 -7629582 -6806490 -6046547 -5344012 -4693605 -4089546
56969 -4089546 -3525762 -2996999 -2499312 -2029769 -1586326 -1167633 -772049 -397340 -42699 289331
56958E95015K78498K53053K26588J93944J55330J17945Q9222P0928O0234N3494
56948B094251M7630M0514L2279K5071K0039J5733J0498M884L46l044o035q425
56936B273741r591j0051j1116j3394j6750k1092k6125l0824l4346l7033l9613
56925B023806m1999m3992m6680n1868o0025o9647p8588q5443q9951r2857r5353
56914A267403r8064j00612j02482j03851j05032j05500j04093j00224r4516q8374
56904B64655q2897p7888C1890c2347n5647m8156m2391l7265l2030k7437k4416
56893b99689k2889k2449k2888k3311k2144j9130j6072j4296j2690r663n844l013
56881d94078j266P72L544O339R123J2442J5567J7003J7121J8109K0590K2139K0256
$$ plain form
56958 595015 873513 1126566 1353154 1547098 1702428 1820373 1909595 1980523 2040757 2094251
56948 2094251 2141881 2182395 2214674 2239745 2259784 2275517 2286015 2290899 2291245 2288201 2282166 2273741
56936 2273741 2264150 2254099 2242983 2229589 2212839 2191747 2165622 2134798 2100452 2063419 2023806
56925 2023806 1981807 1937815 1891135 1839267 1779242 1709595 1631007 1545564 1455613 1362756 1267403
56914 1267403 1169339 1068727 966245 862394 757362 651862 547769 447545 353029 264655
56904 264655 181758 103870 31890 -32347 -87994 -136150 -178541 -215806 -247836 -275273 -299689
56893 -299689 -322578 -345027 -367915 -391226 -413370 -432500 -448572 -462868 -475558 -485221 -491065 -494078
56881 -494078 -495344 -494572 -491028 -484689 -475566 -463124 -447557 -430554 -413433 -395324 -374734 -352595 -332339
56868c32339J5299R357L636j721o286r408j1277j2704j3877j4186j3273j1660
56856c98439j0236r425q849p788o059m290k979j732k01O83j82j766j437J599M896
56841d46205N918N121M518M534M255M042N458Q431J0813J1426J1695J3168J5028
56828c41798J5674J5648J6968J9817K1785K0789J7441J3809J0974Q671O675N379
56816a68168N145N906P469R603J1723J3100J3694J4304J5576J7269J8881a4879
56803H259K6336K8975K9882K9148K7877K6877K5768K3361J8715J1913M134k740
56791B58505o929p759o288m583l860l321j212K987P897J1906J4869J7790K1307
56778C01309K5247K9335L3613L7939M1643M3830M3571L9766L1523J9303N321p688
$$ plain form
56868 -332339 -317040 -307683 -304047 -305768 -312054 -321462 -332739 -345443 -359320 -373506 -386779 -398439
56856 -398439 -408675 -418100 -426949 -434737 -440796 -445086 -448065 -449797 -449998 -449315 -449497 -451263 -452700 -451101 -446205
56841 -446205 -440287 -435166 -430648 -426114 -421859 -417817 -412359 -403928 -393115 -381689 -369994 -356826 -341798
56828 -341798 -326124 -310476 -293508 -273691 -251906 -231117 -213676 -199867 -188893 -180222 -173547 -168168
56816 -168168 -163023 -157117 -149648 -140045 -128322 -115222 -101528 -87224 -71648 -54379 -35498 -14879
56803 8259 34595 63570 93452 122600 150477 177354 203122 226483 245198 257111 261245 258505
56791 258505 251576 243817 237529 232946 229086 225765 224553 227540 235437 247343 262212 280002 301309
56778 301309 326556 355891 389504 427443 469086 512916 556487 596253 627776 647079 652400 644712
56766F44712j8057k5350k9422l0128k7989k4430k0884j7830j4893j1554p520k783
56754D13872K191O582J0018J3247J7338K2105K5967K7631K7174K4896J9929J1229
56742F22179j45j1029j9020k4399k8625l1719l2282k9847k5966k2681k0600j8890
56730C56976j6590j3392r441n012m44L853P532J0417J2455J3540J3355J1488P813
56717C92550K807k787q520j4201j9282k2692k3680k2712k1125j9838j8703j7164
56705B04653j5299j3801j3063j2540j1297r031o394m300l184l039l829n345o756
56692I6775o862n384l585l077l937m623l965k615k141l059m404n015m533l168
56678D0407j336J93N46k47j003p52M4L45J22J73M79n1j759l155k510m9K164K455
$$ plain form
56766 644712 626655 601305 571883 541755 513766 489336 468452 450622 435729 424175 416655 413872
56754 413872 416063 422645 432663 445910 463248 485353 511320 538951 566125 591021 610950 622179
56742 622179 622034 611005 591985 567586 538961 507242 474960 445113 419147 396466 375866 356976
56730 356976 340386 326994 317553 312541 312097 315950 323482 333899 346354 359894 373249 384737 392550
56717 392550 395357 392570 384050 369849 350567 327875 304195 281483 260358 240520 221817 204653
56705 204653 189354 175553 162490 149950 138653 129622 123228 118928 115744 112705 108876 103531 96775
56692 96775 89913 84529 80944 77867 73930 69307 65342 62727 60586 57527 53123 48108 43575 40407
56678 40407 39071 39264 39810 39563 38560 37808 37852 38197 38319 38492 38971 38920 37161 34006 31496 31447 33611 36066
56660C6066J136nM94K401L950L629J985J199K432M171L989J641p04j259m91K44
56644F0878P93J904L450M225L564K289J602J619J432L88j179k358k519j699m35
56629G3954O78J267J229O83l1m39j81O76J590J850J199L00M48K215M342M593K286
56612I6659n05j119N65K137J889P99P48J821K597K513K529L391M472M784M321
56597A27601L823L642L433K761J699Q99J109K390L820M279L581K480J731J495
56583A64743J582J594R74l99j607j626r58j182k614l551k636q00J02k52p69q83
56567A51718r93j373j891k675l934n016m742k853l42J684K752K725J685J99r51
56552A35993j481j503r82k1O32L93q6K61J164J370P09L41P28Q21j17j133q32R17
$$ plain form
56660 36066 37202 37197 37691 40092 44042 47671 49656 50855 53287 57458 61447 63088 62384 61125 60634 60878
56644 60878 61671 63575 67025 71250 74814 77103 78705 80324 81756 82144 80965 78607 76088 74389 73954
56629 73954 74632 75899 77128 77811 77780 77341 77160 77836 79426 81276 82475 82775 83223 85438 89780 94373 96659
56612 96659 96154 95035 95600 97737 99626 100425 101173 102994 105591 108104 110633 114024 118496 123280 127601
56597 127601 131424 135066 138499 141260 142959 143858 144967 147357 151177 155456 159037 161517 163248 164743
56583 164743 166325 167919 168893 168494 166887 165261 164303 163121 160507 156956 154320 153520 153622 153370 152601 151718
56567 151718 150725 149352 147461 144786 140852 135836 131094 128241 127899 129583 132335 135060 136745 136944 135993
56552 135993 134512 133009 132027 132006 132638 133031 132945 133206 134370 135740 136449 136790 137518 138339 138222 137089 136257 137174
56534A37174L173M938N472M573L083K243J988J091m66p79J217L526L336P59j395
56519A69933j324q4N11L59P33K234L978M789M662M624N173N483M768L826M163
56504B13828N757P074P404P770Q972J0219J0533J0191R729Q712O719M577L379
56491C14864L126L430M583O518P665O456L447N37j257j920j218P29K256J620n43
56476C50293k081k461l081m474n379n053m448m403m396l998l945m714n337m786
56462B91737l560k874l021l436l735l908l894l632l260k960k867k998k856j503
56448B47233R52K471J158j839l300k009p8L44k41k76K94N30L33K45K23j32o51
56431B45257j036j488k032j943q78K61O18P14J271J593N72j254k274k121j899
$$ plain form
56534 137174 140347 145285 150757 155330 158413 160656 162644 163735 163269 162490 163707 167233 170569 171328 169933
56519 169933 168609 168525 169036 169395 170128 172362 176340 181129 185791 190415 195588 201071 205839 209665 213828
56504 213828 219585 226659 234063 241833 250805 261024 271557 281748 291477 300189 306908 311485 314864
56491 314864 317990 321420 326003 332521 340186 346642 350089 350626 349369 347449 346231 346960 349216 350836 350293
56476 350293 348212 345751 342670 338196 332817 327764 323316 318913 314517 310519 306574 301860 296523 291737
56462 291737 288177 285303 282282 278846 275111 271203 267309 263677 260417 257457 254590 251592 248736 247233
56448 247233 248185 250656 251814 249975 246675 244666 244588 244932 244691 244415 244709 245239 245572 245817 246040 245908 245257
56431 245257 244221 242733 240701 238758 237880 238141 238759 239473 240744 242337 242909 241655 239381 237260 235361
56416B35361k157k130j308l57j3K7M41J228J854K139K524L497M824N472M488K192
56400B58082J10m46N37K185L554L759K198n65k695k749j123O71J737K102J982
56385B69339J650J692K337K832K341J319R32J301J360O33K3M27J413J813J184
56370B90596J73l55j57L23O08P19R42J194J061N11Kl31r17j858k540k644k738
56353B84589l174l239k398j568j847k522j899J37J909K309J890J355N60l88n21
56338B75193M70J251N80p33q77L45J308R78K94N16J158O26j282k589j443J471
56322B77266L619L588K389J714J909K221K192J841J008l37j421j317k20P89J243
56307B96484J533J699J157M4l52O66J881J570j45j413j024L31J380J936K596L325
$$ plain form
56416 235361 233204 231074 229766 229409 229396 229423 229864 231092 232946 235085 237609 241106 245930 251402 255890 258082
56400 258082 258192 257746 258283 260468 264022 267781 269979 269414 266719 263970 262847 263518 265255 267357 269339
56385 269339 270989 272681 275018 277850 280191 281510 282442 283743 285103 285736 285759 286186 287599 289412 290596
56370 290596 290769 290414 290257 290580 291188 291907 292849 294043 295104 295615 295617 295286 294369 292511 289971 287327 284589
56353 284589 281415 278176 275778 274210 272363 269841 267942 268079 269988 272297 274187 275542 276102 275714 275193
56338 275193 275663 276914 277494 276761 275884 276229 277537 278515 278809 279325 280483 281109 279827 277238 275795 277266
56322 277266 280885 284473 286862 288576 290485 292706 294898 296739 297747 297410 295989 294672 294452 295241 296484
56307 296484 298017 299716 300873 300917 300565 301231 303112 304682 304537 303124 302100 302431 303811 305747 308343 311668
56291C11668L361K591K073K612L465L284K001P59J23m09r13l73J675L822M237
56276C39976K924J489J033J326J847K657L935N343O128N670M068K366J870K888
56262C83520M460N484N577M667K851J142J126K808L909K770Q82Q95K760L976L309
56247D30136K072J597J609J759K760M997P358Q497Q229P018N238L619L198L969
56233D92056M622M338L830L835L939L819M331O026P675P783O907O854Q163R809
56219E73987J1103J2252J3061J2759J1514J0901J2086J4346J6024J6494J6531
56208G21058J6981J7661J7764J7104J6593J7235J9032K1279K3765K6821L0147
56197I45440L2680L4159L5945L9447M4247M8599N1332N2695N3788N5917N9942
$$ plain form
56291 311668 315029 317620 319693 322305 325770 329054 331055 331814 331937 331528 330615 330242 331917 335739 339976
56276 339976 342900 344389 345422 346748 348595 351252 355187 360530 366658 372328 376396 378762 380632 383520
56262 383520 387980 393464 399041 403708 406559 407701 408827 411635 415544 418314 419196 420091 422851 426827 430136
56247 430136 432208 433805 435414 437173 439933 444930 452288 460785 469014 476032 481270 484889 488087 492056
56233 492056 496678 501016 504846 508681 512620 516439 520770 526796 534471 542254 549161 556015 564178 573987
56219 573987 585090 597342 610403 623162 634676 645577 657663 672009 688033 704527 721058
56208 721058 738039 755700 773464 790568 807161 824396 843428 864707 888472 915293 945440
56197 945440 978120 1012279 1048224 1087671 1131918 1180517 1231849 1284544 1338332 1394249 1454191
56186A454191O5391P0508P3972P6191P8079P9163P8074P4607O9893O4470N7612
56175B242151M8917L9248K9439J9024P192n686j8220k9212l8146m5003n0315n5081
56163B144308n9824o3957o6584o7616o7493o6208o3566o0257n7558n5753n3800
56152A461692n0934m7704m4862m2074l8714l5213l2525l0596k8577k6419k4954
56141A059120k4121k2533j9424j5936j3607j2499j1759j1175j0892j0212q141
56130H98821n024k413j204j008j347k210l143l005j350Q35K279K688K458J931
56116H88308J518J796K757L544L641L832N182P435R246R856R810J0041J0890J2158
56102I80014J3635J5164J6485J7225J7260J7091J7637J9377K1663K3305K3944
$$ plain form
56186 1454191 1519582 1590090 1664062 1740253 1818332 1897495 1975569 2050176 2120069 2184539 2242151
56175 2242151 2291068 2330316 2359755 2378779 2385971 2380285 2362065 2332853 2294707 2249704 2199389 2144308
56163 2144308 2084484 2020527 1953943 1886327 1818834 1752626 1689060 1628803 1571245 1515492 1461692
56152 1461692 1410758 1363054 1318192 1276118 1237404 1202191 1169666 1139070 1110493 1084074 1059120
56141 1059120 1034999 1012466 993042 977106 963499 951000 939241 928066 917174 906962 898821
56130 898821 893797 891384 890180 889172 887825 885615 882472 879467 878117 878952 881231 883919 886377 888308
56116 888308 889826 891622 894379 897923 901564 905396 910578 918013 927259 937115 946925 956966 967856 980014
56102 980014 993649 1008813 1025298 1042523 1059783 1076874 1094511 1113888 1135551 1158856 1182800
56091A182800K4470K5905K8204L0541L2582L5107L9201M4980N1142N6059N9443
56080A610434O2826O8097P5767Q4877R4281J03367J11629J18133J21647J21052
56070B572110J15767J06260R4170Q1513O9719N9637N1874M6311M1389L4831K5408
56059C298989J3678J276r922j8341k3675k7585l2491l9555m8442n8825p0769q3322
56047B901016r4101j00994j03563j02330r7675r0052q0565p0526o0898n2455m5682
56036B002175m0181l4932k9641k5027k1302j7360j2230o641k253K20J433K401
56024A816662L730N518P510R443J1327J3112J4189J4020J3324J3654J5540J7932
56012A955961J9721K0832K1444K1264K0298J9502J9935K1779K4526K7326K9095
$$ plain form
56091 1182800 1207270 1233175 1261379 1291920 1324502 1359609 1398810 1443790 1494932 1550991 1610434
56080 1610434 1673260 1741357 1817124 1902001 1996282 2099649 2211278 2329411 2451058 2572110
56070 2572110 2687877 2794137 2888307 2969820 3039539 3099176 3151050 3197361 3238750 3273581 3298989
56059 3298989 3312667 3313943 3304021 3285680 3262005 3234420 3201929 3162374 3113932 3055107 2984338 2901016
56047 2901016 2806915 2705921 2602358 2500028 2402353 2312301 2231736 2161210 2100312 2047857 2002175
56036 2002175 1961994 1927062 1897421 1872394 1851092 1833732 1821502 1814861 1812608 1812828 1814261 1816662
56024 1816662 1820392 1825910 1833420 1842863 1854190 1867302 1881491 1895511 1908835 1922489 1938029 1955961
56012 1955961 1975682 1996514 2017958 2039222 2059520 2079022 2098957 2120736 2145262 2172588 2201683
56001B201683K9257K8760K9275L1121L3192L5008L7282L9952M1615M1819M2112
55990B591076M3578M5009M5038M4508M4952M5942M5980M5201M5284M7100N0070
55979C093738N3459N6858N9780O2211O5249O9911P5628Q1047Q5868R0761R5848
55968C890358J00573J04815J09126J14005J19625J25820J31892J37214J42629
55959D976057J50103J60138J70872J80677J90276K00963K12418K24128K37505
55950F703137K54289K73775K93944L14880L38727L66461L96762M28066M59851
55941I829892M91813N23394N54477N85346O15952O46250O77148P10113P45973
55932A5380358P84854Q26716Q71071R16743R62898J009953J059073J111656J169642
$$ plain form
56001 2201683 2230940 2259700 2288975 2320096 2353288 2388296 2425578 2465530 2507145 2548964 2591076
55990 2591076 2634654 2679663 2724701 2769209 2814161 2860103 2906083 2951284 2996568 3043668 3093738
55979 3093738 3147197 3204055 3263835 3326046 3391295 3461206 3536834 3617881 3703749 3794510 3890358
55968 3890358 3990931 4095746 4204872 4318877 4438502 4564322 4696214 4833428 4976057
55959 4976057 5126160 5286298 5457170 5637847 5828123 6029086 6241504 6465632 6703137
55950 6703137 6957426 7231201 7525145 7840025 8178752 8545213 8941975 9370041 9829892
55941 9829892 10321705 10845099 11399576 11984922 12600874 13247124 13924272 14634385 15380358
55932 15380358 16165212 16991928 17862999 18779742 19742640 20752593 21811666 22923322 24092964
55923B4092964J234783J306962J384682J467968J558946J658912J767133J883654
55915C6356004K010943K151422K305843K475317K662313K868562L095562L348907
55907E7274873L638199L970570M348185M774638N259428N813495O445258P164369
55899I8689015P984354Q918848R981904J1196094J2592589J4197062J6019396
55892A79579262J8054612K0276394K2619746K4971851K7143225K8749754K9058753
55885C50453597K7052698K1900757J3609304L296798p223688j6260530k2852107
55878C69976829k6846595k8611808k8702367k7652425k5889125k3723604k1384002
55871A87166903j9046405j6837675j4828736j3044386j1482510j0124917q944025
$$ plain form
55923 24092964 25327747 26634709 28019391 29487359 31046305 32705217 34472350 36356004
55915 36356004 38366947 40518369 42824212 45299529 47961842 50830404 53925966 57274873
55907 57274873 60913072 64883642 69231827 74006465 79265893 85079388 91524646 98689015
55899 98689015 106673369 115592217 125574121 136770215 149362804 163559866 179579262
55892 179579262 197633874 217910268 240530014 265501865 292645090 321394844 350453597
55885 350453597 377506295 399407052 413016356 416313154 409089466 392828936 369976829
55878 369976829 343130234 314518426 285816059 258163634 232274509 208550905 187166903
55871 187166903 168120498 151282823 136454087 123409701 111927191 101802274 92858249
55864I2858249p914694p021343o251161n586384n008889m507022m071547l689276
55856D8807933l347193l039669k765712k521765k302214k104285j926984j767092
55848B9033019j620790j487513j368104j260929j163736j077347j003352r39661
55840A9111587q82210q29646p82667p39976o98663o57783o18375n80799n44956
55831A2776512n12014m82805m55489m27799m00612l76239l53991l30656l04955
55822I131952k78582k53078k28462k04857j83034j63347j46393j34656j31286
55813G408257j37108j50241j68091j87772k05358k17336k23224k25083k24449
55804E669595k21188k15062k06573j96379j85249j74415j64579j55056j45283
$$ plain form
55864 92858249 84943555 77922212 71671051 66084667 61075778 56568756 52497209 48807933
55856 48807933 45460740 42421071 39655359 37133594 34831380 32727095 30800111 29033019
55848 29033019 27412229 25924716 24556612 23295683 22131947 21054600 20051248 19111587
55840 19111587 18229377 17399731 16617064 15877088 15178425 14520642 13902267 13321468 12776512
55831 12776512 12264498 11781693 11326204 10898405 10497793 10121554 9767563 9436907 9131952
55822 9131952 8853370 8600292 8371830 8166973 7983939 7820592 7674199 7539543 7408257
55813 7408257 7271149 7120908 6952817 6765045 6559687 6342351 6119127 5894044 5669595
55804 5669595 5448407 5233345 5026772 4830393 4645144 4470729 4306150 4151094 4005811
55795D005811j36627j30883j27528j24182j19538j14175j08845j03804r9591r6572
55785B844066r3682q9373q3887p9025p5682p3119p0673o8445o6099o2712n8296
55774B023073n4086n0831m8155m5962m5083m5768m6672m6198m4187m1642l9390
55763A515099l7700l6730l6671l7206l7199l5346l1558k7543k5304k4881k4313
55752A160648k2125j8998j6551j5423j5216j5266j4696j2648r445o628m975l531
55740A005146j596m61j502l722m918m593l839l002j530L6J26j570l643n078o243
55725I63611p465q264q505r004j0357j2265j4297j6187j7112j6092j3629j1744
55713H18690j1684j2503j2472j0963q400n402k748j439j899l445n089o517p824
$$ plain form
55795 4005811 3869184 3738301 3610773 3486591 3367053 3252878 3144033 3040229 2940638 2844066
55785 2844066 2750384 2661011 2577124 2498099 2422417 2349298 2278625 2210180 2144081 2081369 2023073
55774 2023073 1968987 1918156 1870001 1824039 1778956 1733188 1686516 1640318 1596131 1554489 1515099
55763 1515099 1477399 1440669 1403998 1366792 1329593 1294247 1262689 1235146 1209842 1184961 1160648
55752 1160648 1138523 1119525 1102974 1087551 1072335 1057069 1042373 1029725 1020280 1013652 1008677 1005146
55740 1005146 1003550 1003089 1001587 997865 992947 988354 984515 981513 979983 980019 980145 978575 974932 969854 963611
55725 963611 956146 947882 939377 930373 920016 907751 893454 877267 860155 844063 830434 818690
55713 818690 807006 794503 782031 771068 762668 757266 754518 753079 751180 747735 742646 736129 728305
55700G28305q783q925q212p250o819p232q147q973r536j0044j0457j0464j0310
55687F13153j0756j1714j1835j0383q686q493r523j0001r194p846o396m528k722
55674E01076k478m248o400o967n690l844k851l395n063o483o457n270m182l703
55660D34045l338k999l320m285m777m115k846j502K04K159L111K281Q50N07J117
55645D17092J068l70k291l677m533n296n971o362o697p479q802j0045j0289r157
55631C37191p324o119o357p490p951o572l817j509j014j711j727k96J268J394
55617B87966L89j15O10J617J750R27j72r96j359j280r46n84l04k32n93j383k091
55600B83204k185j655p44N00J905K789K585J605O68J99K53Q84J799K091J285K45
$$ plain form
55700 728305 719522 710597 702385 695135 688316 681084 672937 663964 654428 644384 633927 623463 613153
55687 613153 602397 590683 578848 568465 559779 551286 541763 531762 522568 514722 508326 503798 501076
55674 501076 498598 494350 487950 480983 475293 471449 468598 465203 460140 453657 447200 441930 437748 434045
55660 434045 430707 427708 424388 420103 415326 411211 408365 406863 407067 409226 412337 414618 415468 415975 417092
55645 417092 418160 417790 415499 411822 407289 401993 396022 389660 382963 375484 366682 356637 346348 337191
55631 337191 329867 323748 317391 309901 301950 295378 291561 290052 289038 287327 285600 285304 286572 287966
55617 287966 288355 288240 288850 290467 292217 293144 292972 291976 290617 289337 288391 287807 287503 287271 286678 285295 283204
55600 283204 281019 279364 278620 279120 281025 283814 286399 288004 288672 288871 289124 290008 291807 293898 295183 295428
55584B95428O1M88M45j91o31p15j199k470m133n852p513q540q216o679m630k322
55568B43331m0R06o58l605n351m984l951l415k964k337k316k936k730q93J278
55553B09335K247K056J276j92k020k735j694n08q94k201k672k148j765j795j607
55538A94683j250j338j659j412n94J18N86J004R13k79j909k560j867p91k43l88
55522A83014r34j239n64P93J293K55o05P37L558N215M630L147K085J484J376K290
55506B06535L804M402L569K552K179J412q47l648n049m595l569l111l139l091
55492A97404k881k895l261l508l067k189j826k325k778k339j622j726k267j772
55478A62948j7J405J227N7p69q70p42q31j258j843k044j457o47o34j345j536p21
$$ plain form
55584 295428 295489 295977 296422 296231 295600 294885 293686 291216 287083 281231 273718 265178 256962 250283 245653 243331
55568 243331 243291 244197 243539 239934 234583 229599 225648 222233 219269 216932 214616 211680 208950 208057 209335
55553 209335 211582 213638 214914 214722 212702 209967 208273 207765 206871 204670 201998 199850 198085 196290 194683
55538 194683 193433 192095 190436 189024 188430 188548 189134 190138 191051 190772 188863 186303 184436 183645 183402 183014
55522 183014 182080 180841 180277 181070 182363 182618 182013 182750 186308 191523 196153 199300 201385 202869 204245 206535
55506 206535 210339 214741 218310 220862 223041 224453 223606 219958 214909 210314 206745 203634 200495 197404
55492 197404 194523 191628 188367 184859 181792 179603 177777 175452 172674 170335 168713 166987 164720 162948
55478 162948 162931 164336 165563 165620 164851 163981 163239 162408 161150 159307 157263 155806 155159 154525 153180 151644 150923
55461A50923j07r55k910m654n480n356m160j892P24K722L821M198L633J718j139
55446A41086l484l841j904J023K765K001m00k182k099r64j55L9k2m45j443k307
55430A27668j989o24N18P24O39J070J639J152q76l312m164k335J125L790M032
55415A29057K313K97q57j008m73L26P79M29n27j469k130k714l267l318k347m81
55399A14610J367K054J164m63j419j098j66N06P86Q57N03m48j316j190k15N90
55383A16122Q14J072J713K112J776J327J652K465K600J504k13j694k564k742k156
55368A23788j056l5O16J188J835K012J214J0l83M35J695K525K571J552o60k997
55352A34310l463j459R44J395K94m9J050J788Q56o57j139p29m54l17K69Q66M51
$$ plain form
55461 150923 150816 149861 146951 142297 136817 131461 127301 125409 126133 128855 132676 136874 140507 142225 141086
55446 141086 137602 133761 131857 132880 135645 137646 137246 135064 132965 132001 131846 131885 131863 131418 129975 127668
55430 127668 125679 125055 125573 126297 126936 128006 129645 130797 129921 126609 122445 120110 121235 125025 129057
55415 129057 131370 131667 130810 129802 129329 129655 130434 130863 130336 128867 126737 124023 120756 117438 115091 114610
55399 114610 115977 118031 119195 118732 117313 116215 116049 116555 117341 118198 118701 118253 116937 115747 115532 116122
55383 116122 116936 118008 119721 121833 123609 124936 126588 129053 131653 133157 132944 131250 128686 125944 123788
55368 123788 122732 122697 123313 124501 126336 128348 129562 129572 129189 129624 131319 133844 136415 137967 137307 134310
55352 134310 130847 129388 130332 131727 132021 131972 133022 134810 135666 135009 133870 133141 132687 132370 132639 133505 133956
55335A33956p61j291l52J243K192J937P12p83j630j313l42K08k9l79l7J025K052
55318A36408K082Q06q07j175R4J518J609P23J13j35p89j588j479o42m32j042j057
55301A34207K6Q04L42l26l39o68j946k442n26K121K490P40j28R45J615J15k004
55284A35026k439j249J44J335K404K479Q11j395k159j356n18m25n49p04j398k352
55268A27655k347j165j69l42r53r70o19n31m92j49j36j071j984j350M97J489N85
55251A17948q94j263m81M45J057J419J253K92p96q61L16J786K592K472J602M50
55235A27337j55K58R65Q31K6p1R17J588Q89j73j64M82K77q34j564j500j480j561
55217A26068o32J261K079N17j759k111k75J738K411J871P05o92j533r72N81J588
$$ plain form
55335 133956 133195 131904 131552 132795 134987 136924 137636 136853 135223 133910 133568 133776 133747 133368 133331 134356 136408
55318 136408 138490 139296 138489 137314 137408 138926 140535 141258 141371 141236 140447 138859 137380 136738 136306 135264 134207
55301 134207 134233 135037 135379 135053 134714 134046 132100 129658 129132 131253 133743 134483 134355 135300 136915 137030 135026
55284 135026 132587 131338 131482 132817 135221 137700 138511 137116 134957 133601 133083 132658 132109 131405 130007 127655
55268 127655 125308 124143 123974 123632 122679 121709 121090 120559 120067 119918 119782 118711 116727 115377 115874 117363 117948
55251 117948 117054 115791 115310 115755 116812 118231 119484 119776 118980 118119 118435 120221 122813 125285 126887 127337
55235 127337 127182 127440 128405 129236 129262 129191 130108 131696 132585 132412 132248 132730 133007 132173 130609 129109 127629 126068
55217 126068 125436 126697 128776 129293 127534 125423 125148 126886 129297 131168 131873 131181 129648 128676 129257 130845
55201A30845J273M39O0Q0N9P2K94L64j21r33j537j714j456p93j17j36q70j266
55183A24543m41J055J894J602Q80M51L21J74p9k68k22Q5N11R56J520K177K352
55166A37511J544M31L68J286J211j045l731m134k214m47j92k25N65J042k60k430
55150A29280l149j887m99n72j521j763q23L49P30L13n9L09J232J836J555P77L43
55133A26451N15P66N67P4j47J39N89P82P21P25R16J070J020Q36M90k57j231j572
55115A32454q09J07j79j353j502K97K571L398K771J859Q52q40k462k047P14L195
55099A39026K732j07k315k085m29P20P99N74O55Q41P43M41L35N90R06Q72M55M
55081A44757k20l28n29p64q54q49r28j012q10l09N6j09p10j330j614j383o45K68
$$ plain form
55201 130845 132118 132557 132617 132697 132756 132828 133122 133486 133365 132432 130895 129181 127725 126932 126815 126679 125809 124543
55183 124543 124102 125157 127051 128653 129533 129984 130305 130479 130400 130132 129910 129995 130506 131462 132982 135159 137511
55166 137511 139055 139486 139854 141140 142351 141306 137575 133441 131227 130780 130588 130363 130928 131970 131710 129280
55150 129280 126131 124244 123745 123173 121652 119889 119066 119415 120145 120458 120399 120708 121940 123776 125331 126108 126451
55133 126451 126966 127732 128299 128373 128226 128365 128954 129736 130457 131182 132098 133168 134188 135024 135514 135257 134026 132454
55115 132454 131645 131752 131573 130220 128718 129015 131586 134984 137755 139614 140466 139626 137164 135117 135831 139026
55099 139026 141758 141651 139336 137251 136822 137542 138341 138915 139570 140411 141154 141595 141930 142520 143426 144298 144753 144757
55081 144757 144537 144209 143680 142916 142062 141213 140285 139273 138463 138154 138210 138101 137391 136061 134447 133064 132419 132687
55063A32687P29L94l68q78r60r34q47k19J154K525K857K071J197J209J954K324
55047A44895J395o18k429k784j709m55K4K31J223K739L180J745k30q10K54J515
55031A48166J739J011P3m40p5J187K479K574J291k38r18o82J21J350K485K355
55015A62478M79j899l139l117k788k287r57Q49J594O58p53j380j399j399j068
55000A45872J7J212J653J677K182K970K983J948O56k83q21q13k06J32q43k583
54984A55753l258k231q82m81n64k37K65M45P21J435J645M39j190j397j22J051
54968A51392J413J790K513K598J625P25P49P72k74j591j540p5J221J251L26q37
54952A62058j788j963q71R40K021J603L44o68j025p55M4Q71R01J52j84N69J183
$$ plain form
55063 132687 133416 133810 133442 132564 131604 130670 129823 129604 130758 133283 136140 138211 139408 140617 142571 144895
55047 144895 146290 145672 143243 140459 138750 138295 138319 138550 139773 142512 145692 147437 147207 146397 146651 148166
55031 148166 149905 150916 150989 150549 150474 151661 154140 156714 158005 157767 156849 156167 156288 157638 160123 162478
55015 162478 162957 161058 157919 154802 152014 149727 148770 149619 151213 151871 151118 149738 148339 146940 145872
55000 145872 145889 147101 148754 150431 152613 155583 158566 160514 161170 160887 160066 159253 159047 159179 158336 155753
54984 155753 152495 150264 149382 148901 148337 148100 148365 148810 149531 150966 152611 153050 151860 150463 150341 151392
54968 151392 152805 154595 157108 159706 161331 162056 162805 163577 163303 161712 160172 160097 161318 162569 162895 162058
54952 162058 160270 158307 157436 158376 160397 162000 162344 161676 160651 159896 159940 160811 161712 161864 161680 162249 163432
54935A63432M5k265l297j824O61J988J769J083O64M74N58J096J607J189k82j805
54919A65093k347j713k95J425K823L219K450J186L35K99Q44J375J337P38L12O73
54903A77754J358J305L77m48n89o13r21p69N28K189K855K395J622O42j118l321
54887A83246m561m133k739j074J081L646N256M636K407M93m0K99O35P96J007J250
54871A92205J349J337J428J669J817J634J251J142J550K234K895L752N172O892
54857B26327Q174Q733Q867Q533P089M513K043Q71N94j49j797l436m250m463m600
54842B57049m598m089l203k545k500k920l393l666l692l515l124k528j841j177
54828B14258l98P86K204L058K678J531Q81J298J865J351M9j60K051N560P645O903
$$ plain form
54935 163432 163477 161212 157915 156091 156752 158740 160509 161592 162256 162730 163288 164384 165991 167180 166898 165093
54919 165093 162746 161033 160738 162163 164986 168205 170655 171841 172176 172475 173319 174694 176031 176769 177081 177754
54903 177754 179112 180417 180794 180346 179757 179144 178223 177454 177982 180171 183026 185421 187043 187685 186567 183246
54887 183246 178685 174552 171813 170739 171820 175466 180722 185358 187765 188258 188218 188517 189152 189948 190955 192205
54871 192205 193554 194891 196319 197988 199805 201439 202690 203832 205382 207616 210511 214263 219435 226327
54857 226327 234501 243234 252101 260634 267723 272236 274279 275150 275744 275595 273798 270362 266112 261649 257049
54842 257049 252451 248362 245159 242614 240114 237194 233801 230135 226443 222928 219804 217276 215435 214258
54828 214258 213860 214646 216850 219908 222586 224117 224998 226296 228161 229512 229561 229401 231452 237012 244657 251560
54812B51560M791L870M830N998N650L965K251J022l73k442m776o676p975q895
54798B52800r450r321q212o271m210l020l253m410n208m715l212j854j473j863
54784A86328k198j994j489j191j286j590j811j677r23M50J867K481J968Q30k62
54769A79503j197k218l228l681l248k244j168j2J523L134L693K479L85p58k29
54754A72734Q16J022N63N08R60J004M49L73J463K749K739J320k06p39l67J01O0
54737A85549m71r80r48l72K69N47M35R8k55k80L06J245J901K066K099K013J205
54720A94427m16j665j209Q14K915L811L354K211J234J086J958L506N144O274O333
54705B29777N276M180M420N944P181P218O974P361P466N940L263J025m98k329
$$ plain form
54812 251560 256351 260221 265051 271049 276699 280664 282915 283937 283564 281122 276346 269670 261695 252800
54798 252800 243350 234029 225817 219546 215336 212316 209063 204653 199445 194730 191518 189664 188191 186328
54784 186328 184130 182136 180647 179456 178170 176580 174769 173092 172169 172619 174486 176967 178935 179765 179503
54769 179503 178306 176088 172860 169179 165931 163687 162519 162507 164030 167164 170857 173336 173721 172963 172734
54754 172734 173550 174572 175135 175643 176603 177607 178056 178429 179892 182641 185380 186700 186494 185755 185388 185489 185549
54737 185549 185078 184098 183150 182778 183047 183594 184029 184127 183872 183592 183898 185143 187044 189110 191209 193222 194427
54720 194427 194011 192346 191137 191951 194866 198677 202031 204242 205476 206562 208520 212026 217170 223444 229777
54705 229777 235053 239233 243653 249597 256778 263996 270970 278331 285797 291737 295000 296025 295527 293198
54691B93198m628o327o977p277p543p239o301n398m543l067j465j351k820l662
54677B24600k348k91L64k18l45L93R38Q72R31J633K652L524L906L409K119J030
54661B43169R59J498K001K963M991O964O940M841K615J617J335R47M61k02j721
54646B79378m077n985o541o406o504o559n916m927m261l562k069k68L43p54k354
54631B19538k996k500j817j877k704l375k825j027P69J298P10K64P50J674J969
54616B07851J086o64k412l353l343k952k726k531j942j044l59r1j1q4n16j072
54600A85837j049k57N73P03K29l97j071j687j655o54M71N49k00k92R29K320K609
54583A86958K050J721J746J300J33r42j252j117j131j177o40N90J827K225J597
$$ plain form
54691 293198 288570 282243 275266 267989 260446 253207 246906 241508 236965 233898 232433 231082 228262 224600
54677 224600 222252 221961 222325 222107 221762 222155 223093 223965 224896 226529 229181 232705 236611 240020 242139 243169
54661 243169 244128 245626 247627 250590 255581 262545 269485 274326 276941 278558 279893 280840 281301 281099 279378
54646 279378 275301 269316 262775 256369 249865 243306 237390 232463 228202 224640 222571 222303 222646 221892 219538
54631 219538 216542 214042 212225 210348 207644 204269 201444 200417 201186 202484 203194 203458 204208 205882 207851
54616 207851 208937 208273 205861 202508 199165 196213 193487 190956 189014 187970 187611 187520 187509 187425 186909 185837
54600 185837 184788 184531 185104 185807 186036 185639 184568 182881 181226 180572 181043 181592 181392 181100 182029 184349 186958
54583 186958 189008 190729 192475 193775 193908 192966 191714 190597 189466 188289 187649 188239 190066 192291 193888
54568A93888O52L78R77J508Q50r06k382k317p70J077K006J550J88r89j091j36
54552A94483J154K205K859K873J864N9j410j595p70%L4m76q59m13J121L060M099
54535B08288L691K749K414K442J648k15j905k108p37J297K906L263K101P2j504
54520B24402j662m55J292K604K876K211J367J002J054J205J601K336K460O70k580
54505B40383m831m200j528Q00J607J483J143M31p61j668j401j33J025J303J049
54490B34702J122J758K322K185J519R76Q74J026J160J109P72L86O62J993L558
54475B56124L988K976J471K56p59j594j678r08k42m62j023r67k09Q19J995K985
54459B62772K830J375L46J372L361L672J763k50r46j388k764m091l708j762K01
$$ plain form
54568 193888 194540 194918 195895 197403 198253 197347 194965 192648 191878 192955 194961 196511 196699 195710 194619 194483
54552 194483 195637 197842 200701 203574 205438 205497 204087 202492 201722 201722 201756 201280 200421 200008 201129 204189 208288
54535 208288 211979 214728 217142 219584 221232 221017 219112 217004 216267 217564 220470 223733 225834 225906 224402
54520 224402 222740 222285 223577 226181 229057 231268 232635 233637 234691 235896 237497 239833 242293 242963 240383
54505 240383 235552 231352 229824 230624 232231 233714 234857 235288 234527 232859 231458 231325 232350 233653 234702
54490 234702 235824 237582 239904 242089 243608 244584 245458 246484 247644 248753 249525 249911 250573 252566 256124
54475 256124 260112 263088 264559 264815 264056 262462 260784 259876 259634 259172 258149 257182 256973 257792 259787 262772
54459 262772 265602 266977 267323 268695 272056 275728 277491 277241 276295 274907 272143 268052 264344 262582 262783
54444B62783J297J602J154Q8p34n57Rj89r59r22L94J872K393K099J769J840K329
54427B76268K944L009K126J038R63J718J625q0j805j543M77K229K577K309K578
54412B96433L467M353M853M911M473L542K338J225N97P90J719K619K715K234K175
54397C38444K773K880J384j173l064l281k385j537j275j423j662j879k120k464
54383C23218k854k927k236q60K63j45k484n471o807n130j450J733K878K597K144
54368C02469J502j15k249l067j670M59J113j78j994k823k208n55J220J950J115
54353B94969l63r61l65K87J60j59K04R50J034J08j124j808j559l63J430K947L251
54336B98638K196O72j67K43J561K729K608R57j149k242j937j122o59l45N96K319
$$ plain form
54444 262783 264080 265682 266836 266924 266190 265633 265642 265453 264494 263572 263966 265838 268231 270330 272099 273939 276268
54427 276268 279212 282221 284347 285385 286348 288066 289691 289611 287806 286263 286740 288969 291546 293855 296433
54412 296433 299900 304253 309106 314017 318490 322032 324370 325595 326192 326982 328701 331320 334035 336269 338444
54397 338444 341217 344097 345481 344308 341244 337963 335578 334041 332766 331343 329681 327802 325682 323218
54383 323218 320364 317437 315201 314341 314604 314459 311975 306504 299697 294567 293117 294850 297728 300325 302469
54368 302469 303971 303856 301607 298540 296870 297329 298442 298264 296270 293447 291239 290684 291904 293854 294969
54353 294969 294606 293645 293280 293567 293727 293568 293772 294722 295756 295864 294740 292932 291373 291010 292440 295387 298638
54336 298638 300834 301506 301339 301582 303143 305872 308480 309437 308288 306046 304109 302987 302328 301983 302579 304898
54320C04898M009M599L658J695k16j208j163n26K32P65O93j55j196j374l93P55
54304C15073Q46j48j179j409r82n86p04j231j494p97O39J452N20j412k221q77
54288C05490J187J714K19j706k483k182j926k295k851k965k576j970j247m40K3
54273B85992n82k395m462n427m764l141j601n70K63J334K472K895K065N80k02
54258B72457K09O42k82k112k909j732J51Q97K67n04m02M91J501J986J591M85o43
54241B72093j175j105p11j57L12K18m07p17k56m0j280l326m205l281k018j719
54225B52226j828j239j34M74L18r4m35o83o55l52m01j240k049j532K43J698J592
54208B45909L93l94J64J634K626K080L44j143j466j103q27n00J95N82j36j168
$$ plain form
54320 304898 308907 313506 317164 318859 318643 317435 316272 315746 315978 316743 317436 317281 316085 314711 314318 315073
54304 315073 315919 315771 314592 313183 312201 311615 310911 309680 308186 307389 308028 309480 310000 308588 306367 305490
54288 305490 306677 308391 308610 306904 304421 302239 300313 298018 295167 292202 289626 287656 286409 285969 285992
54273 285992 285410 283015 278553 273126 268362 265221 263620 263050 263313 264647 267119 270014 272079 272659 272457
54258 272457 272666 273308 273026 270914 268005 266273 266424 267321 267588 267084 266682 267173 268674 270660 272251 272736 272093
54241 272093 270918 269813 269102 268945 269257 269475 269068 268351 268095 268055 266775 263449 259244 255963 253945 252226
54225 252226 250398 249159 249025 249499 249817 249723 249288 248605 247950 247598 247197 245957 243908 242376 242619 244317 245909
54208 245909 246302 245908 246072 247706 250332 252412 252756 251613 250147 249044 248217 247717 247912 248494 248358 247190
54192B47190q51R14K376K467K015J836J140q78l057l469k046n88l23p47q60m06
54176B44713L72J194J560Q69p84k435l238l155k431j054P33J883J389l25j552
54161B37739j097M39J540J498Q29K01l68j040j545j487q88q7O33Q75J83j073j377
54144B34975J98K161J880r48l521l339j184L52L26k6L58J004J063N98K50L45O79
54127B35171P83L18m52p38k06L81J61n17o71l27m61j232j495n44O67P31m40j779
54109B29350k448k387j817r41p0L71J92k77k58Q45K573L460K574Q00k02j71l09
54092B31285j147j715j336q64j131j330k98J343J860R42J55O63J838K454K256
54077B34975J772J294P23J63R3P79J654J545m1j925k273r41J33l75j134j35J950
$$ plain form
54192 247190 246339 247253 249629 252096 254111 255947 257087 256209 253152 249683 247637 247049 246726 245979 245119 244713
54176 244713 245085 246279 247839 248708 247924 245489 242251 239096 236665 235611 236344 238227 239616 239291 237739
54161 237739 236642 237081 238621 240119 240948 241149 240781 239741 238196 236709 235821 235734 236367 237242 237425 236352 234975
54144 234975 235173 237334 239214 238266 234745 231406 230222 230574 230900 230874 231232 232236 233299 233897 234147 234492 235171
54127 235171 235954 236272 235820 235082 234876 235257 235418 234901 234230 233903 233442 232210 230715 230171 230838 231569 231129 229350
54109 229350 226902 224515 222698 221757 221687 222058 222250 221973 221715 222560 225133 228593 231167 231967 231765 231594 231285
54092 231285 230138 228423 227087 226223 225092 223762 223464 224807 226667 227609 227764 228427 230265 232719 234975
54077 234975 236747 238041 238764 238927 239020 239799 241453 242998 242957 241032 238759 237818 237951 237576 236442 236307 238257
54060B38257K373K99j799j566J63R87M61K75J436K948L421K810K083J936K178
54045B56262K106J240p5r07q41n02n51n86J22J087R89k60j086n46K02k80j231
54028B55143o56J516K902J813n07j711j406j022j207r80L36J695J722O99J97J006
54012B59540K367L218L489L798M331M522L808K452J381J296K053K978L634M042
53998C02909M299M339M145L810L373K956L116M472O725Q608R192Q772P982O714
53984C81412M765L005K651L426L591K241N55J77J143K138K427K597L468M925O106
53969D24627O434O197O085O287O200N249L725K500K061K211K577K824K455J143
53955D80575n32j406j085l52l6k74j186l151n666p068o638o193p815j0464j0730
$$ plain form
54060 238257 240630 240929 239130 237564 237727 238714 239175 239450 240886 243834 247255 250065 252148 254084 256262
54045 256262 258368 259608 259533 258626 257785 257283 256732 256146 256268 257355 258344 258084 256998 256452 256654 256374 255143
54028 255143 254487 256003 258905 260718 260211 258500 257094 256072 254865 253885 254221 255916 257638 258337 258534 259540
54012 259540 261907 265125 268614 272412 276743 281265 285073 287525 288906 290202 292255 295233 298867 302909
53998 302909 307208 311547 315692 319502 322875 325831 328947 333419 340144 348752 357944 366716 374698 381412
53984 381412 386177 389182 391833 395259 398850 401091 401646 401823 402966 405104 407531 410128 413596 418521 424627
53969 424627 431061 437258 443343 449630 455830 461079 464804 467304 469365 471576 474153 476977 479432 480575
53955 480575 480043 478637 477552 477200 477164 476890 475704 472553 466887 459819 453181 446988 439173 428709 417979
53940D17979p325k943q80j385k611l714n065o118n330k733p87j624m368o276n969
53925C60851m515l513l221k931k400k232k804l426k959j335K7k64j757k597j825
53910C25099m15M60J229K892M763M851K695K46o61m37l62k76Q04K554L560L596
53894C50598L905M984N621M843L489K895L039L138L310M322O085P579Q168P991
53880D19967P130N548M020L932N609P642Q442P916P048O395N727M812L804K921
53866E00913K349K479L634N424O892P526P727Q043Q374Q313Q047Q345R576J1090
53852E98732J1746J0979R295P868P556Q296R420J0543J1686J2410J1559Q718N601
53839G24409M815O934R690J0457Q614M997J51n577j0884j4014j4595j4029j3799
$$ plain form
53940 417979 410654 407711 406831 405446 402835 399121 394056 387938 382608 379875 379088 377464 373096 366820 360851
53925 360851 356336 352823 349602 346671 344271 342039 339235 335809 332850 331515 331542 331278 329521 326924 325099
53910 325099 324684 325144 326373 329265 334028 338879 341574 341820 341159 340722 340360 340084 340888 343442 347002 350598
53894 350598 354503 359487 365108 369951 373440 376335 379374 382512 385822 390144 396229 403808 411976 419967
53880 419967 427097 432645 436665 440597 446206 453848 462290 470206 477254 483649 489376 494188 497992 500913
53866 500913 503262 505741 509375 514799 521691 529217 536944 544987 553361 561674 569721 578066 587642 598732
53852 598732 610478 621457 630752 638620 646176 654472 663892 674435 686121 698531 710090 718808 724409
53839 724409 729224 736158 745848 756305 764919 769916 770067 764490 753606 739592 724997 710968 697169
53826F97169j4220j4843j5259j5294j5082j5155j5724j5984j4955j3024j1563
53815E36066j0831r587p211n075m865o495q494r668r561q094n874m328m405n500
53801D36078o400o772o883o459n069l295k281k211k314k214k161k091j683j354
53787C84891j917l079l505k750j916j933k211j718m83P65J695K309K245R95j159
53772C72229k966l172j668J79O37n76j829j482J08J246J289J120J385J565J191
53757C69256O95M48J44k31R3J370K561K759K583L136M353N396N970O306O473O715
53741D18027P785R665J0700R324O319L937L235L536M207N185N837N206L742L039
53727D99744L361L095J536M43J525L779M863M157K807J472k09k190l873n465p808
$$ plain form
53826 697169 682949 668106 652847 637553 622471 607316 591592 575608 560653 547629 536066
53815 536066 525235 515648 508437 503362 498497 492002 483508 473840 464279 456185 450311 445983 441578 436078
53801 436078 429678 422906 416023 409564 404495 401200 398919 396708 394394 392180 390019 387928 386245 384891
53787 384891 382974 379895 376390 373640 371724 369791 367580 365862 365379 366144 367839 370148 372393 373388 372229
53772 372229 369263 366091 364423 364602 365239 364663 362834 361352 361460 362706 363995 365115 366500 368065 369256
53757 369256 369951 370399 370543 370312 370405 371775 374336 377095 379678 382814 387167 392563 398533 404839 411312 418027
53741 418027 425812 435477 446177 455501 461820 465757 468992 472528 476735 481920 487757 492963 496705 499744
53727 499744 503105 506200 507736 508179 509704 513483 518346 522503 525310 526782 526573 524383 520510 515045 507237
53712E07237j0398j1244r531p092o075o201n700m350l779m769n892n527m054l038
53698D19587l095l562l880m110m179l688k750k185k477l162l574l687l769l744
53684C71725l334k463j183M01J671J543l11k517l018j139J862M150M798M000K486
53669C78671R89j2l43j0P70J450J520J194J293K001K290J251m40j203m49J034
53653C90006K390L456M183M280L758L073K478J834J334J613K779L956M288L981
53639D33409L920M589N574N921M890K877J503K102M023N248M887M068L991M182
53625D91184L421J561m89j918k343j581l4J151J208O36J91l90j673l080l379k440
53609D82025j289o22l81n77j153j124N84L112M020K264m23j833j710j112o28l39
$$ plain form
53712 507237 496839 485595 476064 468972 462897 456696 450996 446646 442867 438098 432206 426679 422625 419587
53698 419587 416492 412930 409050 404940 400761 397073 394323 392138 389661 386499 382925 379238 375469 371725
53684 371725 368391 365928 364745 365146 366817 368360 368049 365532 362514 361375 363237 367387 372185 376185 378671
53669 378671 379660 379648 379305 379295 380065 381515 383035 384229 385522 387523 389813 391064 390624 389421 388972 390006
53653 390006 392396 395852 400035 404315 408073 411146 413624 415458 416792 418405 421184 425140 429428 433409
53639 433409 437329 441918 447492 453413 458303 461180 462683 464785 468808 474056 478943 483011 487002 491184
53625 491184 494605 496166 495677 493759 491416 489835 489801 490952 492160 492796 492987 492597 490924 487844 484465 482025
53609 482025 480736 480114 479733 479156 478003 476879 477463 480575 484595 486859 486436 484603 482893 481781 481153 480814
53593D80814n69j359j790j046K74R56Q17M94J2j048k215k396j544p17k12R35L017
53576D74423M564M212K762K201L094M105L977K998K336K668L733M768M990M074
53562E24905K588J739K326L857N028N115M708M776N309N361M495L606L834N111
53548E82758O331O815O821O617N867M416L062K833L729M638M567L539K348J689
53534F46030J598J556J153O78Q28J734K533K271J084R7J03O60O17n90k327l431
53518F54594l469l154l361l912l895l115k527k851l458l303k439j666j033J56
53504F16567J864K964K856K472L036M389N327N110M068K980K492K879L803M515
53490F65322M773N268O536P835P960P108O882Q158R830J0263R355Q518Q921J0498
$$ plain form
53593 480814 480245 478886 477096 476050 476324 477280 478097 478591 478603 477555 475340 472944 471400 470683 470471 471406 474423
53576 474423 478987 483199 485961 488162 491256 495361 499338 502336 504672 507340 511073 515841 520831 524905
53562 524905 527493 529232 531558 535415 540443 545558 550266 555042 560351 565712 570207 573813 577647 582758
53548 582758 589089 595904 602725 609342 615209 619625 622687 625520 629249 633887 638454 641993 644341 646030
53534 646030 647628 649184 650337 651015 651843 653577 656110 658381 659465 659562 659665 660325 660942 660352 658025 654594
53518 654594 651125 647971 644610 640698 636803 633688 631161 628310 624852 621549 619110 617444 616411 616567
53504 616567 618431 621395 624251 626723 629759 634148 639475 644585 648653 651633 654125 657004 660807 665322
53490 665322 670095 675363 681899 689734 697694 704802 711684 719842 729672 739935 749290 757808 766729 777227
53476G77227J2456J4118J5121J5394J5282J5563J6989J9672K2931K5729K7379
53465I77861K7956K8085K8382K9048K9891L0630L1199L1842L2877L4219L5441
53454A317431L6465L7916M0295M2964M4696M5296M5846M7028M7925M7308M5522
53443A798692M4176M4165M4923M5523M5648M5340M4645M3965M3931M4434M4376
53432B289818M2987M0966L9603L9026L8038L5732L2617K9943K8283K7072K5465
53421B669550K3452K2044K2181K3489K4304K3088J9666J5094J0711P410N300L554
53409B869843Q59l444q697j3635j7628k0924k3965k6863k9363l1060l1786l2115
53397B631222l3027l4742l6419l7567l9030m1536m3745m3299l9891l6042l4252
$$ plain form
53476 777227 789683 803801 818922 834316 849598 865161 882150 901822 924753 950482 977861
53465 977861 1005817 1033902 1062284 1091332 1121223 1151853 1183052 1214894 1247771 1281990 1317431
53454 1317431 1353896 1391812 1432107 1475071 1519767 1565063 1610909 1657937 1705862 1753170 1798692
53443 1798692 1842868 1887033 1931956 1977479 2023127 2068467 2113112 2157077 2201008 2245442 2289818
53432 2289818 2332805 2373771 2413374 2452400 2490438 2526170 2558787 2588730 2617013 2644085 2669550
53421 2669550 2693002 2715046 2737227 2760716 2785020 2808108 2827774 2842868 2853579 2860989 2866289 2869843
53409 2869843 2870702 2867258 2858561 2844926 2827298 2806374 2782409 2755546 2726183 2695123 2663337 2631222
53397 2631222 2598195 2563453 2527034 2489467 2450437 2408901 2365156 2321857 2281966 2245924 2211672
53386B211672l4448l4805l4105l2630l1291l0570k9959k8159k4290j9162j4648
53375A897605j1576r055o176l201m80K637O731J1096J4725J7826K1214K4804K7983
53362A994133L1025L4739L8888M2339M4744M6890M9213N1173N2350N3400N5578
53351B494472N9703O5417P0899P3942P4322P4584P7249Q1731Q5531Q7917R0394
53340C336161R3576R6042R6975R7768R9718J01919J02796J02414J01842J01427
53330D330638J01089J01163J01512J00647R7323R2290Q7098Q2036P6745P1823
53320E242364O7899O3692N7342M9533M3005L8489L3351K5184J5041N828j386q160
53308E632182j6659k7892m1380n5456o8087p8216q6344r3494r9936j05338j09672
$$ plain form
53386 2211672 2177224 2142419 2108314 2075684 2044393 2013823 1983864 1955705 1931415 1912253 1897605
53375 1897605 1886029 1876974 1870798 1867597 1867117 1869754 1876485 1887581 1902306 1920132 1941346 1966150 1994133
53362 1994133 2025158 2059897 2098785 2141124 2185868 2232758 2281971 2333144 2385494 2438894 2494472
53351 2494472 2554175 2619592 2690491 2764433 2838755 2913339 2990588 3072319 3157850 3245767 3336161
53340 3336161 3429737 3525779 3622754 3720522 3820240 3922159 4024955 4127369 4229211 4330638
53330 4330638 4431727 4532890 4634402 4735049 4832372 4924662 5011760 5093796 5170541 5242364
53320 5242364 5310263 5373955 5431297 5480830 5523835 5562324 5595675 5620859 5635900 5641728 5640342 5632182
53308 5632182 5615523 5587631 5546251 5490795 5422708 5344492 5258148 5164654 5064718 4959380 4849708
53297D849708j13314j16371j18492j19328j18915j17593j15815j13864j11605
53288C804411j08711j05322j02274j00357r9537r9062r8178r6446r3550q9306
53278B811668q4014p8441p3133o7941o2524n7222n2838m9345m5521m0532l5419
53267B164738l1905k9864k7213k2735j7715j4013j1673r595p650o486n661l732
53255A976496l92L024N566P923J0984J4300J6924J8912K0968K3079K4549K5330
53243B147663K6439K8833L2309L5793L8450M0350M2032M3605M4550M4675M4774
53232B569473M5842M7743M9320M9754M9079M7359M4394M0657L7524L5736L4210
53221C051091L1309K7043K3045K0352J8062J4499R129K851l162q411j2931j6754
$$ plain form
53297 4849708 4736394 4620023 4501531 4382203 4263288 4145695 4029880 3916016 3804411
53288 3804411 3695700 3590378 3488104 3387747 3288210 3189148 3090970 2994524 2900974 2811668
53278 2811668 2727654 2649213 2576080 2508139 2445615 2388393 2335555 2286210 2240689 2200157 2164738
53267 2164738 2132833 2102969 2075756 2053021 2035306 2021293 2009620 2000025 1992375 1985889 1980228 1976496
53255 1976496 1976104 1979128 1984694 1992617 2003601 2017901 2034825 2053737 2074705 2097784 2122333 2147663
53243 2147663 2174102 2202935 2235244 2271037 2309487 2349837 2391869 2435474 2480024 2524699 2569473
53232 2569473 2615315 2663058 2712378 2762132 2811211 2858570 2902964 2943621 2981145 3016881 3051091
53221 3051091 3082400 3109443 3132488 3152840 3170902 3185401 3194530 3197381 3194219 3185808 3172877 3156123
53209C156123j9956k3086k7117l2638l9126m5271n0178n4123n8001o2074o5506
53198B679047o7259o7410o7218o7757o8720o8975o7998o6202o4083o1854o0049
53187A951522n9430n9779n9699n8340n6678n6129n6467n6200n4682n2804n1551
53176A329763n0760m9406m6430m1491l5628l0878k8384k7151k5554k3705k2994
53165I47382k3479k3455k1917j9970j9013j8856j8423j7358j6102j5105j4769
53154G38935j5381j6403j6471j4847j2422j0692j0250j0658j1157j1052j0089
53143E99513q943q530q473p293m754k844l381n613p358p687p230o510n629n226
53129E10042o068p503p681n776l058j402j434k387l169l249k929k947l577m225
$$ plain form
53209 3156123 3136167 3113081 3085964 3053326 3014200 2968929 2918751 2864628 2806627 2744553 2679047
53198 2679047 2611788 2544378 2477160 2409403 2340683 2271708 2203710 2137508 2073425 2011571 1951522
53187 1951522 1892092 1832313 1772614 1714274 1657596 1601467 1545000 1488800 1434118 1381314 1329763
53176 1329763 1279003 1229597 1183167 1141676 1106048 1075170 1046786 1019635 994081 970376 947382
53165 947382 923903 900448 878531 858561 839548 820692 802269 784911 768809 753704 738935
53154 738935 723554 707151 690680 675833 663411 652719 642469 631811 620654 609602 599513
53143 599513 590570 582040 573567 566274 561520 558676 555295 549682 542324 534637 527407 520897 515268 510042
53129 510042 503974 496471 488790 483014 479956 478554 477120 474733 471564 468315 465386 462439 458862 454637
53115D54637m200l630l142k928k715k446k339k402k469k587k760k568j676n49
53101D18226kj86o14j030j516j846j598r23m84n15n54k02M26J091J678K022J941
53084D15914J546J054L17r60k526l639l857l300k180o63P92J565J512J096P35
53069D07406M36J59O9L01P13R86Q67M04N4L59J266K000J970J430R82P55N13J80
53051D20850j75n88r89j134j083j333k006k579k838l305m047m030k737j429j435
53036C91142j937j182N70J318M30m86k21L14r5r61j041k58M07M11J45J68N09O51
53018C89884J30p72j160q18p38j583k342j775o47p81k109k664j649m56j28J36
53002C72528R78J381M74q19j365j561k022k074j261r61k374l903l046l17J113
$$ plain form
53115 454637 450437 446807 443665 440737 438022 435576 433237 430835 428366 425779 423019 420451 418775 418226
53101 418226 418224 418038 417424 416394 414878 413032 411434 410511 410027 409512 408958 408756 409182 410273 411951 413973 415914
53084 415914 417460 418514 418831 417871 415345 411706 407849 404549 402369 401706 402498 404063 405575 406671 407406
53069 407406 407842 408001 408070 408371 409084 410070 410937 411341 411395 411754 413020 415020 416990 418420 419402 420157 420670 420850
53051 420850 420675 420087 419098 417964 416881 415548 413542 410963 408125 404820 400773 396743 394006 392577 391142
53036 391142 389205 388023 388593 389911 390341 389855 389634 389948 389853 388892 387851 387593 388000 388411 388556 388724 389233 389884
53018 389884 390014 389242 388082 387264 386526 384943 382601 380826 380179 379398 377289 374625 372976 372520 372392 372528
53002 372528 373506 374887 375361 374542 373177 371616 369594 367520 366259 365298 362924 359021 355975 355658 356771
52987C56771k16k309k888k203j750j792j463n33K14N4r09j951k370j982j183m47
52971C35043J06M33K11o68j495j305o1J306K029K075J603O31n64j318j283q79
52955C35864o69o17k42N78J280J218M45l24n83n06k98M88K179L717L359J041j047
52938C45883j086P9L12q35j826j600q53n78n12K43J701K800K632J380O8m65k18
52921C47125K82P53J185J253M17r98j575l84J678K926K974K829L122L304K773
52906C67664J857J134N20l61j315j737j523j239j302j397j043n52q42k123l283
52891C54458l153k075j421j638j845j493j358k114l034l056k487k407k755k305
52877C23317n45J472K435K090J032j21r69j269j009l59M42J012Q34k24j464k011
$$ plain form
52987 356771 356555 354246 351358 349155 347405 345613 344150 343617 343831 343885 342976 341025 338655 336673 335490 335043
52971 335043 335149 335582 335793 335125 333630 332325 332264 333570 335599 337674 339277 339908 339344 338026 336743 335864
52955 335864 335195 334578 334336 334914 336194 337412 337857 337533 336950 336444 336146 336634 338813 342530 345889 346930 345883
52938 345883 344797 344876 345188 344353 342527 340927 340074 339496 338984 339227 340928 343728 346360 347740 347808 347343 347125
52921 347125 347407 348160 349345 350598 351015 350017 348442 348058 349736 352662 355636 358465 361587 364891 367664
52906 367664 369521 370655 371175 370814 369499 367762 366239 365000 363698 362301 361258 360706 359864 357741 354458
52891 354458 351305 349230 347809 346171 344326 342833 341475 339361 336327 333271 330784 328377 325622 323317
52877 323317 322772 324244 326679 328769 329801 329680 328711 327442 326433 326074 326516 327528 328362 328138 326674 324663
52861C24663j779j530j861k521k588j225J359L550L525J391n97p16P7k66j755
52846C19727k343r51J099J992J436J72j207k092j582M67K571K960J651L96M69
52831C24765J263J388O68M07J579L294L586J724q89k385k398j884j519j019M8
52816C28628J560K820K953J572l83j031M30K392K615J114P6R03K599L461L222
52801C52931K761K577K388J857J076M19Q4k35j062k191k457j269l0p85l475n735
52785C46854n770m170k533j556j334k225m140n702n426l470j352j19L47N14N79
52770C10497P03J130J889K760L552M176M493M271L299J542m92j728j485n34m28
52755C33645j560k668k639j877j226n13P66J936J694J48r19j60J680K740K163
$$ plain form
52861 324663 322884 321354 319493 316972 314384 313159 314518 318068 321593 322984 322387 321671 321748 321482 319727
52846 319727 317384 316433 317532 319524 320960 321132 319925 317833 316251 316718 319289 322249 323900 324296 324765
52831 324765 326028 327416 328084 328491 330070 333364 336950 338674 337785 335400 333002 331118 329599 328580 328628
52816 328628 330188 333008 335961 337533 337150 336119 336549 338941 341556 342670 342746 343649 346248 349709 352931
52801 352931 355692 358269 360657 362514 363590 364009 364093 363858 362796 360605 358148 356879 356849 356064 352589 346854
52785 346854 341084 336914 334381 332825 331491 329266 325126 319424 313998 310528 309176 309057 309404 309918 310497
52770 310497 311200 312330 314219 316979 320531 324707 329200 333471 336770 338312 337820 336092 334607 334073 333645
52755 333645 332085 329417 326778 324901 323675 323162 323928 325864 327558 327706 326787 326627 328307 331047 333210
52740C33210O84o42j657k686l380k872j306l15j046k381k409j322j219k789l992
52725C05878k961o67O37N62N04J129J615J305O16P1l32m59K31J745L028K920J407
52708C17229m07j373j198m57J91P35J519K415K785K359J572Q29J42k83r0K09o03
52691C25574k443l286j764O34J491P47K05K67m59k225l118j887J34J185J596K562
52675C19213L610L182J241m69q56o46p18n92N79K363L368K976J848P04m78j736
52659C33589k363j694l17M38J84j57J29N88N71L17K91K00m75j386j752j613j658
52642C24892j970j896j254o52m06OJ038K281K947K694J697M01o01q52n04k26m72
52625C27123j078j524j293j71J343K124J550M10L9N63Q49J96q05j324j260q38
$$ plain form
52740 333210 333894 333252 331595 328909 325529 322657 321351 321036 319990 317609 315200 313878 312659 309870 305878
52725 305878 302917 302250 302887 303449 303953 305082 306697 308002 308618 308689 308357 307898 308129 309874 312902 315822 317229
52708 317229 316822 315449 314251 313794 313985 314720 316239 318654 321439 323798 325370 326199 326341 326058 325968 326177 325574
52691 325574 323131 319845 318081 318715 320206 320953 321158 321425 320966 318741 315623 313736 313870 315055 316651 319213
52675 319213 322823 326005 327246 326777 325921 325275 324557 323965 324544 326907 330275 333251 335099 335803 335325 333589
52659 333589 331226 329532 329215 329653 329837 329680 329809 330397 330968 331285 331576 331776 331301 329915 328163 326550 324892
52642 324892 322922 321026 319772 319120 318714 318720 319758 322039 324986 327680 329377 329778 329177 328325 327821 327595 327123
52625 327123 326045 324521 323228 323057 324400 326524 328074 328484 328523 329086 329935 330131 329326 328002 326742 325904
52609C25904j25N14L47n52p39R97L678M783L075P8j588r46P47J940K515L172L765
52592C47565L350K051J540K884M825N298M010K239N64j559l970n228m406k356
52578C56807n61L02L08k01n93l62l0o46j974k331p70J636L377M181M321L594K074
52561C69132Q05M23O6j106k269k312j934k518l505k938m90J950K920K775K138
52546C63137Q18r63j904j250k1L91k7l31o0N93J341J710J042n94j953j915q44
52529C59170P9M80R33J745K410K413J931J541J561J734J483N11p38j497j552j312
52513C70892r52k03P39Q99k02j587j881r86J44R11J387J496R05k27j299k061k536
52496C65439k278p50J319K188J108q20k264l053l370k840j412j71P5K79J759L863
$$ plain form
52609 325904 325779 326293 326640 326088 325349 326346 330024 334807 337882 337960 336372 335426 336173 338113 340628 343800 347565
52592 347565 350915 352966 354506 357390 362215 367513 371523 373762 374326 372767 368797 363569 359163 356807
52578 356807 356246 356548 356856 356655 356062 355700 355670 355024 353050 350719 349949 351585 354962 359143 363464 367058 369132
52561 369132 369937 370360 370426 369320 367051 364739 362805 360287 356782 353844 353354 355304 358224 360999 363137
52546 363137 363955 362992 361088 359838 359817 360208 360181 359850 359790 360383 361724 363434 364476 363882 361929 360014 359170
52529 359170 359249 359729 360662 362407 364817 367230 369161 370702 372263 373997 375480 375991 375253 373756 372204 370892
52513 370892 369940 369737 370476 371375 371173 369586 367705 366719 366863 367774 369161 370657 371562 371335 370036 367975 365439
52496 365439 363161 362411 363730 365918 367026 366206 363942 360889 357519 354679 353267 353096 353171 353450 355209 359072
52480C59072M627L583K211J468N79j074k497k566j749j193r15j19J216K253K529
52465C67425K367K063J499M77r15k156k223l27K761M789M250K042J59n75n48P6
52449C81164J339K466K382J262K87j30n18q31l45P36J167N32k04n56j230k324
52433C85197k427p53J265J756O68q71k290l289k988j087R23J496J409K641N082
52418C86732O356N080K597J057J119K159L445M335M198L021J710J252J719K333
52404D27113K274J433M87J62K57j35j195j905j564r06q39r70n72k85j246l043
52388D19066m150m191l985l526j966J92R57l64k027k303j517p48j93K10k2q35
52372C94598j069j67P47O35P5j80p04j887k304o32J803K617J841J552K393K877
$$ plain form
52480 359072 363699 367282 369493 370961 371540 370466 367969 365403 363654 362461 361546 361427 362643 364896 367425
52465 367425 369792 371855 373354 373831 372916 370760 368537 368210 370971 375760 380010 382052 382211 381636 381088 381164
52449 381164 382503 384969 387351 388613 388900 388770 388252 387421 387076 387812 388979 389511 389307 388751 387521 385197
52433 385197 382770 382017 383282 385038 385706 384835 382545 379256 376268 375181 376104 377600 379009 381650 386732
52418 386732 393088 398168 400765 401822 402941 405100 408545 412880 417078 420099 421809 423061 424780 427113
52404 427113 429387 430820 431307 431469 431726 431591 430396 428491 426927 426021 425182 424212 423640 423355 422109 419066
52388 419066 414916 410725 406740 403214 401248 401440 402397 402033 400006 397703 396186 395438 395245 395455 395433 394598
52372 394598 393529 393362 394109 394744 394819 394639 393935 392048 389744 389112 390915 393532 395373 396925 399318 402195
52356D02195K190J442J549J847J656J535K149L258M552O244Q011Q637P697O507
52342D59469O345O655O102M641L302K489J600J96j441k889m058n029n904o673
52328D64805o955o165m244j856L13K021K945K560J073l03p66r88j790k425j398
52313D46827J257L774M756M445L823L546L971N115O131N761L885J869R14P52O06
52298D97432N15Q74J333J171M83%j00k07k61L18J438K121J838J283J341J958K616
52281E14153L261M048M641M610M274M380N013N610O035O859Q305R683J0266J0248
52267F01386J0399J1174J2492J3979J5008J4958J3930J2936J2846J3412J3942
52256G46462J4465J5270J5512J3752J0290P716Q079J0318J1681J1255J0550J0779
$$ plain form
52356 402195 404385 405827 407376 409223 410879 412414 414563 417821 422373 428617 436628 445265 452962 459469
52342 459469 465814 472469 478571 483212 486514 489003 490603 490799 489358 486469 482411 477382 471478 464805
52328 464805 457850 451685 447441 445585 445898 447919 450864 453424 454497 454194 453428 452440 450650 448225 446827
52313 446827 448084 451858 456614 461059 464882 468428 472399 477514 483645 489406 493291 495160 496074 496826 497432
52298 497432 497947 498821 500154 501325 501808 501808 501708 501501 501240 501558 502996 505117 506955 508238 509579 511537 514153
52281 514153 517414 521462 526103 530713 534987 539367 544380 549990 556025 562884 571189 580872 591138 601386
52267 601386 611785 622959 635451 649430 664438 679396 693326 706262 719108 732520 746462
52256 746462 760927 776197 791709 805461 815751 823467 831546 841864 853545 864800 875350 886129
52244H86129J1170J0682R959J0332J1674J2628J2570J2013J1207R809Q222P726
52232A014121Q442Q433O064K506N19J048K361K543J558N08pj61k34m07p96j177
52216A045321j004o4J192K328L460M740N590N135L374J593J492L787P431J0292
52202A094667J1082J0600J0589J1368J1455R823P491O209O389P259Q472J0291
52190A205695J2342J3424J2813J1059R218P865O929O019M815L541K924L185L386
52177A303215K475Q43n9M15J470K250K790L310L461K912K049J502J372J320J070
52162A330395N57K2J33J398L242M343M271M031M504N223N351N174N619O733P615
52147A388611P712P353P131P423Q386R730J0587J0209Q798P051N225L437K556
$$ plain form
52244 886129 897299 907981 917940 928272 939946 952574 965144 977157 988364 998173 1006395 1014121
52232 1014121 1022563 1030996 1037060 1039566 1040085 1041133 1043494 1046037 1047595 1048103 1048096 1047935 1047701 1047294 1046498 1045321
52216 1045321 1044317 1044253 1045445 1047773 1051233 1055973 1061563 1066698 1070072 1071665 1073157 1076944 1084375 1094667
52202 1094667 1105749 1116349 1126938 1138306 1149761 1159584 1167075 1173284 1179673 1186932 1195404 1205695
52190 1205695 1218037 1231461 1244274 1255333 1264551 1272416 1279345 1285364 1290179 1293720 1296644 1299829 1303215
52177 1303215 1305690 1306533 1306474 1306889 1308359 1310609 1313399 1316709 1320170 1323082 1325131 1326633 1328005 1329325 1330395
52162 1330395 1330952 1330974 1331107 1332505 1335747 1340090 1344361 1348392 1352896 1358119 1363470 1368644 1374263 1380996 1388611
52147 1388611 1396323 1403676 1410807 1418230 1426616 1436346 1446933 1457142 1465940 1472991 1478216 1481653 1484209
52134A484209L620O124Q009P876O442N178M448L721L091L250M030M018K246l50
52120A545912j842j494m94n07k006m290o488q023q453p785o983p229q234q172
52106A473912n924k769q80o29n18L58J128P91j61n60k24J32K59O10J303J711J282
52089A469821K74n55n92L56K033L639M183L364J970J160J313J798J759R42j64
52074A491301p40k51J112K495L182L327L679M622N882P206Q740J0508J2087J3359
52060A566509J4986J7413J9791K0866K0712K0536K0766K0453J8869J6596J4480
52049A771977J2602J0974J0154J0182R727P616M631K485J451M42o75n91J256L498
52035A845729M568M476M063L470K370J030k5r96k475m302n722o666p988j0113
$$ plain form
52134 1484209 1487829 1493953 1501962 1509838 1516280 1521458 1525906 1529627 1532718 1535968 1539998 1544016 1546262 1545912
52120 1545912 1544070 1542576 1542082 1541575 1539569 1535279 1528791 1520768 1512315 1504530 1497547 1490318 1482084 1473912
52106 1473912 1467988 1465219 1464339 1463710 1463192 1463550 1464678 1465469 1465308 1464748 1464524 1464656 1464915 1465525 1466828 1468539 1469821
52089 1469821 1470095 1469540 1468948 1469304 1471337 1474976 1479159 1482523 1484493 1485653 1486966 1488764 1490523 1491465 1491301
52074 1491301 1490561 1490310 1491422 1493917 1497099 1500426 1504105 1508727 1514609 1521815 1530555 1541063 1553150 1566509
52060 1566509 1581495 1598908 1618699 1639565 1660277 1680813 1701579 1722032 1740901 1757497 1771977
52049 1771977 1784579 1795553 1805707 1815889 1825616 1833232 1837863 1840348 1841799 1842241 1841566 1840975 1842231 1845729
52035 1845729 1850297 1854773 1858836 1862306 1864676 1865706 1865681 1864685 1862210 1857908 1852186 1845520 1837532 1827419
52021A827419j2027j2115r755o008k833j668k403l588l851l166k538k475k215
52008A762777p62J622L537M040L623L361L542L621L324L035K985K837K482K564
51994A802588L426L985K737p1k326k487j391r79j864l041l805m863p110r898j1383
51979A763518j0736r283q992j0161j1267j1071r919q716p595o439n882o512p396
51966A649549o890n023l718m205n484o121o371p301q717r409r092q629q327p433
51952A552829n855n131o712r855j2276j2726j2185j2460j4187j6618j8760k0254
51940A405810k1258k2077k3010k4111k4853k4451k2887k1240k0525k0387j9654
51929A161357j7973j6252j5406j5340j5470j5530j5492j5185j4520j3699j2923
$$ plain form
52021 1827419 1815392 1803277 1793522 1787514 1784681 1783013 1780610 1777022 1773171 1770005 1767467 1764992 1762777
52008 1762777 1762015 1763637 1767174 1771214 1774837 1778198 1781740 1785361 1788685 1791720 1794705 1797542 1800024 1802588
51994 1802588 1806014 1809999 1812736 1812665 1810339 1807852 1806461 1805482 1803618 1800577 1796772 1791909 1784799 1774901 1763518
51979 1763518 1752782 1743499 1734507 1724346 1713079 1702008 1692089 1683373 1675778 1669339 1663457 1656945 1649549
51966 1649549 1642659 1637636 1633918 1629713 1624229 1618108 1611737 1604436 1595719 1586310 1577218 1568589 1560262 1552829
51952 1552829 1546974 1541843 1535131 1525276 1513000 1500274 1488089 1475629 1461442 1444824 1426064 1405810
51940 1405810 1384552 1362475 1339465 1315354 1290501 1266050 1243163 1221923 1201398 1181011 1161357
51929 1161357 1143384 1127132 1111726 1096386 1080916 1065386 1049894 1034709 1020189 1006490 993567
51918I93567j2236j1949j2650j4181j5187j4414j2316j0522r796r259p891n968
51906H57198m550l888l035j057J813M485O191O979P169O899O490O549P123P155
51892I05521N639L117J104J02p72k037k981k979k514k020p00K351O462R864J1558
51877I31715J1857J1559J1458J2235J3764J4703J3844J1698R745Q287O247L091
51865A060203l51l334o306r960j3933j7168j9094j9944k0223k0177j9546j7857
51853H92310j5113j2123r680p772o163n347n831o583n557k056K470O419R709J2925
51839H47608J5984J8485K0381K1369K0415J6938J1879O420K49p547j6042k2493
51827I33646k5168k5128k4536k4108k2919k0219j6541j2981j0031p497n290l726
$$ plain form
51918 993567 981331 969382 956732 942551 927364 912950 900634 890112 880316 871057 863166 857198
51906 857198 852648 848760 845725 844668 846481 850966 857157 864136 871305 878204 884694 891243 898366 905521
51892 905521 911160 914277 915381 915483 914711 912674 909693 906714 904200 902180 901480 903831 910293 920157 931715
51877 931715 943572 955131 966589 978824 992588 1007291 1021135 1032833 1042578 1050865 1057112 1060203
51865 1060203 1059852 1056518 1050212 1040252 1026319 1009151 990057 970113 949890 929713 910167 892310
51853 892310 877197 865074 855394 847622 841459 836112 830281 823698 818141 816085 818555 824974 834683 847608
51839 847608 863592 882077 902458 923827 944242 961180 973059 979479 979728 972181 956139 933646
51827 933646 908478 883350 858814 834706 811787 791568 775027 762046 752015 744518 739228 735502
51815G35502k891k067l68K106M262N271N279M734L650K081P24K24J03p81k672
51800G55157m584n625n998o335o691o673o192n362l963j691Q49K199J569p2j062
51785G05526j087j401k982n179o611o793o326n891n775o109o762p032o216m578
51771F32784l166k522k239j855j514j405j232o74J04Q11J370J618J229L68j23
51756F23554J98O34K71o49j061n00N12J413K220K972L241K554J144j25o73q74
51740F34831j579k912l884l559k236q40M68K036L186K393m34l115l749l089l188
51725F14329m416n251m599k824o24J568K917K477O66o89n13L06N02L22Q73K241
51709F07285L293L131K089J313J811L716O109P728Q052P529O656N470M189L499
$$ plain form
51815 735502 732611 730544 730176 732282 736544 741815 747094 751828 755478 757559 758283 758507 758610 757829 755157
51800 755157 750573 744948 738950 732615 725924 719251 713059 707697 703734 702043 702892 705091 706660 706588 705526
51785 705526 704439 703038 700056 694877 688266 681473 675147 669256 663481 657372 650610 643578 637362 632784
51771 632784 629618 627096 624857 623002 621488 620083 618851 618177 618281 619092 620462 622080 623309 623677 623554
51756 623554 623752 624386 624657 624008 622947 622447 622959 624372 626592 629564 632805 635359 636503 636378 635705 634831
51740 634831 633252 630340 626456 622897 620661 619821 620289 622325 625511 627904 627470 624355 620606 617517 614329
51725 614329 609913 604662 600063 597239 596615 598183 601100 603577 604243 603554 603041 603347 603849 604171 605044 607285
51709 607285 610578 613709 615798 617111 618922 622638 628747 636475 644527 652056 658712 664182 668371 671870
51695F71870L476K877N49k779n110n575n234n254n333m519l001k089k476l141
51681F34261k391P5K572L200K145J637L353O359Q442Q975R357J0407J0770Q870
51667G08032N603L651M213N602N493L612J619Q64R66N34j200l577n180n211m226
51652G20795l380l182l337l610m146m758m701l744k868l123m047m014k183M62
51638F74164K106J658n18k894l752k541m31R03J083J146J809K351J602n20k963
51623F73203m571m737l421j210P31J345O00m98q80l66L51N77M65Q95K464M703
51607F69651O582P627Q210Q847R623J0340J0679J0093Q056M757J166j864m241
51594G49526o210p582p903p148n947n005m357l202p58K417M207K756j356n360
$$ plain form
51695 671870 675346 678223 678772 675993 670883 665308 660074 654820 649487 644968 641967 639878 637402 634261
51681 634261 631870 631945 634517 637717 639862 641499 644852 651211 659653 668628 677985 688392 699162 708032
51667 708032 713635 717286 721499 727101 732594 736206 737825 738689 739655 740189 738989 735412 730232 725021 720795
51652 720795 717415 714233 710896 707286 703140 698382 693681 689937 687069 683946 679899 675885 673702 674164
51638 674164 676270 677928 677410 674516 670764 668223 667792 668695 669778 670924 672733 675084 676686 676166 673203
51623 673203 668632 663895 660474 659264 659995 661340 661940 661442 660562 660196 660547 661124 661589 662484 664948 669651
51607 669651 676233 683860 692070 700917 710540 720880 731559 741652 749708 754465 755631 753767 749526
51594 749526 743316 735734 727831 720683 714736 709731 705374 702172 701414 703831 708038 710794 709438 704078
51580G04078o967o379n509n847p357q926r367q332o539n036m160l597l180k932
51566F19950k395r90P80J565R79J42r6k76q90j132l01N90J16j293j969j476r85
51549F12319j265j774j841j484q89j13M99O30Q19J921L693M985N524O301P859
51534F37184R394J0145J0509J1072J1373J0543Q576O248M209K699J826J459J177
51521G26414O87J49j64r0O82K543N268P994J0250J2453J4849J6630J6926J6345
51507H30936J6615J8480K0671K1262J9720J7318J5762J5848J7436K0179K3803
51496A038030K7708L1006L3186L4385L4650L3359K9804K4102J7061R414J585o031
51484A308259j3029j9136k4049k7595l0240l2847l5395l6683l6034l4488l3294
$$ plain form
51580 704078 697111 690732 685223 679376 672019 663093 653726 645394 638855 633819 629659 626062 622882 619950
51566 619950 617555 616565 617345 618910 619889 620031 619935 619659 618769 617637 617336 617926 618042 616749 614780 613304 612319
51549 612319 611054 609280 607439 605955 605066 604953 605452 606082 606901 608822 612515 617500 623024 629325 637184
51534 637184 646578 656723 667232 678304 689677 700220 708796 715044 719253 721952 723778 725237 726414
51521 726414 727101 727250 727086 726996 727678 730221 735489 743483 753733 766186 781035 797665 814591 830936
51507 830936 847551 866031 886702 907964 927684 945002 960764 976612 994048 1014227 1038030
51496 1038030 1065738 1096744 1129930 1164315 1198965 1232324 1262128 1286230 1303291 1312705 1314290 1308259
51484 1308259 1295230 1276094 1252045 1224450 1194210 1161363 1125968 1089285 1053251 1018763 985469
51473I85469l2069k9721k6540k3758k1472j8867j6279j5039j5014j4368j2361
51462G59981j0562j0291j0565r691p627n595m470m531n656o849o650m996l525
51449F68973l085k402m52J317R61j021k627l248l493k948o79K326L674K943K178
51434F62417K603K953K012P11K77m9j648l973n122m546l591l435l853m148m173
51419F36435l934l170j959j271k129m319o444p361p109o324n269l959k848k610
51405E77729l157l594l399k992k862k748k276j743j548j295l69Q63J334Q34M15
51390E55192J043K516M018N156O041O788P392Q044R125J0697J2175J2759J2322
51377F53268J1614J1294J0992R901Q068O253M514K012j222l550l777l144l986
$$ plain form
51473 985469 953400 923679 897139 873381 851909 833042 816763 801724 786710 772342 759981
51462 759981 749419 739128 728563 718872 711245 705650 701180 696649 690993 684144 677494 672498 668973
51449 668973 665888 663486 663034 664351 665312 664291 661664 658416 654923 651975 651296 653622 657296 660239 662417
51434 662417 665020 667973 669985 670696 670973 670924 669276 665303 660181 655635 652044 648609 644756 640608 636435
51419 636435 632501 629331 627372 626101 623972 619653 613209 605848 598739 592415 587146 583187 580339 577729
51405 577729 574572 570978 567579 564587 561725 558977 556701 554958 553410 552115 551746 552609 553943 554777 555192
51390 555192 556235 558751 562769 567925 573966 580754 588146 596190 605315 616012 628187 640946 653268
51377 653268 664882 676176 687168 697069 705137 711390 715904 717916 716694 713144 709367 706223 702237
51364G02237o738r488j0362r328p535n989n132m811m338l106j400n7O31R43Q84
51349F36411K16m55J79K353M514N123M496M071M455N119N815P090R138J0860J0834
51334G10219R091P360P318Q758R930R683Q815R006J0758J2948J4402J5343J7018
51321H50649K0166K4176K7707L0043L1757L4053L7570M1947M6366M9919N1471
51310A245824M9862M4792L7226K8485J9248R776N20q160j6505k4811l2493l8485
51298A315279m2573m5633m8406n0603n1397n0358m7769m4330m0690l6975l2840
51287H23705k8210k3756k0379j8336j7240j6524j5502j3346r864o187l969l743
51275F46649m544n140n132m914n043n712o378o098m623k924k126k225k487k770
$$ plain form
51364 702237 695499 686011 675649 666321 658786 652797 647665 642854 638516 635410 634010 633953 634584 635527 636411
51349 636411 636627 636172 636351 638704 643218 648341 652837 656908 661363 666482 672297 679387 688525 699385 710219
51334 710219 719310 726670 733988 742746 752676 762359 771174 780180 790938 803886 818288 833631 850649
51321 850649 870815 894991 922698 952741 984498 1018551 1056121 1098068 1144434 1194353 1245824
51310 1245824 1295686 1340478 1377704 1406189 1425437 1435213 1435733 1427573 1411068 1386257 1353764 1315279
51298 1315279 1272706 1227073 1178667 1128064 1076667 1026309 978540 934210 893520 856545 823705
51287 823705 795495 771739 751360 733024 715784 699260 683758 670412 660548 654361 650392 646649
51275 646649 642105 636965 631833 626919 621876 616164 609786 603688 599065 596141 594015 591790 589303 586533
51261E86533l558m863o055o739o911o255m277j440P54J234M37l14l7J175K194
51246E51878J737n2j273m29J407J858N19o08j56Q27Q96L88N14J383K243K880L522
51229E67534L825L147J627R2r69j620j930j939j927k092k038j223K23J629K503
51214E66842K761K451J805J299J216J280J131Q99Q56Q78P20O45J088J839K101
51199E87811J477M64j39m7L59N05J48n65j440k439l464m248m652m704m017j890
51183E63159J271L307K455j38j542p74K86%q24q01j96J65Q30K609M438M348K302
51166E80895K95l97m42p97j309j566j840k452k941k573j276L07J371J489R56O53
51150E70373J205K266L006L081K636J722N83K60J796M621O721O816N608M517L927
$$ plain form
51261 586533 582975 578112 572057 565318 558407 552152 547875 546435 547189 548423 548860 548546 548509 549684 551878
51246 551878 553615 553563 552290 551861 553268 555126 555645 555037 554881 555708 556604 556992 557506 558889 561132 564012 567534
51229 567534 571359 574506 576133 576225 575256 573636 571706 569767 567840 565748 563710 562487 562710 564339 566842
51214 566842 569603 572054 573859 575158 576374 577654 578785 579684 580540 581418 582138 582783 583871 585710 587811
51199 587811 589288 589752 589613 589566 589925 590430 590578 590013 588573 586134 582670 578422 573770 569066 565049 563159
51183 563159 564430 567737 570192 570054 568512 567738 568024 568024 567200 566399 566203 566368 567198 569807 574245 578593 580895
51166 580895 581190 580793 580351 579554 578245 576679 574839 572387 569446 566873 565597 565904 567275 568764 569720 570373
51150 570373 571578 573844 576850 579931 582567 584289 584872 585132 586928 591549 598270 605086 610694 615211 619138
51135F19138L216J976N23n66j059j274j757k563k919k171r38o32j719l221m174
51120F01860m616m716l969k149l08L31N6R9O57O88k33j161j277r39o35k5J098
51103E84761J866J493P77J026J995K337J932K011K782K734J182j61M96K334L121
$$ plain form
51135 619138 622354 624330 624853 624287 623228 621954 620197 617634 614715 612544 611606 610974 609255 606034 601860
51120 601860 597244 592528 588559 586410 586102 586433 586489 586588 587245 587933 587700 586539 585262 584323 583688 583663 584761
51103 584761 586627 588120 588897 589923 591918 594255 596187 598198 600980 603714 604896 604735 605231 607565 610686
$$ [...]
##END NTUPLES=NMR SPECTRUM
##END=
