
##TITLE=UV1155_M4-1010-1000_6301843_UsI1x6hxBm
##JCAMPDX= 6.0         $$ Bruker NMR JCAMP-DX V2.0
##DATA TYPE= NMR SPECTRUM
##DATA CLASS= NTUPLES
##ORIGIN= BRUKER
##OWNER= Administrator
$$ 1.72 TOPSPIN		Version 2.1
$$ 2012-06-05 23:27:17.046 -0500  Administrator@TOPSPIN
$$ Compression mode = diff/dup
##.OBSERVE FREQUENCY= 400.13188235
##.OBSERVE NUCLEUS= ^1H
##.ACQUISITION MODE= SIMULTANEOUS (DQD)
##.ACQUISITION SCHEME= undefined
##.AVERAGES= 64
##.DIGITISER RES= 22
##SPECTROMETER/DATA SYSTEM= spect
##.PULSE SEQUENCE= noesygpps1d.comp
##.SOLVENT NAME= COFFEE_meoh
##.SHIFT REFERENCE= INTERNAL, COFFEE_meoh, 1, 14.96709
##AUDIT TRAIL= $$ (NUMBER, WHEN, WHO, WHERE, PROCESS, VERSION, WHAT)
$$ ##TITLE= Audit trail, TOPSPIN		Version 2.1
$$ ##JCAMPDX= 5.01
$$ ##ORIGIN= Bruker BioSpin GmbH
$$ ##OWNER= Administrator
$$ $$ C:\Bruker\TOPSPIN/data/COFFEE/nmr/UV1155_M4-1010-1000_6301843_UsI1x6hxBm/12/pdata/1/auditp.txt
$$ ##AUDIT TRAIL=  $$ (NUMBER, WHEN, WHO, WHERE, PROCESS, VERSION, WHAT)
(   1,<2012-06-05 23:27:11.828 -0500>,<Administrator>,<TOPSPIN>,<go>,<TOPSPIN 2.1>,
      <created by zg
	started at 2012-06-05 23:15:41.625 -0500,
	POWCHK enabled, PULCHK disabled,
       configuration hash MD5:
       D5 CA 7A 23 FE 6B EE E2 50 67 74 61 24 F7 5E 3B
       data hash MD5: 64K
       8F 2A 5B 7B 8B 42 63 17 D6 46 56 EA AF C4 1A 1E>)
(   2,<2012-06-05 23:27:14.750 -0500>,<Administrator>,<TOPSPIN>,<proc1d>,<TOPSPIN 2.1>,
      <Start of raw data processing
       efp LB = 0.3 FT_mod = 6 PKNL = 1 PHC0 = 0 PHC1 = 0 SI = 128K 
       data hash MD5: 128K
       33 A4 1B 29 2F 93 6E D9 DC 45 38 F2 01 A8 5A 07>)
(   3,<2012-06-05 23:27:15.906 -0500>,<Administrator>,<TOPSPIN>,<proc1d>,<TOPSPIN 2.1>,
      <pk PHC0 = 33.13477 PHC1 = 0 
       data hash MD5: 128K
       98 8D 7A 7C 15 D2 1B 04 5E 44 B4 BE 7D 66 3E 63>)
(   4,<2012-06-05 23:27:16.421 -0500>,<Administrator>,<TOPSPIN>,<proc1d>,<TOPSPIN 2.1>,
      <abs ABSG = 1 
       data hash MD5: 128K
       F2 B2 5D 0C 77 31 C0 D5 F0 CF 2C 9F B2 EF 6F 8C>)
(   5,<2012-06-05 23:27:16.687 -0500>,<Administrator>,<TOPSPIN>,<proc1d>,<TOPSPIN 2.1>,
      <abs ABSG = 2 
       data hash MD5: 128K
       0F B0 77 D6 A5 B6 56 30 28 17 BC 9A A8 C6 AA 1D>)
(   6,<2012-06-05 23:27:16.859 -0500>,<Administrator>,<TOPSPIN>,<proc1d>,<TOPSPIN 2.1>,
      <abs ABSG = 3 
       data hash MD5: 128K
       45 4F 14 3D D4 38 6E 03 22 7E E1 12 A3 BB 37 C0>)
(   7,<2012-06-05 23:27:16.906 -0500>,<Administrator>,<TOPSPIN>,<proc1d>,<TOPSPIN 2.1>,
      <abs ABSG = 4 
       data hash MD5: 128K
       FF 13 17 AC 9C 5F 13 3B 6F 88 C5 9E 9B ED 15 D3>)
(   8,<2012-06-05 23:27:16.968 -0500>,<Administrator>,<TOPSPIN>,<proc1d>,<TOPSPIN 2.1>,
      <abs ABSG = 5 
       data hash MD5: 128K
       D7 63 D5 20 59 98 43 03 59 9E 57 43 88 35 29 AA>)
$$ ##END=
$$ 
$$ $$ hash MD5
$$ $$ 83 82 E3 AA 84 29 7B F9 66 5F 80 CF CB 27 C1 89
##$RELAX= 
##$RELAX= 
##$RELAX= 
##$RELAX= 
##$RELAX= 
##$RELAX= 
##$RELAX= 
##$RELAX= 
$$ Bruker specific parameters
$$ [...]
##$TP07= 0
##$TPNAME0= <>
##$TPNAME1= <>
##$TPNAME2= <>
##$TPNAME3= <>
##$TPNAME4= <>
##$TPNAME5= <>
##$TPNAME6= <>
##$TPNAME7= <>
##$TPOAL= (0..7)
0.5 0.5 0.5 0.5 0.5 0.5 0.5 0.5
##$TPOFFS= (0..7)
0 0 0 0 0 0 0 0
##$TUNHIN= 0
##$TUNHOUT= 0
##$TUNXOUT= 0
##$USERA1= <user>
##$USERA2= <user>
##$USERA3= <user>
##$USERA4= <user>
##$USERA5= <user>
##$V9= 5
##$VALIST= <valist>
##$VCLIST= <CCCCCCCCCCCCCCC>
##$VD= 0
##$VDLIST= <DDDDDDDDDDDDDDD>
##$VPLIST= <PPPPPPPPPPPPPPP>
##$VTLIST= <TTTTTTTTTTTTTTT>
##$WBST= 2048
##$WBSW= 25
##$XGAIN= (0..3)
0 0 0 0
##$XL= 0
##$YL= 0
##$YMAX_a= 11159980
##$YMIN_a= -6879044
##$ZGOPTNS= <>
##$ZL1= 120
##$ZL2= 120
##$ZL3= 120
##$ZL4= 120
##$ABSF1= 14.96709
##$ABSF2= -5.585441
##$ABSG= 5
##$ABSL= 3
##$ALPHA= 0
##$AQORDER= 0
##$ASSFAC= 0
##$ASSFACI= 0
##$ASSFACX= 0
##$ASSWID= 0
##$AUNMP= <proc_prof1d_extract.lims>
##$AXLEFT= 0
##$AXNAME= <>
##$AXNUC= <1H>
##$AXRIGHT= 0
##$AXTYPE= 0
##$AXUNIT= <>
##$AZFE= 0.1
##$AZFW= 0.1
##$BCFW= 0
##$BC_mod= 0
##$BYTORDP= 0
##$COROFFS= 0
##$CY= 15
##$DATMOD= 1
##$DC= 0
##$DFILT= <>
##$DTYPP= 0
##$F1P= 0
##$F2P= 0
##$FCOR= 0.5
##$FTSIZE= 131072
##$FT_mod= 6
##$GAMMA= 0
##$GB= 0
##$INTBC= 1
##$INTSCL= 1
##$ISEN= 128
##$LB= 0.3
##$LEV0= 0
##$LPBIN= 0
##$MAXI= 10000
##$MC2= 0
##$MEAN= 0
##$ME_mod= 0
##$MI= 0
##$NCOEF= 0
##$NC_proc= -3
##$NLEV= 6
##$NOISF1= 0
##$NOISF2= 0
##$NSP= 0
##$NTH_PI= 0
##$NZP= 0
##$OFFSET= 14.96709
##$PC= 1
##$PHC0= 33.13477
##$PHC1= 0
##$PH_mod= 1
##$PKNL= yes
##$PPARMOD= 0
##$PPDIAG= 0
##$PPIPTYP= 0
##$PPMPNUM= 2147483647
##$PPRESOL= 1
##$PSCAL= 4
##$PSIGN= 0
##$PYNMP= <proc.py>
##$REVERSE= no
##$SF= 400.130005409144
##$SI= 131072
##$SIGF1= 0
##$SIGF2= 0
##$SINO= 400
##$SIOLD= 131072
##$SPECTYP= <>
##$SREGLST= <1H.CDCl3>
##$SSB= 0
##$STSI= 131072
##$STSR= 0
##$SW_p= 8223.68421052632
##$SYMM= 0
##$S_DEV= 0
##$TDeff= 65536
##$TDoff= 0
##$TI= <>
##$TILT= no
##$TM1= 0
##$TM2= 0
##$TOPLEV= 0
##$USERP1= <user>
##$USERP2= <user>
##$USERP3= <user>
##$USERP4= <user>
##$USERP5= <user>
##$WDW= 1
##$XDIM= 131072
##$YMAX_p= 446113655
##$YMIN_p= -321815845
##$CURPLOT= <Network HP LaserJet P1505>
##$CURPRIN= <$Network HP LaserJet P1505>
##$DFORMAT= <normdp>
##$LAYOUT= <+/1D_H.xwp>
##$LFORMAT= <normlp>
##$PFORMAT= <normpl>
##$SURQMSG= 1
$$ End of Bruker specific parameters
$$ ---------------------------------
##NTUPLES= NMR SPECTRUM
##VAR_NAME=  FREQUENCY,     SPECTRUM/REAL,   SPECTRUM/IMAG
##SYMBOL=    X,             R,               I
##VAR_TYPE=  INDEPENDENT,   DEPENDENT,       DEPENDENT
##VAR_FORM=  AFFN,          ASDF,            ASDF
##VAR_DIM=   131072,        131072,          131072
##UNITS=     HZ,            ARBITRARY UNITS, ARBITRARY UNITS
##FACTOR=    0.0627417313425165, 1,          1
##FIRST=     8223.62146879498, 8150,         -108371
##LAST=      0,             10442,           -107290
##MIN=       0,             -321815845,      0
##MAX=       8223.62146879498, 446113655,    0
$$ Real data points
##PAGE= N=1
##DATA TABLE= (X++(R..R)), XYDATA
$$ [...]
61298H75105P496P375P901R638J1725J3308J4546J5818J6973J8006J9512K1666
$$ 875105 882601 889976 897877 907515 919240 932548 947094 962912 979885 997891 1017403 1039069
61286A039069K3508K4068K3801K3880K4373K4091K2376K0109J8475J7349J5560
$$ 1039069 1062577 1086645 1110446 1134326 1158699 1182790 1205166 1225275 1243750 1261099 1276659
61275A276659J2512Q859N490K465n86l512n803p545r349j1220j2280j2101j1566
$$ 1276659 1289171 1298030 1303520 1305985 1305399 1301887 1296084 1288539 1279190 1267970 1255690 1243589 1232023
61262A232023j1791j2650j3128j2714j1784j0886j0401j0562j0983j0504q520
$$ 1232023 1220232 1207582 1194454 1181740 1169956 1159070 1148669 1138107 1127124 1116620 1108100
61251A108100o271n576o246o020l566k65J678J944K029L137N060O839P751P701
$$ 1108100 1101829 1096253 1090007 1083987 1080421 1080156 1081834 1083778 1085807 1088944 1094004 1100843 1108594 1116295
61237A116295P112O273M647J411k947o373p408o946o874p282o373l279K96J904
$$ 1116295 1123407 1129680 1134327 1135738 1132791 1126418 1119010 1112064 1105190 1097908 1091535 1088256 1088552 1090456
61223A090456J186N6L55K009L647M430M789N512O772Q404J0637J3799J7349J9960
$$ 1090456 1091642 1091698 1092053 1094062 1097709 1102139 1106928 1112440 1119212 1127616 1138253 1152052 1169401 1189361
61209A189361K0862K0534J9881J9350J9305K0438K2956K5763K7338K7367K6885
$$ 1189361 1210223 1230757 1250638 1269988 1289293 1309731 1332687 1358450 1385788 1413155 1440040
61198A440040K6856K7323K7993K8927L0243L1533L1850L0279K6543K1249J5412
$$ 1440040 1466896 1494219 1522212 1551139 1581382 1612915 1644765 1675044 1701587 1722836 1738248
61187A738248R554L399l302r969j5651k0080k3797k7281l0344l2375l2761l1289
$$ 1738248 1747802 1751201 1747899 1737930 1722279 1702199 1678402 1651121 1620777 1588402 1555641 1524352
61175A524352k8561k5965k4665k4532k4451k3629k2214k0677j9092j7186j4806
$$ 1524352 1495791 1469826 1445161 1420629 1396178 1372549 1350335 1329658 1310566 1293380 1278574
61164A278574j2176r830q227p329o832o745p241p772p198n532m583n767p813q065
$$ 1278574 1266398 1256568 1248341 1241012 1234180 1227435 1220194 1212422 1205224 1199692 1195109 1189342 1181529 1173464
61150A173464n699k286P40L396N634O356M993K892J929K457L558M640N849P322
$$ 1173464 1167765 1165479 1166219 1169615 1175249 1181605 1186598 1189490 1191419 1193876 1197434 1202074 1207923 1215245
61136A215245Q917J0525J2089J3577J5368J8157K1999K5907K8777L0184K9939
$$ 1215245 1224162 1234687 1246776 1260353 1275721 1293878 1315877 1341784 1370561 1400745 1430684
61125A430684K7840K4454K1265J9147J7384J5088J2760J1375J0671R707Q649Q388
$$ 1430684 1458524 1482978 1504243 1523390 1540774 1555862 1568622 1579997 1590668 1600375 1609024 1617412
61113A617412Q628P865N449K364k24k033l104l542m211o329r753j2714j4088j4955
$$ 1617412 1626040 1633905 1639354 1641718 1641494 1639461 1636357 1632815 1628604 1622275 1612522 1599808 1585720 1570765
61099A570765j6988k0094k2672k3661k3337k2383k1158j9849j8484j6777j4532
$$ 1570765 1553777 1533683 1511011 1487350 1464013 1441630 1420472 1400623 1382139 1365362 1350830
61088A350830j2215j0531r424q067n996l808k625l203n556q995j2347j4722j6183
$$ 1350830 1338615 1328084 1318660 1310593 1304597 1300789 1298164 1294961 1289405 1280410 1268063 1253341 1237158
61075A237158j7312j7994j7366j5340j3267j2200j1073p989l181Q45K560L382
$$ 1237158 1219846 1201852 1184486 1169146 1155879 1143679 1132606 1124617 1121436 1122281 1124841 1128223
61063A128223N348Q128R893J0429J1431J3768J6231J7601J8399J9736K1515K2875
$$ 1128223 1133571 1141699 1151592 1162021 1173452 1187220 1203451 1221052 1239451 1259187 1280702 1303577
61051A303577K3704K4580K5565K5948K5178K3568K2150K1942K2995K3957K3205
$$ 1303577 1327281 1351861 1377426 1403374 1428552 1452120 1474270 1496212 1519207 1543164 1566369
61040A566369K0647J7775J5691J3848J1200P594L385j444o773j1624j4919j6659
$$ 1566369 1587016 1604791 1620482 1634330 1645530 1653124 1656509 1655065 1648292 1636668 1621749 1605090
61028A605090j7575j8130j8528j9076j9605j9182j7317j5039j3785j3661j3762
$$ 1605090 1587515 1569385 1550857 1531781 1512176 1492994 1475677 1460638 1446853 1433192 1419430
61017A419430j3702j3635j3222j1856r803p966o623n434m520m416m808m416k389
$$ 1419430 1405728 1392093 1378871 1367015 1357212 1349246 1342623 1337189 1332669 1328253 1323445 1319029 1316640
61004A316640Q57M239O799Q114Q562R218J0880J3362J6031J8482K0364K1452K2588
$$ 1316640 1317497 1321736 1328535 1336649 1345211 1354429 1365309 1378671 1394702 1413184 1433548 1455000 1477588
60991A477588K5518L0727L6422M0655M3446M5738M7667M9499N2771N8373O4502
$$ 1477588 1503106 1533833 1570255 1610910 1654356 1700094 1747761 1797260 1850031 1908404 1972906
60980A972906O8760P1402P4287P7673Q0792Q4609R0831R8499J04881J09774J15704
$$ 1972906 2041666 2113068 2187355 2265028 2345820 2430429 2521260 2619759 2724640 2834414 2950118
60969B950118J23685J32108J40303J49673J60483J71019J81194J93593K09240
$$ 2950118 3073803 3205911 3346214 3495887 3656370 3827389 4008583 4202176 4411416
60960D411416K25381K39311K51808K65081K80061K97511L19148L45630L75659
$$ 4411416 4636797 4876108 5127916 5392997 5673058 5970569 6289717 6635347 7011006
60951G011006M08718M46358M89296N36018N85709O39777O99176P63845Q36403
$$ 7011006 7419724 7866082 8355378 8891396 9477105 10116882 10816058 11579903 12416306
60942A2416306R22400J024902J143207J278813J437074J620707J829304K069799
$$ 12416306 13338706 14363608 15506815 16785628 18222702 19843409 21672713 23742512
60934B3742512K358776K707920L116405L580653M080909M517722M671626M297696
$$ 23742512 26101288 28809208 31925613 35506266 39587175 44104897 48776523 53074219
60926E3074219L330465K004238P35434j39225n19723m84479j59442L02849O58616
$$ 53074219 56404684 58408922 59144356 59005131 58485408 58000929 57841487 58144336 58802952
60917E8802952O01245n5676j208530k503309l563584m195183m412337m330912
$$ 58802952 59404197 59348521 58139991 55636682 52073098 47877915 43465578 39134666
60909C9134666m068753l715520l335690k966977k621893k302694k013726j758412
$$ 39134666 35065913 31350393 28014703 25047726 22425833 20123139 18109413 16351001
60901A6351001j533589j334069j159099j009841q84194p78207o89636o16355n53969
$$ 16351001 14817412 13483343 12324244 11314403 10430209 9652002 8962366 8346011 7792042
60892G792042m98426m48943m05691l66972l31290k99594k72694k48887k26877
$$ 7792042 7293616 6844673 6438982 6072010 5740720 5441126 5168432 4919545 4692668
60883D692668k08643j96330j88340j81428j74684j68436j61350j52093j42321
$$ 4692668 4484025 4287695 4099355 3917927 3743243 3574807 3413457 3261364 3119043
60874C119043j34531j28074j20526j11878j04084r7285q9958q2311p6200p1697
$$ 3119043 2984512 2856438 2735912 2624034 2519950 2422665 2332707 2250396 2174196 2102499
60864B102499o6895o1279n6521n3454n0805m7561m4420m2207m0568l8767l6407
$$ 2102499 2035604 1974325 1917804 1864350 1813545 1765984 1721564 1679357 1638789 1600022 1563615
60853A563615l3187k9367k6408k5713k6716k7505k7121k5908k4051k1413j8625
$$ 1563615 1530428 1501061 1474653 1448940 1422224 1394719 1367598 1341690 1317639 1296226 1277601
60842A277601j6760j5989j5786j6028j6575j6487j5271j4262j4892j6270j6498
$$ 1277601 1260841 1244852 1229066 1213038 1196463 1179976 1164705 1150443 1135551 1119281 1102783
60831A102783j5807j5981j6981j6776j4785j2916j2582j2848j2323j0956r124
$$ 1102783 1086976 1070995 1054014 1037238 1022453 1009537 996955 984107 971784 960828 951704
60820I51704o790m536l883n345p263p549n847l433j758j414j784j441L87K805
$$ 951704 944914 940378 936495 931150 923887 916338 910491 907058 905300 903886 902102 900661 901048 903853
60806I03853M524N625O823P567O671M707L735M373N127N044N081O064P101P077
$$ 903853 908377 914002 920825 928392 935063 939770 943505 947878 953005 958049 963130 969194 976295 983372
60792I83372O277N526M872L979K772J115j011k532j984R7J067n89l315m873n304
$$ 983372 989649 995175 1000047 1004026 1006798 1007913 1006902 1004370 1002386 1002483 1003550 1002961 999646 994773 989469
60777I89469o146p796r186r498q833p560o064m882m247l660k521p42J497L990
$$ 989469 983323 975527 966341 956843 948010 940450 934386 929504 925257 921597 919076 918334 919831 923821
60763I23821O064O823O375O038O650P536P896Q305R821J2254J4355J5307J5291
$$ 923821 929885 936708 943083 949121 955771 963307 971203 979508 989329 1001583 1015938 1031245 1046536
60750A046536J4975J5182J6525J8607J9999J9745J8499J7585J7427J7478J7151
$$ 1046536 1061511 1076693 1093218 1111825 1131824 1151569 1170068 1187653 1205080 1222558 1239709
60739A239709J6083J4111J1701R791Q463O380K552j955n215p041r063j2162j5104
$$ 1239709 1255792 1269903 1281604 1291395 1299858 1306238 1308790 1306835 1301620 1294579 1285516 1273354 1258250
60726A258250j6120j5145j3942j4352j6579j8946j9404j7598j5325j4548j5253
$$ 1258250 1242130 1226985 1213043 1198691 1182112 1163166 1143762 1126164 1110839 1096291 1081038
60715A081038j5826j5333j4482j4224j4360j4177j3808j4080j5066j5629j4860
$$ 1081038 1065212 1049879 1035397 1021173 1006813 992636 978828 964748 949682 934053 919193
60704I19193j3362j2559j2944j3649j3719j2994j1669r840q010p234p895q971
$$ 919193 905831 893272 880328 866679 852960 839966 828297 818457 810447 803213 795318 786347
60692G86347r253q752q016o756m563k522k326l593l838j708J121K168J095n00
$$ 786347 777094 768342 760326 753570 749007 746485 744159 740566 736728 735020 736141 738309 739404 738904
60678G38904j380j641j975k794l930m608m104k672j356n85K42J417K159J812R81
$$ 738904 737524 735883 733908 731114 727184 722576 718472 715800 714444 713859 714101 715518 717677 719489 720470
60663G20470N43K57p19k315l536l750l257k724k730l638n282o800p258o471n021
$$ 720470 721013 721270 720551 718236 714700 710950 707693 704969 702239 698601 693319 686519 679261 672790 667769
60648F67769l740l352m153n678o923p243o795n999n038l990k991k122j598j981
$$ 667769 664029 660677 656524 650846 643923 636680 629885 623886 618848 614858 611867 609745 608147 606166
60634F06166l336m338l355p59J175J162L91M04R44J100J245K286L746M310L898
$$ 606166 602830 598492 595137 594378 595553 596715 597106 597510 598454 599554 600799 603085 606831 611141 615039
60619F15039L682M253N048N528N733N663N205M769M946N403N084L703K294J936
$$ 615039 618721 622974 628022 633550 639283 644946 650151 654920 659866 665269 670353 674056 676350 678286
60605F78286K488K774J848P8r27J56K663M407M242L388L545M575N096M659M119
$$ 678286 680774 683548 685396 685474 684547 684703 687366 691773 696015 699403 702948 707523 712619 717278 721397
60590G21397M210M910N883O601O348N191M381M608M408J870k435n888p160p352
$$ 721397 725607 730517 736400 743001 749349 754540 758921 763529 767937 769807 767372 761484 754324 746972
60576G46972p716q071p936p571p069n896m123k918k816k788k021j491k416l959
$$ 746972 739256 731185 723249 715678 708609 702713 698590 695672 692856 690068 688047 686556 684140 680181
60562F80181l972j859N97J345J94j362j796p78R00K330L195L554L303K451J683
$$ 680181 676209 674350 674947 676292 676486 675124 673328 672550 673450 675780 678975 682529 685832 688283 689966
60547F89966J929L263M800N735N857N123L715K578K790M011M601L826K882L074
$$ 689966 691895 695158 699958 705693 711550 716673 720388 722966 725756 729767 734368 738194 741076 744150
60533G44150M006M514M447M330L994K838J178R3R3Q88K293M232N948O520O353
$$ 744150 748156 752670 757117 761447 765441 768279 769457 769550 769643 770531 772824 777056 783004 789524 795877
60518G95877O873Q361R370R015Q659J0116J2949J5038J5612J6177J8168K1070
$$ 795877 802750 811111 820481 829496 838155 848271 861220 876258 891870 908047 926215 947285
60506I47285K3649K5901K8613L1681L4201L5969L7371L7636L4814K8246J9906
$$ 947285 970934 996835 1025448 1057129 1091330 1127299 1164670 1202306 1237120 1265366 1285272
60495A285272J2268N774m76o316j0412j2161j2215j1012q185l798J006N152Q639
$$ 1285272 1297540 1303314 1302838 1296522 1286110 1273949 1261734 1250722 1242537 1238739 1239745 1244897 1253536
60482A253536J2013J5613J9725K4643L0145L5615M1127M7584N5245O2840O8634
$$ 1253536 1265549 1281162 1300887 1325530 1355675 1391290 1432417 1480001 1535246 1598086 1666720
60471A666720P1803P2313P0225O5664N8741M9032L5921K0274M936p385j6238k2811
$$ 1666720 1738523 1810836 1881061 1946725 2005466 2054498 2090419 2110693 2115629 2108244 2092006 2069195
60459B069195k7922l1604l3929l4950l4186l1273k6922k2170j6979j0811m342
$$ 2069195 2041273 2009669 1975740 1940790 1906604 1875331 1848409 1826239 1809260 1798449 1794107
60448A794107Q20M257P300J1164J5702K0412K5542L1647L8887M7248N6677O6580
$$ 1794107 1794927 1799184 1806484 1817648 1833350 1853762 1879304 1910951 1949838 1997086 2053763 2120343
60436B120343P6066Q5155R4872J05494J15396J22258J24616J21676J12739R7962
$$ 2120343 2196409 2281564 2376436 2481930 2597326 2719584 2844200 2965876 3078615 3176577
60426C176577P9300N9538M0730K4150J1160K933m15N24N175J2230J8599K0720
$$ 3176577 3255877 3315415 3356145 3380295 3391455 3394388 3393973 3394497 3399672 3411902 3430501 3451221
60414C451221J7038P995o319k6647n2087p8801j02540j21520j35850j45327j49194
$$ 3451221 3468259 3476254 3469935 3443288 3391201 3312400 3209860 3088340 2952490 2807163 2657969
60403B657969j47643j42036j33814j24073j13885j03869r3650q2857p2587o4673
$$ 2657969 2510326 2368290 2234476 2110403 1996518 1892649 1798999 1716142 1643555 1578882
60393A578882n9490n5568n1565m7425m3486l9706l6230l3457l0977k7653k3455
$$ 1578882 1519392 1463824 1412259 1364834 1321348 1281642 1245412 1211955 1180978 1153325 1129870
60382A129870k0044j8530j7782j6047j3336j0909r228p959p347p829q522p872
$$ 1129870 1109826 1091296 1073514 1057467 1044131 1033222 1023994 1016035 1008688 1000859 992337 984465
60370I84465n996m853n708p703r352j0124j0157r646r171r440j0034r506p481
$$ 984465 978469 973616 967908 960205 950853 940729 930572 920926 911755 902315 892281 882775 875294
60357H75294n526n125n871o530o782o746n862l727j317J91J075K089K524J214
$$ 875294 869768 864643 858772 852242 845460 838714 832852 829125 827808 827999 829074 831163 833687 834901
60343H34901q84j361J97J575J307N53O22P21k27j194n41J218K191K132K457L462
$$ 834901 834017 832656 832853 834428 835735 836288 836910 837631 837404 836210 835669 836887 839078 841210 843667 847129
60327H47129L684K431J024O44O11j7m60O46K792L974L439K687L238M469M503K782
$$ 847129 850813 853244 854268 854912 855523 855506 855046 855692 858484 862458 865897 868584 871822 876291 880794 883576
60311H83576Q43M65J655K938L371L484M109M973N194M765M627N250O012O302O424
$$ 883576 884419 884884 886539 889477 892848 896332 900441 905414 910608 915373 920000 925250 931262 937564 943988
60296I43988O907P547P764P553P433P835R010J1221J4284J7179J8846J9368J9713
$$ 943988 950895 958442 966206 973759 981192 989027 998037 1009258 1023542 1040721 1059567 1078935 1098648
60283A098648K0294K0350J8937J6017J2366Q762N315J457l368q751j3320j6027
$$ 1098648 1118942 1139292 1158229 1174246 1186612 1195374 1200689 1202146 1198778 1190027 1176707 1160680
60271A160680j7115j7294j6430j4052j0870q620q114q455q486q086p516o409m307
$$ 1160680 1143565 1126271 1109841 1095789 1084919 1076299 1068185 1059730 1051244 1043158 1035642 1029233 1024926
60258A024926j625O57K007K557K713L059M143N840P326Q235R320J1431J4335J7344
$$ 1024926 1023301 1023958 1025965 1028522 1031235 1034294 1038437 1044277 1051603 1059838 1069158 1080589 1094924 1112268
60244A112268K0636K5004L0502L6178M1059M4575M6082M4955M1261L5505K7589
$$ 1112268 1132904 1157908 1188410 1224588 1265647 1310222 1356304 1401259 1442520 1478025 1505614
60233A505614J6835L560j0064k1331k9088l4217l8270m1881m4353m4653m2718
$$ 1505614 1522449 1526009 1515945 1494614 1465526 1431309 1393039 1351158 1306805 1262152 1219434
60222A219434l9705l6922l4701l2505k9724k6125k1884j7782j5031j4178j4297
$$ 1219434 1179729 1142807 1108106 1075601 1045877 1019752 997868 980086 965055 950877 936580
60211I36580j3919j2712j1460j0515r200p117n088m199m430m805m598l851k883
$$ 936580 922661 909949 898489 887974 878774 871657 866569 862370 857940 853135 848537 844686 841803
60198H41803j840q28j25o9o46j322j495j226j195j762k319j987p22O36J278J064
$$ 841803 839963 839135 839010 838941 838295 836973 835478 834252 833057 831295 828976 826989 826267 826903 828181 829245
60182H29245N60P53K191L903L906J710m07J01K709M621M688M631N978P828Q702
$$ 829245 829805 830558 832749 836652 840558 842268 841861 841962 844671 849292 853980 858611 864589 872417 881119
60167H81119Q872R357R874R425Q115O771N347L261R96k45l81n54j296j864j576
$$ 881119 889991 899348 909222 918647 926762 933533 938880 942141 943137 942892 942511 941957 940661 938797 937221
60152I37221p25O9M36K01k41M53L128O118O289K878j019j831O31L668N100M847
$$ 937221 936496 936565 937001 937202 936961 937414 940542 946660 952949 955827 954808 952977 953608 957276 962376 967223
60136I67223L768K470J343O49L35K90O68J392J731J196N61Q79J613J184m87j475
$$ 967223 970991 973461 974804 975453 975788 976078 976746 978138 979869 981065 981626 982505 984118 985302 984815 983340
60120I83340n75Q32Q82J13O07K773M688M843M000L792M747O421Q384J0076J0477
$$ 983340 982765 983597 984479 984592 985199 987972 992660 997503 1001503 1005295 1010042 1016463 1024847 1034923 1045400
60105A045400R174P416O945P807Q370P519N841M390L205J727n9j539k279k261
$$ 1045400 1054574 1061990 1068935 1076742 1085112 1092631 1098472 1102862 1106067 1107794 1107735 1106196 1103917 1101656
60091A101656j618n34P11K075L907O428R214J1623J3564J5333J6744J7083J6019
$$ 1101656 1100038 1099504 1100215 1102290 1106197 1112625 1121839 1133462 1147026 1162359 1179103 1196186 1212205
60078A212205J4144J2198J0196P745M987K612Q69q92l299n961p842q560q747r043
$$ 1212205 1226349 1238547 1248743 1256488 1261475 1264087 1264956 1264064 1260765 1254804 1246962 1238402 1229655 1220612
60064A220612r339r236q696p835o600n233m647n457o849p246o154m446k819j013
$$ 1220612 1211273 1202037 1193341 1185506 1178906 1173673 1169026 1163569 1156720 1149474 1143320 1138874 1136055 1135042
60050A135042J110K800L542M096N446P238Q316Q584R191J0835J2833J4184J4763
$$ 1135042 1136152 1138952 1142494 1146590 1152036 1159274 1167590 1176174 1185365 1196200 1209033 1223217 1237980
60037A237980J5026J5065J4638J3882J3358J3154J2267R411M568n32l948n416
$$ 1237980 1253006 1268071 1282709 1296591 1309949 1323103 1335370 1344781 1349349 1348817 1344869 1339453
60025A339453o147o845o914o020n292n827o776o389m827m377o452r641j1450j1004
$$ 1339453 1333306 1326461 1319547 1313527 1308235 1302408 1295632 1289243 1284416 1280039 1273587 1263946 1252496 1241492
60011A241492r404q222q466j0357j3119j5270j5882j5241j3929j1945r608q527
$$ 1241492 1232088 1223866 1215400 1205043 1191924 1176654 1160772 1145531 1131602 1119657 1110049 1101522
59999A101522j0194j3721j6333j6306j4385j2152j0316r020q541q764q796p999
$$ 1101522 1091328 1077607 1061274 1044968 1030583 1018431 1008115 999095 990554 981790 972994 964995
59987I64995o855o019n231m039k934k684k954k705j776q76j87Q36K088K513J599
$$ 964995 958140 952121 946890 942851 939917 937233 934279 931574 929798 928922 928735 929571 931659 934172 935771
59972I35771J38j017k099l663n363o200n710m423l473l824n416o927p030o000
$$ 935771 935909 934892 932793 929130 923767 917567 911857 907434 903961 900137 894721 887794 880764 874764
59958H74764n250n195m756l392k227k226k535j990j175j360k088j707L5J705K650
$$ 874764 869514 864319 859563 856171 853944 851718 849183 847193 846018 844658 842570 840863 840898 842603 845253
59943H45253L837N846P660Q298Q356Q944J0013J0697J0587R938R001P898O793
$$ 845253 849090 854936 862596 870894 879250 888194 898207 908904 919491 929429 938430 946328 953121
59930I53121N699M544L573L161L015K370J270P67J361K160K259K042K256K609
$$ 953121 958820 963364 966937 970098 973113 975483 976753 977520 978881 981041 983300 985342 987598 990207
59916I90207K368J751J538J643J291M78R6M87R14P25K21k6l3n3M6N27J116J241
$$ 990207 992575 994326 995864 997507 998798 999276 999372 999859 1000773 1001498 1001719 1001693 1001660 1001607 1001653 1002180 1003296 1004537
59898A004537Q65O77J246K196K625K204J512J068N85m62j907l164m120m970n448
$$ 1004537 1005402 1006079 1007325 1009521 1012146 1014350 1015862 1016930 1017515 1017053 1015146 1011982 1007862 1002892 997444
59883I97444n183m684m847n390n072l787k965l271l445k531j734k445l557k863
$$ 997444 992261 987577 982730 977340 972268 968481 965516 962245 958800 956269 954535 952090 948533 945670
59869I45670o01O23m27j836j208J385L966N096M904M260L757L353K791K314K693
$$ 945670 945069 945692 945265 943429 942221 943606 947572 952668 957572 961832 965589 968942 971733 974047 976740
59854I76740L997M865L980K030J049J713K613K400J435P52N51M73M80O68R01J285
$$ 976740 980737 985602 989582 991612 992661 994374 996987 999387 1000822 1001574 1002125 1002598 1003078 1003746 1004647 1005932
59838A005932K251L475L601J966r8p28J82J309J952K445K683J879K94k13J622
$$ 1005932 1008183 1011658 1015259 1017225 1017127 1016399 1016581 1017890 1019842 1022287 1024970 1026849 1027143 1026930 1028552
59823A028552M481N832N089M231N032O573O454M072J735K026M844P653Q344O945
$$ 1028552 1033033 1038865 1043954 1048185 1053217 1059790 1066244 1070316 1072051 1074077 1078921 1086574 1094918 1101863
59809A101863M639K154l68k599m014m563m710m804m752m402l906l574l445l174
$$ 1101863 1106502 1108656 1108288 1105689 1101675 1097112 1092402 1087598 1082846 1078444 1074538 1070964 1067519 1064345
59795A064345k405j328p14j161k246k727j701N82L069M909O039P066Q793J1669
$$ 1064345 1061940 1060612 1059898 1058737 1056491 1053764 1052063 1052645 1055714 1060623 1066662 1073728 1082521 1094190
59781A094190J5461J9343K2159K2622J9801J4143P930L843K675K880K685K055
$$ 1094190 1109651 1128994 1151153 1173775 1193576 1207719 1215649 1219492 1222167 1225047 1227732 1229787
59769A229787J990K436J776j551p461j4335k0162k3547k4246k3221k2051k1718
$$ 1229787 1231777 1234213 1235989 1234438 1226977 1212642 1192480 1168933 1144687 1121466 1099415 1077697
59757A077697k1754k0749j7994j4505j2122j1538j1610j0917r481q394q090p862
$$ 1077697 1055943 1035194 1017200 1002695 990573 979035 967425 956508 947027 938633 930543 922681
59745I22681p131o276n869n885o143o795p725q017o972n321m546n001n612n509
$$ 922681 915550 909274 903405 897520 891377 884582 876857 868840 861868 856547 852001 847000 841388 835879
59731H35879n143n383o238p003p340p518p684p418o257m420k682j483n48M07Q54
$$ 835879 830736 825353 819115 812112 804772 797254 789570 782152 775895 771475 768793 767310 766762 767169 768023
59716G68023Jj775k786j872R5J218P94k86j138j859k700l219k855j717j81J672
$$ 768023 768024 766249 763463 761591 761686 762904 763698 763412 762274 760415 757715 754496 751641 749924 749743 751415
59700G51415L592M668M328L566M034N699O573N255K888J590J650J524N17P9J711
$$ 751415 755007 759675 764003 767569 771603 777302 783875 789130 792018 793608 795258 796782 797299 797378 799089
59685G99089M514N979M966K814J305M93o69k229k849j718N4O28m13j699j781n73
$$ 799089 803603 809582 814548 817362 818667 819160 818491 816262 813413 811695 811749 812377 811964 810265 808484 807911
59669H07911R95K125K550K205J105m15j708k245j875p57Q03K393L603M165L974
$$ 807911 808906 811031 813581 815786 816891 816476 814768 812523 810648 809891 810694 813087 816690 820855 824829
59654H24829L080J904J297K047M081O379P808P950P124N920M812M136M163N135
$$ 824829 827909 829813 831110 833157 837238 843617 851425 859375 866499 872419 877231 881367 885530 890665
59640H90665O983Q948R800Q983P552P300Q641R866R072O442L988L123L178K573
$$ 890665 897648 906596 916396 925379 932931 940231 948872 958738 967810 974252 978240 981363 984541 987114
59626I87114P74j350k825l505l640l154j924n43J6l47o48l63n44k499n657p821
$$ 987114 987888 986538 983713 980208 976568 973414 971490 970947 970963 970616 969968 969605 969061 966562 960905 953084
59610I53084p687o152m807m092l470k629j688p39M0L09K65Q85K605M186M006K328
$$ 953084 945397 939245 934438 930346 926876 924247 922559 921820 921860 922169 922434 923319 925924 930110 934116 936444
59594I36444J113J451K343K416J801J591K157K808K860K290J289k37k472n053
$$ 936444 937557 939008 941351 943767 945568 947159 949316 952124 954984 957274 958563 958326 955854 950801
59580I50801o916p109n940n001n588p264q448q288p268n995m320k105j88K59r28
$$ 950801 943885 936776 930836 925835 920247 912983 904535 896247 888979 882984 878664 876559 876371 876630 875702
59565H75702k730m047m565m562m283l730k988k550l074m593o154o724o440o461
$$ 875702 872972 868925 864360 859798 855515 851785 848797 846247 843173 838580 832426 825702 819262 812801
59551H12801p353q236p846o085l892k007n39L53K30q29j774j521k49P58N36n98
$$ 812801 805448 797212 789366 783281 779389 777382 776843 777196 777426 776597 774823 773302 773053 773811 774347 773749
59535G73749j617j953j806j522j148p03m69p63j509k275k670k601k254j885j616
$$ 773749 772132 770179 768373 766851 765703 765000 764531 763768 762259 759984 757314 754713 752459 750574 748958
59520G48958j300p62k64m18j428k608l056k755k623l366m516m830l540j102J206
$$ 748958 747658 746896 746632 746214 744786 742178 739122 736367 733744 730378 725862 721032 717492 716390 717596
59505G17596K335K133J270O39Q02J588K171J846R55O36J331K130K231K454M161
$$ 717596 719931 722064 723334 723973 724775 726363 728534 730380 731335 731971 733302 735432 737663 740117 744278
59490G44278O903Q565Q093O761O210O461O741P100Q086R593J1159J2827J4714
$$ 744278 751181 759746 767839 774600 780810 787271 794012 801112 809198 818791 829950 842777 857491
59477H57491J6368J7635J9485K2431K4591K2935J6689Q445J700j759k305j532
$$ 857491 873859 891494 910979 933410 958001 980936 997625 1006070 1007770 1006011 1003706 1002174
59465A002174j139j701k283j834p09J10P83K222M010M401K735M22j073k027l522
$$ 1002174 1001035 999334 997051 995217 994508 994618 995401 997623 1001633 1006034 1008769 1009191 1008118 1006091 1002569
59450A002569n833q398j0574j1810j1829j1184j0996j1721j2820j3760j4442j4466
$$ 1002569 996736 988338 977764 965954 954125 942941 931945 920224 907404 893644 879202 864736
59438H64736j3156j0786q682p542o649n326m065l495l237k663j996j722j635j228
$$ 864736 851580 840794 832112 824570 817921 812595 808530 805035 801798 799135 797139 795417 793782 792554
59424G92554m91L88J412K301K384J647J157J695K733L366L528L548L321K786K432
$$ 792554 792063 792451 793863 796164 798548 800195 801352 803047 805780 809146 812674 816222 819543 822329 824761
59409H24761K462K249J512J182K084L396L641K701J816J923K946M353N540O037
$$ 824761 827223 829472 830984 832166 834250 837646 841287 843988 845804 847727 850673 855026 860566 866603
59395H66603N983O065O454O497O073O168P278Q320Q330Q180R073J0207R642P042
$$ 866603 872586 878651 885105 891602 897675 903843 911121 919441 927771 935951 945024 955231 964873 971915
59381I71915L864J248p91k330l427m814p106r361r978q898p370n681l137l53P09
$$ 971915 975779 977027 976236 973906 970479 965665 958559 949198 939220 930322 922952 917271 914134 913781 914490
59366I14490k08n58J772N561Q061Q577Q766J0008J1991J3967J6099J9006K2363
$$ 914490 914282 913724 915496 921057 929118 937695 946461 956469 968460 982427 998526 1017532 1039895
59353A039895K4792K5541K5927K8044L1488L2329K6574J4355j65j2470k0082k2137
$$ 1039895 1064687 1090228 1116155 1144199 1175687 1208016 1234590 1248945 1248780 1236310 1216228 1194091
59341A194091j9077j3244p812l851K97N577R254O906k741j5835k6253l0117k8066
$$ 1194091 1175014 1161770 1153958 1150107 1150404 1155981 1165235 1172141 1169400 1153565 1127312 1097195 1069129
59328A069129k3933k1153k0117j8766j5447j0770o835n249n907p089o666l821
$$ 1069129 1045196 1024043 1003926 985160 969713 958943 952108 946859 940952 933863 927197 923376
59316I23376K93L883O215P533Q018P966Q525J0671J3452J4691J3681J1869J0659
$$ 923376 923669 927552 933767 941300 949318 957284 965809 976480 989932 1004623 1018304 1030173 1040832
59303A040832R962R319Q791Q142O698M963M906P468J0985J3273J4142J4689J5156
$$ 1040832 1050794 1060113 1068904 1077046 1083744 1088707 1093613 1101081 1112066 1125339 1139481 1154170 1169326
59290A169326J4979J4267J3747J3690J4075J5222J7132J8747J9120J8773J8681
$$ 1169326 1184305 1198572 1212319 1226009 1240084 1255306 1272438 1291185 1310305 1329078 1347759
59279A347759J8529J7373J5567J4249J3142J0708O697K878N71j028l324o328r099
$$ 1347759 1366288 1383661 1399228 1413477 1426619 1437327 1444024 1446902 1447473 1446445 1443121 1436793 1427694
59266A427694j1352j3457j5384j6495j6388j5353j4035j2991j2440j2162j1650
$$ 1427694 1416342 1402885 1387501 1371006 1354618 1339265 1325230 1312239 1299799 1287637 1275987
59255A275987j0547q996p548o759o635o473n545m126l322l518l574k228K40K600
$$ 1275987 1265440 1256444 1248896 1242137 1235502 1229029 1223484 1219358 1216036 1212518 1208944 1206716 1206956 1209556
59241A209556M396N950O963O701N726N972Q374J1629J4044J5600J7299J9448K1674
$$ 1209556 1213952 1219902 1226865 1233566 1239292 1245264 1253638 1265267 1279311 1294911 1312210 1331658 1353332
59228A353332K3878K5749K5728K1757J3169J209j1872k3401l0720l2841l1674
$$ 1353332 1377210 1402959 1428687 1450444 1463613 1464822 1452950 1429549 1398829 1365988 1334314
59217A334314l0096k8564k5178j9348j3512j0135q671p035m791l076k100p60J343
$$ 1334314 1304218 1275654 1250476 1231128 1217616 1207481 1198810 1191775 1186984 1183908 1181808 1181048 1182391
59204A182391L268M299M673M550L499J358j508n028r163j2712j3951j3001j2068
$$ 1182391 1185659 1189958 1194631 1199181 1202680 1204038 1202530 1197502 1188339 1175627 1161676 1148675 1136607
59191A136607j2539j3308j2922j1913j1558j1611j0925r537q389p409n609k919
$$ 1136607 1124068 1110760 1097838 1085925 1074367 1062756 1051831 1042294 1033905 1026496 1020887 1017968
59179A017968n14Q32J456J866K216K746L623M310M097L374L324M301N401N739
$$ 1017968 1017454 1018286 1019742 1021608 1023824 1026570 1030193 1034503 1038600 1041974 1045298 1049599 1055000 1060739
59165A060739N192L918K129M54n12j048j864k821l132k820k695k898k752k263
$$ 1060739 1065931 1069849 1071978 1072432 1071920 1070872 1069008 1066187 1063055 1060235 1057540 1054642 1051890 1049627
59151A049627k343l068l039j200J783M504O188O495N170K745P27K82J219K747
$$ 1049627 1047284 1044216 1041177 1039977 1041760 1046264 1052452 1058947 1064117 1066862 1067589 1067871 1069090 1071837
59137A071837M402N824O600O970P795R156R893R171P658O500N975N843O081O419
$$ 1071837 1076239 1082063 1088663 1095633 1103428 1112584 1122477 1131648 1139306 1145806 1151781 1157624 1163705 1170124
59123A170124O087M896L789L495L516L212K860K605J537q58l166l585k339j182
$$ 1170124 1176211 1181107 1184896 1188391 1191907 1195119 1197979 1200584 1202121 1201263 1198097 1194512 1192173 1190991
59109A190991r00p97k81M82J488K999M705N866O346O603O748O601O416O488O272
$$ 1190991 1190091 1189294 1189013 1189495 1190983 1193982 1198687 1204553 1210899 1217502 1224250 1230851 1237267 1243755 1250027
59094A250027N038L177J583Rk506n627p716q065p649p270o562n441m951n595o097
$$ 1250027 1255065 1258242 1259825 1259834 1257328 1251701 1243985 1235920 1228271 1221001 1214439 1208998 1204047 1198452 1192355
59079A192355n047k984j671j886k919l862m386m453m079l379k376r72O04J710
$$ 1192355 1187308 1184324 1182653 1180767 1177848 1173986 1169600 1165147 1161068 1157689 1155313 1154341 1154945 1156655
59065A156655K180K776M126N650O361O514P592J0550J4769J8787K1535K2761K2827
$$ 1156655 1158835 1161611 1165737 1171387 1177748 1184262 1191854 1202404 1217173 1235960 1257495 1280256 1303083
59052A303083K2371K1863K1319K0695K0416K1007K2118K2540K1517J9590J7795
$$ 1303083 1325454 1347317 1368636 1389331 1409747 1430754 1452872 1475412 1496929 1516519 1534314
59041A534314J6446J5174J3717J2087J0076P415M391J681n72k873n249o833p051
$$ 1534314 1550760 1565934 1579651 1591738 1601814 1609229 1613620 1615301 1614729 1611856 1606607 1599774 1592723
59028A592723o712p123q432r629j0120j0582j2142j5171j8952k2166k3746k3689
$$ 1592723 1586011 1578888 1570456 1560827 1550707 1540125 1527983 1512812 1493860 1471694 1447948 1424259
59016A424259k3150k3331k4352k5456k6023k5862k4888k3291k1851k1178k0635
$$ 1424259 1401109 1377778 1353426 1327970 1301947 1276085 1251197 1227906 1206055 1184877 1164242
59005A164242j9031j6456j4348j3416j2598j0696q161o471o268o782o729n384
$$ 1164242 1145211 1128755 1114407 1100991 1088393 1077697 1069536 1063065 1056797 1050015 1043286 1037902
58993A037902l209j698j951l147l188j234J221K349K107J682J725K100K626L162
$$ 1037902 1034693 1032995 1031044 1027897 1024709 1023475 1024696 1027045 1029152 1030834 1032559 1034659 1037285 1040447
58979A040447L455L744M892P075R120J0106J0851J2594J4746J5471J4197J2200
$$ 1040447 1043902 1047646 1052538 1059613 1068733 1078839 1089690 1102284 1117030 1132501 1146698 1158898
58967A158898J0909J0968J2755J6239K0122K2608K3491K4337K6154K8005K8497
$$ 1158898 1169807 1180775 1193530 1209769 1229891 1252499 1275990 1300327 1326481 1354486 1382983
58956A382983K7606K6307K5016K3116J9670J4361Q103K746l88j703k445k864k203
$$ 1382983 1410589 1436896 1461912 1485028 1504698 1519059 1527162 1529908 1529520 1527817 1525372 1522508 1520305
58943A520305m79J053J656K039K832L277K352L28j841l959o392q978j1260j3466
$$ 1520305 1519826 1520879 1522535 1524574 1527406 1530683 1533035 1533363 1531522 1527563 1521171 1512193 1500933 1487467
58929A487467j6035j8370j9323j9059j9300k1143k3581k4768k4103k2381k0449
$$ 1487467 1471432 1453062 1433739 1414680 1395380 1374237 1350656 1325888 1301785 1279404 1258955
58918A258955j8590j7006j5889j4852j2974r903o523m139l219l143k935j921J0
$$ 1258955 1240365 1223359 1207470 1192618 1179644 1169741 1163218 1159079 1155860 1152717 1149782 1147861 1147871
58905A147871K316M062M639M247L503K794K352K520L360M113L757K128m2k204
$$ 1147871 1150187 1154249 1158888 1163135 1166638 1169432 1171784 1174304 1177664 1181777 1185534 1187662 1187620 1185416
58891A185416m445o867r198j1071j2102j1714r785p450o289o473o632n814m419
$$ 1185416 1180971 1174104 1164906 1153835 1141733 1130019 1120234 1112784 1106495 1100022 1093390 1087576 1083157
58878A083157k878q62J350K034n0l684o462p461p607p946q795j0133j1539j1900
$$ 1083157 1080279 1079417 1080767 1082801 1082751 1079067 1072605 1065144 1057537 1049591 1040796 1030663 1019124 1007224
58864A007224j0449p978o049n162m721m545m991n594m980k749m09K45q22j976
$$ 1007224 996775 988797 982748 977586 972865 968320 963329 957735 952755 950006 949597 949842 949020 947044
58850I47044j611M52K989M558M834M700N012N651O201O959Q545J0839J2955J4175
$$ 947044 945433 945885 948874 953432 958266 962966 967978 973629 979830 986789 995334 1006173 1019128 1033303
58836A033303J4407J3861J2855J1694J0481R430R429J1386J4556J6708J6834J6525
$$ 1033303 1047710 1061571 1074426 1086120 1096601 1106031 1115460 1126846 1141402 1158110 1174944 1191469
58824A191469J7483J8867J8715J7052J5515J4474J2623R417N954L199R97r35k567
$$ 1191469 1208952 1227819 1246534 1263586 1279101 1293575 1306198 1315615 1321569 1324768 1325765 1324830 1322263
58811A322263m331o808r358j0624j0647j0907j1913j2405j1492r962q914q464
$$ 1322263 1317932 1311124 1301766 1291142 1280495 1269588 1257675 1245270 1233778 1223816 1214902 1206438
58799A206438q448q957r611r772j0096j2199j5967j8774j8612j6537j4859j4203
$$ 1206438 1197990 1189033 1179422 1169650 1159554 1147355 1131388 1112614 1094002 1077465 1062606 1048403
58787A048403j3691j2879j1966j0822r307q054p739p859p295n823m309l689m284
$$ 1048403 1034712 1021833 1009867 999045 989738 981684 973945 966086 958791 952968 948659 944970 940686
58774I40686n603o338n240k622l35L00k19p58j025j252j459j817k820m170m595
$$ 940686 935083 928745 923505 920883 920548 920848 920629 919871 918846 917594 916135 914318 911498 907328 902733
58759I02733l734l053l694m456l533j372j05m37q99j82J225K106K019J288K67
$$ 902733 898999 895946 892252 887796 884263 882891 882786 882349 881450 881268 882493 884599 886618 887906 888173
58744H88173r55k411l896m755m365l135k359k663l212k931j842n80N72J457J653
$$ 888173 887218 884807 880911 876156 871791 868656 866297 863634 860422 857491 855649 855069 855641 857098 858751
58729H58751J182P88O91J1j478k131m44K658N151O797Q703J0536J0608Q926P819
$$ 858751 859933 860721 861412 861423 859945 857814 857370 860028 865179 871976 880679 891215 901823 910749 918568
58714I18568Q655R818R047O391L496J125j215l762n903o981o816n596l952k996
$$ 918568 927223 937041 946088 952479 955975 957100 955885 952123 946220 939239 932423 926827 922875 919879
58700I19879l477m702m933l193m35J501J955K015K826L875L692K111Q56J424L217
$$ 919879 916402 911700 906767 903574 903139 904640 906595 908610 911436 915311 919003 921114 921970 923394 926611
58685I26611M477M561M384M916O185P795R593J1444J2876J3408J3151J2889J3418
$$ 926611 931088 935649 940033 944949 951134 958929 968522 979966 992842 1006250 1019401 1032290 1045708
58672A045708J4660J5654J5727J5469J5840J6478J5931J3834J1593J0236Q934
$$ 1045708 1060368 1076022 1091749 1107218 1123058 1139536 1155467 1169301 1180894 1191130 1200064
58661A200064O723M519L724L731K713O17o21l4J087J364J125J170J192N43m81
$$ 1200064 1206787 1211306 1215030 1218761 1221474 1222091 1221470 1221436 1222523 1223887 1225012 1226182 1227374 1227917 1227436
58646A227436j431k992o141j0320j3719j5433j6502j8462k1520k4447k5869k5387
$$ 1227436 1226005 1223013 1216872 1206552 1192833 1177400 1160898 1142436 1120916 1096469 1070600 1045213
58634A045213k3633k1530j9661j8318j7764j8064j8568j8115j6125j3259j0733
$$ 1045213 1021580 1000050 980389 962071 944307 926243 907675 889560 873435 860176 849443
58623H49443r095p950o606m704k374k89N30m31k356l563l182j978j056k44J398
$$ 849443 840348 832398 825792 821088 818714 818425 818955 818524 816168 812605 809423 807445 806389 806145 807543
58608H07543L711N208N097M472M750N754O378O594P462R195J0496J0105Q148N576
$$ 807543 811254 816462 821559 826031 830781 836535 842913 849507 856969 866164 876660 886765 894913 900489
58594I00489L034O58j594l749n570o367n647m034k829k613k948l451m198m910
$$ 900489 903523 904181 902587 898838 893268 886901 881254 877220 874391 871778 868830 865379 861181 856271
58580H56271m888m187l775m037m129l458k718k608k615k070j516j757k241j693
$$ 856271 851383 847196 843421 839384 835255 831797 829079 826471 823856 821786 820270 818513 816272 814579
58566H14579m9J437J864J404N89j12nJ451L770N644O249N927N604N950P086Q514
$$ 814579 814530 815967 817831 819235 819824 819712 819707 821158 824928 830572 836821 842748 848352 854302 861388 869902
58550H69902R328Q889P417N773M682M213L765K609Q95p1P60K463K909J496k1J7
$$ 869902 879230 888119 895536 901309 905991 910204 913969 916578 917473 917402 918162 920625 923534 925030 925009 925026
58534I25026J036J457J024Q01J445K518L282L426L367M179O557R566J1415J1833
$$ 925026 926062 927519 928543 929344 930789 933307 936589 940015 943382 947561 954118 963684 975099 986932
58520I86932J2311J3342J3312J1387R652J0328J2253J2574J1058J0165J1212J2939
$$ 986932 999243 1012585 1025897 1037284 1046936 1057264 1069517 1082091 1093149 1103314 1114526 1127465
58508A127465J4060J4914J6090J7407J8836K0805K3004K4321K4566K4909K6100
$$ 1127465 1141525 1156439 1172529 1189936 1208772 1229577 1252581 1276902 1301468 1326377 1352477
58497A352477K7355K7457K5976K3205J9939J7312J5619J3464R437M414M64k390
$$ 1352477 1379832 1407289 1433265 1456470 1476409 1493721 1509340 1522804 1532241 1536655 1537119 1534729
58485A534729o092j1061j5266j7564j9500k2366k4757k4961k4018k4094k5067
$$ 1534729 1528637 1517576 1502310 1484746 1465246 1442880 1418123 1393162 1369144 1345050 1319983
58474A319983k5032k3574k2216k1762k1203j9671j7751j6262j4892j2811r992
$$ 1319983 1294951 1271377 1249161 1227399 1206196 1186525 1168774 1152512 1137620 1124809 1114817
58463A114817p380n943n747n745m726k733j240j394k406k426p94J304K400K124
$$ 1114817 1107437 1101494 1095747 1090002 1085276 1082543 1081303 1079909 1077503 1075077 1074283 1075587 1077987 1080111
58449A080111R02r30l070m785n149m012k368j473j613j927j621r76q70j383j560
$$ 1080111 1081013 1080083 1077013 1072228 1067079 1063067 1060699 1059226 1057613 1055686 1054065 1053089 1052219 1050836 1049276
58434A049276p69L06N57R0J85J491L004L457L251M027O306Q574R435R716J1287
$$ 1049276 1048507 1048813 1049370 1049460 1049645 1051136 1054140 1057597 1060848 1064875 1071181 1079755 1089190 1098906 1110193
58419A110193J4217J6500J6644J5248J3699J2628J2137J2261J2328J1032Q098
$$ 1110193 1124410 1140910 1157554 1172802 1186501 1199129 1211266 1223527 1235855 1246887 1254985
58408A254985M990K952J305j173m150o437q008r610j0855j0534q725o894n659
$$ 1254985 1259975 1262927 1264232 1263059 1258909 1252472 1244464 1234854 1223999 1213465 1204740 1197846 1192187
58395A192187m072j549Q69J919J768J533J863K543L035K904K025P18m75j131j078
$$ 1192187 1188115 1186566 1187435 1189354 1191122 1192655 1194518 1197061 1200096 1203000 1205025 1205743 1205268 1204137 1203059
58380A203059m43J50n2r65j640j464o92O21K932N660O750N432M159N873R954J3073
$$ 1203059 1202616 1202766 1202714 1201749 1200109 1198645 1197953 1198574 1201506 1207166 1213916 1219348 1223507 1229380 1239334 1252407
58364A252407J3658J3357J4109J5951J7932J9174J8545J5328J0843P653O385M974
$$ 1252407 1266065 1279422 1293531 1309482 1327414 1346588 1365133 1380461 1391304 1398957 1405342 1410316
58352A410316J827k000m689o029o696o694o005n680o622p881p535n182k458j152
$$ 1410316 1412143 1410143 1405454 1399425 1392729 1386035 1380030 1374350 1367728 1359847 1352312 1347130 1344672 1343520
58338A343520j449k022j417O58L208N208O637P920Q722Q242O515M463K598P45
$$ 1343520 1342071 1340049 1338632 1339290 1342498 1347706 1354343 1362263 1370985 1379227 1385742 1390205 1392803 1393548
58324A393548q94j562j147n94o32q47l34J311L742O059P347P628Q032R192J0100
$$ 1393548 1392654 1391092 1389945 1389351 1388719 1387872 1387538 1388849 1392591 1398650 1405997 1413625 1421657 1430849 1440949
58309A440949R570Q347Q244R611J1288J2731J4365J5809J5825J4365J3016J2921
$$ 1440949 1450519 1458866 1467110 1476721 1488009 1500740 1515105 1530914 1546739 1561104 1574120 1587041
58297A587041J3868J5590J8075K0238K0376J8709J7474J7622J7347J5099J2189
$$ 1587041 1600909 1616499 1634574 1654812 1675188 1693897 1711371 1728993 1746340 1761439 1773628
58286A773628J0868J1225J1653J1358J0872J0753J1178J2412J4627J7305J9591
$$ 1773628 1784496 1795721 1807374 1818732 1829604 1840357 1851535 1863947 1878574 1895879 1915470
58275A915470K1144K2365K3881K5713K6713K5376K1960J9025J8630J9673J9563
$$ 1915470 1936614 1958979 1982860 2008573 2035286 2060662 2082622 2101647 2120277 2139950 2159513
58264B159513J7928J6571J6158J5378J3622J2141J1919J2502J3447J4977J6619
$$ 2159513 2177441 2194012 2210170 2225548 2239170 2251311 2263230 2275732 2289179 2304156 2320775
58253B320775J7229J7117J8128K0873K3833K5839K7472K9223L0414L0891L1834
$$ 2320775 2338004 2355121 2373249 2394122 2417955 2443794 2471266 2500489 2530903 2561794 2593628
58242B593628L3848L6040L7655L8943L9707L9109L7492L6324L5792L4783L3688
$$ 2593628 2627476 2663516 2701171 2740114 2779821 2818930 2856422 2892746 2928538 2963321 2997009
58231B997009L4558L7661M0691M2375M3946M6075M7510M8104M9872N3260N5753
$$ 2997009 3031567 3069228 3109919 3152294 3196240 3242315 3289825 3337929 3387801 3441061 3496814
58220C496814N6305N7914O3180P0126P5102P7373P8364P8899P9834Q2927Q8271
$$ 3496814 3553119 3611033 3674213 3744339 3819441 3896814 3975178 4054077 4133911 4216838 4305109
58209D305109R3119R5810R8513J03484J09174J13169J16465J21450J27748J33638
$$ 4305109 4398228 4494038 4592551 4696035 4805209 4918378 5034843 5156293 5284041 5417679
58199E417679J39756J47896J57497J66649J75244J84248J93199K01449K10498
$$ 5417679 5557435 5705331 5862828 6029477 6204721 6388969 6582168 6783617 6994115
58190F994115K22297K36604K52382K69940K89086L07399L23413L39391L57942
$$ 6994115 7216412 7453016 7705398 7975338 8264424 8571823 8895236 9234627 9592569
58181I592569L78186L98448M20032M44540M70023M94093N18615N47079N79480
$$ 9592569 9970755 10369203 10789235 11233775 11703798 12197891 12716506 13263585 13843065
58172A3843065O14204O52891O98545P50604Q06565Q66845R33158J003936J076536
$$ 13843065 14457269 15110160 15808705 16559309 17365874 18232719 19165877 20169813 21246349
58163B1246349J152339J234584J322950J415723J515214J624774J742185J862840
$$ 21246349 22398688 23633272 24956222 26371945 27887159 29511933 31254118 33116958
58155C3116958J988294K124766K274037K433093K601953K784519K982550L197359
$$ 33116958 35105252 37230018 39504055 41937148 44539101 47323620 50306170 53503529
58147E3503529L437880L718741M049726M434251M876432N379369N938011O547752
$$ 53503529 56941409 60660150 64709876 69144127 74020559 79399928 85337939 91885691
58139I1885691P222264P989672Q868808R863736J0982483J2239637J3634842J5157291
$$ 91885691 99107955 107097627 115966435 125830171 136812654 149052291 162687133 177844424
58131A77844424J6832346J8747056K1015554K3729195K6888062L0190252L2692334
$$ 177844424 194676770 213423826 234439380 258168575 285056637 315246889 347939223
58124C47939223L2745828K8670232J9947240P943819m637818j5212913k2446322
$$ 347939223 380685051 409355283 429302523 437246342 432608524 417395611 394949289
58117C94949289k6309797k7453442k6688674k4794099k2350565j9574300j6478917
$$ 394949289 368639492 341186050 314497376 289703277 267352712 247778412 231299495
58110B31299495j3355705j0974173j0095271j0761911j2188643j3380401j3794073
$$ 231299495 217943790 206969617 196874346 186112435 173923792 160543391 146749318
58103A46749318j3446204j2594861j1473917j0255054r073518q005493p061298
$$ 146749318 133303114 120708253 109234336 98979282 89905764 81900271 74838973
58096G4838973o232127n520660m920841m404331l945604l539935l186305k873228
$$ 74838973 68606846 63086186 58165345 53761014 49815410 46275475 43089170 40215942
58088D0215942k592543k349460k147105j974270j817929j676257j551099j438454
$$ 40215942 37623399 35273939 33126834 31152564 29334635 27658378 26107279 24668825
58080B4668825j334551j241847j161401j087222j014574r46275q85001q26871
$$ 24668825 23334274 22092427 20931026 19843804 18829230 17882955 16997954 16171083
58072A6171083p68208p11647o60190o12251n67830n32462n09025m91656m73583
$$ 16171083 15402875 14691228 14031038 13418787 12850957 12318495 11809470 11317814 10844231
58063A0844231m55219m38956m21815l99812l75038l52164l31662l11935k94478
$$ 10844231 10389012 9950056 9528241 9128429 8753391 8401227 8069565 7757630 7463152
58054G463152k81255k70067k57821k45601k35800k27007k16643k06015j98021
$$ 7463152 7181897 6911830 6654009 6408408 6172608 5945601 5728958 5522943 5324922
58045E324922j92072j85772j79390j74293j69154j62111j54795j49878j46377
$$ 5324922 5132850 4947078 4767688 4593395 4424241 4262130 4107335 3957457 3811080
58036C811080j41602j35944j31382j26869j19840j11195j04266r9484r4440q8816
$$ 3811080 3669478 3533534 3402152 3275283 3155443 3044248 2939982 2840498 2746058 2657242
58026B657242q4907q3024q0386p5320o9307o4198o0192n7156n5402n4431n3045
$$ 2657242 2572335 2489311 2408925 2333605 2264298 2200100 2139908 2082752 2027350 1972919 1919874
58015A919874n1191m9860m9032m7629m5621m4221m3642m2551m0229l7761l6355
$$ 1919874 1868683 1818823 1769791 1722162 1676541 1632320 1588678 1546127 1505898 1468137 1431782
58004A431782l5640l4191l1152k7080k3477k1386k0354j9273j8205j8185j8993
$$ 1431782 1396142 1361951 1330799 1303719 1280242 1258856 1238502 1219229 1201024 1182839 1163846
57993A163846j8975j7773j7259j8450j9487j8483j6720j6633j7861j7799j5527
$$ 1163846 1144871 1127098 1109839 1091389 1071902 1053419 1036699 1020066 1002205 984406 968879
57982I68879j2860j1622j1821j2523j2911j2423j1222j0410j0875j2141j3201
$$ 968879 956019 944397 932576 920053 907142 894719 883497 873087 862212 850071 836870
57971H36870j3819j3910j2721j0067p691p711j0061j2737j4186j4276j3561j2874
$$ 836870 823051 809141 796420 786353 778662 770951 760890 748153 733967 719691 706130 693256
57959F93256j3074j3864j3531j1158q242o736o351n602m528m174m019k484o1O13
$$ 693256 680182 666318 652787 641629 633387 626651 620300 614698 610170 605996 601977 599493 599432 600045
57945F00045j475l990m305k742j647k295l783m407l426j664o71j045j580o08J900
$$ 600045 598570 594580 590275 587533 585886 583591 579808 575401 571975 570311 569640 568595 567015 566407 568307
57930E68307M251M980M353L793M318N494N752L967R19j391k104k349l295m443
$$ 568307 572558 577538 581891 585684 590002 595496 601248 605215 606134 604743 602639 600290 596995 592552
57916E92552m849m981n932p380p802o500m233k134j073j635l316m066k178J275
$$ 592552 587703 582722 576790 569410 561608 555108 550875 548741 547668 546033 542717 538651 536473 537748
57902E37748L291K452M04m90K38J423K097K302K477K608K078M16j670k630j898
$$ 537748 541039 543491 543895 543405 543643 545066 547163 549465 551942 554550 556628 557044 555374 552744 550846
57887E50846q53j039j943j613O79L507N104N096M334L742L623L536K839J725J457
$$ 550846 549993 548954 547011 545398 546077 549584 554688 559784 564118 567860 571483 575019 577858 579583 581040
57872E81040K949N381O995P073O289N348M254K854J282l06j677k361k209k033
$$ 581040 583989 589370 596365 603438 609727 615075 619329 622183 623465 623159 621482 619121 616912 614879
57858F14879k773m157n181n780o899q701r895r474q159p408p527p564o799n640
$$ 614879 612106 607949 602768 596988 590089 581388 571493 562019 553860 546452 538925 531361 524562 518922
57844E18922m883m509l720k257j208j780l413m108l039j780k187l935n271n561
$$ 518922 514039 509530 505810 503553 502345 500565 497152 493044 490005 488225 486038 482103 476832 471271
57830D71271n670o025n770m157j797l7K77p04k060k746k489k083k339l039l401
$$ 471271 465601 459576 453806 449649 447852 447815 448092 447388 445328 442582 440093 438010 435671 432632 429231
57815D29231l278l128l161l296l705m478m963m541l848m150n395o072n247l722
$$ 429231 425953 422825 419664 416368 412663 408185 403222 398681 394833 390683 385288 379216 373969 370247
57801C70247k835k888l143k664j024J167K395J631j74q14P81L645O287Q137R252
$$ 370247 367412 364524 361381 358717 357693 358860 361255 362886 362712 361898 362679 366324 372611 380748 390000
57786C90000R548Q962P822O644N980O365P649Q334O631K630j421l422l324k395
$$ 390000 399548 408510 416332 422976 428956 435321 442970 451304 457935 460565 459144 455722 452398 450003
57772D50003j506p01J91J133J804J750J022N33J016J690J098o35j691j113m7K58
$$ 450003 448497 447796 447987 449120 450924 452674 453696 454229 455245 456935 458033 457398 455707 454594 454547 454805
57756D54805K06O01R08K02j068j746j738j686j523q85n68j792m147n933o704p688
$$ 454805 455011 455612 456520 456722 455654 453908 452170 450484 448961 448076 447508 445716 441569 435636 428932 421244
57740D21244r299j0042q790o694n544n323m774l641k789k485k030j219p17o84
$$ 421244 411945 401903 393113 386419 380875 375552 370778 367137 364348 361863 359833 358614 357897 357213
57726C57213j70J400L044L364K311R98J56j95J95J870M412O135N869M566M241
$$ 357213 357043 358443 361487 364851 367162 368160 368316 368121 368316 370186 374598 380733 386602 391168 395409
57711C95409N526O954O830N073K916J277l7j647l569n107n661n462n368n963p002
$$ 395409 400935 407889 414719 419792 422708 423985 423948 422301 418732 413625 407964 402502 397134 391171 384169
57696C84169p863q254q262p878o921n534m284l547k973j839Q6K047K748J395j404
$$ 384169 376306 368052 359790 351912 344991 339457 335173 331626 328653 326814 326900 328947 331695 333090 331686
57681C31686l781m072k376n22k25j361k272j717j96P74M15o50j441j811k294l087
$$ 331686 327905 323833 321457 320935 320710 319349 317077 315360 315164 315938 316353 315703 314262 312451 310157 307070
57665C07070l712l665k877j446M86K299K896J772j59j401j449j038r31j061r52
$$ 307070 303358 299693 296816 295370 295856 298155 301051 302823 302664 301263 299814 298776 297845 296784 295832
57650B95832m92L3L67M93N65O73O40J75o30j215j257j168j392j449m50J465L010
$$ 295832 295340 295373 295740 296233 296798 297471 298111 298286 297656 296441 295184 294016 292624 291175 290725 292190 295200
57633B95200L252K554J731J052N10L22M80L52l99q50L21L036N757P279P864Q434
$$ 295200 298452 301006 302737 303789 304299 304621 305101 305453 305054 304204 304525 307561 313318 320597 328461 336895
57617C36895R375J0641J2467J5267J8952K2840K6334K9465L2818L7067M2440M8314
$$ 336895 346270 356911 369378 384645 403597 426437 452771 482236 515054 552121 594561 642875
57605F42875N3240N5428N3327M5759L2123J3191q031k6975m0082m7070n0360n2080
$$ 642875 696115 751543 804870 850629 882752 895943 887912 860937 820855 773785 723425 671345
57593F71345n2020m8872m2823l6042l0561k6547k3023j9405j5789j2336r339p511
$$ 671345 619325 570453 527630 491588 461027 434480 411457 392052 376263 363927 354588 347077
57581C47077p174p313o488m797l784m018m028k451j71Q93L93l88o44p91j107j139
$$ 347077 339903 332590 326102 321305 317521 313503 309475 307024 306853 307746 308139 307751 307107 306316 305209 304070
57565C04070q06q53j635k504k956l426m236m689m083k944k283k241k312k377k547
$$ 304070 303264 302411 300776 298272 295316 291890 287654 282965 278882 275938 273655 271414 269102 266725 264178
57550B64178k462j827j246j352j444l31J547K250R59r13j725j604j686k302k921
$$ 264178 261716 259889 258643 257291 255847 255516 257063 259313 260272 259359 257634 256030 254344 252042 249121
57535B49121l286l639l999l955l239k161j501k081m019o156o717n044k421p41
$$ 249121 245835 242196 238197 234242 231003 228842 227341 225260 221241 215085 208368 203324 200903 200162
57521B00162n95j109j384j444j715k125k145j629j201j566k547l190k972k370
$$ 200162 199567 198458 197074 195630 193915 191790 189645 188016 186815 185249 182702 179512 176540 174170
57507A74170j958j435k83R88J192N4j388k071j823r21K86J032M34j225k312j594
$$ 174170 172212 170777 170494 171482 172674 172728 171340 169269 167446 166525 166811 167843 168277 167052 164740 163146
57491A63146L19J856K183J525M70k33K04J736L083L045J997J221J056P43P2o8
$$ 163146 163465 165321 167504 169029 169499 169266 169470 171206 174289 177334 179331 180552 181608 182351 182423 182355
57475A82355P55J462Q72l79l55J590L619L441J102j048j231k39l6j104k192k352
$$ 182355 183110 184572 185444 185065 184710 186300 189919 193360 194462 193414 192183 191944 191908 190804 188612 186260
57459A86260k021j875j657p84N58J520J429K88j221k109j962j605k173l470m191
$$ 186260 184239 182364 180707 179923 180481 182001 183430 183718 182497 180388 178426 176821 174648 171178 166987
57444A66987l968m059n347o889p379p019o769o481n193l017j355j147j869k416
$$ 166987 163019 158960 153613 146724 139345 132326 125557 119076 113883 110866 109511 108364 106495 104079
57430A04079k336k011k053k511k554j427J14K97j109j967n47J818K512J287K47
$$ 104079 101743 99732 97679 95168 92614 91187 91301 91598 90489 88522 87975 89793 92305 93592 93839
57415I3839M92R43P23O41J367J846Q74q39j485n54P42J156O52j8l85p31j652l039
$$ 93839 94331 95274 95997 96638 98005 99851 100725 99886 98401 97847 98589 99745 100397 100379 99994 99263 97611 94572
57397I4572l739k788r18J2n78j061L05K994M750M239K362R59Q44J278J129K23
$$ 94572 90833 88045 87127 87139 86561 85500 85805 88799 93549 97788 100150 101109 101953 103231 104360 104583
57381A04583m22K03J770K762K041Q2j497j543m63K75k50j282j134P99L114L828
$$ 104583 104161 104364 106134 108896 110937 111019 109522 107979 107516 107791 107541 106259 105125 105924 109038 112866
57365A12866K397j15k365l551l173j207J329K769K326Q09l97n98R7J202K015J876
$$ 112866 115263 115148 112783 109232 106059 104852 106181 108950 111276 112085 111688 111090 111187 112389 114404 116280
57349A16280P98m20j017r51n65l4M90O47K96r4P6P61J375J573J488J390J503K128
$$ 116280 117078 116658 115641 114690 114125 114091 114581 115228 115524 115430 115506 116267 117642 119215 120703 122093 123596 125724
57331A25724L406M789N129L784J478k50m46O21K189L798N163N773N310M263L422
$$ 125724 129130 133919 139048 142832 144310 144060 143614 144235 146424 150222 155385 161158 166468 170731 174153
57316A74153K789J794O24M29J633K953K999K162J898K441K486J244l09p13J57
$$ 174153 176942 178736 179360 179789 181422 184375 187374 189536 191434 193875 196361 197605 197296 196583 196740
57301A96740J232J740J892K215K745L108L089K850K599K302J847J310R07Q54J468
$$ 196740 197972 199712 201604 203819 206564 209672 212761 215611 218210 220512 222359 223669 224576 225430 226898
57286B26898L025N108O464O213M925L716K619J055l13L9J848K633J020j116j251
$$ 226898 229923 235031 241495 247708 252633 256349 258968 260023 259710 259749 261597 264230 265250 264134 262883
57271B62883L91J780K296K921L904M460M752N922P750Q255O402L735K508L311
$$ 262883 263274 265054 267350 270271 274175 278635 283387 289309 297059 305314 311716 315451 317959 321270
57257C21270N212P136Q339Q455P784O998O175M942L742L759N126O318O163N451
$$ 321270 326482 333618 341957 350412 358196 365194 371369 376311 380053 383812 388938 395256 401419 406870
57243D06870N646O799P798Q052P870P500O836O128O117P258R220J1202J2526J2930
$$ 406870 412516 419315 427113 435165 443035 450535 457371 463499 469616 476874 486094 497296 509822 522752
57229E22752J2596J2006J1672J1902J2625J3355J3562J3284J3082J3064J2485
$$ 522752 535348 547354 559026 570928 583553 596908 610470 623754 636836 649900 662385
57218F62385J0845R046Q522R472J0775J1577J2042J2524J3054J3911J5785J8873
$$ 662385 673230 682276 690798 700270 711045 722622 734664 747188 760242 774153 789938 808811
57206H08811K2323K4921K6098K6217K6190K6629K7037K6363K4753K3875K4530
$$ 808811 831134 856055 882153 908370 934560 961189 988226 1014589 1039342 1063217 1087747
57195A087747K4961K3225K0441J9595K1310K3154K3349K2722K2294K1432J9748
$$ 1087747 1112708 1135933 1156374 1175969 1197279 1220433 1243782 1266504 1288798 1310230 1329978
57184A329978J8641J9110J9645J8285J5593J3643J2907J2205J1173J0861J1956
$$ 1329978 1348619 1367729 1387374 1405659 1421252 1434895 1447802 1460007 1471180 1482041 1493997
57173A493997J4032J6579J9398K1913K3399K4110K5169K7105K9319L1030L2008
$$ 1493997 1508029 1524608 1544006 1565919 1589318 1613428 1638597 1665702 1695021 1726051 1758059
57162A758059L2337L2206L2058L2382L3251L4350L5247L5301L3895L1372K9215
$$ 1758059 1790396 1822602 1854660 1887042 1920293 1954643 1989890 2025191 2059086 2090458 2119673
57151B119673K8382K7866K5871K2097J7873J4229J1068Q338O885P509R780J2334
$$ 2119673 2148055 2175921 2201792 2223889 2241762 2255991 2267059 2275397 2282282 2289791 2299571 2311905
57139B311905J3994J4492J4434J4775J6112J8265K0645K2823K4526K5369K5012
$$ 2311905 2325899 2340391 2354825 2369600 2385712 2403977 2424622 2447445 2471971 2497340 2522352
57128B522352K3601K1644J9546J7477J5532J3641J1513R111P050O011N761N207
$$ 2522352 2545953 2567597 2587143 2604620 2620152 2633793 2645306 2654417 2661467 2667478 2673239 2678446
57116B678446L633J549J08j75J72L28J36K6J89J97m14j744l980p630j2690j7983
$$ 2678446 2682079 2683628 2683736 2683561 2683733 2684061 2684197 2684223 2684412 2684609 2684195 2682451 2678471 2670841 2658151 2640168
57100B640168k2174k5331k8687l2966l7780m2550m7114n1353n5078n8448o1701
$$ 2640168 2617994 2592663 2563976 2531010 2493230 2450680 2403566 2352213 2297135 2238687 2176986
57089B176986o4399o5827o6111o6008o5534o4097o2197o1771o4261o9358p6207
$$ 2176986 2112587 2046760 1980649 1914641 1849107 1785010 1722813 1661042 1596781 1527423 1451216
57078A451216q4839r5792j09206j24878j42388j60637j78147j94437A50481g6508
$$ 1451216 1366377 1270585 1161379 1036501 894113 733476 555329 360892 150481 -76508
57067c20586k61078k77677k93897l10481l29461l53209l82604m17261m57469n04360
$$ -320586 -581664 -859341 -1153238 -1463719 -1793180 -2146389 -2528993 -2946254 -3403723 -3908083
57057c908083n57951o17092o82011p55039q38023r30779j033113j146446j272409
$$ -3908083 -4466034 -5083126 -5765137 -6520176 -7358199 -8288978 -9322091 -10468537 -11740946
57048a1740946j411684j565499j736362j926048k135021k365779k625401k923918
$$ -11740946 -13152630 -14718129 -16454491 -18380539 -20515560 -22881339 -25506740 -28430658
57040b8430658l272562l685385m179527m770165n465326o266635p172568q178425
$$ -28430658 -31703220 -35388605 -39568132 -44338297 -49803623 -56070258 -63242826 -71421251
57032g1421251r275268j0451389j1691624j2969566j4240341j5447257j6543762
$$ -71421251 -80696519 -91147908 -102839532 -115809098 -130049439 -145496696 -162040458
57025a62040458j7517123j8391904j9189293j9837241k0080744j9488550j7612776
$$ -162040458 -179557581 -197949485 -217138778 -236976019 -257056763 -276545313 -294158089
57018b94158089j4230155r500249l927352J835856P204097J1782778J5380673
$$ -294158089 -308388244 -317888493 -321815845 -319979989 -312775892 -300993114 -285612441
57011b85612441J7958947J9570534K0319570K0342506J9796237J8842161J7629262
$$ -285612441 -267653494 -248082960 -227763390 -207420884 -187624647 -168782486 -151153224
57004a51153224J6284088J4906687J3566701J2301158J1120120J0019269Q990999
$$ -151153224 -134869136 -119962449 -106395748 -94094590 -82974470 -72955201 -63964202
56997f3964202Q029497P132468O301989N543264M861079M256686L727125L266360
$$ -63964202 -55934705 -48802237 -42500248 -36956984 -32095905 -27839219 -24112094 -20845734
56989b0845734K867118K522491K225891J969548J744415J542944J361648J200072
$$ -20845734 -17978616 -15456125 -13230234 -11260686 -9516271 -7973327 -6611679 -5411607
56981e411607J057895R33920Q26997P36148O59657N95076f1798D30944M50739
$$ -5411607 -4353712 -3419792 -2592795 -1856647 -1196990 -601914 -61798 430944 881683
56972H81683M12055L75870L42590L13037K87817K67020K49820K34823K21287K09540
$$ 881683 1293738 1669608 2012198 2325235 2613052 2880072 3129892 3364715 3586002 3795542
56962C795542J99783J91227J83109J76116J72423J74822J85296K01870K15421
$$ 3795542 3995325 4186552 4369661 4545777 4718200 4893022 5078318 5280188 5495609
56953E495609K12011J82114J28644O5153O258l9824p1710r1714j03257j09263
$$ 5495609 5707620 5889734 6018378 6083531 6089789 6049965 5978255 5886541 5783284 5674021
56943E674021j11307j10287j07687j05250j03530j01942j00416r9867j00909j03285
$$ 5674021 5562714 5452427 5344740 5239490 5135960 5034018 4933602 4833735 4732826 4629541
56933D629541j06866j12123j19154j27125j35038j42194j47674j50509j51034
$$ 4629541 4522675 4410552 4291398 4164273 4029235 3887041 3739367 3588858 3437824
56924C437824j51132j52329j54337j56092j57533j59313j61168j61693j59913
$$ 3437824 3286692 3134363 2980026 2823934 2666401 2507088 2345920 2184227 2024314
56915B024314j56297j51835j46588j39695j30806j20977j11785j03686r5826q7506
$$ 2024314 1868017 1716182 1569594 1429899 1299093 1178116 1066331 962645 866819 779313
56905G79313p9186p1619o4627n7475n0156m3364l7367l1840k6909k3240k0739
$$ 779313 700127 628508 563881 506406 456250 412886 375519 343679 316770 293530 272791
56894B72791j8183j5121j3269j4658j8553k1611k1693k0356k0505k2199k2325
$$ 272791 254608 239487 226218 211560 193007 171396 149703 129347 108842 86643 64318
56883F4318j8719j3260r788r619B629f097m390P91d821B670R582J2178J5477J8616
$$ 64318 45599 32339 22551 12932 2629 -6097 -10487 -9696 -4821 2670 12252 24430 39907 58523
56869E8523K0346J9978J7560J3306P333J54p033j2881j6548j7848j7180j5447
$$ 58523 78869 98847 116407 129713 137046 137200 130167 117286 100738 82890 65710 50263
56857E0263j3570j1948j0648D099f064j0146q381m927j981j315j970j566O21L061
$$ 50263 36693 24745 14097 4099 -6064 -16210 -24591 -29518 -31499 -32814 -34784 -36350 -35729 -32668
56843c2668M158L792K724J714J600L145O077f32I256R286Q398Q536R863J1524
$$ -32668 -28510 -24718 -21994 -20280 -18680 -15535 -9458 -632 9256 18542 26940 35476 45339 56863
56829E6863J2580J2908J3187J3939J4778J4970J4430J3587J2342J0004O526L090
$$ 56863 69443 82351 95538 109477 124255 139225 153655 167242 179584 189588 196114 199204
56817A99204R51K75O30J950M144O057O161M672L976O240J0981J5734J8751K0330
$$ 199204 200155 200430 201060 203010 207154 213211 219372 224044 228020 234260 245241 260975 279726 300056
56803C00056K1797K4168K7874L2734L7519M0268L9667L5834K9424K0743J0431
$$ 300056 321853 346021 373895 406629 444148 484416 524083 559917 589341 610084 620515
56792F20515L66p343j2128j4830j5877j4795j1692q007n022k327J394O432J1645
$$ 620515 620881 613538 601410 586580 570703 555908 544216 536209 531187 528860 530254 536686 548331
56779E48331J5839J9070K2427K6896L2526L8616M4382M9042N1121M8429L9602
$$ 548331 564170 583240 605667 632563 665089 703705 748087 797129 848250 896679 936281
56768I36281K5586R110p185k1509l2431l8994m1636m1849m0516l7473l2937k8074
$$ 936281 961867 970977 963792 942283 909852 870858 829222 787373 746857 709384 676447 648373
56756F48373k3408j8016j1377m988n88K552O838J3021J9330K4130K7794L0991
$$ 648373 624965 606949 595572 590584 589996 592548 599386 612407 631737 655867 683661 714652
56744G14652L2397K9481K1246R212m077j6605k7007l4168l7485l7271l4535l0440
$$ 714652 747049 776530 797776 806988 802911 786306 759299 725131 687646 650375 615840 585400
56732E85400k6135k2636k0233j7981j4528r712m964j702K51K250N016P990J0394
$$ 585400 559265 536629 516396 498415 483887 474175 469211 467509 467760 470010 475026 483016 493410
56719D93410J2207J3555J3520J0332L184o246j4679j9949k2560k4205k5348k5228
$$ 493410 505617 519172 532692 543024 546208 539962 525283 505334 482774 458569 433221 407993
56707D07993k3889k2631k2053k1124j9107j7023j5978j5231j3498j1319j0222
$$ 407993 384104 361473 339420 318296 299189 282166 266188 250957 237459 226140 215918
56696B15918j0118r424p659o012n281n057n097n608n931m871k867j867k296k191
$$ 215918 205800 196376 188717 182705 177424 172367 167270 161662 155731 150860 147993 146126 143830 141639
56682A41639l46J583J568Q2j077j497j884k202j864j155q81j004r54p64p49o03
$$ 141639 141293 142876 144444 144526 143449 141952 140068 137866 136002 134847 133966 132962 132008 131244 130495 129892
56666A29892MN76O19O12R16P22n79j817j535k65M63P31J662K681J875o82k351
$$ 129892 129896 130472 131091 131703 132619 133341 132762 130945 129410 129145 129608 130339 132001 134682 136557 135875 133524
56649A33524j499L46R31K47j86K57R30J205R91M07j82j83M97J037N59q61k371
$$ 133524 132025 132371 133302 133549 133363 133620 134550 135755 136746 137153 136971 136788 137285 138322 138881 138020 135649
56632A35649l224l164k338j152N1J289K617L557L413K326J442J659K706L619L781
$$ 135649 132425 129261 126923 125771 125822 127111 129728 133285 136698 139024 140466 142125 144831 148450 152231
56617A52231L240K460K059K415L308M084M188L351J545o98k146j829k35J250K176
$$ 152231 155471 157931 159990 162405 165713 169797 173985 177336 178881 178183 176037 174208 173973 175223 177399
56602A77399L357N034N805M368J662Q7O82K130K751K512K409K530J813k33k503
$$ 177399 180756 185790 191595 195963 197625 197712 198394 200524 203275 205787 208196 210726 212539 212306 209803
56587B09803l594l533l441l782l823l024k023j766k237k636k463j934j459j190
$$ 209803 206209 202676 199235 195453 191630 188606 186583 184817 182580 179944 177481 175547 174088 172898
56573A72898r59m91K02O12K83m39o96k29N16J335K400L192K623Q96r1P78K110
$$ 172898 171939 171448 171650 172262 172545 172106 171410 171181 171697 173032 175432 178624 181247 182143 182052 182830 184940
56556A84940K102J280J387K256J963Mj761j856j066p54q80p45n79j162k409l363
$$ 184940 187042 188322 189709 191965 193928 193932 192171 190315 189249 188495 187615 186870 186291 185129 182720 179357
56540A79357l320k382j186n30p92j272n74J727M195M970L826K147J045L63l28
$$ 179357 176037 173655 172469 171939 171147 169875 169301 171028 175223 180193 184019 186166 187211 187574 187246
56525A87246n90K26J621K229J733J543K820M530M737L553L123M294N150L947J982
$$ 187246 186656 186882 188503 190732 192465 194008 196828 201358 206095 209648 212771 217065 222215 226162 228144
56510B28144J653K824L314K554K325L526M651M479M275N744Q152R399R149R063
$$ 228144 229797 232621 235935 238489 240814 244340 248991 253470 257745 263489 271641 281040 290189 299252
56496B99252J0040J0994J0704R467Q284P383O441N659N556N878N615M346K936
$$ 299252 309292 320286 330990 340457 348741 356124 362565 368224 373780 379658 385273 389619 392555
56483C92555K472K927L319K864J485m95k487l630l492k922l428n344p221p495
$$ 392555 395027 397954 401273 404137 405622 405127 402640 399010 395518 392596 389168 383824 376603 369108
56469C69108o234m894m764n965p498p937o662m663l568l650l648k824k054k186
$$ 369108 362874 357980 353216 347251 339753 331816 325154 320491 316923 313273 309625 306801 304747 302561
56455C02561k599k468k402l340m684n016m233l399k836j953p85r0N3K74M72q9
$$ 302561 299962 297494 295092 291752 287068 282052 277819 274420 271584 269631 268846 268756 268809 269083 269555 269466
56439B69466j050j022K27J226J117Q61J293J430M3k197l479l124j939q16r6J4
$$ 269466 268416 267394 267621 268847 269964 270825 272118 273548 273591 271394 267915 264791 262852 262036 261940 261954
56423B61954m82r22n37M56R80M90k96k05J054K475K638J169o48j074J31J419J483
$$ 261954 261472 260550 260013 260469 261449 261939 261643 261438 262492 264967 267605 268774 268126 267052 267183 268602 270085
56406B70085J006J695L769N331M620K255N47P84K019K682K566K526K812K843K377
$$ 270085 271091 272786 276555 281886 286506 288761 289308 290092 292111 294793 297359 299885 302697 305540 307917
56391C07917J876J482Q06l1k99j06o08j969k400n79K059K998J972Q69Q12J085
$$ 307917 309793 311275 312081 312050 311751 311645 311037 309068 306668 306089 308148 311146 313118 313987 314799 315884
56375C15884R25O42N74M46K14M02J073J374O42p43j865k051j217r3O6j035j845
$$ 315884 316809 317451 318025 318471 318685 319087 320160 321534 322176 321433 319568 317517 316300 316207 316273 315238 313393
56358C13393p92J300K126J194M59J251K397K262J101K24pq7r7J56K66l99j577
$$ 313393 312601 313901 316027 317221 317680 318931 321328 323590 324691 324915 324908 324821 324724 324880 325146 324747 323170
56341C23170k253j865q22J22O06Q24J225J912K390K128J338P32N97O70Q04J099
$$ 323170 320917 319052 318230 318352 318958 319782 321007 322919 325309 327437 328775 329507 330104 330774 331578 332677
56325C32677J465J738K179L092L996M168L961M486N837O755O452N670N468N777
$$ 332677 334142 335880 338059 341151 345147 349315 353276 357762 363599 370354 376806 382476 387944 393721
56311C93721N783N009L476J462m78j688k012j870j713j768k161k668k594j708
$$ 393721 399504 404513 407989 409451 408973 407285 405273 403403 401690 399922 397761 395093 392499 390791
56297C90791q52p52o94L07J547J490L47j57L62M71k98n47L33Q44J5o72L38K043
$$ 390791 389939 389187 388493 388800 390347 391837 392184 392027 392389 392860 392562 392015 392348 393192 393207 392535 392873 394916
56279C94916K482J621Q13M36J4q9Q52K187K501J872J776K655L167K255Q33O35
$$ 394916 397398 399019 399832 400268 400282 400193 401045 403232 405733 407605 409381 412036 415203 417458 418291 418926
56263D18926K170M258N337M908L705K564J476K24l88Q49L411M814L308K7k345
$$ 418926 421096 425354 430691 435599 439304 441868 443344 443568 443180 444029 447440 452254 455562 455589 453244
56248D53244k334n63J324J882Q19m38J22K580M546L968J698K25O31J986L090L508
$$ 453244 450910 450347 451671 453553 454372 453934 454056 456636 461182 465150 466848 467073 467704 469690 472780 476288
56232D76288L309K901K993L772M421M188L388K571J471k4p02N68K712L524K778
$$ 476288 479597 482498 485491 489263 493684 497872 501260 503831 505302 505278 504576 505144 507856 511380 514158
56217E14158K518L892N482N570M631M357N061N439M740L879M016M800M826L714
$$ 514158 516676 520568 526050 531620 536251 540608 545669 551108 555848 559727 563743 568543 573369 577083
56203E77083K956M187P055R623J0737J1142J1925J2817J2758J1628J0535J0576
$$ 577083 580039 584226 591281 600904 611641 622783 634708 647525 660283 671911 682446 693022
56191F93022J1839J3613J5093J5933J6428J7157J8462K0352K2711K5100K6453
$$ 693022 704861 718474 733567 749500 765928 783085 801547 821899 844610 869710 896163
56180H96163K5851K3878K2376K2275K2357K0802J7420J3612J0587Q372O342L883
$$ 896163 922014 945892 968268 990543 1012900 1033702 1051122 1064734 1075321 1083693 1090035 1093918
56168A093918N81l488p399r823j0314r965j0516j2615j5158j6488j6199j5379
$$ 1093918 1094499 1091011 1083612 1073789 1063475 1053510 1042994 1030379 1015221 998733 982534 967155
56156I67155j5180j5684j6299j6460j5611j3323j0221p979p538p866p433o183
$$ 967155 951975 936291 919992 903532 887921 874598 864377 856398 848860 840994 833561 827378
56144H27378n012m053k920k018j966k078j108O01J508J231Q19O50N7p74n73Q10
$$ 827378 822366 818313 815393 813375 811409 809331 808223 808824 810332 811563 812382 813032 813089 812315 811742 812552
56128H12552J876J947K279L873N749O460N912M790L476K418K295L030L617L646
$$ 812552 814428 816375 818654 822527 828276 834736 840648 845438 848914 851332 853627 856657 860274 863920
56114H63920L787M333M703M958O195Q591J0567J0870J0217J0007J0633J1829J3362
$$ 863920 867707 872040 876743 881701 887896 896487 907054 917924 928141 938148 948781 960610 973972
56101I73972J4598J4670J3889J3768J4998J6694J8150J9742K1589K3008K4047
$$ 973972 988570 1003240 1017129 1030897 1045895 1062589 1080739 1100481 1122070 1145078 1169125
56090A169125K5775K8313L0411L1722L3581L6562L9433M1648M4704M9622N5173
$$ 1169125 1194900 1223213 1253624 1285346 1318927 1355489 1394922 1436570 1481274 1530896 1586069
56079A586069O0249O6006P3932Q3427R3105J02857J12968J22620J30883J37665
$$ 1586069 1646318 1712324 1786256 1869683 1962788 2065645 2178613 2301233 2432116 2569781
56069B569781J42147J41872J35300J24032J11157R8680Q7705P9212P2815O6118
$$ 2569781 2711928 2853800 2989100 3113132 3224289 3322969 3410674 3489886 3562701 3628819
56059C628819N6831M4326K8419Q997j1653k8691l9133m4699m8684n2341n6363
$$ 3628819 3685650 3729976 3758395 3767392 3755739 3727048 3687915 3643216 3594532 3542191 3485828
56048C485828o3173p4618q8919j02514j13489j20930j23006j18669j10048j00343
$$ 3485828 3422655 3348037 3259118 3156604 3043115 2922185 2799179 2680510 2570462 2470119
56038B470119r0395p9642o8919n9660n1601m3847l7057l2079k7639k2059j6145
$$ 2470119 2379724 2300082 2231163 2171503 2119902 2076055 2038998 2006919 1979280 1957221 1941076
56027A941076j1873r269o968m821l424k225m60J053J463K008M252P354R450J0599
$$ 1941076 1929203 1919934 1912966 1908145 1904721 1902496 1902036 1903089 1904552 1906560 1910812 1918166 1927616 1938215
56013A938215J2093J4031J5820J7777K0212K2341K4019K6660L0390L2601L1746
$$ 1938215 1950308 1964339 1980159 1997936 2018148 2040489 2064508 2091168 2121558 2154159 2185905
56002B185905L0175L0555L2012L2754L3708L6033L7732L6723L5069L5960L8532
$$ 2185905 2216080 2246635 2278647 2311401 2345109 2381142 2418874 2455597 2490666 2526626 2565158
55991B565158L9806L9791M0372M1092M0574M0384M2752M5925M6704M6249M8402
$$ 2565158 2604964 2644755 2685127 2726219 2766793 2807177 2849929 2895854 2942558 2988807 3037209
55980C037209N3291N7543O0081O2707O5570O7050O7798P0138P3585P5589P6430
$$ 3037209 3090500 3148043 3208124 3270831 3336401 3403451 3471249 3541387 3614972 3690561 3766991
55969C766991P8852Q2994Q6214Q7910R0207R3962R8107J02766J09045J16239J23064
$$ 3766991 3845843 3928837 4015051 4102961 4193168 4287130 4385237 4488003 4597048 4713287 4836351
55958D836351J30819J41276J52536J61411J68894J78790J91970K06515K22266
$$ 4836351 4967170 5108446 5260982 5422393 5591287 5770077 5962047 6168562 6390828
55949F390828K40361K59393K76972K93764L11303L27473L39634L50574L65576
$$ 6390828 6631189 6890582 7167554 7461318 7772621 8100094 8439728 8790302 9155878
55940I155878L85028M05405M25945M48281M71494M93919N18323N48731N83835
$$ 9155878 9540906 9946311 10372256 10820537 11292031 11785950 12304273 12853004 13436839
55931A3436839O20084O59218P05651P58496Q13647Q71662R35784J004426J074002
$$ 13436839 14056923 14716141 15421792 16180288 16993935 17865597 18801381 19805807 20879809
55922B0879809J147097J229265J319883J414981J516379J628690J750045J875861
$$ 20879809 22026906 23256171 24576054 25991035 27507414 29136104 30886149 32762010
55914C2762010K008786K154522K311347K475122K650755K846736L063568L301809
$$ 32762010 34770796 36925318 39236665 41711787 44362542 47209278 50272846 53574655
55906E3574655L576306L906111M294533M735591N234122N800472O432459P126394
$$ 53574655 57150961 61057072 65351605 70087196 75321318 81121790 87554249 94680643
55898I4680643P900973Q785506R790627J0919646J2203194J3690323J5412635
$$ 94680643 102581616 111367122 121157749 132077395 144280589 157970912 173383547
55891A73383547J7395069J9689311K2338926K5301900K8425507L1396981L3516017
$$ 173383547 190778616 210467927 232806853 258108753 286534260 317931241 351447258
55884C51447258L3489187K9776365K1595470R805375l268681j5028395k3796001
$$ 351447258 384936445 414712810 436308280 446113655 442844974 427816579 404020578
55877D04020578k9155940l1545357l1720385l0448337k8367169k5917650k3362606
$$ 404020578 374864638 343319281 311598896 281150559 252783390 226865740 203503134
55870B03503134k0865356j8533914j6414950j4504385j2788998j1265242r923763
$$ 203503134 182637778 164103864 147688914 133184529 120395531 109130289 99206526
55863I9206526q744749p713732o822515o053320n380748m790934m282309l847172
$$ 99206526 90461777 82748045 75925530 69872210 64491462 59700528 55418219 51571047
55855E1571047l468482l135479k847363k600354k384512k194116k028811j883637
$$ 51571047 48102565 44967086 42119723 39519369 37134857 34940741 32911930 31028293
55847C1028293j749381j623181j508215j403124j302276j206194j121204j048252
$$ 31028293 29278912 27655731 26147516 24744392 23442116 22235922 21114718 20066466
55839B0066466r81538r18201q60186q06637p53639p01774o55339o13881n72592
$$ 20066466 19084928 18166727 17306541 16499904 15746265 15044491 14389152 13775271 13202679
55830A3202679n31170m94246m62917m33405m04091l76549l49879l21398k92705
$$ 13202679 12671509 12177263 11714346 11280941 10876850 10500301 10150422 9829024 9536319
55821I536319k67760k45179k19766j91460j65483j43854j24490j08957j03111
$$ 9536319 9268559 9023380 8803614 8612154 8446671 8302817 8178327 8069370 7966259
55812G966259j08722j21572j39184j63660j94816k26556k52361k69754k78389
$$ 7966259 7857537 7735965 7596781 7433121 7238305 7011749 6759388 6489634 6211245
55803F211245k78725k73646k66699k57821k44898k29509k16137k05651j94630
$$ 6211245 5932520 5658874 5392175 5134354 4889456 4659947 4443810 4238159 4043529
55794D043529j81608j68941j58064j47843j38165j30418j23752j15464j05789
$$ 4043529 3861921 3692980 3534916 3387073 3248908 3118490 2994738 2879274 2773485
55785B773485r7899r2778q8298q3517p9441p5412o9306o1685n5406n0918m6342
$$ 2773485 2675586 2582808 2494510 2410993 2331552 2256140 2186834 2125149 2069743 2018825 1972483
55774A972483m2050m0461m1182m1152l9836l9524m0296l9731l7841l7186l7588
$$ 1972483 1930433 1889972 1848790 1807638 1767802 1728278 1687982 1648251 1610410 1573224 1535636
55763A535636l6082l2778l1251l2076l1401k7681k4410k4243k5184k4787k3638
$$ 1535636 1499554 1466776 1435525 1403449 1372048 1344367 1319957 1295714 1270530 1245743 1222105
55752A222105k2483k0191j6800j4622j4240j3194j0488q455q381q288p148o989
$$ 1222105 1199622 1179431 1162631 1148009 1133769 1120575 1110087 1101632 1093251 1084963 1077815 1070826
55740A070826q462q485n236j740j317k673k806j955k324m069n721o939q177r031
$$ 1070826 1062364 1053879 1048643 1046903 1045586 1042913 1040107 1038152 1035828 1031759 1026038 1019099 1010922 1001891
55726A001891r090r192j0056j1065j1787j3000j4995j6670j7609j9008k1257k2618
$$ 1001891 992801 983609 973553 962488 950701 937701 922706 906036 888427 869419 848162 825544
55714H25544k1729j9532j7414j5394j3259j1502r931p386m051j983k159l163l884
$$ 825544 803815 784283 766869 751475 738216 726714 716783 709397 705346 703363 701204 698041 694157
55701F94157n177p386q734p963o618o838q374r453r257q276p353p254p983q091
$$ 694157 688980 681594 672860 664897 658279 651441 643067 633614 624357 616081 608728 601474 593491 585400
55687E85400o304m005l986o461q825r598r802r838q398n642m166n026n816m684
$$ 585400 579096 575091 571105 564644 555819 546221 536419 526581 518183 512541 508375 503349 497533 492849
55673D92849l369m033n683o201n700n374m952l786k830l202m168m617n070o174
$$ 492849 489480 485447 479764 473563 467863 462489 457537 453751 450921 447719 443551 438934 433864 427690
55659D27690o714n324k985j802k255l358m406m951m265k431q06l7R88K826L807
$$ 427690 420976 415652 412667 410865 408610 405252 400846 395895 391630 389199 388393 388356 389344 392170 395977
55644C95977K462K4j418j849k443l094k990k629l138m308n150n705o588p360p047
$$ 395977 398439 398463 397045 395196 392753 389659 386669 384040 380902 376594 371444 365739 359151 351791 344744
55629C44744n747m471l794l702l963l887k771j386j487k970l294j069J701K691
$$ 344744 338997 334526 330732 327030 323067 319180 316409 315023 313536 310566 307272 306203 307904 310595
55615C10595K685L698N235M945K078j864n282p313p390n892m585m556m475k673
$$ 310595 313280 316978 322213 327158 329236 327372 322090 314777 307387 301495 296910 292354 287879 285206
55601B85206j9J321J121R16J153Q46k18j037j098p76k0J610L634M969N391N378
$$ 285206 285187 286508 287629 288545 289698 290544 290326 289289 288191 287415 287395 289005 292639 297608 302999 308377
55585C08377M845L606K574K745L214K069p89l446m726n297n947o470o780p550
$$ 308377 313222 316828 319402 322147 325361 327430 326641 323195 318469 313172 307225 300755 293975 286425
55571B86425r072j0503j0764r443o712l381r81o87j841k591k128j368j290j662
$$ 286425 277353 266850 256086 246643 239931 236550 235569 234882 233041 230450 228322 226954 225664 224002
55557B24002j783j619j614j908k156j921j196o56j115k405l260k828j820j447
$$ 224002 222219 220600 218986 217078 214922 213001 211805 211149 210034 207629 204369 201541 199721 198274
55543A98274j727j733j226j005j629k602l016k498j481q48j123j813j800p49M06
$$ 198274 196547 194814 193588 192583 190954 188352 185336 182838 181357 180509 179386 177573 175773 175024 175430
55528A75430P00L21J44O21J611K712L292K865J963J956L331M872N096L818J680
$$ 175430 176130 176451 176595 177216 178827 181539 184831 187696 189659 191615 194946 199818 204914 208732 210412
55513B10412q16k930l373j569J298L571M889N791O252N830M752L661K653J533
$$ 210412 209596 206666 203293 201724 203022 206593 211482 217273 223525 229355 234107 237768 240421 241954
55499B41954N73l7j007l025n334o490o331o093o596p346p467o621n024l256k037
$$ 241954 242527 242490 241483 238458 233124 226634 220303 214210 207614 200268 192801 186180 181156 177900 175863
55484A75863j594j384r71p83j423k562l309l325l007k851l093l601l705k770j292
$$ 175863 174269 172885 171914 171131 169708 167146 163837 160512 157505 154654 151561 147960 144255 141485 140193
55469A40193n27n75j35J127J484k37k342k414q19%r19k274k935l096k944k088
$$ 140193 139666 139091 138956 140083 141567 141330 138988 136574 135755 135755 134836 132562 129627 126531 123587 121499
55453A21499o53O11J586K710L641L563K876K779K919J521j427l161j585J796L915
$$ 121499 120846 121457 123043 125753 129394 132957 135833 138612 141531 143052 141625 138464 136879 138675 142590
55438A42590L854K929J992O10j256k579k774k678l234l931l424j437O61J317L50
$$ 142590 146444 149373 151365 151975 150719 148140 145366 142688 139454 135523 132099 130662 131323 132640 132990
55423A32990j183k225k393j687k30J486K687K943K459J604N34n69j346j589j379
$$ 132990 131807 129582 127189 125502 125272 126758 129445 132388 134847 136451 136985 136416 135070 133481 132102
55408A32102p91J3L75l69j742k251j203L43R31L60o11j417j825j560o20L53P21
$$ 132102 131311 131324 131699 131330 129588 127337 126134 126477 127408 127768 127157 125740 123915 122355 121735 122088 122809
55391A22809N26J28k72l60K39J137J265M45j00L12M47j002l072l570j953K71J737
$$ 122809 123335 123463 123191 122831 123070 124207 125472 125917 125817 126129 126576 125574 122502 118932 116979 117250 118987
55374A18987K361K384J806J103J233K339L234K712R83n46p84q6J75o01j173M4
$$ 118987 121348 123732 125538 126641 127874 130213 133447 136159 137142 136596 135812 135726 135901 135300 134127 134171
55358A34171K511L810K732Q07qK08L47L83Q98J506J375Q32P53Q01j03j849l148
$$ 134171 136682 140492 143224 144031 144023 144231 144578 144961 145859 147365 148740 149572 150325 151126 151023 149174 146026
55341A46026l363k961k306j423q16j117j915k204j861j406o16J058K788K915J466
$$ 146026 142663 139702 137396 135973 135157 134040 132125 129921 128060 126654 126038 127096 129884 132799 134265
55326A34265M57J030J825J051r41k234j923j150j534l033l820k521k02Q80M69
$$ 134265 134722 135752 137577 138628 137687 135453 133530 132380 130846 127813 123993 121472 121270 122150 122619
55311A22619P07K650M247L311R93J40J225K268K168J657J109r1j773k723k594
$$ 122619 123326 125976 130223 133534 134527 134667 135892 138160 140328 141985 143094 143003 141230 138507 135913
55296A35913k141j454L7J593J583L03rJ245J879N05j121r75Q9Jj204j819j268
$$ 135913 133772 132318 132355 133948 135531 135834 135825 137070 138949 139454 138333 137358 137447 137448 136244 134425 133157
55279A33157o02o64j316k121k620k189p14R21J748J810J730J609J097J12j034
$$ 133157 132555 131891 130575 128454 125834 123645 122931 123852 125600 127410 129140 130749 131846 131958 130924
55264A30924j976k452k443k316k278j789l23J407K088J726J670K616L871M730
$$ 130924 128948 126496 124053 121737 119459 117670 117347 118754 120842 122568 124238 126854 130725 135455
55250A35455N098M504K287o61k163j563n52m61n37m5L5j094k174j821p66l46j54
$$ 135455 140553 145057 147344 146683 144520 142957 142405 141944 141407 141362 141397 140303 138129 136308 135542 135196 135042
55233A35042O93J276K57j386j498j62M99k39r52q33q31j468j675p49K65J26q41
$$ 135042 135735 137011 137268 135882 134384 134222 134721 134482 133530 132697 131866 130398 128723 127974 128239 128365 127524
55216A27524j529j488p86O08K365L403K880J372M00Q95K386L509L292K094J187
$$ 127524 125995 124507 123721 124329 126694 130097 132977 134349 134749 135644 138030 141539 144831 146925 148112
55201A48112J105Q97m15k120k638j856j302j845k471j972p20J04L50Q78J920K443
$$ 148112 149217 150114 149699 147579 144941 143085 141783 139938 137467 135495 134775 134879 135229 136107 138027 140470
55185A40470J441o58k190j876j60J206R72k77r85o41l91j354k890l237j794JM27
$$ 140470 141911 141253 139063 137187 137027 138233 139205 138928 137943 137302 136911 135557 132667 129430 127636 127637 128064
55168A28064m16r60l94M36N42K97N80J126R40P6l28P3K21m53p51P08L284M795
$$ 128064 127648 126688 126294 126730 127272 127569 128149 129275 130215 130291 129963 130036 130257 129804 129053 129761 133045 137840
55150A37840L936J428j060k372k332j484n54O8L63L36K2o7Q18K477L433K491K93
$$ 137840 141776 143204 142144 139772 137440 135956 135402 135470 135833 136169 136191 136124 136942 139419 142852 145343 145636
55133A45636j387j674j276j216j572j662j034O9J133J971K615K576R30k143m466
$$ 145636 144249 142575 141299 140083 138511 136849 135815 135884 137017 138988 141603 144179 145109 142966 138500
55118A38500l765m54K641L601L153K645J940L97j374k230k236k222k158j421k50
$$ 138500 134735 134281 136922 140523 143676 146321 148261 148658 147284 145054 142818 140596 138438 137017 136767
55103A36767M46N78R02J690K535L323M085M070K393k18j730j251M9P38O37R7q68
$$ 136767 137213 137791 138693 140383 142918 146241 150326 154396 156789 156571 154841 153590 153639 154377 155014 155111 154243
55086A54243j973k264j307k9M96M10L37L2j154k679k901j066J538K861K199O61
$$ 154243 152270 150006 148699 148670 149166 149576 149913 149945 148791 146112 143211 142145 143683 146544 148743 149404
55070A49404l14n03p38j475k079j752o95J00M9n69j086r21J98J838K853K492J385
$$ 149404 149090 148587 147849 146374 144295 142543 141848 141948 141997 141428 140342 139421 139619 141457 144310 146802 148187
55053A48187P04M88k60j736k761k357r92L62J460K396K800K387J767J742K026
$$ 148187 148891 149379 149119 147383 144622 142265 141273 141635 143095 145491 148291 150678 152445 154187 156213
55038A56213J593K96p26n54K02K2j712l834m498l189j263j92L13J537L371M016
$$ 156213 157806 158102 157376 156822 157024 157046 155334 151500 147002 143813 142550 142358 142671 144208 147579 151595
55022A51595K542M16n67p43j549k776k682p44J449K434K427K096J339K11k69M81
$$ 151595 154137 154553 153986 153243 151694 148918 146236 145492 146941 149375 151802 153898 155237 155448 155179 155660
55006A55660J240M86j361k548k501k295k617k740j796j2J761K898L094K492J936
$$ 155660 156900 157386 156025 153477 150976 148681 146064 143324 141528 141516 143277 146175 149269 151761 153697
54991A53697K182K622J900J32q63k38L85p03k656l386k613j846j807j709j049
$$ 153697 155879 158501 160401 160533 159670 159432 159817 159114 156458 153072 150459 148613 146806 145097 144048
54976A44048k95M16J546K762K919K017J531J953J676m32k821l267k095j498k188
$$ 144048 143753 144169 145715 148477 151396 153413 154944 156897 158573 158141 155320 152053 149958 148460 146272
54961A46272k575j246J276L533M533L887J813m81j408o27N57Q32K67k39j64M59
$$ 146272 143697 142451 143727 147260 151793 155680 157493 157012 155604 154977 155534 156366 156633 156394 156230 156689
54945A56689J413K200K109J029j46m48ML22P8l38n06n21o65q82q34k46P93J792
$$ 156689 158102 160302 162411 163440 163294 162846 162850 163172 163250 162912 162406 161885 161220 160338 159504 159258 160051 161843
54927A61843K140J627O51j45l06L44J680L022L283J985Pj145q80J50J156J915
$$ 161843 163983 165610 166261 166116 165810 166154 167834 170856 174139 176124 176131 174986 174106 174256 175412 177327
54911A77327K337K225J879K134L041L293J911p6q06j19M12Kl91n1J67m74q57M63
$$ 177327 179664 181889 183768 185902 188943 192236 194147 194071 193265 193146 193558 193560 193169 193118 193285 192811 191954 192417
54893A92417K708L476J813o84k089k213j990j744r72M92J772J743M20p97o74K81
$$ 192417 195125 198601 200414 199730 197641 195428 193438 191694 190722 191214 192986 194729 195149 194352 193678 193959
54877A93959N73J06M96K407L889K970P83J31J403K201J255L46J365L481M650M572
$$ 193959 194532 194638 195134 197541 201430 204400 205183 205314 206717 208918 210173 210519 211884 215365 220015 224587
54861B24587M486M942N405N624N952O474O924P425Q225Q790Q023N637K607J29
$$ 224587 229073 234015 239420 245044 250996 257470 264394 271819 280044 288834 296857 302494 305101 305230
54847C05230j480k753m315o126p395p522p099p394q590r300q359o323m524l373
$$ 305230 303750 300997 296682 290556 283161 275639 268540 261146 252556 243256 234897 228574 224050 220677
54833B20677k426j513o63N77K555M367M476K645M02o16j37J010J878J980J479
$$ 220677 218251 216738 216075 216652 219207 223574 228050 230695 231097 230481 230344 231354 233232 235212 236691
54818B36691J093J386K170K883L459M296N549O996Q413R445R284P271L828K31
$$ 236691 237784 239170 241340 244223 247682 251978 257527 264523 272936 282381 291665 298936 302764 302995
54804C02995k590m479n544o023o491p322p928p461o274n629n830n810n001m329
$$ 302995 300405 295926 290382 284359 277868 270546 262618 255157 248883 243254 237424 231614 226613 222284
54790B22284m521m648l625k388k930n275o913n745k531K30J163R58Q34J008Q26
$$ 222284 217763 213115 209490 207102 204172 198897 191984 186239 183708 183938 185101 186059 186893 187901 188727
54775A88727o8j112j306k87J117J560O09o50q56p6K94n29j552j397k51L94j97
$$ 188727 188659 187547 186241 185954 187071 188631 189240 188590 187734 187658 187952 187423 185871 184474 184223 184617 184420
54758A84420j181j556j436j435j430p90M79J536J676J040K24m04q28j028q47k59
$$ 184420 183239 181683 180247 178812 177382 176592 177071 178607 180283 181323 181547 181143 180315 179287 178440 178181
54742A78181M30Q22R07R85J087Q43J27n61p09m47j92J2L01O02R29J612K470K489
$$ 178181 178611 179433 180340 181325 182412 183255 183382 182821 182112 181665 181473 181485 181786 182388 183317 184929 187399 189888
54724A89888J331N27J659L768M392L166K369L443M984N144M204L479L203K963
$$ 189888 191219 191746 193405 197173 201565 204731 207100 210543 215527 220671 224875 228354 231557 234520
54710B34520K979L421L449K556J999L211N411O545O198N939O921Q539R550R193
$$ 234520 237499 240920 244369 246925 248924 252135 257546 264091 270289 276228 283149 291688 301238 310431
54696C10431P200L901M47k016l425m472n523o635p971r290r514p983n606l629
$$ 310431 317631 321532 321979 319963 316538 312066 306543 299908 291937 282647 273133 265150 259544 255915
54682B55915k078o87m05j951l564k628N18K708K259Q25L51M34r3q12n52O66J843
$$ 255915 253837 253150 252745 250794 247230 244602 245120 247828 250087 250912 251263 251697 251604 250792 250240 250906 252749
54665B52749K428K556K606L265N140P597Q884Q164O596N680N543N534N407M885
$$ 252749 255177 257733 260339 263604 268744 276341 285225 293389 299985 305665 311208 316742 322149 327034
54651C27034L130j11l543n726o898q196r562r790q570p163o746o885o196m122
$$ 327034 330164 330053 326510 320784 313886 305690 296128 286338 277768 270605 263859 256974 250778 246656
54637B46656j737p79j847l621m186l171k009j958k601k783k355k097k246j982
$$ 246656 244919 244140 242293 238672 234486 231315 229306 227348 224747 221964 219609 217512 215266 213284
54623B13284n95J400K680K542J607R03M43o74k584l837l021p16J114J376N63m92
$$ 213284 212689 214089 216769 219311 220918 221821 222264 221590 219006 215169 212148 211432 212546 213922 214485 213993
54607B13993j330j446n93K34m66k424l459k324n27k30j295j700l78J517K131R31
$$ 213993 212663 211217 210624 210858 210392 207968 204509 202185 201658 201428 200133 198433 198055 199572 201703 202634
54591B02634q90j618o47J016K051K363K669K869K076M37n22pQ22O26j72k65N84
$$ 202634 201744 200126 199479 200495 202546 204909 207578 210447 212523 212960 212438 212431 213253 213879 213707 213442 214026
54574B14026J606K372K897K786J486o64k413k676j295Q71K329J986L83p32n17
$$ 214026 215632 218004 220901 223687 225173 224509 222096 219420 218125 218996 221325 223311 223694 222962 222445
54559B22445R5J45J28P57J311P14m37n44N53J364J016K70l7k67r94j731j406K07
$$ 222445 222540 222685 222813 223570 224881 225595 225158 224614 225167 226531 227547 227817 227780 227513 226519 224788 223382 223589
54541B23589K154L204K890J845J164J393K124K577K352J463N3j555k801l204k603
$$ 223589 225743 228947 231837 233682 234846 236239 238363 240940 243292 244755 244808 243253 240452 237248 234645
54526B34645j105P67J891J379r5p19K15J334J190L12K26J250K449L254L682L328
$$ 234645 233540 234307 236198 237577 237482 236763 236978 238312 239502 239814 240040 241290 243739 246993 250675 254003
54510B54003J664n00j329k04J388J777J085N94P47O61m22j896k420j653p11n64
$$ 254003 255667 255167 253838 253634 255022 256799 257884 258478 259225 259886 259464 257568 255148 253495 252784 252220
54494B52220m26J243M194O090N309L009J536J616K193K317J936J184K18k99K83
$$ 252220 251794 253037 257231 263321 268630 271639 273175 274791 276984 279301 281237 282421 282639 282340 282623
54479B82623J476K015J545J074J531K606L320L234K799K747L199L345K287L83
$$ 282623 284099 286114 287659 288733 290264 292870 296190 299424 302223 304970 308169 311514 313801 314184
54465C14184r33j014q26j297j805j445q95j389k328j773N79K631K577R69n84j408
$$ 314184 313251 312237 311411 310114 308309 306864 305969 304580 302252 300479 301058 303689 306266 307235 306651 305243
54449C05243j738j692j261p38l68M0O38J028O93l12j270j214M92L313N318M749
$$ 305243 303505 301813 300552 299814 299446 299486 300124 301152 301845 301533 300263 299049 299541 302854 308172 312921
54433C12921K072l14p79q2J72k66m56L6O92J119J696K848M259N049M649L364K158
$$ 312921 314993 314679 313900 313818 313990 313724 313268 313304 313996 315115 316811 319659 323918 328967 333616 336980 339138
54416C39138J855K467L303L684L449K933K699L172M257N311N654N146M076K762
$$ 339138 340993 343460 346763 350447 353896 356829 359528 362700 366957 372268 377922 383068 387144 389906
54402C89906J543R07J141J848K212J798R06J19k79n63j350k814m081l903k312
$$ 389906 391449 392356 393497 395345 397557 399355 400261 400380 400101 399538 398188 395374 391293 387390 385078
54387C85078r24j060k140k711k523k544l197l607k802q79J058J681L37k197m046
$$ 385078 384154 383094 380954 378243 375720 373176 369979 366372 363570 362691 363749 365430 365767 363570 359524
54372C59524m044k978k422k687k884k589k197j754o94J005K468L029K815K119
$$ 359524 355480 352502 350080 347393 344509 341920 339723 337969 337275 338280 340748 343777 346592 348711
54358C48711J119L18K82O91N92k23j059j564k083k519k193j139l34j44K04J007
$$ 348711 349830 350148 350430 351121 351713 351490 350431 348867 346784 344265 342072 340933 340599 340455 340659 341666
54342C41666J309N63k05M8O86M71n05j158j045m72M94J925L203L483K870K175
$$ 341666 342975 343538 343333 343381 344067 344538 344033 342875 341830 341358 341852 343777 346980 350463 353333 355508
54326C55508J569M83j127k253j939m69Q19P57n13j529q80J185K857K617O08j946
$$ 355508 357077 357560 356433 354180 352241 351772 352591 353348 352835 351306 350426 351611 354468 357085 357693 355747
54310C55747l890m443l233q81J043J439P19o6n15o62k73O27J070J93j334k051
$$ 355747 351857 347414 344181 343300 344343 345782 346501 346435 345920 345258 344985 345612 346682 346875 345541 343490
54294C43490j695j192q54M0J522K234J181q18k297l015l725m604m937m312l206
$$ 343490 341795 340603 339749 339789 341311 343545 344726 343908 341611 338596 334871 330267 325330 321018 317812
54279C17812k271j683j510k028l174m019l497j730j64m7j122k018j755n49O10
$$ 317812 315541 313858 312348 310320 307146 303127 299630 297900 297736 297689 296567 294549 292794 292245 292855
54264B92855Q59L0j239k007j946j728k105k792k695j289P23K113K085O53j333
$$ 292855 293714 293744 292505 290498 288552 286824 284719 281927 279232 277943 278666 280779 282864 283517 282184
54249B82184k448j710L64K148K566J915R96K23k23r9L68L25p55k226k994k806
$$ 282184 279736 278026 278390 280538 283104 285019 286015 286238 286015 285916 286284 286609 285854 283628 280634 277828
54233B77828k242j699r53J34R62N46j380l644m374k858m86O27j27j569k388k269
$$ 277828 275586 273887 272934 273068 274030 274576 273196 269552 265178 262320 261834 262461 262334 260765 258377 256108
54217B56108j433j48R30R68Lr39j250j404j748j567j61J898L401L843L439K448
$$ 256108 254675 254527 255457 256425 256428 255489 254239 252835 251087 249520 249359 251257 254658 258501 261940 264388
54201B64388J321P80R47R15P0p72n93Qm05j794k413j095J237K611J942j00j664
$$ 264388 265709 266489 267436 268351 268421 267649 267056 267064 266659 264865 262452 261357 262594 265205 267147 267047 265383
54184B65383j228Q23K345J754j80j559j826j858j924j165N27J590O46j487k655
$$ 265383 264155 264978 267323 269077 268897 267338 265512 263654 261730 260565 261092 262682 263328 261841 259186
54169B59186j950o64n88j853k850k247o63J72l64j280j738k125k746k731j488
$$ 259186 257236 256572 255984 254131 251281 249034 248371 248543 248179 246899 245161 243036 240290 237559 236071
54154B36071k46n75j852k006o09N52K23o47o50J57R08J381J842K190K163J841
$$ 236071 235825 235250 233398 231392 230783 231335 231558 230911 230261 230418 231326 232707 234549 236739 238902 240743
54138B40743J334M82n85j134o85K52Q22Q17O36O07P42Q49O80L38M98J601K822
$$ 240743 242077 242559 241974 240840 240155 240407 241229 242046 242682 243289 244031 244880 245560 245898 246396 247997 250819
54121B50819K678Q80j249k509k962k986k451j547j325k325l406l023j181Q06J936
$$ 250819 253497 254377 253128 250619 247657 244671 242220 240673 239348 237023 233617 230594 229413 230219 232155
54106B32155J951P58j206k399j330J476L690L550J340j412l278l551k546j528
$$ 232155 234106 234864 233658 231259 229929 231405 235095 238645 239985 238573 235295 231744 229198 227670
54092B27670j538k024j476L50J868J791R42J108K586L757K993M13k262l220j991
$$ 227670 226132 224108 222632 222982 224850 226641 227583 228691 231277 235034 238027 238440 236178 232958 230967
54077B30967L09K069K639K580K532K309J396L1q20n78K63P13M04n9J89J246K213
$$ 230967 231276 233345 235984 238564 241096 243405 244801 244832 244012 243434 243697 244410 244814 244755 244944 246190 248403
54060B48403K079Q08n87j129q02k78L9L27P27Q62K65q34j523j152q0O93N57k09
$$ 248403 250482 251290 250703 249574 248772 248494 248533 248860 249587 250449 250714 249880 248357 247205 247125 247818 248375 248166
54042B48166q96j085q53n71n67q00p10L01J988L113K629R16o07j082r64r88j039
$$ 248166 247270 246185 245332 244761 244194 243394 242684 242985 244973 248086 250715 251631 251024 249942 248978 247990 246951
54025B46951n13N80J507J749J485J014K89n99r38NJ909L494L836L249K605K168
$$ 246951 246438 247018 248525 250274 251759 252773 253062 252463 251525 251530 253439 256933 260769 264018 266623 268791
54009B68791J520N12l33n13k21K1J66O26J529K367K584K169J469O81q1l52M90
$$ 268791 270311 270823 270490 269977 269756 269777 269943 270569 272098 274465 277049 279218 280687 281368 281287 280935 281425
53992B81425K335M020M345L330K138J710J946K311K797L799N156N933N388L989
$$ 281425 283760 287780 292125 295455 297593 299303 301249 303560 306357 310156 315312 321245 326633 330622
53978C30622L149L867N637O827O362N053M903O843R537J0872J0382R493R440R927
$$ 330622 333771 337638 343275 350102 356464 361517 366420 373263 382800 393672 404054 413547 422987 432914
53964D32914J0119R951R708R048P635O315O405P808R046R456J0049J1466J2259
$$ 432914 443033 452984 462692 471740 479375 485690 492095 499903 508949 518405 528454 539920 552179
53951E52179J0350N648R1m601q126j0800j2718j3877j4215j3401j1380r198q367
$$ 552179 562529 568177 568268 563667 555541 544741 532023 518146 503931 490530 479150 469952 461585
53938D61585r150j0373j1008j0959r971p295l361n41q26l334n382n583m714l905
$$ 461585 452435 442062 431054 420095 410124 402829 399468 398927 398101 394767 389385 383802 379088 375183
53924C75183l489l508m000m390l742k056n23j74r72k288l434l743l104k534l052
$$ 375183 371694 368186 364186 359796 356054 353998 353475 353301 352329 350041 346607 342864 339760 337226 334174
53909C34174l862k974r7K472K670J116j47j74O44J833K963L347K880K536K835
$$ 334174 330312 327338 327241 329713 332383 333499 333352 333178 333822 335655 338618 341965 344845 347381 350216
53894C50216K662J051o17j40K168L696L129J897J618K125K704L573N035O523P555
$$ 350216 352878 353929 353312 353172 355340 359036 362165 364062 365680 367805 370509 374082 379117 385640 393195
53879C93195Q517R451R254P310M972M078M689N565O155O674O814N984M646L856
$$ 393195 401712 411163 420417 427727 432699 436777 441466 447031 453186 459860 466674 472658 477304 481160
53865D81160L549K899K342L403N929P378O115L931L787N857P607P463O645O980
$$ 481160 484709 487608 489950 493353 499282 506660 512775 516706 520493 526350 533957 541420 548065 555045
53851E55045Q431R640J0046J0221J0458J0174Q959P466O582O181N486M510M243
$$ 555045 563476 573116 583162 593383 603841 614015 622974 630440 637022 643203 648689 653199 657442
53838F57442M926N040L024l99k817l109k673l205m504n401n916o993q519r152
$$ 657442 662368 667408 670432 670033 667216 664107 661434 658229 653725 648324 642408 635415 626896 617744
53824F17744q347p226o960p394p849q324r073r747r862r575r137q126o203m274
$$ 617744 609397 602171 595211 587817 579968 571644 562571 552824 542962 533387 524250 516124 509921 505647
53810E05647l637m070l994k818j845k254l176k753o08J825L194L684M294N367
$$ 505647 502010 497940 493946 491128 489283 487029 483853 481100 480492 482317 485511 489195 493489 498856
53796D98856O276O418O116O273P067P162M710o13o759j0916j2016j1502j1511
$$ 498856 505132 511550 517666 523939 531006 538168 542878 542265 535506 524590 512574 501072 489561
53783D89561j2585j3337j2270r490o509m710m417n182o268o830o359n245m278
$$ 489561 476976 463639 451369 441879 435370 430660 426243 421061 414793 407963 401604 396359 392081
53770C92081l408j796L72J206p13m151o410o293m637k399J93K547L570L130K322
$$ 392081 388673 386877 387249 388455 387742 383591 377181 370888 366251 363852 364045 366592 370162 373292 375614
53755C75614J777J043J31J13J231J939J114K7N31K335L665M014M451N525O627
$$ 375614 377391 378434 378565 378678 379909 381848 382962 382989 383520 385855 389520 393534 397985 403510 410137
53740D10137P375Q016Q266P277N280L943M424O049P437Q072Q112P545O298M742
$$ 410137 417512 425528 433794 441071 446351 450294 454718 460767 468204 476276 484388 491933 498231 502973
53726E02973L366K273J372P92O16N50K75j1J75P98J094L48j168k221j957j146
$$ 502973 506339 508612 509984 510776 511392 511942 512217 512206 512381 513179 514273 514621 513453 511232 509275 508129
53710E08129j530l701o150p024o343n717o154p066p414o927n927m707l523k758
$$ 508129 506599 502898 496748 489724 483381 477664 471510 464444 457030 450103 444176 439469 435946 433188
53696D33188k567k669k729k840l422m582n696n773m564l125k734l247l328k499
$$ 433188 430621 427952 425223 422383 418961 414379 408683 402910 398346 395221 392487 389240 385912 383413
53682C83413j795j890j789o14O12M82k64K04J683K078P73k85M41J962K525J836
$$ 383413 381618 379728 377939 377325 377937 378419 378155 378359 380042 382120 382893 382608 383049 385011 387536 389372
53666C89372N30j072k439k378n58J449J961J293Q80J119J432J757K381K803K281
$$ 389372 389902 388830 386391 384013 383455 384904 386865 388158 389038 390157 391589 393346 395727 398530 400811
53651D00811J373J435K581L481L382K969K943L037K964L105L539L406K221J104
$$ 400811 402184 403619 406200 409681 413063 416032 418975 422012 424976 428081 431620 435026 437247 438351
53637D38351J505L130M288M261M090M643N092M211K431J356J559K148K536L168
$$ 438351 439856 442986 447274 451535 455625 460268 465360 469571 472002 473358 474917 477065 479601 482769
53623D82769L918L454J396j48R02L250L537R48j573j321Q66K240J560k67j788
$$ 482769 486687 490141 491537 491389 492291 495541 499078 500026 498453 497132 497998 500238 501798 501531 499743
53608D99743k022q08O87N66j584l780l979k549j226n44J60Q19N83l80p55j09L85
$$ 499743 497721 496913 497600 498166 496582 492802 488823 486274 485048 484504 484664 485483 486066 485686 484931 484822 485207
53591D85207k34j328j690j154n75p24j513k012j266L99J218K8j775j524J318M273
$$ 485207 484973 483645 481955 480801 480226 479502 477989 475977 474711 475110 476328 476356 474581 473057 474375 478648
53575D78648M794L023R82R8L59J097J567J225L65K09J593L736N037M964M422M296
$$ 478648 483442 486465 487447 487545 487904 489001 490568 491793 492158 492367 493960 497696 502733 507697 512119 516415
53559E16415M427M297M022M114M603M933M739M294M008L750L071K076J755L097
$$ 516415 520842 525139 529161 533275 537878 542811 547550 551844 555852 559602 562673 564749 566504 569601
53545E69601N813Q204Q484O465L841K734L699N267N564M236K473J425J120J021
$$ 569601 575414 583618 592102 598567 602408 605142 608841 614108 619672 623908 626381 627806 628926 629947
53531F29947R06Q43P03K96k71o86p60n04j35j39r04k090k871k977k856k608j742
$$ 629947 630853 631696 632399 632695 632424 631738 630978 630474 630339 630200 629296 627206 624335 621358 618502 615894 614152
53514F14152n66o54k690m772m454k035j03J04pQ91J944J812R34O30J023J411K086
$$ 614152 613586 612932 610242 605470 601016 598981 598878 598982 598975 599866 601810 603622 604556 605186 606209 607620 609706
53497F09706L946O285O805M596J802J188K695L814L118K019K448M038M844M268
$$ 609706 613652 619937 626742 631338 633140 634328 637023 640837 643955 645974 648422 652460 657304 661572
53483F61572L778M692O660Q775J0777J2294J2310J0896J0377J2852J6890J8869
$$ 661572 665350 670042 676702 685477 696254 708548 720858 731754 742131 754983 771873 790742
53471G90742J7637J5896J6302J8349K0177K1601K3484K5447K6339K6523K7680
$$ 790742 808379 824275 840577 858926 879103 900704 924188 949635 975974 1002497 1030177
53460A030177L0293L2947L4368L4731L4697L4622L5202L7527M1466M5070M6690
$$ 1030177 1060470 1093417 1127785 1162516 1197213 1231835 1267037 1304564 1346030 1391100 1437790
53449A437790M6978M7723M9287N0442N0536N0429N1001N1854N2107N1692N1137
$$ 1437790 1484768 1532491 1581778 1632220 1682756 1733185 1784186 1836040 1888147 1939839 1990976
53438A990976N0555M9712M8897M8969N0267N1902N2428N1145M8807M6988M6603
$$ 1990976 2041531 2091243 2140140 2189109 2239376 2291278 2343706 2394851 2443658 2490646 2537249
53427B537249M6835M5921M3155L9732L7120L5166L2762K9926K7919K7154K6359
$$ 2537249 2584084 2630005 2673160 2712892 2750012 2785178 2817940 2847866 2875785 2902939 2929298
53416B929298K4520K2382K1000J9794J7423J3986J0832Q380N571J609l102q056
$$ 2929298 2953818 2976200 2997200 3016994 3034417 3048403 3059235 3067615 3073186 3074795 3071693 3063637
53404C063637j3337j8659k2982k5953k8758l2498l6374l8586l8689l8115l8651
$$ 3063637 3050300 3031641 3008659 2982706 2953948 2921450 2885076 2846490 2807801 2769686 2731035
53393B731035m1101m5056m9005n0955n0079m7872m6662m6881m6780m5081m2721
$$ 2731035 2689934 2644878 2595873 2544918 2494839 2446967 2400305 2353424 2306644 2261563 2218842
53382B218842m1311m0830l9838l7436l4018l0335k6737k3327k0057j6655j2995
$$ 2218842 2177531 2136701 2096863 2059427 2025409 1995074 1968337 1945010 1924953 1908298 1895303
53371A895303r499o486l273J148O416J0920J3978J6830K0778K5293K9059L2094
$$ 1895303 1885804 1879318 1876045 1877193 1883609 1894529 1908507 1925337 1946115 1971408 2000467 2032561
53359B032561L5526L9664M3716M7323N0915N4360N6715N7926N9499O2660O6760
$$ 2032561 2068087 2107751 2151467 2198790 2249705 2304065 2360780 2418706 2478205 2540865 2607625
53348B607625P0392P3225P5870P8625Q1540Q5098Q9719R4706R8782J01647J04178
$$ 2607625 2678017 2751242 2827112 2905737 2987277 3072375 3162094 3256800 3355582 3457229 3561407
53337C561407J07143J10432J13435J15399J15657J14482J13590J14643J17106
$$ 3561407 3668550 3778982 3892417 4007816 4123473 4237955 4351545 4466188 4583294
53328D583294J18582J17588J14957J12080J08924J04669R9449R4205Q9044Q2858
$$ 4583294 4701876 4819464 4934421 5046501 5155425 5260094 5359543 5453748 5542792 5625650
53318E625650P4970O6485N9326N4078M9343M3567L7044L1272K6354K0214J1090
$$ 5625650 5700620 5767105 5826431 5880509 5929852 5973419 6010463 6041735 6068089 6088303 6099393
53307F099393j79j1700k3586l7672n4202p0696q4821r6717j07393j16255j21953
$$ 6099393 6099214 6087514 6063928 6026256 5972054 5901358 5816537 5719820 5612427 5496172 5374219
53296E374219j24908j27213j30086j32834j34481j35127j35272j34764j33140
$$ 5374219 5249311 5122098 4992012 4859178 4724697 4589570 4454298 4319534 4186394
53287D186394j30441j27261j24317j22204j21061j20114j18076j14444j10078
$$ 4186394 4055953 3928692 3804375 3682171 3561110 3440996 3322920 3208476 3098398
53278C098398j06032j02231r7919r3140q8766q4900q0234p3767o6500o0319n5358
$$ 3098398 2992366 2890135 2792216 2699076 2610310 2525410 2445176 2371409 2304909 2244590 2189232
53267B189232m9751m2445l5054k9956k7227k4742k0978j6438j2206q494n218k834
$$ 2189232 2139481 2097036 2061982 2032026 2004799 1980057 1959079 1942641 1930435 1921941 1916723 1913889
53255A913889j549l88J927N442R163J2553J5842J8925K1092K2291K3760K6593
$$ 1913889 1912340 1911952 1913879 1919321 1928484 1941037 1956879 1975804 1996896 2019187 2042947 2069540
53243B069540L0190L2936L4294L5415L7601M0802M3988M6418M8064M9145M9965
$$ 2069540 2099730 2132666 2166960 2202375 2239976 2280778 2324766 2371184 2419248 2468393 2518358
53232B518358N1025N2684N4614N6091N6880N7219N6939N5432N2764M9960M7601
$$ 2518358 2569383 2622067 2676681 2732772 2789652 2846871 2903810 2959242 3012006 3061966 3109567
53221C109567M4964M1271L7129L3694L0918K7716K3592J8907J3794Q002J974l220
$$ 3109567 3154531 3195802 3232931 3266625 3297543 3325259 3348851 3367758 3381552 3389554 3391528 3388308
53209C388308p333j1397j6395k2334k8773l5298m1318m6504n1784n8530o6174
$$ 3388308 3380975 3369578 3353183 3330849 3302076 3266778 3225460 3178956 3127172 3068642 3002468
53198C002468p2004p4417p5164p6981p9816q1076p9300p6042p3820p3335p3283
$$ 3002468 2930464 2856047 2780883 2703902 2624086 2543010 2463710 2387668 2313848 2240513 2167230
53187B167230p2260p0274o8409o7287o6144o3965o1289n9980o0880o2614o3275
$$ 2167230 2094970 2024696 1956287 1889000 1822856 1758891 1697602 1637622 1576742 1514128 1450853
53176A450853o2329o0213n7058n3029m9012m5680m2326l8083l3868l1516l1086
$$ 1450853 1388524 1328311 1271253 1218224 1169212 1123532 1081206 1043123 1009255 977739 946653
53165I46653l0539k8368k5196k2440k0594j9267j7961j6307j4390j3023j2911
$$ 946653 916114 887746 862550 840110 819516 800249 782288 765981 751591 738568 725657
53154G25657j3356j2890j1312r906r364q944q228q233r641j1193j1168r684q262
$$ 725657 712301 699411 688099 678193 668829 659885 651657 643424 633783 622590 611422 601738 593476
53141E93476p699p587p489p371p155o862o997p729q046o877m814l519l564m076
$$ 593476 585777 578190 570701 563330 556175 549313 542316 534587 526541 519664 514850 511331 507767 503691
53127E03691m546n432o638o875n508l872l639m497m633l256j631j407k624l699
$$ 503691 499145 493713 487075 480200 474692 470820 467181 462684 458051 454795 453164 451757 449133 445434
53113D45434l247j635o30j361k891l336k294j307j681k743k951k036j046o55n07
$$ 445434 442187 440552 439922 438561 435670 432334 430040 428733 427052 424309 421358 419322 418276 417621 417114
53098D17114k57j81m67o91m55l5J03kn0j05m80j091j473j425j352j649k053j904
$$ 417114 416857 416676 416209 415518 415063 415028 415131 415129 415079 414974 414494 413403 411930 410505 409153 407504 405451 403547
53080D03547j052j55J73J91N51J137J157M78J02O61J264P39m74r22l89j71q94
$$ 403547 402495 402340 402513 402704 403255 404392 405549 406027 406129 406790 408054 408793 408319 407397 407008 406837 405943
53063D05943j506r56K78J202J686J877J226m37j571l70K505M236L131M78j361
$$ 405943 404437 403481 403759 404961 406647 408524 409750 409313 407742 407372 409877 414113 417244 417722 416361
53048D16361j577j087r89j607k597l366l588l616l977m434m086k726j399j110
$$ 416361 414784 413697 412708 411101 408504 405138 401550 397934 393957 389523 385437 382711 381312 380202
53034C80202j588j871j659j367j199r30n31m25r24j751k267k024j148k92q7m85
$$ 380202 378614 376743 375084 373717 372518 371588 371057 370632 369708 367957 365690 363666 362518 362226 362139 361654
53018C61654q50p32k85K39R07J770K489K802L015L435L563K573O31r64j210n78
$$ 361654 360804 360072 359787 360026 360933 362703 365192 367994 371009 374444 378007 380580 381211 380247 379037 378459
53002C78459l68j204k532l506l892l915l547k420n86J002J205j65k131l423l406
$$ 378459 378091 376887 374355 370849 366957 363042 359495 357075 356489 357491 358696 358531 356400 352977 349571
52987C49571k314r96m29r99k080k651k406j861j382p56l1nj156k475k219j4K441
$$ 349571 347257 346261 345832 344833 342753 340102 337696 335835 334453 333697 333666 333661 332505 330030 327811 327797 330238
52970C30238K994J149j597l290l209k149j310j101j100q50k84N28J492K203K137
$$ 330238 333232 334381 332784 329494 326285 324136 322826 321725 320625 319775 319491 320019 321511 323714 325851
52955C25851J387Q02Q93J030K52j367k760l203l000k795k731k551k144j636j093
$$ 325851 327238 328040 328933 329963 330215 328848 326088 322885 319885 317090 314359 311808 309664 308028 306935
52940C06935m34L01P74O23k2m23R2J320K224J967P34n87j395j800k095k053j087
$$ 306935 306501 306802 307576 308199 308177 307754 307846 309166 311390 313357 314091 313504 312109 310309 308214 306161 305074
52923C05074Q54K816L656L285K552J873P59r15k039j595k26P29J359K752M528
$$ 305074 305928 308744 312400 315685 318237 320110 320869 319954 317915 316320 316094 316823 318182 320934 325462
52908C25462M675K512J31k98O41R30J86k63J85O56M78l2n95j381j988j369M59
$$ 325462 330137 332649 332780 332482 333123 334053 334239 333976 334161 334817 335295 335263 334668 333287 331299 329930 330389
52891C30389J706P53j764l684l713k389r54j09K8n68j873l451m332l621j407R97
$$ 330389 332095 332848 331084 327400 323687 321298 320344 320235 320263 319695 317822 314371 310039 306418 305011 306008
52875C06008K109J636O15J08J40K7n17j013r00j67P50J470J776J429K95j228k271
$$ 306008 308117 309753 310368 310476 310616 310643 310126 309113 308213 308046 308796 310266 312042 313471 313766 312538 310267
52858C10267k251j469p20m54n79q22r20o87l34m61j202j514k03K338M230M187
$$ 310267 308016 306547 305827 305373 304794 303972 303052 302365 302031 301570 300368 298854 298651 300989 305219 309406
52842C09406K737J062l88j624k253j804n29P79J595J859J751J704K145K706K180
$$ 309406 312143 313205 312817 311193 308940 307136 306607 307386 308981 310840 312591 314295 316440 319146 321326
52827C21326M7k308k673l66L000N038M514J996r00k821l520l494l020k058r63
$$ 321326 321373 319065 316392 316026 319026 324064 328578 330574 329674 326853 323333 319839 316819 314761 313798
52812C13798m36m51j14Q75J459O86p00j047K62K395M199M967M505L286K288J944
$$ 313798 313362 312911 312797 313672 315131 315817 315117 314070 314332 316727 320926 325893 330398 333684 335972 337916
52796C37916J514K06j353j627r6J953K706J517n54j798j622j258k117l699m171
$$ 337916 339430 339636 338283 336656 336560 338513 341219 342736 342182 340384 338762 337504 335387 331688 327517
52781C27517l026j732j360j283j014j427k852l697k673j015o05j181j415j377
$$ 327517 324491 322759 321399 320116 319102 317675 314823 311126 308453 307438 306833 305652 304237 302860
52767C02860j584q26K157N628O505M706K856J802j74l352n201m264k369j563j400
$$ 302860 301276 300450 302607 308235 314740 319446 322302 324104 323930 320578 315377 311113 308744 307181 305781
52752C05781q59n28j005j225k08J207K123L270N082N810L744J21k314k752k378
$$ 305781 304922 304394 303389 302164 301956 303163 305286 308556 313638 319448 323192 323313 320999 318247 315869
52737C15869j960j377r81j411k254k479k020j644j561j450j433j764j969j405
$$ 315869 313909 312532 311551 310140 307886 305407 303387 301743 300182 298732 297299 295535 293566 292161
52723B92161l53N18J240K021K274J410L3q58j284j742j890j258n65p68j215m72
$$ 292161 291808 292326 293566 295587 297861 299271 299304 298446 297162 295420 293530 292272 291707 290939 289724 289252
52707B89252J136J603O2j930k345q36J378K835K854J947J369J752K406K410J810
$$ 289252 290388 291991 292053 290123 287778 286942 288320 291155 294009 295956 297325 299077 301483 303893 305703
52692C05703J011j52j653k349j340K59O06j28o4J336K373J722K73l72r7K4n89
$$ 305703 306714 306562 304909 302560 301220 301479 302085 301957 301893 303229 305602 307324 307597 307225 307128 307152 306563
52675C06563j352j272J6J702K433J837J074J280J948J821R15M27Q94J670K135
$$ 306563 305211 303939 303955 305657 308090 309927 311001 312281 314229 316050 316965 317392 318286 319956 322091
52660C22091K075J039j268l771m605l327j433l59j18j12j54k45l97r08j854k270
$$ 322091 324166 325205 323937 320166 315561 312234 310801 310442 310324 310212 310058 309813 309416 308508 306654 304384
52644C04384j132P25J230Jj056p18k19j031k389k507j182L78J473K199K378J729
$$ 304384 303252 303977 305207 305208 304152 303434 303215 302184 299795 297288 296106 296484 297957 300156 302534 304263
52628C04263Q39O57J066R70p6j247j484n26J051K212K057O89n60m52P47J747K006
$$ 304263 305102 305759 306825 307795 307719 306472 304988 304462 305513 307725 309782 310471 309911 309459 310206 311953 313959
52611C13959K170K678K784J528p05k228j747K43J953K097J039O0j31J50L91M93
$$ 313959 316129 318807 321591 323119 322414 320186 318439 318682 320635 322732 323771 323831 323700 323850 324241 324734
52595C24734N12L45L6l7M46J320K171K790L201L463L562L331K511J028p52k273
$$ 324734 325246 325591 325627 325590 326036 327356 329527 332317 335518 338981 342543 345874 348385 349413 348661 346388
52579C46388l216l452k894j827j071j112j219k78J519K644K149Q20O4M08J477
$$ 346388 343172 339720 336826 334999 333928 332816 331597 331319 332838 335482 337631 338451 338515 338923 340400
52564C40400K734L693L777K627M65k045m072m790l955k377j291j042j012r40j381
$$ 340400 343134 346827 350604 353231 353696 351651 347579 342789 338834 336457 335166 334124 333112 332172 330791
52549C30791k384k755j524L97J127J23j174j113M11K111K820K557K174K187K206
$$ 330791 328407 325652 324128 324525 325652 325775 324601 323488 323899 326010 328830 331387 333561 335748 337954
52534C37954J680P99J73j33n31j050j316j388j648j714n48J959M420N508N285
$$ 337954 339634 340433 340606 340473 339942 338892 337576 336188 334540 332826 332278 334237 338657 344165 349450
52519C49450M396K946R86p03j386j412j503j514q48K30Q62J010J461K308K456
$$ 349450 353846 356792 357778 357075 355689 354277 352774 351260 350412 350642 351504 352514 353975 356283 358739
52504C58739J071j156k635k454j121P3J89o21j430j558j080l66M90J454K128K011
$$ 358739 359810 358654 356019 353565 352444 352517 352706 352085 350655 349097 348017 347651 348141 349595 351723 353734
52488C53734J069k51j393j881j510o35L2K28L76P20P41p5j292k014k048j947k086
$$ 353734 354803 354552 353159 351278 349768 349133 349165 349393 349769 350489 351230 351155 349863 347849 345801 343854 341768
52471C41768k287k269j974j429p05J6N71R66J240J355J393J474J370O92k55m40
$$ 341768 339481 337212 335238 333809 333104 333120 333691 334657 335897 337252 338645 340119 341489 342181 341926 341486
52455C41486N55J832K299K034J828J917J951J812J695J642J696K208L224M002
$$ 341486 342041 343873 346172 348206 350034 351951 353902 355714 357409 359051 360747 362955 366179 370181
52441C70181L862L139K465J621J58j237j481r58j274k845m189m005k738j506o14
$$ 370181 374043 377182 379647 381268 381426 380189 378708 377750 376476 373631 369442 365437 362699 361193 360579
52426C60579M5J11o44j343p95Q80K147J780K46q39m14J029K226K739L259M198
$$ 360579 360624 360735 360091 358748 357953 358833 360980 362760 363006 362167 361753 362782 365008 367747 371006 375204
52410C75204M719L881K182R70N85K59k41j63P03J373J103N36O02J178J560J625
$$ 375204 379923 383804 385986 386956 387541 387800 387559 387396 388099 389472 390575 391111 391713 392891 394451 396076
52394C96076J622J329K56j496l100l645k718q49M84nj801k937k454j610j830k455
$$ 396076 397698 399027 399283 397787 394687 391042 388324 387475 387959 387954 386153 383216 380762 379152 377322 374867
52378C74867j779K50J897K070J453J015N76n11k022k906k353o08J094J491N42
$$ 374867 373088 373338 375235 377305 378758 379773 380349 379838 377816 374910 372557 371949 373043 374534 375076
52363C75076m32l67J30k52j391j754o65P26J271J487K407L638L833K814J939K182
$$ 375076 374644 374277 374407 374155 372764 371010 370345 371071 372342 373829 376236 379874 383707 386521 388460 390642
52347C90642K908L020K597K676L720N080O034O736P678Q560Q289O270L283O99
$$ 390642 393550 396570 399167 401843 405563 410643 416677 423413 431091 439651 447940 454210 457493 458192
52333D58192r09k071l451n005o154o389n676m429l220k282j347k10P56J042Q71
$$ 458192 457283 455212 451761 446756 440602 434213 428537 424108 420888 418606 417259 417049 417805 418847 419718
52318D19718R75J456J664J474J848L362M901M839L281J993K050K609K385J488
$$ 419718 420693 422149 423813 425287 427135 430497 435398 440237 443518 445511 447561 450170 452555 454043
52304D54043R44J102J306J042N78M25O85J120J452J447J004M26K29M96O52J55
$$ 454043 454987 456089 457395 458437 459015 459440 460125 461245 462697 464144 465148 465574 465803 466299 466951 467106
52288D67106p30j181q16j44J28k8Q2J093K917M798N901N905N106M073L340L385
$$ 467106 466376 465195 464379 464235 464363 464335 464417 465510 468427 473225 479126 485031 490137 494210 497550 500935
52272E00935M508O324P510O824M704L249M056O411Q344R134R769J0902J1665J1142
$$ 500935 505443 511767 519277 526101 530805 534054 538110 544521 552865 561999 571768 582670 594335 605477
52258F05477J0022R744J0420J0794J0110Q969Q146P504O525N319M516M509N186
$$ 605477 615499 625243 635663 646457 656567 665536 673682 681186 687711 693030 697546 702055 707241
52245G07241O155O916P097O829O754P338Q320Q919Q491O860M424K142J106J719
$$ 707241 713396 720312 727409 734238 740992 748330 756650 765569 774060 780920 785344 787486 788592 790311
52231G90311L253M476M619L768K570J732J577J845K077K290K979M233N161M592
$$ 790311 793564 798040 802659 806427 808997 810729 812306 814151 816228 818518 821497 825730 830891 835483
52217H35483K306o23k637k832j592k07M18P16J786L714N245N451N060N521P085
$$ 835483 837789 837166 834529 831697 830105 829898 830316 831032 832818 836532 841777 847228 852288 857809 864894
52202H64894Q553Q716P483N664M302M010M560N078N032M813N018N516N902O377
$$ 864894 873447 882163 889646 895310 899612 903622 908182 913260 918292 923105 928123 933639 939541 945918
52188I45918P327Q281Q280P326O482O382O484O051N042L821K858K979M828P544
$$ 945918 953245 961526 969806 977132 983614 989996 996480 1002531 1007573 1011394 1014252 1017231 1022059 1029603
52174A029603Q998Q098O139N032N032N296N857P446R539J0258Q822O862O485P715
$$ 1029603 1038601 1046699 1052838 1057870 1062902 1068198 1074055 1081501 1091040 1101298 1110120 1116982 1123467 1131182
52160A131182Q781Q535P697P662Q760J0078J0633J0384J0025R988R991R645R206
$$ 1131182 1139963 1148498 1156195 1163857 1172617 1182695 1193328 1203712 1213737 1223725 1233716 1243361 1252567
52147A252567R263R709R647Q659P700Q025R413J0224R398P739O727O725O949O903
$$ 1252567 1261830 1271539 1281186 1289845 1297545 1305570 1314983 1325207 1334605 1342344 1349071 1355796 1362745 1369648
52133A369648O849O911O630N799N043N015N460N603N173M501L851L201K569K156
$$ 1369648 1376497 1383408 1390038 1395837 1400880 1405895 1411355 1416958 1422131 1426632 1430483 1433684 1436253 1438409
52119A438409K026J910J246n35l433o405p942p493n987m663l901l630m151n574
$$ 1438409 1440435 1442345 1443591 1443056 1439623 1433218 1425276 1417783 1411796 1407133 1403232 1399602 1395451 1389877
52105A389877o826o441m441k447j703j732j413o23k37p83j621j544r7J810K766
$$ 1389877 1383051 1376610 1372169 1369722 1368019 1366287 1364874 1364251 1364014 1363231 1361610 1360066 1359969 1361779 1364545
52090A364545K391J676J582J770J313L01j27O57J847K063R07n21o33Q74K380K076
$$ 1364545 1366936 1368612 1370194 1371964 1373277 1373578 1373451 1374108 1375955 1378018 1378925 1378404 1377771 1378645 1381025 1383101
52074A383101L63n74J19P18l09j851k030j071k48R94M098Q052R940R185Q547J0036
$$ 1383101 1383464 1382890 1383009 1383727 1383418 1381567 1379537 1378466 1378218 1379212 1383310 1391362 1401302 1410487 1419034 1429070
52058A429070J2374J3615J3940J4250J4101J2888J1533J1111J0904R497O816L726
$$ 1429070 1441444 1455059 1468999 1483249 1497350 1510238 1521771 1532882 1543786 1553283 1560099 1563825
52046A563825O70j839k617j384M7p0r95r30O8N76M87J056K504L626L712L268K773
$$ 1563825 1564495 1562656 1560039 1558655 1558702 1558632 1557637 1556707 1556775 1557351 1557838 1558894 1561398 1565024 1568736 1572004 1574777
52029A574777K186J596J020k16k476m616n353n315o007p116o952n430m340m430
$$ 1574777 1576963 1578559 1579579 1579363 1576887 1572271 1566918 1561603 1555596 1548480 1541528 1536098 1531758 1527328
52015A527328m394l313j992j156k09J240K306K330J945J741J392J049J963M345
$$ 1527328 1522934 1519621 1517629 1516473 1516264 1517504 1519810 1522140 1524085 1525826 1527218 1528267 1530230 1534575
52001A534575O001M820J703o26j020o32n82o06j38M09Q1j424l300m339m199l835
$$ 1534575 1540576 1545396 1547099 1546473 1545453 1544821 1544239 1543633 1543495 1543904 1543985 1542561 1539261 1534922 1530723 1526888
51985A526888m282n186n352m757m826o190p490p232n960n373n902o364n850m810
$$ 1526888 1522606 1517420 1512068 1507311 1502485 1496295 1488805 1481573 1475613 1470240 1464338 1457974 1452124 1447314
51971A447314m160m131m155l443j675N05J709J079o33j668j047N01J552J647J569
$$ 1447314 1443154 1439023 1434868 1431425 1429750 1430255 1431964 1433043 1432410 1430742 1429695 1430196 1431748 1433395 1434964
51956A434964J876J648m76m018o397n829l702k921m280n845n864m826m405n680
$$ 1434964 1436840 1438488 1438012 1433994 1427597 1421768 1418066 1415145 1410865 1405020 1399156 1394330 1389925 1384245
51942A384245q868j3411j7644j9605j9125j8283j8875k0409k1414k1753k2312
$$ 1384245 1375377 1361966 1344322 1324717 1305592 1287309 1268434 1248025 1226611 1204858 1182546
51931A182546k3107k3117k1838j9877j8077j6923j6653j7015j7078j6102j4627
$$ 1182546 1159439 1136322 1114484 1094607 1076530 1059607 1042954 1025939 1008861 992759 978132
51920I78132j3882j4215j4891j5313j5506j5364j4446j2887j1640j1170j0659
$$ 978132 964250 950035 935144 919831 904325 888961 874515 861628 849988 838818 828159
51909H28159r125o901n081l845k283KK194L698N375Q222J1308J2492J1266R443
$$ 828159 819034 812133 807052 803207 800924 800926 803120 806818 812193 820415 831723 844215 855481 864924
51895H64924Q513P801O259M608M003L631J779j145k845k523j824j921j844o89
$$ 864924 873437 881238 887497 892105 896108 899739 901518 900373 897528 895005 893181 891260 889416 888727
51881H88727N05O64R72L351P513J1309J3560J4952J6279J7173J6873J5203J2594
$$ 888727 889232 889896 890868 894219 901732 913041 926601 941553 957832 975005 991878 1007081 1019675
51868A019675R757P387N604L621M50l996q790j2891j5983j8435k0516k1662k0978
$$ 1019675 1029432 1036819 1042423 1046044 1046494 1042498 1033708 1020817 1004834 986399 965883 944221 923243
51855I23243j8898j7566j8364j9606j8521j5404j3491j4143j4716j2630r174p117
$$ 923243 904345 886779 868415 848809 830288 814884 801393 787250 772534 759904 750730 743613
51843G43613o343m786k329p47j41J394M287O492O773O443O631O123L583K47j607
$$ 743613 737270 732484 730155 729408 729267 730661 734948 741440 748213 754656 761287 767410 770993 771240 769633
51828G69633j836k107k825k426L5L052M417M113M442P239J1716J5619J8026J9899
$$ 769633 767797 765690 762865 760439 760474 763526 767943 772056 776498 783737 795453 811072 829098 848997
51814H48997K1708K1844J8462J2148N408j64m871r054j1881j2636j2187j2200
$$ 848997 870705 892549 911011 923159 928567 928403 923532 914478 902597 889961 877774 865574
51802H65574j3357j4969j6024j6126j5476j4396j2989j1221r295p658o565n890
$$ 865574 852217 837248 821224 805098 789622 775226 762237 751016 741721 734063 727498 721608
51790G21608n554n672n921n529m480m053n252p194q172p852p187o549n459m153
$$ 721608 716054 710382 704461 698932 694452 690399 685147 677953 669781 661929 654742 648193 642734 638581
51776F38581l706m155m041k535q11l49r25j247q49k88R2N45J176J552J232L59
$$ 638581 634875 630720 626679 624144 623333 622984 622059 620812 619963 619675 619767 620312 621488 623040 624272 624631
51760F24631m05n37l46o99j725k184j038P42J158N9m90R10L051M022L690L144
$$ 624631 624226 623689 623343 622644 620919 618735 617697 618439 619597 619656 619166 620076 623127 627149 630839 633983
51744F33983K671J736N08j21M8K32k36j292k615l817m269l652k735k760l882n015
$$ 633983 636654 638390 638898 638777 638825 639057 638821 637529 634914 631097 626828 623176 620441 617681 613799 608784
51728F08784n216m486l095j186O07J147J77j028j134m32k03p83j274j007k90M79
$$ 608784 603568 599082 595987 594801 595408 596555 596732 595704 594570 594138 593935 593152 591878 590871 590581 591060
51712E91060J446K597L196K722J783J293J194Q95P32J817M220O450P222O955O740
$$ 591060 592506 595103 598299 601021 602804 604097 605291 606186 606918 608735 612955 619405 626627 633582 640322
51697F40322O568N494L245P04j221k465l413m133m338l858l044k607k967l708
$$ 640322 646890 652384 655629 656333 655112 652647 649234 645101 640763 636905 633861 631254 628287 624579
51683F24579l984l453k352p44J510L662M065K162j85m49J880N301Q472J1047J2602
$$ 624579 620595 617142 614790 614046 615556 619218 623283 625445 625260 624811 626691 631992 640464 651511 664113
51668F64113J2370J0528Q465P076N704L558J404R88K922N786P377O514L725M52
$$ 664113 676483 687011 695476 702552 708256 711814 713218 714206 717128 722914 730291 736805 740530 740982
51654G40982k250m205n449n649m561k807j635j908l555n661o875o282m392k730
$$ 740982 738732 734527 729078 723429 718868 716061 714426 712518 708963 703302 696427 690145 685753 683023
51640F83023j890p87J233K573J266j874l937l708k781k598k328o97J759L510L921
$$ 683023 681133 680346 681579 684152 685418 683544 679607 675899 673118 670520 668192 667495 669254 672764 676685
51625F76685L172J299j489m214n937o675o763o064m638l342k612j387J433M868
$$ 676685 679857 681156 679667 675453 669516 662841 656078 650014 645376 642034 639422 638035 639468 644336
51611F44336O644O017M580M095M642N186N130M826N055O402Q833J1526J3193J2790
$$ 644336 650980 656997 661577 665672 670314 675500 680630 685456 690511 696913 705746 717272 730465 743255
51597G43255J0053N697J017k989o265r182j1410j1949j0503q155o184m755l304
$$ 743255 753308 759005 760022 757033 750768 741586 730176 718227 707724 699569 693385 688630 685326
51584F85326j757o58l78p98j698k977m477n943p161q053q734r412r847r162o834
$$ 685326 683569 682911 682533 681735 680037 677060 672583 666640 659479 651426 642692 633280 623433 614271 607437
51569F07437l892k233k462l293l426l091l046l030k159l40J595K851L068K203
$$ 607437 603545 601312 598850 595557 592131 589040 585994 582964 580805 580465 582060 584911 587979 590182
51555E90182P51l11m17J4L79P04J112J050j5j538k429k389k036j881j816j472
$$ 590182 590933 590622 590205 590219 590598 591302 592414 593464 593449 591911 589482 587093 585057 583176 581360 579888
51539E79888m95J211L030L848L348K620K954M461O535Q945J1512J3422J3912J3417
$$ 579888 579393 580604 583634 587482 590830 593450 596404 600865 607400 616345 627857 641279 655191 668608
51525F68608J2886J2228J0491P504M372K376K091L413N571P345Q129Q702J0204
$$ 668608 681494 693722 704213 711717 716089 718465 720556 723969 729540 736885 745014 753716 763920
51512G63920J2654J5247J7544J9324J9879J8914J7857J8592K0849K2394K2025
$$ 763920 776574 791821 809365 828689 848568 867482 885339 903931 924780 947174 969199
51501I69199K0807J9955J9251J8487J8905K1765K6243L0122L2295L3526L4746
$$ 969199 990006 1009961 1029212 1047699 1066604 1088369 1114612 1144734 1177029 1210555 1245301
51490A245301L5291L3284K7590J9258J0788L691k783j0200j8755k7285l4778m0710
$$ 1245301 1280592 1313876 1341466 1360724 1371512 1375203 1372420 1362220 1343465 1316180 1281402 1240692
51478A240692m4262m4870m3719m3002m3140m2104l8266l2685k7587k3712k0404
$$ 1240692 1196430 1151560 1107841 1064839 1021699 979595 941329 908644 881057 857345 836941
51467H36941j7442j5327j4072j3010j1827j0900j0407r868q855p710p222p680
$$ 836941 819499 804172 790100 777090 765263 754363 743956 734088 725233 717523 710301 702621
51455G02621q418q385p239n635m305l255k320j983k694l666l504k185j206j469
$$ 702621 694203 685818 678579 672944 668639 665384 663064 661081 658387 654721 651217 649032 647826 646357
51441F46357k142k172j805j868k402k969l587m458n165m994l861k384j306j090
$$ 646357 644215 642043 640238 638370 635968 632999 629412 624954 619789 614795 610934 608550 607244 606154
51427F06154j642k095j511j29P36M01l79o69m67N5J128K382K379N10j545j629
$$ 606154 604512 602417 600906 600777 601513 601914 601535 600866 600399 600454 601582 603964 606343 606853 605308 603679
51411F03679K84K559M208N116M702K443l68j547j049j240l481o168p113o282n018
$$ 603679 603963 606522 610730 615846 620548 622991 622623 621076 620027 618787 615306 609138 602025 595743 590725
51396E90725l842k542j614j985l442m576m405l203j714k68J244L041N178P264
$$ 590725 586883 584341 582727 580742 577300 572724 568319 565116 563402 563134 564378 567419 572597 579861
51382E79861Q637R167R669J0982J2806J3989J3839J2512J0270P248M204K653L488
$$ 579861 588498 597665 607334 618316 631122 645111 658950 671462 681732 688980 693184 695837 699325
51369F99325N673O917N649K180j891n067o810p552q022q524q694q034o608n068
$$ 699325 704998 711915 717564 719744 717853 712786 705976 698424 690402 681878 673184 665150 658542 653474
51355F53474m072l752l800l889l996m247m436l741j404J993M359M012J752L08
$$ 653474 649402 645650 641850 637961 633965 629718 625282 621541 620137 622130 626489 630501 632253 632561
51341F32561J385L954N792O000N343M783M651N006N872O986Q080R284J0632J1369
$$ 632561 633946 637900 643692 649692 655035 659818 664469 669475 675347 682333 690413 699697 710329 721698
51327G21698J0666R194Q887J0896J4533J8594K2698K6707K9794L1215L1656L2793
$$ 721698 732364 741558 750445 761341 775874 794468 817166 843873 873667 904882 936538 969331
51315I69331L5548L9366M3210M6684N0013N3140N4991N3849M8746M0435L0524
$$ 969331 1004879 1044245 1087455 1134139 1184152 1237292 1292283 1346132 1394878 1435313 1465837
51304A465837J9765Q013m219j5490k5223l4440m3629n1040n4713n5421n5778n6569
$$ 1465837 1485602 1493615 1489396 1473906 1448683 1414243 1370614 1319574 1264861 1209440 1153662 1097093
51292A097093n5902n2368m7258m2723l9056l4999l0043k5231k1771j9776j8408
$$ 1097093 1041191 988823 941565 898842 859786 824787 794744 769513 747742 727966 709558
51281G09558j6888j5250j4168j3832j3227j1180q185o264o387o951n755k976r72
$$ 709558 692670 677420 663252 649420 636193 625013 616828 610564 604177 597226 591471 588495 587523
51268E87523j186k453k731j634n48p82k304m046m890m298k635j041n89j302k124
$$ 587523 586337 583884 581153 579519 578971 578189 575885 571839 566949 562651 560016 558975 558386 557084 554960
51253E54960k140j520j045r79r05o34n66r82j408j205n54l16r80k058k615k165
$$ 554960 552820 551300 550255 549276 548371 547737 547171 546189 544781 543576 543022 542706 541726 539668 537053 534888
51237E34888j033r1n4q73j724j794j051j68K19l4p09j444j767j302p9J376K455
$$ 534888 533855 533764 533710 532837 531113 529319 528268 528100 528319 528285 527576 526132 524365 523063 522984 524360 526815
51220E26815K917K934K838K949L540M727O139O817N887L602J351J60m99j794l592
$$ 526815 529732 532666 535504 538453 541993 546720 552859 559676 565563 569165 570516 570676 570177 568383 564791
51205E64791m435l548j885o58J57J116J933J951J390R66N54n71k224l266l252
$$ 564791 560356 556808 554923 554265 554422 555538 557471 559422 560812 561778 562332 561761 559537 556271 553019
51190E53019k941k865k464j273k2K26m89j236j434j260j031p08q0Q46J603J508
$$ 553019 550078 547213 544749 543476 543454 543680 543191 541955 540521 539261 538230 537522 537442 538288 539891 541399
51174E41399M20p54q15L64J669K030J422O07M48J474L298M403L447J096m47k17
$$ 541399 541819 541065 540250 540614 542283 544313 545735 546342 546790 548264 551562 555965 559412 560508 560061 559844
51158E59844L51k46j313j180K63J750K722L647M456M292L073J963J753J903J614
$$ 559844 560195 559949 558636 557456 557719 559469 562191 565838 570294 574586 577659 579622 581375 583278 584892
51143E84892J032Q96J633L214N140O253N398K805J99r62q23l41L6L43M28J94J02
$$ 584892 585924 586820 588453 591667 596807 603060 608458 611263 611462 610500 609677 609336 609372 609715 610143 610337 610439
51126F10439N60J063O58p64k317l214l437l201k488j324j44N83R57J501K290K547
$$ 610439 610999 612062 612720 611956 609639 606425 602988 599787 597299 595975 595831 596414 597371 598872 601162 603709
51110F03709J440o88k380k754k572l033l907l923k892k050j990j702m70O14L67
$$ 603709 605149 604461 602081 599327 596755 593722 589815 585892 583000 580950 578960 577258 576788 577402 577769
51095E77769l44O2J104Q09j019k169j257L50Q31N39R51K027K254Q72j207k561
$$ 577769 577425 577487 578591 579400 578381 576212 574955 575305 576136 576675 577626 579653 581907 582779 581572 579011
51079E79011k356n59J876L170K204J7j150m91N21K78q48j181Q6K098L543L942
$$ 579011 576655 576096 577972 581142 583346 583363 582213 581722 582243 582521 581673 580492 580578 582676 586219 590161
51063E90161L628K945J948R29P98K264M715O501O742O229N992N613M010J542N5
$$ 590161 593789 596734 598682 599611 600409 602673 607388 613889 620631 626860 632852 638465 642475 644017 644072
51048F44072N58J872K243J466Q38J423L031M602N094M214K713J845K199L211L988
$$ 644072 644630 646502 648745 650211 651049 652472 655503 660105 665199 669413 672126 673971 676170 679381 683369
51033F83369M286M347M138L287J749J75n98l15L96O08J37k39N7L27n39k239l190
$$ 683369 687655 692002 696140 699427 701176 701351 700753 700438 700834 701442 701579 701340 701397 701724 701185 698946 695756
51016F95756k659j695j315r98L8J030N58j135k233j661j50J146J961K568L119
$$ 695756 693097 691402 690087 689089 689127 690157 690715 689580 687347 685686 685536 686682 688643 691211 694330
51001F94330L735M549N309N626N822O826Q924J1151J2208J1496R203O181L949
$$ 694330 698065 702614 707923 713549 719371 726197 735121 746272 758480 769976 779179 785360 789309
50988G89309L933O035Q476R530R042Q057P583Q109R582J1235J1890J0901Q593
$$ 789309 793242 799277 807753 817283 826325 834382 841965 850074 859656 870891 882781 893682 902275
50975I02275N519J993j299l090k771j435q92j961m232p041r971j2522j4070j4177
$$ 902275 907794 909787 908488 905398 902627 901192 900300 898339 894107 887066 877095 864573 850503 836326
50961H36326j2697r877o653m301l172k228m40J837L554M458N027N396N387N326
$$ 836326 823629 813752 807099 802798 799626 797398 796958 798795 802349 806807 811834 817230 822617 827943
50947H27943N716O254O287O075O493P401P634O903O402P023Q060Q369P868P086
$$ 827943 833659 839913 846200 852275 858768 866169 873803 880706 887108 894131 902191 910560 918428 925514
50933I25514O097M891M201M887O694Q460R511J0109J0515J0332R184P651P044
$$ 925514 931611 936502 940703 945590 952284 960744 970255 980364 990879 1001211 1010395 1018046 1025090
50920A025090Q088J0011J1289J1307J0871J0741J0247Q072M148k20l996p102r295
$$ 1025090 1033178 1043189 1054478 1065785 1076656 1087397 1097644 1105716 1109864 1109644 1105648 1098546 1089251
50907A089251r622p758m998l014k099j372j87J473L644O495R728J2473J3952J4121
$$ 1089251 1079629 1071871 1066873 1063859 1061760 1060388 1060201 1061674 1065318 1071813 1081541 1094014 1107966 1122087
50893A122087J3799J4327J6647K0390K4127K6845K8736L0400L1879L3015L4084
$$ 1122087 1135886 1150213 1166860 1187250 1211377 1238222 1266958 1297358 1329237 1362252 1396336
50882A396336L5505L7276L9312M1816M4703M7168M8437M8461M7099M3364L6567
$$ 1396336 1431841 1469117 1508429 1550245 1594948 1642116 1690553 1739014 1786113 1829477 1866044
50871A866044K7990K0224J4833J1344Q327M606k43n562r853j2457j4799j8844
$$ 1866044 1894034 1914258 1929091 1940435 1948762 1953368 1953125 1947563 1937710 1925253 1910454 1891610
50859A891610k4351k9010l1438l2581l3762l4730l4595l3600l2845l2779l2807
$$ 1891610 1867259 1838249 1806811 1774230 1740468 1705738 1671143 1637543 1604698 1571919 1539112
50848A539112l1997k9603k5477k0709j7402j6881j8183j8903j7621j5212j3688
$$ 1539112 1507115 1477512 1452035 1431326 1413924 1397043 1378860 1359957 1342336 1327124 1313436
50837A313436j3981j4891j4381j1995r581r146j0443j1521j1323j0395r169p158
$$ 1313436 1299455 1284564 1270183 1258188 1248607 1239461 1229018 1217497 1206174 1195779 1186610 1179452
50825A179452m472k667k900m215m831m457m148m274l911k229L05K261K437R30
$$ 1179452 1174980 1172313 1169413 1165198 1160367 1155910 1151762 1147488 1143577 1141348 1141653 1143914 1146351 1147281
50811A147281o59n28J454L668M901N758P284R163J0358J0833J1406J2162J2411
$$ 1147281 1146622 1146094 1147548 1151216 1156117 1161875 1169159 1178322 1188680 1199513 1210919 1223081 1235492
50798A235492J2146J2378J3794J5878J7491J7783J6783J5782J6792K0557K5237
$$ 1235492 1247638 1260016 1273810 1289688 1307179 1324962 1341745 1357527 1374319 1394876 1420113
50787A420113K8041K8163K7229K7005K7847K9388L1387L3489L5153L6355L7703
$$ 1420113 1448154 1476317 1503546 1530551 1558398 1587786 1619173 1652662 1687815 1724170 1761873
50776A761873L9595M1918M4579M7370M9299M9371M8497M9390N3681O0037O5728
$$ 1761873 1801468 1843386 1887965 1935335 1984634 2034005 2082502 2131892 2185573 2245610 2311338
50765B311338O9340P1312P2764P4740P7897Q1856Q5197Q6870Q7245Q7075Q5956
$$ 2311338 2380678 2451990 2524754 2599494 2677391 2759247 2844444 2931314 3018559 3105634 3191590
50754C191590Q2742P7128O9806O1171N0881L8864K5928J2994K59j2510k4995l5950
$$ 3191590 3274332 3351460 3421266 3482437 3533318 3572182 3598110 3611104 3611363 3598853 3573858 3537908
50742C537908m3850m8099m9676n0186n0187m8725m4735l8401l0742k2439j3776
$$ 3537908 3494058 3445959 3396283 3346097 3295910 3247185 3202450 3164049 3133307 3110868 3097092
50731C097092n375K033Q661J5687K3753L1944L8633M3120M6050M8256M9542M8713
$$ 3097092 3091717 3093750 3102411 3118098 3141851 3173795 3212428 3255548 3301598 3349854 3399396 3448109
50719C448109M4844L8435L1132K4366J8452J2999P748K542l276j0742k0155l0344
$$ 3448109 3492953 3531388 3562520 3586886 3605338 3618337 3626085 3628627 3625351 3614609 3594454 3564110
50707C564110l9578m7364n5036o4221p4664q4099r0421r3584r4973r5401r4486
$$ 3564110 3524532 3477168 3422132 3357911 3283247 3199148 3108727 3015143 2920170 2824769 2730283
50696B730283r1829q7831q3072p7606p1409o5110n9654n5221n0758m4828l7046
$$ 2730283 2638454 2550623 2467551 2389945 2318536 2253426 2193772 2138551 2087793 2042965 2005919
50685B005919k8835k2425j8714j6228j2717p559k116K130M983P186R609J2913
$$ 2005919 1977084 1954659 1935945 1919717 1907000 1899441 1897325 1899455 1904438 1911624 1921233 1934146
50673A934146J7089K1033K3433K4382K5346K7189K9298L0912L2269L3620L4237
$$ 1934146 1951235 1972268 1995701 2020083 2045429 2072618 2101916 2132828 2165097 2198717 2232954
50662B232954L3319L1196K8821K6831K5758K6042K6900K6387K4056K2335K3400
$$ 2232954 2266273 2297469 2326290 2353121 2378879 2404921 2431821 2458208 2482264 2504599 2527999
50651B527999K5541K5110K1856J9877K2642K9073L5452L9498M1543M3154M5871
$$ 2527999 2553540 2578650 2600506 2620383 2643025 2672098 2707550 2747048 2788591 2831745 2877616
50640B877616N0266N5039N7811N7787N6854N7045N7700N6484N2573M7403M2460
$$ 2877616 2927882 2982921 3040732 3098519 3155373 3212418 3270118 3326602 3379175 3426578 3469038
50629C469038L7847L3312K9527K7570K7776K9611L2431L5880L9747M3858M8182
$$ 3469038 3506885 3540197 3569724 3597294 3625070 3654681 3687112 3722992 3762739 3806597 3854779
50618C854779N2928N8349O4365P0582P6912Q4091R3140J04149J15994J27395J37914
$$ 3854779 3907707 3966056 4030421 4101003 4177915 4262006 4355146 4459295 4575289 4702684 4840598
50607D840598J47581J55895J61568J63228J60248J53245J43902J33907J23761
$$ 4840598 4988179 5144074 5305642 5468870 5629118 5782363 5926265 6060172 6183933
50598F183933J13051J02061R2383Q5164P9126P1336N9933M5477K9751J4119p05
$$ 6183933 6296984 6399045 6491428 6576592 6655718 6727054 6786987 6832464 6862215 6876334 6875629
50587F875629j4296k6633l8096m8599n6914o1520o2174o0100n6566n1681m4913
$$ 6875629 6861333 6834700 6796604 6748005 6691091 6629571 6567397 6507297 6450731 6399050 6354137
50576F354137l6360k7116j8483j1318o222l851m500p476j1375j5223j9157k3853
$$ 6354137 6317777 6290661 6272178 6260860 6254638 6250787 6246287 6238811 6227436 6212213 6193056 6169203
50564F169203k9435l5013l9270m1594m3107m6680n5079o8181q2013r1282r3183
$$ 6169203 6139768 6104755 6065485 6023891 5980784 5934104 5879025 5810844 5728831 5637549 5544366
50553E544366q8575p9860o8800n6644m5013l5248k7250k0148j4109j0491j0108
$$ 5544366 5455791 5375931 5307131 5250487 5205474 5170226 5142976 5122828 5108719 5098228 5088120
50542E088120j2599j7762k6249l8064n1390o4057p5529q6273r5700j02348j06033
$$ 5088120 5075521 5057759 5031510 4993446 4942056 4877999 4802470 4716197 4620497 4518149 4412116
50531D412116j08298j10234j11052j09497j05714j00955r5952r0324q3274p4520
$$ 4412116 4303818 4193584 4082532 3973035 3867321 3766366 3670414 3580090 3496816 3422296
50521C422296o4828n5686m7984m0840l2613k3230j4533p937k838K047O925J1539
$$ 3422296 3357468 3301782 3253798 3212958 3180345 3157115 3142582 3134645 3131807 3133854 3140779 3152318
50509C152318J6388K1981K7487L1560L4162L6343L8604M0792M3351M7220N2438
$$ 3152318 3168706 3190687 3218174 3249734 3283896 3320239 3358843 3399635 3442986 3490206 3542644
50498C542644N8160O4112P0858P8586Q6883R5841J06020J17060J27689J37389
$$ 3542644 3600804 3664916 3735774 3814360 3901243 3997084 4103104 4220164 4347853 4485242
50488D485242J46586J54747J59933J61219J60126J58529J56364J52665J47872
$$ 4485242 4631828 4786575 4946508 5107727 5267853 5426382 5582746 5735411 5883283
50479E883283J43655J41152J40657J42389J46032J49908J52132J52506J52071
$$ 5883283 6026938 6168090 6308747 6451136 6597168 6747076 6899208 7051714 7203785
50470G203785J51016J48611J45267J42971J43032J44658J46565J48790J51908
$$ 7203785 7354801 7503412 7648679 7791650 7934682 8079340 8225905 8374695 8526603
50461H526603J55151J56770J55951J53295J49152J42447J31625J16227R6798P3599
$$ 8526603 8681754 8838524 8994475 9147770 9296922 9439369 9570994 9687221 9784019 9857618
50451I857618M6255J5160j7550m9368p9687j09836j40379j69150j92631k08878
$$ 9857618 9903873 9919033 9901483 9852115 9772428 9662592 9522213 9353063 9160432 8951554
50441H951554k18269k21765k19547k11622j98751j82058j62131j39100j13525
$$ 8951554 8733285 8511520 8291973 8080351 7881600 7699542 7537411 7398311 7284786
50432G284786q6839o1041l8109j9522o030J999L748k118j6240l7273o2335q8814
$$ 7284786 7197947 7136906 7098797 7079275 7073245 7075244 7078992 7076874 7060634 7023361 6961026 6872212
50420F872212j15237j40320j62025j78469j89602j97015k01915k04047k03050
$$ 6872212 6756975 6616655 6454630 6276161 6086559 5889544 5687629 5483582 5280532
50411E280532k00036j96727j93254j87992j79826j69719j59475j49658j39609
$$ 5280532 5080496 4883769 4690515 4502523 4322697 4152978 3993503 3843845 3704236
50402C704236j29070j18801j09427j00558r1420q1977p2917o4867n7969n1964
$$ 3704236 3575166 3456365 3346938 3246380 3154960 3072983 3000066 2935199 2877230 2825266
50392B825266m6314m0360l3969k8034k3790k1273j8930j5222j0368o020l206j131
$$ 2825266 2778952 2738592 2704623 2676589 2652799 2631526 2612596 2597374 2587006 2580986 2577780 2576649
50380B576649J829O329J1444J5729J8662K1014K3908K7572L1288L4591L7964M2046
$$ 2576649 2578478 2584807 2596251 2611980 2630642 2651656 2675564 2703136 2734424 2769015 2806979 2849025
50368B849025M6627N1149N5730O0763O5715O9513P2128P4702P7715Q0381Q2285
$$ 2849025 2895652 2946801 3002531 3063294 3129009 3198522 3270650 3345352 3423067 3503448 3585733
50357C585733Q4372Q7504R1285R5206R9786J05363J10812J14942J18253J21787
$$ 3585733 3670105 3757609 3848894 3944100 4043886 4149249 4260061 4375003 4493256 4615043
50347D615043J24897J25955J24673J21943J17695J10916J01787R1811Q1644P0551
$$ 4615043 4739940 4865895 4990568 5112511 5230206 5341122 5442909 5534720 5616364 5686915
50337E686915N8302M5604L2191J6387k495k3040m3785o4749q5841j05289j20959
$$ 5686915 5745217 5790821 5823012 5839399 5836904 5813864 5770079 5705330 5619489 5514200 5393241
50326E393241j32125j38945j41352j39581j34601j27011j16544j03562q9811p6702
$$ 5393241 5261116 5122171 4980819 4841238 4706637 4579626 4463082 4359520 4269709 4193007
50316D193007o4100n1827m0861l1750k3462j5592j0287r979j4300k1212l0110
$$ 4193007 4128907 4077080 4036219 4004469 3981007 3965415 3955128 3945149 3930849 3909637 3879527
50305C879527m1453n4223o6253p6695q5776r2479r5175r4711r4164r4846r4791
$$ 3879527 3838074 3783851 3717598 3640903 3555127 3462648 3367473 3272762 3178598 3083752 2988961
50294B988961r2071q7532q3196p9763p6830p4145p1505o8463o4992o1596n8299
$$ 2988961 2896890 2809358 2726162 2646399 2569569 2495424 2423919 2355456 2290464 2228868 2170569
50283B170569n4590n0577m6888m3092l8013l2280k8571k8145k8740k7455k4233
$$ 2170569 2115979 2065402 2018514 1975422 1937409 1905129 1876558 1848413 1819673 1792218 1767985
50272A767985k0898j8110j5264j2664j1501j1707j1570r858p152m864l870m174
$$ 1767985 1747087 1728977 1713713 1701049 1689548 1677841 1666271 1656413 1649261 1644397 1640527 1636353
50260A636353n000n070l595j075J500M131P574J1693J5125J6964J8006J9698K2351
$$ 1636353 1631353 1626283 1622688 1621613 1623113 1627244 1634818 1646511 1661636 1678600 1696606 1716304 1738655
50247A738655K5084K7230K9044L0836L1930L1067K7695K2487J6541J0819O417
$$ 1738655 1763739 1790969 1820013 1850849 1882779 1913846 1941541 1964028 1980569 1991388 1997805
50236A997805M386M440M615L456K022K291L833L972J500j628l204l533l971m268
$$ 1997805 2002191 2006631 2011246 2014702 2016724 2019015 2022848 2026820 2028320 2026692 2023488 2019955 2015984 2011716
50222B011716l210r02J670M780R419J4337J5622J0308m93j2534k1694k5918k5243
$$ 2011716 2008506 2007604 2009274 2014054 2023473 2037810 2053432 2063740 2063247 2050713 2029019 2003101 1977858
50209A977858k1210j6060j1678q814p156n919m406k539r32k51l65l65N59K494
$$ 1977858 1956648 1940588 1928910 1920096 1912940 1907021 1902615 1900076 1899144 1898893 1898528 1898163 1898722 1901216
50195A901216M900O953P932P846P756Q877J1180J3244J3813J3103J2312J2177
$$ 1901216 1906116 1913069 1921001 1928847 1936603 1945480 1956660 1969904 1983717 1996820 2009132 2021309
50183B021309J2426J2597J2908J4042J6126J8330J9800K0857K2786K6273L0427
$$ 2021309 2033735 2046332 2059240 2073282 2089408 2107738 2127538 2148395 2171181 2197454 2227881
50172B227881L3818L6172L8594M2211M7060N2350N7458O2473O8106P5114Q3697
$$ 2227881 2261699 2297871 2336465 2378676 2425736 2478086 2535544 2598017 2666123 2741237 2824934
50161B824934R3241J02772J11709J20201J28697J37121J44320J48347J47508J41390
$$ 2824934 2918175 3020947 3132656 3252857 3381554 3518675 3662995 3811342 3958850 4100240
50151D100240J30954J17771J03458Q9556P7343O7285N8900N1244M3284L3689K0722
$$ 4100240 4231194 4348965 4452423 4541979 4619322 4686607 4745507 4796751 4840035 4873724 4894446
50140D894446K736k1136n0471q3126j15311j43007j63947j77974j85458j86329
$$ 4894446 4897182 4876046 4825575 4742449 4627138 4484131 4320184 4142210 3956752 3770423
50130C770423j81092j71759j60617j48523j35403j21902j09385r8393q8481p9807
$$ 3770423 3589331 3417572 3256955 3108432 2973029 2851127 2741742 2643349 2554868 2475061
50120B475061p3658p0667o9233o6560o1138n3808m6729m1557l8429l6141l3298
$$ 2475061 2401403 2330736 2261503 2194943 2133805 2079997 2033268 1991711 1953282 1917141 1883843
50109A883843k9412k5104k1418j8892j7150j5185j2326r081o625n279l999j864
$$ 1883843 1854431 1829327 1807909 1789017 1771867 1756682 1744356 1735275 1728650 1723371 1719372 1717508
50097A717508M73J690J784K090L377M917N853O504P806J0024J2655J5150J7083
$$ 1717508 1717981 1719671 1721455 1723545 1726922 1731839 1737692 1744196 1752002 1762026 1774681 1789831 1806914
50084A806914J8002J7724J6754J5964J5771J5908J5912J5584J5069J4779J5321
$$ 1806914 1824916 1842640 1859394 1875358 1891129 1907037 1922949 1938533 1953602 1968381 1983702
50073A983702J7207K0372K4079K7554L0669L3789L6772L8666L8986L9041M0885
$$ 1983702 2000909 2021281 2045360 2072914 2103583 2137372 2174144 2212810 2251796 2290837 2331722
50062B331722M4865M9133N2125N4567N8041O2493O6592P0023P3978P9163Q4952
$$ 2331722 2376587 2425720 2477845 2532412 2590453 2652946 2719538 2789561 2863539 2942702 3027654
50051C027654R0982R8246J07718J18815J30254J41868J54717J69645J86533K04805
$$ 3027654 3118636 3216882 3324600 3443415 3573669 3715537 3870254 4039899 4226432 4431237
50041D431237K24006K43535K61970K76732K84689K83723K74079K58019K38322
$$ 4431237 4655243 4898778 5160748 5437480 5722169 6005892 6279971 6537990 6776312
50032F776312K17612J98747J84390J75107J68383J60135J46882J26187R6103N5795
$$ 6776312 6993924 7192671 7377061 7552168 7720551 7880686 8027568 8153755 8249858 8305653
50022H305653O798m7193j02033j54326k01313k40860k71977k94885l10059l17553
$$ 8305653 8312451 8265258 8163225 8008899 7807586 7566726 7294749 6999864 6689805 6372252
50012F372252l17583l11450l01270k88555k73403k55372k35065k14296j94526
$$ 6372252 6054669 5743219 5441949 5153394 4879991 4624619 4389554 4175258 3980732
$$ [...]
##END NTUPLES=NMR SPECTRUM
##END=
