
##TITLE=UV1156_M5-1005-1002_6301942_61RBpldRb7
##JCAMPDX= 6.0         $$ Bruker NMR JCAMP-DX V2.0
##DATA TYPE= NMR SPECTRUM
##DATA CLASS= NTUPLES
##ORIGIN= BRUKER
##OWNER= Administrator
$$ 1.72 TOPSPIN		Version 2.1
$$ 2012-06-06 04:09:05.546 -0500  Administrator@TOPSPIN
$$ Compression mode = diff/dup
##.OBSERVE FREQUENCY= 400.13188235
##.OBSERVE NUCLEUS= ^1H
##.ACQUISITION MODE= SIMULTANEOUS (DQD)
##.ACQUISITION SCHEME= undefined
##.AVERAGES= 8
##.DIGITISER RES= 22
##SPECTROMETER/DATA SYSTEM= spect
##.PULSE SEQUENCE= zg30
##.SOLVENT NAME= COFFEE_meoh
##.SHIFT REFERENCE= INTERNAL, COFFEE_meoh, 1, 14.98061
##AUDIT TRAIL= $$ (NUMBER, WHEN, WHO, WHERE, PROCESS, VERSION, WHAT)
$$ ##TITLE= Audit trail, TOPSPIN		Version 2.1
$$ ##JCAMPDX= 5.01
$$ ##ORIGIN= Bruker BioSpin GmbH
$$ ##OWNER= Administrator
$$ $$ C:\Bruker\TOPSPIN/data/COFFEE/nmr/UV1156_M5-1005-1002_6301942_61RBpldRb7/10/pdata/1/auditp.txt
$$ ##AUDIT TRAIL=  $$ (NUMBER, WHEN, WHO, WHERE, PROCESS, VERSION, WHAT)
(   1,<2012-06-06 04:08:58.765 -0500>,<Administrator>,<TOPSPIN>,<go>,<TOPSPIN 2.1>,
      <created by zg
	started at 2012-06-06 04:07:51.671 -0500,
	POWCHK enabled, PULCHK disabled,
       configuration hash MD5:
       D5 CA 7A 23 FE 6B EE E2 50 67 74 61 24 F7 5E 3B
       data hash MD5: 64K
       E7 C9 37 96 D2 1D 8B 4E B0 79 4A E7 66 66 04 F4>)
(   2,<2012-06-06 04:09:01.390 -0500>,<Administrator>,<TOPSPIN>,<proc1d>,<TOPSPIN 2.1>,
      <Start of raw data processing
       efp LB = 0 FT_mod = 6 PKNL = 1 PHC0 = 0 PHC1 = 0 SI = 32K 
       data hash MD5: 32K
       77 B3 6D 00 14 F6 73 01 0B C0 D0 B6 06 B0 16 D8>)
(   3,<2012-06-06 04:09:01.812 -0500>,<Administrator>,<TOPSPIN>,<proc1d>,<TOPSPIN 2.1>,
      <pk PHC0 = 211.3989 PHC1 = 0 
       data hash MD5: 32K
       FE 6C 19 9D 23 E5 DA 55 F9 3F 7B 32 66 E9 39 49>)
(   4,<2012-06-06 04:09:01.921 -0500>,<Administrator>,<TOPSPIN>,<proc1d>,<TOPSPIN 2.1>,
      <abs ABSG = 1 
       data hash MD5: 32K
       C9 0F 48 80 3F EC 32 41 B3 97 82 2A EB 08 70 F0>)
(   5,<2012-06-06 04:09:01.953 -0500>,<Administrator>,<TOPSPIN>,<proc1d>,<TOPSPIN 2.1>,
      <abs ABSG = 2 
       data hash MD5: 32K
       B9 B8 1F C0 23 96 CA 9F 93 EB A2 AB FA 0C 94 95>)
(   6,<2012-06-06 04:09:01.984 -0500>,<Administrator>,<TOPSPIN>,<proc1d>,<TOPSPIN 2.1>,
      <abs ABSG = 3 
       data hash MD5: 32K
       0B 18 CD 69 B3 34 4A DF 37 E7 1D 1B 12 EC 6B A7>)
(   7,<2012-06-06 04:09:02.015 -0500>,<Administrator>,<TOPSPIN>,<proc1d>,<TOPSPIN 2.1>,
      <abs ABSG = 4 
       data hash MD5: 32K
       33 06 44 D6 0A AE 24 7F B0 DF 41 34 54 94 11 32>)
(   8,<2012-06-06 04:09:02.046 -0500>,<Administrator>,<TOPSPIN>,<proc1d>,<TOPSPIN 2.1>,
      <abs ABSG = 5 
       data hash MD5: 32K
       80 DE B1 1C D8 AE FD 72 3D 93 A0 F1 70 40 34 90>)
$$ ##END=
$$ 
$$ $$ hash MD5
$$ $$ C1 0C 09 09 1B 2F 91 4B 86 46 13 69 D0 2D B9 D4
##$RELAX= 
##$RELAX= 
##$RELAX= 
##$RELAX= 
##$RELAX= 
##$RELAX= 
##$RELAX= 
$$ Bruker specific parameters
$$ --------------------------
$$ [...]
150 150 150 150 150 150 150 150
##$TP07= 0
##$TPNAME0= <>
##$TPNAME1= <>
##$TPNAME2= <>
##$TPNAME3= <>
##$TPNAME4= <>
##$TPNAME5= <>
##$TPNAME6= <>
##$TPNAME7= <>
##$TPOAL= (0..7)
0.5 0.5 0.5 0.5 0.5 0.5 0.5 0.5
##$TPOFFS= (0..7)
0 0 0 0 0 0 0 0
##$TUNHIN= 0
##$TUNHOUT= 0
##$TUNXOUT= 0
##$USERA1= <user>
##$USERA2= <user>
##$USERA3= <user>
##$USERA4= <user>
##$USERA5= <user>
##$V9= 5
##$VALIST= <valist>
##$VCLIST= <CCCCCCCCCCCCCCC>
##$VD= 0
##$VDLIST= <DDDDDDDDDDDDDDD>
##$VPLIST= <PPPPPPPPPPPPPPP>
##$VTLIST= <TTTTTTTTTTTTTTT>
##$WBST= 2048
##$WBSW= 25
##$XGAIN= (0..3)
0 0 0 0
##$XL= 0
##$YL= 0
##$YMAX_a= 509310
##$YMIN_a= -610032
##$ZGOPTNS= <>
##$ZL1= 120
##$ZL2= 120
##$ZL3= 120
##$ZL4= 120
##$ABSF1= 14.98061
##$ABSF2= -5.57192
##$ABSG= 5
##$ABSL= 3
##$ALPHA= 0
##$AQORDER= 0
##$ASSFAC= 0
##$ASSFACI= 0
##$ASSFACX= 0
##$ASSWID= 0
##$AUNMP= <proc_prof1d_extract_pilot.lims>
##$AXLEFT= 0
##$AXNAME= <>
##$AXNUC= <1H>
##$AXRIGHT= 0
##$AXTYPE= 0
##$AXUNIT= <>
##$AZFE= 0.1
##$AZFW= 0.1
##$BCFW= 0
##$BC_mod= 0
##$BYTORDP= 0
##$COROFFS= 0
##$CY= 15
##$DATMOD= 1
##$DC= 0
##$DFILT= <>
##$DTYPP= 0
##$F1P= 0
##$F2P= 0
##$FCOR= 0.5
##$FTSIZE= 32768
##$FT_mod= 6
##$GAMMA= 0
##$GB= 0
##$INTBC= 1
##$INTSCL= 1
##$ISEN= 128
##$LB= 0
##$LEV0= 0
##$LPBIN= 0
##$MAXI= 10000
##$MC2= 0
##$MEAN= 0
##$ME_mod= 0
##$MI= 0
##$NCOEF= 0
##$NC_proc= -8
##$NLEV= 6
##$NOISF1= 0
##$NOISF2= 0
##$NSP= 0
##$NTH_PI= 0
##$NZP= 0
##$OFFSET= 14.98061
##$PC= 1
##$PHC0= 211.3989
##$PHC1= 0
##$PH_mod= 1
##$PKNL= yes
##$PPARMOD= 0
##$PPDIAG= 0
##$PPIPTYP= 0
##$PPMPNUM= 2147483647
##$PPRESOL= 1
##$PSCAL= 4
##$PSIGN= 0
##$PYNMP= <proc.py>
##$REVERSE= no
##$SF= 400.13
##$SI= 32768
##$SIGF1= 0
##$SIGF2= 0
##$SINO= 400
##$SIOLD= 32768
##$SPECTYP= <>
##$SREGLST= <1H.CDCl3>
##$SSB= 0
##$STSI= 32768
##$STSR= 0
##$SW_p= 8223.68421052632
##$SYMM= 0
##$S_DEV= 0
##$TDeff= 65536
##$TDoff= 0
##$TI= <>
##$TILT= no
##$TM1= 0
##$TM2= 0
##$TOPLEV= 0
##$USERP1= <user>
##$USERP2= <user>
##$USERP3= <user>
##$USERP4= <user>
##$USERP5= <user>
##$WDW= 1
##$XDIM= 32768
##$YMAX_p= 458796356
##$YMIN_p= -749518
##$CURPLOT= <Network HP LaserJet P1505>
##$CURPRIN= <$Network HP LaserJet P1505>
##$DFORMAT= <normdp>
##$LAYOUT= <+/1D_H.xwp>
##$LFORMAT= <normlp>
##$PFORMAT= <normpl>
##$SURQMSG= 1
$$ End of Bruker specific parameters
$$ ---------------------------------
##NTUPLES= NMR SPECTRUM
##VAR_NAME=  FREQUENCY,     SPECTRUM/REAL,   SPECTRUM/IMAG
##SYMBOL=    X,             R,               I
##VAR_TYPE=  INDEPENDENT,   DEPENDENT,       DEPENDENT
##VAR_FORM=  AFFN,          ASDF,            ASDF
##VAR_DIM=   32768,         32768,           32768
##UNITS=     HZ,            ARBITRARY UNITS, ARBITRARY UNITS
##FACTOR=    0.250966925370066, 1,           1
##FIRST=     8223.43324360095, -119948,      -15898
##LAST=      0,             54123,           -243877
##MIN=       0,             -749518,         0
##MAX=       8223.43324360095, 458796356,    0
$$ Real data points
##PAGE= N=1
##DATA TABLE= (X++(R..R)), XYDATA
$$ [...]
19538G5188f9602j71098a17566L7457A33918j382J09808F9226d3762k9365A68723
19526C73272c7826E771b64630e5574m7409o438p6285r8509J35045A78603a53654
19514H8386Q9707D2070k0188d21729h3108B740j010K56339C7025h3834j34773
19503b18607Q5929f4744L1914j47842A37657a06278p2794A1907b8835q499l07321
19492c44655A93117d9762m8522B64884F3189a01121q1096L520c7224j4850l37674
19481c89748e0894J3002j72573L8503A76558b83877A89049b01269b5750r7422
19471a23172j24527b363H5173b47809D2344b2470k5089G1834c18479a2547k99019
19460c11566A51070p329f4956J681A55543J1306p3702C1672i3410J6279n2570
$$ y = [75188, -69602, -240700, -117566, -80109, 133918, 132536, 242344, 69226, -43762, -73127, 168723, 373272, -37826, 5771, -264630, -55574, -102983, -109421, -185706, -284215, -149170, 178603, -153654, 88386, 178093, 42070, 21882, -421729, -83108, 2740, 1730, 258069, 37025, -83834, -218607, -132678, -64744, -32830, -180672, 137657, -106278, -179072, 11907, -28835, -37334, -344655, 193117, -49762, -98284, 264884, 63189, -101121, -182217, -178697, -37224, -52074, -389748, -50894, -37892, -210465, -171962, 176558, -283877, 189049, -201269, -25750, -123172, -247699, -2363, 85173, -247809, 42344, -22470, -47559, 71834, -318479, -12547, -311566, 151070, 143741, -64956, -63275, 155543, 166849, 93147, 31672, -93410, -77131, -129701]
19449a29701J3892a8951A06014a92383A16208h8008H0770K0298b3065l8429Q191
19438e3303E9892N5133E0181e2460j97542h8432j8173b2128j23597L6027G675
19426D15791c13710a29997j59728D8905d6920A59531G3041b27672I6042a4559
19415d17617a64357C9817b673p8679C3042a35518A67549C8719M2908a86727A03933
19403B3108a63550C75981a11945k7859A5268g9139A28965n3389J7744b5573N007
19392b0566A18632c72594I3354a08018D0614R9041a54842C13860f3074K1425r824
19381e1473k9378m53804a86223f838j45354C3765d01225A5421K4075J80658a60185
19369a12710A01377K424l5197b82800a21761j914B1934a9921p7262C8941a24782
$$ y = [-129701, -115809, -18951, 106014, -192383, 116208, -88008, 80770, 101068, -23065, -61494, -53303, 59892, 115025, 50181, -52460, -250002, -88432, -106605, -22128, -145725, -109698, 7675, 415791, -313710, -129997, -289725, 48905, -46920, 159531, 73041, -227672, 96042, -14559, -417617, -164357, 39817, -2673, -81352, 33042, -135518, 167549, 38719, 81627, -186727, 103933, 23108, -163550, 375981, -111945, -139804, 15268, -79139, 128965, 75576, 93320, -25573, -20566, 118632, -372594, 93354, -108018, 40614, 139655, -154842, 313860, -63074, -41649, -51473, -80851, -534655, -186223, -6838, -152192, 33765, -401225, 15421, 39496, 220154, -160185, -112710, 101377, 103801, 68604, -282800, -121761, -123675, 21934, -19921, -97183, 38941, -124782]
19357d9034I3035d1522l55370a57671N3684A32662a58312B16163b0662j97447
19347b18109B63500b17815E1646b74900h9671A04550R7030C9782a0051p4261A16563
19335a05182b0888k10062C1274J17739b58180G7927a04392A03033c0950A50437
19324H4928L9924J900b14535b0210C00664a25940L3749n4572f6002j03469b3442
19312F5741K2836b63093K9443j94374d6757C52619b69089j4001J40862d1471l6669
19301g8140j27964H5781j9543g8641k97868J82794R4508l119a3422k51839A7646
19289f4522A47160j8857a46295O6735B6819J05150b43272R3109k07796I5049a34491
19277C660i1514K4088m9747K7953k67798a5946q4328A35113M00485e0746k71260
$$ y = [-49034, 93035, -41522, -396892, -157671, -103987, 132662, -158312, 216163, -20662, -218109, 263500, -217815, 51646, -274900, -89671, 104550, 201580, 39782, -10051, -84312, 116563, -105182, -20888, -230950, 31274, 149013, -258180, 77927, -104392, 103033, -30950, 150437, 84928, 124852, 126752, -214535, -20210, 300664, -125940, -92191, -146763, -66002, -169471, -23442, 65741, 88577, -263093, -233650, -428024, -46757, 352619, -269089, -283090, -142228, -41471, -78140, -206104, 85781, 66238, -78641, -376509, -193715, -99207, -102326, -13422, -265261, 17646, -64522, 147160, 128303, -146295, -79560, 26819, 131969, -243272, -150163, -357959, 95049, -134491, 3660, -91514, -67426, -117173, -89220, -357018, -15946, -100274, 135113, 535598, -50746, -322006]
19266c22006A5921a767B13453b63641j99648H1283e0567j27973B07230a65362
19255a1926B20552a20869o3208A80650a67940A6090O389J24934J0373a58986e2123
19243f8590q7812N040l7922B8097d6481m74212K09798H7078a77546a2232m4175
19232e6407p3882n0437j2348G1500A0423b01685f3199K4043l30942A22902a06617
19220A92983g3485m3446B34751b45458H2674b2728j80796A65191a01429D66539
19209g6418B16707a29902o0516k31395H730b60004b4811j96944i2328o3887N0760
19198a05455d8179k7387p4706K7132k85425a00692a2598j76437l7662B90670B857
19186b97203P7885o4621A4774b29384J06178l1558K9683o6211P164d0663A13530
$$ y = [-322006, 15921, -1767, 213453, -263641, -463289, 81283, -50567, -178540, 207230, -165362, -11926, 220552, -120869, -184077, 180650, -167940, 16090, 22479, 147413, 157786, -158986, -52123, -68590, -156402, -151362, -189284, 28097, -46481, -520693, -310895, 87078, -177546, -12232, -56407, -130289, -180726, -193074, 71500, 10423, -201685, -63199, -39156, -370098, 122902, -106617, 192983, -73485, -116931, 234751, -245458, 82674, -22728, -203524, 165191, -101429, 466539, -76418, 216707, -129902, -190418, -421813, 8730, -260004, -24811, -221755, -92328, -156215, -105455, -48179, -75566, -150272, -123140, -408565, -100692, -12598, -189035, -226697, 290670, 2857, -297203, -219318, -283939, 14774, -229384, -123206, -154764, -125081, -191292, -184128, -40663, 113530]
19174A28531b34242J0380c4699I2923a32868E5135a24261k2234r4836g229q7415
19163i4644c3414j46585e7080k00229I7683b52403c526k72748a22666k02860a39071
19151e2604A27152D3682J88282a05028C5726a40227q0955Q8165E3500a85279F997
19139B37743j01926j5305a61113B9194Q4516g6426j78297B59795j20785a70697
19128B36917j17695a15530B05099b8199B48073b13275j725j5705d9330j06418
19118a55748c2846G8262a16192L3353P355j3134c5928A7500f5037a4526I657c23735
19105c31177e7493B73415r8262b04295a8241C8966a98213b6637l5891p1426C7277
19093d6252F4993a17709I2294C6479f9419B36704i7933I2205D2989a11720k143
$$ y = [128531, -234242, -223862, -34699, 92923, -132868, 55135, -124261, -146495, -241331, -7229, -94644, -33414, -179999, -57080, -257309, 97683, -252403, -3526, -276274, -122666, -325526, -139071, -52604, 127152, 43682, 231964, -105028, 35726, -140227, -221182, -133017, 53500, -185279, 6997, 237743, 135817, 120512, -161113, 29194, 113710, -76426, -254723, 259795, 139010, -170697, 236917, 119222, -115530, 205099, -28199, 248073, -213275, -215000, -230705, -49330, -155748, -32846, 78262, -116192, -82839, -75484, -88618, -35928, 17500, -65037, -14526, 9657, -323735, -331177, -57493, 273415, 175153, -204295, -18241, 38966, -198213, -26637, -62528, -133954, 37277, -46252, 64993, -117709, 92294, 36479, -69419, 236704, -97933, 92205, 42989, -111720, -113863]
19082a13863k56560a28568k53031C4132a70645B7956a64004K861g397j20867q4675
19071b12939o4508b7342A73450m8712a32413k5360e1550j42836j09464A2729J27107
19060A39836e2039C3714h9196p1134B57500c2259N59k42323l7418A78935a58874
19048B31369E0196R4679f8855B77588i1261A83374a46470n906b3419j2321A27862
19036e39209C466N4009d98682B2806b39659a2692B26092c47468b5879A23521b52260
19024a69353D3675d524j84029A53718a22254j16901B06927a88716A56915i303
19013c2923j19374a0720j58947A88482r1365a94357j2817k77252K06250a31091
19002c2881F7924b33458h0093a1439l84954b504C3409a2333B77248G892L06639
$$ y = [-113863, -370423, -128568, -381599, 34132, -170645, 27956, -164004, -161143, -7397, -128264, -212939, -277447, -27342, 173450, 124738, -132413, -157773, -51550, -194386, -303850, 12729, 139836, -52039, 33714, -89196, -160330, 257500, -32259, -31700, -274023, -311441, 178935, -158874, 231369, 50196, 144875, -68855, 277588, -91261, 183374, -146470, -152376, -23419, -35740, 127862, -539209, 3466, 57475, -498682, 22806, -239659, -12692, 226092, -347468, -25879, 123521, -252260, -169353, 43675, -4524, -188553, 153718, -122254, -239155, 206927, -188716, 156915, -9303, -32923, -152297, -10720, -169667, 188482, 97117, -194357, -207174, -484426, -278176, -131091, -32881, 67924, -233458, -80093, -11439, -396393, -2504, 33409, -12333, 277248, 7892, 314531]
18991C14531I1913b24033j09655B00020e830k50171F3414J46280b64857A47074
18980A05981b34299f3360E9600b84713m0462J45084C6700N847a38609R831c0724
18968a87326F58302A15311b24570j43866H0969K5637c01472H097b01647c8666
18957a09353m5164M5392F8901d2304A90474A6196J28099M0360i6397B20445m6143
18946A74302G3211Q5601g939A11435b14340R1914A67130c39203Q9851b5413j13346
18935a38759L4738A6607L16495a59880N3174G1381N8145c810C8560N7414h7215
18923b63704b1137k07615P8779L6660a7948A80225c09664i529p3534j7369j30806
18912b31238G3251i4560n7528b0762B12306M0073G5498K66501a41827j72256a49633
$$ y = [314531, 91913, -224033, -333688, 200020, -5830, -256001, 63414, 209694, -264857, 147074, 105981, -234299, -63360, 59600, -284713, -325175, -180091, 36700, 42547, -138609, -128778, -30724, -187326, 658302, 115311, -224570, -368436, 80969, 106606, -301472, 8097, -201647, -38666, -109353, -154517, -109125, 68901, -42304, 190474, 16196, 144295, 184655, -96397, 220445, 174302, 73211, 158812, -7939, 111435, -214340, -122426, 167130, -339203, -249352, -25413, -138759, -104021, 16607, 333102, -159880, -106706, 71381, 129526, -3810, 38560, 95974, -87215, -263704, -21137, -228752, -149973, -113313, -17948, 180225, -309664, -9529, -83063, -100432, -231238, 73251, -94560, -152088, -20762, 212306, 252379, 75498, 341999, -141827, -314083, -149633]
18900e5004A32032D5232c4142j19108f3552F9627c4233A30830e2795k67509D4028
18888G057R5351a47765l7080C3795c3703k9678K6233B16019b00862b8152k87451
18877c15603a25284d7240A36205c9469f402l83179c4334p5436A21286c044A61840
18865b57137A99766I1795i3735l7335j20519a01655M9381p0560J917d96D0095
18853e9240G5017P649d08604e5318F7991M6109c24734a12314k10962C598b92257
18841f9013n8172A15920b1646p0624A3313J318g8761c8465o0876p9868e8080j8193
18829g6273q439D434a01887K4032C2705M6118N9790c01291B17915c47616J6034
18818c31582C46187C4481b22555M6375P7386L3840b7487H8424P9582g3355A78860
$$ y = [-55004, 132032, 45232, -34142, -153250, -63552, 69627, -34233, 130830, -52795, -320304, 44028, 7057, 102408, -147765, -184845, 33795, -33703, -63381, -37148, 216019, -200862, -28152, -315603, -125284, -47240, 136205, -39469, -6402, -389581, -34334, -109770, 121286, -3044, 161840, -257137, 199766, 91795, -93735, -131070, -251589, -101655, -52274, -122834, -120917, -496, 40095, -59240, 75017, 82666, -408604, -55318, 67991, 114100, -324734, -112314, -323276, 3598, -292257, -69013, -127185, 115920, -21646, -92270, 13313, 14631, -78761, -38465, -99341, -179209, -58080, -76273, -84712, 4434, -101887, -77855, 32705, 78823, 138613, -301291, 217915, -347616, -331582, 346187, 34481, -222555, -176180, -98794, -64954, -27487, 88424, 168006, -73355, 178860]
18806a69172I4448i7941c833A33088d52921A17346R3606o6161l2569b60250O5502
18795a94748B49141H801b3659B1146J97661b30316A36677c6884n8866j40232G930
18783A7261J02724b79942A40394E8880M873c00020B49479b06422j5106k29609
18773d51137A77805a78214A23551a12517J6621c605F1033d3762H1140g4285K533
18762g1752A43704C1123b7290I6788e7275A08163m6621a77337A43903o4304l2267
18751D7332a63060j85911G4244H958a85107G6478a07A19150C7333c57552a78625
18739d0352I1512D2425b0221k55674A77799h9925A35285n0183b10508q4829J44269
18728a51068b7947B19125R9255C9419J38951d7406B83390e57577F8865a10015
$$ y = [-169172, 94448, -97941, -3833, 133088, -452921, 117346, 210952, 144791, 112222, -260250, -194748, 249141, 8801, -23659, 21146, 218807, -230316, 136677, -36884, -95750, -235982, 7930, 17261, 119985, -279942, 140394, 58880, 63753, -300020, 249479, -206422, -221528, -451137, 177805, -178214, 123551, -112517, -95896, -3605, 61033, -43762, 81140, -74285, -71752, 143704, 31123, -27290, 96788, -57275, 108163, 61542, -177337, 143903, 79599, 47332, -163060, -348971, 74244, 8958, -185107, 76478, -107, 119150, 37333, -357552, -178625, -40352, 91512, 42425, -20221, -275895, 177799, -89925, 135285, 85102, -210508, -295337, -151068, -27947, 219125, 318380, 39419, 178370, -47406, 283390, -557577, 68865, -110015]
18717a56540M8307A91848b20065i3093m10063i3155k89875J81398p933e512k6468
18706c1980k62256A65383e60220I3982Q1592q1908f8418K608B8721a41946A27190
18694g6539A57293b26296B71J43545E1482i2594J3905l822l3649k7826r5096d4666
18681B21181a77796A22931Q1584I07N4432a00509I3635b85037B2765a4848A51767
18669b05k49120e0164k28331e6059j60071m126H9724a87535H8779r58l4881a74013
18656A7413b3368p4717E7630R1976R178p7831J8311b54775A8515M4435a16263
18644b06105d1613m5775B56341l2804b12340C40136L8022B147P4992b58905E7675
18632a14065B9826i1320j29575g9554G103M4905B494J35952L9247a64275n7196
$$ y = [-156540, -108233, 191848, -220065, -93093, -503156, -93155, -383030, -201632, -209565, -5512, -31980, -294236, 165383, -560220, 93982, 175574, 93666, -68418, -65810, 28721, -141946, 127190, -76539, 157293, -226296, 271, 143816, 51482, -92594, -78689, -82511, -116160, -143986, -239082, -44666, 221181, -177796, 122931, 204515, 907, 55339, -100509, 93635, -285037, 22765, -14848, 151767, -205, -249325, -50164, -278495, -56059, -216130, -220256, 89724, -187535, 88779, 87821, 52940, -174013, 17413, -23368, -98085, 57630, 149606, 158784, 80953, 99264, -254775, 18515, 62950, -116263, -206105, -41613, -87388, 256341, 223537, -212340, 340136, 378158, 2147, 77139, -258905, 57675, -114065, 29826, -91320, -220895, -79554, 7103, 52008, 2494, 138446, 177693, -164275, -221471]
18621b21471P8793N1658c9349E1612f0983K5538k95991J6023A33334j4147c22205
18609b03564f4269j17776k3272c5369l5757M336k0054A71064b14048K7576b7543
18597A93243a16703C7142G897c20462A56629a39572b5637I2888h7915F0638a062
18585c01284c8492C9715d561B2616b73318f6630D8748O7956a76698P8305j85108
18574b83501J02472g3878A68240d37250h366o7884B34272c57533E1905L16365
18564C68270C1412R3599l869a79714d4837B89381H2402c00745o7888J14539K2866
18553b31228B09380b45856E7806b39100A44340b98653A46481m7576h7785L7423
18543e0362j91716A0347m745b33073C6725e9830j65065c556k41158B56888d77130
$$ y = [-221471, -142678, -91020, -39349, 51612, -60983, -35445, -331436, -315413, 133334, 119187, -322205, -203564, -64269, -182045, -205317, -35369, -71126, -66790, -86844, 171064, -214048, -186472, -27543, 193243, -116703, 37142, 7897, -320462, 156629, -139572, -25637, 92888, -87915, 60638, -1062, -301284, -38492, 39715, -4561, 22616, -273318, -66630, 48748, 116704, -176698, -98393, -283501, -181029, -73878, 168240, -437250, -8366, -76250, 234272, -357533, 51905, 368270, 31412, 125011, 121142, -179714, -44837, 289381, 82402, -300745, -368633, -254094, -231228, 209380, -245856, 57806, -239100, 144340, -298653, 146481, 98905, -87785, -50362, -242078, 10347, 5602, -233073, 36725, -59830, -224895, -3556, -244714, 256888, -477130]
18531c0721g417B33629a16998j34624i6197E3262J41852E9701i0976a9620B60283
18519b41257I1578L241a73870L5593g683k8915A69974b40449i4063h805n7177
18508f5982j90188a12978F2977O3424B2321h6931k1100e791k27813d2058B65030
18496d19531C7812J994a45653q2077F9276a44863C0396f3098p481j33234o0796
18485b64609M3545A9963O9957b2365C74853a37672c5342A882M273J47852e0893
18473A72425n3486b76078h300l7289B2394b6615E568a23888C5939a10890K0091
18462i0799A95486k130E2263J71166f4231k07770c3545j28685a1287j31329n3366
18451a95982g2409A54349a89619B83839b94517m1881a25899L3818E5754J32943
$$ y = [-30721, -7417, 233629, -116998, -251622, -96197, 53262, 195114, 59701, -90976, -19620, 260283, -241257, 91578, 94819, -173870, -138277, -7683, -36598, 169974, -240449, -94063, -8805, -65982, -256170, -112978, 62977, 126401, 22321, -86931, -108031, -5791, -233604, -42058, 265030, -419531, 37812, 39806, -145653, -227730, 69276, -144863, 30396, -63098, -70579, -203813, -264609, -221064, 19963, 89920, -22365, 374853, -137672, -35342, 1882, 6155, 154007, -50893, 172425, 118939, -276078, -8300, -45589, 22394, -26615, 5568, -123888, 35939, -110890, -90799, 195486, 193356, 52263, 223429, -64231, -272001, -33545, -162230, -11287, -142616, -195982, -72409, 154349, -189619, 283839, -294517, -336398, -125899, -92081, 55754, 188697]
18441A88697B777b98229a33755p7214A36846b80871P7824j94887F2459b95186
18430a75532A57761A2761J24051a76705Q5863R241j41840B12502a13848q1582
18420a95430k26062J84555Q8375b5648q9914l8530H1621a02260M7939l09749G2029
18408A99450F672f8872k34311A2905a83987A59087a66835k1390A97072d1377k49804
18397b91181a14921i250q8947C4218L8201A8274K11439A1091P9067M1777c70550
18385c01602C0734i0296A31226I31Q8338f723j24470A09291b94098B17183a44184
18373I5909G80J62077b24242A34357D5928d8291j9480K426C6043a32264G8510
18361B1043a15912m2880m0899f5899m1534n0110B42601C4072L6131g4947p7598
$$ y = [188697, 2777, -298229, -133755, -210969, 136846, -280871, -203047, -397934, 62459, -295186, -175532, 157761, 12761, 136812, -176705, -90842, -81601, -223441, 212502, -113848, -195430, -421492, -236937, -148562, -25648, -115562, -154092, 81621, -102260, -54321, -364070, 72029, 199450, 6672, -68872, -303183, 12905, -183987, 159087, -166835, -188225, 197072, -41377, -291181, -114921, -9250, -98197, 34218, 72419, 18274, 229713, 11091, 90158, 131935, -370550, -301602, 30734, -90296, 131226, 931, 89269, -6723, -131193, 109291, -294098, 217183, -144184, 95909, 780, 162857, -224242, 134357, 45928, -48291, -67771, -65345, 36043, -132264, 78510, 21043, -115912, -158792, -199691, -65899, -107433, -157543, 242601, 34072, 70203, -74947, -152545]
18350a52545M7264j37922j2794J05304B6479I076J4439J1993a71208k46366J30553
18339b87021a8745m7986D4268e8246M243a8558n304l31869f0521j33360E0053
18327C9026J76251A9007d9585I1336J00525O0973q0684a44246C0872f5367k28432
18316b93799f9148A1896R0816N6723a63901d1662k29357A78417a52617m7337g5038
18304B95323b26004d3528D3425R2686D2250K9479O6773J41566f3321n2695j84712
18293c00728b6757A341c15555J31892b6164A4267a68949f5433C94790A94810j2560
18282A82250R407k2691b53621h8153B4641b26413A34852j0160e0906B46978O9502
18271C16480B9484c76631a46259l4485A0700b09691b0344j19169b9694k11361
$$ y = [-152545, -105281, -243203, -255997, -150693, 26479, 9076, 23515, 35508, -171208, -417574, -287021, -18745, -66731, 44268, -58246, -54003, -18558, -23862, -355731, -60521, -193881, 50053, 39026, 215277, 19007, -49585, 91336, 191861, 252834, 172150, -144246, 30872, -65367, -293799, -69148, 11896, 102712, 159435, -163901, -41662, -271019, 178417, -152617, -199954, -75038, 295323, -226004, -43528, 43425, 136111, 42250, 71729, 138502, 280068, -63321, -116016, -300728, -26757, 1341, -315555, -183663, -26164, 14267, -168949, -65433, 394790, 194810, 182250, 191657, 168966, -253621, -88153, 24641, -226413, 134852, 124692, -50906, 246978, 316480, 29484, -376631, -146259, -180744, 10700, -209691, -20344, -139513, -29694, -241055]
18261b41055c1971j44809N2641Q648q5818i7995I905a44388l6488C7825A526a11167
18248c6882A43872c5717C56034A69697b46868f7785j61878A11602a23332A7372
18237G1820i6913G5950b86564J40692I6753K2598l6741b17443f1316l12360a6730
18225a56061A51147D5708L02549A03873h6537E2564b13954k3846H8603a11716
18214E6247j7121Q6705D5776a77744Q5224l82331b1885A9463M5013K14685a84632
18202b33116C0206F864K176a32843B63134a02111A79129g4702j25310B50533b49684
18190a05287j29605A52529K05282e935B07572d17979C10599h2777j74334J18388
18180a38723a7158C18847d0909A14121b95951k4646F6583b64023J24080H8660
$$ y = [-241055, -31971, -176780, -124139, -115491, -201309, -97995, 9905, -144388, -180876, 37825, 1526, -111167, -36882, 143872, -35717, 356034, 169697, -246868, -67785, -229663, 111602, -123332, 17372, 71820, -96913, 75950, -286564, -145872, 96753, 119351, 82610, -217443, -61316, -373676, -16730, -156061, 151147, 45708, 348257, 103873, -86537, 52564, -213954, -237800, 88603, -111716, 56247, 39126, 125831, 45776, -177744, -92520, -474851, -21885, 19463, 64476, 279161, -184632, -233116, 30206, 6864, 9040, -132843, 263134, -102111, 179129, -74702, -200012, 250533, -249684, -105287, -234892, 152529, 357811, -5935, 207572, -417979, 310599, -82777, -257111, -138723, -17158, 318847, -40909, 114121, -295951, -320597, 66583, -264023, -139943, 88660]
18169h289B55841o2958D0013f0020E7418P7532a31611d9346C26684B3203i2857
18157a6047k76774h3860j3028c2014p9504l0766e0860C23891D2901J19108d04388
18145b22887B3984i0994B5316b52456i5035b6396n4375j39528b749A51181b66541
18133a09535B26588c25024A08524J94303a9663A89328o2781l7568f5643M865r9161
18122a59939l199n6377n622g6652k15088B0938h390B6696J56762G4733J90423
18111B65156a10975j84534a47022A84152q1388o296a31718I8788g3259B57744
18100b8770j35109g8140K272B83823J3048A44666a13381F3917L86157a30837L5977
18089i4860l02717a09201N2599p8553N7878A33599j9880J08570a39304A64578
$$ y = [-8289, 255841, 192883, 40013, -60020, 57418, 134950, -131611, -49346, 326684, 23203, -92857, -16047, -292821, -83860, -96888, -32014, -111518, -142284, -50860, 323891, 42901, 162009, -404388, -222887, 23984, -90994, 25316, -252456, -95035, -26396, -80771, -220299, -2749, 151181, -266541, -109535, 226588, -325024, 108524, 302827, -19663, 189328, 126547, 88979, -65643, -60778, -159939, -163138, -219515, -225137, -76652, -291740, 20938, -8390, 26696, 183458, 74733, 265156, -110975, -295509, -147022, 184152, 102764, 96468, -131718, 98788, -73259, 257744, -28770, -163879, -78140, -75868, 283823, 296871, 144666, -113381, 63917, 450074, -130837, -94860, -397577, -109201, -56602, -135155, -77277, 133599, 113719, 222289, -139304, 164578]
18078G9556B31a23046A58822a84035A39392i3554b3824C4031d02044d1528A09159
18066c82041a61622A89864f314A05808b66150A91705k3133g5286K6383n6636k57919
18055c63458g6257F0208j2638i4721H171a82844f9974o718p5513A22953E5460
18043A30000N008f3672K5167k54041J00096P7281j15444F7469f2679m3281B8853
18031a92771c9771I9136a0287A87520Q0149h5648b8918p1096I5253K9217E8895
18019b28507A17233c58775f0734B28934b66484o9170a43992j08326A12357b5152
18008C81177j04795H9309J64418a6187B8150a32386J8440k8561k11707D7443J13161
17997A60604E4111b14892i7323r6997J5158A83496k4480K11054A00842b10876
$$ y = [79556, 231, -123046, 158822, -184035, 139392, -93554, -23824, 34031, -402044, -41528, 109159, -382041, -161622, 189864, -6314, 105808, -266150, 191705, 168572, -75286, -48903, -105539, -363458, -76257, 60208, 47570, -94721, 8171, -182844, -69974, -76692, -152205, 122953, 55460, 130000, 135008, -63672, -38505, -292546, -192450, -115169, -230613, 67469, -62679, -105960, 28853, -192771, -39771, 99136, -10287, 187520, 267669, -85648, -28918, -100014, 95253, 124470, 58895, -228507, 117233, -358775, -60734, 228934, -266484, -335654, -143992, -252318, 112357, -25152, 381177, 276382, 89309, 253727, -16187, 28150, -132386, -113946, -142507, -354214, 47443, 160604, 54111, -214892, -97323, -194320, -179162, 183496, 159016, 370070, 100842, -210876]
17986B4100a02313k67711D22133c417l0108B0384a42291L2281D26375b99660C181
17974B15235a86420P4907k47814C0871J43384a85462B0156J94688b20710M8863
17964a71847G1162k3073a78497h7721A09717Q1718g5403C29522A53603b69455
17953E4193d6170p9194d2499l62940a86879A34580b410B41652F7877k1670L33855
17942C80062a80072B59297C9115a12435r523r2075j4010d1359A47298a26700A64490
17930a7033A26596B4957K57097A4280o623a65087O9154A15723d4823G0711e6280
17918b7152j8891I887a08767B02608I0248N0662a45117D2923A4972N9132c51464
17906h5229A26300a62844j25534a08618n6562A8838K55425a64676j8524A14253
$$ y = [24100, -102313, -370024, 422133, -3417, -33525, 20384, -142291, -110010, 426375, -299660, 3181, 215235, -186420, -111513, -359327, 30871, 174255, -185462, 20156, 214844, -220710, -171847, 71162, 48089, -178497, -87721, 109717, 191435, -75403, 329522, 153603, -269455, 54193, -46170, -125364, -42499, -405439, -186879, 134580, -2410, 241652, 67877, 46207, 380062, -180072, 259297, 39115, -112435, -121958, -214033, -228043, -41359, 147298, -126700, 164490, -17033, 126596, 24957, 282054, 14280, 7657, -165087, -95933, 115723, -44823, 70711, -56280, -27152, -46043, 9887, -108767, 202608, 90248, 140910, -145117, 42923, 14972, 74104, -351464, -85229, 126300, -162844, -288378, -108618, -165180, 18838, 274263, -164676, -183200, 114253]
17895F0160a53750f765j43528j93994J09494G107J19926C1627J02011O7858a47843
17883b30826R0098l6565D363O8828h8668D1476J6513L5970h3706D3401J47880
17872A91281Q7939b44890A23503E4595b14264I0082q77B0169P5847a54308K0575
17861a33733B42996b50812a13404A13907E4693e586B38815d2040A51572c02562
17850A89865A1533K83678H9326M6250L24663b74589d4576A20329a98178A8485
17839I3076l6375i4409j49566a6868j82847e2511H2617K81456k8235I1779h7054
17827F5379R3996C2519a14438j52384A82525H5486Q9638k0787h7963E0330k952
17816D7378c09267Q1723j6321A59025c16661a42354L7578B48722a06991B57243
$$ y = [60160, -153750, -6765, -150293, -344287, -234793, 7107, 127033, 31627, 133638, 201496, -147843, -230826, -140728, -177293, 4363, 73191, -88668, 41476, 57989, 93959, -83706, 43401, 191281, 279220, -244890, 123503, 54595, -214264, 90082, 89205, 20169, 96016, -154308, -133733, 242996, -250812, -113404, 113907, 54693, -5586, 238815, -42040, 151572, -302562, 189865, 11533, 295211, 89326, 135576, 460239, -274589, -44576, 120329, -198178, 18485, 93076, 56701, -94409, -243975, -16868, -199715, -52511, 82617, 364073, 335838, 91779, -87054, 65379, 159375, 32519, -114438, -266822, 182525, 85486, 175124, 154337, -87963, 50330, 47378, -309267, -227544, -243865, 159025, -316661, -142354, -104776, 248722, -106991, 257243]
17805A886N8185b08033C85835A42935n3301J21571c6104j12522c0506C3921K93697
17794C27618a96882D16294a56158I1147a24775b5498b748A02684a10582d3870
17783A72273b36747A78738b06424M8461g716A99421b57403A11998c25428B27140
17772A54454E7090b3503l9776A82727b3919m0027K1467F5902K78307G7531Q4762
17761A62293o2212a32698F6989d7500I8204J86469H3228M3343K0277E2324L51446
17750D03770A6869a59452B11667a22202N0710H6528E318b96317o0714J45735I1650
17738d3631o5522A52990m0626L6262D8102Q0392L21506E6784N1105c3580n6320
17727h9900c3426C5175b43881C428h0822l9321f307j93180F1728c87617K2731
$$ y = [1886, 60071, -208033, 385835, 142935, 89634, 211205, -36104, -148626, -30506, 33921, 327618, -196882, 416294, -156158, 91147, -124775, -25498, -2748, 102684, -110582, -43870, 172273, -236747, 178738, -206424, -157963, -7716, 199421, -257403, 111998, -325428, 227140, 154454, 57090, -23503, -63279, 182727, -23919, -63946, -42479, 65902, 344209, 77531, 162293, 100081, -132698, 66989, -47500, 98204, 284673, 83228, 126571, 146848, 52324, 403770, 16869, -159452, 211667, -122202, -71492, 86528, 5318, -296317, -357031, -211296, 91650, -43631, -109153, 152990, 112364, 148626, 48102, 128494, 450000, 56784, 107889, -33580, -89900, -33426, 35175, -243881, 3428, -80822, -120143, -6307, -199487, 61728, -387617, -364886]
17716c64886G9860O3744f7465E3546j2192d0884k73014C5761F615a28270m7940
17705a76210c4585k27368F6628a4560E7501J02488a4386A34749m2775b9294I7792
17693d4392G6247a2186l8320B72467C2203i9270n2736A03689b81449c0831B53645
17681F460K36315m5028p931l2312B2927L9921M0142O3013a30448N8917B59J78596
17669A78855b19657B49940b02523A89482p3080J27583j7443K55838e0019A17036
17658A18459b51103B46432f7099A22550B5512P6900h9968m2507m2308L6989b7320
17646G4131J68672a32442C40043b48879A58678R900d0665D3286a7865A49411a05198
17634g2610k38437B99944j44052n3109m692b6658A8884h4015A02965O9470a36758
$$ y = [-364886, 79860, 143604, -67465, 53546, 41354, -40884, -313898, 35761, 6615, -128270, -176210, -34585, -261953, 66628, -14560, 57501, 159989, -14386, 134749, 91974, -29294, 97792, -44392, 76247, -12186, -50506, 272467, 32203, -99270, -152006, 103689, -281449, -30831, 253645, 6460, 242775, 197747, 189816, 157504, 22927, 62848, 102990, 166003, -130448, -71531, 259, 178855, -219657, 249940, -202523, 189482, 116402, 243985, 226542, 482380, -50019, 117036, 118459, -251103, 246432, -67099, 122550, 25512, 102412, -89968, -132475, -174783, -137794, -27320, 74131, 242803, -132442, 340043, -248879, 158678, 168578, -40665, 43286, -17865, 149411, -105198, -72610, -311047, 299944, 155892, 102783, 98091, -26658, 18884, -84015, 102965, 172435, -136758]
17622B69579b34989f5363A97321G7837a09269C50248g3950B40900m1798b54289
17611A09802J36594G4140J17675q9310e1863H7648J2285L461M3067A9479d0069
17599A05419D5423c02074m8869a24087F0068h9209k0135d2689A34148c3002J6309
17588a6693A23302H232J38548l3696D5051J61766m5178D4307J35765j2338l8805
17577A28929J82162J62110e033B4151L3072a62320H1133P5077G2962b14113E9758
17565A01039a9676A18150a15509F7339J52930C392J8633J14015k9103a78254A23791
17553E506K62632A32929a1918A04293E1381c4187j74021G7362K10146i5208p0611
17542a65819A63752n3613a85426E8548a2969p7127k24493n7787B23455b8225m4498
$$ y = [269579, -234989, -65363, 197321, 77837, -109269, 350248, -73950, 240900, 199102, -254289, 109802, 246396, 74140, 191815, 102505, -51863, 87648, 99933, 103394, 146461, 19479, -40069, 105419, 45423, -302074, -350943, -124087, 60068, -89209, -109344, -42689, 134148, -33002, -16693, 123302, 8232, 146780, 113084, 45051, 206817, 161639, 44307, 180072, 167734, 128929, 311091, 473201, -5033, 24151, 57223, -162320, 81133, 156210, 72962, -214113, 59758, 101039, -19676, 118150, -115509, 67339, 220269, 3392, 22025, 136040, 106937, -178254, 123791, 5506, 268138, 132929, -11918, 104293, 51381, -34187, -208208, 77362, 287508, -95208, -165819, 163752, 110139, -185426, 58548, -12969, -90096, -314589, -372376, 223455, -28225, -72723]
17531g2723j5358A8056L30470A74114O0006b65900C03853a50958B59946a40245
17520I0949L32689b29632A54690f9531B6043a17494a0833j19394d714j63776Q0079
17509h8411C34334r9994J19118Q2988a06002F9960L38868a27809E5570J62795
17499B18365a74166C45979q5499b76573J14154B6261a66253A68390K70974a02424
17488B04547A4693a78969A02503L36229a89669A25767c01516A13490J80921j10643
17478A83768i0096C69770b8688B91184j19665b73350G6722h0465n9393f7967j39153
17467b07120O4441D31310F1687K70606I9687J35231A12417N5875P6711a26224
17456B53639q2157n5132f4392E5398L53077j21989F6021Q1581K4443g534n6005
$$ y = [-72723, -88081, 18056, 348526, 174114, 234120, -265900, 303853, -150958, 259946, -140245, 90949, 423638, -229632, 154690, -69531, 26043, -117494, -10833, -130227, -4714, -168490, -88411, 334334, 234340, 353458, 436446, -106002, 69960, 408828, -127809, 55570, 218365, -174166, 345979, 260480, -276573, -162419, 26261, -166253, 168390, 439364, -102424, 204547, 14693, -178969, 102503, 438732, -189669, 125767, -301516, 113490, 294411, 183768, -90096, 369770, -28688, 291184, 171519, -273350, 76722, -80465, -139858, -67967, -207120, -142679, 431310, 61687, 332293, 99687, 234918, 112417, 168292, 245003, -126224, 253639, 171482, 116350, -64392, 55398, 408475, 286486, 66021, 147602, 172045, -7534, -63539]
17445f3539I6756J29552c3737B14803g8871C57492j46547f1520J4903E60357A75309
17433B31714m9195j0388O2384c975A93553o9897b11471C66570A74467K5198C4146
17421C96966j56300j05657l2688k1060j4640K21816O8321J07717A81201a51168
17410B66781k3742M5430H6579J67579p6226G9586N4002J78279K72595k45046J97004
17399E36420Q3075B41550B8098L4980c7926A6226a12761C39928f6842k54955R1896
17388b29901a262A44104i5109j38846C19110J866b4553l3994j10411B21497B3430
17376A84896j4813J54963K197f8213B20149b2956C94329A75061M9871m1340J77028
17365C60620D5469L44325I5422J93529r1642k3666I776h8648B02931H2011L5872
$$ y = [-63539, 96756, 226308, -33737, 214803, -78871, 357492, 210945, -61520, -46617, 560357, 175309, 231714, 182519, 172131, 234515, -3975, 193553, 123656, -211471, 366570, 174467, 199665, 34146, 396966, 240666, 135009, 102321, 81261, 66621, 288437, 356758, 464475, 181201, -151168, 266781, 243039, 288469, 86579, 254158, 177932, 79586, 133588, 311867, 584462, 339416, 536420, 619495, 241550, 28098, 63078, -37926, 16226, -112761, 339928, -66842, -321797, -229901, -1262, 144104, -95109, -233955, 319110, 320976, -24553, -58547, -168958, 221497, 23430, 184896, 170083, 325046, 327243, -68213, 220149, -22956, 394329, 175061, 224932, 183592, 360620, 45469, 389794, 95422, 288951, 197309, 173643, 9776, -88648, 202931, 82011, 117883]
17354A17883J40794F2564c2700A33729L23502j71502j30145D6852N7778h4787
17343A24807B4588L159J35108F1713Q0160L17493e7C85327j23224c6588A66945
17331B78617i5630A95878p8657K989R8723M2553b15534C66543d568A70319J18205
17320B88524j04737e7077B05031I7363J73860Q6397f6683C40746j13293p6394
17310A51059G797P7495C193a10529C76586I5969K03190H9832l400O4501o5281
17299H5652a21386M3069G8491J21651Q3506K4302p6313c1535j6259B6288J75723
17288B02011M052F2933J48331N4748n4658Q1608Q7984e9216C1888J7807I705K5112
17276C4817L61391A33296J40299n6799o416C5524K8937L16530A84960a33083A35556
$$ y = [117883, 258677, 62564, -32700, 133729, 457231, 285729, 155584, 46852, 104630, -84787, 124807, 24588, 27747, 162855, 61713, 141873, 459366, -57, 385327, 262103, -36588, 166945, 278617, -95630, 195878, 117221, 120210, 218933, 261486, -215534, 366543, -4568, 170319, 288524, 183787, -57077, 205031, 97363, 271223, 357620, -66683, 340746, 227453, 151059, 7797, 85292, 3193, -110529, 376586, 95969, 299159, 89832, 86432, 150933, 85652, -121386, -78317, 78491, 200142, 283648, 307950, 231637, -31535, -47794, 26288, 202011, 206063, 62933, 211264, 266012, 211354, 292962, 380946, -59216, 31888, 49695, 9705, 34817, 396208, 133296, 273595, 216796, 210380, 35524, 64461, 380991, 184960, -133083, 135556]
17264A00171A580J17545P4315O4409p0043C7985M2426M4170P9398g1105D50644
17252a3587A51808O7112C8225R2097E606a31976N5458B81009K4680A18402l7845
17241H0557K39932C8814L1234K23179J83797A68165A3938e3307C9918a11012m393
17230a15405C01914j15301n8161m0070q398d7791A3971K18787K6565F6818L56446
17219D23264A08426j4631K47187J23872A83858C3949L55504A15510J0859b97612
17208D12274A73722k7707b15569H77K39911K16675C57M87742A91344d2132b1065
17196B20765N4481a33240B35507R355j5680K78945B45446g4600A68857R704E5483
17184A68809i6663d0876A39833J65428P8633A75086L52437j07571m8145A32957
$$ y = [100171, 1580, 119125, 193440, 257849, 187806, 37985, 80411, 124581, 203979, -71105, 450644, -13587, 151808, 218920, 38225, 130322, 5606, -131976, -76518, 281009, 305689, 118402, 80557, 320489, 38814, 70048, 293227, 477024, 168165, 13938, -53307, 39918, -111012, -115405, 301914, 186613, 128452, 88382, 79984, -47791, 13971, 232758, 259323, 66818, 423264, 108426, 93795, 340982, 464854, 183858, 33949, 389453, 115510, 126369, -297612, 412274, 173722, 146015, -215569, 877, 240788, 457463, 357, 488099, 191344, -42132, -21065, 220765, 275246, -133240, 235507, 244862, 229182, 508127, 245446, -74600, 168857, 178561, 55483, 168809, -96663, -40876, 139833, 305261, 383894, 175086, 527523, 419952, 371807, 132957]
17173B11136R4174n1217r369O8520J18535B04501J74799A88061J26953p3640K8796
17162B70170C7081L15553A19399J69046n1784q4589G1843M10501j39462O1928
17152D04810K82049g9587B67768a69591F3794K87632A67675M25869k75585K1603
17142C39562o0445r4625d4278B4091M28136K6547k36542K88275j58755A05434
17131C50363a48043B55616D0723J92772a089A59842P8222K30667A38599P9795
17121B18394F786P3841O45279C20527J09537j41961j12292n4670K51743a32075
17110C65153n544P7660J33350k8407k17391J43520K23051j7071B80536O0200j07122
17099B33614H2164B6423K2230K09371M53774l54004A78686L19274I1202M49363
$$ y = [211136, 305310, 254093, 244724, 313244, 431779, 204501, 379300, 188061, 315014, 241374, 270170, 37081, 352634, 119399, 288445, 236661, 152072, 71843, 482344, 342882, 404810, 686859, -79587, 267768, -169591, 63794, 351426, 167675, 593544, 317959, 339562, 279117, 184492, -44278, 24091, 452227, 478774, 242232, 530507, 371752, 105434, 350363, -148043, 255616, 40723, 233495, -1089, 159842, 238064, 468731, 138599, 218394, 6786, 80627, 725906, 320527, 430064, 288103, 175811, 121141, 372884, -132075, 365153, 359609, 437269, 570619, 542212, 324821, 468341, 691392, 674321, 280536, 340736, 233614, 82164, 26423, 48653, 258024, 711798, 357794, 178686, 497960, 91202, 540565]
17089E40565k30757J30662j100K10152A55113O3271K08590J48046P011M306j13915
17078D72422K6206k07594J63295j14197B5557J69515L68922B54509K85938k16234
17068C24213Q7710M2289j56870C1162N79377N5040B47388P966N93970B39666Q4072
17057C23738K83542j9693k6597P1073J03070n8879j43278r8599l4917r7080L09706
17046F12086j68130k96K88266C58422Q8258o6659O6657J12089j31051K29388m8373
17035F08731A87157K49838J21415K54786k41623p462r5902J25485J4906B90149
17024E55290O3413q4161L31222k34625k1573j03902Q439B47535N8151M17106j25003
17013E97789K3801p5665j8629K4712L81683l14643l06743L71881J64505l05338
$$ y = [540565, 309808, 440470, 439370, 649522, 155113, 218384, 426974, 575020, 582031, 586337, 472422, 498628, 291034, 454329, 340132, 25557, 195072, 563994, 254509, 540447, 324213, 411923, 454212, 297342, 31162, 610539, 665579, 247388, 255354, 849324, 239666, 323738, 607280, 587587, 560990, 632063, 735133, 676254, 532976, 434377, 399460, 302380, 612086, 443956, 443660, 731926, 358422, 446680, 380021, 446678, 558767, 427716, 657104, 608731, 187157, 436995, 558410, 813196, 571573, 564111, 468209, 593694, 608600, 290149, 555290, 618703, 534542, 865764, 631139, 609566, 505664, 514103, 247535, 305686, 722792, 597789, 621590, 545925, 527296, 552008, 933691, 619048, 312305, 684186, 848691, 543353]
17003E43353o479R7747j51474P7957L50085k00058j97224m3191P1693L25157r0862
16992G76704J166Q240j197C79949O91295n22103j7148p2792j0137Q9766l240K13679
16980G49269J7412J20617l24289N07677r2681j08902j77111o221J45281J26409
16970I57461m17045M04944j38126J63199k82407N4165J47456R3492P271j38373
16960H52037J69994k50473J95327l5104J91999l11204J27353J64359k50793r7973
16950G55522J16160O1353N9646k23990K87118J69340D48036K13863M98661q9980
16940A070580R5341k64169N4659K53682l81316L53942J68863j62888m9111j44526
16930I95057j41935L27701r8747J2526J2807M9025m8101r120m1136P5610Q8222
$$ y = [543353, 536874, 634621, 483147, 561104, 911189, 711131, 513907, 470716, 542409, 867566, 776704, 777870, 786110, 784913, 379949, 1071244, 549141, 531993, 459201, 449064, 538830, 535590, 749269, 766681, 887298, 563009, 1070686, 978005, 869103, 691992, 685771, 831052, 957461, 540416, 945360, 807234, 970433, 688026, 742191, 889647, 983139, 990410, 852037, 1022031, 771558, 966885, 931781, 1123780, 812576, 939929, 1104288, 853495, 755522, 871682, 933035, 992681, 768691, 1055809, 1225149, 448036, 661899, 1160560, 1070580, 1165921, 901752, 956411, 1210093, 828777, 1182719, 1351582, 1188694, 1139583, 995057, 853122, 1180823, 1082076, 1094602, 1107409, 1156434, 1108333, 1099213, 1058077, 1133687, 1221909]
16919A221909m66572L92173J35095k14081j54432K04068j32009L53656k83100
16910A056707N13610l44257J77472q9464P6420j05959K55147k59404J30880J47803
16900A558955k69216R3938m749M07468k92812K44012p0556P3910J37400m40506
16890A437844K12614P7639Q2075m10126K44340L824j9623J34853J03328J72p9539
16879A787401P4469k17741K90759j77497J27527O30923m31069j21143m9795j64935
16869A748899M38617K46211r0573m65898J20604J04040K45128k25934J39453P8521
16859B339068R3802l8347M8008p4817j47461M97859l88008N13795l0220N5386
16849B869065n9300j66810l30976O16786k5439k258L1060K26911J6621k45196
$$ y = [1221909, 755337, 1147510, 1282605, 1068524, 914092, 1118160, 986151, 1339807, 1056707, 1570317, 1226060, 1403532, 1314068, 1390488, 1284529, 1539676, 1280272, 1411152, 1558955, 1289739, 1383677, 1378928, 1786396, 1493584, 1737596, 1667040, 1740950, 1878350, 1437844, 1650458, 1728097, 1810172, 1400046, 1644386, 1648210, 1628587, 1763440, 1866768, 1866940, 1787401, 1861870, 1644129, 1934888, 1757391, 1884918, 2515841, 2084772, 1963629, 1913834, 1748899, 2187516, 2433727, 2343154, 1877256, 1997860, 2101900, 2347028, 2121094, 2260547, 2339068, 2432870, 2394523, 2442531, 2367714, 2220253, 2718112, 2330104, 2843899, 2813679, 2869065, 2809765, 2642955, 2311979, 2928765, 2903326, 2901068, 2932128, 3159039, 3175660, 2930464]
16839B930464J36135J85917J41971l94151J36583L19546J57826q6100Q1328J26607
16829C736126r182P8919Q9220J00994r5336J24308J25319j88246L88347k99680
16819D050789K53207K24247j6936j39323J43794L20735J48616p8149k1822K50958
16809E136116L33122j18559m3885M3813M72839l50402N47544Q3935J69958J54089
16799F428570k85012J50654M74657K01327J13444J21962j77210L84119L4291M66193
16789G912995l3637K35725J29561J58249K83787M46122j81980L73509J32061M91207
16779I947599K61019M12962M11845L6905L79624J77053N37846J06061M95956J54035
16769A2920905R07067L93804P7723K73353J071770k21938R13404Q47972L62103
$$ y = [2930464, 3066599, 3252516, 3394487, 3000336, 3136919, 3456465, 3614291, 3528191, 3609519, 3736126, 3726944, 3805863, 3895083, 3996077, 3900741, 4025049, 4150368, 3962122, 4350469, 4050789, 4303996, 4528243, 4511307, 4371984, 4515778, 4836513, 4985129, 4906980, 4885158, 5136116, 5469238, 5350679, 5306794, 5350607, 5823446, 5473044, 6020588, 6104523, 6274481, 6428570, 6143558, 6294212, 6768869, 6970196, 7083640, 7205602, 7028392, 7412511, 7446802, 7912995, 7879358, 8115083, 8244644, 8402893, 8686680, 9132802, 8950822, 9324331, 9456392, 9947599, 10208618, 10621580, 11033425, 11070330, 11449954, 11627007, 12164853, 12270914, 12766870, 12920905, 13827972, 14221776, 14299499, 14572852, 15644622, 15422684, 16336088, 17184060, 17546163]
16760A7546163K44320R21969N81176P01192P36288J104104R94518Q05282P70145
16751B4405157R98789R87978R72396J215044J322205J441373J283991J574563
16743C4201496J216130K085360J676584J907818J887800K533870K222373K451647
16735E0183078K889790K228659L607068K871805L346380M106138L416669M094581
16727G6744168M531493M720640M842423M880867N646667N863673N950526N685173
16719A18865630O235134O091390O449476N973967O069015N576025N071705M967312
16711A65299654L690815L327727K860657J332024M10054k40843j506355k553112
16703A72620621l125610m097077m716868n696404n351631o223753o039666o125465
$$ y = [17546163, 17790483, 18712452, 19293628, 19994820, 20731108, 21835212, 22829730, 23635012, 24405157, 25403946, 26391924, 27364320, 28579364, 29901569, 31342942, 32626933, 34201496, 35417626, 37502986, 39179570, 41087388, 42975188, 45509058, 47731431, 50183078, 53072868, 55301527, 58908595, 61780400, 65126780, 69232918, 72649587, 76744168, 81275661, 85996301, 90838724, 95719591, 101366258, 107229931, 113180457, 118865630, 125100764, 131192154, 137641630, 143615597, 149684612, 155260637, 160332342, 165299654, 168990469, 172318196, 175178853, 176510877, 176920931, 176680088, 175173733, 172620621, 169495011, 165397934, 160681066, 154984662, 149633031, 143409278, 137369612, 131244147]
16695A31244147o006369o342510o361797n415857n764798n380464n230946n049701
16687H5691705m172096m644261m335022l928158l726472l221162l566869k664531
16679E5433134l047879k628803k650747k295727k271680j645510k274065j748937
16671C6869786k018151j033546j865152r97092j401187j360612j516498p61107
16663B5916441r71987r10618j364914o52927o01109r53843o62553n80739p24063
16654A8493688r60276n47305l30421n74978m92877n40169l29664n98371l27769
16645A3791858o26707n34918m7076p93771J81690n89039n30093J12320q65398
16636A0098866M9225l11014j63554m2792n87463p3814m09219Q3394l72447n21914
$$ y = [131244147, 125237778, 118895268, 112533471, 107117614, 101352816, 95972352, 90741406, 85691705, 81519609, 76875348, 72540326, 68612168, 64885696, 61664534, 58097665, 55433134, 52385255, 49756452, 47105705, 44809978, 42538298, 40892788, 38618723, 36869786, 34851635, 33818089, 31952937, 30955845, 29554658, 28194046, 26677548, 25916441, 24944454, 24033836, 22668922, 22015995, 21414886, 20461043, 19798490, 19217751, 18493688, 17533412, 16986107, 16655686, 16080708, 15587831, 15047662, 14717998, 14119627, 13791858, 13165151, 12630233, 12583157, 11789386, 11971076, 11382037, 10851944, 10964264, 10098866, 10148091, 9837077, 9673523, 9630731, 9043268, 8969454, 8560235, 8643629, 8271182, 7749268]
16626G749268M32829k25528m56133m30067m8710K97540n93035j20414J31575j66500
16616F570825l82745K10587m08207j48274j79626j38677P668n73546M45197j69955
16606E233247k93497j67419M3835j75281l1062j20703m31337J64951j5718j53353
16596D053663L6164K02504k48492j81817J85464m14673N5142J13553j94867M0704
16586C647345j15517p4780R1013o00642J99332j62653Q4108K27226o8115L772
16576C231089j13811r2062J69415k55081l20044J98821k6531k48259R5879J91666
16566B831082m07363M61382k92203k68010K58469l04007R5879J32399l18280J1381
16556B200729N6967n6715j86854J54935k00040L9017K61996l43737j09910O26070
$$ y = [7749268, 8182097, 7956569, 7500436, 7070369, 7021659, 7319199, 6726164, 6605750, 6737325, 6570825, 6188080, 6398667, 5990460, 5842186, 5662560, 5523883, 5531551, 4958005, 5403202, 5233247, 4939750, 4772331, 4816166, 4640885, 4609823, 4489120, 4057783, 4222734, 4207016, 4053663, 4089827, 4292331, 4043839, 3862022, 4047486, 3632813, 3687955, 3801508, 3606641, 3647345, 3531828, 3457048, 3548061, 2947419, 3146751, 2984098, 3068206, 3295432, 3227317, 3231089, 3117278, 3025216, 3194631, 2939550, 2619506, 2818327, 2791796, 2543537, 2639416, 2831082, 2423719, 2885101, 2592898, 2324888, 2583357, 2279350, 2375229, 2507628, 2189348, 2200729, 2257696, 2200981, 2014127, 2169062, 1969022, 2008039, 2270035, 1926298, 1816388, 2442458]
16546B442458l76271l25726l0528j23220J47571Q8426j59107J09377r5043q8547
16536A589390l8230J08345j75014J93957P201q9553l35995N37826j79013J1394
16526A630308m2871m5511k40750L72008j77630r555L8405l92187M05058k46602
16516A290673M26073l34083j94059J98650J3240j39527l3783k89729P31138n07619
16506A160974L31728m93569M62858n58417K16242K32370l95269L27848o00066
16497F84699N91014o3897k50152J90397q4727l57250M03382K9106l53098J59458
16487I48932P7192p7206N8196j0860J07671l61635J59981j69524N17281m38851
16477H11177o9794J36479j46726J70609K9607j07559K33524p4115l36483M73984
$$ y = [2442458, 2066187, 1740461, 1709933, 1586713, 1734284, 1822710, 1663603, 1772980, 1677937, 1589390, 1551160, 1659505, 1484491, 1678448, 1685649, 1596096, 1260101, 1797927, 1618914, 1630308, 1587437, 1541926, 1301176, 1673184, 1495554, 1485999, 1524404, 1132217, 1537275, 1290673, 1716746, 1382663, 1188604, 1387254, 1400494, 1260967, 1227184, 937455, 1668593, 1160974, 1492702, 999133, 1461991, 903574, 1119816, 1352186, 956917, 1284765, 684699, 1275713, 1211816, 961664, 1152061, 1067334, 710084, 1113466, 1142572, 789474, 948932, 1026124, 948918, 1007114, 996254, 1103925, 742290, 902271, 732747, 1250028, 811177, 741383, 877862, 731136, 901745, 931352, 823793, 1057317, 983202, 646719, 1120703]
16467A120703j73877j27289p5365k22122K96212R5484M13582k69646l06555J31027
16457H82154k3250j33539r2109K47414j77125j00527K33428k45360L17139l66653
16447E41572L73901l76000M226J25453J0094K34410j70236q6016N6128q5867O2633
16436F90298L2436K7534R8059j86282J56710C03543N05145l80970K35918n8520
16426F05116j68140A24734M17302Q5354J12751j65465M4578L3223Q683M1748K6150
16415G29058p8182B73496N70416k45825P2690k27973J27046j13760M122P020J53548
16404F20780L68683m94275J02909j64006A32714M11328j14213j43262J57637r3902
16394C50302L5575L00845k90470G4399K22458M33137k96128M0684J47271B54790
$$ y = [1120703, 946826, 819537, 744172, 522050, 818262, 913746, 1327328, 1057682, 751127, 882154, 858904, 725365, 633256, 880670, 703545, 603018, 836446, 591086, 908225, 541572, 915473, 539473, 543699, 669152, 679246, 913656, 743420, 657404, 713532, 627665, 690298, 722734, 750268, 848327, 662045, 818755, 303543, 808688, 427718, 663636, 605116, 436976, 124734, 542036, 627390, 740141, 574676, 619254, 652477, 661160, 702908, 729058, 650876, 273496, 843912, 598087, 670777, 442804, 569850, 456090, 460212, 467232, 620780, 989463, 495188, 598097, 434091, 132714, 544042, 429829, 286567, 444204, 350302, 385877, 686722, 396252, 74399, 296857, 729994, 433866, 474550, 621821, 254790]
16383F08602k29494J03400j64530j44954M33138C1278M34377H7755O62553C08399
16372E48201J43135l23575M09110C58956J99537j48669o439N4227j38565L67841
16362F86888g713B78842L5169P100L234A45255K391G0397N28807B84439m1131
16351B43308a5203D07487r4319L351N31048l97076j61358A32948K39773A66231
16340A27191M0388L67433k29655p9171p073J03334A51197N5037P1372J97133j02102
16329C72637J9044K3282J51334B29041L5530C4891M72805k37863J76667r5071
16319C51429A21552K35580j23520q290J54878q4307E6934K23403k5442Q3459m721
16308C33633B0131M52137H5716K44107q7031J36047j84823N744J03494A8470J60104
$$ y = [608602, 379108, 482508, 317978, 173024, 606162, 31278, 465655, 87755, 750308, 308399, 548201, 691336, 367761, 776871, 358956, 558493, 409824, 403385, 457612, 319047, 686888, -7713, 278842, 314011, 321111, 324345, 145255, 147646, 70397, 599204, 284439, 243308, -15203, 407487, 313168, 316519, 847567, 450491, 289133, 132948, 372721, 166231, 127191, 167579, 535012, 305357, 226186, 219113, 322447, 151197, 206234, 277606, 474739, 372637, 391681, 414963, 566297, 229041, 264571, 34891, 507696, 269833, 446500, 351429, 121552, 357132, 233612, 225322, 380200, 295893, 56934, 280337, 254895, 338354, 333633, 20131, 472268, 85716, 329823, 242792, 378839, 194016, 199760, 303254, 18470, 178574]
16297A78574B3004O33344b4123E193J31901J35066K18502B7305M41559A14957
16286C09269n2541f579A12284P5631J2555o7708a574B13472p4370J9895K07568
16275C66565a59175B75844m0488A16353L77222A43752j582L70856A29357M3606
16265A72963J58775B2683K57178J45251b45605D01604A20924J69956J49838A48666
16254B86893j21451J82185q3990d0562A93763P853p6265J41755o7240J61472H6337
16242A13837M5764M7216a26589B39724K9815B8887d135D62685F6547L5095d48933
16230A72564J89872N8280O2972j70265R10b2956A29493a42172C24839A10143g3027
16218C76726A18742J07786E2515J30137p7655l1577M29765d77372A9813K49476
$$ y = [178574, 23004, 656348, -24123, 5193, 137094, 272160, 490662, 27305, 468864, 114957, 309269, 256728, -6579, 112284, 187915, 200470, 132762, -1574, 213472, 139102, 158997, 366565, -159175, 275844, 235356, 116353, 493575, 143752, 142170, 513026, 129357, 172963, 331738, 22683, 279861, 425112, -245605, 401604, 120924, 290880, 440718, 148666, 286893, 165442, 347627, 263637, -40562, 193763, 201616, 125351, 267106, 199866, 361338, 86337, 113837, 159601, 206817, -126589, 239724, 269539, 28887, -4135, 462685, 66547, 101642, -448933, 172564, 362436, 420716, 483688, 313423, 314333, -22956, 129493, -142172, 324839, 110143, -73027, 376726, 118742, 226528, 52515, 182652, 104997, 73420, 503185, -477372, 19813, 269289]
16208B69289M0063i5185B66499B4422Q4333P1996B5233L70125A36170K02058b7247
16196E072k503K08525i75A79863J048q4919H724J01253K06683A28583l0591e760
16183A67542K41187j8852b09415B51812a1769o051k1752j23085A09065j1622P057
16172A04500m7004K72854D9804J47805a41895B50383D7121a48004n9818B55097
16161A41025I935L02969p1924I024L21069d9712a5955B70396c6458r0837D02392
16149A50173n5901J2667b5349k22597a507p5432l09209d9769j98680H4031g6515
16137h734A003e84l909A70277l1385l0409L88572E012J0784e434A16042J59303
16125B75345j13272a16510e2390D3039K47708A02773h1619n462B03411b82127
$$ y = [269289, 309352, -95185, 266499, 24422, 108755, 180751, 25233, 395358, 136170, 338228, -27247, 5072, 2569, 211094, -975, 179863, 180911, 95992, 8724, 109977, 316660, 128583, 97992, -5760, 167542, 408729, 389877, -209415, 251812, -11769, -17820, -39572, -162657, 109065, 97443, 104500, 57496, 330350, 49804, 197609, -141895, 250383, 47121, -148004, -207822, 255097, 141025, 9935, 312904, 240980, 9024, 330093, -49712, -15955, 270396, -36458, -127295, 402392, 150173, 94272, 106939, -25349, -247946, -1507, -76939, -386148, -49769, -248449, 84031, -76515, -8734, 1003, -584, -4493, 170277, 138892, 108483, 497055, 5012, 15796, -5434, 116042, 275345, 162073, -116510, -52390, 43039, 290747, 102773, -81619, -87081, 203411, -282127]
16114B12547n3746J65565k4165r5485I598J6596a32729c6718H9462a48173c5360
16102H9361d29B33090K1413a70687F5214P256K42647K5051b59403A416a36397
16090A79290J2346p2662K5483a71381j7905a2971B19363d66A35041j9132m2215
16079G3694J14649a8188k82572K4224A67114A5329i3826I1208c82614A93533d5341
16067e6740m1339H318a00221A56146F7554O8621R3501n4633b79246B36475b4976
16055f9931H2312k7297b51704a6793B3748b6321A2761a16728G9775c3156D06795
16043D7989J74288I2224J80282j00706q2620f6086r6388d6146B55496P8318B5294
16031g8142K6549A23485a4468j0993k56584A22233K77803A99035r329K52341e1015
$$ y = [212547, 158801, 324366, 300201, 204716, 9598, 26194, -132729, -36718, 89462, -148173, -35360, 89361, -429, 233090, 254503, -170687, 65214, 72470, 315117, 340168, -259403, 1416, -136397, 179290, 191636, 118974, 144457, -171381, -189286, -12971, 219363, -466, 135041, 115909, 73694, 188343, -18188, -300760, -276536, 167114, 15329, -93826, 91208, -382614, 193533, -45341, -56740, -98079, 8318, -100221, 156146, 67554, 136175, 229676, 175043, -279246, 236475, -24976, -69931, 82312, 55015, -251704, -16793, 23748, -26321, 12761, -116728, 79775, -33156, 406795, 47989, 222277, 92224, 272506, 171800, 89180, -66086, -162474, -46146, 255496, 333814, 25294, -78142, -51593, 123485, -14468, -25461, -282045, 122233, 400036, 199035, 189706, 442047, -51015]
16019a33320M7950A03035c72440a63614K8050E7966a63445N3245b8141A7797O6113
16008H3910C1068a65592B51139p4509b10659h7099A11830b95732a37783C71842
15997i9236A52200k5537b21749h9450J8429j46916B2453J07886a00718A65402
15986A17084K3654C2560J75653a32476b2866F9896L03180F6374b1566j5696l41090
15975c78352J22974A12124e7470I4726O1497a96371A69658c4692B02623H1355
15964a4860m6584k4550C15244b07702B73143c3563j65284B46559A3379b75849
15953a3510j97491N8538k7312j80740a36438b5917m8911A13972c36408f4751D14705
15941A2340M8560a54594A31371A0176J62205e3028a47C22286i3775j62851e2807
$$ y = [-133320, -85370, 103035, -372440, -163614, -135564, 57966, -163445, -110200, -28141, 17797, 83910, 31068, -165592, 251139, 176630, -210659, -87099, 111830, -295732, -137783, 371842, -99236, 152200, 126663, -221749, -89450, -71021, -217937, 22453, 130339, -100718, 165402, 117084, 140738, 32560, 208213, -132476, -22866, 69896, 373076, 66374, -21566, -37262, -378352, -255378, 112124, -57470, 94726, 156223, -196371, 169658, -34692, 202623, 81355, -14860, -61444, -85994, 315244, -207702, 273143, -33563, -198847, 246559, 13379, -275849, -13510, -211001, -152463, -179775, -360515, -136438, -25917, -74828, 113972, -336408, -64751, 414705, 12340, 60900, -154594, 131371, 10176, 172381, -53028, -147, 322286, -93775, -256626, -52807]
15929B1576e23122a62133A42749C680J00076e7199m855q7826A61107a29884j6860
15918a46744f7248j41994M5619C67304E2756o826i0933k20811B83108D4336R0863
15907A35199a98810c0170R212j75482P0209r7584A75221B798c77547a12094M3067
15896f9027b6405q1614M1018B4486J08761c6857H1962a83654d7424D87761a28445
15884B05819m1488N3229I0003P2419D3391h2093I0435Q9846l1962b21983D67742
15872i8511L0537o2146J9579A36967a25192K4116A19221i7588C2549b10428J04928
15861a05500L3125b6175j6123h201A13832c13477f3028k15978E8278a29666l1462
15850a61128a5463A04733O0989a70126G7426d3187k6360G3832J7337a14543e2562
$$ y = [21576, -523122, -162133, 142749, 3680, 103756, -57199, -62054, -149880, 161107, -129884, -146744, -67248, -209242, -163623, 367304, 52756, 45930, -90933, -311744, 283108, 44336, 135199, -198810, -30170, -20958, -196440, -126231, -223815, 175221, 2798, -377547, -112094, -69027, -26405, -108019, -67001, 24486, 133247, -36857, 81962, -183654, -47424, 487761, -128445, 205819, 164331, 217560, 90003, 162422, 43391, -82093, 90435, 180281, 148319, -221983, 467742, -98511, -67974, -130120, -110541, 136967, -125192, -101076, 119221, -97588, 32549, -210428, -105500, -72375, -26175, -42298, -8201, 113832, -313477, -63028, -279006, 58278, -129666, -161128, -15463, 104733, 165722, -170126, 77426, -43187, -69547, 73832, 91169, -114543, -52562]
15838a29374A96276e6516q6C7364Q1792A0658O3251i5891K2704o8381q962j0081
15826a60611A53104D0411A7320J73305O7811b126j58403K1325r4832O5311j15867
15815b84592g2379k9988C00008b8760j4068j21910A90342h6641j26358B02838
15804c41284J04375A38024a40938B33793b90339e0565D0136K00813n6629K7288
15794B11608M1670A14346A6421J8522J3939a56869m7758C15071H017c11082c3963
15782B5292b02397I2343A9595a83398l806C4452b18431C4031b80989A5538K17563
15771B33101h2740j1688n8956j75494J06394A39256a14430B5573J33297d2167
15760h4578d1475g978j10679D6717h7444j15949B68928i7357n2541B16834b65651
$$ y = [-129374, 196276, -56516, -56602, 37364, 119156, 10658, 73909, -95891, -73187, -141568, -150530, -160611, 153104, 40411, 17320, 190625, 258436, -2126, -160529, -139204, -234036, -168725, -284592, -72379, -102367, 300008, -28760, -42828, -164738, 190342, -86641, -212999, 202838, -341284, -236909, 138024, -140938, 233793, -290339, -50565, 40136, 240949, 184320, 211608, 253278, 114346, 16421, 34943, 48882, -156869, -204627, 315071, 8017, -311082, -33963, 25292, -202397, 92343, 19595, -183398, -187204, 34452, -218431, 34031, -280989, 15538, 233101, -82740, -94428, -153384, -328878, -222484, 139256, -114430, 25573, 158870, -42167, -84578, -41475, -7978, -118657, 46717, -87444, -203393, 268928, -97357, -149898, 216834, -265651]
15748H8027E285a65255L5430A42066k6276R9314I5512N5725a92945b0690A74078
15736b9704k0845k8582E1971g6469K6192D108c20207d7667j00973O547A04347
15724a3988o1796A12436A379h1075c6589l38924L70a1558l46822G4015f7484G2025
15711E8720M226G697a45722B37647d946r371k86113e2900A00036r499h6729H0300
15698g7598r3772N5076l6124P0515j27662A40584a4291A19141a44615r310e8384
15686d8548j02128L1334n2192j1852Q3490B0411a13763h063r0729c2142B05396
15674b62063A24715C738d37532O9583A16960A4289h9268k0690G0676J01839f9660
15662a06765J6318D02145D6480J2342K81079i5481C0657b45637R3782B8571d3550
$$ y = [88027, 5285, -165255, -129825, 142066, 115790, 215104, 95512, 151237, -192945, -20690, 174078, -29704, -50549, -79131, 51971, -76469, -50277, 4108, -320207, -47667, -148640, -142093, 104347, -13988, -75784, 112436, 1379, -81075, -36589, -375513, -375143, -11558, -358380, 74015, -67484, 72025, 58720, 62946, 7697, -145722, 237647, -4946, -14317, -300430, -52900, 100036, 90537, -86729, 80300, -77598, -171370, -116294, -152418, -81903, -209565, 140584, -14291, 119141, -144615, -153925, -58384, -48548, -150676, -119342, -171534, -183386, -99896, 20411, -113763, -8063, -98792, -32142, 205396, -262063, 124715, 3738, -437532, -367949, 116960, 14289, -89268, -109958, 70676, 172515, -69660, -106765, -90447, 402145, 46480, 58822, 339901, -95481, 30657, -245637, -151855, 28571, -43550]
15650A2322i7953N4A40629b80240J09349j14656J38044k40917a68091A4791b9148
15638a29651N1151A11423A8347b27635c631j75596A43299N6469J4392a89287B8935
15626a93895c0436F0012b35447B33649c6646B02514q3671b81246B8270c9633A82537
15614A0393b21359B35694d7124B30480m9948J82149A81196H5124a62539B61737
15603a22119B29128a76230j71674A7654J33479a10465q1190c8504a8568m77421
15593d95989f0681q2992j94973A41400E5089h4820H764e1913C33477r0894b24596
15581c51109H9724J59509C7105a223B19829c9766B12635e46m7609o8868d9903
15569A83394A2668a39475G6886E646c6775j72251E0161K22180i3754J5207a9557
$$ y = [12322, -97953, -97899, 140629, -280240, -170891, -285547, -147503, -388420, -168091, 14791, -29148, -129651, -78500, 111423, 18347, -227635, -3631, -179227, 143299, 199768, 214160, -189287, 28935, -193895, -30436, 60012, -235447, 233649, -36646, 202514, 118843, -281246, 28270, -39633, 182537, 10393, -221359, 235694, -47124, 230480, 180532, 362681, 181196, 85124, -162539, 261737, -122119, 229128, -176230, -347904, 17654, 151133, -110465, -191655, -38504, -18568, -495989, -60681, -143673, -338646, 141400, 55089, -84820, 8764, -51913, 333477, 242583, -224596, -351109, 89724, 249233, 37105, -1223, 219829, -39766, 212635, -546, -48155, -117023, -49903, 183394, 12668, -139475, 76886, 5646, -36775, -209026, 50161, 272341, -93754, -78547, -19557]
15557a59010G1295a70075Q4907n8921c1099r4551m377p5797E3602b18907O5353
15546a53554D37241A82032l1244a84509b5016h474G659h9708I77i0753k81562
15535c72315J80874A8308M09354a05157r792l00611J62668B71105a22309A57189
15524b4408j97314d5435F3578R5716i6230b9193o194k56818a17912D5360a80216
15512e7487j5885B17782a04065B72555f6447C73362j62005a14063k94683B33298
15501H6136J83727A13198K7533K3851i2773A90211H9128C6562M1527j5306b9713
15489a24608c0576j83304A98079a21237p8175B42522c25085g7056L2557n7939
15479a02438G0182B6642a36597j1098k80071c0646A7342e2482j47785M008D44978
$$ y = [-159010, 71295, -170075, -85168, -144089, -31099, -125650, -130027, -205824, 53602, -218907, -153554, 437241, 182032, 150788, -184509, -25016, -8474, 7659, -89708, 977, -90753, -372315, -191441, 18308, 427662, -105157, -114949, -415560, -252892, 271105, -122309, 157189, -24408, -221722, -45435, 63578, 159294, -96230, -29193, -35387, -292205, -117912, 45360, -180216, -57487, -73372, 217782, -104065, 272555, -66447, 373362, 211357, -114063, -408746, 233298, 86136, 269863, 113198, 140731, 164582, -92773, 190211, 89128, 36562, 78089, 62783, -29713, -124608, -30576, -213880, 198079, -121237, -199412, 242522, -325085, -77056, -44499, -102438, 70182, 26642, -136597, -147695, -427766, -30646, 17342, -52482, -200267, -196259, 444978]
15467B49698B692b03846j0800Q5577O189p2926A57693d9438I3762J62818a8701
15455B2862a01814l8247A38501c71218D17353a41538B11458b18159H4485C9675
15444A16576G30M46231a64618D4526a81087M1769c1603k29022B45020i1800n3573
15433a45373F1433J17553d0252A7472a60997r2481E4578a23807K9596M6560l9037
15422h6688j89717A66583a46709H009K12385R2885b97618I5490j0488m0148c11349
15410a63540j37184G8771a8901D6677a2870j71862B52549E9394K62793a53455
15399a71266O083B44371A18776g4224k55911O4480J00780j57259H1563D686J13643
15388A18329a60182D2846b09938A36358B1587i9868H4524j0678J24290A8296f1416
$$ y = [249698, 2692, -203846, -214646, -129069, -122880, -195806, 157693, -49438, 93762, 256580, -18701, 22862, -101814, -140061, 138501, -371218, 417353, -141538, 211458, -218159, 84485, 39675, 116576, 730, 446961, -164618, 44526, -181087, -139318, -31603, -260625, 245020, -91800, -145373, 61433, 178986, -40252, 17472, -160997, -253478, 54578, -123807, -94211, -47651, -86688, -276405, 166583, -146709, 8009, 220394, 313279, -297618, 95490, 85002, 44854, -311349, -163540, -300724, 78771, -18901, 46677, -12870, -184732, 252549, 59394, 322187, -153455, -171266, -165183, 244371, 118776, -74224, -330135, -265655, -164875, -322134, 81563, 4686, 118329, -160182, 42846, -209938, 136358, 21587, -99868, 84524, 73846, 198136, 18296, -61416]
15376C65178a01937a3937k42094A41365B198d9104A78831G6350R360B8044b26767
15364a47587F753P3395a94191B37846q2397a38009F6078E588i5560A76890c38
15352A90537F232b99061e6530m4453A75012J05280a33390O2228m38016c3700Q684
15341b5016l20904J13348F483l121g313B77686a85511P7115A56197J7100o9318
15330A03979D5748Q2946c1989J2642j77822C8276J19205l2839J13331A04514P9377
15319A83891a666l27066B18359b4931o4223a0518G2771N0150b6242A82872a08762
15307c77619J40814Q5287O6594A53873h8989h075k6147j88988A35606J1F4228
15295b7725A80777H022a72378A9819J63402c48369a09166B35280D6631a13630
$$ y = [365178, -101937, -13937, -256031, 141365, 2198, -49104, 178831, 76350, 85710, 28044, -226767, -147587, 6753, 80148, -194191, 237846, 155449, -138009, 66078, 5588, -95560, 176890, -338, 190537, 6232, -299061, -56530, -100983, 175012, 280292, -133390, -71162, -509178, -33700, -25016, -345920, -232572, 6483, 3362, -7313, 277686, -185511, -108396, 156197, 173297, 103979, 45748, 128694, -31989, -19347, -197169, 38276, 157481, 124642, 237973, 104514, 183891, -1666, -328732, 218359, -24931, -89154, -10518, 72771, 122921, -26242, 182872, -108762, -377619, -236805, -151518, -84924, 153873, -88989, -8075, -34222, -223210, 135606, 135617, 64228, -27725, 180777, 8022, -172378, 19819, 183221, -348369, -109166, 235280, 46631, -113630]
15284A29553E0194b17756A79565p5083C8845J75304B5612f3796G4127i6787A23137
15272i501B43229c9719E8609k5535J82009F3690F874h7759B07190e2859p8142
15261a31001l1989J4013l0147B71862N9130r217A09165C7469J68433d6976A61223
15249A16287a06498g395A78464D5962a94539C10950j43181M9019M7380K94K85432
15238E49894B54971J76693L1887k21893N57577P77457j0727m06465L9698m74527
15228G24671k06062C0314L43487A01978l832K10672A35743J61372o7747g1467
15217B27803L2428L7185j44047P7792c5369E1661K55635B5899L2548a9227A05378
15205A35116j3990A2117N5005P007J05999j0565c4268C71179B93J17527a19318
$$ y = [129553, 50194, -217756, 179565, 104482, 38845, 214149, 25612, -63796, 74127, -96787, 123137, -9501, 243229, -39719, 58609, 33074, 215083, 63690, 6874, -87759, 207190, -52859, -131001, -162990, -148977, -179124, 271862, 330992, 321775, 109165, 37469, 205902, -46976, 161223, 116287, -106498, -7395, 178464, 45962, -194539, 310950, 167769, 216788, 264168, 264462, 549894, 254971, 431664, 463551, 241658, 799235, 1576692, 1565965, 1159500, 1199198, 724671, 518609, 30314, 373801, 101978, 98146, 308818, 135743, 297115, 229368, -71467, 227803, 260231, 297416, 153369, 231161, -35369, 51661, 307296, 25899, 58447, -19227, 105378, 135116, 121126, 12117, 67122, 74129, 180128, 169563, -34268, 371179, 293, 117820, -119318]
15193C53119a02995L1342m4494b2315E8623A7254g2136F9748O9996d4323I4837
15181C41442C9975J8708c14399J48699C7169R3265O4651d268A55288k7363K63584
15170C91509a11064A22540L44204b06553L1725A72619A0471P174K46633g8798
15159a33515A90674n7652K33340E5048g6139a7787j87886A84888a9777m6734I3334
15147a0541A9578a69524a1577k0694j45543A70496b13945F0690J56192n6930j4873
15136A45079m1650a23447A57248l9930K56887m0297q1022j12068N1175J28723
15126C20716G9785G119b04475R0760g092B1681K48290J49453b1954I2070b8097
15114A78015i4600B78392J61448b45611f9214C1473J82666K2772C7238L73375
$$ y = [353119, -102995, -71653, -116147, -22315, 58623, 17254, -72136, 69748, 139744, -44323, 94837, 341442, 39975, 58683, -314399, -165700, 37169, 130434, 195085, -4268, 155288, 127925, 391509, -111064, 122540, 466744, -206553, -174828, 172619, 10471, 17645, 264278, -78798, -133515, 190674, 133022, 366362, 55048, -76139, -17787, -205673, 184888, -19777, -66511, 93334, -10541, 19578, -169524, -11577, -32271, -177814, 170496, -213945, 60690, 216882, 159952, 145079, 103429, -123447, 157248, 117318, 374205, 333908, 252886, 140818, 191993, 320716, 79785, 7119, -204475, -113715, -7092, 21681, 269971, 419424, -21954, 92070, -28097, 178015, -94600, 278392, 439840, -245611, -69214, 31473, 214139, 236911, 37238, 410613]
15104D10613j83792N6887d9770j17427O9376c3786C35188G1524J98307A261J10620
15093A11881R3994F3626J35357L3878r3518m406e5868C636K31668g5507J3211
15082f2296A16529a46457A68368a0743A09007b2011F402d3500k1236B57620A9787
15070H5288J47330k4703b37304C43301A60542M67322i4536C83538H3321C3831
15059C5417K26142j7885L5355f9515A10450M5255J34560a21355A75336b15104
15048G743J65844L48705A2791L7572b5657B17529K36066k9428G2546N43548F6044
15036C1293J01283K6860m2205L77772E9957J83582a45733A17071K74919D5373
15025D21996C2945K74415a48003C859K33800j05850d1104F583L26165a4123A27590
$$ y = [410613, 226821, 283708, -49770, -167197, -97821, -33786, 335188, 71524, 269831, 1261, 111881, 205875, 63626, 198983, 232861, 139343, 134937, -55868, 3636, 235304, -75507, -62296, 116529, -146457, 168368, -10743, 109007, -22011, 6402, -43500, -64736, 257620, 19787, 85288, 232618, 207915, -237304, 343301, 160542, 627864, -94536, 383538, 83321, 33831, 35417, 261559, 243674, 279029, -69515, 110450, 155705, 290265, -121355, 175336, -215104, 7743, 173587, 522292, 12791, 50363, -25657, 217529, 453595, 424167, 72546, 616094, 66044, 31293, 132576, 159436, 117231, 495003, 59957, 243539, -145733, 117071, 391990, 45373, 421996, 32945, 307360, -148003, 3859, 237659, 131809, -41104, 6583, 332748, -14123, 127590]
15013E06687A93050K69053j81854A26106i4755B29287D6559K22113A08413I844
15002A2656M30172I4892O5831k5018l2138m498K79651j77939f2878q7011a7503
14990B85805L62009A77883Q8922j16052C6732L32823b9413B33133H3449J14665
14980A98114e2345B86092H6655N0841J43606A06355b45000D32174e1797B88994
14969A11730a52027A69056J2524a6495E4522P2956J44987J43022p3363j15274
14959B26850e5720A21817l1833J61862K6773o7364J43749A75231Q1813L6426A28037
14947C96458I3453A093O1273h0230B2735L16585q9309a68013B38185F1902K96727
14936C58629j28985L520A06735K03692J3456j14248N0313C8549L79185j6132A49228
$$ y = [506687, 193050, 462103, 280249, 126106, -94755, 229287, 46559, 268672, 108413, 9844, 12656, 442828, 94892, 160723, 135705, 103567, 99069, 378720, 200781, -62878, -149889, -17503, 285805, 647814, 177883, 266805, 150753, 36732, 369555, -29413, 233133, 83449, 198114, -52345, 286092, 86655, 137496, 281102, 106355, -245000, 432174, -51797, 288994, 111730, -152027, 169056, 181580, -16495, 54522, 127478, 272465, 415487, 342124, 226850, -55720, 121817, 89984, 251846, 278619, 211255, 355004, 175231, 257044, 293470, 128037, 396458, 93453, 1093, 62366, -80230, 22735, 339320, 250011, -168013, 238185, 61902, 358629, 229644, 233164, 106735, 310427, 323883, 209635, 259948, 38549, 417734, 401602, 149228]
14924B24846q1924A7251L54228F9340M12369c5594G41945C02808J1759l6997H244
14912B14744J76943a6988B40834K35727q7620q250j9388r3309o1711J33193J09059
14901D48535j61872H3235J18139M3081l5822K26759A06320R8861J01490j02719
14891B03952L94972B29416J40151L308j5121k8300K53785j88878N765a51157D01786
14879g9903A85500Q9044J59723K18239r2872B26814J57950A52989J72344K8370
14869C53703q109j47363K45179J58312B78365J6913P9156j27413L14421A69467
14858F39050K15978C37251j23110K93029j73474j13276J57718Q726Q1948k09299
14848B59513o1954M15483B61180M2723L5325K57856k41860J46259I4143P19158
$$ y = [224846, 142922, 17251, 371479, 69340, 481709, -35594, 741945, 302808, 314567, 277570, 8244, 214744, 391687, -16988, 240834, 476561, 388941, 380691, 361303, 267994, 206283, 339476, 448535, 286663, 83235, 201374, 244455, 208633, 435392, 106320, 205181, 306671, 203952, 598924, 229416, 369567, 372875, 357754, 329454, 583239, 394361, 400126, -151157, 401786, -79903, 185500, 274544, 434267, 652506, 559634, 226814, 384764, 152989, 325333, 353703, 345594, 198231, 443410, 601722, 278365, 295278, 374434, 247021, 561442, 169467, 639050, 855028, 337251, 214141, 507170, 333696, 220420, 378138, 386864, 468812, 259513, 197559, 613042, 261180, 303903, 339228, 597084, 355224, 501483, 94143, 813301]
14838H13301k98975h867E45832I1083N02993A75988J98315A55655K05039p8466
14828B82228R4010j7007J58515k38770J53627A82213J8271J73667J30983M0898
14818E46032n7727M1877l121j4958l9289n7333J35550j76298m5908J98090j23611
14807D03304J11315m8015p7302L3994j55892J96557A83514K31242J01099A38273
14796B58164L07088K4513B92243L16315J27911O3539j56340k97497K14281k3219
14786E37233j87705L75732o5001B43212K72933A52954J99514M21006q9633k45236
14776D38605m8120j19255J06778P4603K5068J44780k01776M77280k98032k24121
14766C75810R3784K61479C33314J51195K66410C23535K95819j25561o598j86344
$$ y = [813301, 514326, -8867, 545832, 91083, 594076, 175988, 374303, 155655, 360694, 282228, 376238, 359231, 517746, 278976, 432603, 182213, 200484, 374151, 505134, 546032, 488305, 530182, 527061, 512103, 472814, 415481, 551031, 374733, 328825, 526915, 403304, 514619, 466604, 389302, 423296, 267404, 463961, 183514, 414756, 515855, 138273, 258164, 565252, 589765, 292243, 608558, 736469, 800008, 643668, 346171, 560452, 537233, 349528, 725260, 660259, 243212, 516145, 152954, 352468, 773474, 683841, 438605, 390485, 271230, 378008, 452611, 477679, 622459, 420683, 897963, 599931, 375810, 469594, 731073, 333314, 484509, 750919, 323535, 619354, 493793, 487195, 300851]
14756C00851L47346Q1406J33126l45892O6861j15103J04023j14781j73728L81814
14746F65923j09851Q1268R8908k49279q6115J93946L6566l0421R0635j98360Q3566
14735E76786k8720P1297k42605N04533j34221j96736M2519K4889k67530L43631
14725F93843J94781l59993J98164j09292P0170o6262k79434L16603q080K21356
14715H71856l52597K63113k01149K89769j79420k00009R3983J74524M9404k51291
14705E58183M42484l47250J31015o5292J39896p5598R2135k01847J11178K5652
14695H10556j91531K89047N273j40295L67091n43666K99725P363n3487j46907
14685G03169k22121Q8862K07500j30075K14900r0978K11748n9364k11558J97589
$$ y = [300851, 648197, 729603, 862729, 516837, 583698, 468595, 572618, 457837, 284109, 665923, 556072, 637340, 736248, 486969, 400854, 594800, 631366, 600945, 691580, 493220, 576786, 548066, 619363, 376758, 881291, 747070, 550334, 592853, 617742, 350212, 693843, 888624, 528631, 726795, 617503, 687673, 621411, 341977, 658580, 650500, 871856, 519259, 782372, 581223, 870992, 691572, 491563, 585546, 760070, 809474, 558183, 1000667, 653417, 784432, 719140, 859036, 783438, 875573, 673726, 784904, 810556, 619025, 908072, 913345, 773050, 1140141, 596475, 896200, 903563, 850076, 703169, 481048, 569910, 777410, 647335, 862235, 771257, 983005, 923641, 712083, 909672]
14675I09672j56074J31124j0238n3025J21891J08100k13057J50334k61366K89326
14665A016687l02353K06584J20336P1066l85513J42606j0323P4301M2881j13518
14655H62754R3572Q097O6883L8605m29489L49097o7787L3507J14042l05727K56170
14644A019724k5811K60360M12l50587K22014m03854K63302l5965K28993j8485
14634A160103j72666M7877k07816p3199K53474M19298k03051l00950N0994J68074
14624A142138p7849r3560O2947J21292J28231K04271k03303j04019K15880n47764
14614H48264P31305r4462j35894k43431L17037l20562K34073k31334J09492K07186
14604A421674j97034j09306J58990j4992K19981r3472j61705Q1815N5973j37373
$$ y = [909672, 753598, 884722, 874484, 821459, 943350, 1051450, 838393, 988727, 727361, 1016687, 714334, 920918, 1041254, 1112320, 726807, 869413, 859090, 933391, 976272, 862754, 956326, 964423, 1031306, 1069911, 640422, 989519, 921732, 955239, 1069281, 763554, 1019724, 993913, 1254273, 1254685, 904098, 1126112, 722258, 985560, 949595, 1178588, 1160103, 987437, 1035314, 827498, 754299, 1007773, 1427071, 1224020, 923070, 974064, 1142138, 1064289, 970729, 1033676, 1154968, 1283199, 1487470, 1284167, 1180148, 1396028, 848264, 1579569, 1485107, 1349213, 1105782, 1422819, 1102257, 1336330, 1104996, 1214488, 1421674, 1224640, 1115334, 1274324, 1259332, 1479313, 1385841, 1224136, 1305951, 1361924, 1224551]
14594A224551k8243J15303L00602l07086j96117M20612k34272L71354k43350K18307
14584A641661l63422K01006K28242k28375K26049j3046r5434Q8523k32234K81851
14574A734821o8406j84902j22537L69596j88969r5426N93002j98983k49544J946
14564A590598J39491k16171J05617L46052M63833j67015j83174K00301l81850
14555A897682L03133q2188k15975L85802j82000L98886k19459n7539J57377O3383
14545B449102K46681J80605J09386K93863K74783O2287M96699O39625O01000O90312
14535F044343J329439K578090L578368O715078R300668k382456q825740n876840
14527A2460950n111222k119144j629776o43293j07483m75397j30936J67513j73192
$$ y = [1224551, 1196308, 1311611, 1612213, 1305127, 1109010, 1529622, 1295350, 1666704, 1423354, 1641661, 1278239, 1479245, 1707487, 1479112, 1705161, 1692115, 1596681, 1685204, 1452970, 1734821, 1666415, 1481513, 1358976, 1728572, 1539603, 1444177, 2037179, 1838196, 1588652, 1590598, 1730089, 1513918, 1619535, 1965587, 2429420, 2262405, 2079231, 2279532, 1897682, 2200815, 2118627, 1902652, 2288454, 2106454, 2505340, 2285881, 2228342, 2385719, 2449102, 2695783, 2876388, 2985774, 3279637, 3554420, 3616707, 4113406, 4753031, 5354031, 6044343, 7373782, 9951872, 13530240, 20245318, 29545986, 27163530, 18337790, 12460950, 7349728, 5230584, 3600808, 2957515, 2850032, 2374635, 2243699, 2411212, 2238020]
14518B238020J10786j06802j22473j65487P1033K99194k80348M195K54051j51974
14508B150195K29575r1586j08828M57037m07070L17942L0232k51435K87285o6886
14498B546461p0933P3194n1295J95940J78518j12405m4685J94683l67220K85637
14488B827895l01182J21340K00114M39729k53730l28600K90065J10876k53390
14479B853117J20988K46852p8058L09213k1381l56163L2970l7462L23815J85552
14469C579443j27190j70880J01889L37795P0631j43789O1845o4299l77623M39164
14459C706986J08457J62958P788J22349j07625J4780j73698L44353j8076n0841
14449D117431M12q4371J82350k50691M85905J94564n624k80127M08481q1252J16036
$$ y = [2238020, 2348806, 2242004, 2119531, 1954044, 2025077, 2324271, 2043923, 2048118, 2302169, 2150195, 2379770, 2288184, 2179356, 2636393, 2229323, 2547265, 2577497, 2326062, 2613347, 2546461, 2475528, 2548722, 2497427, 2693367, 2871885, 2759480, 2714795, 2909478, 2542258, 2827895, 2526713, 2648053, 2848167, 3287896, 3034166, 2705566, 2995631, 3106507, 2853117, 2974105, 3220957, 3142899, 3452112, 3430731, 3074568, 3107538, 3070076, 3393891, 3579443, 3452253, 3281373, 3383262, 3721057, 3791688, 3647899, 3709744, 3645445, 3267822, 3706986, 3815443, 3978401, 3986189, 4108538, 4000913, 4015693, 3841995, 4186348, 4168272, 4117431, 4117843, 4033472, 4215822, 3965131, 4451036, 4645600, 4639976, 4359849, 4768330, 4687078, 4803114]
14438D803114Q6504K4893K97032l39245j79985M13341o4930J73130L35172Q867
14428E557893l51619P3655J77485O7248J90524j99739N40890j05106j15711J20925
14418E956445J8681K03053K63308j28850K73740O599L3898N4885K58162R9293
14408G039214l30890N16794j849M5216K32470L0458J80834Q6323J07313o4761
14398G841122j17770K81626K46543J54857K59665K1540m7350M92707r5461L01786
14388I339265j07027J05883N39290k5178J52826J93329K92444j32127L14121L49455
14378A1022281j5968K01108o3022L81680n0117N87363n8141M52510J24433K98846
14368A2880973J23317K10006N35331m4608L89816L73318P2225L10699N41771j66910
$$ y = [4803114, 4889618, 4914511, 5211543, 4872298, 4692313, 5105654, 5040724, 5213854, 5549026, 5557893, 5206274, 5279929, 5457414, 5524662, 5715186, 5515447, 6056337, 5951231, 5835520, 5956445, 5975126, 6178179, 6441487, 6312637, 6586377, 6592976, 6626874, 6681759, 6939921, 7039214, 6708324, 7225118, 7223269, 7268485, 7500955, 7531413, 7712247, 7798570, 7905883, 7841122, 7723352, 8004978, 8251521, 8406378, 8666043, 8687583, 8640233, 9132940, 9037479, 9339265, 9232238, 9338121, 9877411, 9852233, 10005059, 10198388, 10490832, 10358705, 10672826, 11022281, 11006313, 11207421, 11144399, 11526079, 11475962, 12063325, 12005184, 12457694, 12582127, 12880973, 13004290, 13214296, 13749627, 13705019, 14094835, 14468153, 14540378, 14851077, 15392848, 15225938]
14358A5225938L34193K37301M68649N06669M36785L69641J88019J24776P79423
14349A8671394N1467L43561P41538N13104j7688P99981M82487P36661J6439P03769
14339B3042713K78280Q14207L77554M88582O61866M23593Q27680Q92155P34554
14330B8541184M99393P27997R36761J201134P57690Q93968J103091P31430J080118
14321C6472766O98911J543734R40634J097223J271371J248379J644470J300570
14313D6218058J377264J709289J626157J739611J967906J592794K058999J998566
14305F0288644K487175K481678K014968L042537K711776K666522L238812L191269
14297H2123381L185619M117370L732294M202030M492742M691890M657849N494234
$$ y = [15225938, 15560131, 15797432, 16266081, 16772750, 17209535, 17579176, 17767195, 17891971, 18671394, 18722861, 19066422, 19807960, 20321064, 20303376, 21103357, 21585844, 22322505, 22338944, 23042713, 23320993, 24135200, 24512754, 25001336, 25663202, 26086795, 26914475, 27806630, 28541184, 29040577, 29768574, 30705335, 31906469, 32664159, 33558127, 34661218, 35392648, 36472766, 37171677, 38715411, 39656045, 40753268, 42024639, 43273018, 44917488, 46218058, 47595322, 49304611, 50930768, 52670379, 54638285, 56231079, 58290078, 60288644, 62775819, 65257497, 67272465, 70315002, 73026778, 75693300, 78932112, 82123381, 85309000, 89426370, 93158664, 97360694, 101853436, 106545326, 111203175, 116697409]
14289A16697409N788639N422692O240282O893848P057103P789261P694605Q663717
14281A72247556R091389R541231J0095899J0599902J1887846J2202778J2662914
14274B48329515J3146330J3924149J4121916J4833816J4680044J4754082J5050803
14267C48840655J4686000J3968269J2904184J2343517J1502746J0307526R503689
14260D34056586Q652673O762305L149998K875597J929325J369872m459867n815647
14252D48520842n057684p035724j0495980j1895858j3245819j3632330j4353716
14245C72803731j4108536j5006488j4921246j4337519j4074163j3813893j2840869
14238B73701017j2664688j2253789j1967492j1418872j1166092j1276068j0702852
$$ y = [116697409, 122486048, 127908740, 134149022, 141042870, 148099973, 155889234, 163583839, 172247556, 181338945, 190880176, 200976075, 211575977, 223463823, 235666601, 248329515, 261475845, 275399994, 289521910, 304355726, 319035770, 333789852, 348840655, 363526655, 377494924, 390399108, 402742625, 414245371, 424552897, 434056586, 442709259, 449471564, 452621562, 455497159, 457426484, 458796356, 454336489, 448520842, 443463158, 436427434, 425931454, 414035596, 400789777, 387157447, 372803731, 358695195, 343688707, 328767461, 314429942, 300355779, 286541886, 273701017, 261036329, 248782540, 236815048, 225396176, 214230084, 202954016, 192251164]
14231A92251164j0224233r600754q642962q224499p798076o952676o900421o389756
14223A27517787n932862n598025n319263m635069m910727m089783l822628l854374
14215H9355056l751904l606410l271867l055099l168368k548841k519404k424011
14207F5009152k304713k410839j657586k086816j900514j825483j907817j327294
14199D9588090j592380j314067j585322j466230j072802j311649r17329r82357
14191C9345954j300756j410235j112044r15803o52275m67738j334641p71800p15260
14182C0665402q89461j253299j30762r59989n03167q03603q93853l21163m74193
14173B4435912n85908m84390j101470j17615p32430m09653k37125m98999n82342
$$ y = [192251164, 182026931, 172426177, 163783215, 155558716, 147760640, 140807964, 133907543, 127517787, 121584925, 115986900, 110667637, 106032568, 101121841, 97032058, 93209430, 89355056, 85603152, 81996742, 78724875, 75669776, 72501408, 69952567, 67433163, 65009152, 62704439, 60293600, 58636014, 56549198, 54648684, 52823201, 50915384, 49588090, 47995710, 46681643, 45096321, 43630091, 42557289, 41245640, 40328311, 39345954, 38045198, 36634963, 35522919, 34607116, 33954841, 33487103, 32152462, 31380662, 30665402, 29775941, 28522642, 28391880, 27431891, 26928724, 26125121, 25231268, 24910105, 24435912, 23850004, 23365614, 22264144, 22146529, 21414099, 21004446, 20767321, 20268322, 19685980]
14164A9685980m35484n81391N8833m35662m85942n07468o08775J39210r1838o61124
14154A6076339j98945m74828k47125k41543k89602k86661R16m43939l46344l67549
14144A3180719j81136l03831j27806j59096k45783k05019j00172j44424l09712
14135A1403740k05421o7320M809j52900n13550L76461o40780K53353o24885k77288
14125I556219Q8351j35137j59969o4036j58748l98962L94451n09512l13111L6963
14115H336509L1424J47326o84323l3548K82288k93241M7948l61510j29391K8864
14105G372346n5555j50416q5711l18738Q6682l6172K4537j68957j38395l95399
14095F134222K55952j36808k3946P8367j0089j14993j34971l54162J10214r6154
$$ y = [19685980, 19250496, 18669105, 18727938, 18292276, 17806334, 17298866, 16690091, 16829301, 16737463, 16076339, 15877394, 15402566, 15155441, 14913898, 14624296, 14337635, 14338551, 13894612, 13548268, 13180719, 12999583, 12695752, 12567946, 12408850, 12163067, 11958048, 11857876, 11713452, 11403740, 11198319, 11130999, 11135808, 10982908, 10469358, 10845819, 10205039, 10458392, 9833507, 9556219, 9644570, 9509433, 9349464, 9285428, 9126680, 8727718, 9122169, 8612657, 8299546, 8336509, 8367933, 8515259, 7830936, 7797388, 8079676, 7786435, 7834383, 7472873, 7343482, 7372346, 7316791, 7166375, 7080664, 6761926, 6848608, 6812436, 6836973, 6668016, 6529621, 6134222, 6390174, 6253366, 6229420, 6307787, 6297698, 6182705, 6047734, 5693572, 5803786, 5707632]
14085E707632J28658l14561l745P8287j68717K00019l58422j64151J05158j63225
14075E046933l1520l26490K90653k19228o7351J59657j31649j39677K54380k37894
14065D597814L56065l22059P3076m89124K8761j69555K17000m2035k52895p7600
14055C919448O5972j50692K28097k07639o7223k7974k02574M6035J00709m1109
14045C663050L67442m35381n6637k4762m6328o4138m6699j22896L96830l18037
14035C312444r7074j2365K29121k37468J40827k9525J63799l69552j72837P9086
14025C006456j11685J19622j80385J43780J97972k68301O9336j55591K23880o3355
14015B981729l28499K35280l25030J34895K54330k06446m26120K91534n1668j43453
$$ y = [5707632, 5836290, 5521729, 5517984, 5596271, 5427554, 5627573, 5269151, 5105000, 5210158, 5046933, 5015413, 4688923, 4979576, 4760348, 4692997, 4852654, 4721005, 4581328, 4835708, 4597814, 4953879, 4631820, 4704896, 4215772, 4244533, 4074978, 4291978, 4249943, 3997048, 3919448, 3985420, 3834728, 4062825, 3855186, 3787963, 3759989, 3557415, 3603450, 3704159, 3663050, 4030492, 3595111, 3538474, 3513712, 3467384, 3403246, 3356547, 3233651, 3630481, 3312444, 3215370, 3203005, 3432126, 3194658, 3335485, 3305960, 3469759, 3100207, 2927370, 3006456, 2894771, 3014393, 2834008, 2977788, 3175760, 2907459, 2976795, 2821204, 3045084, 2981729, 2653230, 2888510, 2563480, 2698375, 2952705, 2746259, 2320139, 2611673, 2560005, 2416552]
14005B416552j39196Q5487J98968o4666o1587L6338j03740O8080k68316J948q2210
13994B087658K18569l4143O8058J37173m65969l8090L9091L20903j54459k23308
13984A955483J28730q8747L50724m7943J92383M3683M87572K05050M16118J139078
13974D782131K061416L141908O107386R934742J866744q091462o241210m217596
13966I344059k591355j077691q68328m94432n09573n27236l63887K31717k84574
13957B858700j33053k42536Q8768J1319k81590j7862j02053J49043j62519J08874
13947B277091j95250l9450o0820J03383L3574j05595k62941O9845l73627M12417
13937A858627j93385K89913l91233K01681R7656k65201K73242r2806K8625m56633
$$ y = [2416552, 2277356, 2362843, 2561811, 2497145, 2435558, 2471896, 2368156, 2436236, 2167920, 2169868, 2087658, 2306227, 2272084, 2340142, 2477315, 2011346, 1973256, 2012347, 2333250, 2178791, 1955483, 2084213, 1995466, 2346190, 2298247, 2490630, 2534313, 3021885, 3226935, 3643053, 4782131, 6843547, 9985455, 16092841, 26027583, 27894327, 19802865, 13561655, 9344059, 6752704, 5675013, 4806685, 4312253, 3802680, 3275444, 2911557, 3143274, 2858700, 2725647, 2483111, 2571879, 2583198, 2301608, 2283746, 2181693, 2330736, 2168217, 2277091, 2081841, 2042391, 1981571, 2084954, 2118528, 2012933, 1749992, 1819837, 1446210, 1858627, 1665242, 1955155, 1563922, 1765603, 1863259, 1598058, 1871300, 1778494, 1807119, 1350486]
13927A350486L30283J15728j45532K29050k05124j37538J69056l41569K80274
13918A645114p5925o6484m7385K17671k47939J93784n120R122j09026L51724m67809
13907A397727M09655m42761j70084J79077K64611m06710j2258M20641k80033K38261
13897A598126N1705q4983k28440R99k91838M81392l71075K49800p0122K27821
13887A563385l85502r2498K13481J15810j25587l07641M86470l05402K18327k7494
13877A353349l040n1295j08425j08778J52598k76350M9655P8493p3878j8457J26650
13866A120522l1710l95158J68753K93265K4270p9639j8024j02970M19088F81590
13855I83199J86204m7980J39111k32515q7668k39003J86807K41388l35143o344
$$ y = [1350486, 1680769, 1796497, 1650965, 1880015, 1674891, 1537353, 1706409, 1364840, 1645114, 1569189, 1502705, 1455320, 1672991, 1425052, 1618836, 1613716, 1622838, 1513812, 1865536, 1397727, 1807382, 1364621, 1194537, 1373614, 1638225, 1231515, 1219257, 1639898, 1359865, 1598126, 1649831, 1564848, 1336408, 1337407, 1045569, 1526961, 1155886, 1405686, 1335564, 1563385, 1177883, 1085385, 1298866, 1414676, 1289089, 981448, 1467918, 1162516, 1380843, 1353349, 1350309, 1299014, 1190589, 1081811, 1234409, 958059, 1007714, 1086207, 1012329, 993872, 1120522, 1088812, 693654, 862407, 1155672, 1179942, 1100303, 1082279, 979309, 1398397, 681590, 983199, 1169403, 1121423, 1260534, 1028019, 940351, 701348, 888155, 1129543, 794400, 788056]
13845G88056M23762j74312j51544K6337n9552J49822m40850L11319j37868K88953
13835A024123k01834J1243m2108P3507J64026L9135k71365J08761j88933K17420
13825I33975J88064k8530j05637j86057J01425l25247J62208r038q6075K1998
13815F67086K35247k19916K16547j03549k20621M2843Q1456L54186k12586K7101
13805H67794k13K9590o6071P340o9757j58j84265N18302l75369J00484p4609K27196
13793I80264O8301j36443k13997k61650j8376J39471J09066J40925k01622J74845
13783G80784J0242k32507P1767L39628l21927j49552q1990K70773k5684k5558
13773F35976k26786K36131K2045k7633k94755M35668m9607j11818M5491K3955
$$ y = [788056, 1211818, 1037506, 885962, 912299, 852747, 1002569, 561719, 873038, 735170, 1024123, 822289, 833532, 791424, 864931, 1028957, 1068092, 796727, 905488, 716555, 933975, 1122039, 1093509, 987872, 801815, 903240, 577993, 740201, 731163, 645088, 667086, 902333, 682417, 898964, 795415, 574794, 617637, 699093, 1053279, 840693, 867794, 867581, 897171, 831100, 838440, 768683, 768525, 584260, 1102562, 727193, 827677, 753068, 980264, 1048565, 912122, 698125, 436475, 418099, 557570, 666636, 807561, 605939, 780784, 791026, 558519, 630286, 969914, 647987, 498435, 416445, 687218, 661534, 635976, 409190, 645321, 667366, 639733, 344978, 780646, 731039, 619221, 664712, 688667]
13763F88667K7495j96794L40661j38696j00353p5200O2656L27673j81683B71148
13752F00344r4376L44897M9819j27171l55982L64794j19746j5540p3740l502L20877
13741H90674l15865J48817C05324K33713N6758J32461r8589K03084C13663J58915
13731D72578K62298C62409K29820j39037r262R3046O943m22K30542N6164l45960
13720D84243F3729M81439o4162O3274K5731n6283J36157J3539p9521j54702L63769
13709G92970C91679O7678j29898L14313k30772J59780q6037L5790j3452K6097
13699E35178J89036j25841o0374l9255j5088j43720J53172B41036L95589J08034
13689G44659k49483J18359B45714M76849A80713K81223p0888K72488k98283L50010
$$ y = [688667, 716162, 519368, 860029, 721333, 620980, 545780, 608436, 936109, 754426, 271148, 600344, 505968, 850865, 900684, 773513, 417531, 782325, 662579, 647039, 573299, 569797, 890674, 574809, 723626, 305324, 539037, 595795, 728256, 629667, 832751, 313663, 472578, 734876, 362409, 592229, 453192, 443930, 536976, 543919, 543497, 774039, 830203, 484243, 63729, 545168, 481006, 544280, 570011, 513728, 649885, 663424, 583903, 429201, 792970, 391679, 459357, 329459, 643772, 413000, 572780, 486743, 522533, 509081, 535178, 724214, 598373, 537999, 498744, 483656, 339936, 493108, 241036, 636625, 744659, 495176, 613535, 245714, 722563, 180713, 461936, 391048, 663536, 365253, 715263]
13679G15263k38102J14129A28967L08428K07018k75532o7399M2345J09086J1685
13669D64598J86374N1451r2476A50845L22771J78075j78731J60923k92923j03723
13659B37237K84747J23733r1908A67888K45577O752p820P5213J12128B84154L53161
13648F37315n6622J70027l03317O5233J72041k45294J23818j79950c269A09549
13637F87852j2620O2317n4190l16011J78084j20303A46796R6655h8765D97256
13626F74023B79632J15560j19886R5188a01246B33788r3008J67356A45550F7459
13615B36477L46879k61622R3001o2079K37836d9476D10264A18081J55771J05837
13605C79689J08631k39563L0172b750C89807J01585J0559j85847j25649K36399
$$ y = [715263, 477161, 591290, 128967, 437395, 644413, 368881, 301482, 343827, 452913, 464598, 650972, 702423, 609947, 150845, 473616, 651691, 472960, 633883, 340960, 237237, 521984, 645717, 553809, 167888, 413465, 420217, 412397, 487610, 599738, 284154, 637315, 580693, 750720, 447403, 512636, 684677, 439383, 563201, 383251, -3269, 109549, 687852, 675232, 737549, 683359, 367348, 545432, 425129, 146796, 243451, -88765, 497256, 674023, 279632, 395192, 275306, 370494, -101246, 233788, 140780, 308136, 145550, 67459, 236477, 583356, 321734, 414735, 352656, 590492, -49476, 410264, 118081, 273852, 379689, 488320, 248757, 278929, -2750, 389807, 491392, 501951, 316104, 190455, 426854]
13595D26854O5365A68469O88202B81797B9272J21390B6660J73495e1308B91427
13584B21843K18575o134j27599j1956O8805J0749R1232j10191J96602k59131L36354
13573F29149B29351R2467J04200p5419K30805o1681O3978B15869j8082D8929K08787
13562B57716j2703m8224o805n9398K93161j87156J31836A82410J8770J71705r0124
13551B82761J52171j96049j10795n5362M22218j94681J19372J6194j51822j8623
13541B65384e9805k7001C0947K12678O8659j05424K83872j42031L86233B95600
13530C26814A00129J34716M5840p2136N6267H0378K51665B2471P5528L6042L25141
13519D59182B07402I4615L38398M886q5370A57288L84875A18921d757C06702P9079
$$ y = [426854, 492219, 168469, 856671, 281797, 29272, 150662, 26660, 200155, -51308, 291427, 221843, 440418, 434284, 306685, 294729, 363534, 374283, 465515, 355324, 551926, 292795, 629149, 229351, 321818, 426018, 350599, 581404, 519723, 583701, 215869, 197787, 48929, 257716, 245013, 196789, 189984, 130586, 423747, 236591, 368427, 182410, 201180, 372885, 282761, 434932, 238883, 128088, 72726, 494944, 300263, 419635, 435829, 284007, 265384, -59805, -86806, 30947, 243625, 312284, 206860, 490732, 348701, 734934, 295600, 326814, 100129, 234845, 280685, 208549, 264816, 80378, 332043, 22471, 97999, 134041, 459182, 207402, 94615, 433013, 437899, 352529, 157288, 542163, 118921, -4757, 306702, 385781]
13508C85781b21336A56282c5444A40777m3293K60137J02406o6094j25077j7412
13498B51444m9422D2078K34852M1576a01699B74366A25539k0053K14235R9378
13488D19099A92093J73392A69841j4835K99407A00472K61898j37716J65618J0381
13478D00653m5540k6927O7711E3239M16510A49993J67651O8910j57877J77422
13468D06099E53N32173B29061K23341B17587M9629H3583J26981B30M23873A09065
13456F7632J82072R9401P390A76004P3650E9617J74912F4193N14102D5113c9292
13444C53245p4550B7586K63998L68600k03226A26888M9508J12009j11000R7230
13434B74635L7288j20247J61319A59105J8017Q4296Q8643p7642j31168R0325H0188
$$ y = [385781, -221336, 156282, -35444, 140777, 97484, 357621, 460027, 393933, 268856, 251444, 202022, 42078, 276930, 318506, -101699, 274366, 125539, 105486, 319721, 419099, 192093, 365485, 169841, 155006, 454413, 100472, 362370, 224654, 390272, 400653, 355113, 328186, 395897, 53239, 469749, 149993, 317644, 386554, 228677, 406099, 553, 532726, 229061, 452402, 217587, 267216, 83583, 210564, 230, 424103, 109065, 67632, 249704, 349105, 356495, 176004, 249654, 59617, 234529, 64193, 578295, 45113, -39292, 353245, 278695, 27586, 291584, 660184, 456958, 126888, 176396, 288405, 177405, 274635, 311923, 191676, 352995, 159105, 177122, 261418, 350061, 272419, 141251, 231576, 80188]
13422D05850i741A9907L40748H8329J22491b8007H2473j2545M37730N1999A98825
13410A46705G0171A6955K84450n2679q1335J29600A08248O843O2740Q3348a55232
13398b45413D70839A32111h1187B03969R5653C751M6440M10650I5448L6628a0056
13386B62239n8360c501C60670A53630b2212l20605B75279m733J23368A68985j7215
13375A51770J15836a5061B10252F9641L02659A75713D2064p282j6735K00549A4609
13363b4878A70976n4113L12342j80502J28920j76433J48599o0974q2840I511R6846
13352A06357a28831A44766K95333A06503J26163J84578r0491G2565K84612q9436
13342B67741a3954A92021J85475B2336K18665l8323J86385d8916D37771i370C10677
$$ y = [405850, -9741, 19907, 360655, 88329, 210820, -28007, 82473, 69928, 507658, 559657, 198825, 146705, 70171, 16955, 301405, 248726, 167391, 296991, 108248, 115091, 177831, 261179, -155232, -245413, 470839, 132111, -81187, 203969, 299622, 3751, 50191, 460841, 95448, 132076, -10056, 262239, 203879, -3501, 360670, 153630, -22212, -342817, 275279, 270546, 393914, 168985, 151770, 267606, -15061, 210252, 69641, 372300, 175713, 42064, 34782, 18047, 218596, 14609, -24878, 170976, 116863, 429205, 248703, 377623, 201190, 349789, 288815, 205975, 9511, 106357, -128831, 144766, 440099, 106503, 232666, 417244, 326753, 72565, 357177, 267741, -13954, 192021, 377496, 22336, 241001, 202678, 389063, -48916, 437771, -9370, 310677]
13330F4317K19190J33586G6912J35560J87049Q196A22070K10423K98556A65360
13319D89742A72830K97L92850f7936B62834A5096K65418j10819P5251B1040b0266
13307B45455B7790K25256a6885H3604M33772a31518A43160L16870j97368B2888
13296D16038j96114l1864L1606K8637R5739n6130J2827g6890C2780J72135q63
13285B04052n2066K55119j31631J29508j95732c4780E8770f8190B28614c0685
13274E9631L59566d7452D15748b03649g0433A59825p0235Q6043m4526Q634G517
13262e7085D8364j7725L05338A37250E5547L7091j0346b88936f088D41252d6679
13250g9509I7161a06403D9690R1414E6974b71047C08895I9574a66603A27372I124
$$ y = [64317, 283507, 417093, 76912, 212472, 399521, 407717, 122070, 332493, 631049, 165360, 489742, 172830, 173127, 565977, -67936, 262834, 15096, 280514, 169695, 244946, 21040, -20266, 245455, 27790, 253046, -16885, 83604, 517376, -131518, 143160, 460030, 262662, 22888, 416038, 219924, 188060, 219666, 248303, 344042, 287912, 300739, -76890, 32780, 204915, 204052, 151986, 407105, 275474, 404982, 209250, -34780, 58770, -68190, 228614, -30685, 59631, 419197, -47452, 415748, -203649, -70433, 159825, 89590, 175633, 131107, 139741, 7517, -57085, 48364, 30639, 335977, 137250, 55547, 92638, 82292, -288936, -6088, 441252, -46679, -79509, 97161, -106403, 49690, 141104, 56974, -271047, 308895, 99574, -166603, 127372, 9124]
13238H5895A6121L86398a55076C10463A1998b61114A73128R9196q0019F840L12926
13227C19766N8187j01842D9517c7058B22877J66581B9666P3150Q7109D848J24202
13216A29050J2572c33073A26986J75662C180a18788H1899M62b24734d4133B08108
13204A36863q490J53175j09776D2499N0959B5190L03834p8425J69542H6154M3859
13193A30013J10801D690J30688D8362K06076o0972J30508e2151B89530k8646j05901
13182A54983J11106F8726k46j8246J35330g8639I5079a5320B23220I7173a9412
13170A09890d439I0606L0053a01380A02726J93942h0792q7224B94242l6336f2358
13158C91694i7907G4306a2410A09660K13111A32914b6742F23949H3516J01596
$$ y = [85895, 16121, 402519, -155076, 310463, 11998, -261114, 173128, 272324, 192305, 6840, 319766, 377953, 276111, 49517, -37058, 222877, 389458, 29666, 102816, 189925, 4848, 129050, 141622, -333073, 126986, 302648, 3180, -118788, 81899, 82361, -224734, -44133, 208108, 136863, 128373, 281548, 171772, 42499, 93458, 25190, 329024, 250599, 420141, 86154, 130013, 240814, 4690, 135378, 48362, 254438, 193466, 323974, -52151, 289530, 260884, 154983, 266089, 68726, 68480, 50234, 185564, -78639, 95079, -15320, 223220, 97173, -19412, 109890, -4439, 90606, 120659, -101380, 102726, 296668, -80792, -168016, 294242, 257906, -62358, 391694, -97907, 74306, -12410, 109660, 322771, 132914, -26742, 623949, 83516, 185112]
13148A85112H511L35087k4241D0961a16984E5122J6894K97673b21793A57361J04948
13137B62309c3450j90556g3682n7701A4854b05719A07934J9195a71343N1461E9811
13125d2625B43872o5867f3792A12232C6128a50362A06226D3853e6109B6070L64243
13114C90313A44984i271G9632K47825j03002b47837e2447G9614N0072n5063Q3580
13103A58203l799M1778G9757a41244H2041h9828b2833f840A9025a18835H2480
13091B37817Q2311o2967j13190F1713b87538i0990m4377I2794e7890A5153B483
13079E0455k2059K07139i5340L8639C3056j3419P570K89080j177A9773J30861
13068A50634F2937a63739A70389E5404R1301b3316C18086e8946L749D1142J83173
$$ y = [185112, 8511, 343598, 319357, 40961, -116984, 55122, 72016, 369689, -221793, 157361, 262309, -33450, -224006, -73682, -131383, 14854, -205719, 107934, 127129, -171343, -119882, 59811, -42625, 243872, 178005, -63792, 112232, 36128, -150362, 106226, 43853, -56109, 26070, 390313, 144984, -9271, 79632, 327457, 224455, -247837, -52447, 79614, 129686, 74623, 158203, 154404, 196182, 79757, -141244, 82041, -89828, -22833, -6840, 19025, -118835, 82480, 237817, 320128, 257161, 143971, 61713, -287538, -90990, -135367, 92794, -57890, 15153, 2483, 50455, 28396, 235535, -95340, -56701, 33056, 19637, 27207, 316287, 315110, 19773, 150634, 62937, -163739, 170389, 55404, 146705, -23316, 318086, -58946, -55197, 41142, 224315]
13057B24315a80703A07071k7251B1611L67041a1454j29220E7237K53914d412G5246
13045A63729b1436k20187B84277J31153J57522A39353J58394b3128C3393K86000
13035C19393A26859a27431B81702C7514P5749m4692P5322L6815G7419K59444q2492
13024B54371a43941A2629d9460A37085j113b9307A47772F0983J56165D2140a89148
13012A98787J51167b6212o9284A18565K1677b32100A33406g7611B67211b36599
13001A1088e2048j38644L8033A07224K5680J19710j04004i1450j03298A02319
12990C87934h3695H411R9384c3797G5831J42212r8086G435b63424B05532F2574
12978C3446M9671J58077g8936A04710K46224i1182I0553K26069a68680L7114C39423
$$ y = [224315, -180703, 107071, 79820, 21611, 388652, -11454, -140674, 57237, 311151, -4412, 75246, 163729, -21436, -241623, 284277, 415430, 572952, 139353, 297747, -23128, 33393, 319393, 126859, -127431, 281702, 37514, 113263, 68571, 143893, 180708, 77419, 336863, 254371, -143941, 12629, -49460, 137085, 135972, -29307, 147772, 60983, 217148, 42140, -189148, 198787, 349954, -26212, -95496, 118565, 140242, -232100, 133406, -77611, 267211, -236599, 11088, -52048, -190692, -152659, 107224, 132904, 252614, 148610, -91450, -194748, 102319, 387934, -83695, 8411, 107795, -33797, 75831, 218043, 119957, 7435, -263424, 205532, 62574, 33446, 83117, 241194, -78936, 104710, 350934, -91182, 90553, 316622, -168680, -131566, 339423]
12966c8957j24954A27936B5991e381D6135c1813l8217i068r4300C91759j55919
12955B35840b98863C16338h1100A9865b01189C2582P2424h842B82950J6518I2183
12943a83539h2704c0679k80664a23737B50259b2409A14319m9113M9126O0350D6723
12931C0804f3350K5811j55048d2506A19754o459K0473j3932a20338G8036C7466
12919A02986J80450q0462K7082f4790G2831g2646A25306c6961j62962O4993b1547
12907C809J5972J18126C0870L19467j28342d834B3593q584J57747E3849J59988
12896B13837o4376h3622A37287a20861A38467b47317A47459J17438a64131B19553
12885c40703B6452J21958a33278A21505R9727a44427A928J71263a01221a1708
$$ y = [-38957, -163911, 127936, 25991, -5381, 46135, -31813, -70030, -9068, -103368, 391759, 235840, -298863, 316338, -81100, 19865, -201189, 32582, 105006, -8842, 282950, 299468, 92183, -183539, -82704, -30679, -311343, -123737, 250259, -22409, 114319, 65206, 114332, 174682, 46723, 30804, -63350, -37539, -192587, -42506, 119754, 113295, 133768, 119836, -120338, 78036, 37466, 102986, 283436, 202974, 230056, -64790, 72831, -72646, 125306, -36961, -199923, -134930, -21547, 3809, 19781, 137907, 30870, 350337, 221995, -4834, 23593, 15009, 172756, 53849, 213837, 149461, -83622, 137287, -120861, 138467, -247317, 147459, 264897, -164131, 219553, -340703, 26452, 148410, -133278, 121505, 221232, -144427, 1928, 173191, -101221, -11708]
12874c4867k41641C06715a15892C69803b48102B78889b6814l1924B00088B3008
12863c2500B22666H003M8939e883l3914k5634K0344p5415l9651f7648m0204A94063
12850G8405g9811m7310D5387e0210r9376n2376A38260N2083N5499E2847Q2138
12839A34985c1176C58074e6231k38558h4023A65640l1540c9077B14208A6546J49488
12828A66034a37507B7390K12402A11836J49109c7188C44775j54067J48207c98062
12817a52358e7544A12731E2100j6519e6736m5909G4865b33741g2065A91740O8591
12806B60331H5449A9708a63263i015j18345B9318L6654L4771e0405l2476E5454
12794B9134M10130b22260D3739e7047C1495M7370a68246r5964B7385f6662A52704
$$ y = [-34867, -276508, 306715, -115892, 369803, -248102, 278889, -26814, -58738, 200088, 23008, -32500, 222666, 8003, 56942, -5883, -39797, -65431, -45087, -120502, -160153, -67648, -107852, 194063, 78405, -79811, -127121, 45387, -50210, -149586, -201962, 138260, 190343, 245842, 52847, 134985, -31176, 358074, -56231, -294789, -84023, 165640, 134100, -39077, 214208, 16546, 166034, -137507, 27390, 239792, 111836, 260945, -37188, 344775, 190708, 338915, -398062, -152358, -57544, 112731, 52100, 35581, -56736, -102645, 74865, -233741, -72065, 191740, 260331, 85449, 19708, -163263, -9015, -127360, 29318, 65972, 100743, -50405, -82881, 55454, 29134, 439264, -222260, 43739, -57047, 31495, 78865, -168246, -264210, 27385, -66662, 152704]
12782a21244A80583a74079j7917j7831C87851n4534c17995M4583I7071e289A60569
12770b34209K9682B82245f0474K4328j4000A28914l047b73149B26750J25456A19251
12758i689A25269a53189l7489A92044B1584J11959P7885p1160g9289B38656E9084
12746b3550I9522R9707R5048c1344k32804R0460P1366L658b4983j48229B0822
12734d4696E4729J04380K23666a39803N1181D7622a06333A84018b4596C5799B966
12722c42183C17749A22873a50116B5904J61670b63887A29160k8385j5742b74939
12711c9350l6063r160L8021r2625a2644C8663K11684r8359D8996g5782C6884J8431
12699E5315h9299I8531C1246L18441I3005Q9250R8471d4137A12428J86217b01257
$$ y = [-121244, 180583, -174079, -191996, -209827, 387851, 333317, -317995, -273412, 97071, -5289, 160569, -234209, -204527, 282245, -60474, -36146, -50146, 128914, 125867, -273149, 226750, 352206, 119251, -9689, 125269, -153189, -190678, 192044, 21584, 133543, 211428, 140268, -79289, 238656, 59084, -23550, 99522, 199229, 294277, -31344, -264148, -173688, -102322, -98664, -24983, -173212, 20822, -44696, 54729, 159109, 382775, -139803, -88622, 47622, -106333, 184018, -24596, 35799, 2966, -342183, 317749, 122873, -150116, 25904, 187574, -263887, 129160, 100775, 85033, -274939, -39350, -75413, -84573, -46552, -139177, -12644, 38663, 250347, 151988, 48996, -75782, 36884, 55315, -89299, 98531, 31246, 349687, 93005, 182255, 280726, -44137, 112428, 298645, -201257]
12687C6144Q8359D6943K15560d428j96596C7641J4226d01418D04626d9213I0283
12675d6353A51122A6478K53286g9170B57065C8312L8587K31179E7480d3285B61767
12663e5481C7416P3802B9345K78995a7614F5085J67779J11430j36608a87234b0316
12651b29435C25731G1415C1155O3498K83507A02579a98781B6443J78706A2855
12640B72762N621J2847g5849j9316A81577b34103A35660a9805C03096a21964m6483
12629a68447B67168A656P3760a91706a8939A86045J13166a28847L7277B37687
12618d1330B15982A03600B996a09606B34539n0259L20862E3612J50975L6490j18203
12607A22874M3457O6541F3712a58779B6935J15834J02882A03261a06244j26488
$$ y = [36144, 124503, 46943, 262503, -4428, -201024, 37641, 51867, -401418, 404626, -49213, 90283, -46353, 151122, 16478, 269764, -79170, 257065, 38312, 76899, 308078, 57480, -43285, 261767, -55481, 37416, 111218, 29345, 308340, -17614, 65085, 232864, 344294, 207686, -187234, -20316, -229435, 325731, 71415, 31155, 94653, 378160, 102579, -198781, 26443, 205149, 12855, 272762, 278383, 291230, -75849, -95165, 181577, -234103, 135660, -19805, 303096, -121964, -168447, 267168, 1656, 75416, -191706, -18939, 186045, 299211, -128847, -91570, 237687, -41330, 215982, 103600, 2996, -109606, 234539, 184280, 505142, 53612, 204587, 241077, 122874, 166331, 232872, 63712, -158779, 26935, 142769, 245651, 103261, -106244, -232732]
12597b32732d1222a812E1430a05844A6198F849J2411a61392A69157J8242p3459
12586A13940K75012j51924O3178I5845c8775h91B91373C7212b18522A73962B1192
12574D84679a85114j6259B67457q1942E2659a75994D6254q222J2277a16813A43324
12562a69945A8216d2548F1159e6625j3885o7974E4558a10158C0378a56428O4202
12551i2226D0262a3724D3070M2888J61647b18454F4543J28726D0666d9138j32550
12540a81688l6629A79632D1399a42819M8850A92116C2446a94778j419B01279h3836
12528A8605L5059c3061B57906c8711C98678a6063A85840a22019C7248m018c7206
12516B19340e5694j37941B35176a21393e4745a6654C56106c13867B85951d8030
$$ y = [-232732, -41222, -1812, 51430, -105844, 16198, 6849, 19260, -161392, 169157, 187399, 113940, 388952, 237028, 300206, 95845, -38775, -891, 291373, 37212, -218522, 173962, 21192, 484679, -185114, -201373, 267457, 185515, 52659, -175994, 46254, 38032, 50309, -116813, 143324, -169945, 18216, -42548, 61159, -56625, -70510, -138484, 54558, -110158, 30378, -156428, -92226, 40262, -13724, 43070, 85958, 247605, -218454, 64543, 193269, 40666, -49138, -181688, -218317, 179632, 41399, -142819, -93969, 192116, 32446, -194778, -196197, 201279, -83836, 18605, 53664, -33061, 257906, -38711, 398678, -16063, 185840, -122019, 37248, 33230, -37206, 219340, -55694, -193635, 235176, -121393, -54745, -16654, 356106, -313867, 285951, -48030]
12505I8063g1812D230L26130A04497I85K72394o1437J56443F499J76745a53339
12493A63236r186K4916J00102a24294j54231J01944B03213g827k25318K8088G1226
12481a3787j00637I9961a73061k68386b5999l4480B36387o7310M0644K14203A48120
12469A02937a60808j26675D00940a5092a352j38582j72965h8887k18127d1030
12458A32090C4874h0377F5388K25749b32736A16577A0075a72486O0287A79907
12447b65146J23883j49762C33668j04585O1073q3757I3474k3595b64006A01707
12436F2035i3632A06199O4500R3930A06409h5999A25186a89436N6695F7460L3130
12425A00590c81515a1082j24565j52479F172R5714e4072r3409c008B20496o4209
$$ y = [98063, -71812, 4230, 330360, 104497, 985, 273379, 211942, 368385, 6499, 183244, -153339, 163236, 154050, 178966, 279068, -124294, -278525, -176581, 203213, -7827, -233145, -205057, 71226, -13787, -114424, 99961, -173061, -441447, -25999, -60479, 236387, 169077, 209721, 423924, 148120, 102937, -160808, -287483, 400940, -15092, -1352, -139934, -312899, -88887, -307014, -41030, 132090, 34874, -80377, 65388, 291137, -232736, 116577, 10075, -172486, -112199, 179907, -265146, -141263, -291025, 333668, 229083, 290156, 206399, 93474, 69879, -264006, 101707, 62035, -93632, 106199, 170699, 264629, 106409, -85999, 125186, -189436, -132741, 67460, 100590, -381515, -11082, -135647, -288126, 6172, 101886, -54072, -147481, -3008, 220496, 156287]
12414A56287F4555a22887K9613K2121A2406C382J23541C5311K3620a6052B0257
12402f2748C59175j72787b4180A0274b18437j5457a3729B25960i673m6690B08246
12390g0815m53403B07006q203g6411l7315B4612Q5357e97119A4037a71677B00029
12378A85140e4487q4961d0715B69267G3892N7616b41232B19760n3943f0738B12332
12366A4K94211a08701A63216a69174c9051B14113H802J69168d6279C3180f6515
12354i197o5016A53704a0452k62268G3950c11673D2385j9759a10759a5838B17982
12342C27215a36875L5451G6723c2932I1931K35348D0944L03428F6522J39317C1838
12330A83842o0427O6327n1898A7427f2403A4698L76786j37579a54703a7625A71355
$$ y = [156287, 64555, -122887, -93274, -71153, 12406, 3382, 126923, 35311, 58931, -16052, 20257, -62748, 359175, 186388, -24180, 10274, -218437, -233894, -13729, 225960, -9673, -56363, 208246, -70815, -524218, 207006, 198803, -76411, -113726, 24612, 109969, -597119, 14037, -171677, 200029, 185140, -54487, -139448, -40715, 269267, 73892, 131508, -241232, 219760, 165817, -60738, 212332, 14, 294225, -108701, 163216, -169174, -39051, 214113, 8802, 177970, -46279, 33180, -66515, -9197, -74213, 153704, -10452, -272720, 73950, -311673, 42385, 22626, -110759, -15838, 217982, 327215, -136875, -101424, 76723, -32932, 91931, 327279, 40944, 344372, 66522, 205839, 31838, 183842, 123415, 189742, 137844, 17427, -62403, 14698, 391484, 253905, -154703, -17625, 171355]
12318a48383b4988k0742l8743A87470e1624A84586a14626e426A06315J24998Q0945
12307C12258A6131a88046A91183b24606H3007a56113D9857a31216B99036j31687
12297A67349a14088q5802H0744Q706K52162A4053J17036b81998A35499K62555
12287C98054A94560a82176E0998K20751A21339m1479b36484a05483J8182l3040
12277a20341J0094L3082A6970e2823k01229B54178a44036C98184j65998e6243
12266a17520K1989B29031g2069i56j149j93091C4928J83348f0801A31472j8825
12255A12647c021A44594m1160j7192a64422f9696q2453N9959B3758a21339c5927
12243A04856j6242j5926c2641l2904B57704g1782l244C39457j38062a34543j2991
$$ y = [-148383, -24988, -45730, -84473, 187470, -51624, 184586, -114626, -5426, 106315, 231313, 312258, 16131, -188046, 191183, -224606, 83007, -156113, 49857, -131216, 299036, 167349, -114088, -199890, 80744, 89450, 341612, 14053, 131089, -281998, 135499, 398054, 194560, -182176, 50998, 271749, 121339, 79860, -236484, -105483, -87301, -120341, -110247, -77165, 16970, -52823, -254052, 254178, -144036, 398184, 232186, -56243, -117520, -95531, 229031, -72069, -956, -2105, -195196, 34928, 218276, -60801, 131472, 112647, -3021, 144594, 103434, 86242, -164422, -69696, -152149, -92190, 23758, -121339, -35927, 104856, 88614, 72688, -32641, -65545, 257704, -71782, -75026, 339457, 201395, -134543, -147534]
12232a47534C3200R9658L3268a02137a8733C71761j31851E2700J05775G066b24734
12220A59567p9018b04047D54384j36083e0296B06835R0780m0918e7688B00704
12209b7455G9460J35501a35805G49K14582q328J58578H1735L37057D4549M51610
12198D96159d8409n9411E5168N0093a28507A9801J13913J24259A2076i435j11094
12187a20529A60443J48262j08567B6102H987L70923A09762D4656J30845J64349
12177C39850j09778m3423R2898J40493A40015m8039h8828B73267L6520b56750
12166c3425C29714j7875M0179b13324a588j24718C7123K64246a55828J1574j07577
12155b51831Q3443C33005A13223K06070A21450a37392A06906a38469A18295a6171
$$ y = [-147534, 33200, 132858, 166126, -102137, -18733, 371761, 239910, 52700, 158475, 7066, -224734, 159567, 80549, -204047, 454384, 318301, -50296, 206835, 297615, 256697, -57688, 200704, -27455, 79460, 214961, -135805, 749, 215331, 207003, 365581, 81735, 418792, 44549, 496159, -48409, -107820, 55168, 105261, -128507, 19801, 133714, 257973, 12076, -9435, -120529, 160443, 308705, 200138, 26102, 8987, 379910, 109762, 44656, 175501, 339850, 230072, 186649, 279547, 420040, 140015, 91976, -88828, 273267, 309787, -256750, -33425, 329714, 311839, 352018, -213324, -1588, -126306, 37123, 301369, -155828, -144254, -251831, -168388, 333005, 113223, 319293, 121450, -137392, 106906, -138469, 118295, -16171]
12144D33086a10739k4303b0413j69192A04255j4712R9107f3695A16512r680P2447
12133A79279q2958h6308A68123j2156d4798p0275C9844J24376g8278c2673B20326
12121D13409i7695a3022j42280a705n2897D7678h9709I324L4731B0764J97087
12110B17851p8220n5578O325j6233a81910b0651J0003A8489J43620a28487d6950
12098a37825A84722n2138g5006j12137B00694a71178i92A81705a95033j8589k7219
12087b40841B73935f7173o5883C16583j24970H6380L19637E4065N9458e0133A7858
12075B1842b81879a09262A7518L17029h8987h899B3974J31892L2247B7729J86660
12064B14389a61782B7406d01886i7484d0126j59296n5224A11935O05820J23963
$$ y = [433086, -110739, -135042, -20413, -189605, 104255, 89543, 188650, -63695, 116512, 106832, 179279, 96321, -86308, 168123, 155967, -44798, -115073, 39844, 164220, -78278, -32673, 220326, 413409, -97695, -13022, -155302, -1705, -54602, 47678, -89709, 9324, 44055, 20764, 217851, 139631, 84053, 90378, 74145, -181910, -20651, -10648, 18489, 162109, -128487, -46950, -137825, 184722, 132584, -75006, -187143, 200694, -171178, -992, 181705, -195033, -213622, -240841, 273935, -67173, -133056, 316583, 191613, 86380, 406017, 54065, 113523, -50133, 17858, 21842, -281879, -109262, 17518, 334547, -88987, -8899, 23974, 155866, 188113, 27729, 214389, -161782, 27406, -401886, -97484, -40126, -199422, -254646, 111935, 717755, 841718]
12054H41718Q3780D06002j21255j06962d425j47837B66261p4419J30173A29770
12043d31974G5554B3581c0144j32630A42223Q8092e8938E2694b78055f8448B09858
12031a5335A20785a56514o0754e2587p1353j4678q1379A00210b63175R1517B58480
12019b5809r3704E8001c3571A35414E3496a57395E2035a86052A36506a54065A43104
12007g3092c76k75543B16316J12128j49566a56204l8218B81155b33490F1181b091
11995E11354b0168k58480e7610B16379e8036j21304D3111M12J42749N5899b03189
11983a04015A385a28656b7675A02389i6916C11827f1030j65697J08367C6388g3211
11971b36537P4214A30785k7367b65861j12435a57780C3450b5963C16552a87865
$$ y = [841718, 925498, 406002, 284747, 177785, -4425, -152262, 266261, 191842, 322015, 129770, -431974, 75554, 23581, -30144, -162774, 142223, 230315, -58938, 52694, -278055, -68448, 209858, -15335, 120785, -156514, -217268, -52587, -123940, -138618, -219997, 100210, -263175, -171658, 258480, -25809, -119513, 58001, -33571, 135414, 53496, -157395, 52035, -186052, 136506, -154065, 143104, -73092, -376, -275919, 216316, 328444, 178878, -156204, -194422, 281155, -233490, 61181, -2091, 511354, -20168, -278648, -57610, 216379, -58036, -179340, 43111, 43523, 186272, 242171, -203189, -104015, 1385, -128656, -27675, 102389, -96916, 311827, -61030, -226727, -118360, 36388, -73211, -236537, -162323, 130785, 103418, -265861, -378296, -157780, 33450, -25963, 316552, -187865]
11960b5975j37776A14757J76618c30884a30378d2614k98378J40060l5285g8752
11949A57786m7452c12066B1966h4491H0990J6733i0538k9513j9972k70591e4698
11937D7523b71362P226B24914e8381a8040A45339E4951c942B6527M0636b2359
11925f7817I5607L104a19367j58123G9306b19173G3624N577b55093J18934j48293
11914b84452f6725B89491n9731d4905n0014A50482a15940j32497a6284A4152b62918
11902b76037c8239E7885j75a70005j3240p0120N6584A97637b73201M7850b3242
11890H0768J39458p2698a9225j413E0242b2942l60180e1222E5989R9094n0704
11879A04379R5060a18898m0527I8165b95870g4680J0574j4934b5721G5295b02147
$$ y = [-25975, -163751, 114757, 291375, -330884, -130378, -42614, -340992, -200932, -236217, -78752, 157786, 110334, -312066, 21966, -84491, 80990, 97723, -90538, -120051, -140023, -410614, -54698, 47523, -271362, -264136, 224914, -58381, -18040, 145339, 54951, -3942, 26527, 67163, -22359, -67817, 95607, 98711, -119367, -277490, 79306, -219173, 73624, 79201, -255093, -136159, -284452, -66725, 289491, 229760, -44905, -94919, 150482, -115940, -248437, -16284, 14152, -262918, -276037, -38239, 57885, 57710, -170005, -183245, -253365, -196781, 197637, -273201, -225351, -23242, 80768, 220226, 147528, -19225, -20638, 50242, -22942, -383122, -51222, 55989, 155083, 104379, 199439, -118898, -159425, 98165, -295870, -74680, -64106, -79040, -25721, 75295, -202147]
11867B0565b2754k10888h0044A33313a16045b3456k81024J00628P5449C1932J52495
11856A84427Q191Q1194C1829r108a45508e1621D4074a35368l1698O6989D850e5195
11843a54035A50657g7165A90834E5480J5504a83991G6491a30759K1691e0349j44520
11832a94869A15009a60756B41916H1904R1346M9418c35779J01431E3314a57010
11821b7904j74759A6673b96891d1827F2286a28115e1776b312r4894B79243B3478
11809B4499J9699J13630a39453q3585f1782b3046C8399J87867c95246a89204A46425
11797D00617H8586J7283d7784m3805d3647A23282a33303K189b3203E4545c86795
11785A39768b10562H5427a52748A12281d6897j09633J1248N1050B23572c13429
$$ y = [20565, -22754, -233642, -80044, 133313, -116045, -23456, -304480, -203852, -128403, 31932, 184427, 192618, 273812, 31829, 22721, -145508, -51621, 44074, -135368, -167066, -100077, 4850, -55195, -154035, 150657, -77165, 190834, 55480, 70984, -183991, 76491, -130759, -109068, -50349, -194869, 115009, -160756, 241916, 81904, 173250, 222668, -335779, -234348, 53314, -157010, -27904, -202663, 16673, -296891, -41827, 62286, -128115, -51776, -2312, -97206, 279243, 23478, 24499, 44198, 157828, -139453, -223038, -61782, -23046, 38399, 226266, -395246, -189204, 146425, 400617, 88586, 105869, -47784, -91589, -43647, 123282, -133303, -131114, -23203, 54545, -386795, 139768, -210562, 85427, -152748, 112281, -46897, -156530, -145282, -94232, 223572, -313429]
11774d5951C27744a51276B41899a01632j47139b3358A31402b54485d6679l2411
11764g9090m463b3628B09698c6741A21268a5393A70688N6381d02777a88379q0747
11753b69126A67108a54346h09j69811a6411k78004J07901F7698J30862H8990J81903
11742B70893m5451F5980J0501n133F181f8759j60071O0772p9142a3472k94796
11731c08268H2720b49788b6373C60025d7486j07908J9348k17985C1730N3352b06232
11719e9516a5828A01902K20505G56J36001a28153O3818M963B1309P161c6431j53242
11707a89673C2691a2300r1372l5482A66879a60172O673J9159A09917K07739a33581
11695c352A63323b46332k7646A04535H544l078N6467L3609i7837K0626D8636i1372
$$ y = [-45951, 327744, -151276, 241899, -101632, -248771, -23358, 131402, -254485, -46679, -79090, -83553, -23628, 209698, -36741, 121268, -15393, 170688, 227069, -402777, -188379, -269126, 167108, -154346, -809, -170620, -16411, -294415, -186514, 67698, 198560, 88990, 270893, 225442, 65980, 76481, 71348, 6181, -68759, -228830, -168058, -247200, -13472, -308268, 82720, -249788, -26373, 360025, -47486, -155394, -136046, -354031, 31730, 85082, -206232, -59516, -15828, 101902, 322407, 756, 136757, -128153, -64335, -59372, 21309, 28470, -36431, -189673, 32691, -12300, -103672, -139154, 166879, -160172, -153499, -134340, 109917, 317656, -133581, -3352, 163323, -246332, -273978, 104535, 8544, 5466, 61933, 95542, -97837, -77211, 48636, -91372]
11682A86401j7783a91431g7657B24468A10208L0523c30408c8167k17655c0650
11671A39420M4080f4859A08499b60123A76204c82913B10589q5359B964J80343
11661A83307f2695l156D48070a5934n30A26215a31276F4118h6128n9853A88968
11649F3716e8185j94959a10774B15696L3121D0459N0620a67291j7783F0386a67336
11637i0739A03159N5947a69809O3352K6321c520j25873A77968k9468b72830B57983
11625b48217A20459l1291a69017I0387b13181G8047c5213p9204n2795B62229j27013
11614A35216g5263B30828a74029B10678l6010e3413B12444G3649a70784J0716
11604a60068H6587b21654j0765C71331E964J55540b47516C15363b83263A956b76613
$$ y = [186401, 168618, -191431, -77657, 224468, 110208, 140731, -330408, -38167, -255822, -30650, 139420, 183500, -64859, 108499, -260123, 176204, -382913, 210589, 125230, 2964, 183307, -62695, -65851, 448070, -15934, -16464, 126215, -131276, 64118, -86128, -145981, 188968, 63716, -58185, -253144, -110774, 215696, 248817, 40459, 91079, -167291, -185074, 60386, -167336, -90739, 103159, 159106, -169809, -106457, -80136, -3520, -129393, 177968, 148500, -272830, 257983, -248217, 120459, 89168, -169017, 90387, -213181, 78047, -35213, -114417, -167212, 262229, 135216, -75263, 230828, -174029, 210678, 174668, -53413, 212444, 73649, -170784, -160068, 86587, -221654, -232419, 371331, 5964, 161504, -247516, 315363, -283263, 1956, -276613]
11592G3154e8584j60752j00026c6746l08849c4366B72666j33742a56468A19478
11581b70083a00349D3425b61086B23449I7873H175e6377R355A47631c693r7801
11570a01494l872B9557c42410C03814a465G1167a42994b9096H3640M33206c5361
11558c9797B83876a14384q870C26927i4622G7010c4502B25258i6394l0094k28260
11547c54748a16799B23151J66296A08666d01B49822d7744j24489B13616D4557
11536I5817A7600J32370b5916A57185G5405K34486b59142C760J55391a37571B13124
11524A9224j098N7602h1310B19755m258C1782K8382N4402j5555a37137B4256a77871
11511B94746a27115k1300A30059b50841A34652b2526I4352P2810m7583A4287K3422
$$ y = [73154, -58584, -219336, -319362, -36746, -345595, -34366, 272666, 138924, -156468, 119478, -270083, -100349, 43425, -261086, 223449, 97873, 8175, -56377, -47022, 147631, -3693, -101494, -105366, 29557, -342410, 303814, -1465, 71167, -142994, -29096, 83640, 516846, -35361, -39797, 283876, -114384, -123254, 326927, -94622, 77010, -34502, 225258, -96394, -126488, -354748, -116799, 223151, 389447, 108666, -401, 249822, -47744, -172233, 213616, 44557, 95817, 17600, 149970, -25916, 157185, 75405, 309891, -259142, 3760, 159151, -137571, 213124, 19224, 18126, 75728, -81310, 219755, 215497, 31782, 60164, 114566, 99011, -137137, 24256, -177871, 294746, -127115, -148415, 130059, -250841, 134652, -22526, 94352, 167162, 119579, 14287, 37709]
11500C7709a00637A52040a12522A27496a40258O2618B25007K25417A74315L5077
11490B09392o0807B0276L7657B6916K10757g9947B93660q3112K60061a60765A71180
11478B00643F1802M65327k37621a512k1340j53155B71570B6262d5477B20085K3475
11467B43560J34257G7105J40240F3594P7215K85599A53609n7924i9471L7678B89532
11455A04015J61985m6477a9815D9060R5410J80557a90422A19063K07540p7589
11445B49014J4974c8388B1881r282g3383J1350p087A56339n535e6694A22217A3414
11432A91774a13922B40343j6732j11569K2810J9880F2408d5581j77983A3629L1638
11421D5267j9040f5345A88844R4248B7885L50636i5318E1473B2205g8880a6350
$$ y = [37709, -100637, 152040, -112522, 127496, -140258, -77640, 225007, 450424, 174315, 209392, 148585, 20276, 57933, 26916, 237673, -79947, 293660, 210548, 470609, -160765, 171180, 200643, 61802, 527129, 289508, -1512, -22852, -176007, 271570, 26262, -45477, 220085, 243560, 377817, 77105, 217345, 63594, 140809, 426408, 153609, 95685, -99471, -61793, 289532, 104015, 266000, 219523, -19815, 49060, 144470, 325027, -190422, 119063, 326603, 249014, 263988, -38388, 21881, 12599, -73383, -62033, -69120, 156339, 150804, -56694, 122217, 13414, 191774, -113922, 240343, 223611, 112042, 134852, 154732, 62408, -45581, -223564, 13629, 45267, 26227, -65345, 188844, 283092, 27885, 378521, -95318, 51473, 22205, -78880, -16350]
11409A35820F7003e2883G84b74111b3566j41445D1707L4329I849J40652K14196
11398C64697A35217b22223A58609b37608G8585R2057a6553D2753e6438A2032K30437
11387B42469a2438k03556G8790j478k3196a77409e7061f716m3170B19611a71812
11375A55310P3356e297j47646j05555A25079d03038a27247B53091G7226J76945
11365B54171a43129E3110M1020i9890A29766b35263B23960G7313b6828k2460A69362
11353b7250D1220a65781E958K2496a27075G942a4843F2507K04794B8597b5645
11341A24289a47779A77726J2214a86470j6413Q1721r7191a2280n7547b6838B22969
11329f2848G0301o578a76295C09378e3005l39436F1601a85469H0606b26446R9751
$$ y = [135820, 67003, -52883, 784, -274111, -23566, -165011, 41707, 76036, 9849, 150501, 364697, 135217, -222223, 158609, -237608, 78585, 170642, -16553, 42753, -56438, 12032, 242469, -12438, -215994, 78790, 77312, 54116, -177409, -57061, -6716, -49886, 219611, -171812, 155310, 228666, -5297, -152943, -258498, 125079, -403038, -127247, 253091, 77226, 254171, -143129, 53110, 94130, -99890, 129766, -235263, 223960, 77313, -26828, -49288, 169362, -27250, 41220, -165781, 5958, 28454, -127075, 7942, -14843, 62507, 267301, 28597, -25645, 124289, -147779, 177726, 189940, -186470, -202883, -121162, -218353, -12280, -69827, -26838, 222969, -62848, 70301, 63723, -176295, 309378, -53005, -392441, 61601, -185469, 80606, -226446, -126695]
11318a26695A28348e2181a3116k09571A23485c11671E5266a47481N9517m08707
11308d96671c8815k40000A72672B4721a20568A44678i2800b1230n4105E0457a87739
11296b24122K5702A90004i0936B7962K2500b25558m7890A05271a79690A04212
11285c9052o9545l9783B8412b55315P2407A04522e465j98426A48298a86845B61844
11273A5038J53215b82252M3479J13670a7670C1569a59754q8591E3018a14846o1108
11262a75954g7402A58218E6495J34437f7797p9834D7921K0801a57000j06857m3956
11251c07813c3412J5194k27560C1129d81811c6089n7422A80118o15a8409k2097
11240d0506A70905c49674a52076G0804c51239a73169g0929m0654C31753d8169
$$ y = [-126695, 128348, -52181, -13116, -222687, 123485, -311671, 55266, -147481, -87964, -496671, -38815, -278815, 172672, 24721, -120568, 144678, -92800, -21230, -75335, 50457, -187739, -224122, -198420, 190004, -90936, 27962, 50462, -225558, -273448, 105271, -179690, 104212, -39052, -108597, -148380, 28412, -255315, -182908, 104522, -5465, -203891, 148298, -186845, 261844, 15038, 168253, -282252, -238773, -125103, -17670, 31569, -159754, -248345, 53018, -114846, -175954, -77402, 158218, 56495, 190932, -67797, -147631, 47921, 68722, -157000, -263857, -307813, -33412, -18218, -245778, 31129, -481811, -36089, -93511, 180118, 179503, -18409, -40506, 170905, -349674, -152076, 70804, -351239, -173169, -70929, -111583, 331753, -48169]
11229b21212e4349g604I9723K53519a49306q8654P226h8242A24692b59927c3691
11217a14760j38577e3305j89190O0471e1774r6430A43924B8108K7154J84687E6012
11205b46968d364A76503a1779d114q7251p3747A2766a22104d9973j38724J2715
11194a75982A84483a58023A24868c6509A72561b5963j26686j44449m8124B67371
11183I1193h99l63480H2044k3116B7789a53546C5670J95653a2333G5061c40244
11171i9005E6329b80659g1221I779b27673J00399B47404A117J33977g4915k78906
11160c53821N7007A07512a90130e37B60739b49712N2997l5311Q1129I5058a72328
11148d32714i4642A62696c68364g1880C4075A3733a56634A5942a52804g3261E3230
$$ y = [-221212, -54349, -7604, 99723, 353242, -149306, -237960, -230734, -88242, 124692, -259927, -33691, -114760, -253337, -53305, -242495, -182024, -51774, -148204, 143924, 28108, 55262, 239949, 56012, -246968, -4364, 176503, -11779, -4114, -91365, -165112, 12766, -122104, -49973, -188697, -175982, 184483, -158023, 124868, -36509, 172561, -25963, -152649, -297098, -345222, 267371, 91193, -899, -364379, 82044, 58928, 27789, -153546, 35670, 231323, -12333, 75061, -340244, -99005, 56329, -280659, -71221, 9779, -227673, -127274, 247404, 1117, 135094, -74915, -353821, -296814, 107512, -190130, -537, 260739, -249712, -196715, -232026, -150897, 95058, -172328, -432714, -94642, 162696, -368364, -71880, 34075, 13733, -156634, 15942, -152804, -73261, 53230]
11136h4966A09403D1117d4909A82293o3418a11072B76359I112C803L34343l4468
11125C03678A19711B6377b15094e2592j04594b7598j15289N831A68626q4196k0008
11114F4422b71043b6840B31945a84085A93013K9623I1341J46414Q4961I1306m5539
11103D5767J09307O3520c37822F8686J35424J4949C8931a03076C06273o3375C1433
11091B37159M4231m249j25413Q7662E1156J07864G5013e8313A19859J22023G6807
11079a52680B83398A15146P2182i1250E216K8871d454j05672c3982C41003I9236
11067D32012B05856F4329b37994B53646K9139K29282B07256J57393j43919P4585
11057B95315j28702N3903M09712B53063P35865D08305A40920P2954J64774A48779
$$ y = [-84966, 109403, 41117, -44909, 182293, 118875, -111072, 276359, 9112, 3803, 338146, 303678, 119711, 26377, -215094, -52592, -157186, -27598, -142887, -137056, 168626, 84430, 64422, -271043, -26840, 231945, -184085, 193013, 222636, 91341, 237755, 322716, 91306, 45767, 155074, 218594, -337822, 68686, 204110, 219059, 38931, -103076, 306273, 242898, 31433, 237159, 281390, 277141, 151728, 239390, 51156, 159020, 75013, -58313, 119859, 241882, 76807, -152680, 283398, 115146, 187328, -91250, 5216, 34087, -4454, -110126, -33982, 341003, 99236, 432012, 205856, 64329, -237994, 253646, 282785, 512067, 207256, 364649, 220730, 295315, 166613, 220516, 630228, 253063, 988928, 408305, 140920, 213874, 378648, 148779]
11046C75795J03556m4587N0985J55354A21369M94619L8998l8772K32685k65455
11036E83444L46741k66775J28157N6803l7004k64575K55517J1524j821J97646
11026A009657o0346D41578K91856J37112C22503L20818K24654K24194n22942L21833
11016H91060r0984o7047r7613M6194L6963L72852n02148r7106L54944k16460K11739
11005H42394k99036k66994J97731p743K17436j37419P3273N10561C23791M2998
10995C66789Q0536O1172L4185M7302j55814J23744L08828k94766L6231J3972L07067
10984I29246C77447L71210J99569m17346K02350k01831J62556k4781N36253m85027
10974G20400K66943l92729R3830K98589j5510J14764J00320j97604N09096j33923
$$ y = [375795, 479351, 434764, 485749, 641103, 121369, 615988, 654986, 616214, 848899, 583444, 930185, 663410, 791567, 848370, 811366, 546791, 802308, 813832, 812011, 1009657, 949311, 441578, 733434, 870546, 322503, 643321, 867975, 1092169, 569227, 891060, 800076, 733029, 635416, 681610, 718573, 1091425, 589277, 492171, 847115, 630655, 842394, 543358, 276364, 474095, 466352, 683788, 546369, 619642, 1130203, 323791, 366789, 447325, 508497, 542682, 589984, 434170, 557914, 866742, 571976, 608207, 622179, 929246, 377447, 748657, 948226, 530880, 733230, 531399, 693955, 669174, 1205427, 720400, 987343, 594614, 688444, 987033, 971523, 1086287, 1186607, 989003, 1498099, 1364176]
10964A364176K55693k4244J1388L70819K98596J68621k0256L54489P8354q2077
10954B775559M7699k31755o1829m10825l36370m4718n3801n6421k50178r1109
10944A286252r9098J43354J05348l76214M4715J91730j88283k36586P2479l30383
10934F13314j66749J8549j77783K02756j6020k03655A09923K04913A43910J45121
10924B89031J34673j83594O0531a24426C80179F7631A4718K007J33796n9148A8911
10912G442O1512K07465c61307M0544D02392F6134K0756J4863m6492c05948C1639
10900i9019k31398D48562a06554b9907B08641g7976c3586l3527A0750b06804Q1047
10889a25757I849O8469L1725g5661A54090f4549A64796h0971A93900b37210b1876
$$ y = [1364176, 1619869, 1595625, 1607013, 1977832, 2276428, 2445049, 2424793, 2779282, 2857636, 2775559, 2823258, 2591503, 2529674, 2118849, 1782479, 1737761, 1683960, 1627539, 1377361, 1286252, 1187154, 1330508, 1435856, 1059642, 1104357, 1296087, 1107804, 871218, 943697, 613314, 446565, 465114, 287331, 490087, 474067, 270412, 109923, 314836, 143910, 289031, 423704, 240110, 300641, -124426, 380179, 67631, 14718, 16725, 150521, 91373, 18911, 7442, 68954, 276419, -361307, -320763, 402392, 66134, 86890, 101753, 55261, -305948, 31639, -99019, -330417, 448562, -106554, -29907, 208641, -77976, -33586, -67113, 10750, -206804, -125757, 9849, 78318, 110043, -75661, 154090, -64549, 164796, -80971, 193900, -237210, -21876]
10877H3488A5962b10560D5402b89740c9948a6030I4400J04867a37149b9402l71705
10866d01107J75989A95122B9856d5949k95534D78074d468B04783i6643j36357
10856b33000a05680a7265m3764j43447P7467A69463j0028K5716b8942k26522B10184
10844h6561l6630C8838O4921b38726K655A37805b45904B1715e0670C9729a6616
10832b55074A66222d6906B38874e7755n8517j27200A39096M8104a14982n4431
10822a69413G4509a52792B70644f3502n8397j76480A43998o7290a402G2087g2404
10810h6365q8814j74929A11339b74491A66721c16536M4142r501M7141H4523F13
10798b027E5467c01654d0899A88196b18075A48845l3286J6791b87509J43333k301
$$ y = [83488, 15962, -210560, 45402, -289740, -39948, -16030, 94400, 199267, -137149, -29402, -401107, -225118, 195122, 29856, -45949, -341483, 478074, -4468, 204783, -96643, -233000, -105680, -17265, -61029, -204476, -127009, 169463, 159435, 185151, -28942, -255464, 210184, -86561, -123191, 38838, 103759, -238726, -236071, 137805, -245904, 21715, -50670, 39729, -16616, -255074, 166222, -46906, 238874, -57755, -116272, -243472, 139096, 187200, -114982, -169413, 74509, -152792, 270644, -63502, -121899, -298379, 143998, 76708, -1402, 72087, -72404, -86365, -175179, -350108, 111339, -274491, 166721, -316536, -272394, -281895, -234754, 84523, 613, -2027, 55467, -301654, -40899, 188196, -218075, 148845, 115559, 132350, -287509, -144176, -146477]
10787a46477A4744J22464K6327a00181F2919L3261J3817J32867c6668j64136A19962
10775C9264j9119P1366O065l4342K25637A04102a56926O2068A40066e089A0430
10763D57427A24987K04649E0191a98324D3661P4125K261J19711a59360o1174A04065
10751a4088k3902j14366m915d3260q0812A48889n4964O8798c97246J69626p7021
10740c04641j031J09745A85691o6410e6292F2023c4643o7680j64052h2357j61648
10729b44005F8016J0917L2773a14193N6816D2087K9423k4567C198c5727j67450
10718b03177B82601f9361G5916a06218K8204C23940b02867F4558b67833I7934
10707d2139j29830K4165A41157d3142j99396B46370q0396a00631j79684O3110
$$ y = [-146477, 14744, 137208, 163535, -100181, 62919, 96180, 109997, 242864, -36668, -200804, 119962, 39264, 20145, 91511, 97576, 63234, 288871, 104102, -156926, -94858, 140066, -5089, 10430, 457427, 124987, 329636, 50191, -198324, 43661, 117786, 120047, 239758, -159360, -220534, 104065, -14088, -37990, -152356, -157271, -43260, -124072, 148889, 93925, 162723, -397246, -227620, -304641, -305672, -195927, 185691, 119281, -56292, 62023, -34643, -102323, -266375, -82357, -244005, 68016, 78933, 111706, -114193, -57377, 42087, 71510, 46943, 3198, -35727, -203177, 282601, -69361, 75916, -106218, -78014, 323940, -202867, 64558, -267833, 97934, -42139, -171969, -147804, 141157, -43142, -242538, 246370, 165974, -100631, -280315, -217205]
10697b17205A55441m4438b62988A32447c14505M3540j36363d1457B12292j01939
10687A10353a34023O2953G1349B1461J13957f6510a3903A93419d0978j33713h0511
10675B114J57201c10870F5302b53603j32079B86747a24224N0851A12501B7003
10664A35619c68949J28643M3315B52351n2065c9752q7980O0249A06425b81666
10653A2691M9717h0331L6111j62894M6343a4564B50710A01466f2713D32817i1551
10641a3395j35528r7762B34640q3363a15922B04528B1508P3584d4678F648P8907
10630H5555B0491f2861p7747A60097p8595b06146L1993a1095j46143l6168A95538
10618E5054Q0209A4714K22299b5472j95900A71946h6969K9339E8491A1407P3255
$$ y = [-217205, 155441, 111003, -262988, 132447, -314505, -270965, -407328, -41457, 212292, 110353, -134023, -71070, 71349, 21461, 135418, -66510, -13903, 193419, -40978, -174691, -80511, 2114, 159315, -310870, 65302, -253603, -385682, 286747, -124224, -73373, 112501, 27003, 135619, -368949, -240306, -196991, 252351, 200286, -39752, -127732, -67483, 106425, -281666, 12691, 62408, -80331, -44220, -207114, -160771, -14564, 250710, 101466, -62713, 432817, -91551, -13395, -148923, -246685, 234640, 151277, -115922, 204528, 21508, 95092, -44678, 6648, 85555, 20491, -62861, -140608, 160097, 81502, -206146, -174153, -11095, -157238, -193406, 195538, 55054, 135263, 14714, 237013, -25472, -221372, 171946, -86969, -57630, 58491, 11407, 84662]
10607H4662a6937k12079g7251e455j73061B539b0645l56811G2213J3530K3750
10596A09493c47463d3629k52747A75558F0358e9245I7649k2451d12991B9896J10033
10585A39929d87016h6194j47896M0790B40432A6406J51245D839K7259a63998A70711
10573G3171a08455I9358a90293A03350f2805k4260l6012C0822K24587a04368d4000
10561i12l42070b2084j86698l28054J50805h8862E1699d0972l42511a3559j85607
10550a99166h1859j07220i1141m3891L2307B8661h8C6789i4869B284h0663l272
10538h3935C84155a02383H8772A5803J14693a14356A22721B6724Q7084J15591
10528B29399j04810a07383R800j32989A05333c20623A05080P5417a28367f1123
$$ y = [84662, -16937, -229016, -77251, -5455, -178516, 2539, -20645, -377456, 72213, 85743, 109493, -347463, -43629, -296376, 175558, 60358, -59245, 97649, 75198, -412991, 29896, 139929, -487016, -86194, -234090, -193300, 240432, 16406, 167651, 4839, 32098, -163998, 170711, 73171, -108455, 99358, -190293, 103350, -62805, -87065, -123077, 30822, 255409, -104368, -44000, -912, -342982, -22084, -208782, -536836, -386031, -88862, 51699, -40972, -383483, -13559, -199166, -81859, -189079, -91141, -135032, -102725, 28661, -88, 36789, -94869, 2284, -80663, -83935, 384155, -102383, 88772, 15803, 130496, -114356, 122721, 26724, 113808, 229399, 124589, -107383, -97583, -230572, 105333, -320623, 105080, 180497, -128367, -61123]
10517H7607b64284H8487a61415B56686D1735d6026D8038b75174I0278a17885r7308
10506b15193A4787J4827c6254j21853j18693a10747m2635F8674a5854k74265c7044
10494a42917C34976g3384j58261o2352a28222i305d319F5295a60459A38168B8642
10482c12644a02071c6967A31935h4810A7538J13223a39478B15208A969J16579
10472A18548b90065E639a24833j47267J18600b1345j3135j2136D1343K9727a93181
10460H3374a63763j04476Q1891b9772A08524d1421J5761d65k6872p3209A21593
10448g801A4220a87866m7212J09260N675C3945L209K02675q1952h414j15582j6486
10436a40482c8335A62134J2707A9494f8696k17577k5500R9683A91662a40799N2069
$$ y = [87607, -264284, 88487, -161415, 256686, 41735, -46026, 48038, -275174, 90278, -117885, -215193, 14787, 29614, -36254, -158107, -276800, -110747, -153382, 68674, -15854, -290119, -37044, -142917, 334976, -73384, -231645, -293997, -128222, -9305, -4319, 65295, -160459, 138168, 28642, -312644, -102071, -36967, 131935, -84810, 17538, 130761, -139478, 215208, 1969, 118548, -290065, 5639, -124833, -272100, -153500, -21345, -34480, -46616, 41343, 71070, -193181, 83374, -163763, -268239, -186348, -29772, 108524, -41421, -25660, -465, -27337, -100546, 121593, -7801, 14220, -187866, -235078, -125818, -120143, 33945, 37154, 239829, 157877, -8414, -123996, -140482, -38335, 162134, 174841, 19494, -68696, -286273, -311773, -212090, 191662, -140799, -88730]
10425h8730A88162C1P686O5462a7412r9471D8652e8422a971k8860m6057A19571
10412A37316J7355g1928n6109A50714d7773a338B99766H573M3162f8717A46171
10400a25760j51499c6903E6391b13483L1601I0622L4757g4662B64185c57955C5174
10388b51309A54232k3237J23814p3789J0538n0359n2929c65755L4120b8603j00072
10377a28675K844H2309i8587F1695b37077A81308c0275D3860k0098J50286O5337
10366B39385A06254J08132p7235J07033K79681k50280k0690m9408B2177M33929
10356D56106j11918A55618K70503L8152H3404L62944J71770B39009j4206B7757
10345D07898m2654j96j60349q1529K81528E177N36343k03422j13583O8344j9489
$$ y = [-88730, 188162, 31, 7717, 73179, -17412, -116883, 48652, -58422, -1971, -30831, -76888, 119571, 137316, 154671, -71928, -128037, 150714, -47773, -1338, 299766, 8573, 51735, -68717, 146171, -125760, -277259, -36903, 56391, -213483, -181882, 90622, 125379, -74662, 264185, -357955, 35174, -251309, 154232, 130995, 254809, 181020, 191558, 141199, 88270, -365755, -331635, -28603, -128675, -125831, 82309, -98587, 61695, -237077, 181308, -30275, 43860, 23762, 174048, 239385, 106254, 214386, 137151, 244184, 523865, 273585, 252895, 203487, 22177, 456106, 344188, 155618, 426121, 464273, 83404, 446348, 618118, 239009, 224803, 27757, 407898, 365244, 365048, 204699, 123170, 404698, 5177, 541520, 338098, 224515, 292859, 273370]
10334B73370J35457H2597P1298L32740J21867k96138J88614n1828j98886p4667
10324A75597L1770q5495J74143K923J60263j41134a3719B70516N1443e0111F7828
10312b96711j51839i7047C34576j51855G3045J64559N8662G7052d2404q8675B32009
10300a94895I4410m0534e8530C48171h795A39607E6197J21471a28765j8161B37736
10288d378j9887j14519C58017a51971B94613b30740m7869I4920b64785B6828a2068
10276b59257a01304C36013i5446L6938D8788a05844A0411k441J89857a62188F9843
10264E9169K76458a61456b9434I5895a64153e3115a3304j27400O2764l4000a8245
10252i8760E3567a69592A40891g9010j45885J00287C72132c02721C87841i8859
$$ y = [273370, 408827, 82597, 153895, 486635, 608502, 312364, 500978, 449150, 250264, 175597, 207367, 121872, 296015, 298938, 459201, 318067, -13719, 270516, 321959, -50111, 67828, -296711, -448550, -97047, 334576, 182721, 73045, 237604, 296266, 77052, -42404, -131079, 232009, -194895, 94410, 53876, -58530, 348171, -8795, 139607, 56197, 177668, -128765, -146926, 237736, -4378, -24265, -138784, 358017, -151971, 294613, -230740, -278609, 94920, -264785, 26828, -12068, -259257, -101304, 336013, -95446, -58508, 48788, -105844, 10411, 7970, 197827, -162188, 69843, 59169, 335627, -161456, -29434, 95895, -164153, -53115, -13304, -140704, -77940, -111940, -18245, -98760, 53567, -169592, 140891, -79010, -224895, -124608, 372132, -302721, 387841, -98859]
10241B34426J77799A21344m456i2578b9043D22436M4963a07178O204F6177C849
10229A07869d4659k2850l8335A0198J2131b52684A99647d8593m4440L2446F9989
10217H2722J10952a61759I3122c005B46957h1929H6581a55327j70093B06797C2337
10205a66813m9759h409k31400c4895A73830m6824i747j91075M9241A09501b99598
10193c19508a04083A0449e9992K4688j40357G0631a90412b1084H9249a39600J700
10182a37900j95737f381k32694G8851a46849a9762d672A19051b44967m967N2778
10171a97156H0775a53646B01209b70772J20232o8398b6498j17242l2941L0504
10161a46177e5803l18629J80553f4163H2227b14182C0052b60364D9875d6365o0871
$$ y = [234426, 412225, 121344, 116888, -92578, -29043, 422436, 467399, -107178, -100974, 66177, 3849, 107869, -44659, -67509, -105844, 10198, 22329, -252684, 199647, -48593, -93033, -60587, 69989, 82722, 193674, -161759, 93122, -3005, 246957, -81929, 86581, -155327, -325420, 206797, 32337, -166813, -216572, -8409, -239809, -34895, 173830, 127006, -9747, -200822, -151581, 109501, -299598, -319508, -104083, 10449, -59992, -35304, -175661, 70631, -190412, -21084, 89249, -139600, -137900, -333637, -6381, -239075, 78851, -146849, -19762, -4672, 119051, -244967, -249934, -197156, 80775, -153646, 201209, -270772, -150540, -218938, -26498, -143740, -176681, -146177, -55803, -374432, -193879, -64163, 82227, -214182, 30052, -260364, 49875, -46365, -107236]
10150a07236E9477a06244A16101b07870O5963C19477a28548j90273a43742P0710
10140g3032E7399f5669a9000B98377G9351a44227j08126e0410C8808a39922N0561
10129h9361K5332j59077B1030b25559A38447b13688C3204b94037B46222a42r100
10118i242E722d25398J70781C5650e3213A74156q5359l6454B4291M101L0888J54912
10106B14192m5643a95450p909g0812A79383a06898j54425A24322a53556J1794
10096a41762b0255j25504r4318F4255L18201a34800j38508R7650A85052E7238
10085a77615e7286C23188b687n002A46418F0622B7848J3553i5715c6517l3837
10074g0354n414k60383f4272C6160a74640Q4751l76090H2117k5968b63064A38249
$$ y = [-107236, 59477, -106244, 116101, -207870, -141907, 319477, -128548, -318821, -143742, -73032, 57399, -65669, -19000, 298377, 79351, -144227, -252353, -50410, 38808, -139922, -89361, -64029, -223106, 21030, -225559, 138447, -213688, 33204, -294037, 246222, -142, -9242, 5722, -425398, -254617, 35650, -53213, 174156, 88797, 52343, 24291, 28392, 59280, 214192, 168549, -195450, -203359, -70812, 179383, -106898, -261323, 124322, -153556, -141762, -20255, -145759, -240077, 64255, 382456, -134800, -273308, -175658, 185052, 57238, -177615, -57286, 323188, -2687, -7689, 146418, 60622, 27848, 41401, -95715, -36517, -70354, -75768, -336151, -64272, 36160, -174640, -89889, -465979, 82117, 56149, -263064, 138249]
10062B00537c15628A69780B41R341N4954d4294o5736B11109b98201B27464A01146
10050B11203C2073a31826A8165b11213d03A05914a37445B07205o3030a58117K1659
10039a36458A28175Q6721e8538j94979A10481n1140i885C4321a80095l6268B01940
10027i8752C22390F3902h5194C4850e036l0203B882J73632d289j56019C9980f7885
10014a09165B32771A14418a22659j59436D0721d35808A15475Q1172a33277G6168
10003D6765e8793m6594b7153r96H6092b95973F1422b23846A99805b24379H280
9991d7630j68820B60347A28238e347j15279j53919E3800a11383B23M39100b06057
9979a57939K709A1924c1825j45075K5947n0015j00256R5597d3685j23822b5585
$$ y = [200537, -315628, 169780, 241, 9582, 64536, -44294, -110030, 211109, -298201, 227464, 101146, 211203, 32073, -131826, 18165, -211213, -403, 105914, -137445, 207205, 144175, -158117, -136458, 128175, 214896, -58538, -253517, 110481, 59341, -9885, 34321, -180095, -216363, 201940, -98752, 322390, 63902, -85194, 34850, -5036, -35239, 2882, 176514, -4289, -160308, 39980, -67885, -109165, 232771, 114418, -122659, -282095, 40721, -435808, 115475, 196647, -133277, 76168, 46765, -58793, -105387, -27153, -28149, 86092, -295973, 61422, -223846, 199805, -224379, 8280, -47630, -216450, 260347, 128238, -5347, -120626, -274545, 53800, -111383, 223, 439323, -206057, -157939, -155230, 11924, -31825, -176900, -150953, -200968, -301224, -205627, -43685, -167507, -25585]
9967A82322a38897A35700b71806a32074a6645p3102j07589b8052m806H3353c79123
9955b50333m1816c7437j75522M0301A38258a4430k54008M8698A93409m3139a31550
9943F2638c04393i4772A79371b25150G072a41159A40812b48209B04558I5177g787
9931c68749G3379d6519j44626k02758C11156a55262A12307b66287A84271h2445
9920c8227e763B04961b11697j26314d8553B4137N8551g5202l9891A4342b83439
9908a55743H8836d6710a6570j23617p604k2046H7533N6685m6002D7061b72768
9896b22043H1258g2789m7453C707a42959E7400a25663E336K59772B3928I084b33636
9883c644A1662J59189R0769J02545a45515c4682p1776N0742m3491j60628I4316
$$ y = [182322, -138897, 135700, -271806, -132074, -16645, -89747, -197336, -28052, -32858, 83353, -379123, -250333, -292149, -37437, -212959, -172658, 138258, -14430, -268438, -219740, 193409, 150270, -131550, 62638, -304393, -94772, 179371, -225150, 7072, -141159, 140812, -248209, 204558, 95177, -7787, -368749, 73379, -46519, -191145, -393903, 311156, -155262, 112307, -266287, 184271, -82445, -38227, -5763, 204961, -211697, -338011, -48553, 24137, 82688, -75202, -115093, 14342, -283439, -155743, 88836, -46710, -16570, -140187, -147791, -169837, 87533, 144218, 98216, 47061, -272768, -222043, 81258, -72789, -120242, 3707, -142959, 57400, -125663, 5336, 265108, 23928, 9084, -233636, -3644, 11662, 170851, 261620, 364165, -145515, -34682, -106458, -55716, -99207, -259835, 94316]
9871c0825A72614d9420l1112A42171D1068I912a73963p6384e1708a3084G5641
9859b45511K1685e8727m8803e3414B89521d9715E2183d33753b10456D7468K86508
9848C33976e2138m7680C2648a65719F4523j1057J53913J5951J5240a93292d572
9836a66371p4469j28490J21583j42425J10126R4198A31899d19835B21854h0233
9825g4377B6766J40121k5775A2563a76685b4985o5894l3723G6120K7829a13533
9813a73125M8995B9979a39442j49994G3085J22945g1362l3410B68810f7144m28035
9802d95179K20753B46038l0631g7866D7933b7433l51269f1794H5755N7683a71860
9790a88470H7522B6245a18074k2358j30336F5418e31487i7946o9680A36258f3079
$$ y = [-30825, 172614, -49420, -80532, 142171, 41068, 9912, -173963, -250347, -51708, -13084, 75641, -245511, -223826, -58727, -107530, -53414, 289521, -49715, 52183, -433753, -210456, 47468, 333976, -52138, -99818, 32648, -165719, 64523, 53466, 207379, 223330, 238570, -193292, -4572, -166371, -240840, -369330, -247747, -390172, -280046, -185848, 131899, -419835, 221854, -80233, -74377, 26766, 166887, 141112, 12563, -176685, -24985, -90879, -124602, 76120, 103949, -113533, -173125, -124130, 29979, -139442, -289436, 73085, 196030, -71362, -104772, 268810, -67144, -495179, -274426, 246038, 215407, -77866, 47933, -27433, -378702, -61794, 85755, 143438, -171860, -188470, 87522, 26245, -118074, -140432, -270768, 65418, -531487, -97946, -167626, 136258, -63079]
9778c4055G3633a21941F3507M9154K95592c55234A76544B3474L4763K62834b96614
9766A32195b81117a30016C7591A318a33246A37012j937a39349A62195e6951F331
9754g0000l28918B05299c14019A29002k4248a57136J0174A75949H3594a05999
9743A74761a64962n4275c0428p116j16781j34242a30393p6988A2464K64221a57821
9731A9405h0580G9207j1844e8509G9205b93724D7351b10675r2318a12537A28500
9719h3635J7694p2235j13848k3852k4807G9287f1666j1554k23615a05598j91063
9708b96661C56203c65336J54499j5945A03487f7514H2983A8909K3591b10149d7993
9696c84075e7560l00135J25033A39056F1590b41602A38742a0592j51509n8654
$$ y = [-34055, 73633, -121941, 63507, 112661, 408253, -355234, 176544, 23474, 58237, 321071, -296614, 132195, -281117, -130016, 37591, 1318, -133246, 137012, 135075, -139349, 162195, -56951, 6331, -70000, -398918, 205299, -314019, 129002, 104754, -157136, -146962, 175949, 83594, -105999, 174761, -164962, -219237, -30428, -37544, -154325, -288567, -130393, -207381, 12464, 276685, -157821, 19405, -80580, 79207, 67363, -58509, 79205, -293724, 47351, -210675, -302993, -112537, 128500, -83635, -65941, -138176, -252024, -275876, -300683, 79287, -61666, -73220, -296835, -105598, -296661, 356203, -365336, -210837, -226782, 103487, -67514, 82983, 18909, 42500, -210149, -47993, -384075, -57560, -357695, -232662, 139056, 61590, -241602, 138742, -10592, -162101, -220755]
9686b20755C04313c03430b8805k12873e3053F6927i6039r0523I3702b58723Q2899
9675a75824O9797k94533I9902c13103a1186C8168b0898B87320j16148n111A5810
9663A2462a18181A49154c98028C808b81186B49724a10778j98540a01319l34014
9653d35333I872b35386C2345K77485l7576b16508O0505b1181j78761j1023A09300
9641c11255C82J087a18522B3268J50359N2992c54002A1070a14180b2473p3684
9630i6157l1340A10853d15465A6930a80827A38452P6560G2323m00d232A88330
9618F317e6448B27667d56215a51143A49507a98040D221a26125A32529g8027B56772
9606A55978e319k97563e1649E3372K35287B8838b55022j24570A16685n1793b74442
$$ y = [-220755, 304313, -303430, -28805, -241678, -53053, 66927, -96039, -186562, 93702, -258723, -175824, -106027, -400560, 99902, -313103, -11186, 38168, -20898, 287320, 171172, 166061, 15810, 12462, -118181, 149154, -398028, 3808, -281186, 249724, -110778, -309318, -101319, -435333, 9872, -235386, 32345, 309830, 272254, -216508, -156003, -21181, -199942, -210965, 109300, -311255, 382, 1469, -118522, 23268, 173627, 226619, -354002, 11070, -114180, -22473, -96157, -127497, 110853, -415465, 16930, -180827, 138452, 215012, 72323, 71923, -4232, 188330, 6317, -56448, 227667, -456215, -151143, 149507, -198040, 4221, -126125, 132529, -78027, 256772, 155978, -5319, -302882, -51649, 53372, 288659, 28838, -255022, -379592, 116685, 64892, -274442]
9594b14430C5195J32740J64881b8032j0639j86309H0950e18020A00351b76398
9583B311J9721b40717h1560F351b56382G9290N0669o4720d6335A3888J6807a63949
9570A40684c32511k0505a31681l0206F3852J03231a97454C77839a94719p5971
9560b70690j2713A49642g0315F0893K22080j34345b65992C05754B0354R6567d80
9548B30144i6534q5077O7629j14312d6537j54919d8648B57387i2958A48530b49469
9536a45177l56800B12022A021N2149c77391J52878B44772P0347c1283A30825J22822
9525B53647b06351a01136l4968l52970D0a41058o0077B57802A16437J18120D5002
9513A84028b38834m7397K0517a02492A12435a90231O8782A70911f7921A21219
$$ y = [-214430, 35195, 167935, 332816, -28032, -38671, -224980, 80950, -518020, 100351, -276398, 2311, 22032, -240717, -81560, 6351, -256382, 79290, 129959, 65239, -46335, 13888, 30695, -163949, 140684, -332511, -353016, -131681, -161887, 63852, 167083, -197454, 377839, -194719, -270690, -283403, 149642, -70315, 60893, 282973, 148628, -265992, 305754, 20354, 116921, -480, 230144, -96534, -181611, -113982, -228294, -46537, -201456, -48648, 257387, -92958, 148530, -249469, -145177, -501977, 212022, 1021, 53170, -377391, -224513, 244772, 315119, -31283, 130825, 253647, -206351, -101136, -136104, -489074, 40, -141058, -201135, 257802, 116437, 234557, 45002, 184028, -238834, -286231, -265714, -102492, 112435, -190231, -121449, 170911, -67921, 121219]
9502b82014i317A19572a72055e1032r8192A68054a47903G3267a24463I893L2881
9491D2774a7245l439l37433g6726A28036h0999L483j01283c5583k29269J02888
9480a61964G4421a10784j64170P7478n0678B2087a46269A30567a11671E2992a13837
9468a05373l8188j72899J7481J41107B05361b23910j8719A13726c59311L0254
9458c29057J12603A74467h6122n688a949l6384j3593k24821A07598A6886c10745
9446F257a82927j55022a28343j37652A49566a81981J7049l9568M0382M3782B70912
9434A21901b26906A14767a59934I161a71212B90197o7940b58235Q5814e6017B49802
9422a49885f2530o4895A81458e6432K7017A46911e4241j82494J14280j01014N0075
$$ y = [-282014, -9317, 119572, -172055, -51032, -149224, 168054, -147903, 73267, -124463, 9893, 42774, -17245, -20684, -358117, -76726, 128036, -80999, -77516, -178799, -35583, -264852, -161964, 74421, -110784, -274954, -197476, -248154, 22087, -146269, 130567, -111671, 52992, -113837, -105373, -143561, -316460, -298979, -157872, 205361, -223910, -242629, 113726, -359311, -329057, -216454, 174467, -86122, -91810, -1949, -38333, -51926, -276747, 107598, 16886, -310745, 6257, -182927, -337949, -128343, -265995, 149566, -181981, -164932, -204500, -164118, -120336, 270912, 121901, -226906, 114767, -159934, 9161, -171212, 290197, 222257, -258235, -172421, -56017, 249802, -149885, -62530, -127425, 181458, -56432, -29415, 146911, -54241, -236735, -122455, -223469, -173394]
9411a73394B25110a58213m9311B48515D5983a58819g7657q702n5477A23812A5314
9399a8143j76956E8077B7235L9900J4596j480c0780A0878d23021D5192a81635
9387A67540h1949k68061D757b60170J5144D14535a29625e2722A78427R611d04181
9375g8361A09301c46780B0732g076A26035a79043q9692a25739K9416A5537M8665
9364F4202b78316J15867A2211b11432a9453j39222o4459h6508j26112d7146b136
9352G3009a25004j75063c2430B71913i7298B35067j06619b05196A09295e7135
9341c03011N1399C083a04708k81792A4166g5144j47675e2735l00426c5854j04387
9330a40241O0382O812E3614g9389j22251Q9725A27556d0270l5840e989B52579
$$ y = [-173394, 225110, -158213, -207524, 248515, 45983, -158819, -77657, -86359, -141836, 123812, 15314, -18143, -195099, 58077, 27235, 67135, 81731, 80251, -30780, 10878, -423021, 45192, -181635, 167540, -81949, -350010, 4757, -260170, -245026, 414535, -129625, -52722, 178427, 188038, -404181, -78361, 109301, -346780, 20732, -7076, 126035, -179043, -268735, -125739, -96323, 15537, 64202, -278316, -162449, 12211, -211432, -19453, -158675, -223134, -86508, -212620, -47146, -2136, 73009, -125004, -300067, -32430, 271913, -97298, 235067, 128448, -205196, 109295, -57135, -303011, -251612, 3083, -104708, -386500, 14166, -75144, -222819, -52735, -353161, -35854, -140241, -79859, -73047, 53614, -79389, -201640, -111915, 127556, -40270, -76110, -5989, 252579]
9318a28442B5024c825j78976g2104j17293f1397m771G491J91433J53006b75561
9306C33626a65550M6570b0588m2274C35427A5392c05623c5019j92078J01985A685
9294C0726a71684f9224l0036j69118H4631a68298B9980g6250j90844F418d66034
9282B61572a14961A45910b6137j4315F1712J84617f0913k22983C74256a14913
9271A34376a71195p9102i459m46192J40620a52270F13981c79116M1768H9857b18821
9259B40938r8344M7254D0959a29909q1194D443K32446j14828f9797n8294p9419
9248b07510A44202j8802b06832A22626a00681K9712J4294D7305P2920a2682k46661
9237b59343E9949b02418C9764N9716a58317b6197j20555L6878j49031j07362G794
$$ y = [-128442, 25024, -3825, -182801, -72104, -189397, -61397, -66168, 7491, 198924, 351930, -275561, 333626, -165550, -118980, -20588, -62862, 335427, 15392, -305623, -35019, -227097, -125112, 1685, 30726, -171684, -69224, -99260, -268378, 84631, -168298, 29980, -76250, -267094, 6418, -466034, 261572, -114961, 145910, -26137, -40452, 61712, 246329, -60913, -283896, 374256, -114913, 134376, -171195, -250297, -9459, -455651, -315031, -152270, 613981, -379116, -337348, 89857, -218821, 240938, 142594, 189848, 40959, -129909, -211103, 4443, 236889, 122061, -69797, -128091, -207510, 144202, 125400, -206832, 122626, -100681, -70969, -56675, 47305, 120225, -12682, -259343, 59949, -202418, 39764, 99480, -158317, -26197, -146752, -109874, -258905, -366267, 7794]
9225A00614C9394j6806b00048d6902l6954c7692k52004b7007A64959J11450B152
9213c30333A0596M0856c18218Q0912P2444B2202J9775c18012d0018k2602D07053
9201I8998f0770a0791l31383i0052k28055J17505k6160A56485a29917j59628j16210
9190d05755h2899j32747P0498A34844E9873J13676J7976d59405i1812m5237K2553
9179a14496L9694E7127a64880A15277g1122C8201Q125a20892o9761M1447q741
9168a57947A92988e1437l7940F4262r415c4179k44021A23620b31870K5524F2496
9156c22610C325J39030g8573B86106h988n2847b9879C21475b2628F9442A4231
9144b7204A33676Q9390P7654b73668O2166e5954j65979k62059A41346b42423I5541
$$ y = [100614, 39394, 22588, -200048, -46902, -83856, -37692, -289696, -27007, 164959, 276409, 2152, -330333, 10596, 51452, -318218, -237306, -164862, 22202, 41977, -318012, -40018, -62620, 407053, 98998, -60770, -10791, -342174, -90052, -318107, -200602, -226762, 156485, -129917, -289545, -405755, -82899, -215646, -145148, 134844, 59873, 173549, 191525, -459405, -91812, -137049, -114496, -74802, 57127, -164880, 115277, -71122, 38201, 46326, -120892, -190653, -149206, -157947, 192988, -51437, -89377, 64262, 54847, -34179, -278200, 123620, -231870, -206346, 62496, -322610, 3325, 142355, -78573, 286106, -8988, -61835, -29879, 321475, -22628, 69442, 14231, -27204, 133676, 223066, 300720, -273668, -211502, -55954, -221933, -483992, 141346, -242423, 95541]
9132g5369n8598B2139a63022E5152g7685B8015R7616c00928c5276A09908c19548
9120b44412b537q171l342A4566h7287A87863A3413K9538b04638A57983k4954a72092
9107a85025A75786E0328a35791N206B84829a2165A30879n0636N8400b88243A51650
9095A11911a81864A16148J06089b33904e8740p7484o7523R3556p3770O9998b9635
9083b44763K4534e7925A03880c9634n6161c2503q2311g296m5097E7722g148C8619
9070c59769a24742A32534B206L2716d0402q907o842j2618C27939a99576F9560
9058A46351c36398i4168A05396c80087R7047N2648B68109a23037B06717J6252
9048B22969a92973E9985P9J56027L8215b60560D53024i5710A31296b33368a9187
$$ y = [-75369, -133967, 22139, -163022, 55152, -77685, 28015, 125631, -300928, -35276, 109908, -319548, -244412, -2537, -10708, -14050, 14566, -87287, 187863, 13413, 42951, -204638, 157983, 133029, -172092, -185025, 175786, 50328, -135791, -130585, 284829, -12165, 130879, 80243, 138643, -288243, 151650, 111911, -181864, 116148, 222237, -233904, -58740, -136224, -203747, -110191, -183961, -113963, -29635, -244763, -220229, -57925, 103880, -39634, -95795, -32503, -114814, -7296, -52393, 57722, -7148, 38619, -359769, -124742, 132534, 2206, 34922, -40402, -49309, -56151, -68769, 327939, -199576, 69560, 146351, -336398, -94168, 105396, -380087, -283040, -230392, 268109, -123037, 206717, 222969, -192973, 59985, 60064, 216091, 254306, -260560, 453024, -95710, 131296, -233368, -19187]
9036A0246a27727n7106c8300A0413b89552Q7982B09822c6032j7594p8316A18319
9024H2595f4655b0695k46159J08323N426B0706K56463c9812j22384B43135D8533
9012a73247B58115b73817d2145H5239a77982I4671l5081a01287A20234k5951c57332
9000b19624M8072H037M3686J22599G0990a04240A92430a4772k37804f906k0738
8989b7644j72883k6561K4796e8504J894A08480P0721a09813A75734f8347J0984
8978e7363n6349A60089b01350j13339A35239N3670F3900b21416j33921f6348p3678
8967a40026H5048b0403k87921a30276A16183i2119k36681a30118D3146a83239
8956f6630A7304c7127n5646F8101J31966j3026e3762G4907a68920E8669g7642
$$ y = [10246, -127727, -184833, -38300, 10413, -289552, -201570, 209822, -36032, -53626, -131942, 118319, 82595, -64655, -20695, -266854, -158531, -153105, 20706, 277169, -39812, -162196, 243135, 48533, -173247, 258115, -273817, -42145, 85239, -177982, 94671, 59590, -101287, 120234, 94283, -357332, -219624, -171552, 8037, 51723, 174322, 70990, -104240, 192430, -14772, -252576, -6906, -27644, -200527, -227088, -202292, -58504, -56610, 108480, 179201, -109813, 175734, -68347, -57363, -113712, 160089, -201350, -314689, 135239, 188909, 63900, -221416, -355337, -66348, -140026, 85048, -20403, -308324, -130276, 116183, -92119, -328800, -130118, 43146, -183239, -66630, 17304, -37127, -92773, 68101, 200067, 187041, -53762, 74907, -168920, 58669, -77642]
8944C8178c1782A5630b29927a09588G3405b67384C25664j53693a07424A64743
8933A11514a76792j0924l50972J61698A50067a35826j7389g3226j6649B57368
8922B29464a94153N2449a7906B1526J32547B3545Q3465H376J84702F9K61141J1290
8910B72500N32139L33421N48803J067686K996012K651543m109002j949249j048487
8901A295366m09097j56500F9734K91211A62665l022i2775F6438L8548j482K53693
8890C57197e0260B26637p4856a47889D1351R4430a12990b1452q5048j18506a3911
8878g1559A17391a48338f7838o0793N349j10558B2807b87543n1539F5582N4368
8867A19950h7205N166J7817H0128d9949q5599j07094a07244K6729j08831m3108
$$ y = [38178, -31782, 15630, -229927, -109588, 73405, -267384, 325664, 171971, -107424, 164743, 111514, -176792, -187716, -538688, -376990, 150067, -135826, -153215, -73226, -89875, 257368, 229464, -194153, -141704, -17906, 21526, 154073, 23545, 107010, 8376, 193078, 69, 261210, 272500, 804639, 1138060, 1686863, 2754549, 5750561, 8402104, 4293102, 2343853, 1295366, 886269, 729769, 69734, 360945, 162665, 159643, -92775, 66438, 104986, 103504, 357197, -50260, 226637, 151781, -147889, 41351, 135781, -112990, -21452, -106500, -225006, -13911, -71559, 117391, -148338, -67838, -128631, -123282, -233840, 22807, -287543, -339082, 65582, 119950, -87205, -82039, -64222, 80128, -49949, -135548, -242642, -107244, -80515, -189346, -232454]
8856b32454B01041a58364A31675a61152r7131A44330h9698G2439J64964b82415
8845G1674K06231I2450J38301a66635P5355B63129q0072J26051b2315k38753r1379
8834c52447D9663a44623j22415q3237L3286j13442H4458K5652b14104E4068a47253
8822A47681b705n9651I5524a4305k46744A71816B0916d512j11610k31045J20867
$$ y = [-232454, 201041, -158364, 131675, -161152, -258283, 144330, -89698, 72439, 237403, -282415, 71674, 277905, 92450, 230751, -166635, -91280, 263129, 183057, 309108, -22315, -261068, -352447, 49663, -144623, -267038, -350275, -316989, -430431, 84458, 110110, -214104, 54068, -147253, 147681, -2705, -62356, 95524, -14305, -261049, 171816, 20916, -4512, -116122, -347167, -226300]
$$ [...]
##END NTUPLES=NMR SPECTRUM
##END=
