
##TITLE=UV1156_M5-1005-1002_6301942_61RBpldRb7
##JCAMPDX= 6.0         $$ Bruker NMR JCAMP-DX V2.0
##DATA TYPE= NMR SPECTRUM
##DATA CLASS= NTUPLES
##ORIGIN= BRUKER
##OWNER= Administrator
$$ 1.72 TOPSPIN		Version 2.1
$$ 2012-06-06 04:22:09.671 -0500  Administrator@TOPSPIN
$$ Compression mode = diff/dup
##.OBSERVE FREQUENCY= 400.13188235
##.OBSERVE NUCLEUS= ^1H
##.ACQUISITION MODE= SIMULTANEOUS (DQD)
##.ACQUISITION SCHEME= undefined
##.AVERAGES= 64
##.DIGITISER RES= 22
##SPECTROMETER/DATA SYSTEM= spect
##.PULSE SEQUENCE= noesygpps1d.comp
##.SOLVENT NAME= COFFEE_meoh
##.SHIFT REFERENCE= INTERNAL, COFFEE_meoh, 1, 14.96695
##AUDIT TRAIL= $$ (NUMBER, WHEN, WHO, WHERE, PROCESS, VERSION, WHAT)
$$ ##TITLE= Audit trail, TOPSPIN		Version 2.1
$$ ##JCAMPDX= 5.01
$$ ##ORIGIN= Bruker BioSpin GmbH
$$ ##OWNER= Administrator
$$ $$ C:\Bruker\TOPSPIN/data/COFFEE/nmr/UV1156_M5-1005-1002_6301942_61RBpldRb7/12/pdata/1/auditp.txt
$$ ##AUDIT TRAIL=  $$ (NUMBER, WHEN, WHO, WHERE, PROCESS, VERSION, WHAT)
(   1,<2012-06-06 04:22:04.937 -0500>,<Administrator>,<TOPSPIN>,<go>,<TOPSPIN 2.1>,
      <created by zg
	started at 2012-06-06 04:10:34.687 -0500,
	POWCHK enabled, PULCHK disabled,
       configuration hash MD5:
       D5 CA 7A 23 FE 6B EE E2 50 67 74 61 24 F7 5E 3B
       data hash MD5: 64K
       FE 68 F9 9D 3D 41 76 8E E4 9F F3 8E 0E FF 64 13>)
(   2,<2012-06-06 04:22:07.578 -0500>,<Administrator>,<TOPSPIN>,<proc1d>,<TOPSPIN 2.1>,
      <Start of raw data processing
       efp LB = 0.3 FT_mod = 6 PKNL = 1 PHC0 = 0 PHC1 = 0 SI = 128K 
       data hash MD5: 128K
       85 B7 FC 20 7D 81 8F CA 47 FB A0 FC 5F 9E F8 A9>)
(   3,<2012-06-06 04:22:08.890 -0500>,<Administrator>,<TOPSPIN>,<proc1d>,<TOPSPIN 2.1>,
      <pk PHC0 = 33.73901 PHC1 = 0 
       data hash MD5: 128K
       83 63 BE 6A 9C E4 99 41 58 39 88 96 7A F8 BE 43>)
(   4,<2012-06-06 04:22:09.140 -0500>,<Administrator>,<TOPSPIN>,<proc1d>,<TOPSPIN 2.1>,
      <abs ABSG = 1 
       data hash MD5: 128K
       81 C6 11 B3 65 E0 6C 15 F0 00 6D B4 9F CC 63 A1>)
(   5,<2012-06-06 04:22:09.218 -0500>,<Administrator>,<TOPSPIN>,<proc1d>,<TOPSPIN 2.1>,
      <abs ABSG = 2 
       data hash MD5: 128K
       33 AC 25 0D AC 25 66 70 E0 BC F7 B8 34 A0 70 54>)
(   6,<2012-06-06 04:22:09.468 -0500>,<Administrator>,<TOPSPIN>,<proc1d>,<TOPSPIN 2.1>,
      <abs ABSG = 3 
       data hash MD5: 128K
       B2 17 30 4F CE 48 09 3B B8 1D BD A0 B6 45 FF ED>)
(   7,<2012-06-06 04:22:09.515 -0500>,<Administrator>,<TOPSPIN>,<proc1d>,<TOPSPIN 2.1>,
      <abs ABSG = 4 
       data hash MD5: 128K
       4A D4 A0 E2 9F B7 68 9A AD 57 48 BB 37 70 84 75>)
(   8,<2012-06-06 04:22:09.578 -0500>,<Administrator>,<TOPSPIN>,<proc1d>,<TOPSPIN 2.1>,
      <abs ABSG = 5 
       data hash MD5: 128K
       03 B6 8E DD C2 B2 26 AA 37 24 E0 DD C3 40 A6 36>)
$$ ##END=
$$ 
$$ $$ hash MD5
$$ $$ 18 8E 0C 9E 94 44 72 89 B5 4C 4C 74 A8 BF 70 84
##$RELAX= 
##$RELAX= 
##$RELAX= 
##$RELAX= 
##$RELAX= 
##$RELAX= 
##$RELAX= 
##$RELAX= 
$$ Bruker specific parameters
$$ [...]
##$TP07= 0
##$TPNAME0= <>
##$TPNAME1= <>
##$TPNAME2= <>
##$TPNAME3= <>
##$TPNAME4= <>
##$TPNAME5= <>
##$TPNAME6= <>
##$TPNAME7= <>
##$TPOAL= (0..7)
0.5 0.5 0.5 0.5 0.5 0.5 0.5 0.5
##$TPOFFS= (0..7)
0 0 0 0 0 0 0 0
##$TUNHIN= 0
##$TUNHOUT= 0
##$TUNXOUT= 0
##$USERA1= <user>
##$USERA2= <user>
##$USERA3= <user>
##$USERA4= <user>
##$USERA5= <user>
##$V9= 5
##$VALIST= <valist>
##$VCLIST= <CCCCCCCCCCCCCCC>
##$VD= 0
##$VDLIST= <DDDDDDDDDDDDDDD>
##$VPLIST= <PPPPPPPPPPPPPPP>
##$VTLIST= <TTTTTTTTTTTTTTT>
##$WBST= 2048
##$WBSW= 25
##$XGAIN= (0..3)
0 0 0 0
##$XL= 0
##$YL= 0
##$YMAX_a= 9277150
##$YMIN_a= -6385940
##$ZGOPTNS= <>
##$ZL1= 120
##$ZL2= 120
##$ZL3= 120
##$ZL4= 120
##$ABSF1= 14.96695
##$ABSF2= -5.58558
##$ABSG= 5
##$ABSL= 3
##$ALPHA= 0
##$AQORDER= 0
##$ASSFAC= 0
##$ASSFACI= 0
##$ASSFACX= 0
##$ASSWID= 0
##$AUNMP= <proc_prof1d_extract.lims>
##$AXLEFT= 0
##$AXNAME= <>
##$AXNUC= <1H>
##$AXRIGHT= 0
##$AXTYPE= 0
##$AXUNIT= <>
##$AZFE= 0.1
##$AZFW= 0.1
##$BCFW= 0
##$BC_mod= 0
##$BYTORDP= 0
##$COROFFS= 0
##$CY= 15
##$DATMOD= 1
##$DC= 0
##$DFILT= <>
##$DTYPP= 0
##$F1P= 0
##$F2P= 0
##$FCOR= 0.5
##$FTSIZE= 131072
##$FT_mod= 6
##$GAMMA= 0
##$GB= 0
##$INTBC= 1
##$INTSCL= 1
##$ISEN= 128
##$LB= 0.3
##$LEV0= 0
##$LPBIN= 0
##$MAXI= 10000
##$MC2= 0
##$MEAN= 0
##$ME_mod= 0
##$MI= 0
##$NCOEF= 0
##$NC_proc= -3
##$NLEV= 6
##$NOISF1= 0
##$NOISF2= 0
##$NSP= 0
##$NTH_PI= 0
##$NZP= 0
##$OFFSET= 14.96695
##$PC= 1
##$PHC0= 33.73901
##$PHC1= 0
##$PH_mod= 1
##$PKNL= yes
##$PPARMOD= 0
##$PPDIAG= 0
##$PPIPTYP= 0
##$PPMPNUM= 2147483647
##$PPRESOL= 1
##$PSCAL= 4
##$PSIGN= 0
##$PYNMP= <proc.py>
##$REVERSE= no
##$SF= 400.130005466004
##$SI= 131072
##$SIGF1= 0
##$SIGF2= 0
##$SINO= 400
##$SIOLD= 131072
##$SPECTYP= <>
##$SREGLST= <1H.CDCl3>
##$SSB= 0
##$STSI= 131072
##$STSR= 0
##$SW_p= 8223.68421052632
##$SYMM= 0
##$S_DEV= 0
##$TDeff= 65536
##$TDoff= 0
##$TI= <>
##$TILT= no
##$TM1= 0
##$TM2= 0
##$TOPLEV= 0
##$USERP1= <user>
##$USERP2= <user>
##$USERP3= <user>
##$USERP4= <user>
##$USERP5= <user>
##$WDW= 1
##$XDIM= 131072
##$YMAX_p= 429367309
##$YMIN_p= -443492550
##$CURPLOT= <Network HP LaserJet P1505>
##$CURPRIN= <$Network HP LaserJet P1505>
##$DFORMAT= <normdp>
##$LAYOUT= <+/1D_H.xwp>
##$LFORMAT= <normlp>
##$PFORMAT= <normpl>
##$SURQMSG= 1
$$ End of Bruker specific parameters
$$ ---------------------------------
##NTUPLES= NMR SPECTRUM
##VAR_NAME=  FREQUENCY,     SPECTRUM/REAL,   SPECTRUM/IMAG
##SYMBOL=    X,             R,               I
##VAR_TYPE=  INDEPENDENT,   DEPENDENT,       DEPENDENT
##VAR_FORM=  AFFN,          ASDF,            ASDF
##VAR_DIM=   131072,        131072,          131072
##UNITS=     HZ,            ARBITRARY UNITS, ARBITRARY UNITS
##FACTOR=    0.0627417313425165, 1,          1
##FIRST=     8223.62146879498, 4401,         -95276
##LAST=      0,             7108,            -95529
##MIN=       0,             -443492550,      0
##MAX=       8223.62146879498, 429367309,    0
$$ Real data points
##PAGE= N=1
##DATA TABLE= (X++(R..R)), XYDATA
$$ [...]
62525H85106J3423J1137P295K323k883p113r569j0755j2033j3845j5101j4909
$$ 885106 898529 909666 916961 919284 916401 909288 899719 888964 876931 863086 847985 833076
62513H33076j4191j4583j6128j7203j6737j5402j4378j3818j3126j2065j0984
$$ 833076 818885 804302 788174 770971 754234 738832 724454 710636 697510 685445 674461
62502F74461j0215r734r330q818q157p494o869n918m277k341j134j170j766j841
$$ 674461 664246 654512 645182 636364 628207 620713 613844 607926 603649 601308 600174 599004 597238 595397
62488E95397j019K82J434J977J728J000N26Q19J785L074M438N423N328M059K773
$$ 595397 594378 594660 596094 598071 599799 600799 601325 602144 603929 607003 611441 616864 622192 626251 629024
62473F29024K936M793P283R291J0470J1076J1680J2935J4897J6652J7329J7492
$$ 629024 631960 636753 644036 653327 663797 674873 686553 699488 714385 731037 748366 765858
62461G65858J8627K1119K3784K5724K7683L0759L4494L7277L8335L8548L9258
$$ 765858 784485 805604 829388 855112 882795 913554 948048 985325 1023660 1062208 1101466
62450A101466M0891M2711M3554M2712M0467L7673L4766L1335K6911K1750J6547
$$ 1101466 1142357 1185068 1228622 1271334 1311801 1349474 1384240 1415575 1442486 1464236 1480783
62439A480783J1712P383L744Q62j522l472m412l830k118j4K588O356J1118J5680
$$ 1480783 1492495 1499878 1503622 1504484 1502962 1499490 1495078 1491248 1489130 1489116 1491704 1498060 1509178 1524858
62425A524858J9279K2357K5607K8935L1790L3798L4528L3211K9317K3230J5941
$$ 1524858 1544137 1566494 1592101 1621036 1652826 1686624 1721152 1754363 1783680 1806910 1822851
62414A822851Q296P25o686j4178k2012k9924l7225m3531m8874n2948n5148n5833
$$ 1822851 1831147 1831872 1825186 1811008 1788996 1759072 1721847 1678316 1629442 1576494 1521346 1465513
62402A465513n6520n7958n8763n7079n3074m8604m4720m0807l6181l1255k6898
$$ 1465513 1408993 1351035 1292272 1235193 1182119 1133515 1088795 1047988 1011807 980552 953654
62391I53654k3633k1742k1067k0413j8146j3966r291n621l299k215k460l570m120
$$ 953654 930021 908279 887212 866799 848653 834687 825396 819775 816476 814261 811801 808231 804111
62378H04111l097j121L80O85j24j716l378m133l920l868m520m821m115l976o076
$$ 804111 801014 799893 800273 800958 800834 799118 795740 791607 787687 783819 779299 774478 770363 766387 760311
62363G60311q961r327o504l399k479l097l584l823m194l805j906J0l34k729m544
$$ 760311 751350 742023 735519 732120 729641 726544 722960 719137 714943 711138 709232 709242 708908 706179 701635
62348G01635m100k420j275r07m40M30J089J056O97P62J540K645L678M802O313
$$ 701635 697535 695115 693840 692933 692493 692923 694012 695068 695765 696527 698067 700712 704390 709192 715505
62333G15505P827Q560Q456Q307Q575Q899R122R827J1194J2345J2790J3597J5867
$$ 715505 723332 731892 740348 748655 757230 766129 775251 785078 796272 808617 821407 835004 850871
62320H50871J8661K0025J9771J9712K1237K4020K7183L0197L2378L3097L3125
$$ 850871 869532 889557 909328 929040 950277 974297 1001480 1031677 1064055 1097152 1130277
62309A130277L4367L7445M0819M3122M5175M8480N2872N7122O1089O5577P0444
$$ 1130277 1164644 1202089 1242908 1286030 1331205 1379685 1432557 1489679 1550768 1616345 1686789
62298A686789P4559P7736Q1034Q4514Q6143Q4006P8705P2412O5857N7552M6193
$$ 1686789 1761348 1839084 1920118 2004632 2090775 2174781 2253486 2325898 2391755 2449307 2495500
62287B495500L2831J9923Q722j524j1886k2193l1646m0199m8319n5647o0995o3879
$$ 2495500 2528331 2548254 2556976 2555452 2543566 2521373 2489727 2449528 2401209 2345562 2284567 2220688
62275B220688o5124o5493o4601o1980n8572n6063n4921n3997n2147m9458m6679
$$ 2220688 2155564 2090071 2025470 1963490 1904918 1848855 1793934 1739937 1687790 1638332 1591653
62264A591653m4123m1543l8753l6042l4016l3045l2693l1846k9843k7391k5775
$$ 1591653 1547530 1505987 1467234 1431192 1397176 1364131 1331438 1299592 1269749 1242358 1216583
62253A216583k5205k4625k3395k2292k2198k2328k0844j7150j2754r533p837o727
$$ 1216583 1191378 1166753 1143358 1121066 1098868 1076540 1055696 1038546 1025792 1016259 1008422 1001695
62241A001695n521m356l417k353q27Q51K019K462K594K895L470M181M978N927
$$ 1001695 996174 991818 988401 986048 985221 986072 988091 990553 993147 996042 999512 1003693 1008671 1014598
62227A014598P042Q202R167R673R664R487R727J0640J1865J2916J3874J5294J7307
$$ 1014598 1021640 1029842 1039009 1048682 1058346 1067833 1077560 1088200 1100065 1112981 1126855 1142149 1159456
62214A159456J9128J9812J9488J9572K1485K5277K9622L3118L5572L7997M1542
$$ 1159456 1178584 1198396 1217884 1237456 1258941 1284218 1313840 1346958 1382530 1420527 1462069
62203A462069M6406N1806N6867O1416O5832P0304P4541P8256Q1418Q3785Q4471
$$ 1462069 1508475 1560281 1617148 1678564 1744396 1814700 1889241 1967497 2048915 2132700 2217171
62192B217171Q2401P7143O9023N8735M7170L5258K3309J0746k748j5941k6919
$$ 2217171 2299572 2376715 2445738 2504473 2551643 2586901 2610210 2620956 2618208 2602267 2575348
62181B575348l5348m2929n1222n9945o7840p4074p8064p9038p7016p3603p0510
$$ 2575348 2540000 2497071 2445849 2385904 2318064 2243990 2165926 2086888 2009872 1936269 1865759
62170A865759o7626o3822n9206n5033n1512m7353m1954l6514l2134k8120k3296
$$ 1865759 1798133 1734311 1675105 1620072 1568560 1521207 1479253 1442739 1410605 1382485 1359189
62159A359189j8238j4827j3818j3903j3434j2243j1274j0776r560o521k532Kj27
$$ 1359189 1340951 1326124 1312306 1298403 1284969 1272726 1261452 1250676 1241116 1234595 1232063 1232065 1231938
62146A231938j370j336L06J840K009J268O03N03J412L794P084R576J0203R669
$$ 1231938 1230568 1229232 1229538 1231378 1233387 1234655 1235258 1235761 1237173 1240967 1248051 1257627 1267830 1277499
62132A277499R267R472J0257J1767J3778J5386J6217J7223J9206K1329K2254K2197
$$ 1277499 1286766 1296238 1306495 1318262 1332040 1347426 1363643 1380866 1400072 1421401 1443655 1465852
62120A465852K2457K3242K3388K2365K1242K1341K2773K4673K6325K7838L0111
$$ 1465852 1488309 1511551 1534939 1557304 1578546 1599887 1622660 1647333 1673658 1701496 1731607
62109A731607L4050L9394M4635M8613N1745N4897N7483N7861N5388N0963M5514
$$ 1731607 1765657 1805051 1849686 1898299 1950044 2004941 2062424 2120285 2175673 2226636 2272150
62098B272150L9087L1511K2821J2981K256p953j5961k1908k7777l4808m2101m8318
$$ 2272150 2311237 2342748 2365569 2378550 2380806 2372853 2356892 2334984 2307207 2272399 2230298 2181980
62086B181980n3348n7292n9164n8190n5542n3186n1392m8906m5385m2002l9383
$$ 2181980 2128632 2071340 2012176 1953986 1898444 1845258 1793866 1744960 1699575 1657573 1618190
62075A618190l6450l2063k6799k2304j9480j7983j7021j5945j4360j2325j0472
$$ 1618190 1581740 1549677 1522878 1500574 1481094 1463111 1446090 1430145 1415785 1403460 1392988
62064A392988r444r093q387o182k166K741O948R489J0847J2067J3024J2293R181
$$ 1392988 1383544 1374451 1366064 1359882 1357716 1360457 1367405 1376894 1387741 1399808 1412832 1425125 1434306
62051A434306N198K521J460N31j055k256k053j194j296k928n510q415j1046j2220
$$ 1434306 1439504 1442025 1443485 1444016 1442961 1440705 1438652 1437458 1436162 1433234 1427724 1419309 1408263 1396043
62037A396043j0919p783m776l027j866k30J998M453P106R938J2523J4637J6732
$$ 1396043 1385124 1377341 1372565 1369538 1367672 1367442 1369440 1373893 1380999 1390937 1403460 1418097 1434829
62024A434829J9159K1483K3270K5056K7688L1099L4479L7387L9832M1567M2185
$$ 1434829 1453988 1475471 1498741 1523797 1551485 1582584 1617063 1654450 1694282 1735849 1778034
62013A778034M2000M2000M2784M3995M4770M4403M2865M1184M0914M2473M4159
$$ 1778034 1820034 1862034 1904818 1948813 1993583 2037986 2080851 2122035 2162949 2205422 2249581
62002B249581M3644M0263L5026K8686K1001J2051K957n216j2492j9300k5585l1129
$$ 2249581 2293225 2333488 2368514 2397200 2418201 2430252 2433209 2427993 2415501 2396201 2370616 2339487
61990B339487l6311m1843m8052n4553o0350o4219o5709o5885o6232o6591o5131
$$ 2339487 2303176 2261333 2213281 2158728 2098378 2034159 1968450 1902565 1836333 1769742 1704611
61979A704611o1013n5954n2218m9784m6859m2725l8611l5634l3291l0667k8135
$$ 1704611 1643598 1587644 1535426 1485642 1438783 1396058 1357447 1321813 1288522 1257855 1229720
61968A229720k6749k6384k5492k3020j9852j7761j7283j7233j6456j5358j5098
$$ 1229720 1202971 1176587 1151095 1128075 1108223 1090462 1073179 1055946 1039490 1024132 1009034
61957A009034j5753j6124j5423j4266j3621j3376j2660j1184r490p844n615k247
$$ 1009034 993281 977157 961734 947468 933847 920471 907811 896627 887137 879293 873678 871431
61945H71431J508L988M449M070M625O287P462O928N414M405M052L215J331q40
$$ 871431 872939 876927 881376 885446 890071 896358 903820 910748 916162 920567 924619 927834 929165 928325
61931I28325k454l541m397m962n363o305q236j0516j2008j2164j1198r629q170
$$ 928325 925871 922330 917933 912971 907608 901303 893067 882551 870543 858379 847181 837552 829382
61918H29382p631q211r121r357q712p627o457n380m659m352l971l042j815q76
$$ 829382 821751 813540 804419 795062 786350 778723 772266 766886 762227 757875 753904 750862 749047 748171
61904G48171k15O35J673K395K747L420M974P040Q722R489R676J0187J1620J3513
$$ 748171 747956 748591 750264 752659 755406 758826 763800 770840 779562 789051 798727 808914 820534 834047
61890H34047J4779J5201J5935J8027K0890K3282K5347K8393L2529L6030L7713
$$ 834047 848826 864027 879962 897989 918879 942161 967508 995901 1028430 1064460 1102173
61879A102173L8705M0793M3848M5980M5895M3965M1261L8572L6391L4894L3614
$$ 1102173 1140878 1181671 1225519 1271499 1317394 1361359 1402620 1441192 1477583 1512477 1546091
61868A546091L1765K9089K5900K2246J7728J2278O517J101l751p876j0815j2025
$$ 1546091 1577856 1606945 1632845 1655091 1672819 1685097 1691614 1692715 1688964 1681088 1670273 1658248
61856A658248j1128q094l824l15J039J514M039R504J5468J9429K1790K3973K5095
$$ 1658248 1647120 1639026 1635202 1634887 1635926 1637440 1641479 1650983 1666451 1685880 1707670 1731643 1756738
61843A756738K2978J7827J2227P319J599n737j2745j7389k0244k2950k5585k7366
$$ 1756738 1779716 1797543 1809770 1817089 1818688 1812951 1800206 1782817 1762573 1739623 1714038 1686672
61831A686672k8614k9932l0441k8943k6437k5349k6391k7841k7982k6676k4638
$$ 1686672 1658058 1628126 1597685 1568742 1542305 1516956 1490565 1462724 1434742 1408066 1383428
61820A383428k2768k2186k3246k4319k3210k0067j7275j6064j4999j2421q666
$$ 1383428 1360660 1338474 1315228 1290909 1267699 1247632 1230357 1214293 1199294 1186873 1178207
61809A178207m915j425J984M836O740Q325J0447J3189J6393K0261K4651K8789
$$ 1178207 1173292 1171867 1173851 1178687 1185427 1193752 1204199 1217388 1233781 1254042 1278693 1307482
61797A307482L2589L7106M2616M7523N0520N2833N6641O1933O6615O9202O9753
$$ 1307482 1340071 1377177 1419793 1467316 1517836 1570669 1627310 1689243 1755858 1825060 1894813
61786A894813O8479O5400O1352N7461N3184M6491L6698K5710J5750P072j134q595
$$ 1894813 1963292 2028692 2090044 2147505 2200689 2247180 2283878 2309588 2325338 2332410 2331276 2322681
61774B322681j4024j6888j7989j8238j7577j5334j1250n997q91K816M549M708
$$ 2322681 2308657 2291769 2273780 2255542 2237965 2222631 2211381 2205384 2204493 2207309 2211858 2216566
61762B216566M390M396M007J066n966j5770k4956l1488l6557m2389m9159n5074
$$ 2216566 2220956 2225352 2229359 2230425 2224459 2208689 2183733 2152245 2115688 2073299 2024140 1969066
61750A969066n8878o0874o1674o1302n9796n7613n5130n2437m9818m7657m5711
$$ 1969066 1910188 1849314 1787640 1726338 1666542 1608929 1553799 1501362 1451544 1403887 1358176
61739A358176m3303m0431l7891l5951l3723l0299k6038k2299k0172j9605j9399
$$ 1358176 1314873 1274442 1236551 1200600 1166877 1136578 1110540 1088241 1068069 1048464 1029065
61728A029065j8125j5638j3512j3207j3905j3313j0752q223p809r191j0489j0452
$$ 1029065 1010940 995302 981790 968583 954678 941365 930613 922390 914581 905390 894901 884449
61716H84449q875n851k092O76J165L12K86J756L433M365N089O002O184N044M039
$$ 884449 875574 869723 867631 868307 869472 869784 870070 871826 875259 879624 884713 890715 896899 901943 905982
61701I05982N095P834R941J0240R856R977R985Q786O727M852K990J89l078m861
$$ 905982 911077 918911 928852 939092 948948 958925 968910 977696 984423 989275 992265 992454 989376 984515
61687I84515m416l646m884q000j0670j1139r811q206p249o815o432n930n385m705
$$ 984515 980099 976453 971569 963569 952899 941760 931949 923743 916494 909679 903247 897317 891932 887227
61673H87227l647k458j987k686l666l599k461j449j089n73O01J618J792J774K210
$$ 887227 883580 881122 879135 876449 872783 869184 866723 865274 864185 863612 864213 865831 867623 869397 871607
61658H71607K156M76j825k366m49K138L360K668M19k786n698o861o273n678o365
$$ 871607 873763 874239 872414 870048 869599 871737 875097 877765 878184 875398 869700 862839 856566 850888 844523
61643H44523p551p770p021o516o803p248p263p083p173p486p600p273o615n869
$$ 844523 836972 829202 822181 815665 808862 801614 794351 787268 780095 772609 765009 757736 751121 745252
61629G45252n247m965n257o023o579o173n000m178m357m842m690m132m066m471
$$ 745252 740005 735040 729783 723760 717181 711008 706008 701830 697473 692631 687941 683809 679743 675272
61615F75272m394l388j929l59J464L158L629K485Q66J41L90P15N83K32Q2L02Q42
$$ 675272 670878 667490 665561 665202 666666 669824 673453 675938 676804 676945 677335 678050 678633 678865 678947 679249 680091
61598F80091J599K666M357O607Q414Q478O706M547L564M058N208O097O382O381
$$ 680091 681690 684356 688713 695320 703734 712212 718918 723465 727029 731087 736295 742392 748774 755155
61584G55155O629P134P196O385N380N084N175M487K690N40j334k739l180k351
$$ 755155 761784 768918 776114 782499 787879 792963 798138 802625 805315 805855 804521 801782 798602 796251
61570G96251j460k284m465n639m926m274n104n739m247k122k475n237o937n476
$$ 796251 794791 792507 788042 782403 777477 773203 768099 762360 758113 755991 753516 748279 741342 735866
61556G35866k835k205m094o339o991o123n163n215o223p592r168j0998j2299j1898
$$ 735866 733031 730826 726732 720393 713402 707279 702116 696901 690678 683086 673918 662920 650621 638723
61542F38723j0160r195j0104j1194j0187p398n145m739n691p374r419j0545r097
$$ 638723 628563 619368 609264 598070 587883 580485 575340 570601 564910 557536 548117 537572 528475
61529E28475n361j841o42j568l100m083m070l224k266j791j480r14p92j894l099
$$ 528475 523114 521273 520631 519063 515963 511880 507810 504586 502320 500529 499049 498135 497343 495449 492350
61514D92350k438j76J230P71J55N43M87j261l055k637o04P83J027J255J477O65
$$ 492350 489912 489736 490966 491737 491892 492435 492922 491661 488606 485969 485365 486148 487175 488430 489907 490572
61498D90572p29q48O53K021K179K075K609L109K818K322K360K371J423k29j424
$$ 490572 489843 488995 489648 491669 493848 495923 498532 501641 504459 506781 509141 511512 512935 512706 511282
61483E11282j354N3K219L879L929K978K992M592N896N178L501L099L965L988K285
$$ 511282 509928 509981 512200 516079 520008 522986 525978 530570 536466 541644 545145 548244 552209 556197 558482
61468E58482L48m40o38j368k504l247l407l187k433j247o64j511k904l067j727
$$ 558482 558830 558390 557752 556384 553880 550633 547226 544039 541606 540359 539695 538184 535280 532213 530486
61453E30486n32p76j690j618k84J054J427J200J199J558J954K419L137L665L317
$$ 530486 529954 529178 527488 525870 525586 526640 528067 529267 530466 532024 533978 536397 539534 543199 546516
61438E46516K365J923K231K125R72J20J090L005L577K501J905K890L634K209k28
$$ 546516 548881 550804 553035 555160 556132 556252 557342 560347 563924 566425 568330 571220 574854 577063 576835
61423E76835q73R15K974L311K181J035O75P99O28k99j496j829q97K24M34J75O01
$$ 576835 575962 576877 579851 583162 585343 586378 587053 587852 588480 588181 586685 584856 583959 584183 584617 584792 585393
61406E85393J556J756Q15l67j265k347l633m137l375k261j773j635r89L27J782
$$ 585393 586949 588705 589520 589153 587888 585541 581908 577771 574396 572135 570362 568727 567738 568065 569847
61391E69847K688K495J314L55Q37K225K838K507L015N165P162P142N820N092N184
$$ 569847 572535 575030 576344 576699 577536 579761 582599 585106 588121 593286 600448 607590 613410 618502 623686
61376F23686M971M260L918M166M372M400M698N218N527N755O218O370N501M205
$$ 623686 628657 632917 636835 641001 645373 649773 654471 659689 665216 670971 677189 683559 689060 693265
61362F93265L770M245M570M486M693M980M000J457r69j672j030m37l64k84J0q1
$$ 693265 697035 701280 705850 710336 715029 720009 724009 725466 724497 722825 721795 721358 720994 720710 720720 720639
61346G20639j136k820l937l527k078j216j858l179l960m091l937l106j311K40
$$ 720639 719503 716683 712746 709219 707141 705925 704067 700888 696928 692837 688900 685794 684483 684723
61332F84723J22r80j024L15J228O43m46r34j039j005k60J130J808J220Q11J856
$$ 684723 684845 683865 682841 683156 684384 685027 684581 683647 682608 681603 681343 682473 684281 685501 686312 688168
61316F88168L376L753L333L741N299O709O936N998M277K327J233J869L699N232
$$ 688168 691544 695297 698630 702371 707670 714379 721315 727313 731590 733917 735150 737019 740718 745950
61302G45950N710N627N724O148O699P234P762Q303Q624Q171O902O168P677J1139
$$ 745950 751660 757287 763011 769159 775858 783092 790854 799157 807781 815952 822854 829022 836699 847838
61288H47838J4105J4884J4523J4756J5154J3913J0896Q049O793O592O329N786
$$ 847838 861943 876827 891350 906106 921260 935173 946069 954118 960911 967503 973832 979618
61276I79618N226M519L359J780P5j424k314k397k190k676m205n867o280n040l284
$$ 979618 984844 989363 992722 994502 994577 993153 990839 988442 986252 983576 979371 973504 967224 962184 958900
61261I58900k597l219l671k585n62O34O02P26J937L493M603N803P582Q932Q851
$$ 958900 956303 953084 949413 946828 946266 946900 947502 948228 950165 953658 958261 964064 971646 980578 989429
61246I89429Q314R029J0746J1470J0191P812N435L219J030j100l395o016q173
$$ 989429 997743 1006772 1017518 1028988 1039179 1046991 1052426 1055645 1056675 1055575 1052180 1046164 1037991
61233A037991q771q202q195r533j0961j0911r377p530o252n551m866l692k193
$$ 1037991 1029220 1021018 1012823 1003290 992329 981418 972041 964511 958259 952708 947842 944150 941957
61220I41957j292j511j985j366M48K453M185N995P703Q449Q264Q446R765J1364
$$ 941957 940665 939154 937169 935803 936251 938704 942889 948884 956587 965036 973300 981746 991511 1002875
61206A002875J2078J1849J1293J0855J1130J2949J6171J9277K0994K1685K2222
$$ 1002875 1014953 1026802 1038095 1048950 1060080 1073029 1089200 1108477 1129471 1151156 1173378
61195A173378K2208K0558J7400J4156J1701R395O307K722j3j051j091j742l794
$$ 1173378 1195586 1216144 1233544 1247700 1259401 1268796 1275103 1277825 1277812 1276761 1275670 1273928 1270134
61182A270134o448q424r386r730r518q697q124r010j0999j2148j1442j0274j0416
$$ 1270134 1263686 1255262 1245876 1236146 1226628 1217931 1209807 1200797 1189798 1177650 1166208 1155934 1145518
61169A145518j1418j1128q476m711j919j102j665k272k083j357r22j174j826k389
$$ 1145518 1134100 1122972 1114496 1109785 1107866 1106764 1105099 1102827 1100744 1099387 1098465 1097291 1095465 1093076
61155A093076k373j293O59K166K024P96K5j48r04k015j378J588M100L497J075
$$ 1093076 1090703 1089410 1090069 1092235 1094259 1095055 1095080 1094932 1094028 1092013 1090635 1092223 1096323 1099820 1100895
61140A100895K72J921L815M612N609Q165J1509J4116J5603J6181J5455J3011R581
$$ 1100895 1101167 1103088 1106903 1111515 1117124 1125289 1136798 1150914 1166517 1182698 1198153 1211164 1220745
61127A220745O572M744L928L671L510K879J417o02k408l345l335k928k916l623
$$ 1220745 1227317 1232061 1235989 1239660 1243170 1246049 1247466 1246864 1244456 1241111 1237776 1234848 1231932 1228309
61113A228309m533m909m808n083o275p885r002r389r623j0206j0841j0904j0506
$$ 1228309 1223776 1218867 1214059 1208976 1202701 1194816 1185814 1176425 1166802 1156596 1145755 1134851 1124345
61100A124345j0601j1699j2880j2780j1333r627q127o260m005k459k028j398M69
$$ 1124345 1113744 1102045 1089165 1076385 1065052 1055425 1047298 1041038 1037033 1034574 1032546 1031148 1031617
61087A031617K344K297L88j830l903o546r405j0862j0483r666r197p993n371k822
$$ 1031617 1033961 1036258 1036646 1034816 1030913 1024367 1014962 1004100 993617 983951 974754 966761 961390 958568
61073I58568k078k670k995k839k985k867p60L448P362Q788Q245P950R080J1015
$$ 958568 956490 953820 950825 947986 945001 942134 941374 944822 952184 960972 969217 977167 986247 997262
61059I97262J2874J4679J6762J8772J9897J9933J9624J9753K0249K0466K0114
$$ 997262 1010136 1024815 1041577 1060349 1080246 1100179 1119803 1139556 1159805 1180271 1200385
61048A200385J9513J8942J8253J7316J6479J6131J5823J4271J0510N005n91m857
$$ 1200385 1219898 1238840 1257093 1274409 1290888 1307019 1322842 1337113 1347623 1352628 1352037 1347180
61036A347180p599r476j1006j2355j3801j5649j7470j8121j7074j5292j4280j4500
$$ 1347180 1339581 1330105 1319099 1306744 1292943 1277294 1259824 1241703 1224629 1209337 1195057 1180557
61024A180557j5148j5327j4759j3508j1603r228o954n396m702m393l803k724j484
$$ 1180557 1165409 1150082 1135323 1121815 1110212 1100984 1094030 1088634 1083932 1079539 1075736 1073012 1071528
61011A071528k68J304L456N388O094O072P106R872J2800J4054J3842J3841J5034
$$ 1071528 1071260 1072564 1076020 1081408 1087502 1093574 1100680 1110552 1123352 1137406 1151248 1165089 1180123
60998A180123J7088J9401K1732K4060K6597K9654L2911L5329L6579L7854M0395
$$ 1180123 1197211 1216612 1238344 1262404 1289001 1318655 1351566 1386895 1423474 1461328 1501723
60987A501723M3809M6880M9386N2019N5104N8652O3041O8314P3403P7505Q1633
$$ 1501723 1545532 1592412 1641798 1693817 1748921 1807573 1870614 1938928 2012331 2089836 2171469
60976B171469Q7162R3428R8667J02920J07981J14680J22363J30946J41044J51824
$$ 2171469 2258631 2352059 2450726 2553646 2661627 2776307 2898670 3029616 3170660 3322484
60966C322484J61134J68419J75496J83814J93055K03123K15334K30782K49306
$$ 3322484 3483618 3652037 3827533 4011347 4204402 4407525 4622859 4853641 5102947
60957E102947K70780K95410L22446L51050L83106M22631M71523N28667N93677
$$ 5102947 5373727 5669137 5991583 6342633 6725739 7148370 7619893 8148560 8742237
60948H742237O67888P50583Q38809R33131J039392J162871J306764J479847J697103
$$ 8742237 9410125 10160708 10999517 11932648 12972040 14134911 15441675 16921522 18618625
60939A8618625J964502K269893K597586K937389L249060L414623L268620K727390
$$ 18618625 20583127 22853020 25450606 28387995 31637055 35051678 38320298 41047688
60931D1047688J900695J050283M16566Q3899K423R3899K88253M66481M38829M8872
$$ 41047688 42948383 43998666 44415232 44499131 44501554 44595453 44883706 45350187 45789016 45837888
60921D5837888o85637j558414k315356k810305l040705l076047k984788k816409
$$ 45837888 45152251 43593837 41278481 38468176 35427471 32351424 29366636 26550227
60913B6550227k610157k393852k178534j965387j756980j558238j371548j197747
$$ 26550227 23940070 21546218 19367684 17402297 15645317 14087079 12715531 11517784
60905A1517784j040281r03671p88432o90869o07266n35771m74925m22919l78281
$$ 11517784 10477503 9573832 8785400 8094531 7487265 6951494 6476569 6053650 5675369
60896E675369l39824l06175k76171k49034k23749j99573j77708j60636j48779
$$ 5675369 5335545 5029370 4753199 4504165 4280416 4080843 3903135 3742499 3593720
60887C593720j39490j30326j21538j14179j07829j01706r6230r1668q6803q0755
$$ 3593720 3454230 3323904 3202366 3088187 2980358 2878652 2782422 2690754 2603951 2523196
60877B523196p4598o9498o4677n9149n4073n1163m9797m7736m3966l9067l3701
$$ 2523196 2448598 2379100 2314423 2255274 2201201 2150038 2100241 2052505 2008539 1969472 1935771
60866A935771k8516k4552k1856j8690j4032r876q794j0103j0870j0090r332r511
$$ 1935771 1907255 1882703 1860847 1842157 1828125 1818249 1809455 1799352 1788482 1778392 1769060 1759549
60854A759549r733r571j0007j1569j3429j4997j6638j8353j9351j9472j9593k0186
$$ 1759549 1749816 1740245 1730238 1718669 1705240 1690243 1673605 1655252 1635901 1616429 1596836 1576650
60842A576650k0869k1635k3115k5120k6322k5895k4410k2761k1387k0747k1238
$$ 1576650 1555781 1534146 1511031 1485911 1459589 1433694 1409284 1386523 1365136 1344389 1323151
60831A323151k2229k2408k1468k0391j9769j9232j8753j9042j9984k0124j8624
$$ 1323151 1300922 1278514 1257046 1236655 1216886 1197654 1178901 1159859 1139875 1119751 1101127
60820A101127j6564j5405j5148j4999j4917j5348j6001j6021j5194j4157j3495
$$ 1101127 1084563 1069158 1054010 1039011 1024094 1008746 992745 976724 961530 947373 933878
60809I33878j3152j2684j1704j0160q373o761n488m618m445n148o193o620o108
$$ 933878 920726 908042 896338 886178 877805 871044 865556 860938 856493 851345 845152 838532 832424
60796H32424n306n012n419o157o642o375n368m310l988m539n518o420o770o140
$$ 832424 827118 822106 816687 810530 803888 797513 792145 787835 783847 779308 773790 767370 760600 754460
60782G54460m646l240k879l695n338p494r525j0326r521q139p039n453k424Q78
$$ 754460 749814 746574 743695 740000 734662 727168 717643 707317 697796 689657 682618 677165 674741 675619
60768F75619K073O95j192j634n76J023K380K859K233J355J358J930J677M65r3
$$ 675619 677692 678387 677195 675561 674985 676008 678388 681247 683480 684835 686193 688123 689800 690265 690172
60753F90172R48K370K461J093o35j850k337k370k628l522m371m088k816j768j353
$$ 690172 691120 693490 695951 697044 696409 694559 692222 689852 687224 683702 679331 675243 672427 670659 669306
60738F69306q74k77o05k122l583m168m636n596o143n456m507m774o143p296p482
$$ 669306 668432 668155 667550 665428 661845 657677 653041 647445 641302 635846 631339 626565 620422 613126 605644
60723F05644o854n704m419l616l458l340k851k318j926j267m14k04p82j042m34
$$ 605644 598790 593086 588667 585051 581593 578253 575402 573084 571158 569891 569477 569273 568491 567449 567015
60708E67015O5k65m87K73J155J137J001J887L072L144K590L012M405N248N004
$$ 567015 567080 566815 566328 566601 567756 568893 569894 571781 574853 577997 580587 583599 588004 593252 598256
60693E98256M407L614K256J287K444N293O994N785L064J118L68j21p60j384k252
$$ 598256 602663 606277 608533 609820 612264 617557 624551 630336 633400 634518 634886 634765 634005 632621 630369
60678F30369l841n883p449p867p285o480o292o843p277o790n773n326n681n962
$$ 630369 626528 620645 613196 605329 598044 591564 585272 578429 571152 564362 558589 553263 547582 541620
60664E41620n557m843m263l581k501j298l77L37J046J494J184P7j121j422m41
$$ 541620 536063 531220 526957 523376 520875 519577 519200 519537 520583 522077 523261 523338 522217 520795 520354
60649E20354J052J665Q15o40j460j285n06M84J244J109P9o36J2J360J973J884
$$ 520354 521406 523071 523886 523246 521786 520501 519995 520479 521723 522832 522911 522275 522287 523647 525620 527504
60633E27504K416L792M479L495K028K031L929O374P717P273N757M740N159O191
$$ 527504 529920 533712 538191 541686 543714 545745 549674 556048 563765 571038 576795 581535 586694 592885
60619E92885O276N330M943O164Q111R277R198Q186O336L790J348j77j040k195
$$ 592885 599161 604491 609434 615598 623709 632986 642184 650370 656706 660496 661844 661667 660627 658432
60605F58432l929n428n643m340k401j279j819l402m646n004n108n387n182l828
$$ 658432 654503 649075 643432 639092 636691 635412 633593 630191 625545 620541 615433 610046 604864 601036
60591F01036j907o47m80r74j825k973l856l566k059n76l91j522l033m279n321
$$ 601036 599129 598482 598002 597028 595203 592230 588374 584808 582749 582173 581782 580260 577227 572948 567627
60576E67627o153o178m908k952j592j194o70R30K721K788O69j762k296o47J726
$$ 567627 561474 555296 550388 547436 545844 544650 543980 544910 547631 550419 551088 549326 547030 546383 548109
60561E48109L543M663N295N123L700J481j80k26J097K639L540L776L757L930M594
$$ 548109 551652 556315 561610 566733 570433 571914 571734 571508 572605 575244 578784 582560 586317 590247 594841
60546E94841N538N788M560K631J788K414K679J175n79J23L414O417O750M868K570
$$ 594841 600379 606167 610727 613358 615146 617560 620239 621414 620835 620958 624372 630789 637539 642407 644977
60531F44977P26m99m90J239L674M847L988K393J859K726L710L603K820L122N648
$$ 644977 645703 645204 644714 645953 649627 654474 658462 660855 662714 665440 669150 672753 675573 678695 684343
60516F84343R437J2250J2864J2147J1824J2661J4149J5611J7037J8864K1161K3348
$$ 684343 693780 706030 718894 731041 742865 755526 769675 785286 802323 821187 842348 865696
60504H65696K4714K5054K4548K3035K0014J5558J0741O699L533O67k054m156n222
$$ 865696 890410 915464 940012 963047 983061 998619 1009360 1016059 1019592 1020259 1018205 1014049 1008827
60491A008827n197m177k360m4K792O510J0953J5065J8173K1137K5220L0207L4867
$$ 1008827 1003630 999453 997093 997049 999841 1006351 1017304 1032369 1050542 1071679 1096899 1127106 1161973
60478A161973L9041M3752M9163N3992N7350N9571O0410N7879N0331L8908K6661
$$ 1161973 1201014 1244766 1293929 1347921 1405271 1464842 1525252 1583131 1633462 1672370 1699031
60467A699031J5580N617l764j2334j9542k5172k9101l0982l0661k8733k6268k3905
$$ 1699031 1714611 1720228 1716464 1704130 1684588 1659416 1630315 1599333 1568672 1539939 1513671 1489766
60455A489766k1400j8180j4227j0086o056j920K441O777J1280J6884K3920L1080
$$ 1489766 1468366 1450186 1435959 1425873 1419817 1417897 1420338 1427115 1438395 1455279 1479199 1510279
60443A510279L6787M1346M6615N3778O2583P2375Q2297R0414R4473R4424R2714
$$ 1510279 1547066 1588412 1635027 1688805 1751388 1823763 1906060 1996474 2090947 2185371 2278085
60432B278085R1114Q8402Q2194P2210O0618M9782M0780L3749K8685K5808K5338
$$ 2278085 2369199 2457601 2539795 2612005 2672623 2722405 2763185 2796934 2825619 2851427 2876765
60421B876765K6527K6709K2226J1134n425k4866m5357o5829q4844j00725j12611
$$ 2876765 2903292 2930001 2952227 2963361 2957936 2933070 2887713 2821884 2737040 2636315 2523704
60410B523704j20480j24377j24223j20346j13740j05864r8228r1575q5279p8268
$$ 2523704 2403224 2278847 2154624 2034278 1920538 1814674 1716446 1624871 1539592 1461324
60400A461324p0739o4055n8640n3235m6967m0897l6432l3292l0291k7279k4818
$$ 1461324 1390585 1326530 1267890 1214655 1167688 1126791 1090359 1057067 1026776 999497 974679
60389I74679k2684k0209j7697j5915j4530j2628j0689j0213j1162j1380r315o073
$$ 974679 951995 931786 914089 898174 883644 871016 860327 850114 838952 827572 818257 812184
60377H12184m066m412o284q102q752q166p200o695o501n874m795m157m446n017
$$ 812184 808118 803706 797422 789320 780568 772402 765202 758507 752006 746132 741337 737180 732734 727717
60363G27717n074m783m935n821o861p117o070m177k740k757l745m043k517K71
$$ 727717 722643 717860 712925 707104 700243 693126 687056 682879 680139 677382 673637 669594 667077 667348
60349F67348K667L308J971m32k418k849j731r4J094J755K396L246L921L979L608
$$ 667348 670015 673323 675294 674862 672444 669595 667864 667770 668864 670619 673015 676261 680182 684161 687769
60334F87769L493L926M244L540J895M91L90J584L285M559M618L144Q88o54o47
$$ 687769 691262 695188 699432 702972 704867 705358 705748 707332 710617 715176 719794 722938 723826 723172 722525
60319G22525L49J408K391L446M030L354J641J17j54R78K876M412M477L039J436
$$ 722525 722874 724282 726673 730119 734149 737503 739144 739261 739107 740085 742961 747373 751850 754889 756325
60304G56325R97J487J694J321J305K265L576M319M469M698N441O566P781R004
$$ 756325 757322 758809 760503 761824 763129 765394 768970 773289 777758 782456 787897 794463 802244 811248
60290H11248J0261J1251J1291J0060Q261O973O206M809K152q66k960l853m061
$$ 811248 821509 832760 844051 854111 862372 869345 875551 880360 882512 881646 878686 874833 870772
60277H70772m023m227n295o953p601o137l674k325k646l442l685l374k716j771
$$ 870772 866749 862522 857227 850274 842673 836536 832862 830537 827891 824449 820764 817390 814674 812903
60263H12903r21n55l74q0l18j632k780j709J673N287P602R034J0411J1781J3302
$$ 812903 811982 811427 811053 810973 810655 809023 806243 804534 806207 811494 819096 828130 838541 850322 863624
60248H63624J5666J8817K1639K3778K6441L0378L4193L5786L4470L0659K4427
$$ 863624 879290 898107 919746 943524 969965 1000343 1034536 1070322 1104792 1135451 1159878
60237A159878J5648M995o233j6865k5705l1349l3291l2770l1547l0135k7941k4826
$$ 1159878 1175526 1180521 1174288 1157423 1131718 1100369 1067078 1034308 1002761 972626 944685 919859
60225I19859k1617j9276j8120j7725j7112j5420j2815j0365q754p742p059o795
$$ 919859 898242 878966 860846 843121 826009 810589 797774 787409 778655 770913 763854 757059
60213G57059o491n063k707j509k892n290o004m683l158k294j165M63R90o19k877
$$ 757059 750568 745505 742798 741289 738397 733107 727103 722420 719262 716968 715803 716266 717256 716637 713760
60198G13760l537k450j388j532k278k482j857q77J01J116K164K868K772J968J157
$$ 713760 710223 707773 706385 704853 702575 700093 698236 697359 697460 698576 700740 703608 706380 708348 709505
60183G09505J030J623K454L038L181K900K353J818J542J677K322L396M470N113
$$ 709505 710535 712158 714612 717650 720831 723731 726084 727902 729444 731121 733443 736839 741309 746422
60169G46422N459N943O385O019M742L564L224L225K987L152M494O171O561N704
$$ 746422 751881 757824 764209 770228 774970 778534 781758 784983 787970 791122 795616 801787 808348 814052
60155H14052N318O234P337P553P343P331O783M842K446J540K630M330N192N046
$$ 814052 819370 825604 832941 840494 847837 855168 861951 866793 869239 870779 873409 877739 882931 887977
60141H87977M554M434N120O246O406M500J495j75N46K138K731K464K588L075K662
$$ 887977 892531 896965 902085 908331 914737 919237 920732 920557 921103 923241 925972 928436 931024 934099 936761
60126I36761J004o74j500k102l180l905k896l34J948K452J336k85j465j661o46
$$ 936761 937765 937091 935591 933489 930309 926404 923508 923174 925122 927574 928910 928625 927160 925499 924853
60111I24853J086K251J849L11r04r05k22J7p85k333l759m046k714n82O68K87n89
$$ 924853 925939 928190 930039 930350 929446 928541 928319 928336 927551 925218 921459 917413 914699 914117 914785 915072 914483
60094I14483m61N23J268J919L705O352P683O815N944P257R490R724P707N812N079
$$ 914483 914022 914545 915813 917732 921437 927789 935472 942287 948231 955488 964978 974702 982409 988221 993300
60079I93300M152K625K572N271Q638R772Q595P213O871P298Q051Q640P968N428
$$ 993300 997452 1000077 1002649 1007920 1016558 1026330 1034925 1042138 1049009 1056307 1064358 1072998 1080966 1086394
60065A086394K195K1q27j028n06R45J946P44j876k967j088K295N295P502Q818
$$ 1086394 1088589 1088610 1087783 1086755 1086249 1087194 1089140 1089884 1088008 1085041 1083953 1086248 1091543 1099045 1107863
60050A107863Q575P076O291P535R535J0146R068P619O581N713M906M366L769K281
$$ 1107863 1116438 1123514 1129805 1137340 1146875 1157021 1166089 1173708 1180289 1186002 1190908 1195274 1199043 1201324
60036A201324l12l191n282o016n460m147k848k122k024k253k509k659k912l737
$$ 1201324 1201012 1197821 1192539 1186523 1181063 1176916 1174068 1171946 1169922 1167669 1165160 1162501 1159589 1155852
60022A155852n272o862p701p968q682j0349j2280j3371j3046j1542r925r745j1623
$$ 1155852 1150580 1143718 1136017 1128049 1119367 1109018 1096738 1083367 1070321 1058779 1048854 1039109 1027486
60009A027486j4132j4994j3713j1983j1303j1282j0864j0020r316q759p992p195
$$ 1027486 1013354 998360 984647 972664 961361 950079 939215 929195 919879 911120 903128 895933
59997H95933o879p152p647p844p192n611m171m286n658o075m137j283l0q38j928
$$ 895933 889054 881902 874255 866411 859219 853608 849437 845151 839493 833418 829281 827998 827968 827130 825202
59982H25202j809p32K88Q61J284J849K298J948N30j120j766j380j258k206l474
$$ 825202 823393 822661 822949 823810 825094 826943 829241 831189 831719 830599 828833 827453 826195 823989 820515
59967H20515m099m359n041o005o493o380o146n996n748n260m296k524m01O69n4
$$ 820515 816416 812057 807016 801011 794518 788138 781992 775996 770248 764988 760692 758168 757767 758436 758382
59952G58382j466k041j781j657j829j766j630j912k025q83R83J616L07j329j574
$$ 758382 756916 754875 753094 751437 749608 747842 746212 744300 742275 741392 742375 743991 744298 742969 741395
59937G41395o59P5J3n86j388j993j704j98J725K862K990L000L604M456M715M176
$$ 741395 740736 740811 740824 740238 738850 736857 735153 734955 736680 739542 742532 745532 749136 753592 758307 762483
59921G62483L417K960K723K568K897L988M965M410K234L1q72q26p59o72j64K96
$$ 762483 765900 768860 771583 774151 777048 781036 786001 790411 792645 792676 791804 790978 790219 789547 789383 789679
59905G89679l5p38o57K91R70P45L06M50R86J245J019N03j85j014j701j622k65
$$ 789679 789644 788906 788249 788540 789510 790255 790561 791011 791997 793242 794261 794764 794579 793565 791864 790242 789977
59888G89977K024L752L430J437J08J219L749M990L642J077l37M73K623M278M426
$$ 789977 792001 795753 799183 800620 800728 801947 805696 810686 814328 815405 815068 815541 818164 822442 826868
59873H26868L902M387O129P533P393O563O379O581O283O127P459R686J0561R409
$$ 826868 830770 835157 841286 848819 856212 862775 869154 875735 882018 888145 895604 905290 915851 925260
59859I25260Q053Q018Q544Q371P909Q284R225R290P778N380L176J731R78L79p07
$$ 925260 933313 941331 949875 958246 966155 974439 983664 992954 1000732 1006112 1009288 1011019 1011997 1012376 1011669
59844A011669k320l718m141l620k877k672l347m633n649n411l567o53K242L921
$$ 1011669 1009349 1005631 1001490 997870 994993 992321 988974 984341 978692 973281 969714 969061 971303 975224
59830I75224L687K104R19J548L596N399N885N384M873N043N974P036P293O530
$$ 975224 978911 981015 981934 983482 987078 992477 998362 1003746 1008619 1013662 1019636 1026672 1033965 1040495
59816A040495N540M879M028K574J295P95M4j972l886l559j703j267k993m353l753
$$ 1040495 1046035 1050914 1054942 1057516 1058811 1059606 1059650 1057678 1053792 1050233 1048530 1047263 1044270 1039917 1036164
59801A036164k934l600m300l026r69q67k732l958l204j638l16J309L725O153P734
$$ 1036164 1033230 1029630 1025330 1022304 1021335 1020468 1017736 1013778 1010574 1008936 1008620 1009929 1013654 1019807 1027541
59786A027541Q676R436R848R577Q602O841M162J201n84l24J262K626K832J953
$$ 1027541 1036217 1045653 1055501 1065078 1073680 1080521 1084683 1085884 1085300 1084976 1086238 1088864 1091696 1093649
59772A093649N00j239l419o291r483j1919j2813j2556j2037j1412j0238q748p966
$$ 1093649 1094149 1092910 1089491 1083200 1073717 1061798 1048985 1036429 1024392 1012980 1002742 993994 986028
59759I86028q308q913q770p731o041l604n89J804K146M24j913l667n027o657q262
$$ 986028 977720 968807 960037 952306 946265 942661 942072 943876 946022 946446 944533 940866 935839 929182 920920
59744I20920q707p457n454m358n020o708p769p110n185l458k861l004k938k291
$$ 920920 912213 904756 899302 894944 889924 883216 875447 868337 863152 859694 856833 853829 850891 848600
59730H48600j308k06Q81J542J478J200J467J957J464k47j814k082j478r09k76
$$ 848600 847292 847086 847967 849509 850987 852187 853654 855611 857075 856828 855014 852932 851454 850545 850269
59715H50269P96J553Q98q78k365k808k522j856j077r66k050l228k675l41J888
$$ 850269 851065 852618 853516 852638 850273 847465 844943 843087 842010 841044 838994 835766 833091 832750 834638
59700H34638K800L146L850M469M383M171M630N316N228M430L985M492N423N723
$$ 834638 837438 840584 844434 848903 853286 857457 862087 867403 872631 877061 881046 885538 890961 896684
59686H96684M674K537O34L16J509K762K871J937O72l51o93k98r2j188k988l429
$$ 896684 901358 903895 904529 904845 906354 909116 911987 913924 914596 914245 913552 913254 913162 911974 908986 905557
59670I05557j875l94r89k790l531k872k424k881l005j721K64J505J544J043P67
$$ 905557 903682 903288 902299 899509 895978 893106 890682 887801 884796 883075 883339 884844 886388 887431 888198
59655H88198R04J159J347J836L148M967O130O038N564N992P498R259J0590J1191
$$ 888198 889102 890261 891608 893444 896592 901559 907689 913727 919291 925283 932781 942040 952630 963821
59641I63821J0778R456Q317Q601J0163J1500J1479J0443R389Q574P351N295L140
$$ 963821 974599 984055 992372 1000973 1011136 1022636 1034115 1044558 1053947 1062521 1069872 1075167 1078307
59628A078307K272L042L941L116N82j906l128l509l649l165j836p80j204k674
$$ 1078307 1080579 1083621 1087562 1090678 1091260 1089354 1086226 1082717 1079068 1075903 1074067 1073287 1072083 1069409
59614A069409l860m441n052n719n739n018m293l839l045j561J6R55J267J505K092
$$ 1069409 1065549 1061108 1056056 1050337 1044598 1039580 1035287 1031448 1028403 1026842 1026858 1027813 1029080 1030585 1032677
59599A032677L028L952M465M549M468M170L288K132J930L356N334O050M806K147
$$ 1032677 1035705 1039657 1044122 1048671 1053139 1057309 1060597 1062729 1064659 1068015 1073349 1079399 1084205 1086352
59585A086352j178m446o671p423p855r671j2856j5405j5546j3523j1070r760j0009
$$ 1086352 1085174 1080728 1074057 1066634 1058779 1049108 1036252 1020847 1005301 991778 980708 970948 960939
59572I60939j1006j1502j1033j0309j0035r844r065q047p686p889p623o524n495
$$ 960939 949933 938431 927398 917089 907054 897210 888145 880098 872412 864523 856900 850376 844881
59559H44881n595p054r383j1709j2946j2471j0699q592o745n398m766m508l592
$$ 844881 839286 832232 822849 811140 798194 785723 775024 766432 759687 754289 749523 745015 741423
59546G41423j745m90j262k985l193j360O83J586J817J837J092l57j046j82R67
$$ 741423 739678 739188 737926 734941 731748 730388 731071 732657 734474 736311 737403 737046 736000 735818 736785
59531G36785Q99p3p29q13p95p22n15o39j413k283k746l154l734l761k824j977
$$ 736785 737684 737611 736882 736069 735274 734552 734037 733398 731985 729702 726956 723802 720068 716307 713483 711506
59515G11506k229k825k494j631j518j943j546l56J5j042k188k283j821j477p63
$$ 711506 709277 706452 703958 702327 700809 698866 697320 696964 696979 695937 693749 691466 689645 688168 687405
59500F87405Q98K809L879M014L768L273K465J838K056L068M364N713O997P766
$$ 687405 688303 691112 694991 699005 702773 706046 708511 710349 712405 715473 719837 725550 732547 740313
59486G40313P708P317P437Q408J0175J2691J5427J7268J8006J9271K2245K4586
$$ 740313 748021 755338 762775 771183 781358 794049 809476 826744 844750 864021 886266 910852
59474I10852K1939J3263K905l852n928n793n285m252k712j808k001k158j257J19
$$ 910852 932791 946054 948959 945107 939179 933386 928101 923849 921137 919329 917328 915170 913913 914032
59460I14032P74M09n86j981l528m645n000n126n803p199q904j0364j0879r978
$$ 914032 914806 915215 914629 912648 909120 904475 899475 894349 888546 881347 872443 862079 851200 841222
59446H41222q254p218p626q500q442p369o176n290m499l811l534l552l292k424
$$ 841222 832968 825750 818124 809624 801182 793813 787637 782347 777848 774037 770503 766951 763659 761235
59432G61235j114K56J239J477J244J390K197K841K650K296K836M059M824M645
$$ 761235 760121 760377 761616 763093 764337 765727 767924 770765 773415 775711 778547 782606 787430 792075
59418G92075L925K967K003J797K914M371M501L257K289K491K895K487J637R48
$$ 792075 796000 798967 800970 802767 805681 810052 814553 817810 820099 822590 825485 827972 829609 830557
59404H30557L6j342k047q63J465K909K742K274K913M567O356Q017R753J1077J0847
$$ 830557 830593 829251 827204 826341 827806 830715 833457 835731 838644 843211 849567 857584 867337 878414 889261
59389H89261Q821O546N861O681P096N846L640J554p80m102p429q706p578n933
$$ 889261 898082 904628 910489 917170 924266 930112 933752 935306 934526 930424 922995 914289 906711 900778
59375I00778n300n024l733j494M43J298J227O54J42O07K646N477P334P352O662
$$ 900778 895478 890454 886721 885227 885670 886968 888195 888849 888991 889598 892244 897721 905055 912407 919069
59360I19069P236R719J2801J4888J6004J7553K0450K4243K8007L0908L1321K6853
$$ 919069 926305 936024 948825 963713 979717 997270 1017720 1041963 1069970 1100878 1132199 1159052
59348A159052J6811M302n723j0585j1267j0049q171n672j958L611J0181J4158
$$ 1159052 1175863 1180165 1174442 1163857 1152590 1142541 1134370 1128698 1126740 1130351 1140532 1154690
59336A154690J1473K129q904j6485j9817k1072k1208j9326j5620j2417j1487j1745
$$ 1154690 1166163 1168292 1159388 1142903 1123086 1102014 1080806 1061480 1045860 1033443 1021956 1010211
59324A010211j0730p675m164j911p38Q04L258N519O433O284O056N942N742O166
$$ 1010211 999481 991806 987642 985731 984993 985797 989055 994574 1001007 1007291 1013347 1019289 1025031 1031197
59310A031197Q134J0758J1853J0992J0275J1168J2237J1608J0079R785J0633J0428
$$ 1031197 1039331 1050089 1061942 1072934 1083209 1094377 1106614 1118222 1128301 1138086 1148719 1159147
59298A159147Q299N836M429L614K800K853M569O809P729P343P419Q967J1063J2454
$$ 1159147 1167446 1173282 1177711 1181325 1184125 1186978 1191547 1198356 1206085 1213428 1220847 1229814 1240877 1253331
59284A253331J3197J4036J4823J4554J2995J1358J0912J1324J1073R341O780M345
$$ 1253331 1266528 1280564 1295387 1309941 1322936 1334294 1345206 1356530 1367603 1376944 1383724 1388069
59272A388069K111l00k702m459n400n991o693p565q477r127r008p954o825o941
$$ 1388069 1390180 1389880 1387178 1382719 1377319 1371328 1364635 1357070 1348593 1339466 1330458 1322504 1315679 1308738
59258A308738q487j0093j0477r938r584r553q997p717o655o351n985m735l273
$$ 1308738 1300251 1290158 1279681 1269743 1260159 1250606 1241609 1233892 1227237 1220886 1214901 1210166 1206893
59245A206893k827l369l881m050m211l764j425K570O210Q453J0465J2898J3541
$$ 1206893 1204066 1200697 1196816 1192766 1188555 1184791 1183366 1185936 1192146 1200599 1211064 1223962 1237503
59232A237503R622J540p574j5293k1031k4309k4442k2186j9748j8399j7595j6749
$$ 1237503 1247125 1248665 1241091 1225798 1204767 1180458 1156016 1133830 1114082 1095683 1078088 1061339
59220A061339j6124j5474j3618j0347p171n120l208k78K938N058O236P583R154
$$ 1061339 1045215 1029741 1016123 1005776 998605 993485 990277 989999 992937 997995 1004231 1011814 1020968
59207A020968J0034R982R546Q797P347N476M062L286K358O74j644m310p040q999
$$ 1020968 1031002 1040984 1050530 1059327 1066674 1072150 1076212 1079498 1081856 1082530 1080886 1076576 1069536 1060537
59193A060537r063p227n188m883o445p925p247m432j577n16q76j029m80k35q33
$$ 1060537 1051474 1044247 1039059 1034176 1027731 1019806 1012559 1008127 1006550 1006034 1005158 1004129 1003649 1003414 1002581
59178A002581j391j062k87K46Q67K170L773M875N446N728N187L258R22Q1J163
$$ 1002581 1001190 1000128 999841 1000087 1000954 1003124 1006897 1011772 1017218 1022946 1028133 1031391 1032313 1032394 1033557
59163A033557K453K223P51l14m2Q03Q87P3k69R13K566K527M74j298p82J052J736
$$ 1033557 1036010 1038233 1038984 1038670 1038628 1039431 1040318 1040391 1040122 1041035 1043601 1046128 1046602 1045304 1044522 1045574 1047310
59146A047310O88m28m90k79p43j374j164k66K76l1p04j114r37M3J909M046N132
$$ 1047310 1047998 1047570 1047080 1046801 1046058 1044684 1043520 1043254 1043530 1043499 1042795 1041681 1040744 1040787 1042696 1046742 1051874
59129A051874M238K040M90R70K890M383M313L335L060M447O952Q828Q446N737
$$ 1051874 1056112 1058152 1058642 1059612 1062502 1066885 1071198 1074533 1077593 1082040 1088992 1097820 1106266 1112003
59115A112003K426L80j16j07k98l96J5Q95K112L502M439M370L939M434N744O040
$$ 1112003 1114429 1114809 1114693 1114586 1114288 1113892 1113907 1114802 1116914 1120416 1124855 1129225 1133164 1137598 1143342 1149382
59099A149382M181J354n03j054j497k928n520q662j1065j1418r875q286q255r597
$$ 1149382 1153563 1154917 1154414 1153360 1151863 1148935 1143415 1134753 1123688 1112270 1102395 1094109 1085854 1076257
59085A076257j1238j2749j4014j4395j3374j1489r554p656n863n075n824o988
$$ 1076257 1065019 1052270 1038256 1023861 1010487 998998 989444 981788 975925 970850 965026 958038
59073I58038p087o373o104o198n267k866j16K004L524M634N324O016P307Q871
$$ 958038 950951 944578 938474 932276 927009 924143 924027 926031 929555 934189 939513 945529 952836 961707
59059I61707R973J1093J3590J7363K0337K0907J9642J7912J6105J4166J2798J2757
$$ 961707 971680 982773 996363 1013726 1034063 1054970 1074612 1092524 1108629 1122795 1135593 1148350
59047A148350J3464J3466J2168J0307Q760P594O356M798L015J180o53k419l874
$$ 1148350 1161814 1175280 1187448 1197755 1206515 1214109 1220465 1225263 1228278 1229458 1228805 1226386 1222512
59034A222512m772n143n119m588l513k787l827o706r324r468p454n781o208q121
$$ 1222512 1217740 1212597 1207478 1202890 1199377 1196590 1192763 1186057 1176733 1167265 1159811 1154030 1147822 1139701
59020A139701r982j1416j3192j5578j7484j7524j5693j3508j2284j1724j0852
$$ 1139701 1129719 1118303 1105111 1089533 1072049 1054525 1038832 1025324 1013040 1001316 990464
59009I90464r835r735j0458j0498r361q652r608j0709r435n719k145r50k096m009
$$ 990464 980629 970894 960436 949938 940577 931925 922317 911608 902173 896454 894309 893359 891263 887254
58995H87254m907l701r17J288J191m97j707j714j419j209l42J319K555K533K076
$$ 887254 882347 878646 877729 879017 880208 879711 878004 876290 874871 873662 873320 874639 877194 879727 881803
58980H81803K474L787M989N189M418L622L965N624P296P601O791O197O340O703
$$ 881803 884277 888064 893053 898242 902660 906282 910247 915871 923167 930768 937559 943756 950096 956799
58966I56799P282Q897J1700J4610J6673J7953J8651J8428J7143J5308J3309J0975
$$ 956799 964081 972978 984678 999288 1015961 1033914 1052565 1070993 1088136 1103444 1116753 1127728
58954A127728Q454O525N431M253K257K20n36n2J75r74k864l820k915q46R62J777
$$ 1127728 1136182 1142707 1148138 1152391 1154648 1154868 1154332 1154280 1154455 1153481 1150617 1146797 1143882 1143036 1143998 1145775
58938A145775J797J165l51k511m285n100n627o670p957q865r495j0083j0126r349
$$ 1145775 1147572 1148737 1148386 1145875 1141590 1136490 1130863 1124193 1116236 1107371 1097876 1087793 1077667 1068318
58924A068318q762r303r967q993o488m175k766j399M10K079L451N063O632P065
$$ 1068318 1059556 1050253 1040286 1031293 1024805 1020630 1017864 1016465 1016875 1018954 1022405 1027468 1034100 1041165
58910A041165O500O606Q098R625R934R591R556R472Q493O828N334M293L358K021
$$ 1041165 1047665 1054271 1062369 1071994 1081928 1091519 1101075 1110547 1119040 1125868 1131202 1135495 1138853 1140874
58896A140874k17l270n728n974m637m532p272j1159j3486j3693j3136j2755j2480
$$ 1140874 1140657 1137387 1131659 1125685 1121048 1116516 1109244 1098085 1084599 1070906 1057770 1045015 1032535
58883A032535j2231j1936j0820q139m754k864l654n809o800n518l253k053k492
$$ 1032535 1020304 1008368 997548 989409 984655 981791 978137 972328 965528 960010 956757 954704 952212
58870I52212l456l829l527k675j179K21j25k445m383l905k317k219l332l083j020
$$ 952212 948756 944927 941400 938725 937546 937767 937642 935197 930814 926909 924592 922373 919041 915958 914938
58855I14938M74K46Q4J318K632K696K574L587M971N598O301Q384J1208J3214J4245
$$ 914938 915412 915658 915742 917060 919692 922388 924962 928549 933520 939118 945419 953803 965011 978225 992470
58840I92470J4878J4642J2923J0799R947J0174R951R058Q893J0244J2270J3854
$$ 992470 1007348 1021990 1034913 1045712 1055659 1065833 1075784 1084842 1093735 1103979 1116249 1130103
58828A130103J4730J5117J5172J4992J4696J4551J5004J5947J5970J3575R534
$$ 1130103 1144833 1159950 1175122 1190114 1204810 1219361 1234365 1250312 1266282 1279857 1289391
58817A289391O488N514M806K766N63p9K1j176l598n404n963o284o810o912o555
$$ 1289391 1295879 1301393 1306199 1308965 1309528 1309449 1309470 1308294 1304696 1299292 1293329 1287045 1280235 1273323 1266768
58802A266768o581p212p877q650j0297j2690j4574j5200j5033j4751j4677j5191
$$ 1266768 1260187 1252975 1245098 1236448 1226151 1213461 1198887 1183687 1168654 1153903 1139226 1124035
58790A124035j6467j7610j7237j5262j3110j1984j1702j1392j0516r102p707p198
$$ 1124035 1107568 1089958 1072721 1057459 1044349 1032365 1020663 1009271 998755 989653 981946 974748
58778I74748p926r151r877j0033j0074r830q699o818n106m119l651l406l244k951
$$ 974748 966822 957671 947794 937761 927687 917857 909158 902340 897234 893115 889464 886058 882814 879863
58764H79863k482k304k650k692j322J220L357L931L254K394K001J963J805J346
$$ 879863 877381 875077 872427 869735 868413 869633 872990 876921 880175 882569 884570 886533 888338 889684
58750H89684R90J074J004j51j963k751j977j380k551m482m999l887k891k918l025
$$ 889684 890674 891748 892752 892601 890638 887887 885910 884530 881979 877497 872498 868611 865720 862802 859777
58735H59777k373j627j810k771l429l032j685l3J373K414L223L789M125M692N913
$$ 859777 857404 855777 853967 851196 847767 844735 843050 843017 844390 846804 850027 853816 857941 862633 868546
58720H68546P259P805P842Q605R987J0035P718M669K936K242J063p78k371l690
$$ 868546 875805 883610 891452 900057 910044 920079 927797 932466 935402 937644 938707 937929 935558 931868
58706I31868n300o697o952o644p149q116p724n799m587n625p318o860l754l50
$$ 931868 926568 919871 912919 906275 899126 891010 883286 877487 872900 867275 859957 853097 849343 848993
58692H48993R23J37n78J10J094P18k91M00K951M650M140L909O523J0280J1513
$$ 848993 849916 850053 849475 849585 850679 851397 851106 851506 854457 859107 863247 867156 873679 883959 895472
58677H95472R985Q815R479J0277J0059J0213J1758J3149J2667J1152J0563J1054
$$ 895472 905457 914272 923751 934028 944087 954300 966058 979207 991874 1003026 1013589 1024643
58665A024643J1054R509O796L895J594L06M2O27J994L895N460N842N283M703M191
$$ 1024643 1035697 1045206 1052002 1055897 1057491 1057797 1057839 1058466 1060460 1064355 1069815 1075657 1080940 1085643 1089834
58650A089834K852K96k646n035o844q545j0348j2195j4041j5809j7341j8505j9238
$$ 1089834 1092686 1092982 1090336 1085301 1078457 1069912 1059564 1047369 1033328 1017519 1000178 981673 962435
58637I62435j9658k0185k1078k1752k1360k0302j9889k0005j8579j4635j0367
$$ 962435 942777 922592 901514 879762 858402 838100 818211 798206 779627 764992 754625
58626G54625q440q421p936o477n710o274o613n286k763n89n1j473l458l344j04
$$ 754625 746185 737764 729828 723351 717641 711367 704754 699468 696705 696116 696065 694592 691134 687790 687686
58611F87686L643M565L076K567M412O442O715O067N972O282O411O701P232O817
$$ 687686 691329 695894 698970 701537 705949 712391 719106 725173 731145 737427 743838 750539 757771 764588
58597G64588M606J507j037k609l356l289k919l349m736n810n835n796o672p669
$$ 764588 769194 770701 769664 767055 763699 760410 757491 754142 749406 743596 737761 731965 725293 717624
58583G17624p378n820m249l560l757m402m705l768j481J125K875L347K715J457
$$ 717624 710246 704426 700177 696617 692860 688458 683753 679985 678504 679629 682504 685851 688566 690023
58569F90023M84N22J028O58p64j723j073L72J032O38L08R51K228K935K264Q25
$$ 690023 690507 691029 692057 692715 691951 690228 689155 689527 690559 691197 691505 692456 694684 697619 699883 700708
58553G00708K02J145K649L414L589M050M617M384L494K973L001K868K646L163
$$ 700708 700910 702055 704704 708118 711707 715757 720374 724758 728252 731225 734226 737094 739740 742903
58539G42903M208M481L658K868K744K588J951J400J372J788L228O584J0866J3358
$$ 742903 747111 751592 755250 758118 760862 763450 765401 766801 768173 769961 773189 779773 790639 803997
58525H03997J2994J1951J2592J4318J4828J3350J1166R693R385J0015J0989J1631
$$ 803997 816991 828942 841534 855852 870680 884030 895196 904889 914274 924289 935278 946909
58513I46909J1804J1967J2397J2921J3511J4331J5160J5749J6820J9381K2863
$$ 946909 958713 970680 983077 995998 1009509 1023840 1039000 1054749 1071569 1090950 1113813
58502A113813K5292K5777K5479K5587K5717K4952K3284K1168J8727J6049J3337
$$ 1113813 1139105 1164882 1190361 1215948 1241665 1266617 1289901 1311069 1329796 1345845 1359182
58491A359182J0167N718K99m453p539r796j2433j5271j7201j7676j7248j7135
$$ 1359182 1369349 1375067 1375366 1370913 1363374 1353578 1341145 1325874 1308673 1290997 1273749 1256614
58479A256614j8358k0692k2596k3044k3033k3950k5011k4171k1491j9401j9192
$$ 1256614 1238256 1217564 1194968 1171924 1148891 1124941 1099930 1075759 1054268 1034867 1015675
58468A015675j9294j7784j4805j1610q829o697n602n385n092m162k971j976j475
$$ 1015675 996381 978597 963792 952182 943353 936656 931054 925669 920577 916415 913444 911468 909993
58455I09993k161m387o639o666m544k800k869l339k454n75P89Q93j61j738k487
$$ 909993 907832 903445 896806 890140 885596 882796 879927 876588 874134 873559 874348 875241 875080 873342 870855
58440H70855j352O64J352M38n4Q87J724J122J97O67K447M320N695O570P034P653
$$ 870855 869503 870167 871519 871957 871903 872790 874514 875636 875833 876500 878947 883267 888962 895532 902566 910219
58424I10219R131J1002J1975J2005J2427J3747J5131J6352J8057J9583J8914J5629
$$ 910219 919350 930352 942327 954332 966759 980506 995637 1011989 1030046 1049629 1068543 1084172
58412A084172J1685Q447N216J568j350k964m351o070p184p595q729j0577j0625
$$ 1084172 1095857 1104304 1109520 1111088 1109738 1106774 1102423 1096353 1089169 1081574 1072845 1062268 1051643
58399A051643p466l201o26P3M04J393L569O902R638R430O733M503L664J858k020
$$ 1051643 1044177 1040976 1040350 1040423 1040827 1042220 1045789 1052691 1062329 1071759 1078492 1082995 1086659 1088517 1086497
58384A086497n528o648o577o571n484l055k016l849n524l830k19K012K814L993
$$ 1086497 1080969 1074321 1067744 1061173 1055689 1052634 1050618 1046769 1041245 1037415 1037196 1039208 1042022 1046015
58370A046015N124M740L815M417O066O852O981Q129J0320J2153J3059J2927J0981
$$ 1046015 1051139 1055879 1059694 1064111 1070177 1077029 1084010 1092139 1102459 1114612 1127671 1140598 1151579
58357A151579P316L865J618j026m775o976n592k976k274k597j637n66j918m542
$$ 1151579 1158895 1162760 1164378 1163352 1158577 1151601 1146009 1143033 1140759 1138162 1136525 1135959 1134041 1129499
58343A129499n324m503m548m930k837J394M318M817N148O369O919O261O074O868
$$ 1129499 1124175 1119672 1115124 1110194 1107357 1108751 1113069 1117886 1123034 1129403 1136322 1142583 1148657 1155525
58329A155525O756M640J952L70l0J65N80P30N06P59K045L453M170M903O172O780
$$ 1155525 1162281 1166921 1168873 1169243 1169213 1169378 1169958 1170688 1171194 1171953 1173998 1177451 1181621 1186524 1192696 1199476
58313A199476O043N637O889Q216P903P274Q114R231Q932Q691J0491J2670J2628
$$ 1199476 1205519 1211156 1218045 1226261 1234164 1241438 1249552 1258783 1267715 1276406 1286897 1299567 1312195
58300A312195J1700J2781J4748J4246J1878J1448J3514J4726J3495J1559R887
$$ 1312195 1323895 1336676 1351424 1365670 1377548 1388996 1402510 1417236 1430731 1442290 1452177
58289A452177P660N762O651J0048J2685J3133J3222J4139J4678J4165J3863J4760
$$ 1452177 1459837 1465599 1472250 1482298 1494983 1508116 1521338 1535477 1550155 1564320 1578183 1592943
58277A592943J6594J9143K1903K2953K1104J8553J8313J9791K0173J9140J8434
$$ 1592943 1609537 1628680 1650583 1673536 1694640 1713193 1731506 1751297 1771470 1790610 1809044
58266A809044J7770J5379J2035J0392J0686J0985J1238J2915J5117J5353J4023
$$ 1809044 1826814 1842193 1854228 1864620 1875306 1886291 1897529 1910444 1925561 1940914 1954937
58255A954937J4083J6388J9145K1566K4183K6204K6502K6536K8337L0601L0943
$$ 1954937 1969020 1985408 2004553 2026119 2050302 2076506 2103008 2129544 2157881 2188482 2219425
58244B219425L0630L2470L5430L6421L6036L6980L8226L6686L3763L3815L6767
$$ 2219425 2250055 2282525 2317955 2354376 2390412 2427392 2465618 2502304 2536067 2569882 2606649
58233B606649L8643L9024M1121M4582M5420M3697M4129M7851N0493M9983M9678
$$ 2606649 2645292 2684316 2725437 2770019 2815439 2859136 2903265 2951116 3001609 3051592 3101270
58222C101270N1962N4960N7525O1470O6888P0908P2988P6028Q0662Q3878Q4872
$$ 3101270 3153232 3208192 3265717 3327187 3394075 3464983 3537971 3613999 3694661 3778539 3863411
58211C863411Q6872R1666R7477J03310J10113J16827J20960J23757J29112J36880
$$ 3863411 3950283 4041949 4139426 4242736 4352849 4469676 4590636 4714393 4843505 4980385
58201D980385J43331J48429J55926J65830J73976J79812J87316J97084K05031
$$ 4980385 5123716 5272145 5428071 5593901 5767877 5947689 6135005 6332089 6537120
58192F537120K10264K16853K26506K36776K47667K62232K79514K94932L08949
$$ 6537120 6747384 6964237 7190743 7427519 7675186 7937418 8216932 8511864 8820813
58183H820813L27156L50472L73843L96008M21548M51586M81657N10800N43654
$$ 8820813 9147969 9498441 9872284 10268292 10689840 11141426 11623083 12133883 12677537
58174A2677537N81472O20211O59343P03175P51729P99960Q47321Q98203R52112
$$ 12677537 13259009 13879220 14538563 15241738 15993467 16793427 17640748 18538951 19491063
58165A9491063J004578J058353J121588J194167J268949J347202J438137J541713
$$ 19491063 20495641 21553994 22675582 23869749 25138698 26485900 27924037 29465750
58157B9465750J647940J755692J875864K012945K160761K320047K501973K710292
$$ 29465750 31113690 32869382 34745246 36758191 38918952 41238999 43740972 46451264
58149D6451264K939131L193089L489694L837650M234616M690813N229566N857162
$$ 46451264 49390395 52583484 56073178 59910828 64145444 68836257 74065823 79922985
58141G9922985O557361P322982Q166727R096855J0116585J1256665J2572583J4099225
$$ 79922985 86480346 93803328 101970055 111066910 121183495 132440160 145012743 159111968
58133A59111968J5845176J7834581K0102353K2639795K5390057K8229913L0731745
$$ 159111968 174957144 192791725 212894078 235533873 260923930 289153843 319885588
58126C19885588L1835870L0016594K4215977J4850499L847919o411846j4288357
$$ 319885588 351721458 381738052 405954029 420804528 424652447 418240601 403952244
58119D03952244j9308016k1867932k2769614k2853906k2704265k2491567k2100157
$$ 403952244 384644228 362776296 340006682 317152776 294448511 271956944 249856787
58112B49856787k1410461k0438759j9264347j7941571j6514724j5047069j3593597
$$ 249856787 228446326 208007567 188743220 170801649 154286925 139239856 125646259
58105A25646259j2180695j0833589r590605q473401p473148o580865n804704n145230
$$ 125646259 113465564 102631975 93041370 84567969 77094821 70513956 64709252 59564022
58097E9564022m580193m087901l664098l304536k992031k712760k467553k256874
$$ 59564022 54983829 50895928 47231830 43927294 40935263 38222503 35754950 33498076
58089C3498076k070989j903413j757708j632682j516397j402752j299172j210166
$$ 33498076 31427087 29523674 27765966 26133284 24616887 23214135 21914963 20704797
58081B0704797j127664j045181r67603q99025q34008p69071p10910o65165o27567
$$ 20704797 19577133 18531952 17564349 16665324 15831316 15062245 14351335 13686170 13058603
58072A3058603n93070n63248n38218n11835m81777m54444m33364m12525l87665
$$ 13058603 12465533 11902285 11364067 10852232 10370455 9916011 9482647 9070122 8682457
58063H682457l64381l47912l33912l16849k99399k86193k75375k63381k51665
$$ 8682457 8318076 7970164 7636252 7319403 7020004 6733811 6458436 6195055 5943390
58054E943390k42309k32919k21676k11605k04595j97070j86699j77355j72287
$$ 5943390 5701081 5468162 5246486 5034881 4830286 4633216 4446517 4269162 4096875
58045D096875j68175j61173j53262j47515j42387j35765j29586j25447j20408
$$ 4096875 3928700 3767527 3614265 3466750 3324363 3188598 3059012 2933565 2813157
58036B813157j11986j02821r5876q9567q2051p5763p2986p1012o6292n9780n4087
$$ 2813157 2701171 2598350 2502474 2412907 2330856 2255093 2182107 2111095 2044803 1985023 1930936
58025A930936m9072m4144m1299m1820m3143m2567m0913l9571l7484l4208l2184
$$ 1930936 1881864 1837720 1796421 1754601 1711458 1668891 1627978 1588407 1550923 1516715 1484531
58014A484531l2780l3531l2346l0808l0394k9353k6584k4637k5257k5573k2538
$$ 1484531 1451751 1418220 1385874 1355066 1324672 1295319 1268735 1244098 1218841 1193268 1170730
58003A170730j8003j5687j5848j6315j6305j6072j5141j3681j3467j5210j7146
$$ 1170730 1152727 1137040 1121192 1104877 1088572 1072500 1057359 1043678 1030211 1015001 997855
57992I97855j7908j8116j7875j6193j4207j4933j8026j9153j6638j4142j4266
$$ 997855 979947 961831 943956 927763 913556 898623 880597 861444 844806 830664 816398
57981H16398j4454j2421j0723j1867j3317j1850r193q790j0065j0394j0009j0539
$$ 816398 801944 789523 778800 766933 753616 741766 732573 723783 713718 703324 693315 682776
57969F82776j1052r877q319q635j0060j0420r903r801r416p656n891n879o567
$$ 682776 671724 661847 653528 644893 634833 624413 614510 604709 595293 587637 581746 575867 569300
57956E69300o093n227n649o489n797m013k941k655k261k231l260m168l570k228
$$ 569300 563207 557980 552331 545842 540045 536032 533091 530436 528175 525944 522684 518516 514946 512718
57942E12718j501j065l92n59k107l088j788M28J475J712K171J896j3j681r63R24
$$ 512718 511217 510152 509760 509201 507094 504006 502218 502646 504121 505833 508004 509900 509887 508206 507243 508167
57926E08167J265j35j685l201n420p539q188p815p626p219n593l371j829j036
$$ 508167 509432 509297 507612 504411 498991 491452 483264 475449 467823 460604 455011 451640 449811 448775
57912D48775q56k106m675o327n654m237l771l317j841r46k078l377k525o13J79
$$ 448775 447919 445813 441138 434811 429157 424920 421149 417832 415991 415045 412967 409590 407065 406452 406631
57897D06631N28J984L189K105K49M00J479K08k965m161k069N75J611J683J489
$$ 406631 407159 409143 412332 414437 414686 415086 416565 416773 413808 409647 407578 408153 409764 411447 412936
57882D12936N32o89l77J848M398O284P789Q552P678O008N659O839P521O624N350
$$ 412936 413468 412779 412402 414250 418648 424932 432721 441273 448951 454959 460618 467457 474978 481602 486952
57867D86952M841M610L894K784J484j91k259m459o579q056q009o650n641n788
$$ 486952 491793 496403 500297 503081 504565 504374 502115 497656 491077 483021 475012 468362 462721 456933
57853D56933n772m621l787m765o270o240n188m877m991m077k772k951m278m706
$$ 456933 451161 446540 442753 437988 431718 425478 420290 415413 410422 406345 403573 400622 396344 391638
57839C91638m106m395o123p631p675o610n024l433k861l521l499j180J658J970
$$ 391638 387532 383137 377014 369383 361708 355098 350074 346641 343780 340259 336760 335580 337238 339208
57825C39208J02o24J185L545M551M423L769K527J123L74p9j236k641l000k586
$$ 339208 339310 338686 339871 343416 347967 352390 356159 358686 359809 360183 360104 358868 356227 353227 350641
57810C50641k663k876j877l48m84k400l848l760l189k534q89J270J829M53m66
$$ 350641 347978 345102 343225 342877 342393 339993 336145 332385 329196 326662 325773 327043 328872 329325 328859
57795C28859O07K260K750K441K370K368J871R81j17j373j953q05J302K035M79
$$ 328859 329466 331726 334476 336917 339287 341655 343526 344507 344390 343017 341064 340259 341561 343596 344075
57780C44075j729k714k362j645j498k590m747o475o467n395m664m036k442n18
$$ 344075 342346 339632 337270 335625 334127 331537 326790 320315 313848 308453 303789 299753 297311 296793
57766B96793J36l08n05p63k289l902k942L58K777K795K056J695Q69j85M90K699
$$ 296793 296929 296621 296116 295353 293064 289162 286220 286578 289355 292150 294206 295901 296770 296585 297075 299774
57750B99774L205N56k534l618l999n424o510n427l501k996l347k522p24K52J16
$$ 299774 302979 303535 301001 297383 293384 287960 281450 276023 272522 269526 266179 263657 262933 263185 263301
57735B63301M8M62J004J879L191L847L004J686J202J114M39k19K57J385J950K121
$$ 263301 263349 263811 264815 266694 269885 273732 276736 278422 279624 280738 281177 280958 281215 282600 284550 286671
57719B86671K885M080M776M828M462L191Q32j164j275r4O11M07J8m92j551k542
$$ 286671 289556 293636 298412 303240 307702 310893 311725 310561 309286 309192 309803 310210 310228 309736 308185 305643
57703C05643k416j582j447k178k563j990j171q42j023j583k297k439j506l31l68
$$ 305643 303227 301645 300198 298020 295457 293467 292296 291454 290431 288848 286551 284112 282606 282275 281907
57688B81907j782l196l517l059k704k605k079o05J222J939Q27r12j473r00j009
$$ 281907 280125 276929 273412 270353 267649 265044 262965 262360 263582 265521 266348 265436 263963 263063 262054
57673B62054k554l957l587j939n82k5J87K52K27N21J126J133J1j369k056k414
$$ 262054 259500 255543 251956 250017 249435 249410 249597 249849 250076 250597 251723 252856 252867 251498 249442 247028
57657B47028l092l567l148k653l367m790n101l728k036j414j942l073m383n327
$$ 247028 243936 240369 237221 234568 231201 226411 221310 217582 215546 214132 212190 209117 204734 199407
57643A99407n148l563j269L88K63j602l639l997k552j035p61j163j206j134j667
$$ 199407 194259 190696 189427 189815 190078 188476 184837 180840 178288 177253 176492 175329 174123 172989 171322
57628A71322k213j405Q25K938L790M009N064P384R722J0500R848R813J1943J5099
$$ 171322 169109 167704 168529 171467 175257 179266 184330 191714 201436 211936 221784 231597 243540 258639
57614B58639J7091J8157K0993K6797L3325L8046M1427M5297M9195N0348M6635
$$ 258639 275730 293887 314880 341677 375002 413048 454475 499772 548967 599315 645950
57603F45950L7927K5009R062p736k2670l4054m1672m5817m6723m4917m1308l6797
$$ 645950 683877 708886 717948 710212 687542 653488 611816 565999 519276 474359 433051 396254
57591C96254l2142k7938k4344k1129j8228j5811j3666j1386r277q049p341n870
$$ 396254 364112 336174 311830 290701 272473 256662 242996 231610 222333 214284 206943 201073
57579B01073l540j927j976k656k779k600k467j633J51J422R88j78p10j040k035
$$ 201073 197533 195606 193630 190974 188195 185595 183128 181495 181646 183068 184056 183878 183168 182128 180093
57564A80093k983l176l959o553q939q051m551k289l014m557m690l931l704m233
$$ 180093 177110 173934 169975 163422 154483 146432 141881 139592 136578 132021 127331 123400 119696 115463
57550A15463n203o395o644m317j42K382J027k136l354j766K54N81n01j582k162
$$ 115463 110260 103865 97221 92904 92762 95144 96171 94035 90681 88915 89169 89750 89249 87667 85505
57535H5505k783l742m391m005l055k809l528l918l086k078k444l961n164n551
$$ 85505 82722 78980 74589 70584 67529 64720 61192 57274 54188 52110 49666 45705 40541 34990
57521C4990n800o077n734m657l443k282j028l77j402D96d931n633m990m240l207
$$ 34990 29190 23113 17379 12722 9279 6997 5969 5592 4190 496 -4931 -10564 -15554 -19794 -23001
57506b3001j934j248j545k193k775l754n327o626o735n683l995k190j009j069
$$ -23001 -24935 -26183 -27728 -29921 -32696 -36450 -41777 -48403 -55138 -60821 -64816 -67006 -68015 -69084
57492f9084j852j997j137m46q92j914k400k150j690j316q31J47J802L618M501
$$ -69084 -70936 -72933 -74070 -74516 -75408 -77322 -79722 -81872 -83562 -84878 -85709 -85562 -83760 -80142 -75641
57477g5641M030L213K952K379K53k493l611k985k924m532o070n773m214k584p35
$$ -75641 -71611 -68398 -65446 -63067 -62814 -65307 -68918 -71903 -74827 -79359 -85429 -91202 -95416 -98000 -98735
57462i8735J484K785K316J604K497M296M970M483M601N743O331N473M332M156
$$ -98735 -97251 -94466 -92150 -90546 -88049 -83753 -78783 -74300 -69699 -63956 -57625 -52152 -47820 -43664
57448d3664M483M131K933J711J139J210J432J142l6j702k871k945k326j973k429
$$ -43664 -39181 -35050 -32117 -30406 -29267 -28057 -26625 -25483 -25519 -27221 -30092 -33037 -35363 -37336 -39765
57433c9765l280l628l063k175j970k849m286n386n512m652l518l029l252l275
$$ -39765 -43045 -46673 -49736 -51911 -53881 -56730 -61016 -66402 -71914 -76566 -80084 -83113 -86365 -89640
57419h9640k702k638m091n886n699l183o04m8j333l071m326m608l659k101j236
$$ -89640 -92342 -94980 -99071 -104957 -110656 -113839 -114443 -114491 -115824 -118895 -123221 -127829 -131488 -133589 -134825
57404a34825j333j246l72J92m90j598j943j834k149k602k422k080k601l631l736
$$ -134825 -136158 -137404 -137776 -137584 -138074 -139672 -141615 -143449 -145598 -148200 -150622 -152702 -155303 -158934 -162670
57389a62670k536j157o74j163k217l279l656l174k672k860l032k023j67J051J163
$$ -162670 -165206 -166363 -167037 -168200 -170417 -173696 -177352 -180526 -183198 -186058 -189090 -191113 -191280 -190229 -189066
57374a89066J154J550J497K04j741l036l015j928o00n1o95j658j538j71J001O31
$$ -189066 -187912 -186362 -184865 -184661 -186402 -189438 -192453 -194381 -194981 -195032 -195727 -197385 -198923 -199094 -198093 -197462
57358a97462r80k448k870k400j575o76K11Q21O39o13k486m078m878n011m660l798
$$ -197462 -198442 -200890 -203760 -206160 -207735 -208411 -208200 -207379 -206740 -207353 -209839 -213917 -218795 -223806 -228466 -232264
57342b32264k788k515l311m317m597m397m488m670m000k426j161j123j798k056
$$ -232264 -235052 -237567 -240878 -245195 -249792 -254189 -258677 -263347 -267347 -269773 -270934 -272057 -273855 -275911
57328b75911j575j033j109j659j986j812j689k134k627k207j086p35j975l813
$$ -275911 -277486 -278519 -279628 -281287 -283273 -285085 -286774 -288908 -291535 -293742 -294828 -295563 -297538 -301351
57314c01351m748m417l329j827k97M25m7p82o54Q9L56j13p10j182j657j755r64
$$ -301351 -306099 -310516 -313845 -315672 -315969 -315544 -315591 -316373 -317027 -316938 -316582 -316695 -317405 -318587 -320244 -321999 -322963
57297c22963K12P18M06q0o82j851l242l977m192m785n430m664k453q89j319k379
$$ -322963 -322751 -322033 -321627 -321707 -322389 -324240 -327482 -331459 -335651 -340436 -345866 -350530 -352983 -353872 -355191 -357570
57281c57570k202j389k039m332n835m528j448L35r43l902n677n005l144j807j139
$$ -357570 -359772 -361161 -363200 -367532 -373367 -377895 -379343 -379008 -379951 -383853 -389530 -394535 -397679 -399486 -400625
57266d00625m59J3m74j604k342k723l663m854m631k507k72L53k22o99j006j896
$$ -400625 -401084 -401071 -401545 -403149 -405491 -408214 -411877 -416731 -421362 -423869 -424141 -423788 -424010 -424709 -425715 -427611
57250d27611l327m388m451l545k155j228j717l412m882n121m498l626k502j468
$$ -427611 -430938 -435326 -439777 -443322 -445477 -446705 -448422 -451834 -456716 -461837 -466335 -469961 -472463 -473931
57236d73931j665l207m142k894q88r18l332n660n922m655l394k743k414k025j294
$$ -473931 -475596 -478803 -482945 -485839 -486727 -487645 -490977 -496637 -502559 -507214 -510608 -513351 -515765 -517790 -519084
57221e19084j69Q22J042O73N41R21J263J178R36Q83R98J139J159P31k49j177j350
$$ -519084 -519253 -518431 -517389 -516716 -516175 -515254 -513991 -512813 -511877 -510994 -509996 -508857 -507698 -506967 -507216 -508393 -509743
57204e09743j013j039j615k042j917j543j066q9J429K764L360L685M689O764R434
$$ -509743 -510756 -511795 -513410 -515452 -517369 -518912 -519978 -520067 -518638 -515874 -512514 -508829 -504140 -497376 -487942
57189d87942J1744J2912J3068J3349J4744J6921J8696J9507J9641J9205J7961
$$ -487942 -476198 -463286 -450218 -436869 -422125 -405204 -386508 -367001 -347360 -328155 -310194
57178c10194J6260J4995J4278J3248J1695J0821J1642J3480J4928J5645J6339
$$ -310194 -293934 -278939 -264661 -251413 -239718 -228897 -217255 -203775 -188847 -173202 -156863
57167a56863J7399J8593J9919K1855K4559b7149B265L0302L0541L0896L1462L1453
$$ -156863 -139464 -120871 -100952 -79097 -54538 -27149 2265 32567 63108 94004 125466 156919
57155A56919L0312K8819K8397K9343L0557L1228L1737L2430L2580L1547L0169
$$ 156919 187231 216050 244447 273790 304347 335575 367312 399742 432322 463869 494038
57144D94038K9772L0107K9588K7575K5301K4181K4022K3473K1727J9242J6992
$$ 494038 523810 553917 583505 611080 636381 660562 684584 708057 729784 749026 766018
57133G66018J5532J4778J4292J3592J2324J0521Q665P211N974M341K298O74m4
$$ 766018 781550 796328 810620 824212 836536 847057 855722 862933 868907 873248 875546 876220 876176
57120H76176n60j700l130m150n307p784j1228j3886j5243j6922k0111k3707k6191
$$ 876176 875616 873916 870786 866636 861329 853545 842317 828431 813188 796266 776155 752448 726257
57107G26257k8012l0498l3327l4846l4576l3951l4637l7158m0799m3808m4148
$$ 726257 698245 667747 634420 599574 564998 531047 496410 459252 418453 374645 330497
57096C30497m1449l8096l7167l9424m3350m7602C1389b5173o1220o6825p4286
$$ 330497 289048 250952 213785 174361 131011 83409 31389 -25173 -86393 -153218 -227504
57085b27504q2663r0018r6603j05025j16486j29013j40770j52921j67271j82813
$$ -227504 -310167 -400185 -496788 -601813 -718299 -847312 -988082 -1141003 -1308274 -1491087
57075a491087j97263k11037k26685k44573k62096k77843k93925l12761l33802
$$ -1491087 -1688350 -1899387 -2126072 -2370645 -2632741 -2910584 -3204509 -3517270 -3851072
57066c851072l55513l79190m08375m44808m87103n33451n83769o38757o98668
$$ -3851072 -4206585 -4585775 -4994150 -5438958 -5926061 -6459512 -7043281 -7682038 -8380706
57057h380706p64058q36351r16415j003750j098452j203267j322293j458310j612916
$$ -8380706 -9144764 -9981115 -10897530 -11901280 -12999732 -14202999 -15525292 -16983602 -18596518
57048a8596518j788756j989940k220587k484943k788830l138946l540560l998269
$$ -18596518 -20385274 -22375214 -24595801 -27080744 -29869574 -33008520 -36549080 -40547349
57040d0547349m520049n118972n810569o610296p532943q589773r782353j1099733
$$ -40547349 -45067398 -50186370 -55996939 -62607235 -70140178 -78729951 -88512304 -99612037
57032i9612037j2523186j4033923j5618820j7273467j8999141k0789888k2619925
$$ -99612037 -112135223 -126169146 -141787966 -159061433 -178060574 -198850462 -221470387
57025b21470387k4445275k6200121k7741584k8752133k8713437k7068819k3526550
$$ -221470387 -245915662 -272115783 -299857367 -328609500 -357322937 -384391756 -407918306
57018d07918306j8280967j1959645n333632R84376O662895J1587210J5731877
$$ -407918306 -426199273 -438158918 -443492550 -442508174 -435845279 -424258069 -408526192
57011d08526192J9084783K1648287K3471796K4658758K5329043K5566856K5399934
$$ -408526192 -389441409 -367793122 -344321326 -319662568 -294333525 -268766669 -243366735
57004b43366735K4823719K3842666K2494613K0850664J9003478J7054209J5099814
$$ -243366735 -218543016 -194700350 -172205737 -151355073 -132351595 -115297386 -100197572
56997a00197572J3221812J1479658R909408Q525938P327561O301723N429665M689659
$$ -100197572 -86975760 -75496102 -65586694 -57060756 -49733195 -43431472 -38001807 -33312148
56989c3312148M060466L524756L069574K683784K356188K076518J836733J630623
$$ -33312148 -29251682 -25726926 -22657352 -19973568 -17617380 -15540862 -13704129 -12073506
56981a2073506J452928J299174J165315J047246R41712Q47614P65027O92822O28801
$$ -12073506 -10620578 -9321404 -8156089 -7108843 -6167131 -5319517 -4554490 -3861668 -3232867
56972c232867N72063N23084M81144M43822M09805L80121f6839B70687L24821L16616
$$ -3232867 -2660804 -2137720 -1656576 -1212754 -802949 -422828 -66839 270687 595508 912124
56962I12124L06436K83931K44304J95113J50474J19046R9778Q7568P8950P2264
$$ 912124 1218560 1502491 1746795 1941908 2092382 2211428 2311206 2398774 2477724 2549988
56952B549988O6143N9675N2407M3436L1926J8858O401n043j7424l1827m6361n8563
$$ 2549988 2616131 2675806 2728213 2771649 2803575 2822433 2828834 2823791 2806367 2774540 2728179 2669616
56940B669616o8824p9991r3930j09497j23795j34608j41331j44020j42295j35789
$$ 2669616 2600792 2520801 2426871 2317374 2193579 2058971 1917640 1773620 1631325 1495536
56930A495536j25604j14361j04157r4908q5360p5310o6029n8772n3720n0367m8161
$$ 1495536 1369932 1255571 1151414 1056506 971146 895836 829807 771035 717315 666948 618787
56919F18787m6695m5737m5052m3948m1475l7564l3561l0851k9265k7573k5222
$$ 618787 572092 526355 481303 437355 395880 358316 324755 293904 264639 237066 211844
56908B11844k2661k0135j7176j3533r847o964m993l309j337P83K333K782K304
$$ 211844 189183 169048 151872 138339 128492 121528 116535 113226 111889 112672 115005 117787 120091
56895A20091J218p17l798p304r953j1414j2294j2560j1411r087p091n787l577
$$ 120091 121309 120592 116794 109490 99537 88123 75829 63269 51858 42771 35680 29893 26316
56882B6316L20M025N694O598R306J3764J7535J9390K0505K2178K4380K6491K7578
$$ 26316 26636 30661 36355 42953 52259 66023 83558 102948 123453 145631 170011 196502 224080
56869B24080K6025K0778J3230O231J057l136p022j0175j2423j4069j4495j2677
$$ 224080 250105 270883 284113 290344 291401 288265 281243 271068 258645 244576 230081 217404
56857B17404r517p566p559p312n121k370j336k007k631k359j678r86p3J180K512
$$ 217404 207887 200321 192762 185450 180329 177959 176623 174616 171985 169626 167948 166962 166889 168069 170581
56842A70581L513L859L730M100N587P098O924N449N108P079R711J1139J1779J2987
$$ 170581 174094 177953 181683 185783 191370 198468 205392 210841 215949 223028 232739 243878 255657 268644
56828B68644J4789J6352J7479J8087J7281J4536J0971P938N156J781j499l169
$$ 268644 283433 299785 317264 335351 352632 367168 378139 386077 391233 393014 391515 388346
56816C88346l130k586j950n96J452L220M263N242O860R316J2634J6377J9197K0130
$$ 388346 385216 382630 380680 380084 381536 384756 389019 394261 401121 410437 423071 439448 458645 478775
56802D78775K0368K2310K6371K9948K9903K5250J7180P785o94o471r144r744r463
$$ 478775 499143 521453 547824 577772 607675 632925 650105 657890 657196 650725 641581 631837 622374
56789F22374q719p543o143m566k461L04L250O108R642J4928K1803K8603L3675
$$ 622374 613655 606112 599969 595403 592942 593246 596496 602604 612246 627174 648977 677580 711255
56776G11255L6995M0030M3951M7915M9211M5150L5053K0798N722p216j6844k3842
$$ 711255 748250 788280 832231 880146 929357 974507 1009560 1030358 1036080 1028864 1012020 988178
56764I88178k9260l3066l4355l2863k9572k5692k1723j7732j3858j0030n834j138
$$ 988178 958918 925852 891497 858634 829062 803370 781647 763915 750057 740027 734193 733055
56752G33055L684Q604J4350K1256K8205L3349L5385L3493K6908J5794K236j0765
$$ 733055 736739 745343 759693 780949 809154 842503 877888 911381 938289 954083 956319 945554
56740I45554k1230k8531l2393l2943l1543l0071k8987k7225k4287k1163j8578
$$ 945554 924324 895793 863400 830457 798914 768843 739856 712631 688344 667181 648603
56729F48603j5594j1037n523q46K322M968Q028J1199J3650J5047J5149J3090P956
$$ 648603 633009 621972 616449 615603 617925 622893 630921 642120 655770 670817 685966 699056 707012
56716G07012J69q378j5751k1137k4482k5749k5127k3532k2016k0776j9340j7653
$$ 707012 707181 698803 683052 661915 637433 611684 586557 563025 541009 520233 500893 483240
56704D83240j6188j4944j3352j1404j0061r906j0166r701q447p229o514o084n629
$$ 483240 467052 452108 438756 427352 417291 407385 397219 387518 379071 371842 365328 359244 353615
56691C53615n117m666m484m723n069m849l939l165l273l852l891l087k123j744
$$ 353615 348498 343832 339348 334625 329556 324707 320768 317603 314330 310478 306587 303500 301377 299633
56677B99633k023k442k327j391r6P53R77J167J624J751R88k53j095j262j055p25
$$ 299633 297610 295168 292841 291450 291354 292107 293084 294251 295875 297626 298614 298361 297266 296004 294949 294224
56661B94224l56p7K14R73K367L823M549M223K932J066n11r67o47p33j332j008
$$ 294224 293868 293791 294005 294978 297345 301168 305717 309940 312872 313938 313427 312460 311813 311080 309748 308740
56645C08740Q89K664K365M91q38p90k63P4N45J201J320M58j010k375k914j992
$$ 308740 309629 312293 314658 315149 314311 313521 313258 313332 313877 315078 316398 316856 315846 313471 310557 308565
56629C08565N1J539J248J82J80J104J189N7o18J05R18M82m26k30J136K437K958
$$ 308565 308616 310155 311403 311585 311765 312869 314058 314115 313497 313602 314520 315002 314576 314346 315482 317919 320877
56612C20877L009L047L243L674M239M550M390M080M070M375M678M712M362L644
$$ 320877 323886 326933 330176 333850 338089 342639 347029 351109 355179 359554 364232 368944 373306 376950
56598C76950K827K336K369K722L074L317L619M188M763M439K484m21k511k742
$$ 376950 379777 382113 384482 387204 390278 393595 397214 401402 406165 410604 413088 412667 410156 407414
56584D07414j723m67P07J610J669R40M50M72k97k404l875k729k17P69k30j198
$$ 407414 405691 405224 405931 407541 409210 410150 410600 411072 410775 408371 404496 401767 401550 402319 402089 400891
56568D00891j266j616k647l036k260j633k071k862l428m162m726l810j583k67
$$ 400891 399625 398009 395362 392326 390066 388433 386362 383500 380072 375910 371184 367374 365791 365524
56554C65524r61k030j969j761k680l753l472k466k282k699k347j194m15l40k74
$$ 365524 364563 362533 360564 358803 356123 352370 348898 346432 344150 341451 339104 337910 337495 337155 336881
56539C36881J12O19J205J601J019n16j430o70M63K38o91l28J506L090L572L751
$$ 336881 336993 337612 338817 340418 341437 340921 339491 338821 339284 339522 338831 338503 340009 343099 346671 350422
56523C50422M122M054L248K372J897J513R92N61K42r0p2P65J945K522K504K709
$$ 350422 354544 358598 361846 364218 366115 367628 368620 369181 369423 369333 369261 370026 371971 374493 376997 379706
56507C79706L309L804M340N701P737R173R420R348R703R887Q991P269N792N066
$$ 379706 383015 386819 391159 396860 404597 413770 423190 432538 442241 452128 461119 468388 474180 479246
56493D79246M719M343M093M352M958N099M225K929K252K050J021j286l454m032
$$ 479246 483965 488308 492401 496753 501711 506810 511035 513964 516216 518266 519287 518001 514547 510515
56479E10515l374k676k139j425j221k527m637n624n023m507n334o486o183m306
$$ 510515 507141 504465 502326 500901 499680 497153 492516 486892 481869 477362 472028 465542 459359 455053
56465D55053k419j755j928j784j037p42j867l780m963n051n020n125m310k451
$$ 455053 452634 450879 448951 447167 446130 445388 443521 439741 434778 429727 424707 419582 415272 412821
56451D12821j498k784m637m646l200k376k168q21J278J198k045n427n896m254
$$ 412821 411323 408539 403902 399256 396056 393680 391512 390691 391969 393167 391122 385695 379799 375545
56437C75545l204l259k820j341n9L04O64J889L200L012R32j551k406j029J197
$$ 375545 372341 369082 366262 364921 364862 365166 365830 367719 370919 373931 374863 373312 370906 369877 371074
56422C71074K458K352J773J250L75j075k344k551j668l12R22J639J843K183L311
$$ 371074 373532 375884 377657 378907 379282 378207 375863 373312 371644 371332 372254 373893 375736 377919 381230
56407C81230M686M849L450K057K164L076K900J236k44jJ543K810K988K502J885
$$ 381230 385916 390765 394215 396272 398436 401512 404412 405648 405404 405403 406946 409756 412744 415246 417131
56392D17131R65n56k180k860k060j87J951L567L874K547O78K00J615L038K449
$$ 417131 418096 417540 415360 412500 410440 410253 412204 415771 419645 422192 422870 423070 424685 427723 430172
56377D30172L99q00r7J322J964J579O36l81p53K44K211L572L296K006R57N50M27
$$ 430172 430571 429771 429674 430996 432960 434539 435175 434794 434041 434285 436496 440068 443364 445370 446327 446877 447304
56360D47304L25J77k41j051j915k390k447k329k196k135k256k427k183j263r2
$$ 447304 447629 447806 447565 446514 444599 442209 439762 437433 435237 433102 430846 428419 426236 424973 424881
56345D24881M78p0j378k330j900k22J307J428M68j71J61P33P07K77J07K43L01
$$ 424881 425359 425289 423911 421581 419681 419459 420766 422194 422662 422491 422652 423385 424092 424369 424476 424719 425020
56328D25020L71R68K043K625J959O79K73J231K369K406J609J030O01o61k543l261
$$ 425020 425391 426359 428402 431027 432986 433665 433938 435169 437538 439944 441553 442583 443184 442523 439980 436719
56312D36719j861L03J416J420J207P76l33j453j353j46R12J385J996K845K830
$$ 436719 434858 435161 436577 437997 439204 439980 439647 438194 436841 436695 437607 438992 440988 443833 446663
56297D46663J349n13j148j73J368K100J494K86k22M24J355J602J186N85j2k21
$$ 446663 448012 447499 446351 446178 447546 449646 451140 451426 451204 451628 452983 454585 455771 456356 456344 456123
56281D56123P28K626L739L096K300L224M700L848M77k245j897M49K307K761K648
$$ 456123 456851 459477 463216 466312 468612 471836 476536 480384 480861 478616 476719 477168 479475 482236 484884
56266D84884L127M787P016P977O523M232L810N205N420K908J2l86J266K449K305
$$ 484884 488011 492798 499814 507791 514314 518546 522356 527561 532981 535889 535901 535515 536781 539230 541535
56251E41535K126K750L463L433K933K807L510M673N325M740L436K846L633M775
$$ 541535 543661 546411 549874 553307 556240 559047 562557 567230 572555 577295 580731 583577 587210 591985
56237E91985M884M005L569M651O653P802P035N365M955O525Q319Q336O861N759
$$ 591985 596869 600874 604443 609094 615747 623549 630584 635949 640904 647429 655748 664084 670945 676704
56223F76704N923O776P818R160J0585J1563J2178J2761J2747J1454R854R805J1490
$$ 676704 682627 689403 697221 706381 716966 728529 740707 753468 766215 777669 787523 797328 808818
56210H08818J3391J4844J6667J8985K0548K0905K1259K2370K3432K4011K5308
$$ 808818 822209 837053 853720 872705 893253 914158 935417 957787 981219 1005230 1030538
56199A030538K8241L1847L4796L7254M0084M3251M6250M9231N2777N7157O2251
$$ 1030538 1058779 1090626 1125422 1162676 1202760 1246011 1292261 1341492 1394269 1451426 1513677
56188A513677O7585P2252P5826P9200Q3263Q6875Q7952Q6549Q4706Q3022P9640
$$ 1513677 1581262 1653514 1729340 1808540 1891803 1978678 2066630 2153179 2237885 2320907 2400547
56177B400547P3230O4640N4791M3349L0581J8171O825m864j7733l0234m0719m9540
$$ 2400547 2473777 2538417 2593208 2636557 2667138 2685309 2692134 2687270 2669537 2639303 2598584 2549044
56165B549044n7424o3698o7765p0553p2914p4280p4330p4099p3841p1875o7295
$$ 2549044 2491620 2427922 2360157 2289604 2216690 2142410 2068080 1993981 1920140 1848265 1780970
56154A780970o1989n8035n4982n1557m8175m5627m3178m0187l7898l7277l6684
$$ 1780970 1718981 1660946 1605964 1554407 1506232 1460605 1417427 1377240 1339342 1302065 1265381
56143A265381l4020k9821k5921k2632j9547j7541j7301j7242j5505j2870j1142
$$ 1265381 1231361 1201540 1175619 1152987 1133440 1115899 1098598 1081356 1065851 1052981 1041839
56132A041839j0059q474p127p220p352n313k132r46k220l357l006k500k660k237
$$ 1041839 1031780 1023306 1016179 1008959 1001607 996294 994162 993216 990996 987639 984633 982133 979473 977236
56118I77236k87K228M043M935M989M225L328L262M039N067O435Q435J0269J0815
$$ 977236 976949 979177 983220 988155 993144 997369 1000697 1003959 1007998 1013065 1019500 1027935 1038204 1049019
56104A049019J0332R949R986J0269J1340J3640J6191J7769J8720K0006K1389K2281
$$ 1049019 1059351 1069300 1079286 1089555 1100895 1114535 1130726 1148495 1167215 1187221 1208610 1230891
56092A230891K3310K5162K6977K7957K9430L3067L8153M2849M7097N1966N7413
$$ 1230891 1254201 1279363 1306340 1334297 1363727 1396794 1434947 1477796 1524893 1576859 1634272
56081A634272O3155P0456Q0289R0972J00476J09640J19654J27707J29056J22993
$$ 1634272 1697427 1767883 1848172 1939144 2039620 2149260 2268914 2396621 2525677 2648670
56071B648670J13062J01747Q8911P5478O4565N7871N3785M9667M3591L4041K1032
$$ 2648670 2761732 2863479 2952390 3027868 3092433 3150304 3204089 3253756 3297347 3331388 3352420
56060C352420P588k710r692j5449k0191k3106k6775l6037n1648o9086q4448r7461
$$ 3352420 3360008 3357298 3347606 3332157 3311966 3288860 3262085 3226048 3174400 3105314 3020866 2923405
56048B923405j07632j12097j09699j03650r7500r1081q2716p2973o3810n5774
$$ 2923405 2815773 2703676 2593977 2490327 2392827 2301746 2219030 2146057 2082247 2026473
56038B026473m8185m0828l3984k7751k2387j8249j4950j1784r030p310n873l555
$$ 2026473 1978288 1937460 1903476 1875725 1853338 1835089 1820139 1808355 1799325 1792015 1786142 1782587
56026A782587j026K26R48L354P262R889R905Q951Q700R114J0074J2018J4379J5953
$$ 1782587 1781561 1781787 1782735 1786089 1793351 1803240 1813145 1822096 1830796 1839910 1849984 1862002 1876381 1892334
56012A892334J7281K0057K3861K6245K6484K6480K7477K8609K9202K9821L0702
$$ 1892334 1909615 1929672 1953533 1979778 2006262 2032742 2060219 2088828 2118030 2147851 2178553
56001B178553L1558L3127L6153L9004L9292L7751L7377L8815M0025M0310M1016
$$ 2178553 2210111 2243238 2279391 2318395 2357687 2395438 2432815 2471630 2511655 2551965 2592981
55990B592981M2126M2040M1023M1056M2061M2069M1432M2793M6550N0392N3615
$$ 2592981 2635107 2677147 2718170 2759226 2801287 2843356 2884788 2927581 2974131 3024523 3078138
55979C078138N7563O1585O3211O2986O4451O8519P2521P5531P9816Q5893R1140
$$ 3078138 3135701 3197286 3260497 3323483 3387934 3456453 3528974 3604505 3684321 3770214 3861354
55968C861354R4593R8463J03658J08386J12269J17142J22915J27616J32298J40533
$$ 3861354 3955947 4054410 4158068 4266454 4378723 4495865 4618780 4746396 4878694 5019227
55958E019227J52084J62559J70285J77851J86181J93333K00175K10419K23529
$$ 5019227 5171311 5333870 5504155 5682006 5868187 6061520 6261695 6472114 6695643
55949F695643K34567K42863K53741K69668K86953L03416L21710L42529L62385
$$ 6695643 6930210 7173073 7426814 7696482 7983435 8286851 8608561 8951090 9313475
55940I313475L81151M03855M31746M59660M85769N15428N51376N88677O23985
$$ 9313475 9694626 10098481 10530227 10989887 11475656 11991084 12542460 13131137 13755122
55931A3755122O61344P03742P47251P88803Q31876Q79368R28906R80162J038358
$$ 13755122 14416466 15120208 15867459 16656262 17488138 18367506 19296412 20276574 21314932
55922B1314932J105652J177747J253720J339497J436751J538981J644338J761246
$$ 21314932 22420584 23598331 24852051 26191548 27628299 29167280 30811618 32572864
55914C2572864J895191K041673K198964K375578K577919K803685L055404L346905
$$ 32572864 34468055 36509728 38708692 41084270 43662189 46465874 49521278 52868183
55906E2868183L688599M081560M534652N069913N699647O414945P207298Q082658
$$ 52868183 56556782 60638342 65172994 70242907 75942554 82357499 89564797 97647455
55898I7647455R044930J0091880J1244788J2560280J4100651J5920517J8086253
$$ 97647455 106692385 116784265 128029053 140589333 154689984 170610501 188696754
55891A88696754K0647392K3545506K6581913K9464568L1737513L2545570L0639416
$$ 188696754 209344146 232889652 259471565 288936133 320673646 353219216 383858632
55884C83858632K5014599J5827918M666160o236133j5156085k1446593k5291179
$$ 383858632 408873231 424701149 429367309 423131176 407975091 386528498 361237319
55877C61237319k7191651k7669921k7184146k6087298k4605778k2877058k1000296
$$ 361237319 334045668 306375747 279191601 253104303 228498525 205621467 184621171
55870A84621171j9050050j7083229j5164341j3368887j1748047j0308480r037795
$$ 184621171 165571121 148487892 133323551 119954664 108206617 97898137 88860342
55863H8860342p929880o975369o150969n435725m823491m307452l867375l483876
$$ 88860342 80930462 73955093 67804124 62368399 57544908 53237456 49370081 45886205
55855D5886205l151652k867481k618133k391278k186817k006779j844441j693391
$$ 45886205 42734553 39867072 37248939 34857661 32670844 30664065 28819624 27126233
55847B7126233j557454j441405j340009j245219j156660j076779j002928r32170
$$ 27126233 25568779 24127374 22787365 21542146 20385486 19308707 18305779 17373609
55839A7373609q67137q09896p56279p02868o53152o10437n71109n31096m92830
$$ 17373609 16506472 15696576 14940297 14237429 13584277 12973840 12402731 11871635 11378805
55830A1378805m59599m28990l97947l68620l43343l19291k93850k69778k49395
$$ 11378805 10919206 10490216 10092269 9723649 9380306 9061015 8767165 8497387 8247992
55821H247992k29011k04977j80532j61291j48592j42455j45727j59278j77441
$$ 8247992 8018981 7814004 7633472 7472181 7323589 7181134 7035407 6876129 6698688
55812F698688j93946k08602k23156k35109k41224k43148k43811k41885k35273
$$ 6698688 6504742 6296140 6072984 5837875 5596651 5353503 5109692 4867807 4632534
55803D632534k26513k18955k10742j98380j83679j71377j61936j52064j40745
$$ 4632534 4406021 4187066 3976324 3777944 3594265 3422888 3260952 3108888 2968143
55794B968143j29743j19529j09230r9539r1639q4470p6567o9241o4565o1793n8933
$$ 2968143 2838400 2718871 2609641 2510102 2418463 2333993 2257426 2188185 2123620 2061827 2002894
55783B002894n6063n3892n1017m6022m0494l6672l3868l0413k7422k7172k9235
$$ 2002894 1946831 1892939 1841922 1795900 1755406 1718734 1684866 1654453 1627031 1599859 1570624
55772A570624l1243l2162l2088l0508k7677k5994k7116k9118k9170k7416k5637
$$ 1570624 1539381 1507219 1475131 1444623 1416946 1390952 1363836 1334718 1305548 1278132 1252495
55761A252495k3917k1476j9120j8028j7436j6123j4720j4233j4024j3520j3903
$$ 1252495 1228578 1207102 1187982 1169954 1152518 1136395 1121675 1107442 1093418 1079898 1065995
55750A065995j5675j6610j4881j2180j0870j0180q218n776m831m899m164k774
$$ 1065995 1050320 1033710 1018829 1006649 995779 985599 977381 971605 966774 961875 957711 954937
55738I54937j866q72J040K175L79l205n597o261o879p806p946p467p577q147q242
$$ 954937 953071 952199 953239 955414 955793 952588 946991 940730 933851 926045 918099 910632 903055 894908 886666
55723H86666q516j0287j2839j4255j4516j5116j6067j5781j3716j0874p949n020
$$ 886666 878150 867863 855024 840769 826253 811137 795070 779289 765573 754699 746750 741730
55711G41730k631j276k79J004J591K27k484n024p009q583r050q193p568q326r103
$$ 741730 739099 737823 737544 738548 740139 740366 737882 732858 725849 717266 708216 700023 692455 684129 675026
55696F75026q409p684r160j1916j3082j2130j0980j0464r746q965r335j0476j0347
$$ 675026 666617 658933 649773 637857 624775 612645 601665 591201 581455 572490 563155 552679 542332
55683E42332q276n860m580m353m592m898m720l933l520m238n059m651l674l827
$$ 542332 534056 528196 523616 519263 514671 509773 505053 501120 497600 493362 488303 483652 479978 476151
55669D76151n106n906n452m416l597l553m806o825p670o376m644m400m836m011
$$ 476151 471045 465139 459687 455271 451674 448121 443315 436490 428820 422444 417800 413400 408564 404553
55655D04553k092o29L06J584K640K339J493J705K377J657j94j278j479k392m148
$$ 404553 402461 401832 402138 403722 406362 408701 410194 411899 414276 415933 415739 414461 412982 410590 406442
55640D06442n305n802o953q458q472o967n973o045n502l805k743l313m181m321
$$ 406442 401137 395335 388382 379924 371452 364485 358512 352467 346965 343160 340417 337104 332923 328602
55626C28602m615n546n655l786r96J011J881K003J554J073J502K747L513L147
$$ 328602 323987 318441 312786 309000 308004 309015 310896 312899 314453 315526 317028 319775 323288 326435
55612C26435K334J515J97j641k941l049k468j771j057p34j269j947j512k90Q3
$$ 326435 328769 330284 330481 328840 325899 322850 320382 318611 317554 316820 315551 313604 312092 311802 311885
55597C11885o99j059p4J374K394L117L386K443P12m8O95J369Q84K81O57J138L40
$$ 311885 311186 310127 310053 311427 313821 316938 320324 322767 323479 323431 324126 325495 326379 326660 327317 328455 328795
55580C28795j477l072l996m634n368o537q231r520q996o842n036m754m921m228
$$ 328795 327318 324246 320250 315616 310248 303711 295480 285960 276964 270122 265086 260332 255411 251183
55566B51183l136k689k538j719n71l78j396k448k418j444o09q41j989k864k388
$$ 251183 248047 245358 242820 241101 240530 240152 238756 236308 233890 232446 231837 230996 229007 226143 223755
55551B23755q22N45P20m29k440m222m171j693J477K726J467n13j575j751j654
$$ 223755 222933 223478 224198 223769 221329 217107 212936 211243 212720 215446 216913 216400 214825 213074 211420
55536B11420j380r93r18j330j936k598l261l264j917J89J613J889J792J742J298
$$ 211420 210040 209047 208129 206799 204863 202265 199004 195740 193823 194012 195625 197514 199306 201048 202346
55521B02346K88q67j989k978k926j076J322J922L66j213j142R9J458K742L776
$$ 202346 202634 201767 199778 196800 193874 192798 194120 196042 196408 195195 194053 194152 195610 198352 202128
55506B02128L887L075K272J852J229L42r2k04j104k796l841l678l433l680l465
$$ 202128 206015 209090 211362 213214 214443 214785 214693 214489 213385 210589 206748 203070 199637 195957 192492
55491A92492k467k033k824l355k283l82J079K147K927K475O81m80L92J685J093
$$ 192492 190025 187992 185168 181813 179530 179148 180227 182374 185301 187776 188457 187977 188369 190054 191147
55476A91147q83j934j443p02l12L49J248J367L68q62j528j604j322r83j066j705
$$ 191147 190264 188330 186887 186185 185873 186222 187470 188837 189205 188343 186815 185211 183889 182906 181840 180135
55460A80135k280k369k483l033l214k087k34Q09M37o73j663k144k187k340l118
$$ 180135 177855 175486 173003 169970 166756 164669 164435 165244 165681 165008 163345 161201 159014 156674 153556
55445A53556l906l247r78J011J159K87k3J5q78k481l073j906j49P66O88M65Q88
$$ 153556 149650 146403 145425 146436 147595 147882 147859 147874 146996 144515 141442 139536 139387 140153 140841 141306 142194
55428A42194J857K261J123p99j418M6J916K369J714J130M70j001k468k159J77
$$ 142194 144051 146312 147435 146636 145218 145264 147180 149549 151263 152393 152863 151862 149394 147235 147412
55413A47412K882M415M386K983O78j533k833l407l704l335j881k74L0r51j855
$$ 147412 150294 154709 159095 162078 162756 161223 158390 154983 151279 147944 146063 145789 145819 144868 143013
55398A43013j860j241l53O56J293J168P25N21R0j081k001j207Q70K240K082J518
$$ 143013 141153 139912 139559 140215 141508 142676 143401 143922 144012 142931 140930 139723 140593 142833 144915 146433
55382A46433J522J731J584J153M00r97k559l133k543j981k170k307j505j50P90
$$ 146433 147955 149686 151270 152423 152823 151826 149267 146134 143591 141610 139440 137133 135628 135478 136268
55367A36268J039R19P55Q70J467K095J948J131Q24J622K497K166R67N46J836L893
$$ 136268 137307 138226 138981 139851 141318 143413 145361 146492 147316 148938 151435 153601 154568 155114 156950 160843
55351A60843M907M021K024K60q42j793k746l061k457j734j624j670j120k84K4
$$ 160843 165750 169771 171795 172055 171213 169420 166674 163613 161156 159422 157798 156128 155008 154724 154748
55336A54748j28j36j44p59j787k411k462k376k108j358o15o58j086q04N7K45m57
$$ 154748 154620 154484 154340 153581 151794 149383 146921 144545 142437 141079 140464 139806 138720 137916 137973 138218 137761
55319A37761p07L17J663J957Q81r22k338k025L79L025L370J286p80j171p28o44
$$ 137761 137054 137371 139034 140991 141872 140950 138612 136587 136966 139991 143361 144647 143867 142696 141968 141324
55303A41324n39N9K20p81j730j082O10J554J253O18J41m59j024r74m00J9J13J76
$$ 141324 140785 140844 141064 140283 138553 137471 138081 139635 140888 141506 141647 141188 140164 139190 138790 138809 138922 139098
55285A39098J15k62m07K99J279J444R63R69J483J268O6n86L41J575J213o04j996
$$ 139098 139213 138951 138544 138843 140122 141566 142529 143498 144981 146249 146315 145729 146070 147645 148858 148254 146258
55268A46258j922j247j210j864k524k889l060k706j180J235K873K241k4j602j082
$$ 146258 144336 143089 141879 140015 137491 134602 131542 128836 127656 128891 131764 134005 133981 132379 131297
55253A31297N05J248P39J52L10P04N81J25Q9O85J387J582J166N96N58J318K200
$$ 131297 131802 133050 133789 133941 134251 134955 135536 135661 135750 136435 137822 139404 140570 141166 141724 143042 145242
55236A45242K047N50j106j405l42M68k38j772k355j311K19Q63O32N01P84P25k16
$$ 145242 147289 147839 146733 145328 144986 145454 145216 143444 141089 139778 139997 140860 141492 141993 142777 143502 143286
55219A43286j346j491n11M91N78J76M13J470K135J373j55q14j03P23M82k90j92
$$ 143286 141940 140449 139938 140429 141007 141183 141596 143066 145201 146574 146419 145605 145502 146225 146707 146417 146225
55202A46225R42J679Q04j151k485k076m05R54Q26m37j263n31J244K541K498J472
$$ 146225 147167 148846 149650 148499 146014 143938 143533 144487 145313 144876 143613 143082 144326 146867 149365 150837
55186A50837K72n36n55L89J761K420J744L38p92j420j973k480k312j148L28J066
$$ 150837 151109 150573 150018 150407 152168 154588 156332 156670 155878 154458 152485 150005 147693 146545 146873 147939
55170A47939Q21K65Jq5l50o41o48o96j533l122m293m052k766j573r67n68k3N31
$$ 147939 148760 149025 149026 148941 148591 147950 147302 146606 145073 141951 137658 133606 130840 129267 128300 127732 127709 128240
55152A28240R41J390K153L182L987L805K220j15j749j925j351r66m57R70K765
$$ 128240 129181 130571 132724 135906 139893 143698 145918 145803 144054 142129 140778 139812 139355 140325 143090
55137A43090L379K493J534J438J268r8j943k613j812p65l23j25K61N36M10L05
$$ 143090 146469 148962 150496 151934 153202 153104 151161 148548 146736 145971 145648 145523 145784 146320 146730 147035
55121A47035O54R58L49j071k107j826n49Q41J999K967L237K044j32j298j16K187
$$ 147035 147689 148647 148996 147925 145818 143992 143443 144284 146283 149250 152487 154531 154399 153101 152985 155172
55105A55172L039J449j207l165l875l368j561R89K553J861j20j201p55l38j244
$$ 155172 158211 159660 158453 155288 151413 148045 146484 147473 150026 151887 151767 150566 149811 149473 148229
55090A48229k484k071K57K572L122K266J576J664J675Q99j07m49k80m29r85j088
$$ 148229 145745 143674 143931 146503 149625 151891 153467 155131 156806 157705 157598 157149 156869 156440 155455 154367
55074A54367l14N72O22J3j67O30J609J420k72k201k773j881r83j060j249j69J933
$$ 154367 154053 154625 155247 155260 155093 155723 157332 158752 158480 156279 153506 151625 150642 149582 148333 148164 150097
55057A50097L337L047J677J25j379k507k397q60Q23J323R15Q26J369J815J857
$$ 150097 153434 156481 158158 158283 156904 154397 152000 151140 151963 153286 154201 155027 156396 158211 160068
55042A60068K066K659K780J639j26r08L3J571J937Q10l14j98L86j52j625k133
$$ 160068 162134 164793 167573 169212 169086 168178 168211 169782 171719 172529 172215 172017 172403 172251 170626 168493
55026A68493r49K24k68j611j972j285q99r91l61J105J739M92j360j822m85J465
$$ 168493 167544 167768 167500 165889 163917 162632 161733 160742 160381 161486 163225 163717 162357 160535 160050 161515
55010A61515K710K448N58k020l576l144j363O07K252L279K966J094j160k368k522
$$ 161515 164225 166673 167231 165211 161635 158491 157128 157735 159987 163266 166232 167326 166166 163798 161276
54995A61276k460k160j075K46M71m07r68o76o51j470j848p39O51N42o56r58K42
$$ 161276 158816 156656 155581 155827 156298 155891 154923 154247 153596 152126 150278 149539 150190 150732 150076 149118 149360
54978A49360J566J889J558J186O83J06J37R25J397N75j010j956j657o20L96R87
$$ 149360 150926 152815 154373 155559 156242 156348 156485 157410 158807 159382 158372 156416 154759 154139 154535 155522
54962A55522J028O81L56L36N71R99J678K289K049P32o09o68M87J497J426O94J80
$$ 155522 156550 157231 157587 157923 158494 159493 161171 163460 165509 166241 165632 164964 165451 166948 168374 169068 169248
54945A69248l9o16j836k958k836j133J160K583K574J831J364J416J440P66p95
$$ 169248 169209 168593 166757 163799 160963 159830 160990 163573 166147 167978 169342 170758 172198 172964 172169
54930A72169k739m010l635j485J563M197N229M038J198j385j892m28J183J560
$$ 172169 169430 165420 161785 160300 161863 166060 171289 175327 176525 175140 173248 172820 174003 175563
54916A75563R00j37j293j874n88K469M756L980J251j86Q13K145J688j7r64k74
$$ 175563 176463 176326 175033 173159 172571 175040 179796 183776 185027 184841 185654 187799 189487 189470 188506 188232
54900A88232J280K371K075M38j224j249M97K095J610o35k387k041m31J91j101
$$ 188232 189512 191883 193958 194396 193172 191923 192420 194515 196125 195490 193103 191062 190631 190822 189721
54885A89721k629k133J88J741J018m01m10M61K90p80p28Q60K049J762J319J897
$$ 189721 187092 184959 185147 186888 187906 187505 187095 187556 187846 187066 186338 187198 189247 191009 192328 194225
54869A94225K652K701K873L916M730M341M045N389P241P314N822N158O241P731
$$ 194225 196877 199578 202451 206367 211097 215438 219483 224872 232113 239427 245249 250407 256648 264379
54855B64379Q701R559R873P990L915K90r69j255k886n520o905o314n264n091n517
$$ 264379 273080 282639 292512 300502 304417 304707 303738 302483 299597 294077 287172 280858 275594 270503 264986
54840B64986n850o093o412o484n903m701l112j406k12l18j755l426m023l142j232
$$ 264986 259136 253043 246631 240147 234244 229543 226431 225025 224813 224495 222740 219314 215291 212149 210917
54825B10917J070L149M366M514M235M342M640M142K783K182L895P217R638R493
$$ 210917 211987 215136 219502 224016 228251 232593 237233 241375 244158 246340 250235 257452 267090 276583
54811B76583P424N055L204J844R29K86q85l264o145p940q101p702p706p584o429
$$ 276583 284007 289062 292266 294110 295039 295325 294440 291176 285031 277091 268990 261288 253582 245998 239569
54796B39569m715l846m163m475l804k721k429l069l599l112j800o85p57k133l774
$$ 239569 234854 231008 226845 222370 218566 215845 213416 210347 206748 203636 201836 201151 200394 198261 194487
54781A94487m253l192j736j183j427j362n04N44J160J285R37J09o32m49M61Q31
$$ 194487 190234 187042 185306 184123 182696 181334 180830 181374 182534 183819 184756 184865 184233 183784 184245 185076
54765A85076J39o29o24l85n43m61M48J112J83j600k244j409n64l21L15J705K548
$$ 185076 185215 184586 183962 183577 183034 182573 183021 184133 184316 182716 180472 179063 178499 178178 178493 180198 182746
54748A82746J937Q73O91J236J562J366Q18l2p75n17P88J753J189l46j497j765
$$ 182746 184683 185556 186247 187483 189045 190411 191229 191197 190422 189905 190693 192446 193635 193289 191792 190027
54732A90027j433o32L94Q19Q3j151j743j265O4J945L795M814M982N060N028L839
$$ 190027 188594 187962 188356 189175 189258 188107 186364 185099 185163 187108 190903 195717 200699 205759 210787 214626
54716B14626J673P25K169L895L395J618J446L191M533M586N038O816Q554R197
$$ 214626 216299 217024 219193 223088 226483 228101 229547 232738 237271 241857 246895 253711 262265 271462
54702B71462R516R905R113O630M226L283K498J37k919m495m444m514n577o977
$$ 271462 280978 290883 299996 306626 310852 314135 316633 316770 313851 309356 304912 300398 294821 287844
54688B87844q107q777q310o171l432j899j746j617j076j111j947k222j214k49
$$ 287844 279737 270960 262650 256479 253047 251148 249402 247785 246709 245598 243651 241429 240215 239966
54674B39966p70k147k615j516M93K696M598N480N048M304M559N555N679M283K748
$$ 239966 239196 237049 234434 232918 233411 236107 240705 246185 251233 255537 260096 265651 271330 275613 278361
54659B78361K807M545O561P416O481L976Q41j776l510m931o325o921o069m650
$$ 278361 281168 285713 292274 299690 306171 310147 310988 309212 305702 300771 294446 287525 281456 276806
54645B76806m181m756n035m395l790m036m411l901k909k630l185l524l051k435
$$ 276806 272625 267869 262834 258439 254649 250613 246202 242301 239392 236762 233577 230053 227002 224567
54631B24567k580l507m351m083k370j34R42N8j660k334j348L31J505J619N55j330
$$ 224567 221987 218480 214129 210046 207676 207542 208484 208542 206882 204548 203200 203531 205036 206655 207210 205880
54615B05880k902l070k110j305j085o27L55Q04Q8o58k05O96L92j028j785j041
$$ 205880 202978 199908 197798 196493 195408 194781 195136 195940 196028 195370 195165 195861 196253 195225 193440 192399
54599A92399M3K18k67p03j296k533l926m418l678k094Q7K553M170L816K175J330
$$ 192399 192442 192660 192393 191690 190394 187861 183935 179517 175839 173745 173832 176385 180555 184371 186546 187876
54583A87876J965K299Q98p26m4K551L934K636R06J245K687K381j49k427k548j275
$$ 187876 189841 192140 193038 192312 192268 194819 198753 201389 202295 203540 206227 208608 208459 206032 203484 202209
54567B02209k28L10Q37J125M81r48k145k272j285K89J645K046J386L56k70k96
$$ 202209 201981 202291 203128 204253 204734 203786 201641 199369 198084 198373 200018 202064 203450 203806 203536 203240
54551B03240J08Q38J642K024J790J418J240P32n92j879j607K45J773J380k85j279
$$ 203240 203348 204186 205828 207852 209642 211060 212300 213032 212440 210561 208954 209199 210972 212352 212067 210788
54535B10788p05O40J598J761J262L42n23o79N0J026J490J342R47M76p2l69J07
$$ 210788 210083 210723 212321 214082 215344 215686 215163 214484 214534 215560 217050 218392 219339 219815 219743 219374 219481
54518B19481J348K578K927K104M47j288k175j616J07J979L132L326K646J325K1
$$ 219481 220829 223407 226334 228438 228885 227597 225422 223806 223913 225892 229024 232350 234996 236321 236342
54503B36342l60L02R73P12J3J47J259J987J100r83k724l145k508j446L2K230M597
$$ 236342 235982 236284 237257 237969 237982 238129 239388 241375 242475 241492 238768 235623 233115 231669 231701 233931 238528
54486B38528N585M290J947R21J971L317K931J084j62L58J667K045R27q91k337
$$ 238528 244113 248403 250350 251271 253242 256559 259490 260574 260412 260770 262437 264482 265409 264518 262181
54471B62181k930k742j949p25N23J203J255J391K003K170Q34j161j702m98J56
$$ 262181 259251 256509 254560 253835 254358 255561 256816 258207 260210 262380 263214 262053 260351 259853 260009
54456B60009j249k820j834J219L214K572O73q26j840k507k086l37J426J852J216
$$ 260009 258760 255940 254106 255325 258539 261111 261784 260958 259118 256611 254525 254188 255614 257466 258682
54441B58682O47N49O74R55J313J207K73q94j254m17J155K593L079K419J476J380
$$ 258682 259329 259878 260552 261507 262820 264027 264300 263406 262152 261735 262890 265483 268562 270981 272457 273837
54425B73837K086K464K030J523J407J097L95M56K153M423N458M885L715K764K335
$$ 273837 275923 278387 280417 281940 283347 284444 284839 285295 287448 291871 297329 302214 305929 308693 311028
54410C11028K825M242N488N398M339L615L441K823J338j87r19q72m11J13J27o90
$$ 311028 313853 318095 323583 328981 333320 336935 340376 343199 344537 344350 343431 342559 342148 342261 342388 341698
54394C41698j568j309K7J072R36J6j111k423l667m100l684l535m354n274n079
$$ 341698 340130 338821 338848 339920 340856 340872 339761 337338 333671 329571 325887 322352 317998 312724 307645
54379C07645l869k609j694r11k84Q6O09J584K261J638J68n94k64l23j919l967
$$ 307645 303776 301167 299473 298562 298278 298364 298973 300557 302818 304456 304624 304030 303766 303443 301524 297557
54363B97557m497l278j911j426j038K16J683J927R33K28P24J406Q48p47j900j829
$$ 297557 293060 289782 287871 286445 285407 285623 287306 289233 290166 290394 291118 292524 293372 292625 290725 288896
54347B88896j148n36K34J522K863L406K878J597j16j838k647j705N43K385K530
$$ 288896 287748 287212 287446 288968 291831 295237 298115 299712 299596 297758 295111 293406 293949 296334 298864
54332B98864J461O76Q04R93K48j091j714j114l91q12j875j704L80K520K440M30
$$ 298864 300325 301001 301805 302798 303046 301955 300241 299127 298736 297924 296049 294345 294725 297245 299685 300115
54316C00115r81l26J159J679J363J483K090K061J230P81J285J756J284L44k75
$$ 300115 299134 298808 299967 301646 303009 304492 306582 308643 309873 310654 311939 313695 314979 315323 315048
54301C15048q17j730k373j750p6J443K178K382K296J954J717J834J635J81k127
$$ 315048 314231 312501 310128 308378 308302 309745 311923 314305 316601 318555 320272 322106 323741 323922 321795
54286C21795l707l716k850k107j742j747k244k931l041k448k028k462l399m210
$$ 321795 318088 314372 311522 309415 307673 305926 303682 300751 297710 295262 293234 290772 287373 283163
54272B83163m738m832m062k519j066k15M52J097R91n8p11J42J426J196n32j827
$$ 283163 278425 273593 269531 267012 265946 265731 266183 267280 268271 268213 267502 267644 269070 270266 269734 267907
54256B67907j602q03o25r18r30n83l38l79n26n67l82o6n8p03j616j988j629j175
$$ 267907 266305 265502 264877 263959 263029 262446 262108 261729 261203 260636 260254 260188 260130 259427 257811 255823 254194 253019
54238B53019j072r67m22K66M15j32p94q72j92P77J255P87l91j597k248k157j463
$$ 253019 251947 250980 250558 250824 251239 251107 250313 249441 249249 250026 251281 252068 251677 250080 247832 245675 244212
54221B44212n65L1R6j03j16K59R59J735K022J146q19k595k778j443j53k18j209
$$ 244212 243647 243678 243774 243671 243555 243814 244773 246508 248530 249676 248857 246262 243484 242041 241888 241670 240461
54204B40461j472K6K402L535K192n71k464k400j239j5J456L444M793L967J425
$$ 240461 238989 239015 241417 244952 247144 246573 244109 241709 240470 240455 241911 245355 250148 254115 255540
54189B55540n39n55L29L65p34k032k936l480l489k530r34Mn68j812j994o18Q15
$$ 255540 255001 254446 254775 255140 254406 252374 249438 245958 242469 239939 239005 239009 238441 236629 234635 234017 234832
54172B34832N27j400l183l285j608R85L337M151K736J57j313o42Q03J183M36k54
$$ 234832 235359 233959 230776 227491 225883 226868 230205 234356 237092 237249 235936 235294 236097 237280 237716 237462
54156B37462l23K4Q00J991K667J778k12j719k021j746j470j068m89o0J38J54m64
$$ 237462 237139 237163 237963 239954 242621 244399 244187 242468 240447 238701 237231 236163 235674 235614 235752 235906 235442
54139B35442j968l203k647p49L92K6k86O12J713J761J307J386J502N90r51j871
$$ 235442 233474 230271 227624 226875 227267 227293 227007 227619 229332 231093 232400 233786 235288 235878 234927 233056
54123B33056k086k372k458j163J515L947M868M634M071L170J529n45k075k380
$$ 233056 230970 228598 226140 224977 226492 230439 235307 239941 244012 247182 248711 248166 246091 243711
54109B43711j764j227j465k099k146j304l86j44k98k23m8k47n67l23L33L78o83
$$ 243711 241947 240720 239255 237156 235010 233706 233320 233176 232878 232655 232607 232360 231793 231470 231803 232181 231498
54092B31498k110k765k166o90O92R55p0j293j496q53n65r12o47J096L196L694
$$ 231498 229388 226623 224457 223767 224459 225414 225344 224051 222555 221702 221137 220225 219578 220674 223870 227564
54076B27564K229M73J09J084K078K184J701J397J493J589J332Q30L32q1l36k12
$$ 227564 229793 230266 230375 231459 233537 235721 237422 238819 240312 241901 243233 244063 244395 244314 243978 243766
54060B43766K93O68M07k37l60N39J988L080L256K420O96j483l139l196j429J132
$$ 243766 244059 244727 245134 244897 244537 245076 247064 250144 253400 255820 256516 255033 251894 248698 247269 248401
54044B48401K917K977J471o70k410l095k645j377L80K302L681L519J696l10p44
$$ 248401 251318 254295 255766 255096 252686 249591 246946 245569 245949 248251 251932 255451 257147 256837 256093
54029B56093L41J303J367J501K234K189K86j753j265J420L193K537J398J932L414
$$ 256093 256434 257737 259104 260605 262839 265028 265314 263561 262296 263716 266909 269446 270844 272776 276190
54014B76190L846K987K119J856J977K735M416N956N737L935K602L046M346M829
$$ 276190 280036 283023 285142 286998 288975 291710 296126 302082 307819 311754 314356 317402 321748 326577
54000C26577L931K201L94q65j204q81o46q72j120q20J2Q34J050M71k89J9J979
$$ 326577 330508 332709 333103 332238 331034 330153 329507 328635 327515 326695 326707 327541 328591 329062 328773 328792 330771
53983C30771M432N484M797M059M812O582P761P738P362P617Q547R533J0079J0163
$$ 330771 335203 340687 345484 349543 354355 360937 368698 376436 383798 391415 399962 409495 419574 429737
53969D29737R994R601Q687P013M970L437K944L153L395L479L744M345M782M269
$$ 429737 439731 449332 458019 465032 470002 473439 476383 479536 482931 486410 490154 494499 499281 503550
53955E03550K534J53j935l220l817l970l678k963k201j919k442l882o088q359
$$ 503550 506084 506237 504302 501082 497265 493295 489617 486654 484453 482534 480092 476210 470122 461763
53941D61763r638r468q529p732p179o488n717n180m669l840l079l024l288k845
$$ 461763 452125 442657 434128 426396 419217 412729 407012 401832 397163 393323 390244 387220 383932 381087
53927C81087j668q21o62l66L17L07r64k299k532k440l393m917n262m017k450j363
$$ 381087 379419 378598 377936 377570 377887 378194 377230 374931 372399 369959 366566 361649 356387 352370 349920 348557
53911C48557k77R43J216k26k438l715l388k069p36J6J71K21O51J347J799J874
$$ 348557 348280 349223 350439 350213 347775 344060 340672 338603 337867 337883 338054 338275 338926 340273 342072 343946
53895C43946J932K288L055M353N888O563N655M243M169N425O178N821O049P915
$$ 343946 345878 348166 351221 355574 361462 368025 373680 377923 382092 387517 393695 399516 405565 413480
53881D13480R632R108P220O469P317Q212Q646R620J0971J0871Q766O667O380P207
$$ 413480 423112 432220 439440 445909 453226 461438 470084 479704 490675 501546 510312 516979 523359 530566
53867E30566P652P774Q393R195R346R204R871J1425J2960J4076J5145J6345J7329
$$ 530566 538218 545992 554385 563580 572926 582130 592001 603426 616386 630462 645607 661952 679281
53854F79281J7695J6915J4370J0405O845N261M993M139K216N65J09J68k70j333
$$ 679281 696976 713891 728261 738666 745511 750772 755765 759904 762120 762685 762794 762962 762692 761359
53840G61359k674m120n370n950n860n774o237p174q249r143r601r793j0452j1782
$$ 761359 758685 754565 749195 743245 737385 731611 725374 718200 709951 700808 691207 681414 670962 659180
53826F59180j2655j2064j1097j1804j3952j4795j2723r487p700p657p940q063
$$ 659180 646525 634461 623364 611560 597608 582813 570090 560603 552903 545246 537306 529243
53814E29243q826j0519j2228j2783j1621q990o141m810n569o972p145n858m335
$$ 529243 520417 509898 497670 484887 473266 464276 458135 453325 447756 440784 433639 427781 423446
53801D23446l474l198l122l012k752k612l120m053m252l296k486l019l977l667
$$ 423446 419972 416774 413652 410640 407888 405276 402156 398103 393851 390555 388069 385050 381073 377406
53787C77406k288j494j687j778j510j838k602k092R2J858J524J71n16j023k589
$$ 377406 375118 373624 371937 370159 368649 366811 364209 362117 362209 364067 365591 365762 365246 364223 361634
53772C61634m244l835j609k53j113k546k733k100j809j451J9K126L374L458L378
$$ 361634 357390 353555 351946 351693 350580 348034 345301 343201 341392 339941 339960 342086 345460 348918 352296
53757C52296L420K775J509J215K707M352M057K200J107J996L892N578O866P586
$$ 352296 355716 358491 360000 361215 363922 368274 372331 374531 375638 377634 381526 387104 393970 401556
53743D01556P008N443N067P453J0913J2069J0023P373O751P853Q625Q129P009
$$ 401556 408564 414007 419074 426527 437440 449509 459532 466905 473656 481509 490134 498263 505272
53730E05272N899M795L908L842M403M128J828j663m020l884k300j403k048l202
$$ 505272 511171 515966 519874 523716 528119 532247 534075 532412 528392 524508 522208 520805 518757 515555
53716E15555l595l220k985l391m152m896n609o392p207q039q846r228q520o719
$$ 515555 511960 508740 505755 502364 498212 493316 487707 481315 474108 466069 457223 447995 439475 432756
53702D32756n029m885o220p229o354m181k674k519k377j295o62k278n087n865
$$ 432756 427727 422842 416622 409393 403039 398858 396184 393665 391288 389993 389331 387053 381966 376101
53688C76101l435l49N22o32j949l007m478n553m383j170J418J696R85J212K010
$$ 376101 372666 372317 372839 372207 370258 367251 362773 357220 352837 351667 353085 354781 355766 356978 358988
53673C58988J671p0j762k306j975j356m61P78J869K122J503Q11R03J633J846P38
$$ 358988 360659 360589 358827 356521 354546 353190 352729 353507 355376 357498 359001 359812 360715 362348 364194 364932
53657C64932q73j283N5J924L013L331L429L058J728J17j86J353L379M102L178
$$ 364932 364059 362776 362831 364755 367768 371099 374528 377586 379314 379431 379245 380598 383977 388079 391257
53642C91257J830J441K254L330L612L034K506K803L737M572M965N106N080M613
$$ 391257 393087 394528 396782 400112 403724 406758 409264 412067 415804 420376 425341 430447 435527 440140
53628D40140L571K229R90P2l83j86O07J369J280J24j390k349k590k722l116l273
$$ 440140 443711 445940 446930 447002 446619 446433 447040 448409 449689 449813 448423 446074 443484 440762 437646 434373
53612D34373k510r94M53J494K519L528L599K104M0p38L41J860K077P74q99k000
$$ 434373 431863 430869 431322 432816 435335 438863 442462 444566 444606 443868 444209 446069 448146 448920 448021 446021
53596D46021k549k835k713j994j166r66j253r46M63J912J923M98q66j043l67K92
$$ 446021 443472 440637 437924 435930 434764 433798 432545 431599 432062 433974 435897 436395 435529 434486 434119 434411
53580D34411O78R23Q94N68N28J245K099K067J325J181K114K910K327R13K64R47
$$ 434411 435089 436012 436906 437474 438002 439247 441346 443413 444738 445919 448033 450943 453270 454183 454447 455394
53564D55394K050K683K921L172L442L665M011M447M575M461M992O596Q121P990
$$ 455394 457444 460127 463048 466220 469662 473327 477338 481785 486360 490821 495813 502409 510530 518520
53550E18520O381N096N279O231O826O919O744N969M376K822K368K711K616J829
$$ 518520 524901 529997 535276 541507 548333 555252 561996 567965 572341 575163 577531 580242 582858 584687
53536E84687J401J903K337J345j096l709n233n230l987k125k62J271K363K758
$$ 584687 586088 587991 590328 591673 590577 586868 581635 576405 572418 570293 570031 571302 573665 576423
53522E76423J986o3k555m062l644j659M38J258N16r24j952k004j138K79J695K505
$$ 576423 578409 578346 575791 571729 568085 566426 566864 568122 568638 567714 565762 563758 562620 562899 564594 567099
53506E67099K415J639P16L00J037K976M962N314L685J581M72J14l09k08J758N158
$$ 567099 569514 571153 571869 572169 573206 576182 581144 586458 590143 591724 592196 592310 592001 591793 593551 598709
53490E98709P597P485N824M552M212M090L947M412N861P653Q779Q972R021R920
$$ 598709 606306 613791 619615 624167 628379 632469 636416 640828 646689 654342 663121 672093 681114 691034
53476F91034J1609J2821J2531J1383J1087J2510J5005J7513J9481K0622K0732
$$ 691034 702643 715464 727995 739378 750465 762975 777980 795493 814974 835596 856328
53465H56328K0176J9848K0217K0998K1975K3343K4867K5708K5731K6174K8169
$$ 856328 876504 896352 916569 937567 959542 982885 1007752 1033460 1059191 1085365 1113534
53454A113534L1100L3331L4138L4209L4548L5626L7319L8981L9767L9439L8703
$$ 1113534 1144634 1177965 1212103 1246312 1280860 1316486 1353805 1392786 1432553 1471992 1510695
53443A510695L8291L8052L7568L7145L7353L7863L7765L7072L6860L7603L8142
$$ 1510695 1548986 1587038 1624606 1661751 1699104 1736967 1774732 1811804 1848664 1886267 1924409
53432A924409L6968L4156L1446L0427L1012L1775L1557L0413K9019K7606K5969
$$ 1924409 1961377 1995533 2026979 2057406 2088418 2120193 2151750 2182163 2211182 2238788 2264757
53421B264757K4246K2966K2112K0932J8963J6696J4815J3203J1218Q612N661K696
$$ 2264757 2289003 2311969 2334081 2355013 2373976 2390672 2405487 2418690 2429908 2438520 2444181 2446877
53409B446877j42k902n951r729j4052j7910k0379k1464k1879k2429k3864k6683
$$ 2446877 2446735 2443833 2437882 2428153 2414101 2396191 2375812 2354348 2332469 2310040 2286176 2259493
53397B259493l0473l3785l5289l4939l3751l2830l2699l3050l2848l1413k9665
$$ 2259493 2229020 2195235 2159946 2125007 2091256 2058426 2025727 1992677 1959829 1928416 1898751
53386A898751k9394l0785l1730l0384k7382k4531k2350k0251j8255j6809j5272
$$ 1898751 1869357 1838572 1806842 1776458 1749076 1724545 1702195 1681944 1663689 1646880 1631608
53375A631608j2408q372m690k183k89J529L179N031Q020J2140J6056J8942K1432
$$ 1631608 1619200 1610828 1606138 1603955 1603666 1605195 1608374 1613405 1621425 1633565 1649621 1668563 1689995
53362A689995K4172K6554K7842K8624L0132L2650L5400L7752L9953M2849M7067
$$ 1689995 1714167 1740721 1768563 1797187 1827319 1859969 1895369 1933121 1973074 2015923 2062990
53351B062990N2189N6667N9191O0165O1132O2835O4825O6939O9781P3282P6279
$$ 2062990 2115179 2171846 2231037 2291202 2352334 2415169 2479994 2546933 2616714 2689996 2766275
53340B766275P8229Q0115Q2740Q5365Q7107Q8532R0402R1869R1576Q9951Q8658
$$ 2766275 2844504 2924619 3007359 3092724 3179831 3268363 3358765 3450634 3542210 3632161 3720819
53329C720819Q8073Q6956Q4645Q1931P9508P6972P3828P0282O6530O2231N7199
$$ 3720819 3808892 3895848 3980493 4062424 4141932 4218904 4292732 4363014 4429544 4491775 4548974
53318D548974N1768M6004L9447L2202K5334J9575J4271Q326J520n918j4348k4277
$$ 4548974 4600742 4646746 4686193 4718395 4743729 4763304 4777575 4785901 4787421 4781503 4767155 4742878
53306D742878l5077m5194n3739o1220o8493p5659q2183q7606r1718r4384r5589
$$ 4742878 4707801 4662607 4608868 4547648 4479155 4403496 4321313 4233707 4141989 4047605 3952016
53295C952016r5635r5033r4190r3302r2548r2177r2274r2381r1563q9073q5202
$$ 3952016 3856381 3761348 3667158 3573856 3481308 3389131 3296857 3204476 3112913 3023840 2938638
53284B938638q1303p8813p8016p7702p6131p2543o7846o3679o0633n7630n3364
$$ 2938638 2857335 2778522 2700506 2622804 2546673 2474130 2406284 2342605 2281972 2224342 2170978
53273B170978m8095m3491m0629l8827l6690l3648k9950k5769k1311j7565j5868
$$ 2170978 2122883 2079392 2038763 1999936 1963246 1929598 1899648 1873879 1852568 1835003 1819135
53262A819135j6337j7474j7653j6404j3886r975m805K70L469M525N081O771R515
$$ 1819135 1802798 1785324 1767671 1751267 1737381 1727406 1722601 1722871 1726340 1730865 1735946 1742717 1752232
53249A752232J2128J4021J5722J7926K0675K3495K5877K7437K8052K8202K8905
$$ 1752232 1764360 1778381 1794103 1812029 1832704 1856199 1882076 1909513 1937565 1965767 1994672
53238A994672L0809L3385L5399L6468L7662M0126M3354M5533M5614M4258M2532
$$ 1994672 2025481 2058866 2094265 2130733 2168395 2208521 2251875 2297408 2343022 2387280 2429812
53227B429812M0532L8005L5618L4313L3550L1449K7177K2204J8528J6225J3626
$$ 2429812 2470344 2508349 2543967 2578280 2611830 2643279 2670456 2692660 2711188 2727413 2741039
53216B741039R548M521j82m011p245j0293j3381j6815k0942k5646l0174l3915
$$ 2741039 2750587 2755108 2754926 2750915 2743670 2733377 2719996 2703181 2682239 2656593 2626419 2592504
53204B592504l7110m0400m3729m6423m8464n0881n4201n7222n8272n7354n6076
$$ 2592504 2555394 2514994 2471265 2424842 2376378 2325497 2271296 2214074 2155802 2098448 2042372
53193B042372n5518n5199n4248n2696n1265n0615n0915n1556n1221m9196m6689
$$ 2042372 1986854 1931655 1877407 1824711 1773446 1722831 1671916 1620360 1569139 1519943 1473254
53182A473254m5745m6574m7125m5800m3322m1171l9502l7700l5857l4285l2427
$$ 1473254 1427509 1380935 1333810 1288010 1244688 1203517 1164015 1126315 1090458 1056173 1023746
53171A023746k9709k6919k5243k4269k2510j9721j7269j6126j5807j5483j4988
$$ 1023746 994037 967118 941875 917606 895096 875375 858106 841980 826173 810690 795702
53160G95702j4489j4161j4336j5029j5366j4562j3375j3305j4225j4348j2903
$$ 795702 781213 767052 752716 737687 722321 707759 694384 681079 666854 652506 639603
53149F39603j1215j0505j0109r016p823p781q630q921q150p366p634q837j0061
$$ 639603 628388 617883 607774 598758 590935 583154 574524 565603 557453 550087 542453 533616 523555
53136E23555j0428r585p934o456n833n755n437m698m061l906l926l553k678j891
$$ 523555 513127 503542 495608 489152 483319 477564 472127 467429 463368 459462 455536 451983 449305 447414
53122D47414k005l172m557n184n070m996n146m652k922p75L98J39q31j683k131
$$ 447414 445409 442237 437680 432496 427426 422430 417284 412632 409710 408935 409333 409472 408641 406958 404827
53107D04827k287k352k486k618k465j905j147l55N17J183Q67p68k745l569k850
$$ 404827 402540 400188 397702 395084 392619 390714 389567 389212 389729 390912 391779 391011 388266 384697 381847
53092C81847j638j093j415k110k763l122k849j679O6J463J763J166O37R07J797
$$ 381847 380209 379116 377701 375591 372828 369706 366857 365178 365244 366707 368470 369636 370273 371180 372977
53077C72977K542K513J493k53j812j867%K370L079J543o53j688j413r42r17q71
$$ 372977 375519 378032 379525 379272 377460 375593 375593 377963 381042 382585 381932 380244 378831 377889 376972 376101
53061C76101pJ758L525L987K637N45n33r5N14j57j828k990k844k037j534j510
$$ 376101 376094 377852 381377 385364 388001 388546 388013 387918 388432 388275 386447 383457 380613 378576 377042 375532
53045C75532j512j198n71L04J345K174K056M94k029m193m925m238k964j918j524
$$ 375532 374020 372822 372251 372555 373900 376074 378130 378624 376595 372402 367477 363239 360275 358357 356833
53030C56833j735j871j103L03Q15m46k103k078m05R51R90P10R90J215P73K67K13
$$ 356833 355098 353227 352124 352427 353242 352796 350693 348615 348210 349161 350151 350861 351851 353066 353839 354106 354319
53013C54319Mo66p38L51J023l09k487k956j414J23N80R60J781J661n83l914o218
$$ 354319 354323 353657 352919 353270 354293 353984 351497 348541 347127 347250 347830 348790 350571 352232 351649 347735 341517
52996C41517o509n107k615K20K249K619J659N74K68O06O77k51j674k028n13J558
$$ 341517 335008 329901 327286 327506 329755 332374 334033 334607 334875 335481 336158 335907 334233 332205 331692 333250
52980C33250K073P50o44p51j29M5m35j084j573j692j321j040j750l075l205j326
$$ 333250 335323 336073 335429 334678 334549 334594 334159 333075 331502 329810 328489 327449 325699 322624 319419 318093
52964C18093R06J488P01K64O45R13P77R61J572J771J360J133J248P95m46j331
$$ 318093 318999 320487 321188 321452 322097 323010 323787 324748 326320 328091 329451 330584 331832 332627 332181 330850
52948C30850j243j225k112k761j619P18K183K071J652K003K724K966K522J510
$$ 330850 329607 328382 326270 323509 321890 322608 324791 326862 328514 330517 333241 336207 338729 340239
52934C40239K3j466k277k462k689k922k289p94K21J21L85K412M832M808J878j268
$$ 340239 340262 338796 336519 334057 331368 328446 326157 325363 325584 325705 326090 328502 333334 338142 340020 338752
52918C38752k229j463o54L8J587L614M128K132o36j457K69K515L093J941O25K42
$$ 338752 336523 335060 334406 334444 336031 339645 343773 345905 345269 343812 344081 346596 349689 351630 352255 352497
52902C52497N56Q93R22M47p08k149k944k762k357k444k672k374j627q38M0Q86
$$ 352497 353053 353946 354868 355315 354607 352458 349514 346752 344395 341951 339279 336905 335278 334440 334480 335366
52886C35366P96o46k034j683k32K9j578l327l887l908m125l742k034n9P23M64
$$ 335366 336162 335516 333482 331799 331567 331596 330018 326691 322804 318896 314771 311029 308995 308936 309659 310123
52870C10123J96M3l96o53j1R87J131M22p0K6O0k98o50p86q02m14O23J483J011
$$ 310123 310319 310362 309966 309313 309302 310289 311420 311842 311772 311798 311858 311560 310910 310124 309322 308908 309531 311014 312025
52851C12025l50q19L21J881K732L106L261K398J12k206k803j852r47p64n27J77
$$ 312025 311675 310856 311177 313058 315790 318896 322157 324555 324667 322461 319658 317806 316859 316095 315568 315745
52835C15745N36r1j010j170o46k92k71J49J288K400K711K475K366K301J655N01
$$ 315745 316281 316190 315180 314010 313364 313072 312801 312950 314238 316638 319349 321824 324190 326491 328146 328647
52819C28647k75j94K21L51K73K18M5k76k38M45J204J384J321J881L130M125L893
$$ 328647 328372 328178 328399 328750 329023 329241 329286 329010 328772 329217 330421 331805 333126 335007 338137 342262 346155
52802C46155K202l39k472l007j987q02n74q73p27k90m67j238j601j229j001j626
$$ 346155 348357 348018 345546 342539 340552 339750 339176 338303 337576 337286 336819 335581 333980 332751 331750 330124
52786C30124k667l248l052k333j458o87k3O98J170M69j670l805m049k388o35L3
$$ 330124 327457 324209 321157 318824 317366 316679 316656 317354 318524 318993 317323 313518 309469 307081 306446 306479
52770C06479K84J109K199K548J865P06k98q61j037j179j583k034k152k052k022
$$ 306479 306763 307872 310071 312619 314484 315190 314892 314031 312994 311815 310232 308198 306046 303994 301972
52755C01972j741p34M45P14L05P59K528L983L701K573K333K900K663J084n57j112
$$ 301972 300231 299497 299942 300656 300961 301720 304248 308231 311932 314505 316838 319738 322401 323485 322928 321816
52739C21816j010j267j918k131j591j020j231k035k472k061j260n49K12J002R56
$$ 321816 320806 319539 317621 315490 313899 312879 311648 309613 307141 305080 303820 303271 303483 304485 305441
52724C05441l52j548q80J060J736K62j186m94J343J773K57j359j509m03R52J843
$$ 305441 305089 303541 302661 303721 305457 305719 304533 304039 305382 307155 307412 306053 304544 304141 305093 306936
52708C06936J897J167L77K20L33j94j272j751j043N6N26L01q3l73o10p07n60l46
$$ 306936 308833 310000 310377 310597 310930 310736 309464 307713 306670 306726 307252 307553 307470 307097 306487 305780 305220 304874
52690C04874k82k30J31P66J187R50K05l51j25P64J539J584J087Q11J216J922K061
$$ 304874 304592 304362 304493 305259 306446 307396 307601 307250 307125 307889 309428 311012 312099 312910 314126 316048 318109
52673C18109J218J0m69J42J007J105M67j0K12Q12J299J583J655J273K64j204k808
$$ 318109 319327 319337 318868 319010 320017 321122 321589 321579 321791 322603 323902 325485 327140 328413 328677 327473 324665
52656C24665m153m654l851k026r4J222J683J152k82j700j907r50j05J10Q23K818
$$ 324665 320512 315858 312007 309981 309887 311109 312792 313944 313662 311962 310055 309105 309000 309110 309933 312751
52640C12751M711M473K232J67k67K64M79J52j89l29m30m33l9P73J505J552Q12
$$ 312751 317462 321935 324167 324334 324067 324331 324810 324962 324773 324444 324014 323581 323542 324315 325820 327372 328184
52623C28184j22m97j68L19L91p5r50k004k726k454j144M02J397J815J923J544
$$ 328184 328062 327565 327397 327716 328107 328032 327082 325078 322352 319898 318754 319156 320553 322368 324291 325835
52607C25835L64j323k664k999k173m79J326K229J800P84M57J400L043M252M263
$$ 325835 326199 324876 322212 319213 317040 316561 317887 320116 321916 322700 323157 324557 327600 331852 336115
52592C36115L321K532K685L130K461M39j553k350k354k446k497j983j318j346
$$ 336115 339436 341968 344653 347783 350244 350683 349130 346780 344426 341980 339483 337500 336182 334836
52578C34836j874j844r06K22R22J278J470J396J079P51N14L97O74J528K435K543
$$ 334836 332962 331118 330212 330434 331356 332634 334104 335500 336579 337330 337844 338241 338915 340443 342878 345421
52562C45421J691N51j62k51m6k74j483l064l400j809J87N72o39j670j438m15P33
$$ 345421 347112 347663 347501 347250 347204 346930 345447 342383 338983 337174 337361 337933 337294 335624 334186 333771 334504
52545C34504J876K611K157N74r40j409q96K21J695K816K453L76k310m337n109
$$ 334504 336380 338991 341148 341722 340782 339373 338477 338698 340393 343209 345662 346038 343728 339391 334282
52530C34282m199j361K336M619M304K641J523J209P91J55J03Q32J487J340N79
$$ 334282 330083 328722 331058 335677 339981 342622 344145 345354 346145 346300 346403 347235 348722 350062 350641
52515C50641k19p09p75m28J27N35M93j88j405k517k709j916r82n35j55P88J853
$$ 350641 350422 349713 348938 348510 348637 349172 349665 349477 348072 345555 342846 340930 339948 339413 339258 340046 341899
52498C41899J851L92j581k845l019k509j763q60K51J306J762J372O22K42L79N81
$$ 341899 343750 344142 342561 339716 336697 334188 332425 331565 331816 333122 334884 336256 336878 337120 337499 338080
52482C38080N77N23M07q3p63o81O57K171K160L65j527j689k8J966K937K738J851
$$ 338080 338657 339180 339587 339504 338741 338060 338717 340888 343048 343413 341886 340197 340169 342135 345072 347810 349661
52465C49661M28j502l148l308j963n93j79K80K031L982L611N63k377k521j30K762
$$ 349661 350089 348587 345439 342131 340168 339575 339396 339676 341707 345689 349300 349863 347486 344965 344835 347597
52449C47597M920O086N862M135K057J008Q06L69j25N78K318L006J393j091k327
$$ 347597 352517 358603 364465 368600 370657 371665 372471 372840 372715 373293 375611 378617 380010 378919 376592
52434C76592k240k245k668k437j232l67q77j861j695l16Q03P40J97K57R19J468
$$ 376592 374352 372107 369439 367002 365770 365403 364526 362665 360970 360654 361457 362197 362394 362651 363570 365038
52418C65038J647J785J999J951J499J046J189K178L683M774M425K501J80j145
$$ 365038 366685 368470 370469 372420 373919 374965 376154 378332 382015 386789 391214 393715 393895 392750
52404C92750j311j163j137q05P2R83J448J604J546P67j030l023l843l003j409
$$ 392750 391439 390276 389139 388334 388406 389389 390837 392441 393987 394754 393724 390701 386858 383855 382446
52389C82446m72r21k212l020k490j135j71o4k39j20K78Q60J590J961J325K03M4
$$ 382446 381974 381053 378841 375821 373331 372196 372025 371961 371722 371602 371880 372740 374330 376291 377616 377819 377863
52372C77863J041J339m32k931l773k769j749j532q81J184L562M419L365J627N63
$$ 377863 378904 380243 379811 376880 373107 370338 368589 367057 366176 367360 370922 375341 378706 380333 380896
52357C80896N89J204J645J701J870K525L121K865J987J583K142L026L565L824
$$ 380896 381485 382689 384334 386035 387905 390430 393551 396416 398403 399986 402128 405154 408719 412543
52343D12543M075M258M325M353L987K480j65k704l885l801l510l672l939l499
$$ 412543 416618 420876 425201 429554 433541 436021 435856 433152 429267 425466 421956 418284 414345 410846
52329D10846j902L44J878J679M40oR58J760P93j108j559K78K704L765L456L012
$$ 410846 408944 409288 411166 412845 413285 413279 414237 415997 416790 415682 414123 414401 417105 420870 424326 427338
52313D27338K918K577J756J395K433M262N022L668J364K50J013K285K605K193
$$ 427338 430256 432833 434589 435984 438417 442679 447701 451369 452733 452983 453996 456281 458886 461079
52299D61079K254L105L797L463K257Q70k09p56o99k35K71P38J417K260K655K090
$$ 461079 463333 466438 470235 473698 475955 476825 476616 475860 475161 474926 475197 475935 477352 479612 482267 484357
52283D84357R28K24Q06K550M383N055M390L797N064Q261J1423J2587J1751J0288
$$ 484357 485285 485509 486315 488865 493248 498303 502693 506490 511554 519815 531238 543825 555576 565864
52269E65864R074Q066P325P331Q052Q779R262J0231J2255J4702J6438J7085J6940
$$ 565864 574938 583004 590329 597660 605712 614491 623753 633984 646239 660941 677379 694464 711404
52256G11404J6104J4491J2635J1685J2257J3704J4642J4110J2303J0437R760J0431
$$ 711404 727508 741999 754634 766319 778576 792280 806922 821032 833335 843772 853532 863963
52244H63963J1393J1646J1261J0959J0981J0997J0839J0652J0348R678Q843Q392
$$ 863963 875356 887002 898263 909222 920203 931200 942039 952691 963039 972717 981560 989952
52232I89952Q328P921O578M405J909k38j095o7J967L015K065K02r12j031j084
$$ 989952 998280 1006201 1012779 1017184 1019093 1018855 1017760 1017693 1019660 1022675 1024740 1024942 1024030 1022999 1021915
52217A021915j557k059k189j881r82O97K891N000O693P874Q153P184N551M629
$$ 1021915 1020358 1018299 1016110 1014229 1013247 1013944 1016835 1021835 1028528 1036402 1044555 1051739 1057290 1061919
52203A061919N254O962Q643R510R388Q612P939Q108R237J0885J2622J4138J4854
$$ 1061919 1067173 1074135 1082778 1092288 1101676 1110288 1118227 1126335 1135572 1146457 1159079 1173217 1188071
52190A188071J4154J2214J0021Q320P065O118N772O116O434N883M481K948J814
$$ 1188071 1202225 1214439 1224460 1232780 1239845 1245963 1251735 1257851 1264285 1270168 1274649 1277597 1279411
52177A279411J163R57J083J173R11L49l41j148j899j963r82L26P78K17k83J99
$$ 1279411 1280574 1281531 1282614 1283787 1284698 1285047 1284706 1283558 1281659 1279696 1278714 1279040 1279818 1280035 1279752 1279951
52161A279951J405K482L014L168L286L701M684O123P449Q083P888P147O321N958
$$ 1279951 1281356 1283838 1286852 1290020 1293306 1297007 1301691 1307814 1315263 1323346 1331234 1338381 1344702 1350660
52147A350660O377P199P499O738N336M128L556L674M440N567O445O748O844P100
$$ 1350660 1357037 1364236 1371735 1378473 1383809 1387937 1391493 1395167 1399607 1405174 1411619 1418367 1425211 1432311
52133A432311P128O425N449N104N244M720L175J674J111R22K58n53p51q42k163
$$ 1432311 1439439 1445864 1451313 1456417 1461661 1466381 1469556 1471230 1472341 1473263 1473521 1472968 1472217 1471375 1469212
52118A469212m778p099p951p914q043q121p182n318l891l858m682n199n014m608
$$ 1469212 1464434 1457335 1449384 1441470 1433427 1425306 1418124 1412806 1408915 1405057 1400375 1395176 1390162 1385554
52104A385554m424m425m415m252l670k340l82J427K339K346J967J530R06j21j484
$$ 1385554 1381130 1376705 1372290 1368038 1364368 1362028 1361646 1363073 1365412 1367758 1369725 1371255 1372161 1372040 1370556
52089A370556k692k893j493Q76K442K136J083J280K867L876L027J448Q72J204
$$ 1370556 1367864 1364971 1363478 1364354 1366796 1368932 1370015 1371295 1374162 1378038 1381065 1382513 1383385 1384589
52075A384589J103K22m10j16O49J351K235L793O041Q544J0739J2091J2492J2618
$$ 1384589 1385692 1385914 1385504 1385388 1386037 1387388 1389623 1393416 1399457 1408001 1418740 1430831 1443323 1455941
52061A455941J3500J5598J8410K0889K2009K1365J9703J8527J8587J9046J8768
$$ 1455941 1469441 1485039 1503449 1524338 1546347 1567712 1587415 1605942 1624529 1643575 1662343
52050A662343J7898J7270J6678J4960J1836Q525O312N391N298N562N693N406N085
$$ 1662343 1680241 1697511 1714189 1729149 1740985 1749510 1755822 1761213 1766511 1772073 1777766 1783172 1788257
52037A788257N240N443M709L015J304l9j509l150m441n904q935j3138j5531j4060
$$ 1788257 1793497 1798940 1803649 1806664 1807968 1807929 1806420 1803270 1798829 1792925 1783990 1770852 1755321 1741261
52023A741261j0613q747r273r923q931o986n566n009m758m371l678k647j415j01
$$ 1741261 1730648 1721901 1712628 1702705 1693774 1686788 1681222 1676213 1671455 1667084 1663406 1660759 1659344 1659243
52009A659243J394L008M143M432M478N124O179O720O473N973N471M783M206M408
$$ 1659243 1660637 1663645 1667788 1672220 1676698 1681822 1688001 1694721 1701194 1707167 1712638 1717421 1721627 1726035
51995A726035N143N081L527J461K14k97j296l318n328n933n142m660o042q714
$$ 1726035 1731178 1736259 1739786 1741247 1741461 1741164 1739868 1736550 1731222 1725289 1720147 1715487 1709445 1700731
51981A700731j0424r939q613q671j0404j2012j1974j0635r382r093r623j0140
$$ 1700731 1690307 1680368 1671755 1663084 1652680 1640668 1628694 1618059 1608677 1599584 1589961 1579821
51969A579821r728q110o075m869n056o189p341p700o972n755n253n965o970p215
$$ 1579821 1570093 1561983 1555908 1551039 1545983 1539794 1532453 1524753 1517781 1512026 1506773 1500808 1493838 1486623
51955A486623p157q124j0184j1846j2036j1402j1310j2318j4083j5947j7281j7800
$$ 1486623 1479466 1471342 1461158 1449312 1437276 1425874 1414564 1402246 1388163 1372216 1354935 1337135
51943A337135j7973j8652k0111k1869k3371k4259k4064k2638k0925k0279k0688
$$ 1337135 1319162 1300510 1280399 1258530 1235159 1210900 1186836 1164198 1143273 1122994 1102306
51932A102306k0733j9652j8386j7919j7693j6590j4650j2830j1627j1006j1189
$$ 1102306 1081573 1061921 1043535 1025616 1007923 991333 976683 963853 952226 941220 930031
51921I30031j2462j4277j5470j5408j4384j2948j1548j0667j0652j1231j1642
$$ 930031 917569 903292 887822 872414 858030 845082 833534 822867 812215 800984 789342
51910G89342j1263r892p590m684j809M73K085L176L725L757L722M076M666N007
$$ 789342 778079 768187 760597 755913 754104 754577 756662 759838 763563 767320 771042 775118 779784 784791
51896G84791N084N212N095L779R68k107l720l401k217j332q30j34R07J916K796
$$ 784791 789875 795087 800182 803961 804929 802822 799102 795701 793484 792152 791322 791188 792095 794011 796807
51881G96807L969N645P460R155J0975J2908J4166J4264J4108J4892J6103J5842
$$ 796807 800776 806421 813881 823036 834011 846919 861085 875349 889457 904349 920452 936294
51869I36294J3275R559O007K538j305m929p429r033j0705j2629j4116j4807j4993
$$ 936294 949569 959128 965135 967673 966368 961439 954010 944977 934272 921643 907527 892720 877727
51856H77727j4745j3688j1706r126o056k380J356L935M994O030Q994J3737J7522
$$ 877727 862982 849294 837588 828462 822406 820026 821382 825317 830311 836341 845335 859072 876594
51843H76594J7426J3060O667P24m001p959j1238j3338j4288j5059j6479j8399
$$ 876594 894020 907080 913747 914471 910470 902511 891273 877935 863647 848588 832109 813710
51831H13710k0241k1695k2371k1424j8477j4726j2106j1180j0464q286m832j878
$$ 813710 793469 771774 749403 727979 709502 694776 682670 671490 661026 652740 647908 646030
51819F46030p04p98p18K75J860L560N256O624O833N524L654K518K129J422N3j095
$$ 646030 645326 644528 643810 644085 645945 649505 654761 661385 668218 673742 677396 679914 682043 683465 683518 682423
51803F82423j478j855l042m555n357n408n517n877n713m460k618j209p61r76j205
$$ 682423 680945 679090 676048 671493 666136 660728 655211 649334 643621 639161 636543 635334 634573 633597 632392
51788F32392j257j716l246n471p024o993n904m902m401m144m035m105l862k720
$$ 632392 631135 629419 626173 620702 613678 606685 600781 595879 591478 587334 583299 579194 575332 572612
51774E72612j203p87k047l591l533j744J7K84m21n02M13R26j91k193l235k729
$$ 572612 571409 570622 568575 564984 561451 559707 559724 560008 559587 559085 559498 560424 560233 558040 554805 552076
51758E52076j806j523j538r59L16J681K589K718J905N78k89j80M03R43J800L248
$$ 552076 550270 548747 547209 546250 546566 548247 550836 553554 555459 556037 555748 555568 555971 556914 558714 561962
51742E61962M261L451J156o57p72j4K38p5k0N98P35n08k427l198k003k39k6j619
$$ 561962 566223 569674 570830 570173 569401 569387 569625 569550 569530 570128 570863 570355 567928 564730 562727 562488 562462 560843
51724E60843l151l167k289j778j477m72R47J497R21L12K34op35q95M89K698M213
$$ 560843 557692 554525 552236 550458 548981 548509 549456 550953 551874 552186 552420 552414 551679 550784 551273 553971 558184
51707E58184M749N447P123R098R875Q694O306M333L724L822L211J364q26k292
$$ 558184 562933 568380 575503 584601 594476 603170 609476 613809 617533 621355 624566 625930 625104 622812
51693F22812k934l365l952m517m766m695m608m854n302n152l692j356M25P54K65
$$ 622812 619878 616513 612561 608044 603278 598583 593975 589121 583819 578667 574975 573619 574044 574798 575063
51678E75063K83J334K901M394N848P459Q855R207Q196O663N910O241O576N795
$$ 575063 575346 576680 579581 583975 589823 597282 606137 615344 623540 630203 636113 642354 648930 654725
51664F54725M179K995K903L349L469K867J468o57l006m622m862m008k936k421
$$ 654725 658904 661899 664802 668151 671620 674487 675955 675298 672292 667670 662808 658800 655864 653443
51650F53443k792l827m859n297n181m877m319l067j276J22M85N1p78j986l248
$$ 653443 650651 646824 641965 636668 631487 626610 622291 619224 617948 618070 618555 618606 617828 615842 612594
51635F12594l460j959K02J200O10k42j42N58P06j31j467k766l880m683m830m165
$$ 612594 609134 607175 607377 608577 609187 608945 608803 609361 610067 609936 608469 605703 601823 597140 592310 588145
51619E88145l176k550k305j626J22K414M003M274L846L712M225N127O215P587
$$ 588145 584969 582419 580114 578488 578610 581024 585027 589301 593147 596859 601084 606211 612426 620013
51605F20013R331J1213J2668J2962J1593Q764N332K109p56l544o258q354r190
$$ 620013 629344 640557 653225 666187 677780 686544 691876 693985 693229 689685 683427 675073 665883
51592F65883q645p313o005m983l748j888j08J21j853m891p010p063n398l254j945
$$ 665883 657238 649925 643920 638937 635189 633301 633193 633314 631461 626570 619560 612497 607099 603845 601900
51577F01900k292m158o456p964q401q479q839r108q200n547j883J306L088L675
$$ 601900 599608 595450 588994 581030 572629 564150 555311 546203 538003 532456 530573 531879 534967 538642
51563E38642L631L021J746M55J29O24N60p14j878j272O60J757R31n22p65L74J697
$$ 538642 542273 545294 547040 547495 547624 548248 548808 548094 546216 544944 545604 547361 548292 547770 547005 547379 549076
51546E49076K431K713K626J773K22q92m44J210K522K731K960M772P901J0197J0015
$$ 549076 551507 554220 556846 558619 558841 557949 557505 558715 561237 563968 566928 571700 579601 589798 599813
51531E99813Q049O307N660N061L088k61l502m949m068j902k33L0k67M75K687N198
$$ 599813 607862 614169 619829 624890 627978 627717 624215 619266 615198 613296 613063 613093 612826 613301 615988 621186
51515F21186O834P819R055J0548J1453J1619J2200J4147J6612J7565J6067J3419
$$ 621186 628020 635839 644894 655442 666895 678514 690714 704861 721473 739038 755105 768524
51503G68524J1776J1837J2372J2137J1762J3092J6684K0766K3197K3869K4227
$$ 768524 780300 792137 804509 816646 828408 841500 858184 878950 902147 926016 950243
51492I50243K4600K3340J9216J3543Q804N646K461k077p454j2586j7300k1646
$$ 950243 974843 998183 1017399 1030942 1039746 1045392 1047853 1045776 1038322 1025736 1008436 986790
51480I86790k4752k5773k5548k5857k6942k7156k5469k3049k1415k0101j7486
$$ 986790 962038 936265 910717 884860 857918 830762 805293 782244 760829 740728 723242
51469G23242j3552j0351r538j0538j1510j1193r290o105k784j223k567n747q375
$$ 723242 709690 699339 689801 679263 667753 656560 647270 641165 638381 637158 634591 628844 620469
51456F20469r002p783n203j535K134L805K593J55r36J29K051L240K997J367r37
$$ 620469 611467 603684 598481 596946 599080 602885 605478 605633 604697 604826 606877 610117 613114 614481 613544
51441F13544k536k478j575j594k955m263m318l470k577j894j672k641m713o131
$$ 613544 611008 608530 606955 605361 602406 598143 593825 590355 587778 585884 584212 581571 576858 570727
51427E70727n239k684p01n18j532k754l830m617m832m423l615k483j108o6o3r89
$$ 570727 565488 562804 562103 561585 560053 557299 553469 548852 544020 539597 535982 533499 532391 532325 532262 531273
51411E31273k064k811l286l529l600l964m836n298m144j780l7J55k51p8O33J361
$$ 531273 529209 526398 523112 519583 515983 512019 507183 501885 497741 495961 495924 496079 495828 495750 496383 497744
51395D97744K141L001L322K740J981J914K419K981L739N039O498P490Q168R156
$$ 497744 499885 502886 506208 508948 510929 512843 515262 518243 521982 527021 533519 541009 549177 558333
51381E58333J0499J1665J2204J1661R440N669J854m36j247j644j861j350m39n07
$$ 558333 568832 580497 592701 604362 613802 619471 621325 620889 619642 617998 616137 614787 614348 613841
51367F13841k239m864p360r282j0159r375p305n452m689m236l094j548l68O19
$$ 613841 611602 606738 599378 590096 579937 570562 563257 557805 553116 548880 545786 544238 543870 544489
51353E44489K089L831M983N321N262M787L494J769Q99J628L295M655N001M355
$$ 544489 546578 550409 555392 560713 565975 570762 574256 576025 576924 578552 581847 586502 591503 595858
51339E95858L211K390K459K974K856J941J531K765M983O417O266N373M969N608
$$ 595858 599069 601459 603918 606892 609748 611689 613220 615985 620968 627385 633651 639024 643993 649601
51325F49601P374J0209J3515J6112J7342J7985J9533K2625K6548L0214L3110L5224
$$ 649601 656975 667184 680699 696811 714153 732138 751671 774296 800844 831058 864168 899392
51313H99392L6570L6907L5740L2535K7383K1454J6194J1766O753r0q240j6011
$$ 899392 935962 972869 1008609 1041144 1068527 1089981 1106175 1117941 1124694 1124604 1116364 1100353
51301A100353k2380k7431l1277l3607l4483l4653l4531l3628l1596k9189k7394
$$ 1100353 1077973 1050542 1019265 985658 951175 916522 881991 848363 816767 787578 760184
51290G60184k5990k3976k1228j8770j7266j6217j4988j3802j3119j2625j1497
$$ 760184 734194 710218 688990 670220 652954 636737 621749 607947 594828 582203 570706
51279E70706r460p039m961l686l304l468l623l621l823m312m478l931l325l489
$$ 570706 561246 554207 549246 545560 542256 538788 535165 531544 527721 523409 518931 515000 511675 508186
51265E08186m048l881k811j756j162l85Q39J428L37j677k641j566N81K008J802
$$ 508186 504138 500257 497446 495690 494528 494143 494982 496410 496747 495070 492429 490863 491444 493452 495254
51250D95254N74k06M25J941K869K448J403Q64R39P99j42j604k777k999k320j612
$$ 495254 495828 495622 496047 497988 500857 503305 504708 505572 506511 507310 507168 505564 502787 499788 497468 495856
51234D95856j772k555k723j715o16q65k413l796l701j950N82K424K493J441J524
$$ 495856 494084 491529 488806 487091 486475 485610 483197 479401 475700 473750 474332 476756 479249 480690 482214
51219D82214M023P236Q198O244L518K027J596J122M07n4j39k4K48M60J00q08j251
$$ 482214 486237 493473 501671 507915 511433 513460 515056 516178 516585 516531 516392 516368 516616 517076 517176 516368 515117
51202E15117l84J265K336K149J178K62j30m5N3l29j155j803j740j012J3R55J238
$$ 515117 514733 515998 518334 520483 521661 521923 521793 521748 521801 521472 520317 518514 516774 515762 515775 516730 517968
51185E17968K35j911l886m274k896r37K07R3m89k99J021K359K333J055N5K38P14
$$ 517968 518203 516292 512406 508132 505236 504299 504506 504599 504110 503811 504832 507191 509524 510579 510634 510872 511586
51168E11586J21j481k780k891k241j818k015k201j347Q01L145M209L672K474J497
$$ 511586 511707 510226 507446 504555 502314 500496 498481 496280 494933 495734 498879 503088 506760 509234 510731
51153E10731Q45N32P81J320J419J264K195M645O806O660M615K720J800R92L0k0
$$ 510731 511576 512108 512889 514209 515628 516892 519087 523732 530538 537198 541813 544533 546333 547325 547355 547335
51137E47335J169K002J044p53j355n72l67k019m283m957l547j518k47K36L87J10
$$ 547335 548504 550506 551550 550797 549442 548870 548503 546484 542201 537244 533697 532179 531932 532168 532555 532665
51121E32665p16j387j159n18o04j380j534l96J108J879J939J797J474R57P12R09
$$ 532665 531949 530562 529403 528885 528281 526901 525367 524971 526079 527958 529897 531694 533168 534125 534837 535746
51105E35746Q55J21m35K01J668K747K855K078L88j844l159k388n46J69o58j279
$$ 535746 536601 536722 536287 536488 538156 540903 543758 545836 546224 544380 541221 538833 538287 538456 537798 536519
51089E36519n33N76O80M3j37O13J899L130L491K117o56k768k441m80N39m78j812
$$ 536519 535986 536562 537242 537285 537148 537761 539660 542790 546281 548398 547742 544974 542533 542053 542592 542114 540302
51072E40302j376M30J296J86j342j389k22N16M38P24J824K613K446K392L297M061
$$ 540302 538926 539356 540652 540838 539496 538107 537885 538401 538839 539563 541387 544000 546446 548838 552135 556196
$$ [...]
##END NTUPLES=NMR SPECTRUM
##END=
