
##TITLE=UV1157_M5-1005-1002_6301996_zVrpTGSFuX
##JCAMPDX= 6.0         $$ Bruker NMR JCAMP-DX V2.0
##DATA TYPE= NMR SPECTRUM
##DATA CLASS= NTUPLES
##ORIGIN= BRUKER
##OWNER= Administrator
$$ 1.72 TOPSPIN		Version 2.1
$$ 2012-06-06 02:18:29.921 -0500  Administrator@TOPSPIN
$$ Compression mode = diff/dup
##.OBSERVE FREQUENCY= 400.13188235
##.OBSERVE NUCLEUS= ^1H
##.ACQUISITION MODE= SIMULTANEOUS (DQD)
##.ACQUISITION SCHEME= undefined
##.AVERAGES= 8
##.DIGITISER RES= 22
##SPECTROMETER/DATA SYSTEM= spect
##.PULSE SEQUENCE= zg30
##.SOLVENT NAME= COFFEE_meoh
##.SHIFT REFERENCE= INTERNAL, COFFEE_meoh, 1, 14.98061
##AUDIT TRAIL= $$ (NUMBER, WHEN, WHO, WHERE, PROCESS, VERSION, WHAT)
$$ ##TITLE= Audit trail, TOPSPIN		Version 2.1
$$ ##JCAMPDX= 5.01
$$ ##ORIGIN= Bruker BioSpin GmbH
$$ ##OWNER= Administrator
$$ $$ C:\Bruker\TOPSPIN/data/COFFEE/nmr/UV1157_M5-1005-1002_6301996_zVrpTGSFuX/10/pdata/1/auditp.txt
$$ ##AUDIT TRAIL=  $$ (NUMBER, WHEN, WHO, WHERE, PROCESS, VERSION, WHAT)
(   1,<2012-06-06 02:18:21.812 -0500>,<Administrator>,<TOPSPIN>,<go>,<TOPSPIN 2.1>,
      <created by zg
	started at 2012-06-06 02:17:15.187 -0500,
	POWCHK enabled, PULCHK disabled,
       configuration hash MD5:
       D5 CA 7A 23 FE 6B EE E2 50 67 74 61 24 F7 5E 3B
       data hash MD5: 64K
       4F 39 F3 C4 36 22 B0 A0 70 FF 1B 14 48 32 C6 36>)
(   2,<2012-06-06 02:18:25.734 -0500>,<Administrator>,<TOPSPIN>,<proc1d>,<TOPSPIN 2.1>,
      <Start of raw data processing
       efp LB = 0 FT_mod = 6 PKNL = 1 PHC0 = 0 PHC1 = 0 SI = 32K 
       data hash MD5: 32K
       C8 EC A2 83 A6 F9 C1 1C B7 6A AB F3 49 E5 BE 33>)
(   3,<2012-06-06 02:18:26.093 -0500>,<Administrator>,<TOPSPIN>,<proc1d>,<TOPSPIN 2.1>,
      <pk PHC0 = 210.9595 PHC1 = 0 
       data hash MD5: 32K
       18 A3 EA AE ED 2F EC 2A E1 AD 8A 84 5C 54 60 7C>)
(   4,<2012-06-06 02:18:26.187 -0500>,<Administrator>,<TOPSPIN>,<proc1d>,<TOPSPIN 2.1>,
      <abs ABSG = 1 
       data hash MD5: 32K
       00 D1 57 A6 E4 0C 83 48 83 19 A3 A1 33 C9 F3 F0>)
(   5,<2012-06-06 02:18:26.218 -0500>,<Administrator>,<TOPSPIN>,<proc1d>,<TOPSPIN 2.1>,
      <abs ABSG = 2 
       data hash MD5: 32K
       7B 45 83 D6 8A 38 AE 43 D8 F6 1A 5C 0C A7 38 72>)
(   6,<2012-06-06 02:18:26.250 -0500>,<Administrator>,<TOPSPIN>,<proc1d>,<TOPSPIN 2.1>,
      <abs ABSG = 3 
       data hash MD5: 32K
       1D A1 AE 7F EE 61 9B 06 B8 67 BC ED 75 95 D6 CB>)
(   7,<2012-06-06 02:18:26.281 -0500>,<Administrator>,<TOPSPIN>,<proc1d>,<TOPSPIN 2.1>,
      <abs ABSG = 4 
       data hash MD5: 32K
       94 8C B6 71 49 84 DA E0 48 8E F5 E2 7F C4 1C 17>)
(   8,<2012-06-06 02:18:26.312 -0500>,<Administrator>,<TOPSPIN>,<proc1d>,<TOPSPIN 2.1>,
      <abs ABSG = 5 
       data hash MD5: 32K
       DC 69 3C 3A 5E 81 F9 F9 8F A3 9A F6 90 45 EC 21>)
$$ ##END=
$$ 
$$ $$ hash MD5
$$ $$ 57 0B E0 B1 16 86 F5 C5 06 80 F9 4B 02 B4 D0 1B
##$RELAX= 
##$RELAX= 
##$RELAX= 
##$RELAX= 
##$RELAX= 
##$RELAX= 
##$RELAX= 
$$ Bruker specific parameters
$$ --------------------------
$$ [...]
##$TP= (0..7)
150 150 150 150 150 150 150 150
##$TP07= 0
##$TPNAME0= <>
##$TPNAME1= <>
##$TPNAME2= <>
##$TPNAME3= <>
##$TPNAME4= <>
##$TPNAME5= <>
##$TPNAME6= <>
##$TPNAME7= <>
##$TPOAL= (0..7)
0.5 0.5 0.5 0.5 0.5 0.5 0.5 0.5
##$TPOFFS= (0..7)
0 0 0 0 0 0 0 0
##$TUNHIN= 0
##$TUNHOUT= 0
##$TUNXOUT= 0
##$USERA1= <user>
##$USERA2= <user>
##$USERA3= <user>
##$USERA4= <user>
##$USERA5= <user>
##$V9= 5
##$VALIST= <valist>
##$VCLIST= <CCCCCCCCCCCCCCC>
##$VD= 0
##$VDLIST= <DDDDDDDDDDDDDDD>
##$VPLIST= <PPPPPPPPPPPPPPP>
##$VTLIST= <TTTTTTTTTTTTTTT>
##$WBST= 2048
##$WBSW= 25
##$XGAIN= (0..3)
0 0 0 0
##$XL= 0
##$YL= 0
##$YMAX_a= 528577
##$YMIN_a= -641522
##$ZGOPTNS= <>
##$ZL1= 120
##$ZL2= 120
##$ZL3= 120
##$ZL4= 120
##$ABSF1= 14.98061
##$ABSF2= -5.57192
##$ABSG= 5
##$ABSL= 3
##$ALPHA= 0
##$AQORDER= 0
##$ASSFAC= 0
##$ASSFACI= 0
##$ASSFACX= 0
##$ASSWID= 0
##$AUNMP= <proc_prof1d_extract_pilot.lims>
##$AXLEFT= 0
##$AXNAME= <>
##$AXNUC= <1H>
##$AXRIGHT= 0
##$AXTYPE= 0
##$AXUNIT= <>
##$AZFE= 0.1
##$AZFW= 0.1
##$BCFW= 0
##$BC_mod= 0
##$BYTORDP= 0
##$COROFFS= 0
##$CY= 15
##$DATMOD= 1
##$DC= 0
##$DFILT= <>
##$DTYPP= 0
##$F1P= 0
##$F2P= 0
##$FCOR= 0.5
##$FTSIZE= 32768
##$FT_mod= 6
##$GAMMA= 0
##$GB= 0
##$INTBC= 1
##$INTSCL= 1
##$ISEN= 128
##$LB= 0
##$LEV0= 0
##$LPBIN= 0
##$MAXI= 10000
##$MC2= 0
##$MEAN= 0
##$ME_mod= 0
##$MI= 0
##$NCOEF= 0
##$NC_proc= -8
##$NLEV= 6
##$NOISF1= 0
##$NOISF2= 0
##$NSP= 0
##$NTH_PI= 0
##$NZP= 0
##$OFFSET= 14.98061
##$PC= 1
##$PHC0= 210.9595
##$PHC1= 0
##$PH_mod= 1
##$PKNL= yes
##$PPARMOD= 0
##$PPDIAG= 0
##$PPIPTYP= 0
##$PPMPNUM= 2147483647
##$PPRESOL= 1
##$PSCAL= 4
##$PSIGN= 0
##$PYNMP= <proc.py>
##$REVERSE= no
##$SF= 400.13
##$SI= 32768
##$SIGF1= 0
##$SIGF2= 0
##$SINO= 400
##$SIOLD= 32768
##$SPECTYP= <>
##$SREGLST= <1H.CDCl3>
##$SSB= 0
##$STSI= 32768
##$STSR= 0
##$SW_p= 8223.68421052632
##$SYMM= 0
##$S_DEV= 0
##$TDeff= 65536
##$TDoff= 0
##$TI= <>
##$TILT= no
##$TM1= 0
##$TM2= 0
##$TOPLEV= 0
##$USERP1= <user>
##$USERP2= <user>
##$USERP3= <user>
##$USERP4= <user>
##$USERP5= <user>
##$WDW= 1
##$XDIM= 32768
##$YMAX_p= 447966895
##$YMIN_p= -760041
##$CURPLOT= <Network HP LaserJet P1505>
##$CURPRIN= <$Network HP LaserJet P1505>
##$DFORMAT= <normdp>
##$LAYOUT= <+/1D_H.xwp>
##$LFORMAT= <normlp>
##$PFORMAT= <normpl>
##$SURQMSG= 1
$$ End of Bruker specific parameters
$$ ---------------------------------
##NTUPLES= NMR SPECTRUM
##VAR_NAME=  FREQUENCY,     SPECTRUM/REAL,   SPECTRUM/IMAG
##SYMBOL=    X,             R,               I
##VAR_TYPE=  INDEPENDENT,   DEPENDENT,       DEPENDENT
##VAR_FORM=  AFFN,          ASDF,            ASDF
##VAR_DIM=   32768,         32768,           32768
##UNITS=     HZ,            ARBITRARY UNITS, ARBITRARY UNITS
##FACTOR=    0.250966925370066, 1,           1
##FIRST=     8223.43324360095, -307929,      -854
##LAST=      0,             -29421,          21806
##MIN=       0,             -760041,         0
##MAX=       8223.43324360095, 447966895,    0
$$ Real data points
##PAGE= N=1
##DATA TABLE= (X++(R..R)), XYDATA
$$ [...]
19510h5795C18331a64631k78077A17219a50601O6432j24957A25409a67775G5940
19499D6643L7515a01685A41159a51694M5035L6460C9762d47527A43734L4832H6676
19487d0649p2549M4350F4803J56922a60956J8023D5228c06649J22980e3587m67264
19476e20851a26533M8464j61589a09933A22568b58209O2260I4635a31226k1362
19466a52588k71851B45995A05652j7178a58096c4707k4251k63005A78597a78238
19455A81385E5758Q9759A2071J96576a74344Q6615H0130f0465N724j0363j32165
19444a97269p1401H1432f2679A15501d0233M128B80507j32376J99366p2296j36067
19433A39134F2582g8560K0706m0264j97908k67460i8087h849B9368J55469a56818
$$ plain form
19510 -85795 318331 -164631 -442708 117219 -150601 -84169 -209126 125409 -167775 75940
19499 46643 84158 -101685 141159 -151694 -106659 -70199 39762 -447527 143734 178566 86676
19487 -40649 -113198 -68848 64803 221725 -160956 -142933 45228 -306649 -183669 -53587 -520851
19476 -520851 -126533 -78069 -239658 -109933 122568 -258209 -195949 94635 -131226 -152588
19466 -152588 -424439 245995 105652 88474 -158096 -34707 -58958 -321963 178597 -178238
19455 181385 55758 145517 12071 208647 -174344 -87729 80130 -60465 -54741 -65104 -197269
19444 -197269 -268670 81432 -62679 115501 -40233 -36105 280507 148131 347497 275201 139134
19433 139134 62582 -78560 -57854 -98118 -296026 -563486 -98087 -8849 29368 184837 -156818
19421F0805N229h6390A55740b76210N9341j55699B86205b59717A08134b3373k5349
19410d8722K820j36494j3294O5576A29594d52073D2606a1352c613B41909a01636
19398a47907A45497C6844a20954K4730G0045O7955d36325e5500r9413k9185a3533
19386h7817a2950j06214d6139B54012j01276i6958C3383j772e7426k22925J40024
19375a40327J5956e882j44000H6301a01911j87553A2483c69258C7336a75209O1630
19364a13579J9287j09070A28798b6705o717a3836c635n1505E1516c42840b3443
19352b51109b7142q1103J3807K9611j15211K9594j6598B77148g2294d805k14529
19341b19334C4275b12214A0034c9996A51903D1201d6485k53009h0816j54711A54279
$$ plain form
19421 60805 66034 -86390 155740 -276210 -216869 -372568 286205 -259717 108134 -23373 -48722
19410 -48722 -45902 -182396 -195690 -130114 129594 -452073 42606 -11352 -3613 241909 -101636
19398 -147907 145497 36844 -120954 -96224 70045 138000 -436325 -55500 -154913 -184098 -13533
19386 -87817 -12950 -119164 -46139 254012 152736 -96958 33383 31611 -57426 -280351 -140327
19375 -140327 -124371 -5882 -149882 86301 -101911 -289464 12483 -369258 37336 -175209 -113579
19364 -113579 -94292 -203362 128798 -26705 -33422 -13836 -3635 -55140 51516 -342840 -23443
19352 -251109 -27142 -108245 -94438 -64827 -180038 -150444 -167042 277148 -72294 -4805 -219334
19341 -219334 34275 -212214 10034 -39996 151903 41201 -46485 -299494 -80816 -235527 154279
19329b09602B0576c35136a8727C8974b06225O1770a7316H7214a18654k1696j22770
19318b63120l7165a18817b6804F5985e8600m5624c177j92901g4602k28524B42924
19306G8697c0519j11753j51060h4290k109B59864p9952a61104a9716m5039j14699
19295a79454Q0586j44781j2214A09455a25398M7305j16158H3875a94072o5960
19285b60032B67170b23192l705g2750m33374A67681c25341e9177B10035i269A38467
19273A74055e0396a041j16848j27849F7864Q0580h9099A60614b70798O6614A49110
19261c65153N3469K6811d05o8506j20339b8669p1696j77733J34041j39713A11439
19249a55927M9348C28494a7834F2994l0607J65308a5414k31812h8310A75421C611
$$ plain form
19329 -209602 20576 -335136 -18727 38974 -206225 -144455 -17316 87214 -118654 -140350 -263120
19318 -263120 -300285 -118817 -26804 65985 -58600 -104224 -3177 -196078 -74602 -303126 242924
19306 78697 -30519 -142272 -293332 -84290 -86399 259864 179912 -161104 -19716 -64755 -179454
19295 -179454 -98868 -243649 -255863 109455 -125398 -78093 -194251 83875 -194072 -260032
19285 -260032 267170 -223192 -226897 -72750 -506124 167681 -325341 -59177 210035 -9269 138467
19273 174055 -50396 -1041 -117889 -245738 67864 148444 -89099 160614 -270798 -204184 149110
19261 -365153 -311684 -284873 -405 -68911 -189250 -28669 -100365 -278098 -144057 -283770 111439
19249 -155927 -106579 328494 -17834 62994 32387 197695 -15414 -247226 -88310 175421 3611
19237b70840A26773g8036L364E1343a07518j28216I8451A6392D929c2789l95120
19226d27909B13117g7442B26473r8161C1531a97017A31172b29247A07511i1755
19215a97493K3357A38590C8289N740i2395A25295d9932j34892B10198a1850j99858
19204b11708c5650C23577l9846A5283a23060a0190A52383a1430A85190C2184a37262
19192A3767e092o9837A61750a29005A47717H015b20897A35470c0344k69751H0708
19180A4060L0580K16597b17456c5003l99262J94591B45257m537A11536c859k08280
19169b12139p3285C3667R081c06554A77864b14708p2303J19216f2672B14962k9619
19158A85343a1893r0875o3856M837D7738b5310H7663b31164L5178P555Q3936j47579
$$ plain form
19237 -270840 126773 -78036 -74672 51343 -107518 -235734 98451 16392 4929 -32789 -427909
19226 -427909 213117 -77442 226473 128312 31531 -197017 131172 -229247 107511 -91755
19215 -197493 -174136 138590 38289 44029 -92395 125295 -49932 -184824 210198 -11850 -211708
19204 -211708 -35650 323577 283731 15283 -123060 -10190 152383 -11430 185190 32184 -137262
19192 13767 -5092 -74929 161750 -129005 147717 8015 -220897 135470 -30344 -300095 80708
19180 14060 44640 261237 -217456 -35003 -434265 -239674 245257 240720 111536 -3859 -212139
19169 -212139 -285424 33667 42748 -306554 177864 -214708 -287011 -167795 -62672 214962 185343
19158 185343 -11893 -102768 -166624 -161787 47738 -25310 87663 -231164 -195986 -188431 -104495 -252074
19146b52074A66908c8273l22474b7693k9051k15313a33439A81461b23060K510
19136b20550m9195a4372m4876O97j11634j57443b1577p294k423j05032e8718A00509
19123G266R1903a24133k23624B74920a40386M4955l9192A70919f7299F0634b0893
19111c22209N2549J20752A72839a66440E2284b50541A36056b6381I9326c84427
19100C9266a74412C8670a57049f8204L0280B1327J74712n1718E2739e0857j17911
19089a68768a171j94025A93483b75395B3618M43457c18691C8303j018J19623P7433
19078B34341A01672a00956A37510b45758A7753a03468N686B91817F972b69827
19067a8576r0392B1865a03289j98732O2149P6462A072e7362j27307G4190d03970
$$ plain form
19146 -252074 166908 -38273 -360747 -27693 -56744 -272057 -133439 181461 -223060 -220550
19136 -220550 -269745 -14372 -59248 -58551 -170185 -327628 -21577 -28871 -31294 -136326 -58718 100509
19123 7266 99169 -124133 -347757 274920 -140386 -95431 -134623 170919 -67299 60634 -20893
19111 -322209 -269660 -148908 172839 -166440 52284 -250541 136056 -26381 99326 -384427
19100 39266 -174412 38670 -157049 -68204 -37924 21327 196039 144321 52739 -50857 -168768
19089 -168768 -1171 -195196 193483 -275395 23618 467075 -318691 38303 37285 156908 234341
19078 234341 101672 -100956 137510 -245758 17753 -103468 -97782 291817 6972 -269827
19067 -18576 -108968 21865 -103289 -302021 -239872 -163410 1072 -57362 -184669 74190 -403970
19055H4830c2099G06a55127r3061A49826p1589C6523a06977L9509k21178A36085
19043A27873f9864l7516j91351a09483F4028C0366c2062j30831A22679a46207
19032h7437E7239O4297A7437h8426C71216A26985a41284c8111D7355i6842J6674
19021h0168A96543b24232E7192i0935n1314f5189B10453b43493E8641c87187J38145
19010b49042c5323q3110F4338c94284a60775j47L6063C5608K63492c61255R1038
18999b70217a06648e2484h939A48191b81709a13867q5729k95039b05880f6064
18988a5445F3909g2802p8982D791a80186N2883A2134b72853Q3107L8195a7479
18976f2684r5945P6752k3588A41224b12293a04250k52022a44071A54965b32715
$$ plain form
19055 84830 -32099 706 -155127 -248188 149826 78237 36523 -106977 -67468 -288646 136085
19043 127873 -69864 -107380 -298731 -109483 64028 30366 -32062 -162893 122679 -146207
19032 -87437 57239 121536 17437 -88426 371216 126985 -141284 -38111 47355 -96842 -80168
19021 -80168 196543 -224232 57192 -90935 -142249 -65189 210453 -243493 58641 -387187 -249042
19010 -249042 -35323 -118433 64338 -394284 -160775 -160922 -124859 35608 299100 -361255 -270217
18999 -270217 -106648 -52484 -8939 148191 -281709 -113867 -199596 -494635 -205880 -66064
18988 -15445 63909 -72802 -151784 4791 -180186 -127303 12134 -272853 -189746 -151551 -17479
18976 -62684 -158629 -81877 -105465 141224 -212293 -104250 -356272 -144071 154965 -232715
18965a75589a3551k48082b9177j17103r5735A56236a71256E2327d28194i8461
18954c87765B52914i8477j49877l8810M5396c8209j66028e6501A54999C8813b84871
18942H551b87715J07851j24634a7453j25739j15801D8082K9474J99523a70104
18931A99350f2814m7841a7158k67324j39759h9421K9976k78777f7771B60408a21499
18919a8169n0492A49958P042d5340A19088O2513b7316A08258C0832b58502B25615
18907a28314c2165m7277A10956b23536J0941k46625f1602H8252J3141m3557J65441
18896B23277b07309j15841A29814b22595B09387j8914e38339a26672B66683A7750
18885a27057D9118J0759a36527j71104J15826A99628r2411a29897q2645D8286
$$ plain form
18965 -175589 -13551 -261633 -29177 -146280 -242015 156236 -171256 52327 -428194 -98461
18954 -387765 252914 -98477 -248354 -287164 -241768 -38209 -204237 -56501 154999 38813 -284871
18942 8551 -287715 -179864 -304498 -17453 -143192 -258993 48082 77556 277079 -170104
18931 199350 -62814 -110655 -17158 -284482 -424241 -89421 -59445 -338222 -67771 260408 -121499
18919 -18169 -68661 149958 157000 -45340 119088 181601 -27316 108258 30832 -258502 225615
18907 -128314 -32165 -79442 110956 -223536 -212595 -459220 -61602 88252 101393 57836 223277
18896 223277 -207309 -323150 129814 -222595 209387 190473 -538339 -126672 266683 17750
18885 -127057 49118 59877 -136527 -307631 -191805 199628 107217 -129897 -212542 48286
18874a42302D1926K72159b38502A10069C8602J2451a17670j83200h3825K2072
18864f1753n9765E7525b94350h1136B21757f5056C9354j5873J71255b48155B03833
18852h7984H4103a59473j0551H7955Q8065p4394P6167a27248q9604j63271B09216
18840a2343j89283B14296a41501H4484b01269I7206a55212A7593J9645c16341
18829A3782d2828B414h5874c3871J2621j01628B01686B9936N3472b08900m6075
18818b54975H043Q0823h4764j0576O027l7470r7746B51623c2579A20024b18640
18806c41648A47997L1428h1784o8628m1007I1788J21852c01996a49150C5686a02886
18794D30721A48157a13065o3844C4020i8048j21134A49167D9657K09353A11004
$$ plain form
18874 -142302 41926 314085 -238502 110069 38602 51053 -117670 -300870 -83825 -61753
18864 -61753 -121518 57525 -294350 -81136 221757 -65056 39354 23481 194736 -248155 203833
18852 -87984 84103 -159473 -170024 87955 176020 101626 177793 -127248 -216852 -380123 209216
18840 -12343 -201626 214296 -141501 84484 -201269 97206 -155212 17593 37238 -316341
18829 13782 -42828 2414 -85874 -33871 -21250 -122878 201686 29936 83408 -208900 -254975
18818 -254975 8043 88866 -84764 -95340 -89313 -126783 -224529 251623 -32579 120024 -218640
18806 -341648 147997 179425 -81784 -150412 -191419 91788 213640 -301996 -149150 35686 -102886
18794 430721 148157 -113065 -176909 34020 -98048 -219182 149167 49657 259010 111004
18783B18719I706i8108m33922A69254C9283L7214a90274A11123m0894a7679j31420
18772a49099M700A77625a00756p4664b9626j06415m2856P6674A36673g5230k08508
18761b83738L0275A39508b6953A3155a85058Q6648r1343M2291n036A0676d3152
18749i7921i927j16750l48019a05842J6319B60618j04660p0396P0598f8931q7901
18738a56832H65Q0234l9711L2092a79506j10816q8189J27406j7820h5971D5479
18726i3726J717A23898c0605p29436C93527e0857A16395b0161r3484k92046I8632
18714I6132A1347a78777b9096A37753b34146A75862e5651j9525m0913B04354L3993
18703B38347c52402A77747b02570P5267q0436p0602i5330l80380c1849r2888l43839
$$ plain form
18783 218719 9706 -98108 -532030 169254 39283 76497 -190274 111123 70229 -17679 -149099
18772 -149099 -144399 177625 -100756 -175420 -29626 -136041 -178897 -102223 136673 -75230 -283738
18761 -283738 -253463 139508 -26953 13155 -185058 -98410 -189753 -147462 -152498 10676 -43152
18749 -97921 -9927 -126677 -474696 -105842 -89523 260618 155958 85562 156160 -68931 -156832
18738 -156832 865 81099 41388 73480 -179506 -290322 -378511 -251105 -268925 -85971 45479
18726 -93726 -92009 123898 -30605 -760041 393527 -50857 116395 -20161 -113645 -405691 98632
18714 96132 11347 -178777 -29096 137753 -234146 175862 -55651 -75176 -116089 204354 238347
18703 238347 -352402 177747 -202570 -127303 -207739 -278341 -95330 -475710 -31849 -124737 -468576
18692d68576a30668o4526m7953R9759d8490j98516I3173O048h615B2336b01908
18680e8481N832p6410C46694C9358j6079b71707R5850r851C0473M5468a99084
18668a91973a5952j2105A7154N5007A5580h039A02831a45193l2112b14k20971
18657b21185D3182j9493b2015H6304a48306o4551H8055l3666a04876A13858b55132
18645a35300l8944A3038Q5758h0014A33856k243n0983c08305g6766q4248g9498
18633A70866b03916b8971k34184D6970K7058a41715j08447a1793F5539J92136
18623B57675b36981F7402a0063r0271q0676D582b11691B2544J16446b93743P7148
18612b16595E0700J30761n8940a31558N5980k81121R6916C39765G3519c68323
$$ plain form
18692 -468576 -130668 -195194 -243147 -143388 -48490 -247006 93173 99221 -8615 22336 -201908
18680 -58481 -52649 -129059 346694 39358 23279 -271707 -175857 -185708 30473 75941 -199084
18668 -191973 -15952 -28057 17154 72161 15580 -8039 102831 -145193 -177305 -214 -221185
18657 -221185 43182 23689 -22015 86304 -148306 -212857 88055 54389 -104876 113858 -255132
18645 -135300 -174244 13038 98796 -80014 133856 131613 80630 -308305 -76766 -161014 -79498
18633 170866 -203916 -28971 -263155 46970 74028 -141715 -250162 -11793 65539 257675
18623 257675 -236981 67402 -10063 -100334 -181010 4582 -211691 22544 138990 -293743 -216595
18612 -216595 50700 181461 122521 -131558 -75578 -356699 -259783 339765 73519 -368323
18601a90282k0584P6958n8463j35855Q5271d0983a0297A37022a03244B1291K36357
18590B57648d55801a69213q3961A92461b78175A14934k4768A6107a33570B64207
18579A88526g0470A55950e811j01363B04920J6840f100k45521C78487j06679a27152
18567E1694d04140g6430A4118e132k17832a6598A02804a66055q7645o2362g3781
18555c5908C5973J11173d5936q239A37439J84588i5103M0338k25230A28932K7180
18544A56112o8182d48050D6949e3095j16609f8369C65961i3979D0435a02767c6944
18532C3188N5266b72530A48695C9348a60302e9867A16648g0735E0223R1273G0653
18520a15554C6841d24859a36953q4341g4661j70771I7020a08521a4428A19548
$$ plain form
18601 -190282 -210866 -133908 -192371 -328226 -242955 -40983 -10297 137022 -103244 21291 257648
18590 257648 -455801 -169213 -253174 192461 -278175 114934 90166 16107 -133570 264207
18579 188526 -70470 155950 -5811 -107174 204920 221760 -6100 -251621 378487 271808 -127152
18567 51694 -404140 -76430 14118 -5132 -222964 -16598 102804 -166055 -253700 -316062 -73781
18555 -35908 35973 147146 -45936 -54175 137439 322027 -95103 -54765 -279995 128932 156112
18544 156112 87930 -448050 46949 -53095 -169704 -68369 365961 -93979 40435 -102767 -36944
18532 33188 88454 -272530 148695 39348 -160302 -59867 116648 -70735 50223 141496 70653
18520 -115554 36841 -424859 -136953 -221294 -74661 -245432 97020 -108521 -14428 119548
18509b90904g0477B85668j6649h9067C8687b39791g5684E3428c14081A11446j7591
18498I3855B8835Q0114J30847d04627A7491J40441E3910e0943B2223a2966H5899
18486A13085g3538k81019B35806d9935k18048h2867N322D3913a02083k0529H9819
18474a91550N408j87557F0101J39124k4348b34563J00448G9816f2366p7708q0926
18463b21000I1442A6660f8407m3569j35677a9037l6786A45666g6155j52324Q3716
18452a44763N0072J049a1636l7700N055j23812A7169a03283p3206a1404k15629
18441b27033B2979d5343C0214A823e1333o8971j44265a31130o4271G22c50802
18429B28159a14406L3109C9004J0328Q7846d7368k27936D5499E992M1505Q8702
$$ plain form
18509 -290904 -70477 285668 269019 -89067 38687 -239791 -75684 53428 -314081 111446 93855
18498 93855 28835 108949 239796 -404627 17491 157932 53910 -50943 22223 -12966 85899
18486 113085 -73538 -354557 235806 -49935 -267983 -82867 -77545 43913 -102083 -122612 89819
18474 -191550 -186142 -373699 60101 199225 174877 -234563 -134115 79816 -62366 -140074 -221000
18463 -221000 91442 16660 -68407 -111976 -247653 -19037 -55823 145666 -76155 -228479 -144763
18452 -144763 -94691 -93642 -11636 -49336 -44281 -168093 17169 -103283 -176489 -11404 -227033
18441 -227033 22979 -45343 30214 1823 -51333 -120304 -264569 -131130 -195401 722 -350802
18429 228159 -114406 -81297 39004 49332 137178 -47368 -275304 45499 5992 47497 136199
18418A36199n1400a66162K4678k6654l1300A57441a07302b8646j87092A112M11861
18407D12973A45750a3220I4863d9337B44508a0920m1217a1035A66633h0072a4467
18395a61082j9612C5015g2546j26965c5941J1471j2449F0046L7491L8249b32812
18383A21905i8015E1754a42577b5075m27947B35196l7371B7922c097q9133p3587
18372a65817A95415F2522b22891e1276H2703h1200r6497j44293a36505n3637L9004
18361a51138e08k0963r8552C60933c35686L6072f6933A06377M478g9596B20786
18349C7388b63378e9144B38400a59159m3407k94729P5658H0288a982j2697k32490
18338b47169B6943K11024c3195j02492f5k45132b5188C11461E4594J06410b70936
$$ plain form
18418 136199 84799 -166162 -141484 -168138 -199438 157441 -107302 -28646 -215738 1112 412973
18407 412973 145750 -13220 94863 -49337 244508 -10920 -52137 -11035 166633 -80072 -14467
18395 -161082 -180694 35015 -72546 -199511 -35941 -24470 -36919 60046 97537 135786 -232812
18383 121905 -98015 51754 -142577 -25075 -453022 235196 197825 27922 -3097 -92230 -165817
18372 -165817 195415 62522 -222891 -51276 82703 -81200 -177697 -321990 -136505 -190142 -151138
18361 -151138 -508 -21471 -120023 360933 -335686 -299614 -66933 106377 110855 -79596 220786
18349 37388 -263378 -59144 238400 -159159 -202566 -497295 -421637 80288 -1982 -14679 -247169
18338 -247169 26943 237967 -33195 -135687 -65 -245197 -25188 311461 54594 161004 -270936
18326f1856K4870o1115a3827A62314a6277A97466g0275q3054B68439j1107b16840
18314H2153Q082f2350I4408a91434N1868A2188c5176E1659L0804c86014a52052
18302b36648C88475a46954c8787j79168a03526q4846d3325j2218o4554A44169
18291a42809C45500c21939a07014j86996A30605k0730r512e0864q4958b0411P72
18280a9639k32417A25933e2326C02597A30143n1639a51322e4908A05811R984a40535
18268a05373K9712A96528A6956d43116J90299i4860c0260E9989J35054F3232E68
18256b27323B74726a62950L9810H3179J09077f879C016J41064a4899D1458c18714
18244a61421A53774J53042b21949A03348c45586a47206d045k10599b4380A7976
$$ plain form
18326 -61856 -36986 -98101 -13827 162314 -16277 197466 -70275 -153329 268439 257332 -216840
18314 82153 90235 -62350 94408 -191434 -139566 12188 -35176 51659 82463 -386014 -152052
18302 -236648 388475 -146954 -38787 -217955 -103526 -188372 -43325 -55543 -120097 144169
18291 -142809 345500 -321939 -107014 -294010 130605 109875 100363 -50864 -135822 -20411 -19639
18280 -19639 -252056 125933 -52326 302597 130143 78504 -151322 -54908 105811 115795 -140535
18268 -105373 -75661 196528 16956 -443116 -252817 -94860 -30260 59989 195043 63232 568
18256 -227323 274726 -162950 -123140 83179 192256 -6879 3016 144080 -14899 41458 -318714
18244 -161421 153774 306816 -221949 103348 -345586 -147206 -4045 -214644 -24380 17976
18233E3051a13344j18626f3747K533B8345a48276I27M603f4844n5127G3591B623
18220I2184K4238B6587a82993n4393F2412A0233b6382j923o8985l33694K02582
18209b28402r5136B2743a41656J5167J2444e6861j44450B76112f5082l13654f4863
18197a46978j27893I1184e1328A53020h1102B94055J2987d12I4003P511c32935
18185a74958o3468d6132A9546J13028b99080B10936a47j25400G8792c38363H06
18173d31871b2040j11772k93281f8491A34872f6008j01719b0309j10157M2173
18163h8293H6993a30448k55476C18738g603j5256G831O5931K6483c0363q138o7409
18151a05910d7664j69692G053c4541j13178A18245k4793g2173r4539J2467a1494
$$ plain form
18233 53051 -113344 -231970 -63747 -61214 28345 -148276 927 5530 -64844 -119971 73591 2623
18220 92184 116422 26587 -182993 -237386 62412 10233 -26382 -28305 -97290 -430984 -228402
18209 -228402 -323538 22743 -141656 -126489 -114045 -56861 -201311 276112 -65082 -378736 -64863
18197 -146978 -274871 91184 -51328 153020 -81102 294055 307042 -412 94003 101514 -332935
18185 -174958 -238426 -46132 19546 132574 -299080 210936 -147 -125547 78792 -338363 806
18173 -431871 -22040 -133812 -427093 -68491 134872 -66008 -167727 -20309 -130466 -88293
18163 -88293 86993 -130448 -385924 318738 -7603 -22859 7831 73762 100245 -30363 -38501 -105910
18151 -105910 -47664 -217356 7053 -34541 -147719 118245 93452 -72173 -166712 -154245 -11494
18139A71794b74883B59445b16687A32542a8092j85563J3550J0352A78311b96573
18128h2416E3991J73993c5881j43478M592A13579M31786B11620h2511I4211A6338
18116A81386b3251C66774g2768A9145G882a85459p3995O7960e5239A3733O3249
18105G6982L1296c03680E8189B9083c68412a29589N8547H2158a04617A79105d33721
18093b86184C1625b17719L6176H0138J40635F6806a21961b8435k6224B9542l782
18082B5760J7739a43087k5240P8399j41908a6633j01427E8937b82104c8900j24426
18071a63326A23153a47367K8692A99689a82888Q4586G4273a3272C4009K60648
18061B94657a80695a0385j7930B61522g5308L2979l4902b5338A76333H472a21311
$$ plain form
18139 171794 -274883 259445 -216687 132542 -18092 -203655 -190105 -179753 178311 -296573
18128 -82416 53991 227984 -35881 -179359 -174767 113579 545365 211620 -82511 94211 16338
18116 181386 -23251 366774 -72768 19145 7882 -185459 -259454 -191494 -55239 13733 76982
18105 76982 108278 -303680 58189 29083 -368412 -129589 -71042 82158 -104617 179105 -433721
18093 -286184 31625 -217719 -181543 80138 220773 66806 -121961 -28435 -54659 29542 25760
18082 25760 43499 -143087 -168327 -89928 -231836 -16633 -118060 58937 -282104 -38900 -163326
18071 -163326 123153 -147367 -118675 199689 -182888 -98302 74273 -13272 34009 294657
18061 294657 -180695 -10385 -28315 261522 -75308 -42329 -77231 -25338 176333 8472 -121311
18049A01937a06167B92302c5770C9383b32887D8559a25768b1342B51601j25449
18039A26152k7734C1721R273J11148c8082k6933j5823E7310L5208a42603Q018
18028a34585B12525A01025N2294e0620R951j00423K1975D0438d27947J54899a29154
18016D2709J0607h596A65902a20403A24493A8109c50228J74961C5976K47041b25843
18004B85783A06314a60776k48875a2855A43653F3876B0609L03140c82148I5065
17993b1674B1944a30698M8502A42966P3884a08916B53280h943k17323a0793J202
17982i591l45809C619b3069P365G164J77704a20703b3629G5332i3346l55585D6034
17969A37528O9885a36698B76753b96431R0206D3242J73134b48091D60733g4853
$$ plain form
18049 101937 -106167 292302 -35770 39383 -232887 48559 -125768 -21342 251601 126152
18039 126152 98418 31721 40994 152142 -38082 -65015 -80838 57310 92518 -142603 -134585
18028 -134585 212525 101025 153319 -50620 -40669 -141092 -119117 40438 -427947 -273048 -129154
18016 42709 53316 -8596 165902 -120403 124493 18109 -350228 -175267 35976 283017 -225843
18004 285783 106314 -160776 -409651 -12855 143653 63876 20609 323749 -382148 95065
17993 -21674 21944 -130698 -82196 142966 216850 -108916 253280 -8943 -226266 -10793 -9591
17982 -9591 -355400 3619 -23069 -15704 7164 184868 -120703 -23629 75332 -93346 -448931 46034
17969 137528 207413 -136698 276753 -296431 -206225 43242 216376 -248091 460733 -74853
17958a00978E4006L61616A62959L5970E4731R909J79426D5478J78474g9006H5958
17946A57501a998j8366B6196O2211M6897b38361F2090a54052B14303B86b45580
17934e7022m9040A40085b73760E788f6422A59551f2510A72094C1583a41068k2471
17923a63539P8378j09840F4029Q7521f4965k49068C39765D742K03344E5543J58817
17912B14360E6924e2394D3532d3785r2819F2402P7547J4571i0716d101o9935j90302
17900b64338c531j75986D8874a10855E9930a0400A70225h7263A46975a1362j00283
17889a11645A0699b4869q2191j14026j52504F4392a35810h538k13125g5301k7259
17878a02560j13993B5101Q7083L0970c91042A35978a28979p9515A44759a22737
$$ plain form
17958 -100978 54006 415622 162959 198929 54731 64640 244066 45478 223952 -79006 85958
17946 157501 -1998 -20364 26196 88407 135304 -238361 62090 -154052 214303 286 -245580
17934 -57022 -106062 140085 -273760 5788 -66422 159551 -62510 172094 31583 -141068 -163539
17923 -163539 -85161 -195001 64029 151550 -64965 -314033 339765 4742 208086 55543 214360
17912 214360 56924 -52394 43532 -43785 -136604 62402 139949 154520 -90716 -4101 -74036 -264338
17900 -264338 -3531 -179517 48874 -110855 59930 -10400 170225 -87263 146975 -11362 -111645
17889 -111645 10699 -24869 -107060 -221086 -373590 64392 -135810 -8538 -221663 -75301 -102560
17878 -102560 -216553 25101 112184 143154 -391042 135978 -128979 -208494 144759 -122737
17867E7196J3200f9276j0588C1553a6634o1808K8615j2166A62372i1965A25414
17855g3491B34071n6470R8354f0110A06504M3493K51696j89055e0555j57604j08167
17844c16326I1118b35451A30567a82770H4758a92287j26281a36926j04532g1470
17833B5496J28670a19255A45973R7373b3333j24219j4340j91252L3197B47803
17822b82147E4384a36172A36537a58228F8260J52982h0177A61813d00j31055A03605
17810b29056e5687b1926D0389J29648a95965A02701b33458C18J66533f6544j14719
17799a81263A04567a62259A90525a29798j22136A16635d6286p877H8775h046A3517
17787a25748A13036b98135c0565G4605C927d0677C5416J44394M3799g8296D9451
$$ plain form
17867 57196 70396 -69276 -79864 31553 -16634 -78442 -49827 -61993 162372 -91965 125414
17855 -73491 234071 177601 275955 -60110 106504 149997 401693 212638 -50555 -208159 -316326
17844 -316326 91118 -235451 130567 -182770 84758 -192287 -318568 -136926 -241458 -71470
17833 25496 154166 -119255 145973 243346 -23333 -147552 -161892 -353144 -319947 247803
17822 -282147 54384 -136172 136537 -158228 68260 221242 -80177 161813 -400 -131455 103605
17810 -229056 -55687 -21926 40389 170037 -195965 102701 -233458 318 166851 -66544 -181263
17799 -181263 104567 -162259 190525 -129798 -251934 116635 -46286 -54163 88775 -8046 13517
17787 -125748 113036 -298135 -30565 74605 3927 -40677 35416 179810 223609 -78296 49451
17775a16461b1672h976k55708i4252C1819K1954J54110l8311b05673a7922B18561
17763I7991b36663E2590n051d6481j88642B37053b89182A8214c938I9326B6141
17751e7125o4887K291C31635B4967n001P4931i3041A5233R5229J57184I4083J39126
17739B33209a66451A90370g433H1184k5097b78653g787q7105r3120B50080D9822
17727B47006f343k53683c5493q5772p44b4904j8387j12327C9966b34347e8530
17715c0329A27812C8220a45905r5141N6812J0586N8746A77360c45217A20512b0784
17703b88762j427A68457n1354B1420G386a11593B520E63K86057H0389M8546E967
17690D36454j06373b84569C50284j74501a94724C16796F4454a69680I5503J28190
$$ plain form
17775 -116461 -21672 -8976 -264684 -94252 31819 53773 207883 169572 -205673 -17922 218561
17763 97991 -236663 52590 47539 -46481 -235123 237053 -289182 18214 -3938 99326 26141
17751 -57125 -122012 -119721 331635 24967 19966 94897 -93041 15233 110462 267646 94083 233209
17739 233209 -166451 190370 -7433 81184 56087 -278653 -7787 -94892 -188012 250080 49822
17727 247006 -6343 -260026 -35493 -121265 -122009 -24904 -43291 -155618 39966 -234347 -58530
17715 -30329 127812 38220 -145905 -241046 -184234 -173648 -114902 177360 -345217 120512 -20784
17703 -288762 -290189 168457 117103 21420 7386 -111593 2520 563 286620 80389 128935 5967
17690 436454 330081 -284569 350284 175783 -194724 316796 64454 -169680 95503 223693
17680B23693C9712e3661n5118M3193p8308j09950B40005F6475c4569j68086C5670
17668C7869K68892c36356E2995e9446A32353J19623b96536A70221o2515K8821
17658A36527P2114a79591g0453E8552L30211g900H933a28850E0589K8663J74114
17647B53366A18936b12559F76i7754L1539b2468j35121b3776B58005G4807c98773
17635C0420M7753J80624b16161M5725L5709A54170b31737a02477k60890A074L35652
17624C36726A60526i1444L794I6337n0d5262m437A16248Q5768a33692k696B08692
17611b56670h1833i153A47929F7242N2309i2228p6131k3252D9940L08074b02745
17599C62059e4555C0609K39466G0221J859J04821J18921J04201C941a09867A70865
$$ plain form
17680 223693 39712 -53661 -108779 -65586 -143894 -253844 240005 66475 -34569 -202655 35670
17668 37869 306761 -336356 52995 -59446 132353 251976 -296536 170221 107706 136527
17658 136527 208641 -179591 -70453 58552 388763 -7900 8933 -128850 50589 79252 253366
17647 253366 118936 -212559 676 -97754 -66215 -22468 -157589 -23776 258005 74807 -398773
17635 30420 78173 258797 -216161 -170436 -134727 154170 -231737 -102477 -363367 1074 336726
17624 336726 160526 -91444 -87650 96337 96287 -45262 -49699 116248 202016 -133692 -136388 208692
17611 -256670 -81833 -9153 147929 67242 119551 -92228 -168359 -191611 49940 358014 -202745
17599 362059 -54555 30609 270075 70221 72080 176901 295822 400023 3941 -109867 170865
17587a66393A70715j5333M2521L2010I4804K47029f1218j05066D8769J974J63853
17576B14596a54899D50333A11582f9701B7645b16083G137L20521A03027b0241
17565a81787h2293H1765b41548C3897j5764L06802q6586e4863F2764J8929b25099
17553A24261H55J29538a77520l7458A43055H369h1970m4086A96765a28707a3115
17541I0504J69866a71674I6326J67183L6693a28971O0166j11632o2180C651J13430
17530A17081L02496H3500a10219D44876k16793L3597r6977K00782m6066h4999
17519A00589e6282k895m1108L6268A67215a46130G3012O4119R7686D9385J58158
17508B07543r0733d5644r4608E5032c7338C8221c4381B50585j10711c7110m6123
$$ plain form
17587 -166393 170715 155382 197903 229913 94804 341833 -61218 -166284 48769 50743 214596
17576 214596 -154899 450333 111582 -69701 27645 -216083 7137 327658 103027 -20241
17565 -181787 -82293 81765 -241548 33897 18133 324935 238349 -54863 62764 81693 -225099
17553 124261 855 130393 -177520 -214978 143055 8369 -81970 -126056 196765 -128707 -13115
17541 90504 260370 -171674 96326 263509 300202 -128971 -68805 -180437 -242617 3651 117081
17530 117081 419577 83500 -110219 444876 228083 261680 164703 365485 319419 -84999
17519 100589 -56282 -59177 -100285 -64017 167215 -146130 73012 137131 234817 49385 207543
17508 207543 116810 -45644 -140252 55032 -37338 38221 -34381 250585 139874 -37110 -83233
17497h3233B40123A01295L3574F6704J47002J45259j32289l4137m3701p2758J26278
17486B02358n7168a42661C7803a6903A01229a2218j28597A74878R8068j14388
17476A58558C7145A1549L09733c9584m921B04298a84421P3053E3221J40428j0299
17465A83350J31197j35143p5124e3632D88005A38295J51085A1588a74404A72831
17454c1125f627B45456H8722a00904B06208M0586b43844A38624b28180I9778K34834
17443C34612H5404g2756B06899I2236J69518q8843K11232j58279N7024m6408J91138
17432D27618A26721A3364K04140J20880I2937l7721B0172J1503J55209d1868A95962
17420a04501F3946L5840J39951K14340j89166m6231G4185J90859E0808M01440
$$ plain form
17497 -83233 240123 101295 134869 66704 213706 358965 226676 192539 148838 76080 202358
17486 202358 145190 -142661 37803 -16903 101229 -12218 -140815 174878 272946 158558
17476 158558 37145 11549 321282 -39584 -44505 204298 -184421 -111368 53221 193649 183350
17465 183350 314547 179404 104280 -53632 488005 138295 289380 11588 -174404 172831
17454 -31125 -6627 245456 88722 -100904 206208 246794 -243844 138624 -228180 99778 334612
17443 334612 85404 -72756 206899 92236 261754 172911 384143 225864 282888 236480 427618
17432 427618 126721 13364 217504 338384 92937 55216 20172 31675 186884 -41868 195962
17420 -104501 63946 99786 239737 454077 264911 218680 74185 265044 50808 452248
17410D52248A44225l9635J05247L5009K8285J47016j81215k334L19283p4105G3447
17398C01153j46413i679B09200j00137J8506L4034a2841F6870R4852q0764M6295
17387A27253m5124a88607A26565K8512a1835j0910k72542A1868b640q0476B22206
17375E7836K212i3319A72330J38804K09392a18180B3242d02117C09869j22580
17365A87289m3102J58130q3868Q2714G683a32451C98126m9096a41582C51207A46818
17353C56967G9050J84841b5536C5346J6853L54693p5166B704M4733J7785K20206
17342B85428a43181B31384N8313A39596a1933j5429B63364J79920I1089K3693
17332A14782J22983D1597J4608J18215J39516C2553J02820J77699h646A61851
$$ plain form
17410 452248 144225 104590 209837 244846 273131 420147 238932 236598 555881 481776 73447
17398 301153 154740 -9679 209200 109063 127569 161603 -12841 66870 161722 80958 127253
17387 127253 82129 -188607 126565 155077 -11835 -22745 -295287 11868 -2640 -83116 222206
17375 57836 60048 -93319 172330 311134 520526 -118180 23242 -402117 309869 187289
17365 187289 144187 302317 218449 301163 7683 -132451 398126 349030 -141582 351207 146818
17353 356967 79050 263891 -25536 35346 52199 406892 331726 2704 47437 65222 285428
17342 285428 -143181 231384 289697 139596 -11933 -27362 263364 443284 91089 114782
17332 114782 237765 41597 56205 174420 313936 32553 135373 313072 -8646 161851
17321b3436B60752j15745B0075c4482a296j80738C96187j64293A08131a03412
17310B42647M2543J07191f7440C67483b9188A89666l2179n7645L64828A09699
17299B12127A2699R8719J58832F3051a57201A51401q728P0411p4466J8491o8977
17288H8132J90499G7827M98234B70662K7074M9504j49606a54096I2660L43665
17278D36325F3805J11978N3160I3559L75747G8151K63412n8657j04496B4313c1685
17266C13002A41674K4402J28938c5093B08481A1432e4A54248o7395A1780K6756
17255C8536N05924A02597N1555P9421l9593J00758m1588J56645A00303A5154L6179
17244E1333g4897C66642g3355H6598L36965j87463j10952J78149j8356n3565j05591
$$ plain form
17321 -23436 260752 145007 20075 -34482 -1296 -182034 396187 231894 108131 -103412
17310 242647 285190 392381 -67440 367483 -29188 189666 157487 99842 464670 109699
17299 212127 12699 111418 270250 63051 -157201 151401 142673 213084 138618 157109 88132
17288 88132 278631 77827 576061 270662 297736 347240 197634 -154096 92660 436325
17278 436325 63805 175783 228943 93559 469306 78151 341563 282906 178410 24313 -31685
17266 313002 141674 166076 295014 -35093 208481 11432 -54 154248 86853 11780 38536
17255 38536 544460 102597 154152 233573 193980 294738 253150 409795 100303 15154 51333
17244 51333 -74897 366642 -73355 86598 423563 236100 125148 303297 284941 231376 125785
17233A25785J22870M2962j28041o7847m0986J32980R1038n913A17012J85020A20628
17221D50375A37730K3278D4793K31198L05886k73854O222J69801I7772K0174K41492
17210C59438a56095J0761C75431k8967A13516M29810j98800M4958A29666M89059
17200F18725A29765l2942L01043o2235J76752j04589j62126J70141A32428K76864
17190D09292k03514j8506J70044H2307N9735J4228F9441K61938j50859J09358
17180B89878Q5924A04102K06059C4098R8131K31149E8587M2871C8509K07298o9973
17169A75834q0523L8184O8671J75347o3281r1095J0786A9231E218M22309M2356
17158D69883k29877o0738q38J44031j49197q3677K31653A40002J74486D1812Q381
$$ plain form
17233 125785 248655 291617 163576 95729 54743 187723 278761 272848 117012 302032 120628
17221 450375 137730 161008 44793 275991 581877 308023 314245 484046 97772 117946 359438
17210 359438 -156095 -145334 375431 346464 113516 543326 344526 389484 129666 618725
17200 618725 129765 96823 397866 335631 512383 407794 245668 415809 132428 409292
17190 409292 205778 187272 357316 82307 142042 156270 69441 331379 180520 289878
17180 289878 375802 104102 310161 34098 132229 363378 58587 101458 38509 245807 175834
17169 175834 95311 133495 202166 377513 314232 223137 233923 19231 5218 427527 469883
17158 469883 240006 179268 178430 322461 173264 89587 321240 140002 314488 41812 50193
17147E0193J81572K31436A98118q9618L64281A03121J59846a62725B80337J26382
17137D06719q2586J8067j0465p4949K22024j46780i08C25888d5336B63272K54804
17126E18076B41444O1648J71389q2393A32248j7156K82791A08566a2086A25588
17115E38710B02457H6383J63950L04813B22458M7148p657J06660B1666J96377
17105B18043M49693A64245K0051c1893A17970J95086p3407O4945o8619K10102
17095D46077K33302l13470o8406J13875r8003F0474N79049A52934J84615G8310
17084C72326K6973p8128J50550B01919L01843B16825Q155J68336A23453Q4372
17074B07825M61921A28815J42743P3400O8744J41759j45624Q5978D2931L93052
$$ plain form
17147 50193 231765 463201 198118 108500 472781 103121 262967 -162725 280337 406719
17137 406719 324133 342200 331735 256786 478810 332030 -908 325888 -45336 263272 518076
17126 518076 241444 303092 474481 392088 132248 115092 397883 108566 -12086 125588
17115 538710 202457 86383 250333 555146 222458 269606 261949 368609 21666 218043
17105 218043 667736 164245 184296 -31893 117970 313056 239649 304594 235975 446077
17095 446077 679379 365909 297503 411378 313375 60474 639523 152934 337549 78310
17084 372326 399299 321171 471721 201919 503762 216825 224980 393316 123453 207825
17074 207825 669746 128815 271558 344958 413702 555461 409837 495815 42931 435983
17064D35983J92440r9651p1258A79626L94713j80108J14076o4768R172A89958
17053E16220p7901J42825k77193K32893k4280J9330k04527J07788P8922j20200
17043C93877q5458M3703J91851J29475k88555J95109B82609L04367K61536l41270
17033E07242L15461j72990p9009B66536L52177O1161J65567A69937J73257K59946
17023F03140L36578n6211j92369j53921J96771j33942p392j67463K5697M8664
17013D99552O1931J46445K8076l720j28409k07768J83271J77067C04456L26552
17003F31008K05060l46758k42305M32295j25502N7955P364J61054l749o2935o8642
16992F44845j64504k8727Q1506o4063p8753J90829j29015M51438C13833K53420
$$ plain form
17064 435983 628423 528772 457514 179626 574339 394231 508307 443539 452711 189958
17053 516220 438319 581144 303951 536844 512564 531894 327367 435155 514077 393877
17043 393877 308419 352122 543973 673448 384893 580002 282609 586976 848512 507242
17033 507242 822703 649713 570704 266536 618713 679874 845441 169937 343194 603140
17023 603140 939718 883507 691138 537217 733988 600046 592654 425191 450888 499552
17013 499552 561483 707928 736004 732284 603875 396107 579378 756445 304456 631008
17003 631008 836068 489310 247005 679300 553798 611753 619117 780171 776422 713487 644845
16992 644845 480341 451614 533120 469057 390304 581133 452118 903556 313833 567253
16982E67253j34934J78561j83408L97722J01893j38707j1397J61640m44855K01248
16972F95016J82455P4141j62119M57441n90626L03284o6257j51576O9154l93661
16962D17252M73186j91907K46683m1903J70942l71926J19636m6923M23295m82305
16952G16030M19362o5075k7478k61566q2477K78433m5732K13382l06826r8549
16942G39504K38395K26575J29041o37402K106J99535K71103J38945n20486O06587
16932A393903n34337M69041l59333K02597K55503j55610k61368J02496N1173K2710
16922A186775l52182M60702J91492k35162J44952j02069K79545q1369m16916O7983
16912A143751Q4861N58969q44531N75905M9951l82290M82126l93493M35471j76710
$$ plain form
16982 567253 432319 610880 427472 825194 927087 788380 776983 938623 493768 695016
16972 695016 877471 951612 789493 1246934 656308 959592 893335 741759 810913 417252
16962 417252 890438 698531 945214 903311 1074253 702327 821963 775040 1198335 716030
16952 716030 1135392 1070317 1042839 781273 698796 977229 931497 1144879 838053 739504
16942 739504 977899 1204474 1333515 696113 698219 897754 1168857 1307802 787316 1393903
16932 1393903 859566 1328607 969274 1171871 1427374 1271764 1010396 1112892 1164065 1186775
16922 1186775 834593 1295295 1486787 1251625 1396577 1294508 1574053 1492684 1075768 1143751
16912 1143751 1228612 1787581 943050 1518955 1568906 1186616 1668742 1275249 1710720 1534010
16902A534010j01897L20357n30546N73564J23668n70892K80356N2145L77J95550
16892A876692m05542j5008K07913k34231J14964K85853R3391k23971J67952j05216
16882A762797j86321L90421J75635j56644o8768L21706k65878K08577k82740M87393
16872B386178l4886J05003o51578M03137P6629o1538k77939O45834o81388P519
16862A916971M39578J44169l4348J2275K733K1144k20569M34585j85261K74257
16852B805534k86485K97852k68928M20133j89432L25183j72485J79610Q467j61110
16842B958339k8434K11953j40534M45356K3437K9929k1021J34934k58670J2405
16832C367694K44299K32022j01913L07136r1635k44971K95378j91080N69930j37755
$$ plain form
16902 1534010 1432113 1752470 1221924 1795488 1919156 1348264 1628620 1680765 1681142 1876692
16892 1876692 1471150 1456142 1664055 1429824 1544788 1830641 1924032 1700061 1868013 1762797
16882 1762797 1576476 1966897 2142532 1985888 1917120 2238826 1972948 2181525 1898785 2386178
16872 2386178 2351292 2456295 1804717 2207854 2284483 2222945 1945006 2590840 1909452 1916971
16862 1916971 2356549 2500718 2466370 2478645 2481378 2502522 2281953 2716538 2531277 2805534
16852 2805534 2519049 2816901 2547973 2968106 2778674 3103857 2931372 3110982 3119449 2958339
16842 2958339 2929905 3141858 3001324 3446680 3470117 3500046 3479025 3613959 3355289 3367694
16832 3367694 3611993 3844015 3742102 4049238 3957603 3712632 4008010 3816930 4386860 4249105
16822D249105J27318J80026k23106K40321j1231j3115O14671n9908m68417O19229
16812E254893m7104L45719j9306K05696J38912K03636k82449L11096p7043K09276
16802F243326p4683L75829J41955j34237K79408J74581R7255L01550N49662k09083
16792G745563N90403k27896Q246L83879K03869K93147L65332k09888K86216L77874
16782I816745J80025N66962p6867M38103K3144L02096O38078K39407L13407O80394
16772A3121494J46616N37013L70482L30839K48813O70887M96444K18114N62929
16763A6703631P07413O89610L59394M86502Q91025Q56388M50450J066261Q38020
16754B3048694R27582O03692J020878J133676R92005Q12642J144103J246912J563888
$$ plain form
16822 4249105 4376423 4556449 4333343 4573664 4562433 4549318 5163989 5104081 4635664 5254893
16812 5254893 5207789 5553508 5534202 5739898 5878810 6082446 5799997 6111093 6034050 6243326
16802 6243326 6168643 6544472 6686427 6552190 6831598 7006179 7103434 7404984 7954646 7745563
16792 7745563 8335966 8108070 8116316 8500195 8704064 8997211 9362543 9152655 9438871 9816745
16782 9816745 9996770 10563732 10486865 10924968 10948112 11250208 11888286 12127693 12441100 13121494
16772 13121494 13268110 13805123 14175605 14506444 14755257 15426144 15922588 16140702 16703631
16763 16703631 17411044 18100654 18460048 18946550 19837575 20693963 21144413 22210674 23048694
16754 23048694 23976276 24579968 25600846 26734522 27726527 28539169 29683272 30930184 32494072
16745C2494072J215514J353530J608108K057154J450178J877088K233498J908300
16737D6197442K544979J970406K633894K545519K717750L346925L486182L247759
16729F8690856L895583L683601M281591M406607M399128N192866N398892N195882
16721A05145006N851858N755926O159088O150796O038280O210712O050203O063289
16713A53425158N756983N174795M745698M059585L027655L194786J209057Q74711
16705A81468428n83525r99223k121367l088287m361707m582365m956110n651317
16697A55124527n860904o230834o303365o332193o419433o362367n832536n800605
16689A05982290n579848n537416n368870m722900m666228m153760m408609l423167
$$ plain form
16745 32494072 33709586 35063116 36671224 38728378 40178556 42055644 44289142 46197442
16737 46197442 48742421 50712827 53346721 55892240 58609990 61956915 65443097 68690856
16729 68690856 72586439 76270040 80551631 84958238 89357366 94550232 99949124 105145006
16721 105145006 110996864 116752790 122911878 129062674 135100954 141311666 147361869 153425158
16713 153425158 159182141 164356936 169102634 173162219 176189874 179384660 180593717 181468428
16705 181468428 180884903 179885680 177764313 174676026 170314319 165731954 160775844 155124527
16697 155124527 149263623 143032789 136729424 130397231 123977798 117615431 111782895 105982290
16689 105982290 100402442 94865026 89496156 84773256 80107028 75953268 71544659 68121492
16681F8121492l854687l583761l096382k959254k931507k399897k269494k519698
16673D4506812k172005k077346j433679k113362j577263j367535j406575j719502
16665C0639545j024937j547159p57542j436125j097025m65759j354898o15627
16657B2340473p20613p11993r15299j109314n80559l50258m86688l70489r60760
16648A6134500k96445n20439m11022n90968o67624K20496r82512l65777k90363
16639A2229846J238o75999o6655n98325N6733n08553n46101k5333n54150L82718
16629I695419n03566l43612j43050k20759k37007l73383o6497j65356r9970r7686
16619G444533k37770k74707k59445N7501M2519L1414m55381l31468L07892m99011
$$ plain form
16681 68121492 64266805 60683044 57586662 54627408 51695901 49296004 47026510 44506812
16673 44506812 42334807 40257461 38823782 36710420 35133157 33765622 32359047 30639545
16665 30639545 29614608 28067449 27309907 25873782 24776757 24310998 22956100 22340473
16657 22340473 21619860 20907867 19992568 18883254 18302695 17952437 17465749 17095260 16134500
16648 16134500 15838055 15317616 14906594 14315626 13648002 13868498 12885986 12520209 12229846
16639 12229846 12231084 11555085 11488430 10890105 10946838 10438285 9892184 9866851 9312701 9695419
16629 9695419 9191853 8848241 8705191 8484432 8247425 7874042 7807545 7642189 7542219 7444533
16619 7444533 7206763 6932056 6672611 6730112 6772631 6804045 6348664 6017196 6325088 5826077
16609E826077N7834l4061l88712n6644J53366k30854j30226k13673r9579N2978
16599D936506j50380q3714q4934n8016N3575l47296K4973j15541O1422j92688
16589D043907j30870j42096r4631L86366n56602K87721J25219l52571K2766p41855
16579B847354O99713j24626j68450L8867p7585J8329n545n05142K23668J24462
16569C071045j72534o4877J72148j53139j24894l65361J4841K62634M1479l7355
16559B643987l9270j76548j60452j29964m280P6532N0142p1396j34558J64099
16549B218292K9615J65031l91602j04386L94672m2604j45667j26230m3913J01091
16539B054299J3269K00413n68598L86025P1381n16799K71929l08072L12108k07412
$$ plain form
16609 5826077 5883911 5849850 5461138 5404494 5557860 5327006 5196780 4983107 4883528 4936506
16599 4936506 4786126 4702412 4617478 4559462 4613037 4265741 4290714 4175173 4236595 4043907
16589 4043907 3913037 3770941 3676310 4062676 3506074 3793795 3919014 3566443 3589209 2847354
16579 2847354 3547067 3422441 3253991 3292858 3215273 3233602 3228057 2722915 2946583 3071045
16569 3071045 2898511 2833634 3005782 2852643 2727749 2362388 2377229 2639863 2681342 2643987
16559 2643987 2604717 2428169 2267717 2137753 2133473 2210005 2260147 2188751 2054193 2218292
16549 2218292 2247907 2412938 2021336 1916950 2311622 2269018 2123351 1997121 1953208 2054299
16539 2054299 2067568 2267981 1699383 2085408 2156789 1639990 1911919 1603847 1915955 1708543
16529A708543j65479J82657k79936K58252n74959N70162j53320k6150l8037k04764
16519A276969N5715N4072K54540k95142k2814J32712J81284l33557l9587l63480
16509I00712O20402k0835k67773J02224k56447O9297r9457K62146k2567m95152
16499G92550N85637p2501k02495J44637k5674R5687J7529n7274k81674P1316J16621
16488A184359O670J8025M9653j40885l01693O773K97865p6013M965j92061O31938
16477A489596l63200J22362j03634k0562p8690q3647j3541J19504r9145J94742
16467A163785j823m15221J33806J33394k00357P6334o9219J34083J8474q1332
16457H91924J08093j09580l2951j50920j5295Q8368m069j11189p7116L18677k33731
$$ plain form
16529 1708543 1543064 1725721 1445785 1704037 1129078 1699240 1545920 1519770 1481733 1276969
16519 1276969 1332684 1386756 1641296 1346154 1323340 1456052 1637336 1303779 1264192 900712
16509 900712 1521114 1500279 1232506 1334730 1078283 1147580 1048123 1310269 1287702 792550
16499 792550 1378187 1305686 1103191 1247828 1222154 1317841 1335370 1278096 996422 1067738 1184359
16488 1184359 1191029 1209054 1258707 1117822 816129 822902 1120767 1044754 1049719 857658 1489596
16477 1489596 1126396 1248758 1145124 1124562 1045872 962225 948684 1068188 969043 1163785
16467 1163785 1161962 746741 880547 1013941 813584 889918 820699 954782 973256 891924
16457 891924 1000017 890437 857486 706566 691271 779639 775570 664381 587265 905942 672211
16446F72211n7402J01624l36415P03610k31869k53719J30285j14217J51774K24532
16436I90414m31016J63163J04653R068j33244K01469r2393N1239k38339q7693
16426E37321Q7267K58906q7756O2727M6115m06076K5509L04793j4405j40103j31033
16415E43265L96503k98621N1799J12372k23173j73060M86721l72798P62718F35186
16404F57287k31156J4743K8074j14875K55633K14522B59961L28532j36699j97683
16394B54111O43695l72503k55743J97665J40118B50719K40215L01656j78705B10296
16383G14341j31446j42005j04168L45399k85467k5148J81761o0823B07393L10933
16373E18326B25344J19304P9020K9511k4373K90935k99048K87012B09139h7432
$$ plain form
16446 672211 614809 716433 380018 1083628 851759 598040 728325 614108 765882 990414
16436 990414 559398 722561 827214 836282 703038 904507 812114 863353 625014 537321
16426 537321 624588 883494 795738 858465 904580 498504 524013 828806 814401 674298 543265
16415 543265 939768 641147 692946 805318 582145 409085 895806 523008 1285726 635186
16404 657287 426131 440874 468948 354073 609706 824228 259961 588493 451794 254111
16394 254111 897806 525303 269560 467225 607343 250719 490934 792590 613885 210296
16383 714341 582895 440890 336722 682121 396654 371506 553267 492444 207393 518326
16373 518326 225344 344648 423668 453179 428806 719741 420693 707705 209139 -87432
16362D33190J19208k51487M46044B73497L46893k16329A01336K80622l0242o6236
16352B85480N2272K03235O040j64269j63952Q8706l5890H2547M88455B72059L05728
16341E77787A43321M46535j99583A07718O62910k65749B38174q2212K48138R9561
16331E03661P8736j14750L76615C53792j13113K50567j89413Q4248J46434k18218
16321C14297J08549j12050A08324K82126m7682m3246F3374J64024L47605j53444
16311D21559r1463j13137R14f2806B02024K24214Q3880k49646M72906C27219N2133
16300C79352j06440N3601l284Q1945N6826A10886J50609J40493r4184c9911D22806
16288D02257j31327K87616j39192B8583L05921Q7887j80376K4231P9279j30363
$$ plain form
16362 433190 552398 300911 746955 273497 620390 404061 101336 381958 351716 285480
16352 285480 337752 540987 547027 382758 218806 307512 271622 82547 571002 272059 577787
16341 577787 143321 589856 390273 107718 770628 504879 238174 155962 404100 503661
16331 503661 582397 467647 844262 353792 240679 491246 301833 386081 532515 314297
16321 314297 422846 310796 108324 390450 342768 299522 63374 227398 575003 421559
16311 421559 330096 216959 217873 -62806 202024 426238 510118 260472 733378 327219 379352
16300 379352 272912 326513 323229 405174 462000 110886 261495 401988 307804 -39911 422806
16288 402257 270930 558546 419354 28583 334504 422391 242015 266246 345525 215162
16278B15162L4972k2507R0164g8113E6361O5475R5331E3788N7861N7653R5927
16267B65229K43044B29188L67116j01726C353M26902O8635k02186E3689L10971
16257C64660j09224A20567L72020A548N33225j71330P3719k15852K25750L7050
16247D84110C7890J92418H6518L39949j21134j06473K60746j26523J518F3621
16236d408B91256E3599K97549H9650K8639b0777E1872e6332A36096n0352M02392
16225D88136A62696g4909C14734A33925J18357P7904j31194C7673J65702K20057
16215D23432j34173A40747J09680J30704A79841f3844D0887G852K66357b28785
16204D50315j84475i9309B37614k1445a98788A85342J67920A76595B2783a15039
$$ plain form
16278 215162 250134 227627 317791 -78113 56361 121836 217167 53788 111649 169302 265229
16267 265229 508273 229188 596304 494578 3353 430255 498890 296704 53689 364660
16257 364660 255436 120567 492587 1548 534773 363443 437162 221310 447060 484110
16247 484110 37890 230308 86518 426467 305333 198860 459606 333083 334601 63621
16236 -4408 291256 53599 351148 89650 118289 -20777 51872 -56332 136096 85744 488136
16225 488136 162696 -74909 314734 133925 252282 330186 198992 37673 203375 423432
16215 423432 289259 140747 250427 381131 179841 -63844 40887 7852 274209 -228785
16204 450315 265840 -99309 237614 216169 -198788 185342 353262 176595 22783 -115039
16193B08907A02254h0995E5497K4747J67847a70441A60908G1179P8564m2904g7536
16181a0657B06679a598A49072K68928f1069m8327m4326b5161j46331C4058K78956
16170C13014E3926R5438m7801L03803A37782o6583k0572c0828D3582K07989d21101
16158C00592O900B7922c1979k17076D5539J67687F4645K26969G1311J68961L1275
16147B71547a9457F9856J33308D1738M2359K57853A27340K75721A01499h109C62261
16135C0374J0533K4626b83386i4424A6308K12950B9945a28685C0835J95684n079
16124B21440H3134K14091m5371p5823a13459E8679K1083c5069D05658J7784A88774
16112h0679G6134Q872a69752g5300E23759A5123a16209C42379a7923D56209b63504
$$ plain form
16193 208907 102254 -80995 55497 80244 248091 -170441 160908 71179 149743 106839 -77536
16181 -10657 206679 -1598 149072 418000 -61069 -109396 -153722 -25161 -171492 34058 313014
16170 313014 53926 149364 101563 405366 137782 71199 50627 -30828 43582 251571 -421101
16158 300592 307492 27922 -31979 -249055 45539 213226 64645 291614 71311 240272 271547
16147 271547 -19457 69856 203164 41738 84097 341950 127340 403061 101499 -8109 362261
16135 30374 40907 65533 -283386 -94424 16308 229258 29945 -128685 30835 226519 221440
16124 221440 83134 297225 251854 176031 -113459 58679 79762 -35069 405658 423442 188774
16112 -80679 76134 85006 -169752 -75300 523759 15123 -116209 342379 -17923 456209 -263504
16100C00807N1397d04653B10576C6251J12151c4040A57736J60363a8987k18210
16090b37197G3095K63562J28170G2721f8866k19522a3000k13837A98458p3279
16080A25179b47285a8954k07580A3670J75039A6577J69392L3081A08431a58779
16069c6203l9490B362i5827A42724B6448a6832j30178C62017A290J32972h3108
16057F5662b38633G6729C4326K75191b69113a14075C0808m391Q3256L321J28074
16046B41068g8708B6112c08620A76975b09753B08329a41000J6930f093B32842
16035c65816C5121R104n998K6106a13590G2525K32467A32363d7254k03150B21535
16023c32413g3300C2139b5637A36969a47947N5719M576j28712n8020e5651B23795
$$ plain form
16100 300807 352204 -404653 210576 36251 148402 -34040 157736 318099 -18987 -237197
16090 -237197 73095 336657 464827 72721 -68866 -288388 -13000 -226837 198458 125179
16080 125179 -247285 -18954 -226534 13670 188709 16577 185969 219050 108431 -158779
16069 -36203 -75693 2362 -95827 142724 26448 -16832 -147010 362017 1290 134262 -83108
16057 65662 -238633 76729 34326 309517 -269113 -114075 30808 26417 109673 112994 241068
16046 241068 -78708 26112 -308620 176975 -209753 208329 -141000 -124070 -6093 232842
16035 -365816 35121 44225 38227 64333 -113590 72525 304992 132363 -47254 -250404 221535
16023 -332413 -73300 32139 -25637 136969 -147947 -92228 -87652 -216364 -274384 -55651 223795
16011a69958K1343m0942B23084C4281L4857a31348b0910I962a6290A32680o3092
16000F9588f0277D1671J68900i1523E958b86588A81125a07067A32290a52174p528
15989a59702l7930B75059D142J78950b12032B2646K991a56168d20B96689c76152
15977E8014P8053a754B03466b84519g2303A0163g9583B61959a30873B25101J7141
15966B42242J02218J6476J49932B33292e8679B0332J50663D3889e32586A12567
15955C60101c21592J5908B09759d2463H4140g743q0825o1238c9831D9836g2138
15943a68406A69413J0372j2760H2238M4855d3031I7085K95486a685k34675A1081
15931A21203C0028P6664n1862c97336B17789F7186h486F6501b73005E13J89971
$$ plain form
16011 -169958 -148615 -189557 223084 34281 69138 -131348 -20910 9962 -16290 132680 69588
16000 69588 -60277 41671 210571 -91523 5958 -286588 181125 -107067 132290 -152174 -159702
15989 -159702 -197632 275059 4142 183092 -212032 22646 25637 -156168 -420 296689 -376152
15977 58014 136067 -1754 203466 -284519 -72303 10163 -79583 261959 -130873 225101 242242
15966 242242 344460 360936 510868 233292 -58679 20332 170995 43889 -532586 112567
15955 360101 -321592 -305684 209759 -42463 84140 -7743 -88568 -149806 -39831 49836 -72138
15943 -168406 169413 179785 167025 82238 127093 -43031 97085 392571 -1685 -236360 11081
15931 121203 30028 106692 54830 -397336 217789 67186 -8486 66501 -273005 513 190484
15920A90484f9353B18236a62600k0264B0694c49278N8195P9811M6239I8068k3465
15909G4603b06959C8002i9854C6667H669J48984n2744l8453J78808D9062c1815
15897b9237G0809a99828q9616f2222J201k40356b9203A50189a00999B20439c05499
15885E4051c9778k67737m187R2392A68938R9486c865r5121l01590h1992A48791
15873e1400j9135G4103J74365m3433j8179J0556b00076A60233a20490j35129L3202
15862b22417B16648R7577A39888b44425L5133j6095J09345j55546b9352j06974
15852a36326j81912J29465J528j10042A09488a25414j07829J15198j1104M7474
15842h1675K9592A64102b11217J8600A96685B4684d01705F778a24895A73464i4268
$$ plain form
15920 190484 -69353 218236 -162600 -182864 20694 -349278 -291083 -211272 -165033 98068 74603
15909 74603 -206959 38002 -99854 36667 8669 157653 104909 66456 245264 49062 -31815
15897 -29237 70809 -199828 -289444 -62222 -61021 -301377 -29203 150189 -100999 220439 -305499
15885 54051 -39778 -307515 -311702 -219310 168938 268424 -3865 -98986 -400576 -81992 148791
15873 -51400 -70535 74103 248468 205035 186856 197412 -200076 160233 -120490 -255619 -222417
15862 -222417 216648 314225 139888 -244425 -209292 -225387 -116042 -271588 -29352 -136326
15852 -136326 -318238 -188773 -187245 -297287 109488 -125414 -233243 -118045 -129149 -81675
15842 -81675 -52083 164102 -211217 -192617 196685 24684 -401705 6778 -124895 173464 -94268
15830a14401j16386i9464o774j36113B69525G4d27712a31594d3400B12541L803
15819B16344E9706a74392A12057J83923b06916p355B01506b06005j0422N99G6056
15807b96357F1329a98911h7064n3779k47617a57232l1034C3861N6979d49310a02719
15795c37854a21929d760j43442L9946A73674b5632B0898r011g360k26919A32118
15783i1310C51722b00326b2491k50920A03231B9642d0006k35360J04851M1889
15773a28626C4643O6370e4276k30067d3184C51298c82599J24864h9783k18002
15763c07785E32a70952A64620k7651a23168C8812I339O2491K45360F3252a05083
15751F6692P6094d8906j18092A13011G134a93331L2792K2767j66130j4372g9100
$$ plain form
15830 -114401 -230787 -99464 -106238 -242351 269525 74 -427712 -131594 -43400 212541 216344
15819 216344 59706 -174392 112057 295980 -206916 -214271 201506 -206005 -216427 -215828 76056
15807 -296357 61329 -198911 -87064 -140843 -388460 -157232 -188266 33861 90840 -449310 -102719
15795 -337854 -121929 -4760 -148202 -108256 173674 -25632 20898 11887 -7360 -234279 132118
15783 -91310 351722 -200326 -22491 -273411 103231 29642 -40006 -275366 -170515 -128626
15773 -128626 34643 101013 -54276 -284343 -43184 351298 -382599 -257735 -89783 -307785
15763 -307785 532 -170952 164620 136969 -123168 38812 9339 71830 317190 63252 -105083
15751 66692 142786 -48906 -166998 113011 7134 -193331 -160539 -137772 -303902 -318274 -79100
15739h207C3155b34753h2640B3037a59500f5923j01461I3293N7413a50309j79745
15728c30054p8600d5774A2128L4059B2532N1360a1688A76139m0765D6120R2555
15717A38675i8164A49568i4307A35473O8854B6420J63036a15697m03597e834A30866
15705c23122j8205O5607b8074j98998i0886o8270D1554J96525c76672J3819N3401
15694c09452A07031m4621a21945J8868d5724m9805B1213a14388L4736C1224a61009
15682C5808d40035A08065l9031A6569E52a39954l6371P594r7317i0286I894b04527
15669A43365a67338g1849a9889m64270i801C7475J69182F8696a73179P9954D9880
15657A35542D7397J11904a5951C43116A40937J13498E6830M0617f9861A09670
$$ plain form
15739 -8207 33155 -234753 -82640 23037 -159500 -65923 -167384 93293 150706 -150309 -330054
15728 -330054 -408654 -45774 12128 46187 22532 73892 -11688 176139 135374 46120 138675
15717 138675 -98164 149568 -94307 135473 204327 26420 189456 -115697 -519294 -5834 130866
15705 -323122 -341327 -275720 -28074 -227072 -90886 -159156 41554 238079 -376672 -362853 -309452
15694 -309452 107031 62410 -121945 -103077 -45724 -95529 21213 -114388 -79652 31224 -161009
15682 35808 -440035 108065 69034 16569 552 -139954 -176325 -168731 -266048 -90286 9894 -204527
15669 143365 -167338 -71849 -19889 -484159 -9801 37475 206657 68696 -173179 -93225 49880
15657 135542 47397 159301 -15951 343116 140937 254435 56830 97447 -69861 109670
15646g3860F8973M1097a963A80407A3317f0331k36175e0r9262D2930a84244A80984
15633d7042k02015J05086A96852e6105l26886a02865n3334c6791k17477N1772
15623b02496P3795H8423a56384B33592h6420q2940G868b37414A1645j011k209
15612H425i61r927k02862N6401l37877a66645p967O4202A64239a07413j86156
15601b93569h6271r4280J1733F2158g7150B86110a8159G4931O4324M5203j5509
15590A68949H814K44253a86073N7002B119J58673g3928k73054g73j49759A59845
15578b09525F0990e7283C00422C1294a7550A65933a31375A05810a13861H6275
15567a18367A8604K04576A04293L00106A09312e8887J4981k7048j20548B01350
$$ plain form
15646 -73860 68973 110070 -1963 180407 13317 -60331 -296506 -50 -99312 42930 -184244 180984
15633 -47042 -249057 -143971 196852 -56105 -382991 -102865 -156199 -36791 -254268 -202496
15623 -202496 -128701 88423 -156384 233592 -86420 -169360 7868 -237414 11645 10634 8425
15612 8425 -961 -10888 -213750 -157349 -495226 -166645 -174612 -110410 164239 -107413 -293569
15601 -293569 -86271 -180551 -168818 62158 -77150 286110 -18159 74931 139255 184458 168949
15590 168949 8814 253067 -186073 -129071 2119 160792 -73928 -346982 -773 -150532 159845
15578 -209525 60990 -57283 300422 31294 -17550 165933 -131375 105810 -113861 86275
15567 -118367 18604 223180 104293 404399 109312 -58887 -43906 -70954 -191502 201350
15556A71331a1287p7560K6316k18540J06656N208G7340a4548C35752f178m0074
15545d6252A64409o9929m0497K9877a98449E087f7345k38084i6558C50492G0741
15533C4302c2135A58124a44240e2650C15121b45011J20161A47758e7580B56919
15522c9429A6428b5649j32088j13609G5742J8340K4792a94164M521j4106K6112
15511a77637j01370A05030c33634Q2340a14261D2125f2894J0380m4689A75950
15500b39555A19138j6318c13791d8171C55714f1910C80684e4025D9650C334L21138
15489C24472k2657a86729D54662b20905A76512n3117a12271J8190C12261E5693
15478a18601e6024j42020B24367H531K38698g2480k18663A27174j8651b46851
$$ plain form
15556 171331 -11287 -88847 -62531 -281071 -174415 -169207 77340 -14548 335752 -6178 -46252
15545 -46252 164409 94480 53983 83860 -198449 5087 -67345 -305429 -96558 350492 70741
15533 34302 -32135 158124 -144240 -52650 315121 -245011 -124850 147758 -57580 256919
15522 -39429 16428 -25649 -157737 -271346 75742 94082 118874 -194164 -189643 -203749 -177637
15511 -177637 -279007 105030 -333634 -251294 -114261 42125 -62894 -52514 -97203 175950
15500 -239555 119138 102820 -313791 -48171 355714 -61910 380684 -54025 49650 3334 324472
15489 324472 301815 -186729 454662 -220905 176512 123395 -112271 -94081 312261 55693
15478 -118601 -56024 -198044 224367 8531 247229 -72480 -291143 127174 108523 -246851
15467c42600A07240A5673P2737J48393K19164A39702f2616q6D7772f3046f751
15455a37919l0573j23038G7296i9622d1335j94091H8596K93807a44581A11431
15444A26175L35708b99165B77990D604N4385K68149b34918M7771B53154E4644
15433a62416N4076B2596d7071A8336b96100B65613h2477j23898I8377a95181b1895
15421a49960G9323c4094k5136A38127K4074g6810m585A90724f0934p8549b6799
15409H9862i2791o435n199r3215E7503b58960E0003a65491G5627r983b9852A39114
15396I6676c22678E9739a20748d7469o9188K939b8232J423C10116f0948b2531
15384H3593c25005K6093A36447a62574b466k41625d3920k23807a1670B00426b88321
$$ plain form
15467 -342600 107240 15673 88410 236803 455967 139702 -62616 -62702 47772 -63046 -6751
15455 -137919 -168492 -291530 77296 -99622 -41335 -235426 88596 382403 -144581 111431
15444 126175 461883 -299165 277990 4604 58989 327138 -234918 -187147 253154 54644
15433 -162416 -108340 22596 -47071 18336 -296100 265613 -82477 -206375 98377 -195181 -21895
15421 -149960 79323 -34094 -59230 138127 162201 -76810 -81395 190724 -60934 -139483 -26799
15409 89862 -92791 -99226 -104425 -197640 57503 -258960 50003 -165491 75627 65644 -29852 139114
15396 96676 -322678 59739 -120748 -47469 -116657 -113718 -28232 -26809 310116 -60948 -22531
15384 83593 -325005 -298912 136447 -162574 -2466 -244091 -43920 -267727 -11670 200426 -288321
15372B57785C6386Q9127b30323A14952C1572a12870K4033m4961C2784e6799H6942
15360F8342a14654M4048e579B73931b02201r4038J46610C7416a28834a120j49411
15349a50531H5476k9318L9833O7046c00174C5391R7329c65213a12691N0871B82654
15337B7991c27666a35708A05467a09403C37743C3164b5265A10967a2058B2988
15326b10789O1032A62640n9394c55369A78165b53493A43974k4015J31765c35444
15315b65539B44933f143j01095B22502I5847N699j1992m0322i006C02937A31217
15303A45589O8089b49706f9128C952J91466i9113c909A33138J05815g3255k61900
15292c35155b4898B6960a84584B64450h4276B28434M5387J40647A93828E7332
$$ plain form
15372 257785 36386 125513 -230323 114952 31572 -112870 -88837 -133798 32784 -56799 86942
15360 68342 -114654 -70606 -5579 273931 -202201 -296239 -149629 37416 -128834 -1120 -150531
15349 -150531 85476 56158 95991 163037 -300174 35391 132720 -365213 -112691 -61820 282654
15337 27991 -327666 -135708 105467 -109403 337743 33164 -25265 110967 -12058 22988
15326 -210789 -149757 162640 103246 -355369 178165 -253493 143974 119959 251724 -335444
15315 -265539 244933 -6143 -107238 222502 95847 101546 89554 49232 -9006 302937 131217
15303 145589 213678 -249706 -69128 3952 195418 -99113 -3909 133138 238953 -73255 -335155
15292 -335155 -24898 26960 -184584 264450 -84276 228434 273821 414468 193828 57332
15281B59531C2333d5040o8207g497E1787a81915A67538e3323C01371a91707F433
15269a91216B07612o3152N0764E3264K0209J04229b10774i4322B2780b1799A2062
15257C70442A15349J48620N0858A49346n3657K07610B2006J55994a07236D4290
15246E1727k3526K31779a44867O6194B49233K08532F7643M19356j17865b5176
15235B81854J39846R2590L77235Q25069p9220n0800m78443j06967m13873k65424
15225C21867a14648A79431h6279F5469K57880q6792k4202c2281C90716F1090k6004
15214C5086J68663n3868Q481n0632N0683F1024b3800A15995D1827P2175a06550
15202A90781a11990M049C89754C2391J66965K4462C4149J60649C8239N9488e5418
$$ plain form
15281 259531 32333 -45040 -113247 -7497 51787 -181915 167538 -53323 301371 -191707 6433
15269 -191216 207612 144460 195224 53264 73473 177702 -210774 -94322 22780 -21799 12062
15257 370442 115349 263969 314827 149346 95689 303299 22006 178000 -107236 44290
15246 51727 28201 259980 -144867 -78673 249233 457765 67643 486999 369134 -25176
15235 281854 421700 514290 891525 1716594 1637374 1586574 1108131 1001164 587291 321867
15225 321867 -114648 179431 -86279 65469 323349 236557 212355 -32281 390716 61090 35086
15214 35086 203749 149881 158362 107730 158413 61024 -23800 115995 41827 114002 -106550
15202 190781 -111990 -107941 389754 32391 199356 223818 34149 194798 38239 97727 -55418
15190e0466j72931C00719a69806c7163H5482R9360p3842l4350h6025B5823J07008
15179A32831k9918Q495a2771F4216C0169J16902O9954F6690a2717A76732m9242
15168A27490M4244P2406C798L4418M8136K31978C4303J0903a17056B09489E6481
15156a35830B42573J62323i8180A34434J01378A01972a26871K9930A14846J36948
15146B51794m1840q3836E7422a95436A86985r1521b74932a5309k7305B93075a56159
15134B33226J06572D8938J486K41271I8109d5042l02863h4851B34894r6684K03921
15123C42131d0802A20957m7177a81088A20519D218J24445o1446J25944H1162a21929
15111a44737B09664l4877L7509A05739j1397J4907O3030J16763o2268e0685C25269
$$ plain form
15190 -50466 -223397 300719 -169806 -37163 85482 184842 111000 76650 -86025 25823 132831
15179 132831 102913 111408 -12771 64216 30169 147071 217025 66690 -12717 176732 127490
15168 127490 171734 244140 3798 38216 86352 318330 34303 45206 -117056 209489 56481
15156 -135830 242573 404896 -98180 134434 235812 101972 -126871 -96941 114846 251794
15146 251794 209954 126118 57422 -195436 186985 95464 -274932 -15309 -42614 293075 -156159
15134 233226 339798 48938 50424 291695 98109 -45042 -347905 -84851 234894 138210 342131
15123 342131 -40802 120957 73780 -181088 120519 4218 128663 67217 193161 81162 -121929
15111 -144737 209664 174787 212296 105739 94342 109249 172279 289042 226774 -50685 325269
15099G8728L1712e7380A10136N8273J4725a07k7848p5139A92675H7748L10979
15088C98727a14862e4613i996k3564E043J43770J83A8044J76540E8056a17988
15076b88108H4717E114J14951L9930A8394J57724b5426B43644a81060D1276g4666
15064B37921I1055d9882E13356G3128b45883C68730J07835A91462J93248b78347
15053b09965A33561J12264c3190G6922M9836I441O4577O6727A8847L03221J2937
15042C35005A54338p4627A0499J84088r0843K6974P241j3936J60995p4991N9886
15031B69913p0815O8466b75168A0453J50912e8255B74030k1800l4501A8770d4473
15019B0845J19945b30973H2993J97764B1800L55458j32133d566B65146l36O9696
$$ plain form
15099 78728 110440 -57380 110136 168409 183134 -107 -27955 -103094 192675 87748 398727
15088 398727 -114862 -54613 -9996 -33560 5043 148813 148996 18044 194584 58056 -117988
15076 -288108 84717 5114 120065 159995 18394 176118 -25426 243644 -181060 41276 -74666
15064 237921 91055 -49882 513356 73128 -245883 368730 476565 191462 384710 -278347
15053 -209965 133561 245825 -33190 76922 126758 9441 74018 140745 18847 322068 335005
15042 335005 154338 79711 10499 194587 103744 130718 137959 124023 285018 210027 269913
15031 269913 199098 267564 -275168 10453 161365 -58255 274030 252230 217729 18770 -44473
15019 20845 140790 -230973 82993 280757 21800 377258 245125 -4566 265146 264810 334506
15008C34506i800A01896K48133A8803J93094r5655K94781j600q7197l2869A6451
14996A02416K1741J58913a51225C9058L2333J70387b1083A23441A5904O0019M84374
14985E60297E3403J01929K06498N7773p6272r864A25791K89299j51313J09462
14975C73239J33898j41290o3422l7522J11954J11284B00291a21555o6856a391
14964B04914J66916A00215Q498E3628A3482O06236l08430q0825J9413D6895L78675
14953D25570j55917I9241M30467B27579J28511A2930K23161Q7568l2650A34744
14942A47699P504N6281o8317J32182o7097O9951K23494J5265D4414M45640A57791
14930F15112j30895j6768A77156J11794K4665J0686m089j43811K90863j0226n2791
$$ plain form
15008 334506 -9800 101896 350029 18803 211897 116242 411023 409423 322226 289357 16451
14996 102416 124157 283070 -151225 39058 71391 241778 -21083 123441 15904 75923 560297
14985 560297 53403 155332 361830 419603 343331 333467 125791 415090 263777 373239
14975 373239 507137 365847 302425 264903 376857 488141 200291 -121555 -188411 -1391
14964 204914 371830 100215 108713 53628 13482 619718 311288 230463 249876 46895 425570
14953 425570 269653 99241 529708 227579 356090 12930 236091 323659 291009 134744
14942 147699 155203 211484 143167 275349 208252 278203 501697 516962 44414 490054 157791
14930 615112 484217 467449 177156 288950 313615 324301 320212 176401 467264 457038 404247
14919D04247n9853D6064K47457I2824J05573K54789o7946n8137A59433L38970
14909D98403Q0908k14799o8273K21887j48044O9618J26690k79803J47852L66758
14899H01197A75900F6222B2504N03148B28971m5176J17987Q6662M0892j15332
14889C14004p2596K83921A99140K45653j32943K0842L0128C7705K28962M5394
14879C12061M4078J43973k05179D5130L02525j05790J7580J48175A36993J72902
14869C09895Q9058A42800K53420K7729A65827J05254r8850L26058j97039J47056
14859D48306o0811n5862A43917L40161A65818K55305j04586Q0762j56157R8986
14849C40128q7074J80560a10984A46118M04636B44560E7285J54464L06160m8644
$$ plain form
14919 404247 344394 46064 293521 92824 198397 453186 385240 327103 159433 498403
14909 498403 579311 364512 296239 518126 370082 439700 566390 286587 434439 801197
14899 801197 175900 66222 22504 525652 228971 183795 301782 388444 429336 314004
14889 314004 241408 525329 199140 444793 311850 332692 362820 37705 266667 312061
14879 312061 356139 500112 294933 45130 347655 241865 259445 407620 136993 309895
14869 309895 398953 142800 396220 423949 165827 271081 172231 498289 301250 448306
14859 448306 387495 331633 143917 484078 165818 421123 316537 397299 241142 340128
14849 340128 253054 433614 -110984 146118 550754 244560 57285 211749 517909 469265
14839D69265n4897n5206p263r5445K49576k41330K7249R0111M8642J45689A02414
14827D28291o3635O3711j11380m2061J59652j1848K20384l05717Q7987p7299L52914
14816G00999j68250A90581K42287L82931m01307k6430Q2718j38857K14586Q0121
14806F26630C07308L02223j18204N6113B59102n703J39249j4494n6367M61044
14796G82831k55635n0750J8175M9702j86382A66071K51358A61512O0825L34920
14786E57257l6588k50181K72247J12461p7522j37014M4711J01666n1642J71895
14776G07290M2877O8821B92698L22278m1853k13436N2959M1063P41781m44411
14766G51079j10278j48955J07973p0402K60640l55284m5708L44718m3149C29750
$$ plain form
14839 469265 414368 359162 351899 256454 506030 264700 291949 382060 430702 576391 102414
14827 428291 364656 428367 316987 274926 434578 422730 643114 337397 425384 348085 700999
14816 700999 532749 190581 432868 815799 414492 388062 470780 331923 546509 626630
14806 626630 307308 609531 491327 547440 259102 253399 392648 378154 321787 782831
14796 782831 527196 476446 494621 544323 357941 166071 417429 161512 222337 557257
14786 557257 520669 270488 542735 655196 577674 440660 485371 587037 535395 707290
14776 707290 750167 818988 292698 614976 573123 359687 412646 453709 1195490 751079
14766 751079 640801 491846 599819 529417 790057 434773 389065 733783 690634 329750
14755D70096K20819K0955p2905j40784K26925l44901L3033J9598k8797q6877Q1804
14744C98966J77142q0275L68986k54051j2131j01619K39068J63667K63672j41153
14734A022272l44997p5373L65026l98205K83489j50001P1861M7970R256k93060
14724E38238j31160K71981C25829J96943J70994k52922M06334N4373J2761m31357
14714D82955N43285k02849j30860K37276j66999P7839l25863J91450j85528J40490
14704F61196N60277j66180k17044J47220j05734k54662K67966p7500j41761K13239
14694H87017j46056P4651n6152J40819j68741J82687j80361P4535Q3576K00185
14684A092160l48532K57945j98913O9246k19442K89077q0662q9030K40877k65839
$$ plain form
14755 470096 690915 711870 638965 498181 725106 380205 413238 432836 404039 317162 398966
14744 398966 576108 495833 864819 610768 598637 497018 736086 899753 1163425 1022272
14734 1022272 677275 601902 966928 568723 852212 702211 774072 822042 831298 538238
14724 538238 407078 679059 325829 522772 693766 440844 847178 901551 914312 482955
14714 482955 1026240 823391 692531 929807 762808 840647 514784 706234 520706 661196
14704 661196 1221473 1055293 838249 985469 879735 625073 893039 815539 673778 887017
14694 887017 740961 815612 759460 900279 731538 914225 733864 808399 891975 1092160
14684 1092160 743628 1001573 802660 871906 652464 941541 860879 771849 1012726 746887
14674G46887J92675M0261J58720l40982M4443J69753j30668K96324M6994l12809
14664I11598J22238j2056j27834p6097J51507J27777r1822K00361j85233j15679
14654I04760K01087o2024k8334k57191Q7864L0833M19534k92637j17402K63162
14644A149652q8702j26477k25005K18681M46590k06297p7524J71065k40347J84286
14634A205922l60208K14975M23321n0088l25256K3522j77438L04248L0230J6095
14624A305323l262N3264R633k5397M7573j77012J14486r8175j91169J04660K25048
14613A364972p8347j64038L93007j68534J76412k13138n7450J33708K49369l05533
14603A330428k13663K55777P6108J19381J19684k91924K9433J27708K355o6529
$$ plain form
14674 746887 939562 979823 1138543 797561 842004 1011757 881089 1177413 1224407 911598
14664 911598 1033836 1021780 893946 817849 969356 1097133 1005311 1205672 1020439 904760
14654 904760 1105847 1043823 1015489 758298 846162 876995 1296529 1003892 886490 1149652
14644 1149652 1060950 934473 709468 928149 1374739 1168442 1090918 1261983 1021636 1205922
14634 1205922 845714 1060689 1484010 1433922 1108666 1132188 954750 1258998 1289228 1305323
14624 1305323 1302061 1355325 1364958 1339561 1387134 1210122 1324608 1226433 1035264 1139924 1364972
14613 1364972 1286625 1122587 1515594 1347060 1523472 1310334 1252884 1386592 1635961 1330428
14603 1330428 1116765 1372542 1448650 1568031 1687715 1395791 1425224 1552932 1555287 1488758
14593A488758J59441k45539L72945j38702j13509J48236P2546j14900O2493k6131
14583A665638j0491K18859m80851N35427q2636j52961L9146L25472n0544K1851
14573B028910j075k53444j43023J83414j21203J68989K21935k01054J17212j43029
14563A857632K41866J03928k28771K70833L05783j82890j57572J52545o128K7954
14553B385180Q6258L73813k32434J63107j20138m418J65063J45513O0151J78435
14543C200530K596L59630N08821L1626O63102M67030L39934J204844J601054K605316
14533A0984483L624826O174811P596092o12523r087254n024074m520912l405668
14525E729781j196843p98257n82864o64901L81792o29322K04799L64501J5527
$$ plain form
14593 1488758 1648199 1402660 1775605 1636903 1523394 1671630 1744176 1629276 1691769 1665638
14583 1665638 1655147 1874006 1393155 1928582 1845946 1692985 1732131 2057603 2007059 2028910
14573 2028910 2027835 1774391 1631368 1814782 1693579 1862568 2084503 1883449 2000661 1857632
14563 1857632 2099498 2203426 1974655 2245488 2551271 2368381 2210809 2363354 2357226 2385180
14553 2385180 2471438 2845251 2612817 2775924 2655786 2651368 2816431 2961944 3022095 3200530
14543 3200530 3203126 3562756 4071577 4103203 4766305 5233335 5573269 6778113 8379167 10984483
14533 10984483 14609309 20784120 28380212 27767689 18680435 13656361 9135449 5729781
14525 5729781 4532938 3734681 3151817 2486916 2868708 2239386 2444185 2808686 2824213
14516B824213q24336M87896j70099j17103L57182j84346k80817L02436P7267k18845
14506B253448L61549k48008M88204K7330j12515J7245k73806K04607N624N1093
14496B774771o0430L54131q9549k48353J22589J58080M4582n8073N6978Q5965
14486C140691M0649k70026M18557J83J8861J01090k14981L01967j02261K46289
14476C681019j6712K70511k72763P02K66269n06289L68505k11447L68080p1483
14466C876392L02790m13327N88437n01191K94758M17015l29292j24761M88670
14457D599491O5004m23321J02520j6435L43663k92536L22708p3000L01727N6338
14447D986159p5398o7971j10790L13173k4853L23074j94444J85708P6574L85474
$$ plain form
14516 2824213 1999877 2487773 2317674 2200571 2557753 2373407 2092590 2395026 2472293 2253448
14506 2253448 2614997 2366989 2855193 2882523 2770008 2787253 2513447 2718054 2723678 2774771
14496 2774771 2714341 3068472 2978923 2730570 2853159 3011239 3055821 2997748 3054726 3140691
14486 3140691 3181340 2911314 3329871 3330054 3348915 3450005 3235024 3536991 3434730 3681019
14476 3681019 3664307 3934818 3662055 3662757 3929026 3422737 3791242 3579795 3947875 3876392
14466 3876392 4179182 3765855 4354292 3853101 4147859 4564874 4235582 4110821 4599491
14457 4599491 4664495 4241174 4343694 4327259 4670922 4378386 4701094 4628094 4929821 4986159
14447 4986159 4910761 4842790 4732000 5045173 5020320 5343394 5148950 5334658 5411232 5796706
14437E796706m17723N64002l54365L24790j42809o7937L97913k16824J21107J42870
14427F147730j58900L33323j43122M22397l96185L73199J88075J16793n7172K32094
14417G058232J63220J29081l89207J07639K87755J04919L44289l1373J71416K10247
14407H156218k60320M08548r8429K74788j67329L88574K86658K14490k83901M98742
14397I418039j45039j0243M75795J16963J74262k607J9997M02538J13178j9693
14387A0543190L94790J96486J52449J27715p193M42101k65544O51994J01488N49863
14377A2887339j2041Q1278J06966K79458N92187j67381N41093j01455O35066J38412
14367A4980922M09820K0139N53626M71400p2388K16301M82821L55815M71643L56309
$$ plain form
14437 5796706 5378983 5942985 5588620 5913410 5770601 5702664 6100577 5883753 6004860 6147730
14427 6147730 5988830 6322153 6179031 6601428 6205243 6578442 6766517 6883310 6826138 7058232
14417 7058232 7221452 7350533 6961326 7068965 7356720 7461639 7805928 7774555 7945971 8156218
14407 8156218 7895898 8304446 8206017 8480805 8313476 8702050 8988708 9203198 8919297 9418039
14397 9418039 9273000 9262757 9738552 9855515 10029777 10027170 10047167 10449705 10562883 10543190
14387 10543190 10937980 11134466 11286915 11414630 11407437 11849538 11583994 12235988 12337476 12887339
14377 12887339 12875298 12956576 13063542 13343000 13935187 13767806 14308899 14207444 14842510 14980922
14367 14980922 15390742 15410881 15964507 16435907 16363519 16579820 17062641 17418456 17890099 18246408
14357A8246408J14814P20168K18082M75866J19075P23815M61593K44215N33884
14348B1857920M2541Q16458L99072M61586P43350L09147Q55587L89848O01880
14339B6477389R93345K35128O59360J109572O61690N64219Q70282O86822R82385
14330C3240192J049513P30158Q89867J021071P11729J409940R84115R40893J348391
14321D2325869J070909J437534J099037J826761J239873J596928J643613J760599
14313E4001123J106934K339958J872014J875774K054786K082483K258113K207658
14305F9798843K574811K715483K232416L008940L577815K832359L499423L379366
14297I3619456M101267L593607M128290M667642M493988M978406M860705N290854
$$ plain form
14357 18246408 18361222 19081390 19299472 19775338 19894413 20618228 21079821 21324036 21857920
14348 21857920 21900461 22716919 23115991 23577577 24320927 24630074 25485661 25875509 26477389
14339 26477389 27470734 27705862 28365222 29474794 30136484 30700703 31570985 32257807 33240192
14330 33240192 34289705 35019863 35909730 36930801 37642530 39052470 40036585 40977478 42325869
14321 42325869 43396778 44834312 45933349 47760110 48999983 50596911 52240524 54001123
14313 54001123 55108057 57448015 59320029 61195803 63250589 65333072 67591185 69798843
14305 69798843 72373654 75089137 77321553 80330493 83908308 86740667 90240090 93619456
14297 93619456 97720723 101314330 105442620 110110262 114604250 119582656 124443361 129734215
14289A29734215N977301N888407O578678O471470P291007P439343Q329854Q115801
14281A85826076Q853644R642827R691487J0268816J0753578J1690993J1905531
14274B58632952J2551856J3139632J3406878J3639443J4094700J3744560J3643150
14267C52853171J3040849J2561848J2064303J1246638R906219Q833582P802742
14260D28309352O823305N782612L315879J529172P77887J428688j660977o203917
14252D40102001n530962p199104j0136605r779629j0653443j1032107j2438335
14245C73331816j3121876j3246882j3579221j3334136j2717975j3297299j2695013
14238B81339414j2338210j2742458j2338395j2025728j1172154j1168810j0740335
$$ plain form
14289 129734215 135711516 141599923 148178601 154650071 161941078 169380421 177710275 185826076
14281 185826076 194679720 204322547 214014034 224282850 235036428 246727421 258632952
14274 258632952 271184808 284324440 297731318 311370761 325465461 339210021 352853171
14267 352853171 365894020 378455868 390520171 401766809 411673028 420506610 428309352
14260 428309352 435132657 440915269 444231148 445760320 446538207 447966895 446305918 440102001
14252 440102001 434571039 427371935 417235330 407455701 396802258 385770151 373331816
14245 373331816 360209940 346963058 333383837 320049701 307331726 294034427 281339414
14238 281339414 269001204 256258746 243920351 231894623 220722469 209553659 198813324
14231A98813324j0002736r392749q683330q131118p491531p464819p056090o007312
14223A34583639o147117n449600n293639m711268n159091m328914m104741l588355
14215I5800914l943401l716251l576952l003167k967290k896948k851448k313889
14207G0531568k259051k646107j840398k202755k351854j767256j908801j889030
14199E3666316j319638j672152j408847j639577j312567r54910j144885j396181
14191D2817559r73357j655884q09041j120379j290926n68890q03351j246751r26821
14182C3422159p14145r41064p37503q03509l95163r44466p78976m00929q84896
14173B6821508r83976j28268n92850o15568o91404m77271n79405o32770l70769
$$ plain form
14231 198813324 188810588 179417839 170734509 162603391 155111860 147647041 140590951 134583639
14223 134583639 128436522 122986922 117693283 112982015 107822924 103494010 99389269 95800914
14215 95800914 91857513 88141262 84564310 81561143 78593853 75696905 72845457 70531568
14207 70531568 68272517 65626410 63786012 61583257 59231403 57464147 55555346 53666316
14199 53666316 52346678 50674526 49265679 47626102 46313535 45358625 44213740 42817559
14191 42817559 41844202 40188318 39379277 38258898 36967972 36399082 35595731 34348980 33422159
14182 33422159 32708014 31766950 31029447 30225938 29830775 28886309 28107333 27706404 26821508
14173 26821508 25837532 25709264 25116414 24500846 23809442 23332171 22752766 22119996 21749227
14164B1749227m81903j73449j034179L89753r05332j12705o66394j75482l80631
14155A8208905n31852m6761k40548n95721n74076k43028J41997m00530k59973
14146A5458413k69314R3832p23687J1862o43348J31956l29687k07195j18353n25541
14136A2878938j60893k14872j73875J99622m06404m37059J73822l16770l85727
14127A1156782j10202J51166m82068k49632J46887k33356l99115q709k61626m66327
14117I243800N75927l38372Q1276n61991J32869k16729J56760o97347N37174p85428
14107H127939K72697j77450j57343J93204l54558j2539R9348l70416L4726j89982
14097G465626j52132M6802l41207j26955o5292P5629P927l09904j22823K92010
$$ plain form
14164 21749227 21267324 21093875 20059696 20449449 19544117 19431412 18765018 18589536 18208905
14155 18208905 17677053 17630292 17389744 16794023 16219947 15976919 16118916 15718386 15458413
14146 15458413 15189099 15282931 14559244 14571106 13927758 14059714 13730027 13522832 13404479 12878938
14136 12878938 12718045 12503173 12329298 12528920 12122516 11685457 11859279 11542509 11156782
14127 11156782 11046580 11197746 10715678 10466046 10612933 10379577 9980462 9971753 9710127 9243800
14117 9243800 9819727 9481355 9562631 9000640 9133509 8916780 9073540 8376193 8913367 8127939
14107 8127939 8400636 8223186 8065843 8259047 7904489 7891950 7991298 7620882 7655608 7465626
14097 7465626 7313494 7360296 7019089 6892134 6826842 6902471 6910398 6600494 6477671 6769681
14087F769681m26754J74633j09796M415J32987m50698l01977J76139N8493j95107
14077E832016M0709K8465k83816r3911R5515q1739q3736k88O4316l71695J20884
14066E266720j25178j16971J70800j43256R6369j30708l49736K59907r6669J44792
14056D976070l20463j22582N3690k38010J07454j33480m6343K44935l8184p9787
14046D403300l43882O0893J68852k42917J84862l89527j6917j45581j00051O5843
14036C644875P0383j80723J70720P8717K95306j90888n6508j74319J10872k00656
14026C567779j31875j18725p8188J30062j40532J50879j99473K55003k34830n2116
14016C147984l6248J69554j1526P9747j18542M0044q99k61349m02712J50916L80005
$$ plain form
14087 6769681 6342927 6517560 6407764 6412179 6545166 6094468 5792491 5968630 6027123 5832016
14077 5832016 5872725 5901190 5617374 5523463 5618978 5537239 5453503 5453215 5517531 5145836 5266720
14066 5266720 5141542 5024571 5195371 5052115 5148484 5017776 4668040 4927947 4831278 4976070
14056 4976070 4655607 4533025 4586715 4348705 4456159 4322679 4276336 4521271 4483087 4403300
14046 4403300 4059418 4120311 4289163 4046246 4231108 3841581 3824664 3679083 3579032 3644875
14036 3644875 3715258 3534535 3705255 3783972 4079278 3888390 3831882 3657563 3768435 3567779
14026 3567779 3435904 3317179 3238991 3369053 3228521 3379400 3179927 3434930 3200100 3147984
14016 3147984 3111736 3281290 3269764 3349511 3230969 3271013 3270114 3008765 2606053 2756969 3136974
14005C136974k75185k9847j77808L26595j58358j09273j02016k52469K31475k8821
13995B561267J16905j88870K28225m24052K02483K57130o72809L50806J20555
13986B551640R806J4129p9810M21509j97881O316N8410L45585K52552M49822P02857
13975D534935R90336J932563L288494N765939Q321344L333364p867541n968197
13967A4331237l869963k745280j185618j241990m40883m12981q21896K7018k47876
13958C391768m10455N28844q25843o0032Q8182k05142P507J68880q3829J8647
13948B618527m45580J53540P3418j61865j2447p4610L14937m53628M24980k88494
13938B148778j34712P4686l05249M32232l65343M89906l49370k34903J56482J80566
$$ plain form
14005 3136974 2861789 2831942 2654134 2980729 2822371 2713098 2611082 2358613 2590088 2561267
13995 2561267 2678172 2489302 2717527 2293475 2495958 2753088 2080279 2431085 2551640
13986 2551640 2561446 2575575 2495765 2917274 2719393 2725709 2784119 3129704 3382256 3832078 4534935
13975 4534935 5525271 7457834 10746328 16512267 24833611 28166975 20299434 14331237
13967 14331237 10461274 7715994 6530376 5288386 4847503 4434522 3612626 3639644 3391768
13958 3391768 2981313 3510157 2684314 2624282 2712464 2507322 2514829 2683709 2599880 2618527
13948 2618527 2172947 2326487 2399905 2238040 2225593 2150983 2465920 2012292 2437272 2148778
13938 2148778 2014066 2088752 1783503 2215735 1850392 2340298 1990928 1756025 1912507 2093073
13928B093073k99629k1417M04802m01560J63583j15923j51709k77987O80529k83432
13918A790330K7949o9297k8951N3840J06732m8145J45840k34269J68252j76874
13908A735407Q6287k54880q7095Q2089k25841J65739q1915p5492K81058k34510
13898A390847M35155k22238J85729l39395K14179j01558j72948K55192k78538
13889A366425R1574J81514Q765P909k74775J48337k79030J89361R8638P8817J58033
13878A775568m67348q1154J36524j69970L03785n3450j42293j35079j05499K89595
13868A350679k52719n470l6884j67723K98671J08178J59615r2634k51870N40237
13858A650080k63190m01205n6754K58567j54853J9052M57491j93359q3690J41709
$$ plain form
13928 2093073 1793444 1772027 2176829 1775269 1938852 1822929 1671220 1393233 2073762 1790330
13918 1790330 1818279 1748982 1720031 1773871 1880603 1832458 1978298 1744029 1912281 1735407
13908 1735407 1821694 1566814 1479719 1561808 1335967 1501706 1419791 1344299 1625357 1390847
13898 1390847 1826002 1603764 1789493 1450098 1664277 1562719 1389771 1644963 1366425
13889 1366425 1457999 1639513 1648278 1656187 1381412 1529749 1250719 1440080 1538718 1617535 1775568
13878 1775568 1308220 1227066 1363590 1193620 1497405 1443955 1301662 1166583 1061084 1350679
13868 1350679 1097960 1092490 1055606 887883 1186554 1294732 1454347 1361713 1109843 1650080
13858 1650080 1386890 985685 928931 1187498 1032645 1051697 1509188 1315829 1232139 1373848
13848A373848l42063K26400j5204J4364m6294l37995L40755K9048r441J02564
13838A335982m09432K36641j20609p5149J55435k8436N5802k29153N4689J58035
13828A133805j14690k8151J74660O0447j24007m0051j06056L00843j92324j66425
13818H98051j13300M00426j06439k37668J99920k40200j21202K84773j31575K98883
13808A131669j83781K9894J7387L0705n0605j54130L88031k68801L6431K68869
13798A245669j00832k50925K9461J14124Q523j1495l22414P4992k61919L53263
13788H78447j08765P6427q1866N22746m00241M0134K52484n48800J39981R9807
13778H70354k20065K19751L44687k79679J22831l53742J465J94770j16941n6039
$$ plain form
13848 1373848 1031785 1258185 1242981 1257345 1211051 873056 1213811 1242859 1233418 1335982
13838 1335982 926550 1163191 1042582 967433 1122868 1094432 1150234 921081 975770 1133805
13828 1133805 1019115 990964 1165624 1226071 1102064 1062013 955957 1256800 1064476 898051
13818 898051 784751 1185177 1078738 841070 1040990 800790 679588 964361 832786 1131669
13808 1131669 947888 977782 995169 1025874 975269 821139 1209170 940369 976800 1245669
13798 1245669 1144837 893912 923373 1037497 1046020 1034525 712111 787103 525184 878447
13788 878447 769682 846109 764243 1286989 886748 926882 1179366 630566 770547 870354
13778 870354 650289 870040 1214727 935048 1057879 704137 705602 900372 783431 727392
13768G27392O8662l7338J90434j56870k11831L00717J94508o5854J1473K75361
13758A296654o25716R3857n3534j69535m79r3565L57682L1276k39681J39217K29504
13747I65680D80612N19170l88070j41959K19850L07052m16843j85326L48678k2842
13737G20322n022K4875j67251J39338j40382j7630L95927l06687n4352L5697J80834
13726H05669j06153K7827M04864l65162k00060J02009K5734j47462j03858J85184
13716F28592j01102j67858K70144K1345j66374K84911k947k72861J20146J67803
13706G81799j20603J19886C70658N92785B94293J74094q7381L41735k7244r2475
13696F03022K05936p6892Q4628j27850p548k9989M6793J85407j84374j43802Q6592
$$ plain form
13768 727392 796054 758716 949150 792280 580449 881166 1075674 1009820 1021293 1296654
13758 1296654 670938 764795 711261 541726 541247 447682 805364 836640 596959 736176 965680
13747 965680 480612 999782 611712 469753 689603 996655 579812 394486 743164 720322
13737 720322 715300 740175 572924 712262 571880 554250 950177 643490 589138 624835 805669
13726 805669 699516 727343 1132207 767045 566985 668994 694728 547266 443408 628592
13716 628592 527490 359632 629776 651121 484747 769658 766711 493850 613996 781799
13706 781799 661196 781082 370658 963443 294293 468387 381006 722741 695497 603022
13696 603022 808958 732066 816694 688844 681296 651307 698100 883507 699133 555331 641923
13685F41923j35229J51940r471r7240j38572P0289L08420A74213J81315J88024
13675E43552j48802P1122K91371l55713A67500K18870m6Q9900J37991j78440O3075
13664D98850j9376j26047J53130J3707J74418j06847j24703R8970N0263j87869
13654D24496j29153M8957l3080L63777j90882n7290K39524j90477J40889j64877
13644D51884A22409K22843c7145E27402l4022O2465Q5443J72831k25689N296J13003
13633G06729k37678M7303j17697J19675k20029j12171K59276j34275K19039p1779
13623D58393A80978K10601q658R6365A98972K12756J38576k05244L4281K92165
13613F71506j61573j61603J87067J30488k87713J93791K05557M1671B72202L59153
$$ plain form
13685 641923 506694 658634 649163 551923 413351 483640 792060 174213 355528 543552
13675 543552 394750 465872 757243 401530 167500 386370 386324 476224 614215 435775 498850
13664 498850 479474 353427 506557 520264 694682 587835 463132 562102 612365 424496
13654 424496 295343 344300 311220 674997 484115 426825 666349 475872 616761 451884
13644 451884 122409 345252 -37145 527402 493380 555845 641288 814119 588430 593726 706729
13633 706729 469051 516354 398657 518332 298303 186132 445408 311133 530172 458393
13623 458393 180978 391579 382921 479286 198972 411728 550304 345060 379341 671506
13613 671506 509933 348330 535397 665885 378172 571963 777520 819191 272202 631355
13603F31355k12522j11843K96074B36693j0288J45873G80N87526K16754C51348
13592B34760J52853L20710B03719N76712A61700M08113k23892J53372B04634L00627
13582E05261j79115J72264j53586J59586o662l0002k27532L64134m5261B62687
13571C30577o851J50313R3199M5681k92039K69879j66479J06701r0474q8866K69864
13560F21505k77062j21372K76113m6293M5393R140J32024j63703Q7566B27355
13549F77536C36773j58422J17938J93361R3890O8564k37830J11144j24318J3514
13539D14614j11071K4307b9140B66881n0931K41973j05952K65988k50498n3630
13529C13831J86483j00519P9687a64613A92782N8019l0639K45232K11713B50743
$$ plain form
13603 631355 418833 306990 603064 236693 226405 372278 780 588306 805060 351348
13592 234760 387613 708323 203719 780431 161700 569813 345921 499293 204634 505261
13582 505261 326146 498410 344824 504410 497748 467746 240214 604348 559087 262687
13571 330577 323726 474039 567238 612919 320880 590759 424280 530981 440507 351641 621505
13560 621505 344443 223071 499184 452891 498284 507424 639448 475745 563311 227355
13549 677536 336773 178351 296289 489650 583540 652104 414274 525418 401100 414614
13539 414614 303543 327850 -29140 266881 215950 457923 351971 617959 367461 313831
13529 313831 500314 399795 479482 -164613 192782 250801 220162 465394 677107 250743
13518F54730A02791J89053N542j02530F3400J85448L23884K5047k25139j06288
13508B66352c1077B76543P6527A36507j6696K1151P5107h6115A94465K12008A87912
13496D15833k7404K4777k7343A82343J19609D3616J10655K14503q6726P8293A12018
13484A55135K75808A85661Q7683j9350l6216J84170q8278J77691l8969j0443m2066
13473C99883A30627C8815J17929K55914A90926n6453m7552J05280J97970j83703
13463B06468K322J88730c219C37806A00218M66781B57769L36140M8100B41947
13452E68543k29254J2642P0650R6172B35898G4138K56530a04777B19500K13830
13442D33330j39749p3165K75679B14931K55936A4141L81954J08285O5023A78157
$$ plain form
13518 654730 102791 291844 297386 194856 63400 248848 572732 597779 372640 266352
13508 266352 -31077 276543 353070 136507 119811 140962 216069 -86115 194465 406473 187912
13496 415833 388429 413206 385863 182343 301952 43616 154271 368774 282048 360341 112018
13484 155135 430943 185661 273344 253994 217778 401948 313670 491361 452392 441949 399883
13473 399883 130627 38815 156744 412658 190926 134473 86921 192201 390171 206468
13463 206468 208790 397520 -3219 337806 100218 566999 257769 593909 642009 241947
13452 568543 339289 351931 422581 518753 235898 74138 330668 -104777 219500 433330
13442 433330 293581 220416 496095 214931 470867 14141 396095 504380 569403 178157
13431D59498j84266E3164J10282a8653D45628D4589J48125J55809a34037A60897
13420D20444A07001J88033C8112J94887Q7484F8444N4290J05027L16857j92859
13410C51759J95776e9549b6431A63432a594A03054K8082e9088E5316J44330n7049
13399A42597h0265D03690j8596j38857j13892L1820M0113J68142a22571b4422
13388B29655e7858A26366N3445P9853j7279N5600O2707q8257K1143i2160A20632
13376E6566K26738k6235J05649j54403M2638l0051E2533J73888J01446A17089
13365H131M73538k38496M2448m4552m6104J38302J43677A09065a0648C07413a5283
13353A28511J41835D7426J21698K82093A59084m8458C6252J13646i2432B23670
$$ plain form
13431 459498 275232 53164 163446 -18653 445628 44589 192714 348523 -134037 160897
13420 420444 107001 295034 38112 232999 320483 68444 122734 227761 544618 351759
13410 351759 547535 -59549 -26431 163432 -1594 103054 131136 -59088 55316 199646 142597
13399 142597 -80265 403690 385094 246237 132345 164165 204278 372420 -122571 -24422
13388 229655 -57858 126366 179811 259664 242385 297985 360692 272435 293578 -92160 120632
13376 56566 283304 257069 362718 208315 250953 220902 52533 226421 327867 117089
13365 8131 481669 243173 285621 241069 194965 333267 476944 109065 -10648 307413 -15283
13353 128511 270346 47426 169124 451217 159084 110626 36252 149898 -92432 223670
13342A68756O8232m9182J50691D8174J53995I8605L3526l7914K93456j69602K74095
13331D92166A75373B0858L58161n3553K5160R4281q033j02179j29407p261e7713
13319C24323e1443C60202j74612a37570B02575q9010O9813C4633M314K34692K16352
13308D89991A00306L00227A50569N21967A81918l6391J1697j8754L12607J58425
13298F09502B37278l4705r603K00650H3983J54793o7295a55841B41945K32807
13288D74752B11673K47195B10254P4790A5565a88853B34348O3356k3116K48018
13278E22606k48944j26213O1008M9673A5680J58258K30550k9039j79577O5199
13268B61071j12314K13794j17407p0591a33882N6650A69284P6256a22677j9518
$$ plain form
13342 168756 236988 187806 338497 48174 202169 98605 132131 94217 387673 218071 492166
13331 492166 175373 20858 379019 325466 350626 444907 436874 334695 205288 198027 -57713
13319 324323 -51443 360202 185590 -137570 202575 113565 183378 34633 38947 273639 489991
13308 489991 100306 400533 150569 672536 181918 145527 157224 138470 451077 609502
13298 609502 237278 202573 192970 393620 83983 238776 171481 -155841 241945 474752
13288 474752 211673 458868 210254 285044 15565 -188853 234348 297704 274588 522606
13278 522606 273662 147449 208457 258130 15680 173938 404488 375449 195872 261071
13268 261071 148757 362551 245144 174553 -133882 -77232 169284 245540 -122677 -142195
13258a42195k2841F5786B8244J49744A6221L41791A41697J80104A37777R2735
13248B30512p9654k5837K38231j65179M54539F925P4685M23990B02657p1022F2779
13236B92377F7272K07876A17177E3267N5087D7981K77743a9141C45749E1330b20790
13224b5643B09938q3121Q3813D1085J85618A01387K36592E4866d86602A67553
13213D00795b0232B54482F8501K96436j04789o3331I8322j8417B6625e9961q2519
13202a42480B82050l5635B3998Q6222B4467L4177b1405B12369n1369b32E0383
13190C11517E7849a17799A82698a49654B11455G531J44076G4596I514M1538J63104
13179B14156G8051C2527M4738K79816A10437D0423a2917B87267g0226a1259C10349
$$ plain form
13258 -142195 -165036 65786 28244 177988 16221 358012 141697 321801 137777 230512
13248 230512 150858 125021 363252 198073 652612 6925 81610 505600 202657 131635 62779
13236 292377 67272 275148 117177 53267 108354 47981 325724 -19141 345749 51330 -220790
13224 -25643 209938 126817 210630 41085 226703 101387 337979 54866 -486602 167553
13213 400795 -20232 254482 68501 364937 260148 196817 98322 79905 26625 -59961 -142480
13202 -142480 282050 246415 23998 110220 24467 58644 -21405 212369 161000 -232 50383
13190 311517 57849 -117799 182698 -149654 211455 7531 151607 74596 9514 51052 214156
13179 214156 78051 32527 77265 357081 110437 40423 -12917 287267 -70226 -11259 310349
13167A55135Q5473K4039e5681A5872L49391h8870D6491d3471A57136E8185q979
13156D9206J88966A03386J50203C1084L06153A20458J9278l7023j8746Q2512a1065
13144B39639K046B6580c38260d2469j40389I534R2935a48728b4448A18050a13689
13132F29736B04661K1997M6505m2630D2609M6509J04290J85605i2676B20353E1069
13120G6772L6151J24735j04304D093f2756A99503f5854l9618B9343J55103J21555
13109C06001D2161e5852D43860o9984G3658a48072r0948B57027a8092j34676A14588
13097d7338G7591L5401c7982k76315I6032K18321A1027K74947d1859k0453A31539
13085a48483A67839J0031N7437Q02N9900I1281J81714g6010A53344J03730m4767
$$ plain form
13167 155135 240608 264647 -55681 15872 365263 -88870 46491 -43471 157136 58185 49206
13156 49206 238172 103386 253589 31084 337237 120458 139736 102713 83967 166479 -11065
13144 239639 241685 26580 -338260 -42469 -182858 9534 102469 -148728 -24448 118050 -113689
13132 629736 204661 226658 273163 230533 42609 89118 193408 379013 -92676 220353 51069
13120 76772 112923 237658 133354 4093 -62756 199503 -65854 -105472 29343 184446 306001
13109 306001 42161 -55852 443860 373876 73658 -148072 -239020 257027 -18092 -152768 114588
13097 -47338 77591 112992 -37982 -314297 96032 314353 11027 285974 -41859 -62312 131539
13085 -148483 167839 177870 235307 236109 296009 91281 272995 -76010 153344 257074 212307
13074B12307O463E3175e2056B00483f5436A62498J44227d9639B48498a04963A13989
13062A41932J19323G4029K00216E8052J00413k9365A4860K82837a16230H8428
13051H5382H590L30817h4293B94451j9719c4648B41818a06907B55974d57765D9442
13039A23461c16062A02395m6076J642b8520G8876K22597d21489a14039j44995
13029b59034E5822a11983A56609A2292b843D8643a49808A39891J90529j20578
13019B09842J95359F8750c31397A4919K14196m9754H2255J92341C3313J64506
13009A97819N0930j03651e8647C8345b06260A00782A3231J03907a86105A74780
12998B38451A09352b16569f221B45773a2700B35302A16808B156e1990L937r6099
$$ plain form
13074 212307 218770 53175 -52056 200483 -65436 162498 306725 -49639 248498 -104963 113989
13062 141932 261255 74029 274245 58052 158465 129100 14860 297697 -116230 88428
13051 85382 8590 339407 -84293 294451 274732 -34648 241818 -106907 255974 -457765 49442
13039 123461 -316062 102395 56319 57961 -28520 78876 301473 -421489 -114039 -259034
13029 -259034 55822 -111983 156609 12292 -2843 48643 -149808 139891 330420 209842
13019 209842 405201 68750 -331397 14919 229115 179361 82255 274596 33313 197819
13009 197819 248749 145098 -58647 38345 -206260 100782 13231 117138 -186105 174780
12998 238451 109352 -216569 -6221 245773 -12700 235302 116808 2156 -51990 -48053 -144152
12987a44152E19395A79840L7246a62863B31865F9812J33576H4332L43605a90382
12976A77857p4719J24282e8190F5750k9178a28847a752j22263e1149I2994a6866
12964h0910D9441J34843K52758G5207O1924d2519j760B026b3840B19071a51014
12952A96032J97013j60123A00360a98698A88149b78570A28526C8156J86916E4629
12941B67836k8911a26171j12900B29682b02855C072K7145a04115G8685O3995J24351
12930B67031f3832J9372F4504K27870j11928B5899a10946N2367A37346K16990
12920C54336G3613a65459D16493E6138N5096C1145a26011b0533B10989L7053A15643
12908F6075a63966b3477C20925J5923j22023l8672F6176Q6803n7120Q4840K4816
$$ plain form
12987 -144152 519395 179840 217086 -162863 231865 69812 203388 84332 427937 -190382
12976 177857 103138 227420 -58190 65750 36572 -128847 -1752 -124015 -51149 92994 -16866
12964 -80910 49441 184284 437042 75207 137131 -42519 -44279 2026 -23840 219071 -151014
12952 196032 393045 232922 100360 -198698 188149 -278570 128526 38156 225072 54629
12941 267836 238925 -126171 -239071 229682 -202855 3072 30217 -104115 78685 142680 267031
12930 267031 -63832 -44460 64504 292374 180446 25899 -110946 -58579 137346 354336
12920 354336 73613 -165459 416493 56138 111234 31145 -126011 -20533 210989 248042 115643
12908 66075 -163966 -23477 320925 336848 214825 176153 66176 152979 95859 180699 205515
12897B05515j761J37816A40008c8938k17134e542j70197D6643b3758D03809A46001
12885a02586j44164C18662j51869G074a55188E702h8768B1165K27337b67023f6876
12873a64992L0366e2341A79395f3943n3589C30256b50314B86517a25717B1771
12862B59972a74539A71350K7570L1179j10893J48690O1242c6147B25679g3255
12851I5776j1539A2087a94728C36000A1212K1998M5108a1264B37858G4217B7774
12839g6942B07558g5189G8018a62075l9656M3849f9533C20479A4066c6057g178
12827A63202c02141A69374M4141b04410A52632J86250A38459f8151r9163F6210
12816a08790E2656a0524O45k67649I3038J14967a35638I2226b01894B51601n5878
$$ plain form
12897 205515 203754 341570 140008 -38938 -256072 -5542 -175739 46643 -23758 403809 146001
12885 -102586 -246750 318662 166793 7074 -155188 5702 -88768 21165 248502 -267023 -66876
12873 -164992 -134626 -52341 179395 -63943 -117532 330256 -250314 286517 -125717 21771
12862 259972 -174539 171350 198920 230099 119206 267896 329138 -36147 225679 -73255
12851 95776 84237 12087 -194728 336000 11212 33210 78318 -11264 237858 74217 27774
12839 -76942 207558 -75189 78018 -162075 -201731 -157882 -69533 320479 14066 -36057 -7178
12827 163202 -302141 169374 213515 -204410 152632 338882 138459 -68151 -167314 66210
12816 -108790 52656 -10524 -9879 -277528 93038 208005 -135638 92226 -201894 251601 195723
12805A95723J01020h3020A64608E0386h3708k5064D2854M5108N8647d8306j04846
12794a53152E2674a35440A87773D8590C934c09054b6265D8758P510k1559e2106
12782I1609J0969d0624B2989K32033l1866d6908q106E1007d12138B27735B9763
12770e024m0918j74517A46840K50795b01989A40312a98035A31820K9361a60492
12759A1a72499J6437q2296h2414C1383K43429G1954J63304b05184B539c152E5610
12746B6441O570J07656E7099a0228A31709k1001a94937k4336i4720j7985h739
12734C0762J22374a36286C06072A2576J38410P3826b38420B51605b24566h5643
12723a95336j15924C6946n568d6422A25915h3168C1489b3161p1211B22075J6489
$$ plain form
12805 195723 296743 -83020 164608 50386 -83708 -108772 42854 87962 146609 -48306 -153152
12794 -153152 52674 -135440 187773 48590 3934 -309054 -26265 48758 56268 34709 -52106
12782 91609 102578 -40624 22989 255022 223156 -46908 -55014 51007 -412138 227735 29763
12770 -5024 -45942 -220459 146840 397635 -201989 140312 -198035 131820 161181 -160492
12759 11 -172499 -156062 -238358 -82414 31383 274812 71954 235258 -205184 2539 -3152 55610
12746 26441 33011 140667 57099 -10228 131709 110708 -194937 -219273 -94720 -112705 -8739
12734 30762 153136 -136286 306072 12576 150986 224812 -238420 251605 -224566 -85643
12723 -195336 -311260 36946 31378 -46422 125915 -83168 31489 -23161 -94372 222075 238564
12712B38564L0141j12789j7024K124l3656R16a49823K5872B59709K8401B9898
12700B22200b92749A39675a17140A79J35390f436o6354A48780g0344A08485B5137
12688D4532a95476j85517A02666a03745C1884b03119e8681A22795k4325k2850
12678G5620B8448R4660D5675j2422L04772d7688C26329A41163F6719L58454j24669
12667C00504G2366N2608A0599b6236A10647B5075h6402A66846M3038a02158A58382
12655b31132C20062C0758c9187c839A5922J46370p3247r588J5701K39434J07576
12644D42168a64367B4005f0607i246B59207I3773K17429r1146k6782M9746H5804
12632C78424g4628k8033C6968a21583B41435l14a92682j07371A16459g0833A15501
$$ plain form
12712 238564 268705 155916 138892 141016 107360 108276 -149823 -123951 259709 288110 29898
12700 222200 -292749 139675 -117140 179 135569 -6436 -72790 148780 -70344 108485 25137
12688 44532 -195476 -380993 102666 -103745 31884 -203119 -58681 122795 98470 75620
12678 75620 28448 123108 45675 33253 338025 -47688 326329 141163 66719 425173 300504
12667 300504 72366 124974 10599 -26236 110647 25075 -86402 166846 209884 -102158 158382
12655 -231132 320062 30758 -39187 -3839 15922 162292 89045 79457 95158 334592 442168
12644 442168 -164367 24005 -60607 -9246 259207 93773 311202 220056 193274 243020 85804
12632 378424 -74628 -102661 36968 -121583 241435 241121 -192682 -300053 116459 -70833 115501
12620D83955C4020M47197k38365J55167b55230f9103E13948A14681j9830J0143
12610A04994J85924J0177j8650J9685o785j24345E3977f1949G4826M5575a54692
12598a84274E4265a14227H8810R887J99140a36273p2426C87370A11643P1749D6272
12586f633B51921j02236J02111H9002K78639j80371r2573J28149j4651j01091
12576A07104m1868J22702k3181J62740G2241e6218l147q4775b3487r9337K4774
12565i8050L6290I9958A3892a05663H7400B5289M6546a5975E045Q4509K21655
12554C11209o2403a23034B31356b7604k0968q0089I3288a222m45806B74900a42301
12542E303b3699m08202B06100b6998C09552E0093J97592A15723R8642a8161r3334
$$ plain form
12620 483955 34020 481217 242852 398019 -255230 -69103 513948 114681 94851 104994
12610 104994 290918 301095 282445 302130 295345 171000 53977 -61949 74826 120401 -154692
12598 -184274 54265 -114227 88810 98697 297837 -136273 -208699 387370 111643 183392 46272
12586 -6633 251921 149685 251796 89002 367641 187270 94697 222846 208195 107104
12576 107104 65236 187938 164757 327497 72241 -56218 -59365 -144140 -23487 -122824 -98050
12565 -98050 -61760 99958 13892 -105663 87400 25289 71835 -15975 5045 89554 311209
12554 311209 248806 -123034 231356 -27604 -48572 -128661 93288 -1222 -447028 274900 -142301
12542 5303 -23699 -431901 206100 -26998 309552 50093 247685 115723 214365 -18161 -111495
12531a11495J7841A80452p7817c4811k65277a0271k76494B27990D4257L29172
12521C73429e31742B94793f2197J5993B29656a252D001c27759J34845C02222A18604
12509C21377A43688P7239J35034a9686A7842J89778e0457B39620h6212B71252
12498F5980a38274B13028b0633f872G3114b35174A47042e4760A04645a99737B80706
12486d627j00476d0815B75489j30446O5144c3958k68952a4548B16686l9891j2908
12475A63887f4452j01765A51970p0293g9153A03882d0465B522a61017b3752p0996
12464i4748j4334B8226K64880l0352I2790J21566c3637H9729O76Q5253c51725
12452B17471a40412m4448A46985b54549J03743E9652a86113D538a16702d3522
$$ plain form
12531 -111495 -93654 180452 102635 -34811 -300088 -10271 -286765 227990 44257 373429
12521 373429 -531742 294793 -62197 -46204 229656 -1252 4001 -327759 -192914 302222 118604
12509 321377 143688 220927 355961 -19686 17842 207620 -50457 239620 -86212 271252
12498 65980 -138274 213028 -20633 -6872 73114 -235174 147042 -54760 104645 -199737 280706
12486 -4627 -105103 -40815 275489 145043 210187 -33958 -302910 -14548 216686 176795 163887
12475 163887 -64452 -166217 151970 81677 -79153 103882 -40465 2522 -161017 -23752 -94748
12464 -94748 -109082 28226 293106 262754 92790 214356 -33637 89729 90405 175658 -351725
12452 217471 -140412 -184860 146985 -254549 -150806 59652 -186113 4538 -116702 -43522
12441b9298F9395J9218k0867b52543B77446a73998P2709k7155B0411J33192a82749
12429A13067O1691K00911A71783R8200j16526i002F1977J20927f2661A07880b58692
12417A4734e6240B29647o2559b7733k17779f4072A7684a25498K2160J1506B93154
12405b4711j42784C39344a23097C61983A45133J07367a13066L8192j13035k33223
12395d21132E0788J14665c29418d1012J6473I6464m3157O0842A3095c85054a40463
12383b93088h7108q7474d5910r1719p2608J01912M3084A75233h7881p3952A21119
12371B67605E3476R1711c66717J05939D41956A03191C377K48960b70292E5416
12360A48631K62970H5784a94152B71715a93313G4820g5065a990o124B09000b30276
$$ plain form
12441 -29298 69395 88613 67746 -252543 277446 -173998 -101289 -128444 20411 153603 -182749
12429 113067 174758 375669 171783 269983 153457 -9002 61977 182904 -62661 107880 -258692
12417 14734 -56240 229647 167088 -27733 -245512 -64072 17684 -125498 -103338 -91832 293154
12405 -24711 -167495 339344 -123097 361983 145133 252500 -113066 -74874 -187909 -421132
12395 -421132 50788 165453 -329418 -41012 -24539 96464 53307 114149 13095 -385054 -140463
12383 -293088 -87108 -174582 -45910 -137629 -210237 -108325 -65241 175233 -87881 -161833 121119
12371 267605 53476 145187 -366717 -260778 441956 103191 3377 252337 -270292 55416
12360 148631 411601 85784 -194152 271715 -193313 74820 -75065 -1990 -8114 209000 -230276
12348A33101E572O6129a85462j84748B07231c25125c0073j11107j59372h3897
12337F1049b48010H4839b47945L4913H1789a52229D03949I2411a18513k11036
12327c29549i1747n5609k3369P5537D47985e1223C91J35119b4099B05352m1357
12316A63995J1951q1804h503j95430B06551r1696Q0654a87206h5793j86499A2785
12304a01775K2526A38241J25567f1689m8202B44951a23626b9872e627A4381c6322
12292b977D13648d42184C53526h573k22389A48065J51982c14800f5083B98012
12281H9897b80133A32668o4578J98465a6166j17177l9497k28284C09753D0427
12270b07176C39932a7883D14642b65883g5449I8043Q9968o2502K6888B9007R4943
$$ plain form
12348 133101 5572 71701 -185462 -370210 207231 -325125 -30073 -141180 -300552 -83897
12337 61049 -248010 84839 -247945 -213032 81789 -152229 403949 92411 -118513 -329549
12327 -329549 -91747 -147356 -170725 -95188 447985 -51223 391 135510 -24099 205352 163995
12316 163995 175946 94142 -8503 -203933 206551 114855 195509 -187206 -85793 -272292 12785
12304 -101775 -79249 138241 263808 -61689 -109891 244951 -123626 -29872 -5627 14381 -36322
12292 -2977 413648 -442184 353526 -8573 -230962 148065 300047 -314800 -65083 298012
12281 89897 -280133 132668 68090 266555 -16166 -133343 -172840 -401124 309753 40427
12270 -207176 339932 -17883 414642 -265883 -75449 98043 188011 125509 152397 29007 123950
12259A23950R1289n4855m6018b88053J43427N8111r1058j0788C69007G5920K50600
12248C26520D5387k400N286K82210b3336I9184b0201D3330J45927a13261k2800
12237a36061M2545I8561b27566e726A38762J31666k3290b40682C8534b00772A52471
12225A33476d0830r8890F7664g226B51506a22634I7574i143A29051A077K14431
12214B15508a85323B62360J20408M9849k16015N2741m0631a7994G8866O2438R5921
12203B37225L41963A24142R2025R8465F9337K75442o0441Q407j45152o4492O268
12192H9369J40826R7085j35166C4962R7435L51126j05372r1895J77809j65212
12182B98853o7198c35006D06384a30454D20545A63142b0775A69453J53696C1011
$$ plain form
12259 123950 215239 160384 114366 -288053 -144626 -86515 -177573 -188361 369007 75920 326520
12248 326520 45387 42987 48273 330483 -23336 99184 -20201 43330 189257 -113261 -136061
12237 -136061 -93516 98561 -227566 -5726 138762 270428 247138 -240682 38534 -200772 152471
12225 133476 -40830 -139720 67664 -7226 251506 -122634 97574 -9143 129051 1077 215508
12214 215508 -185323 262360 382768 432617 216602 269343 228712 -17994 78866 141304 237225
12203 237225 579188 124142 216167 314632 69337 344779 284338 292745 147593 83101 89369
12192 89369 230195 327280 192114 34962 132397 483523 378151 286256 464065 298853
12182 298853 231655 -335006 406384 -130454 420545 163142 -20775 169453 323149 31011
12171b5219B90041a05252c6755G5407O3971J74694a75374A64133a03045A03481
12160B30344g2309A87302G0865L94442B5300N00030L2879A58136J29274A13002
12149A74995j3414F1610l031K34015C9477J2379h742k0257j87930f1222j01535
12138a62757A68919i2746E1137e5628k1552A01306a27819j77193B99029c10385
12127E06949b0239r8757B2232J45898J85274b24332C71132a09682l9311A67236
12116a5934A88843a62042d0612B7016K333Q3526C6545F201J37612b76626N5048
12105b21578A76963N2124B4155L31525A70666K0589g4339B4206b16320B79279
12094G0148K14224c2852C8083J71064a12094j1264M9911G9772j9121b7001C01612
$$ plain form
12171 -25219 290041 -105252 -36755 75407 139378 314072 -175374 164133 -103045 103481
12160 230344 -72309 187302 70865 465307 25300 525330 558209 158136 287410 113002
12149 174995 161581 61610 58579 292594 39477 51856 -8742 -28999 -216929 -61222 -162757
12138 -162757 168919 -92746 51137 -55628 -77180 101306 -127819 -305012 299029 -310385
12127 506949 -20239 -118996 22232 168130 353404 -224332 371132 -109682 -148993 167236
12116 -15934 188843 -162042 -40612 27016 29349 112875 36545 6201 143813 -276626 -221578
12105 -221578 176963 229087 24155 355680 170666 191255 -74339 24206 -216320 279279
12094 70148 284372 -32852 38083 209147 -112094 -123358 -73447 79772 60651 -27001 301612
12082a03902p7673A12781g2228B00574p5517h2024f289A001Q7981a79473c3350
12070a6993A92689i5080c0058H2498b43887a6241A54840m7291R5104F52J79886
12059A80538F0102h4718o1386J6985B67657A3069J29453K34830O8168M25290A77470
12047A47394F40J49476N307B8798b21986N238j52618G2618A1660J3891K8513K12464
12035B66528b3984C53872c54558G800J00415c00612h0368E4791a65562O1378k4828
12024a29012B8204L2401i3340H0284J88097i0375p3849N8242F5123N5607C9434
12012A92718o2705b2190B57298a45897L1157j68112e5851j52060F9781N8197b08963
12000B65598g9315A69213D0485k790a28693G0439B2485K33103n9928J26074a331
$$ plain form
12082 -103902 -181575 112781 -72228 200574 125057 -82024 -6289 1001 88982 -179473 -33350
12070 -16993 192689 -95080 -30058 82498 -243887 -16241 154840 107549 202653 652 180538
12059 180538 60102 -84718 -146104 -129119 267657 13069 142522 377352 445520 870810 177470
12047 147394 640 150116 155423 28798 -221986 -216748 -369366 72618 11660 25551 54064 266528
12035 266528 -23984 353872 -354558 7800 108215 -300612 -80368 54791 -165562 -104184 -129012
12024 -129012 28204 60605 -93340 80284 268381 -90375 -164224 -105982 65123 120730 39434
12012 192718 130013 -22190 257298 -145897 -114740 -282852 -55851 -207911 69781 127978 -208963
12000 265598 -79315 169213 40485 37695 -128693 70439 22485 255588 195660 321734 -1331
11988i3712L1430A60413J25511h948r4413A48646J18180d3027D3456J79288a97492
11976a84803J5038I3011c40618b1195j8096A16366a21541o0909C3866O5682h8414
11964h8923C06322d9639E3769M1300b15075b6977p6209B22746I6945m2608a71829
11952G2572b7624p0135c4277k55383b9268f469E9754a26232n3445h1766k2055
11941a03821p2390e6154C39759R169A919a57804C6274a6157k54682A56504C5190
11929c06191B06114a81678B19176a65584A92137R8747a05392D5807c16139D3433
11918G051b46261E0732c55184B2787P7260k8685h5805B09744a96407o0913B66
11906b32603K8021d8093G5494a23751m9299j7182P2847k82736a91970G9527D462
$$ plain form
11988 -93712 -62282 160413 285924 -8948 -103361 148646 266826 -43027 43456 222744 -197492
11976 -184803 -169765 93011 -340618 -21195 -39291 116366 -121541 -182450 33866 99548 -88414
11964 -88923 306322 -49639 53769 95069 -215075 -26977 -103186 222746 96945 54337 -171829
11952 72572 -27624 -97759 -34277 -289660 -29268 -6469 59754 -126232 -179677 -81766 -103821
11941 -103821 -176211 -56154 339759 348928 1919 -157804 36274 -16157 -270839 156504 35190
11929 -306191 206114 -181678 219176 -165584 192137 290884 -105392 45807 -316139 43433
11918 7051 -246261 50732 -355184 22787 100047 71362 -85805 209744 -196407 -257320 266
11906 -232603 -204582 -48093 75494 -123751 -173050 -190232 -117385 -400121 -191970 79527 4462
11894a75084f230j02856N3177b445j45716A06026m5018b5970C56b10331C6991
11882A6041J0322M1095K30294b18917f0088A07618a25692l2234A73640m7234C3413
11870A69101G1676r974b85706B45016g4759j13295G7309J50315b05155B6519B917
11858c3548A80289J33971f968p5328k44202g1215m032m0909l0665f3317A70314
11846d22749B3640d2490B10830F2065d17383B32478l6478O2599D187c21993f0366
11834f6760C6489F196d4203G8594J59286a97123G0506b99894f6782r0910c2299
11822b24718C8093a83210b0057k1271p4828l784A02131N9187b50215A43592C7680
11810A63261a30199p0000I6302l8049b9278q9048a7591j12209o314e0556k26149
$$ plain form
11894 -175084 -6230 -109086 -55909 -2445 -148161 106026 61008 -25970 356 -210331 36991
11882 16041 26363 67458 297752 -218917 -60088 107618 -125692 -157926 173640 126406 33413
11870 169101 71676 61702 -285706 245016 -74759 -188054 77309 227624 -205155 26519 2917
11858 -33548 180289 314260 -6968 -82296 -326498 -71215 -75247 -116156 -146821 -63317 170314
11846 -422749 23640 -42490 210830 62065 -417383 232478 196000 258599 4187 -321993 -60366
11834 -66760 36489 6196 -44203 78594 237880 -197123 70506 -299894 -66782 -157692 -32299
11822 -224718 38093 -183210 -20057 -41328 -116156 -119940 102131 161318 -250215 143592 37680
11810 163261 -130199 -200199 96302 58253 -29278 -118326 -17591 -129800 -136114 -50556 -276705
11799b76705B3481N1525k8668b98610H1458j2479P6599c08709B80111b37628d8089
11787b61254g647k98264A10461G561b52177B2225e7528A32362m1187D5263d879
11775a13748e2675j47041B01682l4773f7123p4430A93231e0355J8064H3096b86225
11763a47526D1669c38919F2182j6460g7510D4272a3741k10522P1718D8353K22610
11752B70963D4711a53285A61661a76894H5947a86330a8086k16103K3535p5606
11742b86260J39488m479g3910B58146i4715C01124a19188B2862R5158c89000B26673
11730a2604A08535C4157K12413c15166h2736C1828b13196r647A01797a60520A57744
11718a22236D21660c38396M2520f7146B3175a58367h237k19953E6989c51838A79678
$$ plain form
11799 -276705 23481 75006 46338 -298610 81458 68979 145578 -308709 280111 -237628 -48089
11787 -261254 -7647 -305911 110461 7561 -252177 22225 -57528 132362 91175 45263 -4879
11775 -113748 -52675 -199716 201682 166909 -67123 -141553 193231 -50355 -32291 83096 -286225
11763 -147526 41669 -338919 62182 45722 -77510 44272 -13741 -224263 -152545 48353 270963
11752 270963 44711 -153285 161661 -176894 85947 -186330 -18086 -234189 -210654 -286260
11742 -286260 -146772 -151251 -73910 258146 -94715 301124 -119188 22862 118020 -389000 226673
11730 -12604 108535 34157 246570 -315166 -82736 31828 -213196 -222843 101797 -160520 157744
11718 -122236 421660 -338396 -295876 -67146 23175 -158367 -8237 -228190 56989 -351838 179678
11706a49899B04257K02481a46603j7255D925a22021i772H0973e379E9460J28608
11695A88068F8624h8849c091H1495C4548a16406m7155M8559a3039E4821f8175
11683A06546d3603B15442C9776b9444A24995l5592J30075E3943M9406n0032d71
11671A09479J22099j04895D4757i9669F4580L4946D0926K5760C0703B815h6962
11659a34833A64456a2404k30823A76964i1010j09574e3846A96327e1522j98661
11649b50183E9692b97125a47226A47926a21966A99544a96176P3621r1158q7754
11639c01467J34738d6453B87779A27364a38872B80603b22445N0348O4094J7862
11629i0141e249m7535B93631d26569i1817B84135f4925B74286L6314D5624a1318
$$ plain form
11706 -149899 204257 406738 -146603 -163858 4925 -122021 -9772 80973 -5379 59460 188068
11695 188068 68624 -88849 -3091 81495 34548 -116406 -163561 -115002 -13039 54821 -68175
11683 106546 -43603 215442 39776 -29444 124995 89403 219478 53943 103349 53317 -471
11671 109479 231578 126683 44757 -99669 64580 99526 40926 66686 30703 2815 -86962
11659 -134833 164456 -12404 -243227 176964 -91010 -200584 -53846 196327 -51522 -250183
11649 -250183 59692 -297125 -147226 147926 -121966 199544 -196176 -122555 -213713 -301467
11639 -301467 -166729 -46453 287779 127364 -138872 280603 -222445 -172097 -108003 -90141
11629 -90141 -5249 -52784 293631 -426569 -91817 284135 -64925 274286 310600 45624 -11318
11617d7860D7539h8012r7322N9024A31429i6044a8485l52887H8183b00151d6997
11605e471n6131j79049A39685e277A07444a59094H2882L0395L7967f8217A02813
11593F0265H009d3506H0732M8546d3598A45819a2076D1535f7740A1858a08209
11581a04894B1662K6517L3838d5471j46429J979A86919a60792K7909A27055a38142
11569D0255e2052J072I5434K55390A48903p0286C5899K50917b20861j7506A65468
11557b07493B5256K68239a79724E1454a3975C5590O9059j171g8801A53210O5363
11546B18573a72034j32782G0585k0680b81158a9146A671P9543L05354b44462C2042
11534D2681e7212C6053a23392j17176a02083G1362M1899H269P1757n324K82067
$$ plain form
11617 -47860 47539 -88012 -185334 -126310 131429 -96044 -18485 -371372 88183 -200151 -46997
11605 -5471 -61602 -240651 139685 -5277 107444 -159094 82882 113277 151244 -68217 102813
11593 60265 8009 -43506 80732 129278 -43598 145819 -12076 41535 -67740 11858 -108209
11581 -104894 21662 48179 82017 -45471 -191900 -189921 186919 -160792 -132883 127055 -138142
11569 40255 -52052 -50980 95434 350824 148903 78617 35899 286816 -220861 -238367 165468
11557 -207493 25256 293495 -179724 51454 -13975 35590 104649 103478 -78801 153210 218573
11546 218573 -172034 -304816 70585 49905 -281158 -19146 1671 81214 386568 -244462 32042
11534 42681 -57212 36053 -123392 -240568 -102083 71362 113261 8269 80026 74702 356769
11523C56769b3575C51266a97490B20926f5369j08198f2543q05G0888L9041h7631
11511F4544K0088e0543C1671K05216i6077m9140D41984a12850M5753A5976M39204
11500D55180h8695G8401A031K28502c121H8461a77444J6275B57629f8223H0863
11488b03147c5119B04481o1495d9936a3231A43780J66562q0942a40792B45227
11477A21141A5765L57319A10564b00891D97611j99812C4759M0975K96247A54894
11466H1400H996M34010d8432A95542o6710O7911D2330J66082O8165o9090k6732
11455A80755b455C53029G146J50965n9976L8904E1308b1229I9949J58451m22I2614
11442B82985a30308f0693A76044m3679a68622C76483a38690j66445B64132d5710
$$ plain form
11523 356769 -23575 351266 -197490 220926 -65369 -173567 -62543 -63348 70888 109929 -87631
11511 64544 84632 -50543 31671 236887 -96077 -145217 441984 -112850 -67097 15976 455180
11500 455180 -88695 78401 1031 229533 -3121 88461 -177444 -161169 257629 -68223 80863
11488 -203147 -35119 204481 142986 -49936 -13231 143780 310342 229400 -140792 245227
11477 121141 15765 373084 110564 -200891 497611 297799 34759 75734 371981 154894
11466 81400 8996 443006 -48432 195542 128832 196743 42330 208412 276577 207487 180755
11455 180755 -2455 353029 7146 158111 98135 137039 51308 -21229 99949 258400 257978 92614
11442 282985 -130308 -60693 176044 132365 -168622 376483 -138690 -305135 264132 -45710
11431f629H037O2593h7074A50964k5404B4173Q8009J6912a16970m846B13628h9774
11418e024I2800h2300E1398J06083L9151a52376q3207B65241g8858A77450o8486
11407A08964M2701a69414M6169p8846l0579A27347E2641L30633A10500b80015
11396b17403G8792a2605k93175o5974A67086a43963F0172h9787B62316I6154J4078
11385A10232M7924J7422o4102F037L46674A6981J12924J38296b51583A23229e8747
11373d6974K1066F6532a57726B06408b46168A38941c51316Q192d0507A66959m3080
11362A23879b8731C08905e5185A65447h7368A08829M6664c9765a0911n5568N108
11351f1371H6817N3073a26021C01913j39882m6942a64963R924g2581a5986A31825
$$ plain form
11431 -6629 8037 70630 -87074 150964 125560 24173 112182 129094 -116970 -121816 213628 -89774
11418 -5024 92800 -82300 51398 157481 196632 -152376 -235583 265241 -78858 177450 108964
11407 108964 151665 -169414 -123245 -202091 -232670 127347 52641 383274 110500 -280015
11396 -217403 78792 -12605 -305780 -371754 167086 -143963 60172 -89787 262316 96154 110232
11385 110232 158156 175578 111476 6037 352711 16981 129905 268201 -251583 123229 -58747
11373 -46974 -25908 66532 -157726 206408 -246168 138941 -351316 -343124 -40507 166959 123879
11362 123879 -28731 308905 -55185 165447 -87368 108829 155493 -39765 -10911 -66479 -61371
11351 -61371 86817 139890 -126021 301913 162031 115089 -164963 -155039 -72581 -15986 131825
11339B9505f1864k69820j8892a58433d65j33907d7873j93769f7079p2397A37884
11327A1367c84504C19154A27109d222F0874c29180e5388A59819a19720N7454j27264
11316a89530J940C42565A0797c7198l05036a63287j8403Q4964E2782k193j5264
11305C5325h6098K7067I6631i7382j46148J19597A77880K60590B1185J2590H877
11293g4419m5112A81923O4587a51520A9581O3570K21885b626k4214A4694b17070
11281b3694B51376a28548k73138f082k8099A03880c25835B02909g8157F558O6554
11270G3112a15044G9270a00692I0233b89600e0461B32900D7165a79406L1988j49813
11259b97231D5098b24544C759b38983B77251f829A37508K9328E2283d7822l59468
$$ plain form
11339 29505 -61864 -331684 -350576 -158433 -465 -134372 -47873 -241642 -67079 -139476 137884
11327 11367 -384504 319154 127109 -4222 60874 -329180 -55388 159819 -119720 -62266 -189530
11316 -189530 -187590 342565 10797 -37198 -342234 -163287 -181690 -96726 52782 50589 35325
11305 35325 -86098 -59031 96631 -97382 -243530 -123933 177880 438470 21185 33775 8877
11293 -74419 -119531 181923 246510 -151520 19581 83151 305036 -2626 -26840 14694 -217070
11281 -23694 251376 -128548 -401686 -6082 -34181 103880 -325835 202909 -78157 6558 73112
11270 73112 -115044 79270 -100692 90233 -289600 -50461 232900 47165 -179406 -147418 -297231
11259 -297231 45098 -224544 3759 -238983 277251 -6829 137508 166836 52283 -47822 -407290
11248d07290A04500i0676E34314a27913C84052g6455A76439C8559N6296E275J21756
11237A27031J742d1051l6594l39240g4276I9696R9875a04885j43170K7758B9069
11225a33878m584j60336J41458P293l17599K04416D6522L623a81191B009d9932
11213h6462G9651N972j6331J0586A3172c70807a43270r9595a13977A97426b37621
11201f6329b4647F5342c09817a2629n40059f6873j21443h7180L4420D2307k288
11190D0019A6136h8289j481B70277a58425g4825H9438K35050j53985C7257J98786
11179B36043e05956h213j08166L4781L3511A7174b33421p3307E9201b907k10980
11168b13887F364b94076N2100f9951l5128I8925b2569B0415b34114A69954c04639
$$ plain form
11248 -407290 104500 -90676 534314 -127913 384052 -76455 176439 38559 94855 5275 127031
11237 127031 128773 -41051 -77645 -416885 -74276 99696 199571 -104885 -248055 -220297 29069
11225 -133878 -138462 -298798 -157340 -150047 -467646 -263230 46522 50145 -181191 2009 -49932
11213 -86462 79651 85623 69292 79878 13172 -370807 -143270 -242865 -113977 197426 -237621
11201 -66329 -24647 65342 -309817 -12629 -552688 -66873 -188316 -87180 -52760 42307 40019
11190 40019 16136 -88289 -89770 270277 -158425 -74825 89438 324488 170503 37257 236043
11179 236043 -505956 -8213 -116379 -81598 -48087 17174 -233421 -306728 59201 -2907 -213887
11168 -213887 6364 -294076 -241976 -69951 -105079 98925 -22569 20415 -234114 169954 -304639
11156A92627c82813H7408J09261J83753a89065O4210e4398l57996J38114Q9045
11146a85235n5278g1856k45274N8158D43747b18348k4871A30764D5752d8374j03509
11135a51883A12599P7583a89752E0552l984b2133I5482D4954J44801d6640A11759
11123A19991m9121J24358f1452C27995i7685k40491J50263Q085A34115E1252J3688
11112F4940L1951M06521A2250K01127O6078L2034A0300M56466d6811B79077e117
11100F1354d8297H7479k8031d05821A92214J28304A05175j558J84549j30273K5321
11089A83214p7110m6787M61823d0017A97017J46849A43014K72991D95R9202N6562
11078A56259a09014C81443k954r8292G3148N9658J99467h7477D71094A70948K57706
$$ plain form
11156 192627 -382813 87408 196669 380422 -189065 -124855 -54398 -412394 -274280 -185235
11146 -185235 -240513 -71856 -317130 -258972 443747 -218348 -243219 130764 45752 -48374 -151883
11135 -151883 112599 190182 -189752 50552 46568 -22133 95482 44954 189755 -46640 111759
11123 119991 70870 195228 -61452 327995 -97685 -338176 -187913 -179828 134115 51252 64940
11112 64940 96891 503412 12250 213377 279455 311489 10300 466766 -46811 279077 -5117
11100 61354 -48297 87479 59448 -405821 192214 320518 105175 103617 288166 157893 183214
11089 183214 106104 59317 521140 -40017 197017 343866 143014 416005 495 99697 156259
11078 156259 -109014 381443 378489 280197 73148 132806 332273 -87477 471094 170948 428654
11067D28654j77414J20593J22019k24963j3374K6113L40695B69669J61345A31310
11056i9642B27799R2080j0286j8999K07069B40908J93460r9209K0243N7276n1899
11045C60779M00716j47527B57816K86576P6478Q8681j22560M6138n0576J92245
11035G74798k40878M55050k58874M5846M3254J26199l02177K29389q3408J30253
11025I19452j53313l5880o6334J946J95668j62078K66039j52968j46579O9476
11015G35429Q2912M6562D09282J96848N1926M2934j20600K85342j70662L81627
11005A076697D99372L78892j57795o8062M5710J04320k88870L41771p2624k25685
10995E57029L41715j16728m9050k34412R8544j09327L83148j16130k01008K31051
$$ plain form
11067 428654 251240 371833 493852 268889 255515 281628 622323 269669 431014 131310
11056 -99642 227799 319879 309593 290594 497663 240908 434368 335159 355402 412678 360779
11045 360779 761495 613968 257816 544392 620870 709551 586991 633129 582553 774798
11035 774798 533920 988970 730096 775942 819196 945395 643218 872607 789199 919452
11025 919452 766139 730259 663925 665871 861539 699461 965500 812532 665953 735429
11015 735429 818341 864903 409282 606130 658056 700990 580390 865732 695070 1076697
11005 1076697 499372 878264 720469 652407 698117 802437 513567 855338 782714 557029
10995 557029 898744 782016 732966 498554 597098 487771 870919 754789 553781 784832
10985G84832j81089P9794L8123j16367L12582j15349p3082J55950r7492k12447
10975E75455k6275M21814O4025l62393M79475N6057m09331N36830k90838M8057
10965A092876M8639M25683J52126K90468R4299K85154O5720L76360K66954j11637
10955B986642J65726Q6286k35677k90765j20705l28027m98545j98027J19231l86745
10945A299394j19717j7884L08176o20034J87266j61000q237r7062l43940J27678
10935E54640R291j69186n5382H7508a8113C91153A42763a33468C4873a35286A49463
10923f7292C54940j68602j4315J9849a80017A928K31432f1170B52957b18104B64208
10911H0394J54629j8487b0841A83289J9013d29877D8662K75191c5144j96605A06757
$$ plain form
10985 784832 603743 683537 721660 605293 917875 802526 729444 885394 787902 575455
10975 575455 549180 970994 1035019 672626 1152101 1208158 798827 1335657 1044819 1092876
10965 1092876 1141515 1567198 1719324 2009792 2104091 2389245 2454965 2831325 3098279 2986642
10955 2986642 3152368 3238654 3002977 2712212 2591507 2263480 1764935 1566908 1686139 1299394
10945 1299394 1179677 1161793 1469969 849935 1037201 876201 867964 770902 426962 554640
10935 554640 563931 394745 339363 87508 -18113 391153 142763 -133468 34873 -135286 149463
10923 -67292 354940 186338 172023 191872 -180017 1928 233360 -61170 252957 -218104 264208
10911 80394 235023 216536 -20841 183289 202302 -429877 48662 323853 -35144 -231749 106757
10899e1383a9449k13027o1112G5572e8364C95674h4916k51042A31659e5432r9735
10888a55167a6097l8948B9398d7147j0108k58329B36371J5716P3741I7357B6787
10876a85051j35825F4220J93701c24677f4694K8838n8203A0170a02701C9898J29121
10865A69019i688A13520K50072E8251c24183D08500a26746L3986A49416J64943
10855C14359j37429e9488j05661M4640D43595A33577g3005k83032c7888D7372
10844d6426C1937d9458k6135B9301J41522i1299b2030A40218a38019c4729q5617
10833a20346H3413h5302L5627B9299J98607b62346e195k79354A21537b85774j17587
10822d03361k8532c6135r0130G174b33004g6739O614j6002K8929F8295J56063
$$ plain form
10899 -51383 -19449 -232476 -293588 75572 -58364 395674 -84916 -335958 131659 -55432 -155167
10888 -155167 -16097 -55045 29398 -47147 -57255 -315584 236371 252087 325828 97357 26787
10876 -185051 -320876 64220 257921 -324677 -64694 -35856 -94059 10170 -102701 39898 169019
10865 169019 -9688 113520 363592 58251 -324183 408500 -126746 -92760 149416 314359
10855 314359 176930 -59488 -165149 -120509 443595 133577 -73005 -356037 -37888 47372
10844 -46426 31937 -49458 -75593 29301 170823 -91299 -22030 140218 -138019 -34729 -120346
10833 -120346 83413 -85302 -49675 29299 227906 -262346 -5195 -284549 121537 -285774 -403361
10822 -403361 -431893 -36135 -126265 7174 -233004 -76739 -70125 -86127 -57198 68295 224358
10811B24358g8669C2561h8348b4709k48652f8165E3516f4799A69943a05098k11310
10800c16408A1473g2166n5159n8449h6997m2784A60815D38P7571f3870b0138r0626
10788a10764F0839O8070C2093b08702C58297j15658n1164c60661G0101A803O1624
10777F3427Q8724c7908A4666d7758B2001a0770H8100a59058g2860F603i4470G4413
10764H5460C5979K27519A5216Q4459c51549A67420c5773k38671a32361j08414
10754b40775i8352B8583a05513F387N7706a94615b1494k17642J09030A76376c6207
10742i0995A81825J4906a56974b3851m0654j84585b2598F16b30720e8031j83310
10731b41341A37420Q0753l1836q2699e9599A93133d45144c7473F2489L6338a88459
$$ plain form
10811 224358 -78669 32561 -88348 -24709 -273361 -68165 53516 -64799 169943 -105098 -316408
10800 -316408 11473 -72166 -127325 -185774 -86997 -129781 160815 438 78009 -63870 -20138 -110764
10788 -110764 60839 128909 32093 -208702 358297 242639 191475 -360661 70101 1803 63427
10777 63427 152151 -37908 14666 -47758 22001 -10770 88100 -159058 -72860 6603 -94470 74413
10764 85460 35979 263498 15216 99675 -351549 167420 -35773 -274444 -132361 -240775
10754 -240775 -98352 28583 -105513 6387 64093 -194615 -21494 -239136 -130106 176376 -36207
10742 -90995 181825 196731 -156974 -23851 -64505 -249090 -22598 616 -230720 -58031 -241341
10731 -241341 137420 218173 186337 103638 -59599 193133 -445144 -37473 62489 98827 -188459
10719I4687A442a82620Q95b152j3934A54357A7989h0548A86547a1929k2722D2697
10706I0670b7180j26017k371d8585j69909d7221J0116B86191c90002C45310A8036
10694A08532a41115D6402D190b96388A5649d0925k22191A52048b37424D2784O9722
10683A12506a55758A55589b32658G3186a71630d9773q3641A3122b2386k3077j5585
10672f1048r3813a8146B39684b61205B42411a57956b3737l4525j21779f2791m48648
10661e11439G5192a33662k842k2756A12610D1199L4720K9474b86152J7890A05780
10649A86360o9726h6389A43963c44665c7073I6550C0460c05593C88516r0612C9821
10637g6881n0377d7537k43277g5196k54568A49591J53196a72147j74801C31400
$$ plain form
10719 94687 1442 -182620 -181725 -2152 -16086 154357 17989 -80548 186547 -11929 -34651 42697
10706 90670 -27180 -153197 -155568 -48585 -218494 -47221 -37105 286191 -390002 345310 18036
10694 108532 -141115 46402 4190 -296388 15649 -40925 -263116 152048 -237424 42784 112506
10683 112506 -155758 155589 -232658 73186 -171630 -49773 -133414 13122 -22386 -45463 -61048
10672 -61048 -154861 -18146 239684 -261205 242411 -157956 -23737 -58262 -180041 -62791 -511439
10661 -511439 75192 -133662 -136504 -159260 112610 41199 75919 105393 -286152 -268262 105780
10649 186360 116634 -86389 143963 -344665 -37073 96550 30460 -305593 388516 297904 39821
10637 -76881 -127258 -47537 -290814 -75196 -329764 149591 302787 -172147 -346948 331400
10626G3646B8656b82073f1746a2935C95254g9039M667k28051B22520G8213b21352
10614d13852e3687O971l4193o2769e2613j047A9392J31713c42246f0890C502a60645
10601a40953G1601K0725d48946d1789C9745a66503A06892C1017Q2352n757k6630
10590H0982c63434I923b4235j51978B1697O8772q77a56280k53983A54735l4171
10579A20564f035r4121A69433a85650E3460b86816J03267f0738q510A7074b14829
10567a43736A95090a6090I6149Q3355b9547l0564l4015A22435a17215k7019B73200
10555f5406H627K24303I6040c58430E2332a6386k87524D7572J76566p1012B5469
10543I1923a93909f0692o6809A2197c36294J31116a450k4814A87253b98501n5696
$$ plain form
10626 73646 28656 -282073 -61746 -12935 395254 -79039 -74372 -302423 222520 78213 -221352
10614 -413852 -53687 -46716 -80909 -143678 -52613 -53660 19392 151105 -342246 -60890 3502 -160645
10601 -140953 71601 92326 -448946 -41789 39745 -166503 106892 31017 113369 107612 80982
10590 80982 -363434 9923 -24235 -176213 21697 90469 89592 -156280 -410263 154735 120564
10579 120564 -6035 -100156 169433 -185650 53460 -286816 -183549 -60738 -69248 17074 -214829
10567 -143736 195090 -16090 96149 179504 -29547 -60111 -94126 122435 -117215 -144234 273200
10555 -65406 8627 232930 96040 -358430 52332 -16386 -303910 47572 224138 153126 25469
10543 91923 -193909 -60692 -127501 12197 -336294 -205178 -1450 -26264 187253 -298501 -354197
10532c54197A05666a57489A02376L899q097m5763a26536e7331A23883c24046d4457
10520g5324G2020e7354a8954j60564l8070i1211l49401a32340M0091q8679N1683
10509a29245e4763n962o6879A23662c28079F4862a59705L4449E0605K70138F5158
10497A7165a80167A59171H723c56180A46411K08062a92743B05981f6172A6443
10486C9326a29840B29324j13551K8497a82370j17364p0432a70620k3452A5522
10475a87462j78365a06587r5492j14143C0517c3217j36705D1808D995P9727i3721
10463h1666B01616d2363j8124C9586c28395j77236a48692j26029D1754a20117
10452f380A35757K9167c08742d5731F4893i8634b0716n9957a9656B24931B8881
$$ plain form
10532 -354197 105666 -157489 102376 106275 98178 52415 -126536 -57331 123883 -324046 -44457
10520 -75324 72020 -57354 -18954 -179518 -217588 -91211 -440612 -132340 -92249 -180928 -129245
10509 -129245 -54763 -60725 -127604 123662 -328079 64862 -159705 -125256 50605 320743 65158
10497 17165 -180167 159171 8723 -356180 146411 354473 -192743 205981 -66172 16443
10486 39326 -129840 229324 115773 144270 -182370 -299734 -370166 -170620 -194072 15522
10475 -187462 -365827 -106587 -202079 -316222 30517 -33217 -169922 41808 4995 84722 -93721
10463 -81666 201616 -42363 -60487 39586 -328395 -505631 -148692 -274721 41754 -120117
10452 -6380 135757 164924 -308742 -45731 64893 -98634 -20716 -80673 -19656 224931 28881
10440I6805A0013J51823g0326P736j41216P4478l3469D7662a3632j27860e7272
10428f5250k77006b4760k03204C7329b58306g3799j20096B29880I0031M6201f1523
10416E18543c2292A97931h6158o127j52361a4335j00788B90666a87574e2165C41608
10404b33434B43910h6200L3492C03952a5083j02687j40639g7551B35181a03345
10393A47155n2170h0060j64669G4806E239b27933a2607f062j4068C38449j24973
10382B13476H8931g467A41019k2743L435k3345b80403E9467d00775C44884I4412
10370A77091L056H6244i249A98525j0270c5946B81607A02377J61542o835n7476
10359A99608q7457L48423B28210K9129J5253l5655J21588J37945O8715j64929
$$ plain form
10440 96805 10013 161836 -70326 -62590 -203806 -129328 -162797 47662 -13632 -141492 -57272
10428 -65250 -342256 -24760 -227964 37329 -258306 -73799 -193895 229880 90031 136232 -61523
10416 518543 -32292 197931 -86158 -92285 -244646 -14335 -115123 290666 -187574 -52165 341608
10404 -233434 243910 -86200 -52708 303952 -15083 -117770 -258409 -77551 235181 -103345
10393 147155 94985 -80060 -244729 74806 5239 -227933 -12607 -6062 -20130 338449 213476
10382 213476 88931 -7467 141019 118276 121711 98366 -280403 59467 -400775 344884 94412
10370 177091 180147 86244 -9249 198525 188255 -35946 281607 102377 263919 257084 199608
10359 199608 112151 460574 228210 257339 272592 236937 358525 496470 565185 400256
10349D00256k0574A84986R4208j0877j00842J88876j20652N7410Q4968A57029
10338B16269L27254k63146J38045o0699k8786K23831p8031B06806K61927j19297
10328C49436J15044A34558J68990k2266a60356A37570J71668G5046A9022J66007
10318A85029a24574K1356B24489j938a11580d1255J3279B52334G541K25434G4252
10306a78588A17987c9274A99784M421r6692n056j6802a22197a036j52284B93889
10294F5760b8956C87081b7774F2858J63849D0472d4425E2432a28849N1862i308
10282a91678J7043j39147A23671l0485b70142J14891a4199r4595H6236b01434
10271A9389a74216A19966c31969e9941k06112O5787m92j672A57981a84075g6828
$$ plain form
10349 400256 379682 184986 279194 268317 167475 356351 235699 293109 378077 157029
10338 216269 543523 280377 418422 357723 328937 552768 474737 206806 468733 349436
10328 349436 464480 134558 303548 281282 -160356 137570 309238 75046 19022 185029
10318 185029 -124574 -103218 224489 222551 -111580 -41255 -27976 252334 7541 232975 74252
10306 -178588 117987 -39274 199784 204205 107513 102457 85655 -122197 -1036 -153320 293889
10294 65760 -28956 387081 -27774 62858 226707 40472 -44425 52432 -128849 -76987 -9308
10282 -191678 -174635 -313782 123671 93186 -270142 -155251 -14199 -108794 86236 -201434
10271 19389 -174216 119966 -331969 -59941 -266053 -200266 -200758 -202430 157981 -184075 -76828
10259c02351N2250E8714a19986C01269f0294n6252m143A80888a1269B53673C7744
10247A31109n0421C3883a49400H2741a29336M8460D07648A60435a28965B66419
10236i6606j51248M8638A83146p6381q195j6326J50432P179a50568k8065j15290
10225b93923E34307a32560A22283c1203A73036J5433a07920o9664E3808a44459
10214I128b08330A50969o1503e0857A06535P2893n8202J15905f4314E8014a2051
10202A13593e2350j09660j14574b1455o4129A21566i2528E2664q820P5892Q331
10191A28067M5394i3598m5583e7930A0797c0037j60059A94305A1574K9381c7148
10179a25950A98867e0678q4881j15893i3169A0523a37414o9955A41919N6528k1288
$$ plain form
10259 -302351 -250101 58714 -119986 301269 -60294 -116546 -120689 180888 -11269 253673 37744
10247 131109 80688 33883 -149400 82741 -129336 -80876 407648 160435 -128965 266419
10236 -96606 -247854 -199216 183146 106765 98570 82244 232676 239855 -150568 -178633 -293923
10225 -293923 534307 -132560 122283 -31203 173036 188469 -107920 -177584 53808 -144459
10214 9128 -208330 150969 89466 -50857 106535 179428 121226 237131 -64314 58014 -12051
10202 113593 -52350 -162010 -276584 -21455 -85584 121566 -92528 52664 43844 119736 128067
10191 128067 173461 -93598 -139181 -57930 10797 -30037 -190096 194305 11574 40955 -37148
10179 -125950 198867 -50678 -135559 -251452 -93169 10523 -137414 -207369 141919 198447 177159
10168A77159d24187B46492b0667k02093A8186b28081L7000l7066g8557B18361
10157c01678a49934j2397B91535k3632Q3197a32384d7919j55551f2008j40378
10147b02386j26599A07462J15555c21782B20390q4371a67413N2053K8119j82096
10137b69337i8954a7825k3310J0434j89833I2221i3324j41333A42994J27835I8647
10125a37044k41993C3620a25546k1157O6333b3557p3239H4696i8828j05186E5000
10113a83273b5555A43856F9261c4753B42118c5861A36313D7500b5225o365j45718
10102a77308A4180M3615A8091b98605B90399c17589a36428d085k49053p8654B1910
10090A06314m6329b1778l25985A92726b99967D3341J97050b12385B5144L4931
$$ plain form
10168 177159 -424187 246492 -20667 -222760 18186 -228081 -191081 -228147 -78557 218361
10157 -301678 -149934 -162331 291535 267903 351100 -132384 -47919 -203470 -62008 -202386
10147 -202386 -328985 107462 223017 -321782 220390 136019 -167413 -115360 -87241 -269337
10137 -269337 -98954 -17825 -41135 -30701 -220534 92221 -93324 -234657 142994 270829 98647
10125 -137044 -379037 33620 -125546 -146703 -80370 -23557 -96796 84696 -98828 -204014 55000
10113 -183273 -25555 143856 69261 -34753 242118 -35861 136313 47500 -25225 -31590 -177308
10102 -177308 14180 57795 18091 -298605 290399 -317589 -136428 -4085 -253138 -331792 21910
10090 106314 59985 -21778 -347763 192726 -299967 43341 240391 -212385 25144 60075
10080F0075O058k4647d72426D7002M096b54985A743g7935B22703b32803A52573
10068e7614J1892j8537B20600A0202c00545J37662l2141A58695a16558a4027A05855
10056b15556O7914I5874K40924A67200a4713D0051M8263l9370N172g5457I1722
10044I2687a13336m0317G7818e3967C7080K16682b85424C9660b3141E1270b9773
10032A35537o0657B0061b24742b618j28463k21385b3340C6863J31728a48595O6379
10021h2216j68686P9247j9425g5951q6137B7428c05776A10953N5112b78331G8497
10009c43037J03235i3940j20859q1210Q5598l1410B78063a15822H7178D426J91980
9998A96406a34138A1215O3502a26023L4512e159A01094a39111N3195j9000k92892
$$ plain form
10080 60075 66133 41486 -472426 47002 51098 -254985 1743 -77935 222703 -232803 152573
10068 -57614 -45722 -64259 220600 10202 -300545 -162883 -195024 158695 -116558 -14027 105855
10056 -215556 -147642 95874 336798 167200 -14713 40051 88314 48944 54116 -75457 91722
10044 92687 -113336 -153653 77818 -53967 37080 253762 -285424 39660 -23141 51270 -29773
10032 135537 74880 20061 -224742 -2618 -131081 -352466 -23340 36863 168591 -148595 -82216
10021 -82216 -250902 -171655 -191080 -75951 -162088 27428 -305776 110953 166065 -278331 78497
10009 -343037 -239802 -93940 -214799 -296009 -210411 -241821 278063 -115822 87178 4426 196406
9998 196406 -134138 11215 74717 -126023 -91511 -5159 101094 -139111 -85916 -104916 -397808
9987c97808a97280B12858a70019b061A4440N1266L5298a0930m6027j27328b7149
9975C7302b86462a20376J157B08021A260Q7484b05110A87073n1306b52164A09812
9963a02813n2886j74451a40194n9500B03523a52948D70684b7503m4586j78268
9953b50357L5511e7385k67864A64643a77196B723a19497a0360j61488B0355b19448
9941b25485Q6828A48058m3261b14526H0074e7793J0676C13275h7557D9546j8804
9930C0742c4778q6515o714j65701n7576a01597I2968b13811L2640A15275J87775
9919C03050e1465j19279B9686O9505B5257i0410k40758A36150m2190e3958A75952
9907c9391I7091b82707A51910c1736j83145j06419j05297a02530m11l632G4567
$$ plain form
9987 -397808 -197280 212858 -170019 -2061 14440 65706 101004 -10930 -56957 -184285 -27149
9975 37302 -286462 -120376 -119219 208021 1260 88744 -205110 187073 135767 -252164 109812
9963 -102813 -155699 -330150 -140194 -199694 203523 -152948 470684 -27503 -72089 -250357
9953 -250357 -214846 -57385 -325249 164643 -177196 2723 -119497 -10360 -171848 20355 -219448
9941 -225485 -138657 148058 104797 -214526 80074 -57793 -47117 313275 -87557 49546 30742
9930 30742 -34778 -121293 -128007 -293708 -351284 -101597 92968 -213811 -181171 115275 303050
9919 303050 -51465 -170744 29686 99191 25257 -90410 -331168 136150 93960 -53958 175952
9907 -39391 97091 -282707 151910 -31736 -214881 -321300 -426597 -102530 -102941 -106573 74567
9895B50657b53024C2204e9024B02798h1560l92074a35738B51856h2625E0187h6378
9883a41557D3489a75258C0651b37000h4901A2698b34895a10367D8404L06368c97873
9871A28986Q7803a24557j60338i7198B1559a9709j74250K2301a0734j17785A95180
9859a72650A87765k1618a85921L9Q454A16682f9459A00377c3221A407d88108i6957
9846a8819k96287a53347K8578G7523a48759o8543h43l23056F2069R4199a72289
9834A27928K4106a53066A13054B656R1668J16123I6604m6248M6064f68l29251
9823c29919a04142e0400A0455e6706b3144B03461a78931B07952f3674p8195N431
9812a36438H2004J094M9797a66543i302A60681a87379c2585B74675e0899A21671
$$ plain form
9895 250657 -253024 32204 -59024 202798 -81560 -473634 -135738 251856 -82625 50187 -86378
9883 -141557 43489 -175258 30651 -237000 -84901 12698 -234895 -110367 48404 354772 -397873
9871 128986 216789 -124557 -284895 -97198 21559 -19709 -193959 -171658 -10734 -128519 195180
9859 -172650 187765 166147 -185921 -185882 -177428 116682 -69459 100377 -33221 1407 -488108 -96957
9846 -18819 -315106 -153347 -124769 77523 -148759 -217302 -843 -323899 62069 156268 -172289
9834 127928 152034 -153066 113054 2656 94324 210447 96604 50356 96420 -668 -329919
9823 -329919 -104142 -50400 10455 -56706 -23144 203461 -178931 207952 -63674 -141869 -136438
9812 -136438 82004 83098 132895 -166543 -9302 160681 -187379 -32585 274675 -50899 121671
9800F3784b2160D8734a35701A3133L09045j33875a73077D52a3365n4253j60984
9789b28602R6753l8175E0701a70742C09107d4661l4691j74924K7527b4730j80172
9778b04902O4890A08317m1940J14383h364B4695O5163b5188o8824J7215L774D0048
9765i2924A6967M17492A28492b02763d6592G8542a01841B08749f5851k05859D5707
9753a90954R1359q2999j3413J0999H1576d1244j51011h9241l23179J39471a6820
9741b63486b228l11122F6911a75925H6996b25391O3265A39338B678a64004N3513
9730a10491A68457a48551B8344c16463R8939d1529l9516m94F6146b50987J09921
9719a41066j15281A61480B9577a44985B13128F1920b74431C30134H7646i5768
$$ plain form
9800 63784 -22160 48734 -135701 13133 322178 188303 -173077 452 -13365 -67618 -228602
9789 -228602 -131849 -170024 50701 -170742 309107 -44661 -79352 -254276 -226749 -24730 -204902
9778 -204902 -140012 108317 66377 180760 -8364 24695 89858 -25188 -94012 -76797 -73023 40048
9765 -92924 16967 434459 128492 -202763 -46592 78542 -101841 208749 -65851 -271710 45707
9753 -190954 -99595 -182594 -196007 -185008 81576 -41244 -192255 -89241 -412420 -272949 -16820
9741 -263486 -2228 -313350 66911 -175925 86996 -225391 -162126 139338 2678 -164004 -110491
9730 -110491 168457 -148551 28344 -316463 -217524 -41529 -81045 -81539 66146 -250987 -141066
9719 -141066 -256347 161480 29577 -144985 213128 61920 -274431 330134 87646 -95768
9708B2243N0319J09930H2457c04893d6492l25360k0519B9158r634b57589o5145
9697c22734c0723l89722g1786R506R80k08242A55801b20140A85964b6115o0013
9686h6128p9114r0818A24680L0135c67474h1166A76795F2958b28605B43754a67562
9674i1510D6020b24702M3593o5471g8814E9799a94664L7667K8568j09658a13123
9662a75996B30497j10012N5063B309P8347D32P6169a14785j6442D5382b79709
9650B69938a78468o4632A17106R9503d50945K5356a46796P0011B18129a48013
9639a71520M3299e1685q9216J2187f3276C5718J41994e3311j19528L5336A4350
9627C12991a91514B38497a69785j03941B66518E3503a33474B8271q097c07923
$$ plain form
9708 22243 72562 182492 82457 -304893 -46492 -371852 -392371 29158 19524 -257589 -322734
9697 -322734 -30723 -420445 -71786 -62280 -61300 -269542 155801 -220140 185964 -26115 -86128
9686 -86128 -165242 -256060 124680 154815 -367474 -81166 176795 62958 -228605 243754 -167562
9674 -91510 46020 -224702 -181109 -246580 -78814 59799 -194664 -156997 -128429 -238087 -113123
9662 -175996 230497 120485 175548 2309 80656 432 76601 -114785 -131227 45382 -279709
9650 269938 -178468 -243100 117106 216609 -450945 -425589 -146796 -76785 218129 -148013
9639 -171520 -128221 -51685 -140901 -128714 -63276 35718 177712 -53311 -172839 -137503 14350
9627 312991 -191514 238497 -169785 -273726 266518 53503 -133474 28271 20174 -307923
9616a62356c5888k19684a23373k11212a04394B27952a02134R170k15714p4042
9606c82720a64886A60222d8332k42050b4251j70264c4031q2787a9234C5827c85773
9594H9031c4820A1671b06223B56852l3079C4964J77427A3906b74797C86468a02447
9582a07706K6927L7712C29810e5963o5305c2217j4894j31536l82874J27358b2194
9570a32420e198F902M6099j477f8757C828f8716B63355b56773A50737a44539j4706
9558a59245L9110d9628A25903d5629C9445b91300F9246e68106B15438l3083J65609
9547C47964C2483b91292B40232d1582j28033n4812Q3930k45739a65636f3129E5980
9535d90971g4919A24336J116F1379a69299O9121j5558A8571c32537a03437k08192
$$ plain form
9616 -162356 -35888 -255572 -123373 -334585 -104394 227952 -102134 -92964 -308678 -382720
9606 -382720 -164886 160222 -48332 -290382 -24251 -194515 -34031 -116818 -19234 35827 -385773
9594 89031 -34820 11671 -206223 256852 223773 34964 212391 13906 -274797 386468 -102447
9582 -107706 -80779 -43067 329810 -55963 -121268 -32217 -47111 -178647 -561521 -434163 -22194
9570 -132420 -5198 6902 53001 51524 -68757 3828 -68716 263355 -256773 150737 -144539 -159245
9558 -159245 -120135 -49628 125903 -45629 39445 -291300 69246 -568106 215438 182355 347964
9547 347964 32483 -291292 240232 -41582 -169615 -224427 -140497 -386236 -165636 -63129 55980
9535 -490971 -74919 124336 125452 61379 -169299 -100178 -115736 18571 -332537 -103437 -311629
9524c11629a17545a2925l91190I9438K4787k0049l0501K60414a4105B47884a78616
9512a87091e4425j99470e1350j63831B31132a75341c2799j57468C17034A34965
9501D4775d7218r8446k9970d8597E496e234j81658l22547b9724j8679B49301D8724
9488A29781g8164P166j03448a0972G1524c8984l88625h3693m8549k24169J58705
9477a97706k02526J98755R1372c6562B6064k771J19706a61035H4746a65295c2182
9465b32069a053j21743B35a00617d4659G6909a48603e5887j2502b0535A3204i2077
9452C60945j22125m1298k5471a72700k53136C00628J3016a16703F8557K85811
9442C54368a30039k35397a1375c437p3752l53869E5672b57295h2946c2849j82569
$$ plain form
9524 -311629 -117545 -12925 -404115 99438 124225 104176 73675 334089 -14105 247884 -178616
9512 -187091 -54425 -253895 -51350 -215181 231132 -175341 -32799 -190267 317034 134965
9501 44775 -47218 -145664 -175634 -48597 5496 -5234 -186892 -509439 -29724 -48403 249301 48724
9488 129781 -78164 -70998 -174446 -10972 71524 -38984 -427609 -83693 -132242 -356411 -197706
9477 -197706 -400232 -201477 -110105 -36562 26064 23293 142999 -161035 84746 -165295 -32182
9465 -232069 -1053 -122796 235 -100617 -44659 76909 -148603 -55887 -68389 -20535 13204 -92077
9452 360945 238820 197522 172051 -172700 -425836 300628 313644 -116703 68557 354368
9442 354368 -130039 -365436 -11375 -3437 -77189 -431058 55672 -257295 -82946 -32849 -215418
9431b15418B39352b6122l36797J19736o2443K018E0119d4253j40458A26959a98916
9419F8308b46854a357B3713K29284b8805C380a43457O9646a2852j51292A89836
9407A6359g1487K5854j38637L9291B47830e1984j12307j33317N6775I5390a1519
9395a45961j54811a34161b3504j03220A9002a23143p8863N8754j10192R6460l7086
9384a94070l3022C1692b09455e630j199A36827b86087m11323B48902f203j43649
9373a49852g4187J9077k82806A00012a57243C6583a31741G0333a27006l61225
9363d88231a56018a9188a474r6172J0669D6336h4558l67313A10543M3472c02971
9351g9330b8332a2831j3655B10150a77619Q769P1235a2464n4181G3958a03039
$$ plain form
9431 -215418 239352 -26122 -362919 -243183 -305626 -303608 50119 -44253 -184711 126959 -198916
9419 68308 -246854 -1357 23713 252997 -28805 3380 -143457 -73811 -12852 -164144 189836
9407 16359 -71487 -45633 -184270 -144979 247830 -51984 -164291 -297608 -240833 95390 -11519
9395 -145961 -300772 -134161 -23504 -126724 19002 -123143 -202006 -143252 -253444 -156984 -194070
9384 -194070 -227092 31692 -209455 -5630 -6829 136827 -286087 -697410 248902 -6203 -149852
9373 -149852 -74187 -55110 -337916 100012 -157243 36583 -131741 70333 -127006 -488231
9363 -488231 -156018 -19188 -1474 -97646 -86977 46336 -84558 -451871 110543 154015 -302971
9351 -79330 -28332 -12831 -26486 210150 -177619 -168850 -97615 -12464 -66645 73958 -103039
9339c37332a36546e398A96597a61865L8174a0403j26897O4298k77282a10856b0430
9327F7254i6349j06472L8565D1694d4681j5837A72288c8263B11620J849i5063
9315B67194b98010J38121n3496h8356r4798b7612k45086a20093j2001F409J51301
9304A57710A7141a84068j40965d2706C7327a05375D1855O4384L6852b50464E654
9292g8657a4372k56327B9425L31241M8550c88910H6507J91581I9353h8954A10424
9280b2605m9506F4801J09309a85109Q8250K4344j435A5223e8898F2487g5551c171
9267g8372l00427E0519b76866A83138K655a14512k46495A4072b17357k509j04855
9256c24721c4327j64931e9563a1380F1552j0159A4806f6151j92023p6931a67121
$$ plain form
9339 -337332 -136546 -5398 196597 -161865 -123691 -10403 -137300 -73002 -350284 -110856 -20430
9327 67254 -96349 -202821 -164256 41694 -44681 -60518 172288 -38263 211620 213469 -95063
9315 267194 -298010 -159889 -213385 -88356 -183154 -27612 -272698 -120093 -132094 6409 157710
9304 157710 17141 -184068 -325033 -42706 37327 -105375 41855 106239 143091 -250464 5654
9292 -78657 -14372 -270699 29425 360666 409216 -388910 86507 278088 99353 -88954 110424
9280 -22605 -72111 64801 174110 -185109 -96859 -72515 -73950 15223 -58898 62487 -75551 -3171
9267 -78372 -378799 50519 -276866 183138 185793 -114512 -361007 14072 -217357 -219866 -324721
9256 -324721 -34327 -199258 -59563 -11380 61552 51393 14806 -66151 -258174 -335105 -167121
9244A33126A1148N2436M5952a91789k22346A81415b87698B47271A11976c10739
9233d02430e5186m6386B2555a75301k6601J9295E7442b56285d5849A54993a15386
9221i8853G5439a77038A69188K7182K6090I2631b02219a8989k23258e6008l8813
9210i4821F3074a52988I0005f440k7995j10996C71929A1324a77298P0028K7228
9199h0042A25726F412g7315p1957d0817A09716f3708j03479A80711j851p3475
9188A05385e9460A47490b37224J06184e0923l69007H6269f2258B82101F4469a06403
9176A45187b18156Q6245Q856N1060p6400n6767A06123b50506q6719e3987A44166
9164G8642J21752E296K14403h4550K3852A3900a43542e4527C8699a10123k62866
$$ plain form
9244 133126 11148 63584 109536 -191789 -414135 181415 -287698 247271 111976 -310739
9233 -402430 -55186 -101572 22555 -175301 -201902 -182607 57442 -256285 -45849 154993 -115386
9221 -98853 75439 -177038 169188 196370 222460 92631 -202219 -18989 -242247 -56008 -94821
9210 -94821 63074 -152988 90005 -6440 -34435 -145431 371929 11324 -177298 -107270 -80042
9199 -80042 125726 6412 -77315 -149272 -40817 109716 -63708 -167187 180711 178860 105385
9188 105385 -59460 147490 -237224 -131040 -50923 -419930 86269 -62258 282101 64469 -106403
9176 145187 -218156 -131911 -123055 -71995 -148395 -205162 106123 -250506 -337225 -53987 144166
9164 78642 200394 5296 219699 -84550 -60698 13900 -143542 -54527 38699 -110123 -372989
9153c72989B69964A6773a2313A87586p3265g8138k92612J62187d2693j53435B4417
9141F9243b36613A49294b12315e6891G6240J5228a36007B47479b57329J22059
9131a35270B02794a76804C6498J16457a27751i049k65689B54621r6647a13558
9120a589n4493D3238J93448A12485b79201A49177c09476F6711g7181B32576C1996
9108b81960l4046A34250a14174A09702e6593G6130a85100b770j67194d3207D3474
9096a4279o0971A96846l5444G4254L7471J25389f4522F7380q205b27747j49077
9085c76824K752J79678h3025J957j36491A14597J0954o2734L7187j220h7283a0099
9072b48534A92218b01874N7091d4225A97985I4294b92302a19903k2563o0875C13806
$$ plain form
9153 -372989 269964 16773 -12313 187586 114321 -78138 -370750 -208563 -42693 -196128 24417
9141 69243 -236613 149294 -212315 -56891 76240 91468 -136007 247479 -257329 -135270
9131 -135270 202794 -176804 36498 152955 -127751 -9049 -274738 254621 157974 -113558
9120 -1589 -56082 43238 236686 112485 -279201 149177 -309476 66711 -77181 232576 31996
9108 -281960 -316006 134250 -114174 109702 -56593 76130 -185100 -2770 -169964 -43207 43474
9096 -14279 -75250 196846 161402 74254 111725 237114 -64522 67380 59175 -227747 -376824
9085 -376824 -374072 -194394 -83025 -81068 -217559 114597 125551 62817 100004 98784 -87283 -10099
9072 -248534 192218 -201874 -144783 -44225 197985 94294 -292302 -119903 -142466 -203341 313806
9060b37048i3240l9744c8424j66145A13777e10432K14689I793d361A54570C3855
9048C55a65971F0935h0273l3652j65076a1945j36190Q918l1625A68203D5790a52150
9035E6540c82532d0477a8897m6035J1I7443g9813A59905c91858J54058a07550
9023b02195L5535H3758b04790A78409i3409A25561l4062L0357b1592E4547a76223
9011e8165J9954C9755a54395L663b9258B18922A8568a79277M9408B10573n2831
9000A57742h9255C37967c45364K9769i1046m02395g9207c6533A8430N506e1990
8988h3780Q230C4563a77445e6238H1930c5349k66753B53380I5146H174i3946k2499
8976a16445m4991A20783d2869j03391j13546K9101J1584P2364m1274R0099a6240
$$ plain form
9060 -237048 -93240 -132984 -38424 -204569 113777 -510432 -295743 9793 -4361 154570 33855
9048 355 -165971 60935 -80273 -113925 -279001 -11945 -148135 -139217 -170842 168203 45790 -152150
9035 56540 -382532 -40477 -18897 -64932 -64921 97443 -79813 159905 -391858 -237800 -107550
9023 -202195 -166660 83758 -204790 178409 -93409 125561 91499 121856 -21592 54547 -176223
9011 -58165 -38211 39755 -154395 -150732 -29258 218922 18568 -179277 -129869 210573 157742
9000 157742 -89255 337967 -345364 -315595 -91046 -493441 -79207 -36533 18430 23936 -51990
8988 -83780 -75550 34563 -177445 -56238 81930 -35349 -302102 253380 95146 8174 -93946 -116445
8976 -116445 -161436 120783 -42869 -146260 -259806 -230705 -219121 -146757 -188031 -97932 -16240
8964A86878a96498b8899m58778I1373i520r7436L1508B6749b58731J21321l83505
8953e20915E2818a36470L1366j53556G1294a75706E3114d3234l2982I562a50269
8941A49989a05674E0562J58026D3469g1848a6634k3906k21610a4057j76604B12225
8929h0588E6177J0087F21J77257e6056n36948g7025A28469a2421j21101A60484
8917c51226C46752A14871l0367L15508A27214M23174B40355O93505K34658N41661
8907A710179J443361K281739L111035D162227j778170A181183k16488m48558k18793
8898B97344b94520D76041k18114b05562C10557I8867M7587J07430r1882c8668
8887C02624e216B838J05770a21651j19456A81504H8443a31714C67666c3309E9286
$$ plain form
8964 186878 -196498 -28899 -487677 91373 -9520 -106956 -75448 26749 -258731 -137410 -520915
8953 -520915 52818 -136470 -105104 -258660 71294 -175706 53114 -43234 -76216 9562 -150269
8941 149989 -105674 50562 208588 43469 -71848 -16634 -40540 -262150 -14057 -190661 212225
8929 -80588 56177 66264 621 177878 -56056 -593004 -77025 128469 -12421 -133522 160484
8917 -351226 346752 114871 84504 400012 127214 550388 240355 933860 1168518 1710179
8907 1710179 3153540 5435279 8546314 4162227 2384057 1181183 964695 516137 297344
8898 297344 -294520 476041 257927 -205562 310557 98867 146454 253884 162002 -38668
8887 302624 -5216 2838 108608 -121651 -241107 181504 88443 -131714 367666 -33309 59286
8875F9266h7101B43787q3732a13153I5232a43649O778A65541j6992J5090A245
8863C81535a41931e5452P561j78792P4376B7029O9486a2023j8736q8881j03345
8852b22985L9799g4763A12870a11653j28570F0476e00910H7336J85055h3708H0960
8840g8965k9429j8408J1599p0322A34092a79147A2856M3364e34j46382r6704B34505
$$ plain form
8875 69266 -87101 243787 160055 -113153 95232 -143649 -136871 165541 148549 163639 1245
8863 381535 -141931 -55452 -47891 -226683 -152307 27029 96515 -12023 -30759 -119640 -222985
8852 -222985 -183186 -74763 112870 -111653 -240223 60476 -500910 87336 272391 -83708 80960
8840 -78965 -108394 -126802 -115203 -185525 134092 -179147 12856 56220 -534 -146916 -243620 234505
$$ [...]
##END NTUPLES=NMR SPECTRUM
##END=
