
##TITLE=UV1157_M5-1005-1002_6301996_zVrpTGSFuX
##JCAMPDX= 6.0         $$ Bruker NMR JCAMP-DX V2.0
##DATA TYPE= NMR SPECTRUM
##DATA CLASS= NTUPLES
##ORIGIN= BRUKER
##OWNER= Administrator
$$ 1.72 TOPSPIN		Version 2.1
$$ 2012-06-06 15:36:00.500 -0500  Administrator@TOPSPIN
$$ Compression mode = diff/dup
##.OBSERVE FREQUENCY= 400.13188235
##.OBSERVE NUCLEUS= ^1H
##.ACQUISITION MODE= SIMULTANEOUS (DQD)
##.ACQUISITION SCHEME= undefined
##.AVERAGES= 64
##.DIGITISER RES= 22
##SPECTROMETER/DATA SYSTEM= spect
##.PULSE SEQUENCE= noesygpps1d.comp
##.SOLVENT NAME= COFFEE_meoh
##.SHIFT REFERENCE= INTERNAL, COFFEE_meoh, 1, 14.967
##AUDIT TRAIL= $$ (NUMBER, WHEN, WHO, WHERE, PROCESS, VERSION, WHAT)
$$ ##TITLE= Audit trail, TOPSPIN		Version 2.1
$$ ##JCAMPDX= 5.01
$$ ##ORIGIN= Bruker BioSpin GmbH
$$ ##OWNER= Administrator
$$ $$ C:\Bruker\TOPSPIN/data/COFFEE/nmr/UV1157_M5-1005-1002_6301996_zVrpTGSFuX/12/pdata/1/auditp.txt
$$ ##AUDIT TRAIL=  $$ (NUMBER, WHEN, WHO, WHERE, PROCESS, VERSION, WHAT)
(   1,<2012-06-06 02:31:28.125 -0500>,<Administrator>,<TOPSPIN>,<go>,<TOPSPIN 2.1>,
      <created by zg
	started at 2012-06-06 02:19:57.968 -0500,
	POWCHK enabled, PULCHK disabled,
       configuration hash MD5:
       D5 CA 7A 23 FE 6B EE E2 50 67 74 61 24 F7 5E 3B
       data hash MD5: 64K
       D3 43 28 20 F8 FF B5 57 BE 63 D2 25 ED 83 9B CF>)
(   2,<2012-06-06 02:31:30.984 -0500>,<Administrator>,<TOPSPIN>,<proc1d>,<TOPSPIN 2.1>,
      <Start of raw data processing
       efp LB = 0.3 FT_mod = 6 PKNL = 1 PHC0 = 0 PHC1 = 0 SI = 128K 
       data hash MD5: 128K
       FE 50 3D 97 53 6D 49 FC 6F AC F8 10 3D 5A 82 87>)
(   3,<2012-06-06 02:31:32.218 -0500>,<Administrator>,<TOPSPIN>,<proc1d>,<TOPSPIN 2.1>,
      <pk PHC0 = 33.349 PHC1 = 0 
       data hash MD5: 128K
       A6 E4 62 D6 C9 E7 84 2A 6A D1 42 88 01 E6 13 9C>)
(   4,<2012-06-06 02:31:33.046 -0500>,<Administrator>,<TOPSPIN>,<proc1d>,<TOPSPIN 2.1>,
      <abs ABSG = 1 
       data hash MD5: 128K
       B4 AF 35 F6 01 73 EC A2 03 2B 87 51 D0 70 F1 76>)
(   5,<2012-06-06 02:31:33.125 -0500>,<Administrator>,<TOPSPIN>,<proc1d>,<TOPSPIN 2.1>,
      <abs ABSG = 2 
       data hash MD5: 128K
       6C CF 42 45 8F 8E B4 40 B3 05 1A B7 2A EF E5 9C>)
(   6,<2012-06-06 02:31:33.187 -0500>,<Administrator>,<TOPSPIN>,<proc1d>,<TOPSPIN 2.1>,
      <abs ABSG = 3 
       data hash MD5: 128K
       89 4A DA 96 BE 06 ED 3A ED 30 32 23 DE B5 E9 38>)
(   7,<2012-06-06 02:31:33.250 -0500>,<Administrator>,<TOPSPIN>,<proc1d>,<TOPSPIN 2.1>,
      <abs ABSG = 4 
       data hash MD5: 128K
       8F A7 DF 9A D1 95 9D C8 18 91 B7 E0 27 93 C9 86>)
(   8,<2012-06-06 02:31:33.296 -0500>,<Administrator>,<TOPSPIN>,<proc1d>,<TOPSPIN 2.1>,
      <abs ABSG = 5 
       data hash MD5: 128K
       BD 3A 5D 3F FA DE 9A 7A 61 8F 2D A2 19 31 88 91>)
(   9,<2012-06-06 02:31:35.828 -0500>,<Administrator>,<TOPSPIN>,<audit>,<TOPSPIN 2.1>,
      <user comment:
       ICON-NMR User ID: COFFEE
       data hash MD5: 128K
$$ [...]
150 150 150 150 150 150 150 150
##$TP07= 0
##$TPNAME0= <>
##$TPNAME1= <>
##$TPNAME2= <>
##$TPNAME3= <>
##$TPNAME4= <>
##$TPNAME5= <>
##$TPNAME6= <>
##$TPNAME7= <>
##$TPOAL= (0..7)
0.5 0.5 0.5 0.5 0.5 0.5 0.5 0.5
##$TPOFFS= (0..7)
0 0 0 0 0 0 0 0
##$TUNHIN= 0
##$TUNHOUT= 0
##$TUNXOUT= 0
##$USERA1= <user>
##$USERA2= <user>
##$USERA3= <user>
##$USERA4= <user>
##$USERA5= <user>
##$V9= 5
##$VALIST= <valist>
##$VCLIST= <CCCCCCCCCCCCCCC>
##$VD= 0
##$VDLIST= <DDDDDDDDDDDDDDD>
##$VPLIST= <PPPPPPPPPPPPPPP>
##$VTLIST= <TTTTTTTTTTTTTTT>
##$WBST= 2048
##$WBSW= 25
##$XGAIN= (0..3)
0 0 0 0
##$XL= 0
##$YL= 0
##$YMAX_a= 10277045
##$YMIN_a= -6767499
##$ZGOPTNS= <>
##$ZL1= 120
##$ZL2= 120
##$ZL3= 120
##$ZL4= 120
##$ABSF1= 14.967
##$ABSF2= -5.58553
##$ABSG= 5
##$ABSL= 3
##$ALPHA= 0
##$AQORDER= 0
##$ASSFAC= 0
##$ASSFACI= 0
##$ASSFACX= 0
##$ASSWID= 0
##$AUNMP= <proc_prof1d_extract.lims>
##$AXLEFT= 0
##$AXNAME= <>
##$AXNUC= <1H>
##$AXRIGHT= 0
##$AXTYPE= 0
##$AXUNIT= <>
##$AZFE= 0.1
##$AZFW= 0.1
##$BCFW= 0
##$BC_mod= 0
##$BYTORDP= 0
##$COROFFS= 0
##$CY= 15
##$DATMOD= 1
##$DC= 0
##$DFILT= <>
##$DTYPP= 0
##$F1P= 0
##$F2P= 0
##$FCOR= 0.5
##$FTSIZE= 131072
##$FT_mod= 6
##$GAMMA= 0
##$GB= 0
##$INTBC= 1
##$INTSCL= 1
##$ISEN= 128
##$LB= 0.3
##$LEV0= 0
##$LPBIN= 0
##$MAXI= 10000
##$MC2= 0
##$MEAN= 0
##$ME_mod= 0
##$MI= 0
##$NCOEF= 0
##$NC_proc= -3
##$NLEV= 6
##$NOISF1= 0
##$NOISF2= 0
##$NSP= 0
##$NTH_PI= 0
##$NZP= 0
##$OFFSET= 14.967
##$PC= 1
##$PHC0= 33.349
##$PHC1= 0
##$PH_mod= 1
##$PKNL= yes
##$PPARMOD= 0
##$PPDIAG= 0
##$PPIPTYP= 0
##$PPMPNUM= 2147483647
##$PPRESOL= 1
##$PSCAL= 4
##$PSIGN= 0
##$PYNMP= <proc.py>
##$REVERSE= no
##$SF= 400.130005446887
##$SI= 131072
##$SIGF1= 0
##$SIGF2= 0
##$SINO= 400
##$SIOLD= 131072
##$SPECTYP= <>
##$SREGLST= <1H.CDCl3>
##$SSB= 0
##$STSI= 131072
##$STSR= 0
##$SW_p= 8223.68421052632
##$SYMM= 0
##$S_DEV= 0
##$TDeff= 65536
##$TDoff= 0
##$TI= <>
##$TILT= no
##$TM1= 0
##$TM2= 0
##$TOPLEV= 0
##$USERP1= <user>
##$USERP2= <user>
##$USERP3= <user>
##$USERP4= <user>
##$USERP5= <user>
##$WDW= 1
##$XDIM= 131072
##$YMAX_p= 453058556
##$YMIN_p= -404931838
##$CURPLOT= <Network HP LaserJet P1505>
##$CURPRIN= <$Network HP LaserJet P1505>
##$DFORMAT= <normdp>
##$LAYOUT= <+/1D_H.xwp>
##$LFORMAT= <normlp>
##$PFORMAT= <normpl>
##$SURQMSG= 1
$$ End of Bruker specific parameters
$$ ---------------------------------
##NTUPLES= NMR SPECTRUM
##VAR_NAME=  FREQUENCY,     SPECTRUM/REAL,   SPECTRUM/IMAG
##SYMBOL=    X,             R,               I
##VAR_TYPE=  INDEPENDENT,   DEPENDENT,       DEPENDENT
##VAR_FORM=  AFFN,          ASDF,            ASDF
##VAR_DIM=   131072,        131072,          131072
##UNITS=     HZ,            ARBITRARY UNITS, ARBITRARY UNITS
##FACTOR=    0.0627417313425165, 1,          1
##FIRST=     8223.62146879498, 1160,         -102698
##LAST=      0,             3428,            -102005
##MIN=       0,             -404931838,      0
##MAX=       8223.62146879498, 453058556,    0
$$ Real data points
##PAGE= N=1
##DATA TABLE= (X++(R..R)), XYDATA
$$ [...]
63589E25531m678k685k013k292k017m74J433K566L004L643M895O316P336P858
$$ 525531 520853 518168 516155 513863 511846 511372 512805 515371 518375 522018 526913 533229 540565 548423
63575E48423Q139Q383Q547Q680R223J0614J2502J3969J4787J5788J7474J9124
$$ 548423 556562 564945 573492 582172 591395 602009 614511 628480 643267 659055 676529 695653
63563F95653K0153K1419K3871K6565K7840K8176K9855L3513L7033L8535L8688
$$ 695653 715806 737225 761096 787661 815501 843677 873532 907045 944078 982613 1021301
63552A021301L9067L9879M0670M1885M3910M5370M4116L9770L4065K8732K3948
$$ 1021301 1060368 1100247 1140917 1182802 1226712 1272082 1316198 1355968 1390033 1418765 1442713
63541A442713J8852J2840O395R24k501m422o394q925j0997j2022j3063j5253j8214
$$ 1442713 1461565 1474405 1480800 1481724 1479223 1474801 1468407 1459482 1448485 1436463 1423400 1408147 1389933
63528A389933k0911k3053k4559k4820k3747k2382k1154j8802j4725j1010r867
$$ 1389933 1369022 1345969 1321410 1296590 1272843 1250461 1229307 1210505 1195780 1184770 1174903
63517A174903j0042q459m898k067r72O17M159P740R201R632J1562J5035J7651
$$ 1174903 1164861 1156402 1151504 1149437 1148465 1149082 1153241 1160981 1170182 1179814 1191376 1206411 1224062
63504A224062J7972J7075J6893J8302K0820K3227K4343K3934K3023K3072K4893
$$ 1224062 1242034 1259109 1276002 1294304 1315124 1338351 1362694 1386628 1409651 1432723 1457616
63493A457616K8323L2475L6136L8508L9925M1472M3596M5411M5444M2685L6941
$$ 1457616 1485939 1518414 1554550 1593058 1632983 1674455 1718051 1763462 1808906 1851591 1888532
63482A888532K8863J9722J0621J922n990j1769j4074j3623j2968j3849j5752j7499
$$ 1888532 1917395 1937117 1947738 1949660 1943670 1931901 1917827 1904204 1891236 1877387 1861635 1844136
63470A844136j9102k1355k4446k7924l1483l5091l8656m1947m4490m5452m4318
$$ 1844136 1825034 1803679 1779233 1751309 1719826 1684735 1646079 1604132 1559642 1514190 1469872
63459A469872m1807l9318l7259l4902l2062k9748k8598k7728k5905k3082k0081
$$ 1469872 1428065 1388747 1351488 1316586 1284524 1254776 1226178 1198450 1172545 1149463 1129382
63448A129382j7534j5739j4697j3643j1454q351o332o979r396j1142j0748q729
$$ 1129382 1111848 1096109 1081412 1067769 1056315 1047964 1041632 1034653 1025257 1014115 1003367 994638
63436I94638o673n977o895q216q320o891m976l410k246j754k379l142j919J615
$$ 994638 987965 981988 975093 966877 958557 951666 946690 943280 941034 939280 936901 933759 931840 933455
63422I33455M932N760M775L881L456L053L227M400N006L116o06l781n625p295
$$ 933455 938387 944147 948922 952803 956259 959312 962539 966939 971945 975061 974455 970674 965049 957754
63408I57754r303j0820j1406j1395j0690r056p503p411q370q900q926r298r122
$$ 957754 948451 937631 926225 914830 904140 895084 887581 880170 871800 862900 853974 844676 835554
63395H35554o502k132Q55J404J919M002N907N992N967Q165J1653J3736J4020J4402
$$ 835554 829052 826920 827775 829179 831098 835100 841007 846999 852966 861131 872784 886520 900540 914942
63381I14942J5958J8240K1077K4839K9100L2865L5932L8461L9642L8469L5616
$$ 914942 930900 949140 970217 995056 1024156 1057021 1092953 1131414 1171056 1209525 1245141
63370A245141L2934L1154K9650K8252K7737K8421K9745L1382L3469L5754L7859
$$ 1245141 1278075 1309229 1338879 1367131 1394868 1423289 1453034 1484416 1517885 1553639 1591498
63359A591498M0342M3888M7398M8546M6671M3447L9990L5074K7314J7844R291
$$ 1591498 1631840 1675728 1723126 1771672 1818343 1861790 1901780 1936854 1964168 1982012 1991303
63348A991303K808k534p750j2534j5910j7497j8022j8998k1720k6109l0699l3997
$$ 1991303 1994111 1991577 1983827 1971293 1955383 1937886 1919864 1900866 1879146 1853037 1822338 1788341
63336A788341l5691l6332l6309l5731l4866l3979l2779l0601k7251k3251j9232
$$ 1788341 1752650 1716318 1680009 1644278 1609412 1575433 1542654 1512053 1484802 1461551 1442319
63325A442319j5497j2168r332o765l928o54K411M475N812P805J1357J5468J8082
$$ 1442319 1426822 1414654 1405322 1398557 1394629 1393975 1396386 1400861 1406673 1414478 1425835 1441303 1459385
63312A459385J8450J8095J8960K1101K2993K3868K4787K7067L0510L3795L6183
$$ 1459385 1477835 1495930 1514890 1535991 1558984 1582852 1607639 1634706 1665216 1699011 1735194
63301A735194L8063L9938M1689M3006M4005M4887M5223M4064M0874L5997K9922
$$ 1735194 1773257 1813195 1854884 1897890 1941895 1986782 2032005 2076069 2116943 2152940 2182862
63290B182862K2485J3458L837m297r734j3387j6887k0385k2762k3777k4831k7252
$$ 2182862 2205347 2218805 2222642 2218345 2208611 2195224 2178337 2157952 2135190 2111413 2086582 2059330
63278B059330l0903l4984l9168m3058m5454m5468m3981m2763m2255m1388l9516
$$ 2059330 2028427 1993443 1954275 1911217 1865763 1820295 1776314 1733551 1691296 1649908 1610392
63267A610392l7243l4998l2079k7892k3227j9408j6738j4569j2601j1417j1876
$$ 1610392 1573149 1538151 1506072 1478180 1454953 1435545 1418807 1404238 1391637 1380220 1368344
63256A368344j4292j7947k1128k2241k1342k0012j9297j8517j6808j4900j4188
$$ 1368344 1354052 1336105 1314977 1292736 1271394 1251382 1232085 1213568 1196760 1181860 1167672
63245A167672j4690j5321j5721j6353j6969j6691j5703j5222j5453j5207j4103
$$ 1167672 1152982 1137661 1121940 1105587 1088618 1071927 1056224 1041002 1025549 1010342 996239
63234I96239j3372j3587j3412j1893j0362j0312j0736r742p918p648r335j0746
$$ 996239 982867 969280 955868 943975 933613 923301 912565 902823 894905 887257 877922 867176
63222H67176j0370r182q373p400n556l826l663m866o099o898p805q951r743r913
$$ 867176 856806 847624 839251 831851 826295 822469 818806 813940 807841 800943 793138 784187 774444 764531
63208G64531r899j0040j0110r726q755p336n898n079n216n906o378o203n455m493
$$ 764531 754632 744592 734482 724756 716001 708665 702767 697688 692472 686566 680188 673985 668530 664037
63194F64037l846l896m299m152l249k658l330m531m692l586k523k236j824m13
$$ 664037 660191 656295 651996 647844 644595 641937 638607 634076 629384 625798 623275 621039 619215 618802
63180F18802J167J411K27j041j395j022l54N91J651K279K376K687L648M420L957
$$ 618802 619969 621380 621607 620566 619171 618149 617795 618386 620037 622316 624692 627379 631027 635447 639404
63165F39404K639J915K351L039L042K502J970J628J759L040N391P185O830M916
$$ 639404 642043 643958 646309 649348 652390 654892 656862 658490 660249 663289 668680 675865 682695 687611
63151F87611L739M570O377P351O740M878K401J80o54M57K698M561N359N715O576
$$ 687611 691350 695920 702297 709648 716388 721266 723667 723847 723193 723650 726348 730909 736268 741983 748559
63136G48559Q178J0010J1467J2264J2323J1641J0493R593R669J0813J2530J4463
$$ 748559 756737 766747 778214 790478 802801 814442 824935 834528 844197 855010 867540 882003
63124H82003J6563J8467J9384J9189J8961J9707K0901K1135J9918J7955J6029
$$ 882003 898566 917033 936417 955606 974567 994274 1015175 1036310 1056228 1074183 1090212
63113A090212J4711J4821J6584J8191J6880J2170O718L105J059j178m041o689
$$ 1090212 1104923 1119744 1136328 1154519 1171399 1183569 1190287 1193392 1194451 1193273 1189232 1182543
63101A182543q887j1114j3243j4779j6244j8670k1643k3365k3092k2084k1550
$$ 1182543 1173656 1162542 1149299 1134520 1118276 1099606 1077963 1054598 1031506 1009422 987872
63090I87872k1028j9645j7847j6710j6191j5344j3854j2268j0802r025o926n344
$$ 987872 966844 947199 929352 912642 896451 881107 867253 854985 844183 835158 828232 822888
63078H22888m893n029m751l755k443j100L66J841K822L015K821K927L536M293
$$ 822888 817995 812966 808215 804460 802017 800917 801283 803124 805946 808961 811782 814709 818245 822538
63064H22538M869N327N971O990Q324R675J0577J0699J0135R411R023R076R308
$$ 822538 827407 832734 838705 845695 854019 863694 874271 884970 895105 904516 913539 922615 931923
63051I31923R406R258Q956Q616Q309Q150Q303Q632Q546P722O971P603R631J1374
$$ 931923 941329 950587 959543 968159 976468 984618 992921 1001553 1010099 1017821 1024792 1032395 1042026 1053400
63037A053400J1577J1183J1904J3506J3903J1983Q967O576N066L688K060K46j760
$$ 1053400 1064977 1076160 1088064 1101570 1115473 1127456 1136423 1142999 1148065 1151753 1153813 1154059 1152299
63024A152299l875n816p734j0129j2539j3367j2074j0618j1269j3556j4920j4109
$$ 1152299 1148424 1142608 1134874 1124745 1112206 1098839 1086765 1076147 1064878 1051322 1036402 1022293
63012A022293j2263j0669r294p988p437p858p990o579m060j736O8J832L363L929
$$ 1022293 1010030 999361 990067 982079 974642 966784 958794 952215 948155 946419 946487 948319 951682 955611
62998I55611L804M320N953P415P473O888P648J0385J3498J4989J4548J3482J2940
$$ 955611 959415 963735 969688 977103 984576 991464 999112 1009497 1022995 1037984 1052532 1066014 1078954
62985A078954J2869J2663J2335J2585J3746J5081J5506J4923J4335J4394J4336
$$ 1078954 1091823 1104486 1116821 1129406 1143152 1158233 1173739 1188662 1202997 1217391 1231727
62974A231727J3028J0794R104Q300O837L602J8j508p07L40n7j650l494n153o245
$$ 1231727 1244755 1255549 1264653 1272953 1279790 1283392 1283410 1281902 1281195 1281535 1281478 1279828 1276334 1271181 1264936
62959A264936o266n569n272n406m477j812J024K521L602O037R418J1819J2917
$$ 1264936 1258670 1253101 1247829 1242423 1237946 1236134 1237158 1239679 1243281 1249318 1258736 1270555 1283472
62946A283472J4299J6743J9232K1070K2903K5053K6699K7635K9154L1824L3842
$$ 1283472 1297771 1314514 1333746 1354816 1377719 1402772 1429471 1457106 1486260 1518084 1551926
62935A551926L3122L0193K7451K6141K5605K5271K5614K6749K7261K5365K0849
$$ 1551926 1585048 1615241 1642692 1668833 1694438 1719709 1745323 1772072 1799333 1824698 1845547
62924A845547J5283J0434O741L247j175o786j3115j9698k6234l2085l6362l8734
$$ 1845547 1860830 1871264 1878005 1881252 1880077 1873291 1860176 1840478 1814244 1782159 1745797 1707063
62912A707063l9772m0325m0942m1867m2969m3522m2835m1323m0084l9072l6856
$$ 1707063 1667291 1626966 1586024 1544157 1501188 1457666 1414831 1373508 1333424 1294352 1257496
62901A257496l3030k9630k8721k9357k8737k6174k3914k3612k3890k2574j9981
$$ 1257496 1224466 1194836 1166115 1136758 1108021 1081847 1057933 1034321 1010431 987857 967876
62890I67876j8333j8507j9088j8643j7554j6961j6999j6897j6274j5382j4278
$$ 967876 949543 931036 911948 893305 875751 858790 841791 824894 808620 793238 778960
62879G78960j2601j0392q462p600p729q150q343q192p745p181o958p352p792p101
$$ 778960 766359 755967 747505 739905 732176 724026 715683 707491 699746 692565 685607 678255 670463 663362
62865F63362m735j574P61J287K12j574l229m220m308l561k457j707j730k180k192
$$ 663362 658627 657053 657814 659101 659313 657739 654510 650290 645982 642421 639964 638257 636527 634347 632155
62850F32155j230L85J871K840L551M439N578O666P385P730P999Q388Q685Q616
$$ 632155 630925 631310 633181 636021 639572 644011 649589 656255 663640 671370 679369 687757 696442 705058
62836G05058Q485R004J0144J0750R834Q006O916P282Q170Q229O979M711J814j336
$$ 705058 713543 722547 732691 743441 753275 761281 768197 775479 783649 791878 798857 803568 805382 804046
62822H04046m243o453p727p937p088n627m404m120m960o748r061j1091j1967j1473
$$ 804046 799803 793350 785623 777686 770598 764971 760567 756447 751487 744739 735678 724587 712620 701147
62808G01147j0176q723p439o641o729p533q176q089p749p890q258p786n965l591
$$ 701147 690971 682248 674809 668168 661439 653906 645730 637641 629892 622002 613744 605958 599993 596402
62794E96402k057k033k874l382l176l077l686m079k940q68j38j699l788m418l858
$$ 596402 594345 592312 589438 586056 582880 579803 576117 572038 569098 568230 568092 566393 562605 558187 554329
62779E54329l279k313rK504K841J000k42P03K086J844P39O26J154N80q60j017
$$ 554329 551050 548737 548728 551232 554073 555073 554831 555534 557620 559464 560203 560829 561983 562563 561703 560686
62763E60686O34J923J279J34O09K140K187j06k557k526P6K817L364J694k07p19
$$ 560686 561320 563243 564522 564656 565265 567405 569592 569486 566929 564403 564479 567296 570660 572354 572147 571428
62747E71428k97m98j609k208j307J92R40J070J458J791R75o70j335k17J311J615
$$ 571428 571131 570633 569024 566816 565509 565701 566641 567711 569169 570960 571935 571265 569930 569713 571024 572639
62731E72639Q04R7L10J635L954O423P728P724P933R304J0402R317O719N286O264
$$ 572639 573443 573540 573850 575485 579439 585862 593590 601314 609247 618551 628953 638270 644989 650275 656539
62716F56539Q259R565J0067J0410J0679J0625J0217R369P881O125M954M477L780
$$ 656539 664798 674363 684430 694840 705519 716144 726361 735730 743611 749736 754690 759167 762947
62703G62947K161m3k269m467o487p753q155q483r241r821r618r225r536j0231
$$ 762947 765108 765065 762796 758329 751842 744089 735934 727451 718210 708389 698771 689546 680010 669779
62689F69779j0190r093p752o969o808o881o734o046m944l982l491l199k805k389
$$ 669779 659589 650496 642744 635775 628967 622086 615352 609306 604362 600380 596889 593690 590885 588496
62675E88496j917r59M84J462J196L10J09R34J996K669L207M268O231Q886J1353
$$ 588496 586579 585620 586104 587566 588762 589072 589181 590115 592111 594780 597987 602255 608486 617372 628725
62660F28725J2593J2486J1969J1772J1650J1465J2108J4262J6949J8630J9357
$$ 628725 641318 653804 665773 677545 689195 700660 712768 727030 743979 762609 781966
62649G81966K0492K2562K4813K6817K8989L1396L3576L5882L9436M4105M7854
$$ 781966 802458 825020 849833 876650 905639 937035 970611 1006493 1045929 1090034 1137888
62638A137888M9128M8877M9170N0621N2095N2468N1605M9896M7619M4682M0544
$$ 1137888 1187016 1235893 1285063 1335684 1387779 1440247 1491852 1541748 1589367 1634049 1674593
62627A674593L4560K6874J8631J0869L533m080j2291k0887k9628l8189m5764n1282
$$ 1674593 1709153 1736027 1754658 1765527 1769060 1764980 1752689 1731802 1702174 1663985 1618221 1566939
62615A566939n4175n4811n4162n3139n1948n0157m7618m5190m3909m3441m2145
$$ 1566939 1512764 1457953 1403791 1350652 1298704 1248547 1200929 1155739 1111830 1068389 1026244
62604A026244l9056l5076l1762k9552k7758k5680k3120k0261j7733j6296j5797
$$ 1026244 987188 952112 920350 890798 863040 837360 814240 793979 776246 759950 744153
62593G44153j4907j2687j0083q898r459j0222r727q006o005m436l615l613m073
$$ 744153 729246 716559 706476 697578 688119 677897 668170 660164 654159 649723 646108 642495 638422
62580F38422m223l570k400j426j094j392j958k303k111j560j074r24j268k462
$$ 638422 634199 630629 628229 626803 625709 624317 622359 620056 617945 616385 615311 614387 613119 610657
62566F10657m539o322n924k892O43J769k03l164m692m449l820l647l189j439J015
$$ 610657 606118 599796 593872 590980 591623 593392 593189 590025 585333 580884 577064 573417 570228 568789 569804
62551E69804K214J029j357k690k198j194r99j065Q6K468M243L932K140O13J93
$$ 569804 572018 573047 571690 569000 566802 565608 564609 563544 563630 566098 570341 574273 576413 577026 577219
62536E77219M55R69J938L436M748M960M000K769K340L057M244M725L864K114L56
$$ 577219 577674 578643 580581 584017 588765 593725 597725 600494 602834 605891 610135 614860 618724 620838 621194
62521F21194j215k966m694n375m483k976k317k890l908m557m596m010k892j669
$$ 621194 619979 617013 612319 606944 602461 599485 597168 594278 590370 585813 581217 577207 574315 572646
62507E72646q56n51o12j226k555l869l880k291l43N75L08m10r63j046m65N55J246
$$ 572646 571790 571239 570627 569401 566846 562977 559097 556806 556463 557038 557346 556936 555973 554927 554462 555017 556263
62490E56263J157Q50J100J749K086K179K750L742M057L208K352K819M287N275
$$ 556263 557420 558270 559370 561119 563205 565384 568134 571876 575933 579141 581493 584312 588599 593874
62476E93874N203M966N425O281O841P192P962R313J0809J2030J2757J2759J2107
$$ 593874 599077 604043 609468 615749 622590 629782 637744 647057 657866 669896 682653 695412 707519
62463G07519J1692J2599J4708J6644J7613J8635K1164K4861K7765K8766K9073
$$ 707519 719211 731810 746518 763162 780775 799410 820574 845435 873200 901966 931039
62452I31039L0676L3802L6535L6941L5104L2857L1732L1494L0713K8413K4842
$$ 931039 961715 995517 1032052 1068993 1104097 1136954 1168686 1200180 1230893 1259306 1284148
62441A284148K0775J6583J2219P826L985J346J05k20l61m43L03K502N399P396
$$ 1284148 1304923 1321506 1333725 1341551 1345536 1346882 1346987 1346767 1346406 1345963 1346266 1348768 1354167 1361563
62427A361563Q115R129J2064J6463K0287K2205K2633K2707K2911K2743K1205J7709
$$ 1361563 1369678 1378807 1390871 1407334 1427621 1449826 1472459 1495166 1518077 1540820 1562025 1579734
62415A579734J2879Q169M261J40n520j2484j9322k5282l0772l5981m0258m3100
$$ 1579734 1592613 1600782 1605043 1605183 1599663 1587179 1567857 1542575 1511803 1475822 1435564 1392464
62403A392464m4817m5829m6113m5737m5024m3836m1477l7935l4427l2037l0308
$$ 1392464 1347647 1301818 1255705 1209968 1164944 1121108 1079631 1041696 1007269 975232 944924
62392I44924k7937k4543k1075j8604j7218j6142j4625j2623j0635q951p393n914
$$ 944924 916987 892444 871369 852765 835547 819405 804780 792157 781522 772571 765178 759264
62380G59264m921m512l973k905k187k658l462l318l008m431o968p369m325p41
$$ 759264 754343 749831 745858 742953 740766 738108 734646 731328 728320 723889 716921 709552 705227 704486
62366G04486J22j156j968j867k314l264l072j640q75j574k221j711j081j362j516
$$ 704486 704608 703452 701484 699617 697303 694039 690967 689327 688452 686878 684657 682946 681865 680503 678987
62351F78987m6K415L733K986J301K59M04J312K316L034L460L765M078M600N717
$$ 678987 678941 681356 685089 688075 689376 689635 690039 691351 693667 696701 700161 703926 708004 712604 718321
62336G18321P547R519J0893J1581J1951J2068J1906J2085J3324J5222J6690J7698
$$ 718321 725868 735387 746280 757861 769812 781880 793786 805871 819195 834417 851107 868805
62324H68805J9310K1618K3075K2737K1924K2499K4379K5995K6700K7427K9061
$$ 868805 888115 909733 932808 955545 977469 999968 1024347 1050342 1077042 1104469 1133530
62313A133530L1440L4068L6854L9758M2392M4464M6322M8720N2135N6286O0375
$$ 1133530 1164970 1199038 1235892 1275650 1318042 1362506 1408828 1457548 1509683 1565969 1626344
62302A626344O3911O7398P1831P7302Q2539Q6191Q8359R0201R2053R2470Q9462
$$ 1626344 1690255 1757653 1829484 1906786 1989325 2075516 2163875 2254076 2346129 2438599 2528061
62291B528061Q2455P2857O2518N1801L9527K5058R911l487j4449k4459l4760m4681
$$ 2528061 2610516 2683373 2745891 2797692 2837219 2862277 2872188 2868701 2854252 2829793 2795033 2750352
62279B750352n2958n9665o5718p1055p4552p5658p5083p3765p1995o9717o6920
$$ 2750352 2697394 2637729 2572011 2500956 2426404 2350746 2275663 2201898 2129903 2060186 1993266
62268A993266o3499n9382n5069n1490m9030m7155m5228m3263m1597m0265l9072
$$ 1993266 1929767 1870385 1815316 1763826 1714796 1667641 1622413 1579150 1537553 1497288 1458216
62257A458216l7974l6975l5776l4012l1734k9405k7379k5607k3845k2002k0120
$$ 1458216 1420242 1383267 1347491 1313479 1281745 1252340 1224961 1199354 1175509 1153507 1133387
62246A133387j8160j5933j3315j0512p961o081n045m694m420l339j030J805L797
$$ 1133387 1115227 1099294 1085979 1075467 1067506 1061425 1056380 1051686 1047266 1043927 1042897 1044702 1048499
62233A048499M286L986M174N547P997J0890J3222J4098J3708J3430J4232J5352
$$ 1048499 1052785 1056771 1060945 1066492 1074489 1085379 1098601 1112699 1126407 1139837 1154069 1169421
62221A169421J5395J4436J4071J5303J7463J9458K1175K3109K5361K7626K9713
$$ 1169421 1184816 1199252 1213323 1228626 1246089 1265547 1286722 1309831 1335192 1362818 1392531
62210A392531L1673L3766L6573M0569M5358N0039N4601N9982O6032P0701P2583
$$ 1392531 1424204 1457970 1494543 1535112 1580470 1630509 1685110 1745092 1811124 1881825 1954408
62199A954408P3519P6829Q3021Q8860R1159R0029Q7737Q5479Q2314P6428O6594
$$ 1954408 2027927 2104756 2187777 2276637 2367796 2457825 2545562 2631041 2713355 2789783 2856377
62188B856377N2914L7078K1463P187o549k0496l3438m3579n1435n9652o9445p8719
$$ 2856377 2909291 2946369 2967832 2975019 2968470 2947974 2914536 2870957 2819522 2759870 2690425 2611706
62176B611706q4685q7258q8516q9410q8676q5248q0231p5567p1599o7176o1900
$$ 2611706 2527021 2439763 2351247 2261837 2173161 2087913 2007682 1932115 1860516 1793340 1731440
62165A731440n6982n3539n0945m7668m3164l8174l3466k9254k5762k3291k1443
$$ 1731440 1674458 1620919 1569974 1522306 1479142 1440968 1407502 1378248 1352486 1329195 1307752
62154A307752j9258j6674j4935j4788j5063j4121j2106j0476r546q041n226k059
$$ 1307752 1288494 1271820 1256885 1242097 1227034 1212913 1200807 1190331 1180785 1172744 1167518 1165459
62142A165459M45K717N607Q745J0977J1925J2238J2653J3672J5781J9065K2676
$$ 1165459 1165904 1168621 1174228 1182973 1193950 1205875 1218113 1230766 1244438 1260219 1279284 1301960
62130A301960K5533K7538K9423L1401L2752L2933L2484L2569L3878L5951L7348
$$ 1301960 1327493 1355031 1384454 1415855 1448607 1481540 1514024 1546593 1580471 1616422 1653770
62119A653770L6765L4484L2502L2489L3870L4782L4851L5766L8842M3178M7022
$$ 1653770 1690535 1725019 1757521 1790010 1823880 1858662 1893513 1929279 1968121 2011299 2058321
62108B058321N0132N3664N8160O2612O5599O6520O5561O2981N8794N2866M5052
$$ 2058321 2108453 2162117 2220277 2282889 2348488 2415008 2480569 2543550 2602344 2655210 2700262
62097B700262L5308K3843J1339r80j1751k0414k7758l5143m2970n0330n6225o0610
$$ 2700262 2735570 2759413 2770752 2769772 2758021 2737607 2709849 2674706 2631736 2581406 2525181 2464571
62085B464571o3832o5641o5564o3983o2057o0370n8252n4752n0013m5333m1922
$$ 2464571 2400739 2335098 2269534 2205551 2143494 2083124 2024872 1970120 1920107 1874774 1832852
62074A832852l9728l7504l4154l0011k6526k4493k2906k0227j6579j3778j2832
$$ 1832852 1793124 1755620 1721466 1691455 1664929 1640436 1617530 1597303 1580724 1566946 1554114
62063A554114j2310j0094o299l183j965r87K151P373J2233J4948J6007J6461J5898
$$ 1554114 1541804 1531710 1525411 1522228 1520263 1519276 1521427 1528800 1541033 1555981 1571988 1588449 1604347
62050A604347J3197Q603L997J032j59l15J03J019J975J807p01n548j0875j4034
$$ 1604347 1617544 1626147 1630144 1631176 1631017 1630702 1630805 1631824 1633799 1635606 1634905 1629357 1618482 1604448
62036A604448j3763j1185q322n960l405PM018P974J1468J4342J6642J8665K0623
$$ 1604448 1590685 1579500 1571178 1565218 1561813 1561820 1565838 1573812 1585280 1599622 1616264 1634929 1655552
62023A655552K2386K4130K6940L1732L7614M2443M5237M6961M8632M9965N0514
$$ 1655552 1677938 1702068 1729008 1760740 1798354 1840797 1886034 1932995 1981627 2031592 2082106
62012B082106N0994N2352N4326N5820N6140N5099N2725M9794M7867M7537M7146
$$ 2082106 2133100 2185452 2239778 2295598 2351738 2406837 2459562 2509356 2557223 2604760 2651906
62001B651906M4464L9298L3278K7340K0738J2501K657q120j8980k8728l6218m1366
$$ 2651906 2696370 2735668 2768946 2796286 2817024 2829525 2832182 2824062 2805082 2776354 2740136 2698770
61989B698770m5338m9534n4740o0909o6933p0961p1890p0543o8615o6700o4372
$$ 2698770 2653432 2603898 2549158 2488249 2421316 2350355 2278465 2207922 2139307 2072607 2008235
61978B008235o1688n9178n6446n2555m8005m4644m2947m1049l7318l2482k8232
$$ 2008235 1946547 1887369 1830923 1778368 1730363 1685719 1642772 1601723 1564405 1531923 1503691
61967A503691k5046k2560k0858k0001j9242j8080j7352j7919j8915j8853j7950
$$ 1503691 1478645 1456085 1435227 1415226 1395984 1377904 1360552 1342633 1323718 1304865 1286915
61956A286915j7685j8275j8280j6920j5237j4372j3952j2836j0701q123n725l743
$$ 1286915 1269230 1250955 1232675 1215755 1200518 1186146 1172194 1159358 1148657 1140534 1134809 1131066
61944A131066k240j145k40P84K118L576M382L636J224j912m659o453p056o488
$$ 1131066 1128826 1127681 1127441 1128225 1130343 1133919 1138301 1141937 1143161 1141249 1136590 1130137 1123081 1116593
61930A116593n778o764r991j3522j5101j5038j5464j7047j8169j7492j5743j4365
$$ 1116593 1110815 1104051 1094060 1080538 1065437 1050399 1034935 1017888 999719 982227 966484 952119
61918I52119j3743j3467j3218j2662j1380r558p952o785n545m273l785m003l372
$$ 952119 938376 924909 911691 899029 887649 878091 870139 863354 857809 853536 849751 845748 842376
61905H42376j023J560K402J713J356K226L665N080O679Q496J0086J1445J3197
$$ 842376 841353 842913 845315 847028 848384 850610 854275 859355 866034 874530 884616 896061 909258
61892I09258J5563J8029K0222K2314K4300K5855K7281K9721L3815L8702M2918
$$ 909258 924821 942850 963072 985386 1009686 1035541 1062822 1092543 1126358 1165060 1207978
61881A207978M5933M8271N0515N2715N4685N6282N7248N7176N5885N3770N1459
$$ 1207978 1253911 1302182 1352697 1405412 1460097 1516379 1573627 1630803 1686688 1740458 1791917
61870A791917M9052M5986M1960L7704L4111L0690K5812J8861J1287M905k4m169
$$ 1791917 1840969 1886955 1928915 1966619 2000730 2031420 2057232 2076093 2087380 2092285 2092261 2088092
61858B088092p499r602j0935j2118j2109q945k693M019R156J3424J8204K2808
$$ 2088092 2080593 2070991 2060056 2047938 2035829 2026884 2024191 2028210 2037366 2050790 2068994 2091802
61846B091802K5400K5758K5322K4675K2740J8644J3021O917N04o429j3586k0407
$$ 2091802 2117202 2142960 2168282 2192957 2215697 2234341 2247362 2254279 2254783 2248354 2234768 2214361
61834B214361k6673l2088l5735l6899l6334l5894l6592l7599l7540l6324l5073
$$ 2214361 2187688 2155600 2119865 2082966 2046632 2010738 1974146 1936547 1899007 1862683 1827610
61823A827610l4403l3589l1823k9589k8059k7428k6785k5659k4660k4098k2925
$$ 1827610 1793207 1759618 1727795 1698206 1670147 1642719 1615934 1590275 1565615 1541517 1518592
61812A518592k0050j6121j2894j0931r031o083k450R81M229P963J2371J7079K1957
$$ 1518592 1498542 1482421 1469527 1458596 1449565 1443482 1441032 1442013 1446242 1454205 1466576 1483655 1505612
61799A505612K7257L2992L8790M4348M9630N4637N9342O3823O8014P1523P4216
$$ 1505612 1532869 1565861 1604651 1648999 1698629 1753266 1812608 1876431 1944445 2015968 2090184
61788B090184P6811Q0125Q3461Q4657Q2139P6343O8684N9747M9282L7488K5412
$$ 2090184 2166995 2247120 2330581 2415238 2497377 2573720 2642404 2702151 2751433 2788921 2814333
61777B814333J4106M040m749j2373j8812k3311k4440k1626j6446j1391p316l173
$$ 2814333 2828439 2832479 2827730 2815357 2796545 2773234 2748794 2727168 2710722 2699331 2692015 2688842
61765B688842J615N866Q307R211R309P965L710l823j3575k4287l5034m4879n3183
$$ 2688842 2690457 2696323 2704630 2713841 2723150 2731115 2734825 2731002 2717427 2693140 2658106 2613227 2560044
61752B560044o0355o7194p3371p7537p9125p9124p8659p7602p5120p1014o6017
$$ 2560044 2499689 2432495 2359124 2281587 2202462 2123338 2044679 1967077 1891957 1820943 1754926
61741A754926o1091n6798n3139m9835m6838m4423m2366l9464l4835k9556k5901
$$ 1754926 1693835 1637037 1583898 1534063 1487225 1442802 1400436 1360972 1326137 1296581 1270680
61730A270680k4564k3745k1623j8769j7046j6737j6081j3761j0802r476j0606
$$ 1270680 1246116 1222371 1200748 1181979 1164933 1148196 1132115 1118354 1107552 1098076 1087470
61719A087470j2512j2733j0609p729n826m881l841k512j554q87L76K131K964K357
$$ 1087470 1074958 1062225 1051616 1043887 1038061 1033180 1029339 1026827 1025273 1024386 1024762 1026893 1029857 1032214
61705A032214J864K909M546M878L956L534M232M751M212L641M275N482N453L570
$$ 1032214 1034078 1036987 1041533 1046411 1050367 1053901 1058133 1062884 1067096 1070737 1075012 1080494 1085947 1089517
61691A089517J144k10l76p00k334m921p094q181q801r588r987r094p251n835n508
$$ 1089517 1090661 1090451 1090075 1089375 1087041 1082120 1075026 1066845 1058044 1048456 1038469 1029375 1022124 1016289 1010781
61676A010781n639n574n528n719n520m245k368j118r28r51k55R96J864J809J180
$$ 1010781 1005142 999568 994040 988321 982801 978556 976188 975070 974142 973191 972936 973932 975796 977605 978785
61661I78785N66J41j37O2J242L200M705M476K369n02k789l978m615n636p360r175
$$ 978785 979351 979492 979355 979417 980659 983859 988564 993040 995409 994907 992118 988140 983525 977889 970529 961354
61645I61354j0287j0550j0265r538q541q192r440j1591j2531j1294r438q940r510
$$ 961354 951067 940517 930252 920714 912173 903981 894541 882950 870419 859125 849687 840747 831237
61632H31237r118o822l797j717j175j777k807l525l532l132k895k880k687k233
$$ 831237 822119 815297 811500 809783 808608 806831 804024 800499 796967 793835 790940 788060 785373 783140
61618G83140j849j773j975k365k602k044o02O55O24l59j040r76o49j29R79K216
$$ 783140 781291 779518 777543 775178 772576 770532 769930 770585 771209 770850 769810 768834 768185 768056 769035 771251
61602G71251K406J599J440K900M772N315M361K942J755J127J702L760O173P258
$$ 771251 773657 775256 776696 779596 784368 789683 794044 796986 798741 799868 801570 805330 811503 818761
61588H18761O788O266P077R036J0947J1910J1799J0936R647Q134O567N132L884
$$ 818761 825549 831815 838892 847928 858875 870785 882584 893520 903167 911301 917868 923000 926884
61575I26884K617J038q74k822m438n450n819n907o258o820o769n736m754n059
$$ 926884 929501 930539 929665 926843 922405 916955 911136 905229 898971 892151 885382 879646 874892 869833
61561H69833o151o181m381k078q65q89j422k107k935l673m148m714n917p969j0758
$$ 869833 863682 857501 853120 851042 850177 849288 847866 845759 842824 839151 835003 830289 824372 816403 805645
61546H05645j3712j5505j4957j2723j1148j1626j3030j3503j2873j2148j1511
$$ 805645 791933 776428 761471 748748 737600 725974 712944 699441 686568 674420 662909
61535F62909j0298q568p322p132p629q248q498p593n096k159r60k324m634n655
$$ 662909 652611 644043 636721 629589 621960 613712 605214 597621 592525 590366 589406 587082 582448 576793
61521E76793m945l878l659l993l736k468j017m08o70r97q80n12j50J61P3j014
$$ 576793 571848 567970 564311 560318 556582 554114 553097 552689 552019 551022 550142 549630 549480 549641 549714 548700
61505E48700k921m413m432l141j309N61J993K303J447M94L69N87K54l09j5J231
$$ 548700 545779 541366 536934 533793 532484 533045 535038 537341 538788 539282 539651 540238 540492 540183 540168 541399
61489E41399K381K734K555K217J739J285J325K017K990L810M297M500M669M978
$$ 541399 543780 546514 549069 551286 553025 554310 555635 557652 560642 564452 568749 573249 577918 582896
61475E82896M973L958K412K018L466N198N505M838M459L847J650j334k721k228
$$ 582896 587869 591827 594239 596257 599723 604921 610426 615264 619723 623570 625220 623886 621165 618937
61461F18937k263m096n876n637m217l537l626l171j932q43l49j65k25n09l89O51
$$ 618937 616674 612578 606702 601065 596848 593311 589685 586514 584582 583739 583390 583225 583000 582491 582102 582753
61445E82753J962K544K481K514K667K427J911J572J105K2r33m49J195K099J234
$$ 582753 584715 587259 589740 592254 594921 597348 599259 600831 601936 601958 601025 600576 601771 603870 605104
61430F05104l81j418j875k237k178j212J55R70J168J436J966K214J854J208O08
$$ 605104 604723 603305 601430 599193 597015 595803 595958 596928 598096 599532 601498 603712 605566 606774 607382
61415F07382po13p75k11O14R12N11m7l52o32j139j408p88L44O10p07k509l038
$$ 607382 607375 606762 605987 605776 606390 607302 607813 607766 607414 606782 605643 604235 603447 603791 604401 603694 601185 598147
61397E98147j867j63R12J221J063N47n4r5N81J153R29N02J003K545M336N935P332
$$ 598147 596280 596117 597029 598250 599313 599860 599806 599711 600292 601445 602374 602876 603879 606424 610760 616695 624027
61380F24027P962P154N709N464O651P312O334N426O466Q322Q551P391P344Q888
$$ 624027 631989 639143 644852 650316 656967 664279 670613 676039 682505 690827 699378 706769 714113 723001
61366G23001R439P386M542L217L017K356J432J539K551L244L490M005M292K925
$$ 723001 732440 739826 744368 747585 750602 752958 754390 755929 758480 761724 765214 769219 773511 776436
61352G76436Qk510l350l239l384l988m672n167n172m534l910m150m782m269k233
$$ 776436 776444 773934 770584 767345 763961 759973 755301 750134 744962 740428 736518 732368 727586 723317 721084
61337G21084k18L66j4M1R87K130K609K046P93k18m65o94j761k669j374J994M583
$$ 721084 720866 721232 721218 721259 722246 724376 726985 729031 729824 729606 729141 728447 726686 724017 722643 724637 729220
61320G29220M494L353L659N094N577M936N053O432P117N758L845L735N689P911
$$ 729220 733714 737067 740726 745820 751397 756333 761386 767818 774935 780693 784538 788273 793962 801873
61306H01873Q839Q289O898N375M262L651L111K280J637K241M591P803J0158J0513
$$ 801873 810712 819001 825899 831274 835536 839187 842298 844578 846215 848456 853047 860850 871008 881521
61292H81521R325Q255Q750J0959J3960J6722J8607J9214J8272J5947J3115J0969
$$ 881521 890846 899101 907851 918810 932770 949492 968099 987313 1005585 1021532 1034647 1045616
61280A045616J0173J0279J0078Q742O599M691L618K981J996K19k267m984p183
$$ 1045616 1055789 1066068 1076146 1084888 1091487 1096178 1099796 1102777 1104773 1104992 1102725 1097741 1090558
61267A090558q236q250q017q137q503q795r048r181q482o324l392j406j345k333
$$ 1090558 1082322 1074072 1066055 1057918 1049415 1040620 1031572 1022391 1013909 1007585 1004193 1002787 1001442 999109
61253I99109k585j233J008K750L219K741K184K210L019M602O844R211J0691J0535
$$ 999109 996524 995291 996299 999049 1002268 1005009 1007193 1009403 1012422 1017024 1023868 1033079 1043770 1054305
61239A054305R006P130N568M118K358L02j833m120o472p948p336m800k114q20
$$ 1054305 1063311 1070441 1076009 1080127 1082485 1082787 1080954 1076834 1070362 1062414 1055078 1050278 1048164 1047344
61225A047344o26l25L56Q40J189K180L792N013N632O797R027J0913J1059J0349
$$ 1047344 1046718 1046393 1046749 1047589 1048778 1050958 1054750 1059763 1065395 1072192 1081219 1092132 1103191 1113540
61211A113540J0751J2447J3800J3944J3758J4034J4183J3440J2321J2095J3299
$$ 1113540 1124291 1136738 1150538 1164482 1178240 1192274 1206457 1219897 1232218 1244313 1257612
61200A257612J5305J6999J7785J8148J9133K0808K1568J9844J6126J2350R443
$$ 1257612 1272917 1289916 1307701 1325849 1344982 1365790 1387358 1407202 1423328 1435678 1445121
61189A445121O730L654N49k629o678j1479j5286j6784j6927j7629j9292k0597
$$ 1445121 1451851 1455505 1456054 1453425 1446747 1435268 1419982 1403198 1386271 1368642 1349350 1328753
61177A328753k0310j8423j5864j3756j2652j2133j1395j0454j0065j0262r980
$$ 1328753 1308443 1290020 1274156 1260400 1247748 1235615 1224220 1213766 1203701 1193439 1183459
61166A183459q584o778n310l880k301j613k689m406m728l274j461l27L64P97L99
$$ 1183459 1174875 1168097 1162787 1158907 1156606 1154993 1152304 1147898 1143170 1139896 1138435 1138108 1138472 1139269 1139668
61151A139668j010k337k206l01K543N144O592O632N839N204N254N701N993O063
$$ 1139668 1138658 1136321 1134115 1133814 1136357 1141501 1148093 1154725 1160564 1165768 1171022 1176723 1182716 1188779
61137A188779O430P692R934J2597J4965J6747J8064J8910J8944J7874J5789J3100
$$ 1188779 1195209 1202901 1212835 1225432 1240397 1257144 1275208 1294118 1313062 1330936 1346725 1359825
61125A359825J0412Q365P215O558N897N344N286N591N849O081O186M979J343l472
$$ 1359825 1370237 1378602 1385817 1392375 1398272 1403616 1408902 1414493 1420342 1426423 1432609 1437588 1438931 1435459
61111A435459o389o170n066n772q133j0189j1355j2711j4717j6440j7135j7129
$$ 1435459 1429070 1422900 1417834 1412062 1403929 1393740 1382385 1369674 1354957 1338517 1321382 1304253
61099A304253j6941j6609j6196j6028j6063j5594j3906j0979p531m673l261l196
$$ 1304253 1287312 1270703 1254507 1238479 1222416 1206822 1192916 1181937 1174406 1169733 1166472 1163276
61087A163276l410k947j850q83o81j534l529o412r560j2327j4272j5001j4361
$$ 1163276 1159866 1156919 1155069 1154186 1153505 1151971 1148442 1142030 1132470 1120143 1105871 1090870 1076509
61074A076509j2860j1157r068n929k200M92J378J572K421L945N652P666J0012
$$ 1076509 1063649 1052492 1043424 1037495 1035295 1035787 1037165 1038737 1041158 1045103 1050755 1058421 1068433
61061A068433J1769J2295J2537J3915J6309J8277J9031J9267K0197K2251K4450
$$ 1068433 1080202 1092497 1105034 1118949 1135258 1153535 1172566 1191833 1212030 1234281 1258731
61050A258731K4990K3115K0444J9266J9546J9262J7897J7165J7520J6665J3262
$$ 1258731 1283721 1306836 1327280 1346546 1366092 1385354 1403251 1420416 1437936 1454601 1467863
61039A467863R505P564N801J644l580o345o489p286j0192j3089j4221j4547j5195
$$ 1467863 1477368 1484932 1490733 1492377 1488797 1482452 1475963 1468677 1458485 1445396 1431175 1416628 1401433
61026A401433j5404j4338j2805j1844j1159j0134r072q520q304p906p061n847
$$ 1401433 1386029 1371691 1358886 1347042 1335883 1325749 1316677 1308157 1299853 1291947 1284886 1279039
61014A279039m817m641m700k953J236N177N999M969N937R803J3476J4629J4395
$$ 1279039 1274222 1269581 1264881 1261928 1263164 1268341 1274340 1279309 1285246 1295049 1308525 1323154 1337549
61001A337549J4585J5054J5235J5952J8105K1177K4233K7086K9692L1814L3897
$$ 1337549 1352134 1367188 1382423 1398375 1416480 1437657 1461890 1488976 1518668 1550482 1584379
60990A584379L6743L9916M2263M4327M8054N3560N8504O1614O4518O8885P3886
$$ 1584379 1621122 1661038 1703301 1747628 1795682 1849242 1907746 1969360 2033878 2102763 2176649
60979B176649P7987Q1415Q5386R0342R6258J03367J11397J19311J26633J33958
$$ 2176649 2254636 2336051 2421437 2511779 2608037 2711404 2822801 2942112 3068745 3202703
60969C202703J41737J49994J59446J70998J83904J96393K08260K20541K32821
$$ 3202703 3344440 3494434 3653880 3824878 4008782 4205175 4413435 4633976 4866797
60960D866797K44056K56325K74013K98211L25562L53873L85039M20770M59643
$$ 4866797 5110853 5367178 5641191 5939402 6264964 6618837 7003876 7424646 7884289
60951G884289N01012N47976O03816O69022P44352Q32516R33782J044802J166048
$$ 7884289 8385301 8933277 9537093 10206115 10950467 11782983 12716765 13761567 14927615
60942A4927615J305659J471026J661527J875041K115279K384814K678237K992408
$$ 14927615 16233274 17704300 19365827 21240868 23356147 25740961 28419198 31411606
60934C1411606L328329L648995L827761L680218L101838K192002J221801M59449
$$ 31411606 34739935 38388930 42216691 45896909 48998747 51190749 52412550 52871999
60926E2871999K2306j18310l9662J73266L79477L65117m8474q54319j834888k704584
$$ 52871999 52894305 52775995 52736333 52909599 53289076 53654193 53605719 52751400 50916512 48211928
60916D8211928l282854l549168l577180l452536l241606k992661k735319k480263
$$ 48211928 44929074 41379906 37802726 34350190 31108584 28115923 25380604 22900341
60908B2900341k230011j989770j765967j560809j374267j208077j063594r38851
$$ 22900341 20670330 18680560 16914593 15353784 13979517 12771440 11707846 10768995
60900A0768995q31309p40450o64509n98172n37337m83279m38448m00742l65599
$$ 10768995 9937686 9197236 8532727 7934555 7397218 6913939 6475491 6074749 5709150
60891E709150l31386k99164k69277k41969k19323k02703j89688j77135j65773
$$ 5709150 5377764 5078600 4809323 4567354 4348031 4145328 3955640 3778505 3612732
60882C612732j58000j52489j45244j35343j25701j18123j11374j04337r7725r2120
$$ 3612732 3454732 3302243 3156999 3021656 2895955 2777832 2666458 2562121 2464396 2372276
60872B372276q7150q3034q0250p7435p2353o5383n9436n5974n3708n1599n0212
$$ 2372276 2285126 2202092 2121842 2044407 1972054 1906671 1847235 1791261 1737553 1685954 1635742
60861A635742m9323m7036m2611l7833l4299l1510k8928k7607k8099k8714k7719
$$ 1635742 1586419 1539383 1496772 1458939 1424640 1393130 1364202 1336595 1308496 1279782 1252063
60850A252063k5694k3972k2189j9309j5977j3819j3180j3224j3580j4132j3828
$$ 1252063 1226369 1202397 1180208 1160899 1144922 1131103 1117923 1104699 1091119 1076987 1063159
60839A063159j1568q094n383m337m437n309o904q331q334p170o335o116n147k984
$$ 1063159 1051591 1043497 1038114 1033777 1029340 1024031 1017127 1008796 1000462 993292 986957 980841 975694 972710
60825I72710j249j278k142k401k383l157m208m056k683j492r32PJ697K923K688
$$ 972710 971461 970183 968041 965640 963257 960100 955892 951836 949153 947661 946729 946736 948433 951356 954044
60810I54044J652J024J156J964L679O194Q440R497R809J0341J0964J0702R346
$$ 954044 955696 956720 957876 959840 963519 969713 978153 987650 997459 1007800 1018764 1029466 1038812
60797A038812P946P585Q286R153R168Q034O575O054O755P693P998P989Q293Q618
$$ 1038812 1046758 1054343 1062629 1071782 1080950 1088984 1095559 1101613 1108368 1116061 1124059 1132048 1140341 1148959
60783A148959Q235P158N989N102M714N201O341O853N953M891N574P944J0044J0594
$$ 1148959 1157194 1164352 1170341 1175443 1180157 1185358 1191699 1198552 1204505 1209396 1214970 1222914 1232958 1243552
60769A243552R979Q746O681L830J080r37k606m565o936r479j1702j2904j3212
$$ 1243552 1253531 1262277 1268958 1272788 1273868 1272931 1270325 1265760 1258824 1249345 1237643 1224739 1211527
60756A211527j4250j7341k1006k2142k0077j7619j7258j8055j7558j5230j2541
$$ 1211527 1197277 1179936 1158930 1136788 1116711 1099092 1081834 1063779 1046221 1030991 1018450
60745A018450j0684r787r699j0177j0627j0636j0351r694q051n589l946m316n613
$$ 1018450 1007766 997979 988280 978103 967476 956840 946489 936795 928744 923155 919209 914893 909280
60732I09280n909n109m775n531o291o113n457n091m848m110l032k638l785o131
$$ 909280 903371 898262 893487 887956 881665 875552 870095 865004 860156 856046 853014 850376 846591 840460
60718H40460q182q618p762p222p918q989r177q555q100q067p833p178o703o792
$$ 840460 832278 823660 815898 808676 800758 791769 782592 774037 765937 757870 750037 742859 736156 729364
60704G29364o940o459n509n049n748p018p364o072m278l648m014l433r93J651
$$ 729364 722424 715965 710456 705407 699659 692641 685277 679205 674927 671279 667265 663832 662839 664490
60690F64490K442J611J059J635K457K668K550K694L024L022K373J270L98N03J504
$$ 664490 666932 668543 669602 671237 673694 676362 678912 681606 684630 687652 690025 691295 691693 692196 693700
60675F93700K226J631N8j298j913k208k621l187l928m771n092m232k659j785k254
$$ 693700 695926 697557 697615 696317 694404 692196 689575 686388 682460 677689 672597 668365 665706 663921 661667
60660F61667l110l091k342k221l598n728p017o689n462m461l840l028k096j945
$$ 661667 658557 655466 653124 650903 647305 641577 634560 627871 622409 617948 614108 611080 608984 607039
60646F07039k810l488k874j598j137j694k005j206J20J022J424J781K092J861
$$ 607039 604229 600741 597867 596269 595132 593438 591433 590227 590347 591369 592793 594574 596666 598527
60632E98527R45k2k47L33R82J111J089J718L053M247M644M421L965L321K648K640
$$ 598527 599472 599450 599203 599536 600518 601629 602718 604436 607489 611736 616380 620801 624766 628087 630735 633375
60616F33375L768N470O566O473N755N649O940Q823Q997N913J104j782r08J752
$$ 633375 637143 642613 649179 655652 661407 667056 673996 682819 691816 697729 698833 697051 696143 697895
60602F97895L024K154Q67P22J674K741K974K071R25J122L001M757M561K876J532
$$ 697895 700919 703073 703940 704662 706336 709077 712051 714122 715047 716169 719170 723927 728488 731364 732896
60587G32896J069N45m04j096j476k527m493o090o210n401n055n761p009p839p546
$$ 732896 733965 734510 734106 733010 731534 729007 724514 718424 712214 706813 701758 695997 688988 681149 673603
60572F73603o276n015m479m115l011j529q58j038p82M50J637J956K033K613L117
$$ 673603 667327 662312 657833 653718 650707 649178 648320 647282 646500 646950 648587 650543 652576 655189 658306
60557F58306K582J281K81qP7M88J525K997M140M516M536M874N620O094N439L588
$$ 658306 660888 662169 662450 662442 662519 663007 664532 667529 671669 676185 680721 685595 691215 697309 702748 706336
60541G06336J611Q10J443K616L402L626L609L649L863M086L843K907J830J376
$$ 706336 707947 708757 710200 712816 716218 719844 723453 727102 730965 735051 738894 741801 743631 745007
60527G45007J481J560J704K556L879M376L529K682L538O271R635J2347J3784J4109
$$ 745007 746488 748048 749752 752308 756187 760563 764092 766774 770312 776583 786218 798565 812349 826458
60513H26458J4371J5822J8382K0481K1096K1138K1929K3180K3867K4418K6226
$$ 826458 840829 856651 875033 895514 916610 937748 959677 982857 1006724 1031142 1057368
60502A057368K9003L0414K8823K4954K0214J4801Q575K695j173k911l874m826
$$ 1057368 1086371 1116785 1145608 1170562 1190776 1205577 1214152 1216847 1215674 1212763 1208889 1204063
60490A204063n076l730p50L573R084J5090K0081K3032K4661K6711L0292L5559
$$ 1204063 1198987 1195257 1194507 1198080 1207164 1222254 1242335 1265367 1290028 1316739 1347031 1382590
60478A382590M2458N0683N8945O5421O9159P0271O8661O3730N5766M6356L6499
$$ 1382590 1425048 1475731 1534676 1600097 1669256 1739527 1808188 1871918 1927684 1974040 2010539
60467B010539K5384J2230j334j2243j9207k3563k6920k9340l0302l0202k9814
$$ 2010539 2035923 2048153 2046819 2034576 2015369 1991806 1964886 1935546 1905244 1875042 1845228
60456A845228k8922k6526k2299j7088j1865o812j630L632Q618J3445J8911K5568
$$ 1845228 1816306 1789780 1767481 1750393 1738528 1731716 1730086 1733718 1742336 1755781 1774692 1800260
60444A800260L2893L9882M6365N3133O0787O9163P7992Q7177R5987J02990J07468
$$ 1800260 1833153 1873035 1919400 1972533 2033320 2102483 2180475 2267652 2363639 2466629 2574097
60433B574097J10064J11014J08644J01090Q9134P5876O3642N2577M2391L3931
$$ 2574097 2684161 2795175 2903819 3004909 3094043 3169919 3233561 3286138 3328529 3362460
60423C362460K8397K6031K6193K7699K8461K5726J7729M621j2732l4098n9006
$$ 3362460 3390857 3416888 3443081 3470780 3499241 3524967 3542696 3547317 3534585 3500487 3441481
60412C441481q5095j08616j26836j39264j46454j48565j45797j39676j32800j26676
$$ 3441481 3356386 3247770 3120934 2981670 2835216 2686651 2540854 2401178 2268378 2141702
60402B141702j20332j11769j00761q9468q0175p3163o7322o1943n7043n2544m8184
$$ 2141702 2021370 1909601 1808840 1719372 1639197 1566034 1498712 1436769 1379726 1327182 1278998
60391A278998m4069m0355l6559l2177k7873k4908k3299k1569j8699j5328j2723
$$ 1278998 1234929 1194574 1158015 1125838 1097965 1073057 1049758 1028189 1009490 994162 981439
60380I81439j1313j0668j0142r191p731o474o265o868p248p261p997r884j1548
$$ 981439 970126 959458 949316 940125 932394 925920 919655 912787 905539 898278 890281 880397 868849
60367H68849j1443r940q757q710q929q261o740n573n835p227q044o815m041j806
$$ 868849 857406 847466 838709 829999 821070 812809 806069 800496 794661 787434 779390 772575 768534 766728
60353G66728j454k199k345j338j03K90k80j122j607j699j618j165l5J104Q12r98
$$ 766728 765274 763075 760730 759392 759289 759579 759299 758177 756570 754871 753253 752088 752053 753157 753969 752971
60337G52971k205j135P91R75l22m09J362K429J249k13m7K16j608m108l994j061
$$ 752971 750766 749631 750422 751397 751075 750666 752028 754457 755706 755493 755446 755662 754054 749946 745952 744891
60321G44891J724K760L347M472M974L906K232J026j5j017p44J393L662M129L372
$$ 744891 746615 749375 752722 757194 762168 766074 768306 769332 769317 768300 767556 768949 772611 776740 780112
60306G80112L280L995M021K988K282K600K820K002J142J741L504M661M279L265
$$ 780112 783392 787387 791408 794396 796678 799278 802098 804100 805242 806983 810487 815148 819427 822692
60292H22692L127M466O733Q786R605R153Q667R417J0869J0843Q102M087J262J32
$$ 822692 825819 830285 837018 845804 855409 864562 873229 882646 893515 904358 912460 916547 917809 917941
60278I17941r59l204n632o480n361l537k522k930m256n347n300m201k885j851
$$ 917941 916982 913778 908146 901666 896305 892768 890246 887316 883060 877713 872413 868212 865327 863476
60264H63476q77K56J179J489J433J668K579L985N237N623N155M989O332Q886J1130
$$ 863476 862599 862855 864034 865523 866956 868624 871203 875188 880425 886048 891203 896192 902524 911410 922540
60249I22540J2406J3753J6204J9359K2410K5670K9945L4944L9271M1584M1013
$$ 922540 934946 948699 964903 984262 1006672 1032342 1062287 1097231 1136502 1178086 1219099
60238A219099L7017K9914K1111J1714J353j0467k2199l0969l5502l6990l6920
$$ 1219099 1256116 1286030 1307141 1318855 1320208 1309741 1287542 1256573 1221071 1184081 1147161
60227A147161l5490l2686k9524k7149k5497k3816k1965k0308j8723j6618j3911
$$ 1147161 1111671 1078985 1049461 1022312 996815 972999 951034 930726 912003 895385 881474
60216H81474j1310r559q816q797r081r075q178o356m509l802m362m913m138k312
$$ 881474 870164 860605 851789 842992 833911 824836 816658 810302 805793 801991 797629 792716 788578 786266
60202G86266j046j329k531l548m170m603m413k998q65O69J114J291K007L090L945
$$ 786266 785220 783891 781360 777812 773642 769039 764626 761628 760763 761432 762546 763837 765844 768934 772879
60187G72879M257L859K701J338O93Q18O78k84j064m54J170K455L083L876M993
$$ 772879 777136 780995 783696 785034 785727 786545 787223 786939 785875 785421 786591 789046 792129 796005 800998
60172H00998N420M673L722L491L525L217L296M553N677M398J014j181M5K910M070
$$ 800998 806418 811091 814813 818304 821829 825046 828342 832895 838572 842970 843984 842803 842848 845758 849828
60157H49828K856J352J078J593K219L199M614N747O308P003Q057Q339O892M558
$$ 849828 852684 854036 855114 856707 858926 862125 866739 872486 878794 885797 893854 902193 909085 913643
60143I13643L005K814L387M094M572M344L267K059J517J356P52j77l77N93J834
$$ 913643 916648 919462 922849 926943 931515 935859 939126 941185 942702 944058 944810 944633 944256 944849 946683
60128I46683K227J681J014R14J186J006m3j276j562p62J59N43P93J293J585J386
$$ 946683 948910 950591 951605 952519 953705 954711 954668 953392 951830 951068 951227 951770 952563 953856 955441 956827
60112I56827J502K682M208M827M538M182L709K418P86L95J611K744K193L07j469
$$ 956827 958329 961011 965219 970046 974584 978766 982475 984893 985679 986074 987685 990429 992622 992929 991460
60097I91460k342k311j424K00J997L366M238M961N910P452R714J2133J3803J4654
$$ 991460 989118 986807 985383 985583 987580 990946 995184 1000145 1006055 1013507 1023221 1035354 1049157 1063811
60083A063811J5607J7115J8371J8545J7983J7149J5204J1153O196L116K775K772
$$ 1063811 1079418 1096533 1114904 1133449 1151432 1168581 1183785 1194938 1201134 1204250 1207025 1209797
60071A209797O38k789m826n009n684q290j1001j1200q935o430m952l841k468j427
$$ 1209797 1210435 1207646 1202820 1197811 1192127 1183837 1172836 1161636 1152701 1146271 1141319 1137478 1135010 1133583
60057A133583j330j636j353p4K041M538O508P109O763P042Q779J1045J2565J3327
$$ 1133583 1132253 1130617 1129264 1129190 1131231 1135769 1142277 1149386 1156149 1163191 1171970 1183015 1195580 1208907
60043A208907J4079J4897J5188J4603J3222J1162Q651O131L880J922N54J94L52
$$ 1208907 1222986 1237883 1253071 1267674 1280896 1292058 1300709 1306840 1310720 1312642 1313196 1313390 1313742
60030A313742k13j784l256m010m841o062o356n122m408o231q956r003n924l120
$$ 1313742 1313529 1311745 1308489 1304479 1299638 1293576 1287220 1282098 1277690 1271459 1262503 1253500 1247576 1244456
60016A244456l301n594p871r673j1659j3800j5435j6202j6061j5257j4702j5286
$$ 1244456 1241155 1235561 1227690 1218017 1206358 1192558 1177123 1160921 1144860 1129603 1114901 1099615
60004A099615j6306j5908j3705j1611j1253j1909j2105j1905j2090j2061j0409
$$ 1099615 1083309 1067401 1053696 1042085 1030832 1018923 1006818 994913 982823 970762 960353
59993I60353p352n011m918o266p028o143m292k952k897l496l406j984N7J407J368
$$ 960353 953001 947990 943072 936806 929778 923635 919343 916391 913494 909998 906592 904608 904665 906072 907440
59978I07440L18p81j229j108j023j212j341j300j711k982m413n070n231n881p102
$$ 907440 907758 906977 905748 904640 903617 902405 901064 899764 898053 895071 890658 885588 880357 874476 867374
59963H67374q011q182p885p122n695m352m272n121n163l788k378j920j500j94
$$ 867374 859363 851181 843296 836174 830479 826127 821855 816734 811571 807783 805405 803485 801985 801791
59949H01791J022Q61O7M09K013L373L736L877M439M919M653L730K580J390L05
$$ 801791 802813 803674 803741 804150 806163 809536 813272 817149 821588 826507 831160 834890 837470 838860 839165
59934H39165m23p60r60j010m31J092L168M978O024O345O125N437M601M441N479
$$ 839165 838742 837982 837022 836012 835581 836673 839841 844819 850843 857188 863313 868750 873351 877792 883271
59919H83271O843O890N413M273M921O158N785L910K824L640N010N579N790O222
$$ 883271 890114 897004 902417 906690 911611 917769 923554 927464 930288 933928 938938 944517 950307 956529
59905I56529N985M304K552K937N572Q220Q813P261M897L026J963R93o28k402k890
$$ 956529 962514 966818 969370 972307 977879 986099 994912 1002173 1007070 1010096 1012059 1013052 1012424 1010022 1007132
59890A007132j662k24k98j835l452m295m549m627m752n170n941o604o576n842
$$ 1007132 1005470 1005246 1004948 1003113 999661 995366 990817 986190 981438 976268 970327 963723 957147 951305
59876I51305m793l712k734k000j457q08k3N15O73Q16J179J589K117L198M738N848
$$ 951305 946512 942800 940066 938066 936609 935801 935778 936293 936966 937782 938961 940550 942667 945865 950603 956451
59860I56451O031N924O365P481R039J0837J2216J2267J1206J0419J0476J0219
$$ 956451 962482 968406 974771 982252 991291 1002128 1014344 1026611 1037817 1048236 1058712 1068931
59848A068931Q765P179O861P382P240N937L911J299j718l991m552m227m562n506
$$ 1068931 1077696 1084875 1091736 1099118 1106358 1112295 1116206 1117505 1115787 1111796 1107244 1103017 1098455 1092949
59834A092949n739m966m237m090l958l467k851j919r2K204L457K855J214j55n86
$$ 1092949 1087210 1082244 1078007 1073917 1069959 1066492 1063641 1061722 1061630 1063834 1067291 1070146 1071360 1071205 1070619
59819A070619n7J075K113K578K789L226L562L218K609K719L527L953L361K180
$$ 1070619 1070562 1071637 1073750 1076328 1079117 1082343 1085905 1089123 1091732 1094451 1097978 1101931 1105292 1107472
59805A107472J087M94O23J137R74k87j264l73J626K345J082k14K68J967L196L376
$$ 1107472 1108559 1109053 1109676 1110813 1111787 1111500 1110236 1109863 1111489 1113834 1114916 1114702 1114970 1116937 1120133 1123509
59789A123509L262L681M768O101P307Q694J0821J2952J2855R363M446J102k50
$$ 1123509 1126771 1130452 1135220 1141321 1148628 1157322 1168143 1181095 1193950 1203313 1207759 1208861 1208611
59776A208611j383k704k577m94J415Q61k351p186j2585j7073j9148j9174j9225
$$ 1208611 1207228 1204524 1201947 1201453 1202868 1203729 1201378 1194192 1181607 1164534 1145386 1126212 1106987
59763A106987k0045j9934j7598j4241j1457r051o531m951n093n431m174k253j836
$$ 1106987 1086942 1067008 1049410 1035169 1023712 1014661 1008130 1003179 998086 992655 988481 986228 984392
59750I84392k689k578j005l8j148l322m869n449n681o048o761p760q471q281p361
$$ 984392 981703 979125 978120 978082 976934 973612 968743 963294 957613 951565 944804 937044 928573 920292 912931
59735I12931o325n321m331l966m741n819n915n315n448o398o567n297m107m483
$$ 912931 906606 901285 896954 892988 888247 882428 876513 871198 865750 859352 852785 847488 843381 838898
59721H38898n824o592o406n905n411m869m504m482m304l486k454j897j588p52
$$ 838898 833074 826482 820076 814171 808760 803891 799387 794905 790601 787115 784661 782764 781176 780424
59707G80424O53J908K626K949K776J863P93P88K137L650M198M069M145M498M644
$$ 780424 781077 782985 785611 788560 791336 793199 793992 794780 796917 800567 804765 808834 812979 817477 822121
59692H22121M708N249O087O369N900N426N336N055M191L388L303L519L305K819
$$ 822121 826829 832078 838165 844534 850434 855860 861196 866251 870442 873830 877133 880652 883957 886776
59678H86776K504J873K47j647k244j527j246k238k979j853K82J160K27q25n28
$$ 886776 889280 891153 891400 889753 887509 885982 884736 882498 879519 877666 877948 879108 879335 878510 877982
59663H77982O26J298J158R69J326J962K298K193K009K098K445K864L356L969M474
$$ 877982 878608 879906 881064 882033 883359 885321 887619 889812 891821 893919 896364 899228 902584 906553 911027
59648I11027M568M509N062O620Q615J0125J0815J1073J1424J2058J2702J2722
$$ 911027 915595 920104 925166 931786 940401 950526 961341 972414 983838 995896 1008598 1021320
59636A021320J1625R690P904P000O829O844O769O486N705M342K918J979J341N83
$$ 1021320 1032945 1042635 1050539 1057539 1064368 1071212 1077981 1084467 1090172 1094514 1097432 1099411 1100752 1101335
59622A101335N9M64J407J441k6j769k380k253k959m998p113p805o681m370j983
$$ 1101335 1101394 1101858 1103265 1104706 1104680 1102911 1100531 1098278 1095319 1090321 1083208 1075403 1068722 1064352 1062369
59607A062369q29j522k937k967j040J048J593J334J982L335L718L050L205M838
$$ 1062369 1061540 1060018 1057081 1054114 1053074 1054122 1055715 1057049 1059031 1062366 1066084 1069134 1072339 1077177
59593A077177O013N188L775M117N988P005N834L314P31j373k834l881n540q632
$$ 1077177 1083190 1088378 1092153 1096270 1102258 1109263 1115097 1118411 1119142 1117769 1114935 1111054 1105514 1096882
59579A096882j2197j4216j4076j3122j2538j2034j1089j0176r999j0379j0515
$$ 1096882 1084685 1070469 1056393 1043271 1030733 1018699 1007610 997434 987435 977056 966541
59568I66541r916q753p850q226r764j0544q822n764m635o730r759j0983j0396
$$ 966541 956625 947872 940022 931796 922032 911488 902666 896902 892267 885537 875778 864795 854399
59555H54399r579q871p461n517m446n052o619p835p856o657n018l938l502k779
$$ 854399 844820 835949 828488 822971 818525 813473 806854 799019 791163 784506 779488 775550 772048 769269
59541G69269j451p00j548k999l051j287O86J287M54p65j167q3K008L471L016J175
$$ 769269 767818 767118 765570 762571 759520 758233 758919 760206 760660 759895 758728 758645 760653 764124 767140 768315
59525G68315n01j518k725m421n385m383j962j77o25k985n230n459l787k258k484
$$ 768315 767814 766296 763571 759150 753765 749382 747420 747243 746618 743633 738403 732944 729157 726899 724415
59510G24415l733m005k614p11O36J614K648L221K609J175J77L70J300J956J773
$$ 724415 720682 716677 714063 713352 713988 715602 718250 721471 724080 725255 725432 725802 727102 729058 730831
59495G30831J016M72Q45K304M258N595N458M319M048O149R732J2073J1719J0264
$$ 730831 731847 732319 733164 735468 739726 745321 750779 755098 759146 765295 775027 787100 798819 809083
59481H09083J0335J2536J5426J7957K0489K3226K4990K4121J9945J3056N003j973
$$ 809083 819418 831954 847380 865337 885826 909052 934042 958163 978108 991164 996167 994194
59469I94194n810o152m778l839l816l519j935M02J916J603oj540k347l013m099
$$ 994194 988384 982232 977454 973615 969799 966280 964345 964747 966663 968266 968260 966720 964373 961360 957261
59454I57261n002m776l919m113n957p949q500q074q302r448j0047r178p906p841
$$ 957261 952259 947483 943564 939451 933494 925545 917045 908971 900669 891221 881174 871996 864090 856249
59440H56249r001r863r240p387n361l999l495l438l010j603M80K246L055L115
$$ 856249 847248 837385 828145 820758 815397 811398 807903 804465 801455 799852 800332 802578 805633 808748
59426H08748K862K451K093K215K835L342L455L761M573N013M284L172K925L140
$$ 808748 811610 814061 816154 818369 821204 824546 828001 831762 836335 841348 845632 848804 851729 854869
59412H54869K458J171J027K111K140q8k493k533o75Q24J376K178L530M366M428
$$ 854869 857327 858498 859525 861636 863776 863688 861195 858662 857987 858811 860187 862365 865895 870261 874689
59397H74689M879O253P412P223O095N260N405O428P677Q149P307N935N234M917
$$ 874689 879568 885821 893233 900456 906551 911811 917216 923644 931321 939470 946777 952712 957946 962863
59383I62863L391K78k625l669l485l706m507m798m303l998m412m781m235k969
$$ 962863 966254 966532 963907 960238 956753 953047 948540 943742 939439 935441 931029 926248 922013 919044
59369I19044j663m73Q98K452L773M588N003N270N572O095P114Q877J1506J4845
$$ 919044 917381 916908 917806 920258 924031 928619 933622 938892 944464 950559 957673 966550 978056 992901
59355I92901J8291K0968K2592K4056K6396K8791K8419K3137J3992M264l601r074
$$ 992901 1011192 1032160 1054752 1078808 1105204 1133995 1162414 1185551 1199543 1203807 1200206 1191132
59343A191132j2055j2065r394n493j282L576Q583J0770O994k375j3333k1764k6006
$$ 1191132 1179077 1167012 1157618 1152125 1150843 1154419 1163002 1173772 1180766 1178391 1165058 1143294 1117288
59330A117288k6457k4411k1645j9696j8658j7261j4561j1035p751n116k824n30
$$ 1117288 1090831 1066420 1044775 1025079 1006421 989160 974599 963564 955813 950697 947873 947343
59318I47343J708L309L563K669K247L865O939R012Q632P184P199R502J2634J4637
$$ 947343 949051 952360 955923 958592 960839 964704 971643 980655 989287 996471 1003670 1013172 1025806 1040443
59304A040443J4699J3293J1463J0107R526R467R593R838J0306J1069J2288J4169
$$ 1040443 1055142 1068435 1079898 1090005 1099531 1108998 1118591 1128429 1138735 1149804 1162092 1176261
59292A176261J6522J8566J9471J9247J8853J9251K0364K1134K0588J8816J6801
$$ 1176261 1192783 1211349 1230820 1250067 1268920 1288171 1308535 1329669 1350257 1369073 1385874
59281A385874J5567J5602J6670J7634J6845J3692R740P326O685N590K358j918
$$ 1385874 1401441 1417043 1433713 1451347 1468192 1481884 1491624 1498950 1505635 1511225 1513583 1511665
59269A511665n028o477p485q967j0869j2999j5003j5847j4767j2715j1511j1513
$$ 1511665 1506637 1500160 1492675 1483708 1472839 1459840 1444837 1428990 1414223 1401508 1389997 1378484
59257A378484j1449j0685j0041r997r564p872n703m478m378m337l478j858j50
$$ 1378484 1367035 1356350 1346309 1336312 1326748 1318876 1313173 1308695 1304317 1299980 1296502 1294644 1294494
59244A294494R59J283J375K048L574N781Q630J2030J5146J7016J8096J9983K2918
$$ 1294494 1295453 1296736 1298111 1300159 1303733 1309514 1318144 1330174 1345320 1362336 1380432 1400415 1423333
59231A423333K4464K1504J3208J630j0016j9187k4832k7348k7757k6702k4435
$$ 1423333 1447797 1469301 1482509 1484139 1474123 1454936 1430104 1402756 1374999 1348297 1323862
59220A323862k1593j9212j7671j6338j4591j2571j0575q455o113l928k163n73
$$ 1323862 1302269 1283057 1265386 1249048 1234457 1221886 1211311 1202856 1196743 1192815 1190652 1190079
59208A190079R36J794J586Q46M57N87P16L74n92k103l768n046n911p005q788j0877
$$ 1190079 1191015 1192809 1194395 1195241 1195698 1196285 1197001 1197375 1196783 1194680 1190912 1185866 1179955 1172950 1164162 1153285
59192A153285j2503j3276j3221j2524j1595j0827j0123r054p644o429n540m448
$$ 1153285 1140782 1127506 1114285 1101761 1090166 1079339 1069216 1060162 1052518 1046089 1040549 1036101
59180A036101k934j521o02J00P20P06k85j646k565k905k776j963m49J073J914
$$ 1036101 1033167 1031646 1031044 1031144 1031864 1032570 1032285 1030639 1028074 1025169 1022393 1020430 1019981 1021054 1022968
59165A022968K164K197K043J745J630J575Q51n50j322n03J091K114K637L468M194
$$ 1022968 1025132 1027329 1029372 1031117 1032747 1034322 1035173 1034623 1033301 1032798 1033889 1036003 1038640 1042108 1046302
59150A046302L564J726N23J216L070M609N313N615N928O230O336O255O458P607
$$ 1046302 1049866 1051592 1052115 1053331 1056401 1061010 1066323 1071938 1077866 1084096 1090432 1096687 1103145 1110752
59136A110752R638J1274J1174R536Q038Q027R126R805R058P433O412O754P554
$$ 1110752 1120390 1131664 1142838 1152374 1160412 1168439 1177565 1187370 1196428 1203861 1210273 1217027 1224581
59123A224581P360O049M839M378L880K613J172M40J34n22j440k052k498l260l958
$$ 1224581 1231941 1237990 1242829 1247207 1251087 1253700 1254872 1255312 1255446 1254924 1253484 1251432 1248934 1245674 1241716
59108A241716l662k263n85O59J166P50k23n12P45K669L684L535L039K305Q10r65
$$ 1241716 1238054 1235791 1235206 1235865 1237031 1237781 1237558 1237046 1237791 1240460 1244144 1247679 1250718 1253023 1253833 1252868
59092A252868j837k054l255n713p422o794m811l489l383l722l982m087l763k870
$$ 1252868 1251031 1248977 1245722 1240009 1232587 1225793 1220982 1217493 1214110 1210388 1206406 1202319 1198556 1195686
59078A195686j956j652j958k689l926n276n504l953j746n17l97l02K90J083K155
$$ 1195686 1193730 1192078 1190120 1187431 1183505 1178229 1172725 1168772 1167026 1166509 1166112 1165810 1166100 1167183 1169338
59063A169338L974O124P345P276P134Q161J0176J2170J3569J4403J4848J5270
$$ 1169338 1173312 1179436 1186781 1194057 1201191 1209352 1219528 1231698 1245267 1259670 1274518 1289788
59051A289788J6209J7622J8463J7685J5513J3148J1407J0243R377Q673P847O585
$$ 1289788 1305997 1323619 1342082 1359767 1375280 1388428 1399835 1410078 1419455 1428128 1435975 1442560
59039A442560N070L729K263j55l318n596n935n391n637o585o865o282o221p428
$$ 1442560 1447630 1451359 1453622 1453467 1450149 1444553 1438618 1433227 1427590 1421005 1414140 1407858 1401637 1394209
59025A394209r047j0316j1798j3998j6055j6918j6996j7444j8501j9571k0388
$$ 1394209 1385162 1374846 1363048 1349050 1332995 1316077 1299081 1281637 1263136 1243565 1223177
59014A223177k0980k0922j9844j8304j7069j5820j3755j1284r812r835j0449j0782
$$ 1223177 1202197 1181275 1161431 1143127 1126058 1110238 1096483 1085199 1075387 1065552 1055103 1044321
59002A044321j0692r935p997n212k928k016k032k206k351k416k171j820j992k596
$$ 1044321 1033629 1023694 1015697 1010485 1007557 1005541 1003509 1001303 998952 996536 994365 992545 990553 987957
58988I87957k596j543k78N21J471L196M874N302M785M603M932M620L184J878K360
$$ 987957 985361 983818 983540 984061 985532 988728 993602 998904 1003689 1008292 1013224 1017844 1021028 1022906 1025266
58973A025266M893Q182J0530J1100J0405R692R636R873J0035J0737J2754J5541
$$ 1025266 1030159 1038341 1048871 1059971 1070376 1080068 1089704 1099577 1109612 1120349 1133103 1148644
58961A148644J7544J8112J8162J8648J9150J8549J6566J3976J1525R304P149N067
$$ 1148644 1166188 1184300 1202462 1221110 1240260 1258809 1275375 1289351 1300876 1310180 1317329 1322396
58949A322396L089J089q59k114j938m57J114J508N60r30k243l234l899m102m019
$$ 1322396 1325485 1326574 1325715 1323601 1321663 1321206 1322320 1323828 1324388 1323458 1321215 1317981 1314082 1309980 1305961
58934A305961m268n204o529p996r986j2692j5107j5817j4744j3297j2617j2564
$$ 1305961 1301693 1296489 1289960 1281964 1271978 1259286 1244179 1228362 1213618 1200321 1187704 1175140
58922A175140j2651j2891j3082j2161r409n839l334k556k584k433j779k74K449
$$ 1175140 1162489 1149598 1136516 1124355 1114946 1109107 1105773 1103217 1100633 1098200 1096421 1096147 1098596
58909A098596N513O937N966M363M226N306N719M781L630L167K951K352J501M76
$$ 1098596 1104109 1111046 1117012 1121375 1125601 1130907 1136626 1141407 1145037 1148204 1151155 1153507 1155008 1155484
58895A155484j188l441n137n348m669m358m851n803p095q751j0111j0119q553
$$ 1155484 1154296 1150855 1145718 1140370 1135701 1131343 1126492 1120689 1113594 1104843 1094732 1084613 1076060
58882A076060o455n117m926n072m319k275j38K84j410l728n066n298n147m810
$$ 1076060 1069605 1064488 1059562 1054490 1050171 1047896 1047758 1048042 1046632 1042904 1037838 1032540 1027393 1022583
58868A022583m163l720m168n228n931n956n762n506m774l545k554k437k977l334
$$ 1022583 1018420 1014700 1010532 1005304 999373 993417 987655 982149 977375 973830 971276 968839 965862 962528
58854I62528k730j093O00J012P7n04P63L232N167O282P797J0071J1814J2041J1428
$$ 962528 959798 958705 959305 960317 960394 959890 960653 963885 969052 975334 983131 993202 1005016 1017057 1028485
58839A028485J1012J0709J0011R332R710J1407J3503J4687J4256J2703J1491J1773
$$ 1028485 1039497 1050206 1060217 1069549 1079259 1090666 1104169 1118856 1133112 1145815 1157306 1169079
58827A169079J3245J4668J5439J5911J6233J5885J4612J2833J0846Q600O529N496
$$ 1169079 1182324 1196992 1212431 1228342 1244575 1260460 1275072 1287905 1298751 1307351 1313880 1319376
58815A319376N324M509K168o70k471k982k803k219j521j638l175n360p068q307
$$ 1319376 1324700 1329209 1331377 1330707 1328236 1325254 1322451 1320232 1318711 1317073 1313898 1308538 1301470 1293163
58801A293163r501j0009r036p694q272j1168j4205j5521j5657j5924j6100j5132
$$ 1293163 1283662 1273653 1264617 1256923 1248651 1237483 1223278 1207757 1192100 1176176 1160076 1144944
58789A144944j3344j2316j2658j3153j2538j1100r933r274q507p566p369q459
$$ 1144944 1131600 1119284 1106626 1093473 1080935 1069835 1059902 1050628 1042121 1034555 1027186 1018727
58777A018727r927j0383r547q241p055n955n133n049n333m745l009j729k447m390
$$ 1018727 1008800 998417 988870 980629 973574 967619 962486 957437 952104 947359 944350 942621 940174 935784
58763I35784n316m314k506j160m21j86q45k345l435k924j254J8J04l88n32K3J169
$$ 935784 930468 926154 923648 922488 922067 921881 921036 918691 915256 912332 911078 911096 911200 910812 910280 910303 911472
58746I11472K497L103J990p15l412m527m109l409l134k861k166j405j026p66j35
$$ 911472 913969 917072 919062 918347 914935 910408 906299 902890 899756 896895 894729 893324 892298 891532 891397
58731H91397P79J548K146K815L520M213N332P221R073R447Q081O361N654N957
$$ 891397 892176 893724 895870 898685 902205 906418 911750 918971 928044 937491 945572 951933 957587 963544
58717I63544O630P682R402J1170J1566R783O345K483p07k530k791k142j944l176
$$ 963544 970174 977856 987258 998428 1009994 1019777 1026122 1028605 1027898 1025368 1022577 1020435 1018491 1015315
58703A015315n388o995o852n467m394m460m942m612l286j941j507j944k457k234
$$ 1015315 1009927 1002932 996080 990613 986219 981759 976817 972205 968919 966978 965471 963527 961070 958836
58689I58836r51R46K417K649K008J972L840P449J1135J2904J2017R720Q240Q698
$$ 958836 957885 958831 961248 963897 965905 967877 971717 979166 990301 1003205 1015222 1024942 1033182 1041880
58675A041880J0109J0879J0962J1804J4103J6413J6598J4269J1296R839J0117
$$ 1041880 1051989 1062868 1073830 1085634 1099737 1116150 1132748 1147017 1158313 1168152 1178269
58664A178269J0302Q670N683L452L118L518K921J445Q09K091M588O753P359N926
$$ 1178269 1188571 1197241 1202924 1206376 1209494 1213012 1215933 1217378 1218187 1220278 1224866 1231619 1238978 1244904
58650A244904K967j26k367m278o875r730j1323j1357j1336j2461j4348j6407j9092
$$ 1244904 1247871 1247745 1245378 1241100 1234225 1224495 1213172 1201815 1190479 1178018 1163670 1147263 1128171
58637A128171k2653k5790k6814k5635k3542k1467j9397j7218j5170j3512j2298
$$ 1128171 1105518 1079728 1052914 1027279 1003737 982270 962873 945655 930485 916973 904675
58626I04675j1466j0827j0211r848j0127j0733j0613r239p230n379l644j738J8
$$ 904675 893209 882382 872171 862323 852196 841463 830850 821611 814381 809002 805358 803620 803638
58613H03638J100J596J971K407K939L806N150O670P925Q675Q850Q697Q895R563
$$ 803638 804738 806334 808305 810712 813651 817457 822607 829277 837202 845877 854727 863424 872319 881882
58599H81882R239O280J544j971k801k610l205l985l954m245o241q503q369o012
$$ 881882 891121 897401 898945 896974 894173 891563 888358 884373 880419 876174 869933 861430 853061 847049
58585H47049m238m332m763m285l775m124m524m084l529l974n084n613m926l301
$$ 847049 842811 838479 833716 829431 825656 821532 817008 812924 809395 805421 800337 794724 789798 786497
58571G86497j426k91o91k153l072k415p54P20J410J271N21q2L93J908L369M053
$$ 786497 785071 784780 784089 781936 778864 776449 775695 776415 777825 779096 779617 779535 779928 781836 785205 789258
58555G89258M249M273L919L413L652M757N434M742L520L053L216L084K674K759
$$ 789258 793507 797780 801699 805112 808764 813521 818955 823697 827217 830270 833486 836570 839244 842003
58541H42003L426M062M461M818M894M323L580L478L797L692L440M427O925R238
$$ 842003 845429 849491 853952 858770 863664 867987 871567 875045 878842 882534 885974 890401 897326 906564
58527I06564R891R630J0269J2113J3740J4122J3818J3809J3972J3376J1747J0061
$$ 906564 916455 926085 936354 948467 962207 976329 990147 1003956 1017928 1031304 1043051 1053112
58515A053112R558J0490J1902J2534J1934J0872J0822J2697J5857J8481J9296
$$ 1053112 1062670 1073160 1085062 1097596 1109530 1120402 1131224 1143921 1159778 1178259 1197555
58504A197555J8924J9191K1055K3638K5421K5846K5364K4355K2762K0656J8549
$$ 1197555 1216479 1235670 1256725 1280363 1305784 1331630 1356994 1381349 1404111 1424767 1443316
58493A443316J6732J4851J2375R226N585J448l181p685j0984j2534j2988j3674
$$ 1443316 1460048 1474899 1487274 1496500 1502085 1503533 1500352 1492667 1481683 1469149 1456161 1442487
58481A442487j5484j8216k0827k2338k2686k2654k2882k3133k2774k1792k0664
$$ 1442487 1427003 1408787 1387960 1365622 1342936 1320282 1297400 1274267 1251493 1229701 1209037
58470A209037j9421j7650j5564j4115j3529j2652j0595q251p132p218p136o152
$$ 1209037 1189616 1171966 1156402 1142287 1128758 1116106 1105511 1097260 1090128 1082910 1075774 1069622
58458A069622m715l208j506P4O77J79n20q41j209k001k849l302l248k384m97J366
$$ 1069622 1064907 1061699 1060193 1060267 1060944 1061123 1060603 1059762 1058553 1056552 1053703 1050401 1047153 1044769 1044272 1045638
58442A045638J480p4j043j72Q00j98k206k493l36K441M302N349N850N518M779
$$ 1045638 1047118 1047044 1046001 1045829 1046629 1046431 1044225 1041732 1041396 1043837 1048139 1053488 1059338 1064856 1069635
58427A069635N098P118R570J0823J0766J0505J0921J2111J3628J4766J4995J4571
$$ 1069635 1074733 1081851 1091421 1102244 1113010 1123515 1134436 1146547 1160175 1174941 1189936 1204507
58415A204507J4361J4767J5118J4450J2558R979P188M199R24k231m369m914m390
$$ 1204507 1218868 1233635 1248753 1263203 1275761 1285740 1292928 1297127 1298051 1295820 1291451 1286537 1282147
58402A282147m003m245m420l806k683j707q50K85J521K283K479K452K249J777
$$ 1282147 1278144 1273899 1269479 1265673 1262990 1261283 1260433 1260718 1262239 1264522 1267001 1269453 1271702 1273479
58388A273479J528K192L380L671K213l25k621l960m297l664k166m15N74L87j2
$$ 1273479 1275007 1277199 1280579 1284250 1286463 1286138 1283517 1279557 1275260 1271596 1269430 1269015 1269589 1269976 1269964
58373A269964J084M264Q026J0182J0243R759J0286J1779J3247J4112J4355J4046
$$ 1269964 1271048 1275312 1283338 1293520 1303763 1313522 1323808 1335587 1348834 1362946 1377301 1391347
58361A391347J3351J2611J1968J1284J0550R810Q600O391L748J816M46j675m479
$$ 1391347 1404698 1417309 1429277 1440561 1451111 1460921 1469521 1475912 1479660 1481476 1481922 1480247 1475768
58348A475768n864m617k399j401j536j592j594k019j840J88L006M377M189M426
$$ 1475768 1469904 1465287 1462888 1461487 1459951 1458359 1456765 1454746 1452906 1453094 1456100 1460477 1464666 1469092
58334A469092N959P636Q584R248R764R312P695N921M647L462K110J159J105J966
$$ 1469092 1475051 1482687 1491271 1500519 1510283 1519595 1527290 1533211 1537858 1541320 1543430 1544589 1545694 1547660
58320A547660L804O327Q115P918O780P053R118J0974J1493J1928J3305J4380J3733
$$ 1547660 1551464 1557791 1565906 1573824 1580604 1587657 1596775 1607749 1619242 1631170 1644475 1658855 1672588
58307A672588J2431J2849J5410J7958J8323J6641J5000J5143J6585J7294J6220
$$ 1672588 1685019 1697868 1713278 1731236 1749559 1766200 1781200 1796343 1812928 1830222 1846442
58296A846442J4586J4127J4909J5883J6688J7506J7865J7298J6752J7525J9034
$$ 1846442 1861028 1875155 1890064 1905947 1922635 1940141 1958006 1975304 1992056 2009581 2028615
58285B028615J9546J9000J9116K0621K2384K3526K4379K5022K4846K4181K4451
$$ 2028615 2048161 2067161 2086277 2106898 2129282 2152808 2177187 2202209 2227055 2251236 2275687
58274B275687K6019K7563K8216K8579K8982K8536K6851K5055K4116K3597K2969
$$ 2275687 2301706 2329269 2357485 2386064 2415046 2443582 2470433 2495488 2519604 2543201 2566170
58263B566170K2853K3869K5328K5994K5406K3938K2326K1444K1698K2583K3620
$$ 2566170 2589023 2612892 2638220 2664214 2689620 2713558 2735884 2757328 2779026 2801609 2825229
58252B825229K5444K8738L2502L5014L6154L7159L8469L9698M1331M4073M6774
$$ 2825229 2850673 2879411 2911913 2946927 2983081 3020240 3058709 3098407 3139738 3183811 3230585
58241C230585M7537M6888M7341M9566N1623N2268N2357N2547N2432N2445N3848
$$ 3230585 3278122 3325010 3372351 3421917 3473540 3525808 3578165 3630712 3683144 3735589 3789437
58230C789437N6175N7540N8111O0256O4431O8139P0022P1756P4549P7061P8486
$$ 3789437 3845612 3903152 3961263 4021519 4085950 4154089 4224111 4295867 4370416 4447477 4525963
58219D525963Q0566Q4569Q9037R2469R5658R9542J03436J07144J12155J18802
$$ 4525963 4606529 4691098 4780135 4872604 4968262 5067804 5171240 5278384 5390539 5509341
58209E509341J24914J29259J33758J40259J47685J54396J60792J67577J74018
$$ 5509341 5634255 5763514 5897272 6037531 6185216 6339612 6500404 6667981 6841999
58200F841999J79996J87248J96469K05642K13164K20095K27544K34743K41706
$$ 6841999 7021995 7209243 7405712 7611354 7824518 8044613 8272157 8506900 8748606
58191H748606K50704K62906K76479K90221L06047L25615L47760L71436L97764
$$ 8748606 8999310 9262216 9538695 9828916 10134963 10460578 10808338 11179774 11577538
58182A1577538M26666M55095M81590N09105N40445N74230O08300O43491O81006
$$ 11577538 12004204 12459299 12940889 13449994 13990439 14564669 15172969 15816460 16497466
58173A6497466P19577P58497Q00141Q46652Q97561R53030J015091J083158J153423
$$ 16497466 17217043 17975540 18775681 19622333 20519894 21472924 22488015 23571173 24724596
58164B4724596J225690J305105J393847J487380J583244J686835J803246J930006
$$ 24724596 25950286 27255391 28649238 30136618 31719862 33406697 35209943 37139949
58156C7139949K063935K208894K370458K549226K745834K965732L211864L479881
$$ 37139949 39203884 41412778 43783236 46332462 49078296 52044028 55255892 58735773
58148E8735773L768836M089999M457336M877122N355566N907387O545360P269005
$$ 58735773 62504609 66594608 71051944 75929066 81284632 87192019 93737379 101006384
58140A01006384Q074526Q968402R962238J1066757J2303206J3704748J5287084
$$ 101006384 109080910 118049312 128011550 139078307 151381513 165086261 180373345
58133A80373345J7029063J8899071K0884822K2979790K5158498K7353101K9328761
$$ 180373345 197402408 216301479 237186301 260166091 285324589 312677690 342006451
58126C42006451L0435385K9531657K5449501J7855574P779988k765101j1812977
$$ 342006451 372441836 401973493 427422994 445278568 453058556 450293455 438480478
58119D38480478j8276277k2059010k3647190k3690290k2821992k1619938k0542320
$$ 438480478 420204201 398145191 374498001 350807711 327985719 306365781 285823461
58112B85823461j9822456j9416454j9084031j8571964j7767799j6713874j5512084
$$ 285823461 266001005 246584551 227500520 208928556 191160757 174446883 158934799
58105A58934799j4243432j2963215j1721509j0556382r480615q494059p601780
$$ 158934799 144691367 131728152 120006643 109450261 99969646 91475587 83873807
58098H3873807o808975o108657n487531m937823m453828m024536l639977l298986
$$ 83873807 77064832 70956175 65468644 60530821 56076993 52052457 48412480 45113494
58090D5113494l001724k740376k505645k296560k115011j955636j809667j674453
$$ 45113494 42111770 39371394 36865749 34569189 32454178 30498542 28688875 27014422
58082B7014422j551157j437153j328756j227811j137825j056539r79704r09167
$$ 27014422 25463265 24026112 22697356 21469545 20331720 19275181 18295477 17386310
58074A7386310q49658q00003p54820p13025o77450o47258o17623n86490n55767
$$ 17386310 16536652 15736649 14981829 14268804 13591354 12944096 12326473 11739983 11184216
58065A1184216n26370m97523m70336m46786m25406m02779l78971l57066l37820
$$ 11184216 10657846 10160323 9689987 9243201 8817795 8415016 8036045 7678979 7341159
58056G341159l19185l00653k83652k67956k51884k36072k22988k12652k02443
$$ 7341159 7021974 6721321 6437669 6169713 5917829 5681757 5458769 5246117 5043674
58047E043674j91407j81318j73256j66265j59624j53613j47869j41497j34845
$$ 5043674 4852267 4670949 4497693 4331428 4171804 4018191 3870322 3728825 3593980
58038C593980j28902j23141j16226j08436j01258r5085q9380q4246p9717p4451
$$ 3593980 3465078 3341937 3225711 3117275 3016017 2920932 2831552 2747306 2667589 2593138
58028B593138o7608o1134n7586n6440n4952n1893m8088m4365m1525m1152m3492
$$ 2593138 2525530 2464396 2406810 2350370 2295418 2243525 2195437 2151072 2109547 2068395 2024903
58017B024903m5524m4185m0775l8981l9293l8898l6702l4760l4398l4334l3436
$$ 2024903 1979379 1935194 1894419 1855438 1816145 1777247 1740545 1705785 1671387 1637053 1603617
58006A603617l2296l1199k9209k6251k3762k2425k1301j9962j9354j9779j9983
$$ 1603617 1571321 1540122 1510913 1484662 1460900 1438475 1417174 1397212 1377858 1358079 1338096
57995A338096j9292j8808j9531k0656k0742j9458j7590j6081j5500j5660j5692
$$ 1338096 1318804 1299996 1280465 1259809 1239067 1219609 1202019 1185938 1170438 1154778 1139086
57984A139086j5242j5163j5954j6280j4604j1826j0445j1248j2696j3502j3900
$$ 1139086 1123844 1108681 1092727 1076447 1061843 1050017 1039572 1028324 1015628 1002126 988226
57973I88226j4221j4159j3885j4120j4660j4302j2796j1405j1096j1476j1941
$$ 988226 974005 959846 945961 931841 917181 902879 890083 878678 867582 856106 844165
57962H44165j2484j2825j2049r880p427n965n625n666n479n111n129n886o527
$$ 844165 831681 818856 806807 796927 789500 783535 777910 772244 766765 761654 756525 750639 744112
57949G44112n302j788J762K572O03j611k221j897k243l602m841m692l031j129
$$ 744112 738810 737022 738784 741356 741959 740348 738127 736230 733987 730385 725544 720852 717821 716692
57935G16692m02o89m85P48J598Q60n52j114j006j370k206k684k910l654m805n579
$$ 716692 716290 715601 715116 715864 717462 718322 717770 716656 715650 714280 712074 709390 706480 702826 698021 692442
57919F92442n787n485m206k171j292k981n719o880o125m904l546j567j36r97l073
$$ 692442 686655 681170 676964 674793 673501 670520 664801 657921 651796 646892 643346 641779 641643 640646 637573
57904F37573l340j417j23p86j237K94K201K132L27j398k208k228j554o33k52j39
$$ 637573 634233 632816 632693 631907 630670 630964 633165 635297 635624 634226 632018 629790 628236 627603 627351 627212
57888F27212R66K987M035L371K896M237O157O446N096L861L771M559N704O698
$$ 627212 628178 631165 635200 638571 641467 645704 651861 658307 663403 667264 671035 675594 681298 687996
57874F87996P005O749O604O456N421L843L490M722N290L362R7k393m000n664p102
$$ 687996 695001 701750 708354 714810 720231 724074 727564 732286 737576 740938 741035 738642 734642 728978 721876
57859G21876p743q659j1010j3294j2774r467o379n715o788p913q382q145p218
$$ 721876 714133 705474 694464 681170 668396 658929 652550 646835 640047 632134 623752 615607 608389
57846F08389o113n633n672n234l927k475j442n18N27J119O81m53j333j277k71
$$ 608389 602276 596643 590971 585737 581810 579335 577893 577375 577902 579021 579702 579249 577916 576639 576368
57831E76368J065J849J615P45j3k97j54K57N71K45p11j348q94N0J57r69k494l612
$$ 576368 577433 579282 580897 581642 581629 581332 581178 581435 582006 582251 581540 580192 579298 579348 579505 578536 576042 572430
57813E72430m289m802n241n640o084o533o812o813o511n893n087m280l325j850
$$ 572430 568141 563339 558098 552458 546374 539841 533029 526216 519705 513812 508725 504445 501120 499270
57799D99270j2J386K000K627M129O089P276P185O572O459P121P854P527N723L510
$$ 499270 499258 500644 502644 505271 509400 515489 522765 529950 536522 542981 550102 557956 565483 571206 574716
57784E74716K514K933L225K205N15n73q43o16L46K000K911J761k75n55J414L033
$$ 574716 577230 580163 583388 585593 586108 585535 584692 584076 584422 586422 589333 591094 590819 590264 591678 594711
57768E94711J979q48k591j803M14K136K610K488K655L079L052K487K318L065L664
$$ 594711 596690 595842 593251 591448 591862 593998 596608 599096 601751 604830 607882 610369 612687 615752 619416
57753F19416K682M69j128j280j167j948k937k780j805j988m487q069j0317j0068
$$ 619416 622098 622567 621439 620159 618992 617044 614107 611327 609522 607534 603047 594978 584661 574593
57739E74593q207o307m940l683k341j454j444j847j858j270m69K51R24J658K534
$$ 574593 566386 560079 555139 551456 549115 547661 546217 544370 542512 541242 540773 541024 541948 543606 546140
57724E46140L559M439M659M117L390L035L067L418M324N616O308N802N047N545
$$ 546140 549699 554138 558797 562914 566304 569339 572406 575824 580148 585764 592072 597874 602921 608466
57710F08466P283Q681Q540P194N589M137K749J354N6q41r85n80p65k519n142o709
$$ 608466 615749 624430 632970 640164 645753 649890 652639 653993 654049 653208 652223 651643 650878 648359 643217 636508
57694F36508o322n268n348o636p567p046n790n224n423m879k630j1P44n28j573
$$ 636508 630186 624918 619570 612934 605367 598321 592531 587307 581884 577005 574375 574364 575108 574580 573007
57679E73007p30R79J570P46l44j032j364j106j00P18K75p77p17P99K435L390M194
$$ 573007 572277 573256 574826 575572 575228 574196 572832 571726 571626 572344 572619 571842 571125 571924 574359 577749 581943
57662E81943N120N554N461N738O323N654L002j5j411j186n02K61J290K068J822
$$ 581943 587063 592617 598078 603816 610139 615793 618795 618780 617369 616183 615681 615942 617232 619300 621122
57647F21122Q20K1l08n85r71j333j729k101j825n36J000J762J847K071K559K735
$$ 621122 621942 621963 621655 621070 620099 618766 617037 614936 613111 612575 613575 615337 617184 619255 621814 624549
57631F24549K590K884M070N665O773O771N755M761N039O468P390O864O461Q502
$$ 624549 627139 630023 634093 639758 646531 653302 659057 663818 668857 675325 682715 689579 696040 704542
57617G04542J2904J7210J9794K1632K4531K8801L3380L7540M1630M6450N2260
$$ 704542 717446 734656 754450 776082 800613 829414 862794 900334 941964 988414 1040674
57606A040674N8193O2233O1809N4709M0141J9799j989k0405l3320m1928m7703
$$ 1040674 1098867 1161100 1222909 1277618 1317759 1337558 1335569 1315164 1281844 1239916 1192213
57595A192213m9928m7466m1900l6780l3908l2118k9839k6991k3899k0241j6064
$$ 1192213 1142285 1094819 1052919 1016139 982231 950113 920274 893283 869384 849143 833079
57584H33079j2444r988p895n562l954l959m311k876L37K995L400K314J437J185
$$ 833079 820635 810647 802752 797190 793236 789277 784966 782090 782427 785422 788822 791136 792573 793758
57570G93758P41k49r42l72J191K371K236J338Q23P63J58j303k330j501Q76K984
$$ 793758 794499 794250 793308 792936 794127 796498 798734 800072 800895 801658 801816 800513 798183 796682 797558 800542
57554H00542L453K535J543J527K455L354L213K006O57L8K39R46J995L191L998
$$ 800542 803995 806530 808073 809600 812055 815409 818622 820628 821285 821323 821562 822508 824503 827694 831692
57539H31692L954L299K765K769L080L175K733J829Q31P4l64n16l13J65M80M47
$$ 831692 835646 838945 841710 844479 847559 850734 853467 855296 856127 856201 855837 855321 855008 855173 855653 856100
57523H56100P43K132M044M849L754J688mo98j58J676L834M494L114J473J417K482
$$ 856100 856843 858975 863019 867868 871622 873310 873306 872608 872450 874126 877960 882454 885568 887041 888458 890940
57507H90940L007K745K731L096K980K389K340K953L172K755K883M124N375N610
$$ 890940 893947 896692 899423 902519 905499 907888 910228 913181 916353 919108 921991 926115 931490 937100
57493I37100N282N031M456L319K824M054O029O905O662O929Q229R035Q085O289
$$ 937100 942382 947413 951869 955188 958012 962066 968095 975000 981662 988591 996820 1005855 1013940 1020229
57479A020229N536O288P218P050O097N791O877Q376Q554O963N070M594N599O719
$$ 1020229 1025765 1032053 1039271 1046321 1052418 1058209 1065086 1073462 1082016 1088979 1094049 1098643 1104242 1110961
57465A110961P002O854P120P820Q207P755O788O031N780N687N502N654O766Q630
$$ 1110961 1117963 1124817 1131937 1139757 1147964 1155719 1162507 1168538 1174318 1180005 1185507 1191161 1197927 1206557
57451A206557J0218J0799J0629J0278R820R028Q008P179O893P293Q298R413R957
$$ 1206557 1216775 1227574 1238203 1248481 1258301 1267329 1275337 1282516 1289409 1296702 1305000 1314413 1324370
57438A324370R759R225Q547P544O617O901Q570R850R021O932O086P326Q873Q967
$$ 1324370 1334129 1343354 1351901 1359445 1366062 1372963 1381533 1391383 1400404 1407336 1413422 1420748 1429621 1438588
57424A438588Q028P555Q018Q755R212R418R585R883J0394J0911J1089J1015J1051
$$ 1438588 1446616 1454171 1462189 1470944 1480156 1489574 1499159 1509042 1519436 1530347 1541436 1552451 1563502
57411A563502J1036J0324R121Q752R931J1507J1856J0965J0115R979J0184J0446
$$ 1563502 1574538 1584862 1593983 1602735 1612666 1624173 1636029 1646994 1657109 1667088 1677272 1687718
57399A687718J0969J1640J1945J1909J2289J3497J5034J6126J6355J5651J4364
$$ 1687718 1698687 1710327 1722272 1734181 1746470 1759967 1775001 1791127 1807482 1823133 1837497
57388A837497J3375J3320J3689J3547J3073J3226J3898J3858J2964J2742J3921
$$ 1837497 1850872 1864192 1877881 1891428 1904501 1917727 1931625 1945483 1958447 1971189 1985110
57377A985110J5024J4745J4264J5267J6835J6602J4598J3430J4442J5970J6194
$$ 1985110 2000134 2014879 2029143 2044410 2061245 2077847 2092445 2105875 2120317 2136287 2152481
57366B152481J5695J5974J7070J8132J9187K0655K1776K1167J8877J6703J6211
$$ 2152481 2168176 2184150 2201220 2219352 2238539 2259194 2280970 2302137 2321014 2337717 2353928
57355B353928J7238J8361J8336J7091J5810J5846J7275J8809J9458J9671K0308
$$ 2353928 2371166 2389527 2407863 2424954 2440764 2456610 2473885 2492694 2512152 2531823 2552131
57344B552131K1205K1594K1416K1134K0669J9664J8625J8639J9822K1126K1857
$$ 2552131 2573336 2594930 2616346 2637480 2658149 2677813 2696438 2715077 2734899 2756025 2777882
57333B777882K2381K3081K3564K3336K2566K1813K1571K2283K4100K6265K7530
$$ 2777882 2800263 2823344 2846908 2870244 2892810 2914623 2936194 2958477 2982577 3008842 3036372
57322C036372K7566K7366K7805K8457K8438K7901K8007K9445L1453L2461L1690
$$ 3036372 3063938 3091304 3119109 3147566 3176004 3203905 3231912 3261357 3292810 3325271 3356961
57311C356961L0189K9993L1906L4406L5346L4432L3153L2504L2040L1345L1048
$$ 3356961 3387150 3417143 3449049 3483455 3518801 3553233 3586386 3618890 3650930 3682275 3713323
57300C713323L1713L2776L3478L4002L4732L5066L4064L1972L0157K9622L0218
$$ 3713323 3745036 3777812 3811290 3845292 3880024 3915090 3949154 3981126 4011283 4040905 4071123
57289D071123L1250L2180L2778L3067L3235L3310L3039L2198L0866K9329K8012
$$ 4071123 4102373 4134553 4167331 4200398 4233633 4266943 4299982 4332180 4363046 4392375 4420387
57278D420387K7508K8167K9574L0993L2292L3744L5004L5228L4429L3509L2717
$$ 4420387 4447895 4476062 4505636 4536629 4568921 4602665 4637669 4672897 4707326 4740835 4773552
57267D773552L1359K9517K8593K9249L0304L0716L1157L2169L2294L0110K7084
$$ 4773552 4804911 4834428 4863021 4892270 4922574 4953290 4984447 5016616 5048910 5079020 5106104
57256E106104K5973K6960K7726K7219K6917K7902K9052K9093K8652K9031L0163
$$ 5106104 5132077 5159037 5186763 5213982 5240899 5268801 5297853 5326946 5355598 5384629 5414792
57245E414792L0959L0882L0282K9679K9301K8848K7562K5174K2849K2176K3148
$$ 5414792 5445751 5476633 5506915 5536594 5565895 5594743 5622305 5647479 5670328 5692504 5715652
57234E715652K4220K4522K4734K5359K5599K4646K3004K1615K0652J9937J9656
$$ 5715652 5739872 5764394 5789128 5814487 5840086 5864732 5887736 5909351 5930003 5949940 5969596
57223E969596J9937K0442K1079K2208K3507K3685K2234K0452J9680J9378J8152
$$ 5969596 5989533 6009975 6031054 6053262 6076769 6100454 6122688 6143140 6162820 6182198 6200350
57212F200350J6008J4280J3727J3944J4417J4994J5416J5433J5416J5982J7049
$$ 6200350 6216358 6230638 6244365 6258309 6272726 6287720 6303136 6318569 6333985 6349967 6367016
57201F367016J7979J8674J9697K1250K2686K3185K2505K1100J9854J9509J9936
$$ 6367016 6384995 6403669 6423366 6444616 6467302 6490487 6512992 6534092 6553946 6573455 6593391
57190F593391K0055J8904J6472J3298R765O385M144L624M013L926L161K877M024
$$ 6593391 6613446 6632350 6648822 6662120 6671885 6678270 6682414 6686038 6690051 6693977 6697138 6700015 6704039
57177F704039O316Q792J0798J2365J4103J6684J9882K2307K2693K1481K0425K0642
$$ 6704039 6710355 6719147 6729945 6742310 6756413 6773097 6792979 6815286 6837979 6859460 6879885 6900527
57165F900527K1617K2029K0973J8452J5441J3497J3372J3879J2975J0277P640
$$ 6900527 6922144 6944173 6965146 6983598 6999039 7012536 7025908 7039787 7052762 7063039 7070679
57154G070679O726O890O100L381n74m647q186j0722j1844j1639j0680r318p463
$$ 7070679 7077405 7084295 7090395 7093776 7093202 7088555 7080369 7069647 7057803 7046164 7035484 7026166 7018703
57141G018703n185l031j431k57O49R90M65p23k353m698p854j0872j2672j3777
$$ 7018703 7013518 7010487 7009056 7008799 7009448 7010438 7010903 7010180 7007827 7003129 6995275 6984403 6971731 6957954
57127F957954j6013k0230k5300k9884l4166l9121m4982n1353n8055o4727p0198
$$ 6957954 6941941 6921711 6896411 6866527 6832361 6793240 6748258 6696905 6638850 6574123 6503925
57116F503925p3418p4685p4846p3648p0316o5572o1605n9726n9214n8924n8964
$$ 6503925 6430507 6355822 6280976 6207328 6137012 6071440 6009835 5950109 5890895 5831971 5773007
57105E773007o0330o3679o9007p5976q4108r2969j02287j11733j20761j28922
$$ 5773007 5712677 5648998 5579991 5504015 5419907 5326938 5224651 5112918 4992157 4863235
57095D863235j35696j39667j39080j34344j28789j25119j22097j17000j10576
$$ 4863235 4727539 4587872 4448792 4314448 4185659 4060540 3938443 3821443 3710867
57086C710867j06718j07193j09789j12298j15334j19794j24472j28162j32175
$$ 3710867 3604149 3496956 3387167 3274869 3159535 3039741 2915269 2787107 2654932
57077B654932j38573j47516j58182j70879j86334k04054k23311k44641k68654
$$ 2654932 2516359 2368843 2210661 2039782 1853448 1649394 1426083 1181442 912788
57068I12788k94195B99089d5313l69844l96109m23263m52732m86792n26655n72064
$$ 912788 618593 299089 -45313 -415157 -811266 -1234529 -1687261 -2174053 -2700708 -3272772
57058c272772o22407o77626p38735q07876q87012r76507j076788j191353j325563
$$ -3272772 -3895179 -4572805 -5311540 -6119416 -7006428 -7982935 -9059723 -10251076 -11576639
57049a1576639j481672j657792j852800k069419k311556k582826k890311l245774
$$ -11576639 -13058311 -14716103 -16568903 -18638322 -20949878 -23532704 -26423015 -29668789
57041b9668789l659576m136407m680694n303731o022143o852173p808273q902739
$$ -29668789 -33328365 -37464772 -42145466 -47449197 -53471340 -60323513 -68131786 -77034525
57033g7034525j0141323j1521610j3038279j4682803j6429592j8225809k0001890
$$ -77034525 -87175848 -98697458 -111735737 -126418540 -142848132 -161073941 -181075831
57026a81075831k1687387k3208266k4473249k5367621k5739320k5360025k3912465
$$ -181075831 -202763218 -225971484 -250444733 -275812354 -301551674 -326911699 -350824164
57019c50824164k1088994j6785850j1242152m990678J341278P222270J2295269
$$ -350824164 -371913158 -388699008 -399941160 -404931838 -403590560 -396368290 -384073021
57012c84073021J6367886J9380959K1381274K2492063K2880390K2725584K2188439
$$ -384073021 -367705135 -348324176 -326942902 -304450839 -281570449 -258844865 -236656426
57005b36656426K1387513K0396783J9263952J8028143J6723146J5375732J4010777
$$ -236656426 -215268913 -194872130 -175608178 -157580035 -140856889 -125481157 -111470380
56998a11470380J2657303J1345852J0101498Q941828P878668O917937O059183
$$ -111470380 -98813077 -87467225 -77365727 -68423899 -60545231 -53627294 -47568111
56991d7568111N298457M631438M052660L553656L124315K755280K437864K163265
$$ -47568111 -42269654 -37638216 -33585556 -30031900 -26907585 -24152305 -21714441 -19551176
56983a9551176J923801J714186J530349J368167J224512J098292R89019Q94997
$$ -19551176 -17627375 -15913189 -14382840 -13014673 -11790161 -10691869 -9702850 -8807853
56975h807853Q13645P42504O79138O21202N67473N17919M72180M29096L88353
$$ -8807853 -7994208 -7251704 -6572566 -5951364 -5383891 -4865972 -4393792 -3964696 -3576343
56966c576343L51256L19202K92324K70199K52784K40070K31314K24352K14545
$$ -3576343 -3225087 -2905885 -2613561 -2343362 -2090578 -1850508 -1619194 -1394842 -1180297
56957a180297J95619J64384J25151Q7221N7149L5222J9263Q605L041P10n90j543
$$ -1180297 -984678 -820294 -695143 -607922 -550773 -515551 -496288 -487683 -484642 -483932 -484522 -486065
56945d86065k271l529n555p414q967j1796j6607k1492k4490k6232k8147k9661
$$ -486065 -488336 -491865 -497420 -504834 -513801 -525597 -542204 -563696 -588186 -614418 -642565 -672226
56933f72226k9348k7617k5934k4308k1657j8098j4768j1816q418m392l04L569
$$ -672226 -701574 -729191 -755125 -779433 -801090 -819188 -833956 -845772 -854190 -858582 -858886 -855317
56921h55317O813Q169P047N214N134O853Q196P849O618N818O059P492R652J1122
$$ -855317 -848504 -840335 -833288 -828074 -822940 -816087 -807891 -800042 -793424 -787606 -781547 -774055 -764403 -753281
56907g53281J0863R921J0331J2315J4111J4727J5177J6565J8437J9834K0749K1656
$$ -753281 -742418 -732497 -722166 -709851 -695740 -681013 -665836 -649271 -630834 -611000 -590251 -568595
56895e68595K2332K1993K0294J7640J4698J1976R848Q796R247J0783J1769J0820
$$ -568595 -546263 -524270 -503976 -486336 -471638 -459662 -449814 -441018 -431771 -420988 -409219 -398399
56883c98399Q789Q122R716J1729J2498J3107J5447J8878K0946K0999K0920K2274
$$ -398399 -389610 -381488 -371772 -360043 -347545 -334438 -318991 -300113 -279167 -258168 -237248 -214974
56871b14974K4451K5898K5538K2671J7192J0468M708O99k680o318r403j0818j0742
$$ -214974 -190523 -164625 -139087 -116416 -99224 -88756 -84048 -83349 -86029 -92347 -101750 -112568 -123310
56858a23310j0038q980p557o323n871n823n229l780k024n18O22J347J412P60j08
$$ -123310 -133348 -142328 -149885 -156208 -162079 -167902 -173131 -176911 -178935 -179453 -178831 -177484 -176072 -175312 -175420
56843a75420l59M74K126L999N756P353Q616R337R845J0802J2199J3168J3258J3318
$$ -175420 -175779 -175305 -173179 -169180 -163424 -156071 -147455 -138118 -128273 -117471 -105272 -92104 -78846 -65528
56829f5528J4506J6862a4844E901K0617J9070J6952J5040J2932R532N134J917
$$ -65528 -51022 -34160 -14844 5901 26518 45588 62540 77580 90512 100044 105178 107095
56817A07095J422K643L675M265N186O190O482O668Q152J0732J2804J3994J5693
$$ 107095 108517 111160 114835 119100 124286 130476 136958 143626 151778 162510 175314 189308 205001
56804B05001J8568K1515K3718K6028K9206L1965L1885K7760K0540J2519N796Q48
$$ 205001 223569 245084 268802 294830 324036 356001 387886 415646 436186 448705 454501 455349
56792D55349l481p962j1390j2130j0727r245q202o100k196K355O629J1079J5684
$$ 455349 451868 443906 432516 420386 409659 400414 392212 386112 383916 386271 392900 403979 419663
56779D19663J9187K1370K4167K8914L4158L7689L9128L8662L4912K6561J5130
$$ 419663 438850 460220 484387 513301 547459 585148 624276 662938 697850 724411 739541
56768G39541L776o139j5077k2431k6394k6907k6337k6334k5862k3336j9147j4847
$$ 739541 743317 737178 722101 699670 673276 646369 620032 593698 567836 544500 525353 510506
56756E10506j0879o485j382L618P670J0840J3849J7121K0297K2663K3819K3508
$$ 510506 499627 493142 491760 495378 503048 513888 527737 544858 565155 587818 611637 635145
56744F35145K0856J4648N082n370j3779j9259k2925k5729k7422k7586k6452k4277
$$ 635145 656001 670649 675731 670361 656582 637323 614398 588669 561247 533661 507209 482932
56732D82932k0953j6852j3340j1509j0650q767m808O9L730N378O201P552Q951
$$ 482932 461979 445127 431787 420278 409628 400861 396053 396122 399852 405230 411431 418983 427934
56719D27934Q543N471R47l311o851j0163j3301j5833j7698j9219k0316k0507j9590
$$ 427934 436477 441948 442895 439584 432733 422570 409269 393436 375738 356519 336203 315696 296106
56706B96106j7744j5194j2511j0888j1040j1932j1669r821p799o781o374n794
$$ 296106 278362 263168 250657 239769 228729 216797 205128 195307 187508 180727 174353 168559
56694A68559n171m957m846m267l407k940l096l653m459n162m886l171j067k60
$$ 168559 163388 158431 153585 149318 145911 142971 139875 136222 131763 126601 121715 118544 117477 117217
56680A17217r28j426n45Q45J054j05j172j027j81J37m80j448k152k454k310j522
$$ 117217 116289 114863 114318 115163 116217 116112 114940 113913 113732 113869 113389 111941 109789 107335 105025 103503
56664A03503j19J308K018J796J023K14k71j20Q69K456L840M133L031J060q13j795
$$ 103503 103384 104692 106710 108506 109529 109743 109472 109352 110221 112677 116517 120650 123681 124741 123928 122133
56648A22133j749j116l05Q01K494M306M938L606J281r2K66J205J281M90j97l73
$$ 122133 120384 119268 118963 119764 122258 126564 131502 135108 136389 136297 136563 137768 139049 139539 139342 138969
56632A38969l51j42N56J300J087o4p48p9J081J578J670K087K299J248n64j393
$$ 138969 138618 138476 139032 140332 141419 141355 140607 140528 141609 143187 144857 146944 149243 150491 149927 148534
56616A48534o95L00P03J066J793K010J115K91J078L021M092L218J320j27o00m03
$$ 148534 147839 148139 148842 149908 151701 153711 154826 155117 156195 159216 163308 166526 167846 167719 167119 166716
56600A66716J17Q73J880L050M007M195L397K051Q32j3o73j190j142q8J640K714
$$ 166716 166833 167706 169586 172636 176643 180838 184235 186286 187118 187105 186432 185242 184100 184012 185652 188366
56584A88366J843n36k102j004J676K893J284j190j764j4K327L831M409M342L611
$$ 188366 190209 189673 187571 186567 188243 191136 192420 191230 189466 189452 191779 195610 200019 204361 207972
56569B07972K433J541J554K340L155L278K626J953K087K751K572P54j680k909
$$ 207972 210405 211946 213500 215840 218995 222273 224899 226852 228939 231690 234262 235016 233336 230427
56555B30427k297p49O23J458J883J980J640O58r82k649l199k062l6J394J419L58
$$ 230427 228130 227381 228004 229462 231345 233325 234965 235623 234641 231992 228793 226731 226695 228089 229508 229866
56539B29866q72j355p58K33M58j96l89Q60K544K792J246o16j355p95M29J539J902
$$ 229866 228994 227639 226881 227114 227572 227376 226987 227847 230391 233183 234429 233813 232458 231663 232092 233631 235533
56522B35533J545J379K035K626J734m16j914j547n8J211J939K529L232M104N132
$$ 235533 237078 238457 240492 243118 244852 244436 242522 240975 240917 242128 244067 246596 249828 253932 259064
56507B59064N844N633M911N086O714Q513Q936Q055P073O664O811P615R008R906
$$ 259064 264908 270541 275452 280538 287252 295765 304701 312756 319829 326493 333304 340919 349927 359833
56493C59833R069P018N837O557P704P255N290L664L383L431K480P20o02r09p73
$$ 359833 368902 375920 381757 388314 396018 403273 408563 412227 415610 419041 421521 422241 421639 420730 419957
56478D19957q87j356j986k565k731k133j072m83j046k626m662o526p358o456m403
$$ 419957 419070 417714 415728 413163 410432 408299 407227 406744 405698 403072 398410 391884 384526 378070 373667
56463C73667l018l516n155o372o614o282n532m321l279l183l591l160j568p3J96
$$ 373667 370649 367133 361978 355606 348992 342710 337178 332857 329578 326395 322804 319644 318076 318003 318199
56448C18199l43m95J94J198J754J499O79L1J59Q44J213O95m28j410j731j420j026
$$ 318199 317856 317361 317555 318753 320507 322006 322685 322716 322875 323719 324932 325627 325199 323789 322058 320638 319612
56431C19612j136j696k037j780j355j243j309j346j641k168j940l35J428J623
$$ 319612 318476 316780 314743 312963 311608 310365 309056 307710 306069 303901 301961 301626 303054 304677
56417C04677N08L2R54J834J318o3j039j388j674j979j833r59M62J889K647K504
$$ 304677 305185 305217 306171 308005 309323 309260 308221 306833 305159 303180 301347 300388 300850 302739 305386 307890
56401C07890K202K702L816M307L542K206J234Q47Q61R98P49j47q91m65O36Q66
$$ 307890 310092 312794 316610 320917 324459 326665 327899 328746 329607 330605 331354 331207 330316 329851 330487 331353
56385C31353K01M62K335L745K608j34j880j792j052l04J142L394N008M755L337
$$ 331353 331554 332016 334351 338096 340704 340570 338690 336898 335846 335542 336684 340078 345086 349841 353178
56370C53178K591L310M526M816L906K612J450K5j804k959k385p66L18P00J532
$$ 353178 355769 359079 363605 368421 372327 374939 376389 376414 374610 371651 369266 368500 368818 369518 371050
56355C71050K759K636M00k335l786m065l889k881p37J243J569O71q9n79j415k110
$$ 371050 373809 376445 376845 374510 370724 366659 362770 359889 359152 360395 361964 362635 362546 361967 360552 358442
56339C58442j652m34L56Q19J784K527J411r29j600N61L087L218J359k43q35j347
$$ 358442 356790 356356 356712 357531 359315 361842 363253 362324 360724 361285 364372 367590 368949 368706 367871 366524
56323C66524k073j984l85K063M082M756L847K016P43J174K685L231J586j162k763
$$ 366524 364451 362467 362082 364145 368227 372983 376830 378846 379589 380763 383448 386679 388265 387103 384340
56308C84340k177l76J058J439J019K38n23q52n71n2K87N84J112J459R96J44K00
$$ 384340 382163 381787 382845 384284 385303 385541 385018 384166 383595 383543 383830 384414 385526 386985 387981 388125 388325
56291C88325J604L192L617K857J924J668K294L351L825K849P61j089j844j773
$$ 388325 389929 393121 396738 399595 401519 403187 405481 408832 412657 415506 416267 415178 413334 411561
56277D11561j249j70J231K129K345K815M043N065M905L990L163K327J297R59K054
$$ 411561 410312 410142 411373 413502 415847 418662 422705 427770 432675 436665 439828 442155 443452 444411 446465
56262D46465L553L802K818J928J615J358J326K289L795M105K551O01K6R40K108
$$ 446465 450018 453820 456638 458566 460181 461539 462865 465154 468949 473054 475605 476206 476232 477172 479280
56247D79280K436J820J146J599L375N211N772N255M715M315L468K491K537L662
$$ 479280 481716 483536 484682 486281 489656 494867 500639 505894 510609 514924 518392 520883 523420 527082
56233E27082M306L401J810J070J432K026K309K748L979N698O630N912M402L940
$$ 527082 531388 534789 536599 537669 539101 541127 543436 546184 550163 555861 562491 568403 572805 576745
56219E76745M939N696M820L414L612N671P936R180R417Q792P398O259O768Q732
$$ 576745 581684 587380 592200 595614 599226 604897 612833 622013 631430 640222 647620 653879 660647 669379
56205F69379J0547J1549J2711J4435J5434J4716J3396J3309J4719J6520J8052
$$ 669379 679926 691475 704186 718621 734055 748771 762167 775476 790195 806715 824767
56194H24767J9607K1409K3075K4228K5112K6428K8619L1283L3461L4737L5829
$$ 824767 844374 865783 888858 913086 938198 964626 993245 1024528 1057989 1092726 1128555
56183A128555L7622L9815M1040M0323L7920L4911L2269L0126K7501K3289J8024
$$ 1128555 1166177 1205992 1247032 1287355 1325275 1360186 1392455 1422581 1450082 1473371 1491395
56172A491395J3868J1885J0082N539j906r394j4298j6444j7346j8570k0973k4182
$$ 1491395 1505263 1517148 1527230 1532769 1530863 1521469 1507171 1490727 1473381 1454811 1433838 1409656
56160A409656k6647k7179k6442k5944k5839k5104k3731k3002k3385k3641k2573
$$ 1409656 1383009 1355830 1329388 1303444 1277605 1252501 1228770 1205768 1182383 1158742 1136169
56149A136169k0400j8023j6028j4811j4709j5531j6564j6973j5766j2133p005
$$ 1136169 1115769 1097746 1081718 1066907 1052198 1036667 1020103 1003130 987364 975231 968226
56138I68226l457l638n777o265m332k344j615p97R54K095J423L28O04J787K386
$$ 968226 964769 961131 955354 949089 944757 942413 940798 940001 940955 943050 944473 944801 945405 947192 949578
56123I49578K449L117M578N931O562O549O257O249O946P820P741O538N404N449
$$ 949578 952027 955144 959722 965653 972215 978764 985021 991270 998216 1006036 1013777 1020315 1025719 1031168
56109A031168O774R012J1402J2441J1254R557J0183J3165J5427J5146J4017J4129
$$ 1031168 1037942 1046954 1058356 1070797 1082051 1091608 1101791 1114956 1130383 1145529 1159546 1173675
56097A173675J5017J5473J6078J7869K0252K2325K4736K8132L1201L2529L3399
$$ 1173675 1188692 1204165 1220243 1238112 1258364 1280689 1305425 1333557 1364758 1397287 1430686
56086A430686L6299M1387M6593N0740N4536N8689O3094O7853P3458P9823Q6480
$$ 1430686 1466985 1508372 1554965 1605705 1660241 1718930 1782024 1849877 1923335 2003158 2089638
56075B089638R3739J02301J11586J19369J23231J21912J15655J06201R6106Q7133
$$ 2089638 2183377 2285678 2397264 2516633 2639864 2761776 2877431 2983632 3079738 3166871
56065C166871P9409P2375O5911N9731N2406M2105K8339J2574k647j4978k3424
$$ 3166871 3246280 3318655 3384566 3444297 3496703 3538808 3567147 3579721 3577074 3562096 3538672
56054C538672k8794l2818l7007m2733n1520o3492p5837q4788q9328r1238r1589
$$ 3538672 3509878 3477060 3440053 3397320 3345800 3282308 3206471 3121683 3032355 2941117 2849528
56043B849528q9606q5208p9815p3791o5874n6424m8285m2792l7680l1023k4580
$$ 2849528 2759922 2674714 2594899 2521108 2455234 2398810 2350525 2307733 2270053 2239030 2214450
56032B214450k0638j7995j4057r113n449l491j745L96K406M340O428P846Q069
$$ 2214450 2193812 2175817 2161760 2152647 2147198 2143707 2141962 2142358 2144764 2149104 2155532 2163378 2171447
56019B171447Q423J0102J1920J2494J3290J6643K1684K5291K6533K7276K8748
$$ 2171447 2179870 2189972 2201892 2214386 2227676 2244319 2266003 2291294 2317827 2345103 2373851
56008B373851L0355L1748L3399L4983L5625L5791L6802L8495L9476L9657M0420
$$ 2373851 2404206 2435954 2469353 2504336 2539961 2575752 2612554 2651049 2690525 2730182 2770602
55997B770602M2258M4277M6007M7773M9200M9261M8022M6780M6436M7027M8568
$$ 2770602 2812860 2857137 2903144 2950917 3000117 3049378 3097400 3144180 3190616 3237643 3286211
55986C286211N0953N3280N4677N5443N6355N7600N9421O2657O7276P1684P4991
$$ 3286211 3337164 3390444 3445121 3500564 3556919 3614519 3673940 3736597 3803873 3875557 3950548
55975C950548P8466Q3159Q7821R1121R4119R8220J02566J06056J10082J16267
$$ 3950548 4029014 4112173 4199994 4291115 4385234 4483454 4586020 4692076 4802158 4918425
55965D918425J23087J28031J31762J36786J43211J49266J55037J62001J69643
$$ 4918425 5041512 5169543 5301305 5438091 5581302 5730568 5885605 6047606 6217249
55956F217249J76231J82518J91042K01934K12832K22955K33938K46609K60057
$$ 6217249 6393480 6575998 6767040 6968974 7181806 7404761 7638699 7885308 8145365
55947H145365K74220K90539L09669L30663L52330L73742L94093M14057M36061
$$ 8145365 8419585 8710124 9019793 9350456 9702786 10076528 10470621 10884678 11320739
55938A1320739M61314M88113N15148N43997N75765O08096O38945O70607P06205
$$ 11320739 11782053 12270166 12785314 13329311 13905076 14513172 15152117 15822724 16528929
55929A6528929P44939P85034Q28497Q78270R33436R92145J056354J128329J205630
$$ 16528929 17273868 18058902 18887399 19765669 20699105 21691250 22747604 23875933 25081563
55920B5081563J285613J371727J468751J574846J685609J803232J933979K079512
$$ 25081563 26367176 27738903 29207654 30782500 32468109 34271341 36205320 38284832
55912C8284832K238951K416704K618897K844372L088993L357527L662096M011576
$$ 38284832 40523783 42940487 45559384 48403756 51492749 54850276 58512372 62523948
55904F2523948M412891M879735N427362O059538O771786P565653Q449418R431511
$$ 62523948 66936839 71816574 77243936 83303474 90075260 97640913 106090331 115521842
55896A15521842J0529605J1780817J3222878J4866020J6697414J8699441K0834062
$$ 115521842 126051447 137832264 151055142 165921162 182618576 201318017 222152079
55889B22152079K3013796K5099352K6855056K7781919K6996556K3500126J6859780
$$ 222152079 245165875 270265227 297120283 324902202 351898758 375398884 392258664
55882C92258664P761861k151879j1097787j7936048k2385861k4744197k5517615
$$ 392258664 400020525 397868646 386770859 368834811 346448950 321704753 296187138
55875B96187138k5204865k4205587k2790636k1127155j9333418j7508912j5730625
$$ 296187138 270982273 246776686 223986050 202858895 183525477 166016565 150285940
55868A50285940j4051255j2508694j1125607r901527q820381p868381p036912
$$ 150285940 136234685 123725991 112600384 102698857 93878476 86010095 78973183
55861G8973183o312566n677365n118663m629160m198506l814201l469549l162111
$$ 78973183 72660617 66983252 61864589 57235429 53036923 49222722 45753173 42591062
55853D2591062k886001k633878k404582k200165k016959j847967j692481j554695
$$ 42591062 39705061 37071183 34666601 32466436 30449477 28601510 26909029 25354334
55845B5354334j433672j323153j220968j130165j050389r76035r04306q38178
$$ 25354334 23920662 22597509 21376541 20246376 19195987 18219952 17315646 16477468
55837A6477468p80056p28415o81966o41323o05273n70489n36042n03554m72329
$$ 16477468 15697412 14968997 14287031 13645708 13040435 12469946 11933904 11430350 10958021
55828A0958021m39297m04603l72251l43996l17010k88802k60260k32729k06006
$$ 10958021 10518724 10114121 9741870 9397874 9080864 8792062 8531802 8299073 8093067
55819H093067j80523j57882j38303j21245j09568j09257j23183j47778j76813
$$ 8093067 7912544 7754662 7616359 7495114 7385546 7276289 7153106 7005328 6828515
55810F828515k05539k30392k48302k58394k62399k62006k57547k49717k40195
$$ 6828515 6622976 6392584 6144282 5885888 5623489 5361483 5103936 4854219 4614024
55801D614024k29677k17338k03166j88982j76306j64859j53715j42418j30712
$$ 4614024 4384347 4167009 3963843 3774861 3598555 3433696 3279981 3137563 3006851
55792C006851j18718j07645r8854r2100q5972p9834p3878o7904o1750n6421n2863
$$ 3006851 2888133 2780488 2681634 2589534 2503562 2423728 2349850 2281946 2220196 2163775 2110912
55781B110912n0141m6739m3066m0588l9070l7052l4679l3528l3823l4132l3745
$$ 2110912 2060771 2014032 1970966 1930378 1891308 1854256 1819577 1786049 1752226 1718094 1684349
55770A684349l3184l2504l1259l0034k9779k9895k9096k7860k7659k8167k7819
$$ 1684349 1651165 1618661 1587402 1557368 1527589 1497694 1468598 1440738 1413079 1384912 1357093
55759A357093k6816k6820k7735k7632k6018k4353k3055k0957j8244j6902j7337
$$ 1357093 1330277 1303457 1275722 1248090 1222072 1197719 1174664 1153707 1135463 1118561 1101224
55748A101224j7254j5069j1973r624p987o672o087o048n233l337j942k123k939
$$ 1101224 1083970 1068901 1056928 1047304 1039317 1032645 1026558 1020510 1015277 1011940 1009998 1007875 1004936
55735A004936l365l883m936n615n359n373o812q828r870r886r810r782r303q576
$$ 1004936 1001571 997688 992752 987137 981778 976405 969593 960765 950895 941009 931199 921417 912114 903538
55721I03538q449r249j0526j1845j3187j4634j5836j5890j4083j1066q543p149
$$ 903538 895089 885840 875314 863469 850282 835648 819812 803922 789839 778773 770230 763081
55709G63081n603l081j281k308n349p726q656r486j0373r722p446o045p210r590
$$ 763081 757478 754397 753116 750808 745459 737733 729077 719591 709218 699496 692050 686005 678795 669205
55695F69205j1123j1651j1949j2035j1876j2219j3271j3778j2715j0850r505q773
$$ 669205 658082 646431 634482 622447 610571 598352 585081 571303 558588 547738 538233 529460
55683E29460q020p179o532o045n753n922o262n973n179n160o460p856p969o849
$$ 529460 521440 514261 507729 501684 495931 490009 483747 477774 472595 467435 460975 453119 445150 438301
55669D38301n357m139l723m385n275n040l837l356m250n248n501n852o689o528
$$ 438301 432944 428805 425082 420697 415422 410382 406545 403189 398939 393691 388190 382338 375649 369121
55655C69121m331j503J62R78K035K744J927K16p84j010j510k095j667n57l84j544
$$ 369121 364790 363287 363449 364427 366462 369206 371133 371349 370565 369555 368045 365950 364283 363726 363342 361798
55639C61798k804l494m190m954m843l833l428m388n315m632k954k171k821l645
$$ 361798 358994 355500 351310 346356 341513 337680 334252 329864 324549 319917 316963 314792 311971 308326
55625C08326l539k839k432k464k445k167j890j718j369q59p95j520k295k033q13
$$ 308326 304787 301948 299516 297052 294607 292440 290550 288832 287463 286604 285809 284289 281994 279961 279148
55610B79148Po92k654m637n397m342j954K64Q98P8o71j53J338K693L219L051K734
$$ 279148 279155 278463 275809 271172 265775 261433 259479 259743 260641 260719 260048 259895 261233 263926 267145 270196 272930
55593B72930K614K411J683R03J326L053M196L265J544J190J720P98j576k736j854
$$ 272930 275544 277955 279638 280541 281867 284920 289116 292381 293925 295115 296835 297633 296057 293321 291467
55578B91467j680m105o785o637m614m137o010p830p821o474m565k164n6J47j831
$$ 291467 289787 285682 278897 272260 267646 263509 257499 249669 241848 235374 230809 228645 228589 228736 226905
55563B26905m151m899l832j829J05J022M67q87j954k684l730m729m381k511n59
$$ 226905 222754 217855 214023 212194 212299 213321 213788 212901 210947 208263 204533 199804 195423 192912 192353
55548A92353L52M58K1j292k913k954p72J313N64k572m984m709k610m37J169K301
$$ 192353 192705 193163 193184 191892 188979 186025 185253 186566 187130 184558 179574 174865 172255 171818 172987 175288
55532A75288K760K241R32o17j789j894n87J318K250J645O88O86J313J392Q13N52
$$ 175288 178048 180289 181221 180604 178815 176921 176334 177652 179902 181547 182235 182921 184234 185626 186439 186991
55516A86991R62J364J411J601K038J912Q48k79o43n46l47N25K233L128J526j660
$$ 186991 187953 189317 190728 192329 194367 196279 197127 196848 196205 195659 195312 195837 198070 201198 202724 201064
55500B01064l794l930l531l719l788l061k388k605k895k116p88l16q17j076n41
$$ 201064 197270 193340 189809 186090 182302 179241 176853 174248 171353 169237 168449 168133 167316 166240 165699
55485A65699k05j163l067m282l521j249O12P10j45j06J090J771Q61n08p61k13
$$ 165699 165494 164331 161264 156982 153461 152212 152824 153534 153389 153283 154373 156144 157005 156497 155736 155523
55469A55523l97j753l205l707l091j610K83J650J596K49j298k200k421k173j535
$$ 155523 155126 153373 150168 146461 143370 141760 142043 143693 145289 145538 144240 142040 139619 137446 135911
55454A35911p24j52J7M1J82M73Q58J187J009j37j987l360l118j415K21K65j276
$$ 135911 135187 135035 135052 135093 135275 135748 136606 137793 138802 138665 136678 133318 130200 128785 129006 129271 127995
55437A27995k856l137k405j904k069k162j520m52K77K36n41j520j668k89J875
$$ 127995 125139 122002 119597 117693 115624 113462 111942 111490 111767 112003 111462 109942 108274 107985 109860
55422A09860L069K419P48p42j666k042j666n59O57J512K137K518K198J275P55
$$ 109860 112929 115348 116096 115354 113688 111646 109980 109421 110078 111590 113727 116245 118443 119718 120473
55407A20473J106J433R57L43M05M73m47j598j253O21K106J890O85j79m14n15p36
$$ 120473 121579 123012 123969 124312 124717 125190 124743 123145 121892 122513 124619 126509 127194 127015 126601 126086 125350
55390A25350p94k91P28J395O47j231k295j077J380K796K519J742J077k72k557
$$ 125350 124556 124265 124993 126388 127035 125804 123509 122432 123812 126608 129127 130869 131946 131674 129117
55375A29117m317m101k304m35O23R60R34R43J355J914J733M47j064j679j360q13
$$ 129117 124800 120699 118395 117960 118583 119543 120477 121420 122775 124689 126422 126869 125805 124126 122766 121953
55359A21953l30K96J065J771K523L480M148L804K712K016K081J758K2k304l437
$$ 121953 121623 121919 122984 124755 127278 130758 134906 138710 141422 143438 145519 147277 147299 144995 141558
55344A41558k974k251k276k406j700o66n59j407j840r78M27R47K2j609k569j909
$$ 141558 138584 136333 134057 131651 129951 129285 128726 127319 125479 124501 124928 125875 125897 124288 121719 119810
55328A19810p4J239Q20o28j486j380j291j652j771j327r89j026o88K23N59l46
$$ 119810 119736 120975 121795 121167 119681 118301 117010 115358 113587 112260 111271 110245 109557 109780 110339 109993
55312A09993j361j210l78nM2M08M55r29l023l557j477J849M295M866L988K851
$$ 109993 108632 107422 107044 107039 107081 107489 107944 107015 103992 100435 98958 100807 105102 109968 113956 116807
55296A16807K376K187J033j142k519j919q13j077j785o62J844K735R58j038j086
$$ 116807 119183 121370 122403 121261 118742 116823 116010 114933 113148 112486 114330 117065 118023 116985 115899
55281A15899k01k77j052j159o04k54O8J134K473K817K150J771K192K277R21j283
$$ 115899 115698 115421 114369 113210 112606 112352 112420 113554 116027 118844 120994 122765 124957 127234 128155 126872
55265A26872k634k227q78q5l40p97p41o79j319k051j643k19Q02R25J217K257K919
$$ 126872 124238 122011 121133 121048 120708 119911 119170 118491 117172 115121 113478 113259 114061 114986 116203 118460 121379
55248A21379K077L65q06j044p73j07R37J804K050K028K000J305m06j814j378K53
$$ 121379 123456 123821 123015 121971 121198 121091 122028 123832 125882 127910 129910 131215 130809 128995 127617 127870
55232A27870R33J6j027j195j351k269k833j598P46J997J264j74q93r68j025p63
$$ 127870 128803 128819 127792 126597 125246 122977 120144 118546 119292 121289 122553 122379 121486 120518 119493 118730
55216A18730M87K075K312P12j087j352l92L03M71J204K681L317J882o09k057j683
$$ 118730 119217 121292 123604 124316 123229 121877 121485 121788 122259 123463 126144 129461 131343 130734 128677 126994
55200A26994l39J036K114K561J904L53j010j308o76K71J192J861J771O63p62j308
$$ 126994 126655 127691 129805 132366 134270 134623 133613 132305 131629 131900 133092 134953 136724 137387 136625 135317
55184A35317o69K57O58P97J210J432N92r17j545p55O0m17j565j959j699j983k773
$$ 135317 134648 134905 135563 136360 137570 139002 139594 138677 137132 136377 136437 136020 134455 132496 130797 128814 126041
55167A26041k559p71J104J508P76K84N03Q42Q30M74k03j124j746j458m23M79O03
$$ 126041 123482 122711 123815 125323 126099 126383 126886 127728 128558 129032 128829 127705 125959 124501 124078 124557 125160
55150A25160P0o31j173j359r57J60J613K506K112O51q42j605j755j682j360p31
$$ 125160 125230 124599 123426 122067 121110 121270 122883 125389 127501 128152 127310 125705 123950 122268 120908 120177
55134A20177k09q6J16Q27J412J066M64J045K567L067J717J58m2K41o65k253k295
$$ 120177 119968 119882 119998 120825 122237 123303 123767 124812 127379 130446 132163 132321 132279 132520 131855 129602 127307
55117A27307l9K757M075L673K425Q40r71k454k711j486L58J627J843J428Q76J82
$$ 127307 127268 130025 134100 137773 140198 141038 140067 137613 134902 133416 133774 135401 137244 138672 139548 139730
55101A39730p08j272q41M06J457J547P76l83j636k721l330l416l190k720j939
$$ 139730 139022 137750 136909 137315 138772 140319 141095 140712 139076 136355 133025 129609 126419 123699 121760
55086A21760j075n26k63N5L48K44p7rM71Q15J107J985L115L068J447j61l71M3
$$ 121760 120685 120159 119896 119951 120299 120543 120466 120457 120928 121743 122850 124835 127950 131018 132465 132304 131933 131976
55068A31976l98j296p97J689M486N408L687L33k713l889l168j821p65L09J726
$$ 131976 131578 130282 129485 131174 135660 141068 144755 145088 142375 138486 135318 133497 132732 133041 134767
55053A34767K639K079N74l69j80L54M19mm96o83l97M4K2m56m32O26J744J543J9
$$ 134767 137406 139485 140059 139690 139510 139864 140283 140279 139783 139100 138703 138747 138769 138313 137881 138507 140251 141794 141813
55034A41813j711k920l508l126j300J526M029N157M686K981J039K19R26J859J641
$$ 141813 140102 137182 133674 130548 129248 130774 134803 139960 144646 147627 148666 148885 149811 151670 153311
55019A53311P33N42J115J192L86k88k55k13p63j455j702j544j215q40q29j555
$$ 153311 154044 154586 155701 156893 157279 156991 156736 156523 155760 154305 152603 151059 149844 149004 148175 146620
55003A46620k464k481j538o15q2O82J775K194J374J74l13j1N63J039J043L08o52
$$ 146620 144156 141675 140137 139522 139440 140122 141897 144091 145465 145639 145326 145315 145878 146917 147960 148268 147616
54986A47616r72p65q72j098k94J357J924N72r74j079n76q08r34N35K530K434L8
$$ 147616 146644 145879 145007 143909 143615 144972 146896 147468 146494 145415 144839 144031 143097 143632 146162 148596 148634
54969A48634j915j517P3Q35M82j26p66j720k536k144j35K510M030L255Q38r42
$$ 148634 146719 145202 145275 146110 146592 146466 145700 143980 141444 139300 139165 141675 145705 148960 149798 148856
54953A48856l54J672K359L60k557l643k300l36N13K83j1K1Lk32k30L02R46J174
$$ 148856 148502 150174 152533 152893 150336 146693 144393 144057 144570 144853 144842 144863 144866 144634 144404 144706 145652 146826
54935A46826J205J657K480K864K445J855J742J759J187J67l56N7P29P01j14q08
$$ 146826 148031 149688 152168 155032 157477 159332 161074 162833 164020 164187 163831 163888 164617 165318 165204 164396
54919A64396m48Q31J738J137n34j615j192j06M09M29Q81J777K038J134j04o42
$$ 164396 163948 164779 166517 167654 167120 165505 164313 164207 164616 165045 165926 167703 169741 170875 170771 170129
54903A70129m85l04n03j030j710k131j723n17L90k0j154j297J41J680J685O09
$$ 170129 169644 169340 168837 167807 166097 163966 162243 161726 162116 162096 160942 159645 159786 161466 163151 163760
54887A63760K99J331K306K044J305J373J905J416l20j818j884r16L08J804L589
$$ 163760 164059 165390 167696 169740 171045 172418 174323 175739 175419 173601 171717 170801 171109 172913 176502
54872A76502M673M077K444J540K156L353L878L573L172L301L954M682N065N243
$$ 176502 181175 185252 187696 189236 191392 194745 198623 202196 205368 208669 212623 217305 222370 227613
54858B27613N948P659R701J0614R560P160M678K762J110p28k601l870m206m142
$$ 227613 233561 241220 250921 261535 271095 278255 282933 285695 286805 286077 283476 279606 275400 271258
54844B71258m671o209q038q856p915n703l581k698l076l628l237j812k60M56J20
$$ 271258 266587 260378 252340 243484 235569 229866 226285 223587 220511 216883 213646 211834 211574 212030 212150
54829B12150o81j012k80J057J752J252O61J415L112L875L019K158K960M918O402
$$ 212150 211469 210457 210177 211234 212986 214238 214899 216314 219426 223301 226320 228478 231438 236356 242758
54814B42758O948P313P764P686O758N389L852J992o9j721k646l203l985n334p199
$$ 242758 249706 257019 264783 272469 279227 284616 288468 290460 290391 288670 286024 282821 278836 273502 266303
54799B66303q963r578q579o671m866l432k413k526m221o235o589n100l411k437
$$ 266303 257340 247762 239183 232512 227646 224214 221801 219275 215054 208819 202230 197130 193719 191282
54785A91282j378K27J126J56j853l017k566j169O2J48j323l316l830k203k64r8
$$ 191282 189904 190131 191257 191413 189560 186543 183977 182808 182870 183018 181695 178379 174549 172346 172082 171984
54769A71984j385k183j713r33p02q21r07r71r70p25l79j61J82Q39J104J90j330
$$ 171984 170599 168416 166703 165770 165068 164247 163340 162369 161399 160674 160295 160134 160316 161155 162259 162449 161119
54752A61119k108j936j750j744r97O18J761J622J196J580K107J404m57k059k430
$$ 161119 159011 157075 155325 153581 152584 153202 154963 156585 157781 159361 161468 162872 162415 160356 157926
54737A57926j736m64J009K203K650K365J755J145P38P74J252J825K305K917L668
$$ 157926 156190 155726 156735 158938 161588 163953 165708 166853 167591 168365 169617 171442 173747 176664 180332
54722A80332M008L655L227L335L545L015J870J099J277K191L454M674N218M787
$$ 180332 184340 187995 191222 194557 198102 201117 202987 204086 205363 207554 211008 215682 220900 225687
54708B25687M182M566N835O707O599O405P053Q155Q637Q045O661M844K872J024
$$ 225687 229869 234435 240270 246977 253576 259981 267034 275189 283826 291871 298532 303376 306248 307272
54694C07272n82k060l341m107m411m930o164p650q365p728n989l955k660k708
$$ 307272 306690 304630 301289 297182 292771 287841 281677 274027 265662 257934 251945 247990 245330 242622
54680B42622l545l737k509p10L00L54L27O25P89O53P85J328J332J38j097m52K228
$$ 242622 239077 235340 232831 232121 232421 232775 233102 233727 234516 235169 235954 237282 238614 238752 237655 237203 239431
54663B39431M890N760N388N507O569P443P322O714O322N849M559K357k54k825
$$ 239431 244321 250081 255469 260976 267545 274988 282310 289024 295346 301195 305754 308111 307857 305032
54649C05032n011o357o698o541o539o742o747o289n423m432l851l999m171l292
$$ 305032 300021 293664 286966 280425 273886 267144 260397 254108 248685 244253 240402 236403 232232 228940
54635B28940j914k268n003p255n967k342l85j272k117q68O03l6j664j693k39M51
$$ 228940 227026 224758 219755 212500 206533 204191 203806 202534 200417 199549 200152 200116 198452 196759 196520 196971
54619A96971j78m10O84J878J820O80o56j682k206k332k591l095k850j153N67Q0
$$ 196971 196793 196383 197067 198945 200765 201445 200789 199107 196901 194569 191978 188883 186033 184880 185447 185527
54603A85527k317l691k273L24J515Q46m26j440j980j544J82K170K776J684K45
$$ 185527 183210 179519 177246 177570 179085 179931 179505 178065 176085 174541 174723 176893 179669 181353 181598
54588A81598k35K57Q65Q97K49o09r80n84O7K33j09k66K42J066J558J662J930K585
$$ 181598 181363 181620 182485 183382 183631 183022 182042 181458 181525 181758 181649 181383 181625 182691 184249 185911 187841 190426
54570A90426K912K021K01j146j213q68j332k314k466j452m11j94k07L91J321J722
$$ 190426 193338 195359 195560 194414 193201 192333 191001 188687 186221 184769 184358 184164 183957 184348 185669 187391
54554A87391J491J259J421J871K443L011L293K926J811J74j443k234j680k97P02
$$ 187391 188882 190141 191562 193433 195876 198887 202180 205106 206917 207091 205648 203414 201734 201437 202139
54539B02139Q13P68J326K136K371J928J286O75J04j68L4K38p8n02j44J017K020
$$ 202139 202952 203720 205046 207182 209553 211481 212767 213442 213546 213378 213412 213650 213572 213070 212926 213943 215963
54522B15963K189J732J051K29o33j185j231q04K21J910L527L832K559R41K79N67
$$ 215963 218152 219884 220935 221164 220531 219346 218115 217311 217532 219442 222969 226801 229360 230301 230580 231147
54506B31147J020J285J337P70o50j852j080J807M543M666K261k14o41P70K276
$$ 231147 232167 233452 234789 235559 234909 233057 231977 233784 238327 242993 245254 245040 244399 245169 247445
54491B47445K710K459K488K916K860J702J42m11N59K094K939K766J932O99n40
$$ 247445 250155 252614 255102 258018 260878 262580 262722 262311 262870 264964 267903 270669 272601 273300 272760
54476B72760p16R96L677N208M711L373K379J263o76k447k425p94O56R71P50L96
$$ 272760 272044 273040 276717 281925 286636 290009 292388 293651 292975 290528 288103 287309 287965 288936 289686 290082
54460B90082m76j502j231O20K056J314n64j262n45k77j291k171j630n52n71j602
$$ 290082 289606 288104 286873 287493 289549 290863 290299 289037 288492 288215 286924 284753 283123 282571 282000 280398
54444B80398k092j342l31p9j76L34J258J363K31q97o24Q61K222K795L071L446
$$ 280398 278306 276964 276633 276554 276378 276712 277970 279333 279564 278667 278043 278904 281126 283921 286992 290438
54428B90438L482K789J929J805K547L438L654K810J192j43mJ681L491L973L238
$$ 290438 293920 296709 298638 300443 302990 306428 310082 312892 314084 313941 313937 315618 319109 323082 326320
54413C26320K628K946L693L980L639L228L284L804M271M082K987J291k79r01k14
$$ 326320 328948 331894 335587 339567 343206 346434 349718 353522 357793 361875 364862 366153 365874 364973 364759
54398C64759J105J594M22j474k350j743p87l34O8P93Q34p99l100l885k581r30
$$ 364759 365864 367458 367880 366406 364056 362313 361526 361192 361260 362053 362887 362088 358988 355103 352522 351592
54382C51592o68j570k316k450k640l319l837l246j602j02K38k60m54J37R43J409
$$ 351592 350924 349354 347038 344588 341948 338629 334792 331546 329944 329842 330080 329820 329366 329503 330446 331855
54366C31855J623J550N74j354k813k262p3J696J581m4j882l000l130k559j976
$$ 331855 333478 335028 335602 334248 331435 329173 329100 330796 332377 332333 330451 327451 324321 321762 319786
54351C19786j859j879j461q09n78n91M8J352K108J636Q64Q24J063P05L38J301
$$ 319786 317927 316048 314587 313778 313200 312609 312657 314009 316117 317753 318617 319441 320504 321209 321547 322848
54335C22848L222L912K274n9r34n68q07j994k299n90J541J852N03m07m5K25o53
$$ 322848 326070 329982 332256 332197 331263 330695 329888 327894 325595 325005 326546 328398 328901 328494 328449 328674 328021
54318C28021j632j264k2M55k84j108j109n37P1O42J231J657J789J610R12m08j716
$$ 328021 326389 325125 325103 325558 325274 324166 323057 322520 322591 323233 324464 326121 327910 329520 330432 330024 328308
54301C28308k096j604j321j820k296j780n56K52J58k69m34n29j234k824m664n620
$$ 328308 326212 324608 323287 321467 319171 317391 316835 317087 317245 316976 316542 316013 314779 311955 307291 301671
54285C01671n063l545k294j974k125j919j230o28n13n96l93k6j60j051j993k015
$$ 301671 296608 293063 290769 288795 286670 284751 283521 282893 282380 281784 281391 281365 281205 280154 278161 276146
54269B76146r96K22P46J86j421l542m890m291k254q55j327k505k458r74N68J269
$$ 276146 275150 275372 276118 276304 274883 271341 266451 262160 259906 259051 257724 255219 252761 251787 252355 253624
54253B53624J406J344J063P39O71N60q4q03o48J31K26o00j030m68l60k065m482
$$ 253624 255030 256374 257437 258176 258847 259407 259323 258520 257872 258003 258229 257629 256599 256131 255771 253706 249224
54236B49224n106k987M48L130L947L035J498O53P30N23r74k956l770l172k493
$$ 249224 244118 241131 241579 244709 248656 251691 253189 253842 254572 255095 254121 251165 247395 244223 241730
54221B41730k641l054k890k104q99Q27K753L702K948J499J023J631J739L74j387
$$ 241730 239089 236035 233145 231041 230142 230969 233722 237424 240372 241871 242894 244525 246264 246638 245251
54206B45251j869j028l89j004k326l155k879j558N18K690L814L169J386n5m15
$$ 245251 243382 242354 241965 240961 238635 235480 232601 231043 231561 234251 238065 241234 242620 242565 242150
54191B42150k82n44j283j882j886j402p95k58L14J073J834K110J584M46q56j969
$$ 242150 241868 241324 240041 238159 236273 234871 234076 233818 234132 235205 237039 239149 240733 241179 240323 238354
54175B38354k545k221j144k37k51p23n86J63L08p39j784j388k5L63r82k485k326
$$ 238354 235809 233588 232444 232207 231956 231233 230647 230810 231118 230379 228595 227207 227182 227545 226563 224078 221752
54158B21752r69m98j599k472j389O99J336p9j581j351J85J462J678Q61p75k472
$$ 221752 220783 220285 218686 216214 214825 215524 216860 216781 215200 213849 214034 215496 217174 218035 217260 214788
54142B14788k814j269P03J252M02m11o08q64j388j241L52K860M930N378L926J539
$$ 214788 211974 210705 211408 212660 213062 212651 212043 211179 209791 208550 208902 211762 216692 222070 225996 227535
54126B27535j98p44j099j911k110p51P66L80j320j800n21L41m35j272o81K91m1
$$ 227535 227337 226593 225494 223583 221473 220722 221488 221868 220548 218748 218227 218568 218133 216861 216180 216471 216430
54109B16430j333k102j985j658j421j162j001q97l85O16J494K024K612L007K292
$$ 216430 215097 212995 211010 209352 207931 206769 205768 204871 204486 205102 206596 208620 211232 214239 216531
54094B16531P62K1K84k75k207l027r41J803J888j90j222j81J062J487K094L120
$$ 216531 217293 217314 217598 217323 215116 212089 211148 212951 214839 214649 213427 213246 214308 215795 217889 221009
54078B21009L072J466J53P06K364L444L261J841o05k973l416j446J136K268J801
$$ 221009 224081 225547 225700 226406 228770 232214 235475 237316 236711 233738 230322 228876 230012 232280 234081
54063B34081R38M30K06P9O0K07O08J195J503J097K92j91k67m56q93j136j018p67
$$ 234081 235019 235449 235655 235734 235794 236001 236609 237804 239307 240404 240696 240505 240238 239782 238889 237753 236735 235968
54045B35968l05O58J790K262J754N42j175l029l908k971j164k72m19q7J211K054
$$ 235968 235663 236321 238111 240373 242127 242669 241494 238465 234557 231586 230422 230150 229731 229644 230855 232909
54029B32909J496N79N45J000R04L40J21M47Q67R52M94l54p10K90K032K795K074
$$ 232909 234405 234984 235529 236529 237433 237773 237894 238341 239208 240160 240654 240300 239590 239880 241912 244707 246781
54012B46781J330J756K658K852K417J988J492P77N32J312K419K896K889K998L047
$$ 246781 248111 249867 252525 255377 257794 259782 261274 262051 262583 263895 266314 269210 272099 275097 278144
53997B78144K641K227K392K838L138L707M736N002L403J059K27J275K493K833
$$ 278144 280785 283012 285404 288242 291380 295087 299823 304825 308228 309287 309514 310789 313282 316115
53983C16115L162M498O443P959Q631Q683Q531Q670R352J0152J0452J0403J0850
$$ 316115 319277 323775 330218 338177 346808 355491 364022 372692 382044 392196 402648 413051 423901
53970D23901J2208J3971J5193J4961J2711Q886N067K652J550Q44K44q2n07j471
$$ 423901 436109 450080 465273 480234 492945 501831 506898 509550 511100 511944 512188 512106 511599 510128
53956E10128k239j717m71l17j684l041l493m229o389q858r544q059n956m791m961
$$ 510128 507889 506172 505701 505384 503700 500659 497166 492937 486548 477690 468146 460087 454131 449340 444379
53941D44379o024p130p384o564n535n324n983o770p177p136o586n479m225l420
$$ 444379 438355 431225 423841 417277 411742 406418 400435 393665 386488 379352 372766 367287 363062 359642
53927C59642l156k963k587k328k573l218l730l759l515l454l465k705p62J259
$$ 359642 356486 353523 350936 348608 346035 342817 339087 335328 331813 328359 324894 322189 321427 322686
53913C22686J593J7j666j753n62M15O10O72J067J448J498J499J792K312K896L515
$$ 322686 324279 324296 322630 320877 320315 320730 321340 322012 323079 324527 326025 327524 329316 331628 334524 338039
53897C38039L997L968L425K900K763K736K439K101K238K781L070K786K444K774
$$ 338039 342036 346004 349429 352329 355092 357828 360267 362368 364606 367387 370457 373243 375687 378461
53883C78461L862N142O115O790P369P785P828P686Q007R168J0601J1244J0604
$$ 378461 382323 387465 393580 400370 407739 415524 423352 431038 439045 448213 458814 470058 480662
53870D80662R127P475N933M730M318M769N173M520L165K566L277M133M012L671
$$ 480662 489789 497264 503197 507927 512245 517014 522187 526707 529872 532438 535715 539848 543860 547531
53856E47531M726P262R632J0733J1209J1972J2654J2470J1836J1904J2719J2940
$$ 547531 552257 559519 569151 579884 591093 603065 615719 628189 640025 651929 664648 677588
53844F77588J1650R512P692O366M867L014J484Q10N53j70j539k851l535m038n375
$$ 677588 689238 698750 706442 712808 717675 720689 722173 722983 723536 723366 721827 718976 715441 711403 706028
53829G06028p815j0324j1405j0440q226o268n495n427m762k990j300j323l043
$$ 706028 698213 687889 676484 666044 657818 651550 646055 640628 635866 632876 631576 630253 627210
53816F27210m583m376k930k101l102n708q870j1419j2554j2478j2493j3649j5364
$$ 627210 622627 618251 615321 613220 610118 604410 595540 584121 571567 559089 546596 532947 517583
53803E17583j6036j5068j3446j2216j1234r904q374p356p102p170p009o293m920
$$ 517583 501547 486479 473033 460817 449583 439679 431305 423949 416847 409677 402668 396375 391455
53790C91455l170j750j260j590k113k383k292j829j116p52j411k829l632k754
$$ 391455 388285 386535 385275 383685 381572 379189 376897 375068 373952 373200 371789 368960 365328 362574
53776C62574q77J32p03k415l340k936j894r08r6L66K5r90j501m57J645L143K874
$$ 362574 361697 361829 361126 358711 355371 352435 350541 349633 349537 349903 349928 348938 347437 346980 348625 351768 354642
53759C54642J104j029k426k525j548l85K53O45J620L344N083O054N959M755K856
$$ 354642 355746 354717 352291 349766 348218 347833 348086 348731 350351 353695 358778 364832 370791 375546 378402
53744C78402J556K215M504O455O950P197Q735J0796J1132R224P156O881P842Q094
$$ 378402 379958 382173 386677 393132 400082 407279 416014 426810 437942 447166 454322 461203 469045 477139
53730D77139O914N475N088N591N598M134J815L38O73J963K495J616K09p09j239
$$ 477139 484053 489528 494616 500207 505805 509939 511754 512092 512765 514728 517223 518839 519048 518339 517100
53715E17100k234m131o470q243q548p257n350m249m507n331n626n284n141n843
$$ 517100 514866 510735 504265 496022 487474 480217 474867 470618 466111 460780 455154 449870 444729 438886
53701D38886p009p534o686n012l966m277m908m355k916k566m190o086o124m513
$$ 438886 431877 424343 417657 412645 408679 404402 399494 395139 392223 389657 385467 379381 373257 368744
53687C68744l183k981k902j985o46J84J02q42k339l523l436k233j156q90p83j29
$$ 368744 365561 362580 359678 357693 357047 357231 357333 356491 354152 350629 347193 344960 343804 342914 342131 342002
53671C42002P08J133J352J771J960J332K63l34k76l1K99R73J754K041J834J711
$$ 342002 342710 343843 345195 346966 348926 350258 350521 350187 349911 349880 350179 351152 352906 354947 356781 358492
53655C58492J867K006K137K588L121K905J679J72q35j174q52K17J668K643K780
$$ 358492 360359 362365 364502 367090 370211 373116 374795 374967 374132 372958 372106 372323 373991 376634 379414
53640C79414K643K743K787K509K519L484M799N002L612J861J323K170L062K734
$$ 379414 382057 384800 387587 390096 392615 396099 400898 405900 409512 411373 412696 414866 417928 420662
53626D20662J441O81J383K743L163K171P79l8m04q29j138p88J65J027J280R28
$$ 420662 422103 422784 424167 426910 430073 432244 433023 432985 432581 431752 430614 429826 429991 431018 432298 433226
53610D33226J25j021k190k814k487j404k32M91P81R32Q39K1j422k370j905p75
$$ 433226 433351 432330 430140 427326 424839 423435 423203 423694 424475 425407 426246 426267 424845 422475 420570 419795
53594D19795o41j834k764k064m49K29p15k121k446j326K01P41j09j374j787j160
$$ 419795 419154 417320 414556 412492 412043 412272 411557 409436 406990 405664 405865 406606 406497 405123 403336 402176
53578D02176k23O23J549K305K220J540J542K617L395K789J814K084L300L777K974
$$ 402176 401953 402576 404125 406430 408650 410190 411732 414349 417744 420533 422347 424431 427731 431508 434482
53563D34482J944J493J418J652K600M027M856M591L915L500L252L110L434M146
$$ 434482 436426 437919 439337 440989 443589 447616 452472 457063 460978 464478 467730 470840 474274 478420
53549D78420M478M249M339N175N657M644K775J744K197L365M406M969M613K862
$$ 478420 482898 487147 491486 496661 502318 506962 509737 511481 513678 517043 521449 526418 531031 533893
53535E33893K38j654j653l03Q28Q24J30j98L59J351J862J358J16j116j827k004
$$ 533893 534131 532477 530824 530521 531349 532173 532303 532105 532464 533815 535677 537035 537151 536035 534208 532204
53519E32204j841j321l53P57J284P99j58n05K09J308J772J242J97n13k38Q22J453
$$ 532204 530363 529042 528689 529446 530730 531529 531371 530866 531075 532383 534155 535397 535594 535081 534843 535665 537118
53502E37118N54j199j654K65L082M768N295N881O393N556L672K975M440O144O044
$$ 537118 537672 536473 534819 535084 538166 542934 548229 554110 560503 566059 569731 572706 577146 583290 589334
53487E89334N011N301P027Q140P601O689O781P510P898Q158R123J0592J1444J1415
$$ 589334 594345 599646 606673 614813 622414 629103 635884 643394 651292 659450 668573 679165 690609 702024
53473G02024J1753J3558J6136J7718J7690J7415J8455K0595K2246K2556K2364
$$ 702024 713777 727335 743471 761189 778879 796294 814749 835344 857590 880146 902510
53462I02510K2959K4652K6769K8587K9834L0593L1165L1890L3030L4841L7560
$$ 902510 925469 950121 976890 1005477 1035311 1065904 1097069 1128959 1161989 1196830 1234390
53451A234390M0813M3201M3363M1659L9987L9598L9870L9790L9620M0246M1560
$$ 1234390 1275203 1318404 1361767 1403426 1443413 1483011 1522881 1562671 1602291 1642537 1684097
53440A684097M2589M2888M2726M2124M0790L9102L8122L8330L9027L9268L8826
$$ 1684097 1726686 1769574 1812300 1854424 1895214 1934316 1972438 2010768 2049795 2089063 2127889
53429B127889L8035L7224L6544L5868L4594L2016K8186K4166K1250K0041K0144
$$ 2127889 2165924 2203148 2239692 2275560 2310154 2342170 2370356 2394522 2415772 2435813 2455957
53418B455957K0417J9643J7556J5110J3262J1593Q871M939J107j675m062p187
$$ 2455957 2476374 2496017 2513573 2528683 2541945 2553538 2562409 2567348 2568455 2566780 2562718 2555531
53406B555531j1030j4717j7906k0963k3991k6554k8417k9857l1109l2090l2827
$$ 2555531 2544501 2529784 2511878 2490915 2466924 2440370 2411953 2382096 2350987 2318897 2286070
53395B286070l3699l4969l6381l7414l7749l7351l6409l5371l4688l4311l3650
$$ 2286070 2252371 2217402 2181021 2143607 2105858 2068507 2032098 1996727 1962039 1927728 1894078
53384A894078l2413l1208l0837l0946k9984k6852k2238j7895j4790j2462j0057
$$ 1894078 1861665 1830457 1799620 1768674 1738690 1711838 1689600 1671705 1656915 1644453 1634396
53373A634396p262m132o97K771N666P863J0230J3542J7185J9842K1502K3721K7555
$$ 1634396 1627134 1623002 1622305 1625076 1630742 1638605 1648835 1662377 1679562 1699404 1720906 1744627 1772182
53360A772182L2135L5887L8448M0575M2727M4794M6966M9765N3075N6055N8389
$$ 1772182 1804317 1840204 1878652 1919227 1961954 2006748 2053714 2103479 2156554 2212609 2270998
53349B270998O0835O4006O7319O9840P1653P3578P5769P7593P9035Q1208Q4936
$$ 2270998 2331833 2395839 2463158 2532998 2604651 2678229 2753998 2831591 2910626 2991834 3076770
53338C076770Q9399R2841R4424R4732R4629R4319R3621R2605R1593R0821R0309
$$ 3076770 3166169 3259010 3353434 3448166 3542795 3637114 3730735 3823340 3914933 4005754 4096063
53327D096063Q9753Q8428Q5580Q1282P6542P2241O8271O4085N9614N4914M9287
$$ 4096063 4185816 4274244 4359824 4441106 4517648 4589889 4658160 4722245 4781859 4836773 4886060
53316D886060M1929L3576K6301K0883J5367P391k514j1379j7732k3715l2442m4129
$$ 4886060 4927989 4961565 4987866 5008749 5024116 5031507 5028993 5017614 4999882 4976167 4943725 4899596
53304D899596n6009o5781p3854q1830q9844r6492j00899j03715j05719j06525
$$ 4899596 4843587 4777806 4703952 4622122 4532278 4435786 4334887 4231172 4125453 4018928
53294D018928j05505j03433j02094j02169j02419j01392r9164r6807r4827r3049
$$ 4018928 3913423 3809990 3707896 3605727 3503308 3401916 3302752 3205945 3111118 3018069
53284C018069r1656r1079r0768q9134q5367q0535p6246p2823o9549o6197o3145
$$ 3018069 2926413 2835334 2744566 2655432 2570065 2489530 2413284 2340461 2270912 2204715 2141570
53273B141570o0123n6005n0446m4810m0626l7535l3715k8456k3411k0707k0276
$$ 2141570 2081447 2025442 1974996 1930186 1889560 1852025 1818310 1789854 1766443 1745736 1725460
53262A725460j9720j6866j1867o616k703m13P34J383K313M185O840R332J1109
$$ 1725460 1705740 1688874 1677007 1670391 1667688 1667275 1668009 1669392 1671705 1675890 1682730 1692062 1703171
53249A703171J2745J5098J8103K1038K3656K6283K8828L0624L1525L2534L4865
$$ 1703171 1715916 1731014 1749117 1770155 1793811 1820094 1848922 1879546 1911071 1943605 1978470
53238A978470L8635M2764M5846M6928M5975M4058M2812M3146M4449M5365M5231
$$ 1978470 2017105 2059869 2105715 2152643 2198618 2242676 2285488 2328634 2373083 2418448 2463679
53227B463679M4334M2916M0617L7251L3612L0807K8760K6117K2029J7541J4437
$$ 2463679 2508013 2550929 2591546 2628797 2662409 2693216 2721976 2748093 2770122 2787663 2802100
53216B802100J2814J0679O278Q9n961j0699j4520j8397k2848k7636l1809l4427
$$ 2802100 2814914 2825593 2831871 2831960 2825999 2815300 2800780 2782383 2759535 2731899 2700090 2665663
53204B665663l5865l8079m2533m8175n2556n4842n6343n8050n9341n9762o0379
$$ 2665663 2629798 2591719 2549186 2501011 2448455 2393613 2337270 2279220 2219879 2160117 2099738
53193B099738o2009o3287o2143n8726n5385n3884n3760n3539n2494n1042n0142
$$ 2099738 2037729 1974442 1912299 1853573 1798188 1744304 1690544 1637005 1584511 1533469 1483327
53182A483327n0414n1374n1606n0192m7787m5684m4046m1904l8797l5560l3251
$$ 1483327 1432913 1381539 1329933 1279741 1231954 1186270 1142224 1100320 1061523 1025963 992712
53171I92712l1938l0819k9133k6761k4203k2066k0423j8902j7501j6827j7079
$$ 992712 960774 929955 900822 874061 849858 827792 807369 788467 770966 754139 737060
53160G37060j7302j6446j4812j3622j3322j3161j2427j1300j0343r884j0042j0738
$$ 737060 719758 703312 688500 674878 661556 648395 635968 624668 614325 604441 594399 583661
53148E83661j1444j1375j0217q429o841o083o265o910p355p381p160o566n348
$$ 583661 572217 560842 550625 542196 535355 529272 523007 516097 508742 501361 494201 487635 482287
53135D82287m165m359n920o841n589l257j973k110k677l540n264p123p515o313
$$ 482287 478122 473763 467843 461002 455413 452156 450183 448073 445396 441856 436592 429469 421954 415641
53121D15641m779l108l68K782L786J638j375k639k291k048k544l196l499l109
$$ 415641 410862 407754 407386 410168 413954 415592 414217 411578 409287 407239 404695 401499 398000 394891
53107C94891j644M33J637J105m66k212m020n271m451j553P28J05k152l060j928
$$ 394891 393247 393680 395317 396422 395956 393744 389724 384453 380002 378449 379177 379282 377130 374070 372142
53092C72142m28M96J408K256J848j00k115k804k338j743j663k123k663k569j611
$$ 372142 371714 372210 373618 375874 377722 377622 375507 372703 370365 368622 366959 364836 362173 359604 357993
53077C57993m11N08J599L314M773M507K324m53k298k246j82K490L273J214j460
$$ 357993 357582 358090 359689 363003 367776 372283 374607 374154 371856 369610 369428 371918 375191 376405 374945
53062C74945j913l69O60K69J03J284K763L247K794J661m99l305n052m673l129
$$ 374945 373032 372663 373323 373592 373695 374979 377742 380989 383783 385444 384945 381640 376588 371915 368786
53047C68786j938j384j091j135j474j269n2J086O60j259l257m262m209l332j840
$$ 368786 366848 365464 364373 363238 361764 360495 360443 361529 362189 360930 357673 353411 349202 345870 344030
53032C44030l05M77K76k02j7R49J634R02q37j689n84J084J218J1l67R43K147J462
$$ 344030 343725 344202 344478 344276 344259 345208 346842 347744 346907 345218 344634 345718 346936 346947 346580 347523 349670 351132
53014C51132m38j625j504r99p93o16r0O12R93P52J31j64K73Q39M66j041k792l924
$$ 351132 350694 349069 347565 346566 345773 345157 345067 345679 346672 347424 347555 347391 347664 348503 348969 347928 345136 341212
52996C41212m169l346j489M13R40R4n52j04M60N5p68r55o69o33o13o8K62r31l283
$$ 341212 337043 333697 332208 332621 333561 333655 333103 332999 333459 333514 332746 331791 331122 330489 329876 329808 330070 329139 325856
52977C25856m762m148k474j627k249l375l608k429o54L24L0m86O6J507K350J628
$$ 325856 321094 316946 314472 312845 310596 307221 303613 301184 300530 300854 300884 300398 300464 301971 304321 305949
52961C05949J9j080j186j033j338j717j232J00J040O95k56n68p6N49J084J549
$$ 305949 305968 304888 303702 302669 301331 299614 298382 298482 299522 300217 299961 299393 299317 299866 300950 302499
52945C02499J200n15k094j222J709L451K246K32j4P59L37r37q10Q93J838Q95l08
$$ 302499 303699 303184 301090 299868 301577 305028 307274 307506 307492 308251 308588 307651 306841 307734 309572 310467 310159
52928C10159j83N30L72o06j343j388r77k53O51J276J322J095R63Q24M54p6o45
$$ 310159 309976 310506 310878 310272 308929 307541 306564 306311 306962 308238 309560 310655 311618 312442 312896 312820 312175
52911C12175j198j360o15P34J528J259R51J685K771K426K45k003k396r70O03J004
$$ 312175 310977 309617 309002 309736 311264 312523 313474 315159 317930 320356 320601 318598 316202 315232 315835 316839
52895C16839K96p82j804k681l136k789j674m18K21m3p80j183q85n16r71j932j855
$$ 316839 317135 316353 314549 311868 308732 305943 304269 303851 304072 304029 303249 302066 301181 300665 299694 297762 295907
52878B95907j14J568R70j642l638l160r50J105J889J192p05k798l712l127k021
$$ 295907 295793 297361 298331 296689 293051 289891 288941 290046 291935 293127 292422 289624 285912 282785 280764
52863B80764j067J03J495J996J046j65l95j14l17o11j2J133J754J944K478K968
$$ 280764 279697 279800 281295 283291 284337 284172 283777 283663 283346 282735 282723 283856 285610 287554 290032 293000
52847B93000K227L23j403k313k863l064k186k46J700K936L603L710L086K199J709
$$ 293000 295227 295550 294147 291834 288971 285907 283721 283475 285175 288111 291714 295424 298510 300709 302418
52832C02418J177k03j691j666l17L60k74m83Q72K347K208R14j02n89r55q96k18
$$ 302418 303595 303392 301701 300035 299718 300078 299804 299321 300193 302540 304748 305662 305560 304971 304016 303120 302902
52815C02902O9q64k059k081j193o12l05P02K252L072K854K648L101L647L679L311
$$ 302902 302971 302107 300048 297967 296774 296162 295857 296559 298811 301883 304737 307385 310486 314133 317812 321123
52799C21123K727J862R06J31q44k544m199m202k350m66j12p44r85q19j327k686
$$ 321123 323850 325712 326618 326749 325905 323361 319162 314960 312610 312144 312032 311288 310303 309484 308157 305471
52783C05471l680l392k384j867k137k450k199j657j369j237o91L08J109J381J699
$$ 305471 301791 298399 296015 294148 292011 289561 287362 285705 284336 283099 282408 282716 283825 285206 286905
52768B86905K566L350L002J585K12m97r55j273n68J444L077K257n69k507j649
$$ 286905 289471 292821 295823 297408 297620 297123 296168 294895 294327 295771 298848 301105 300536 298029 296380
52753B96380P00K012J698J087Q74L54p57j300l56J236J949J429L16j079k728m023
$$ 296380 297080 299092 300790 301877 302751 303105 302348 301048 300692 301928 303877 305306 305622 304543 301815 297792
52737B97792m177l364k418j562n74m9j011l095m487m180l080k320j696n48Q55
$$ 297792 293615 290251 287833 286271 285697 285648 284637 281542 277055 272875 269795 267475 265779 265231 266086
52722B66086J842K366K542J976O30l39J37J284J377J78q15o52j40l38r64j064
$$ 266086 267928 270294 272836 274812 275442 275103 275240 276524 277901 278079 277264 276612 276472 276134 275170 274106
52706B74106n82m18j096k046k304j563l56O61J302J666J689J193L14o30j594k605
$$ 274106 273524 273106 272010 269964 267660 266097 265741 266402 267704 269370 271059 272252 272566 271936 270342 267737
52690B67737l030j835R73L803M946M210K632J196L80M71J405K474K964K971K975
$$ 267737 264707 262872 263845 267648 272594 276804 279436 280632 281012 281483 282888 285362 288326 291297 294272
52675B94272K901K406J858K014K596K288N63j293j613l27J112J521J034L48m55
$$ 294272 297173 299579 301437 303451 306047 308335 308898 307605 305992 305665 306777 308298 309332 309680 309225
52660C09225j904m038n826o063m707k820j246M9J131J461P22l27o21j59J97nm85
$$ 309225 307321 303283 297457 291394 286687 283867 282621 282670 283801 285262 285984 285657 285036 284877 285074 285069 284584
52643B84584r99j535j837j615j251j352j600j027K79R27K16o30p0J603K741K536
$$ 284584 283585 282050 280213 278598 277347 275995 274395 273368 273647 274574 274790 274160 274090 275693 278434 280970
52627B80970J819J728K357K924K809K183J852K331L071K824J124r44j855j334
$$ 280970 282789 284517 286874 289798 292607 294790 296642 298973 302044 304868 305992 305048 303193 301859
52613C01859m38j33l02l01N3L28J45l00m40lO88J166J377J509J438Q99L08P35
$$ 301859 301421 301288 300986 300685 300738 301066 301211 300911 300471 300468 301156 302322 303699 305208 306646 307545 307853 308588
52595C08588K598M909O247O086M766K772Q86K82J274K094M73l236n843m989j961
$$ 308588 311186 316095 322342 328428 333194 335966 336852 337134 338408 340502 340975 337739 331896 326907 324946
52580C24946O7k99j895l178l667l344k163o35K02K5k19M11J598K273J989J226
$$ 324946 325013 324714 322819 319641 315974 312630 310467 309832 310034 310059 309840 310251 311849 314122 316111 317337
52564C17337O71O01Q13P45Jr64j098j04Q24L02j458k783k548j395p94j421k606
$$ 317337 318008 318609 319422 320167 320168 319204 318106 318002 318826 319128 317670 314887 312339 310944 310150 308729 306123
52547C06123l097k078K23K669L926L395J629n9n49K37J325J617R02j43q07q47
$$ 306123 303026 300948 301171 303840 307766 311161 312790 312731 312182 312419 313744 315361 316263 316120 315313 314466
52531C14466k92O74J502J640J305J289J704J657O30n97j093j046j079r97k68P97
$$ 314466 314174 314848 316350 317990 319295 320584 322288 323945 324575 323978 322885 321839 320760 319763 319495 320292
52515C20292J486J899K465K621J422p28k345k914l176l346k696j303m69o40n10
$$ 320292 321778 323677 326142 328763 330185 329457 327112 324198 321022 317676 314980 313677 313208 312568 312058
52500C12058Q49K307K371J371O54N38L96R3M0K71N97J240K187K479J333l55r73
$$ 312058 312907 315214 317585 318956 319610 320148 320544 320637 320677 320948 321545 322785 324972 327451 328784 328429 327456
52483C27456m19j52r84k069k284j542m24N63J036P23j03o64m34L58J043J183Q63
$$ 327456 327037 326885 325901 323832 321548 320006 319582 320145 321181 321904 321801 321137 320703 321061 322104 323287 324150
52466C24150N14L82J59m96j180j173o62n71q48j68J798L226K525Q41M83J656K597
$$ 324150 324664 325046 325205 324709 323529 322356 321694 321123 320275 320107 321905 325131 327656 328497 328980 330636 333233
52449C33233K499K263K419K409K200K605L438L173J283p18j486j544j682j292
$$ 333233 335732 337995 340414 342823 345023 347628 351066 354239 355522 354804 353318 351774 350092 348800
52435C48800K07J429M14k540n020n351l956k041k89R41J307R72O61P41P54L31
$$ 348800 349007 350436 350850 348310 343290 337939 333983 331942 331653 332594 333901 334873 335534 336275 337029 337360
52419C37360R0J019L029M698M761L518K314J750J145k8j031q84O8O54N34K72N2
$$ 337360 337450 338469 341498 346196 350957 354475 356789 358539 359684 359656 358625 357741 357809 358463 358997 359269 359321
52402C59321l82m36J086L891N695M798K104l21j699k396k330j174J69lj863l471
$$ 359321 358939 358503 359589 363480 369175 373973 376077 375756 374057 371661 369331 368157 368326 368323 366460 362989
52386C62989l079j238R8o9r91j456j129n43k77m85r52j239q74J68J082Q45n10
$$ 362989 359910 358672 358770 358701 357710 356254 355125 354582 354305 353820 352868 351629 350755 350923 352005 352850 352340
52369C52340j630j358n8J090J630J792J425J87j217j330Q5J543J799J281J042
$$ 352340 350710 349352 349294 350384 352014 353806 355231 355418 354201 352871 352956 354499 356298 357579 358621
52354C58621J319J882K765L658L529K025O09R63K652L663L151K369K732M040N017
$$ 358621 359940 361822 364587 368245 371774 373799 374408 375371 378023 381686 384837 387206 389938 393978 398995
52339C98995M775L322J219q22k251k922k930k379j514q56p78j035j152j079j015
$$ 398995 403770 407092 408311 407489 405238 402316 399386 397007 395493 394637 393859 392824 391672 390593 389578
$$ [...]
##END NTUPLES=NMR SPECTRUM
##END=
