
##TITLE=UV1163_M6-1005-1000_6307324_defswcotjv
##JCAMPDX= 6.0         $$ Bruker NMR JCAMP-DX V2.0
##DATA TYPE= NMR SPECTRUM
##DATA CLASS= NTUPLES
##ORIGIN= BRUKER
##OWNER= Administrator
$$ 1.72 TOPSPIN		Version 2.1
$$ 2012-06-07 06:03:30.031 -0500  Administrator@TOPSPIN
$$ Compression mode = diff/dup
##.OBSERVE FREQUENCY= 400.13188235
##.OBSERVE NUCLEUS= ^1H
##.ACQUISITION MODE= SIMULTANEOUS (DQD)
##.ACQUISITION SCHEME= undefined
##.AVERAGES= 8
##.DIGITISER RES= 22
##SPECTROMETER/DATA SYSTEM= spect
##.PULSE SEQUENCE= zg30
##.SOLVENT NAME= COFFEE_meoh
##.SHIFT REFERENCE= INTERNAL, COFFEE_meoh, 1, 14.98061
##AUDIT TRAIL= $$ (NUMBER, WHEN, WHO, WHERE, PROCESS, VERSION, WHAT)
$$ ##TITLE= Audit trail, TOPSPIN		Version 2.1
$$ ##JCAMPDX= 5.01
$$ ##ORIGIN= Bruker BioSpin GmbH
$$ ##OWNER= Administrator
$$ $$ C:\Bruker\TOPSPIN/data/COFFEE/nmr/UV1163_M6-1005-1000_6307324_defswcotjv/10/pdata/1/auditp.txt
$$ ##AUDIT TRAIL=  $$ (NUMBER, WHEN, WHO, WHERE, PROCESS, VERSION, WHAT)
(   1,<2012-06-07 06:03:21.828 -0500>,<Administrator>,<TOPSPIN>,<go>,<TOPSPIN 2.1>,
      <created by zg
	started at 2012-06-07 06:02:15.250 -0500,
	POWCHK enabled, PULCHK disabled,
       configuration hash MD5:
       D5 CA 7A 23 FE 6B EE E2 50 67 74 61 24 F7 5E 3B
       data hash MD5: 64K
       66 B3 9E E4 80 95 A9 7A F7 C2 52 8B 51 07 4D 53>)
(   2,<2012-06-07 06:03:25.921 -0500>,<Administrator>,<TOPSPIN>,<proc1d>,<TOPSPIN 2.1>,
      <Start of raw data processing
       efp LB = 0 FT_mod = 6 PKNL = 1 PHC0 = 0 PHC1 = 0 SI = 32K 
       data hash MD5: 32K
       04 FD D8 7C F2 DA 85 47 D4 B9 AC AF 79 7B 18 E9>)
(   3,<2012-06-07 06:03:26.203 -0500>,<Administrator>,<TOPSPIN>,<proc1d>,<TOPSPIN 2.1>,
      <pk PHC0 = 208.5809 PHC1 = 0 
       data hash MD5: 32K
       95 59 A8 7F 8C D6 36 0D 94 6E 68 64 87 25 4C 0A>)
(   4,<2012-06-07 06:03:26.296 -0500>,<Administrator>,<TOPSPIN>,<proc1d>,<TOPSPIN 2.1>,
      <abs ABSG = 1 
       data hash MD5: 32K
       D1 25 53 F5 09 00 59 7E F5 BF 72 C8 CD BE 34 7B>)
(   5,<2012-06-07 06:03:26.328 -0500>,<Administrator>,<TOPSPIN>,<proc1d>,<TOPSPIN 2.1>,
      <abs ABSG = 2 
       data hash MD5: 32K
       6D 19 60 37 B4 84 AF 57 B6 02 03 27 A6 BC C6 36>)
(   6,<2012-06-07 06:03:26.359 -0500>,<Administrator>,<TOPSPIN>,<proc1d>,<TOPSPIN 2.1>,
      <abs ABSG = 3 
       data hash MD5: 32K
       03 A9 01 C1 F0 C6 F1 2E F0 3E EF 42 A0 60 B3 F3>)
(   7,<2012-06-07 06:03:26.406 -0500>,<Administrator>,<TOPSPIN>,<proc1d>,<TOPSPIN 2.1>,
      <abs ABSG = 4 
       data hash MD5: 32K
       E6 39 79 CE 91 B4 65 09 A4 75 35 E8 B9 AF 7B 6B>)
(   8,<2012-06-07 06:03:26.437 -0500>,<Administrator>,<TOPSPIN>,<proc1d>,<TOPSPIN 2.1>,
      <abs ABSG = 5 
       data hash MD5: 32K
       04 DD DC 99 F6 F9 DE 38 06 AE 5E 13 4B 0C 03 B5>)
$$ ##END=
$$ 
$$ $$ hash MD5
$$ $$ 1E 6E 0E 69 83 A6 B6 B5 6A 31 69 E8 89 95 B2 C8
##$RELAX= 
##$RELAX= 
##$RELAX= 
##$RELAX= 
##$RELAX= 
##$RELAX= 
##$RELAX= 
$$ Bruker specific parameters
$$ --------------------------
$$ [...]
##$TP= (0..7)
150 150 150 150 150 150 150 150
##$TP07= 0
##$TPNAME0= <>
##$TPNAME1= <>
##$TPNAME2= <>
##$TPNAME3= <>
##$TPNAME4= <>
##$TPNAME5= <>
##$TPNAME6= <>
##$TPNAME7= <>
##$TPOAL= (0..7)
0.5 0.5 0.5 0.5 0.5 0.5 0.5 0.5
##$TPOFFS= (0..7)
0 0 0 0 0 0 0 0
##$TUNHIN= 0
##$TUNHOUT= 0
##$TUNXOUT= 0
##$USERA1= <user>
##$USERA2= <user>
##$USERA3= <user>
##$USERA4= <user>
##$USERA5= <user>
##$V9= 5
##$VALIST= <valist>
##$VCLIST= <CCCCCCCCCCCCCCC>
##$VD= 0
##$VDLIST= <DDDDDDDDDDDDDDD>
##$VPLIST= <PPPPPPPPPPPPPPP>
##$VTLIST= <TTTTTTTTTTTTTTT>
##$WBST= 2048
##$WBSW= 25
##$XGAIN= (0..3)
0 0 0 0
##$XL= 0
##$YL= 0
##$YMAX_a= 490438
##$YMIN_a= -598102
##$ZGOPTNS= <>
##$ZL1= 120
##$ZL2= 120
##$ZL3= 120
##$ZL4= 120
##$ABSF1= 14.98061
##$ABSF2= -5.57192
##$ABSG= 5
##$ABSL= 3
##$ALPHA= 0
##$AQORDER= 0
##$ASSFAC= 0
##$ASSFACI= 0
##$ASSFACX= 0
##$ASSWID= 0
##$AUNMP= <proc_prof1d_extract_pilot.lims>
##$AXLEFT= 0
##$AXNAME= <>
##$AXNUC= <1H>
##$AXRIGHT= 0
##$AXTYPE= 0
##$AXUNIT= <>
##$AZFE= 0.1
##$AZFW= 0.1
##$BCFW= 0
##$BC_mod= 0
##$BYTORDP= 0
##$COROFFS= 0
##$CY= 15
##$DATMOD= 1
##$DC= 0
##$DFILT= <>
##$DTYPP= 0
##$F1P= 0
##$F2P= 0
##$FCOR= 0.5
##$FTSIZE= 32768
##$FT_mod= 6
##$GAMMA= 0
##$GB= 0
##$INTBC= 1
##$INTSCL= 1
##$ISEN= 128
##$LB= 0
##$LEV0= 0
##$LPBIN= 0
##$MAXI= 10000
##$MC2= 0
##$MEAN= 0
##$ME_mod= 0
##$MI= 0
##$NCOEF= 0
##$NC_proc= -8
##$NLEV= 6
##$NOISF1= 0
##$NOISF2= 0
##$NSP= 0
##$NTH_PI= 0
##$NZP= 0
##$OFFSET= 14.98061
##$PC= 1
##$PHC0= 208.5809
##$PHC1= 0
##$PH_mod= 1
##$PKNL= yes
##$PPARMOD= 0
##$PPDIAG= 0
##$PPIPTYP= 0
##$PPMPNUM= 2147483647
##$PPRESOL= 1
##$PSCAL= 4
##$PSIGN= 0
##$PYNMP= <proc.py>
##$REVERSE= no
##$SF= 400.13
##$SI= 32768
##$SIGF1= 0
##$SIGF2= 0
##$SINO= 400
##$SIOLD= 32768
##$SPECTYP= <>
##$SREGLST= <1H.CDCl3>
##$SSB= 0
##$STSI= 32768
##$STSR= 0
##$SW_p= 8223.68421052632
##$SYMM= 0
##$S_DEV= 0
##$TDeff= 65536
##$TDoff= 0
##$TI= <>
##$TILT= no
##$TM1= 0
##$TM2= 0
##$TOPLEV= 0
##$USERP1= <user>
##$USERP2= <user>
##$USERP3= <user>
##$USERP4= <user>
##$USERP5= <user>
##$WDW= 1
##$XDIM= 32768
##$YMAX_p= 447532810
##$YMIN_p= -660052
##$CURPLOT= <Network HP LaserJet P1505>
##$CURPRIN= <$Network HP LaserJet P1505>
##$DFORMAT= <normdp>
##$LAYOUT= <+/1D_H.xwp>
##$LFORMAT= <normlp>
##$PFORMAT= <normpl>
##$SURQMSG= 1
$$ End of Bruker specific parameters
$$ ---------------------------------
##NTUPLES= NMR SPECTRUM
##VAR_NAME=  FREQUENCY,     SPECTRUM/REAL,   SPECTRUM/IMAG
##SYMBOL=    X,             R,               I
##VAR_TYPE=  INDEPENDENT,   DEPENDENT,       DEPENDENT
##VAR_FORM=  AFFN,          ASDF,            ASDF
##VAR_DIM=   32768,         32768,           32768
##UNITS=     HZ,            ARBITRARY UNITS, ARBITRARY UNITS
##FACTOR=    0.250966925370066, 1,           1
##FIRST=     8223.43324360095, 175842,       122942
##LAST=      0,             191506,          -62822
##MIN=       0,             -660052,         0
##MAX=       8223.43324360095, 447532810,    0
$$ Real data points
##PAGE= N=1
##DATA TABLE= (X++(R..R)), XYDATA
$$ [...]
$$ plain form
19553 137761 -46775 -100674 47188 -338502 -51708 183801 -222530 -159775 65815 111539 50933
19541 -170697 239857 -165309 182409 285312 -296922 70438 47295 87934 -103785 -205284
19531 -205284 -15631 -181805 -60346 -402718 208452 -162561 -379111 -159840 251014 22809
19520 -73930 -41834 127801 -42650 58327 -86571 327501 -87626 -22666 -66723 6284 389956
19509 389956 121573 -97763 -105304 -163004 -155368 -550645 -116778 -25096 151153 163213 -171565
19497 -42362 189096 67900 -3818 226677 -59151 126351 -95455 30529 -35829 50075 247767
19486 247767 269389 1416 60899 47368 -368602 -145082 -581527 323200 41004 6811 -206984
19474 -74756 56616 -242569 27371 -108685 -60404 66251 124894 -8954 -94242 168376 267396
$$ packed form
19553A37761d6775n3899D7188c38502e1708A83801b22530O2755F5815M5724E0933
19541a70697B39857a65309A82409J02903b96922G0438k3143M0639a03785j01499
19531b05284a5631j66174f0346l42372B08452a62561k16550a59840B51014B2809
19520g3930L2096A27801d2650E8327h6571C27501h7626b2666m4057F284L83672
19509C89956A21573i7763p541n7700P636l95277a16778b5096A51153J2060a71565
19497d2362A89096F7900c818B26677e9151A26351i5455C0529c5829E0075J97692
19486B47767K1622A416N9483j3531c68602a45082m36445C23200D1004F811b06984
19474g4756E6616b42569B7371a08685M8281F6251N8643h954q5288A68376R9020
$$ plain form
19463 267396 16295 -94247 -132228 102561 45978 -148119 203792 -94084 -20041 -101725 -89618
19452 -89618 -168693 -395508 -83351 -437999 -115847 -164195 63471 111205 -129032 26943 151038
19441 151038 -348744 198487 -54250 226981 -144594 -277389 -319110 15002 -337377 81145
19430 -451347 145304 161035 -181325 -16437 42530 -193030 94889 54409 104697 -90408 255447
19418 33100 -477983 14209 -171907 -146040 -313966 242088 51720 -128803 23920 37691 207570
19407 207570 -281610 12704 115281 -343310 -253100 -31103 -167733 52913 39414 -94668 87424
19395 -230662 47397 -4527 -206310 251388 -524692 -104617 -68137 -135732 -66855 205153 -105641
19383 170187 211706 267530 -284641 -30100 29547 -39520 -58443 -307103 93466 24569 -71180
$$ packed form
19463B67396A6295i4247l7981A02561D5978a48119B03792i4084b0041q1684J2107
19452h9618p9075k26815h3351l54648a15847m8348F3471M7734a29032B6943J24095
19441A51038c48744A98487e4250B26981a44594j32795m1721A5002c37377H1145
19430d51347A45304J5731a81325a6437D2530a93030I4889m0480N0288i0408B55447
19418C3100d77983A4209a71907K5867j67926B42088E1720a28803B3920J3771J69879
19407B07570b81610A2704J02577c43310R0210c1103j36630E2913j3499i4668H7424
19395b30662D7397d527k01783B51388e24692a04617L6480o7595f6855B05153a05641
19383A70187M1519N5824b84641c0100B9547c9520j8923k48660I3466B4569g1180
$$ plain form
19371 371944 -219774 -135509 144570 -60902 10878 -90859 -277801 -11307 -224864 -190466 -134049
19360 -134049 -270671 45984 -76985 -124485 -269012 -41101 -375529 4891 70921 -204911 -275374
19349 -275374 -404857 -26310 -244096 -98855 247285 -274178 -206239 -86428 -228563 -134939
19339 -134939 -8079 329329 90305 -246575 -14646 203651 240082 86542 -82923 118412 -49712
19327 178467 -159939 -253528 1703 -181222 68918 19846 168081 -43654 53900 118162 142742
19316 142742 -175253 18096 -316533 -101103 162408 -122268 -142702 -204640 -189937 25237
19305 -161900 -198660 -148792 -33264 181553 -98861 -251797 -59296 -91969 21962 135600 224119
19294 224119 91600 -218225 286088 124381 86847 -202980 -3282 -150222 -36082 164520
$$ packed form
19371C71944b19774Q4265A44570f0902A0878i0859j86942a1307k13557L4398N6417
19360a34049j36622D5984g6985m7500j44527d1101l34428D891O6030b04911p0463
19349b75374j29483b6310k17786i8855B47285b74178O7939h6428j42135R3624
19339a34939h079C29329I0305b46575a4646B03651L6431H6542h2923A18412d9712
19327A78467a59939r3589A703a81222F8918A9846J48235d3654E3900O4262K4580
19316A42742a75253A8096c16533a01103A62408a22268k0434o1938J4703B5237
19305a61900l6760M9868c3264A81553i8861j52936e9296l2673B1962J13638Q8519
19294B24119I1600b18225B86088A24381l7534b02980c282j46940c6082A64520
$$ plain form
19283 -273348 -279666 -193944 81194 -122905 -127806 -193330 -39481 241392 -160206 -74051 72352
19271 -7442 117641 -148124 -130036 40585 -304706 -457739 -106792 -88335 -227816 -82808 -55008
19260 -55008 -70898 -150631 217093 67896 16059 -331818 -237209 -76539 -86708 -331161 -49913
19248 123736 -294899 -19699 -126276 106350 -413315 72154 -399758 -38714 -372490 -110470
19237 -139341 29360 160788 -137758 58419 41507 63166 -271225 -264764 -96310 42786 -3404
19225 112329 -170749 -34274 -170967 31010 76748 -49879 -83583 -43863 19558 -172755 -89094
19214 -89094 -248159 239183 -166298 165946 -45404 33142 19103 -129630 -255304 45396
19203 -5736 334315 87682 -103058 -260625 -314036 -70287 -274898 -17625 201521 434978 -205601
$$ packed form
19283b73348o318Q5722H1194a22905m901o5524c9481B41392a60206g4051G2352
19271g442A17641a48124J8088D0585c04706j53033a06792J8457j39481h2808K7800
19260e5008j5890p9733B17093F7896A6059c31818R4609g6539j0169k44453d9913
19248A23736b94899a9699j06577A06350d13315G2154c99758c8714l33776a10470
19237a39341B9360J31428a37758E8419j6912K1659b71225O461i6310D2786c404
19225A12329a70749c4274j36693C1010M5738d9879l3704L9720A9558a72755Q3661
19214h9094j59065B39183a66298A65946d5404C3142j4039a29630j25674D5396
19203e736C34315H7682a03058j57567n3411g0287k04611a7625B01521K33457b05601
$$ plain form
19191 -343522 -15702 -70675 99993 -322908 -117026 -461821 174181 633 -259982 -151022 -39278
19179 -116609 -137610 -139364 -413262 -86915 32490 119676 -373278 233072 -81652 120209 -102120
19167 -395633 158422 -19411 -147007 -31607 48336 -78338 -136747 -77283 -226853 188975 -231756
19155 -214289 -10488 180772 90757 139913 90851 -78397 -111909 -66323 52378 -87857 -100271
19144 -100271 -49112 -144491 -101786 -98737 -412135 197788 148508 -240646 63580 -177088 -87392
19132 -212370 -208856 23138 -276354 1793 -61037 -238946 -51128 315611 -285312 61621 222755
19121 222755 -50506 237524 31208 40540 -201000 -48880 100737 -166069 257821 133087
19111 133087 -9473 154461 -113965 68192 89272 -285736 -121474 -87940 225836 105854
$$ packed form
19191c43522a5702n4973I9993c22908a17026l44795A74181F33b59982J08960c9278
19179a16609k1001j754k73898h6915C2490Q7186c73278B33072h1652A20209a02120
19167c95633A58422a9411j27596c1607D8336g8338n8409N9464j49570A88975b31756
19155b14289a0488A80772r0015M9156m9062g8397l3512M5586E2378h7857j2414
19144a00271d9112r5379M2705L049l13398A97788m9280b40646F3580a77088h7392
19132b12370L514B3138b76354A793f1037j77909e1128C15611b85312F1621J61134
19121B22755e0506B37524C1208R332b01000d8880A00737a66069B57821j24734
19111A33087i473A54461a13965F8192K1080b85736a21474L3534B25836A05854
$$ plain form
19100 -304740 88114 -21530 -260058 -189346 43191 -411047 -45279 248513 -271936 -8011 9791
19088 120730 -19867 -74225 -36212 -108184 -189084 -51578 22225 -139425 50080 367198 -8025
19076 120926 -143820 43850 -123025 -130770 180166 -108103 139852 -10780 -51561 -160042
19066 -160042 -277231 -71085 -44341 -103567 154021 47832 -82465 -89979 20368 145052 58597
19054 410088 -132767 85591 -19546 -110448 -100631 -100569 -97646 -245161 -294831 180676 70580 -63938
19041 28506 -117932 96658 -113917 -34424 -131169 187802 -22092 -201511 11994 -8376 43358
19029 -213313 -104222 -180201 -75604 -246421 -35099 43625 -233651 190330 109530 -54673 76183
19017 137304 3754 98602 -331198 116019 164937 162793 518 174914 340037 146655 200704
$$ packed form
19100c04740H8114b1530k38528P0712D3191d11047d5279B48513b71936h011I791
19088A20730a9867n4358c6212p1972q0900e1578B2225a39425E0080L17118h025
19076A20926a43820D3850a23025p745A80166a08103A39852a0780m0781j08481
19066a60042j17189g1085K6744n9226A54021D7832h2465p514B0368J24684E8597
19054D10088a32767H5591a9546r0902R817O2K923j47515m9670A80676G0580f3938
19041B8506a17932I6658a13917c4424r6745A87802b2092j79419A1994h376D3358
19029b13313a04222p5979g5604j70817c5099D3625b33651A90330q0800e4673G6183
19017A37304C754R4848c31198A16019M8918k144E18J74396J65123A46655N4049
$$ plain form
19006 200704 63294 -87483 -7029 -94073 33646 -329994 -71913 139421 149601 119192 -48124
18994 -105941 58705 22857 211494 -106602 -35143 -339605 105337 -148968 -114047 -290048
18984 -290048 11490 20637 71291 -30620 -132897 -326561 -34097 -146808 204202 164024 82583
18973 82583 14017 -138996 158754 -149766 -205616 -185315 -272435 136697 -88518 -117212 -227470
18962 -227470 95725 90644 -1233 34431 -142210 -284298 -114678 -499 -90628 -59927 -46729 22876
18949 37014 781 138314 89167 -261458 -53474 132622 -15933 -109392 -35182 -234493 86421
18937 228376 -11183 -140164 -22092 -25251 -181427 -261264 12908 -392144 -96292 -52648 151024
18925 209003 252817 -130921 -118863 -74799 200077 -354360 -10879 -306388 -2343 -108359 -151393
$$ packed form
19006B00704F3294h7483g029q7044C3646c29994g1913A39421J0180l0409d8124
18994a05941E8705B2857J88637a06602c5143l04462A05337a48968L4921j76001
18984b90048A1490R147N0654c0620j02277j93664c4097j12711B04202m0178q1441
18973H2583A4017a38996A58754a49766n5850K0301q7120A36697h8518k8694j10258
18962b27470I5725n081a233C4431a42210j42088a14678d99r0129L0701J3198B2876
18949C7014G81J37533m9147b61458e3474A32622a5933r3459c5182j99311H6421
18937B28376a1183j28981b2092l159j56176p9837A2908c92144i6292M3644A51024
18925B09003M3814a30921J2058M4064B00077c54360a0879k95509b343j06016m3034
$$ plain form
18914 -151393 35941 106710 106929 25852 -36461 110493 -17419 281829 -1205 -132831 -37371
18902 -68440 -314023 80579 22144 -92938 -12500 115039 -173641 153888 -94875 -267889 -236197
18891 -236197 63784 9380 -107330 126722 -106857 -167549 48099 112122 -240644 -219106 -345775
18880 -345775 501057 -219158 -218616 -55604 18369 81942 241475 158220 -270930 231090 -109198
18868 350938 88513 102811 -52549 63248 -39559 314521 -281006 56982 276534 -20749 -10590
18857 -10590 -212610 215422 84253 -278980 -344218 205193 -265646 -59989 137701 140273 -216033
18845 -26401 -6496 -574 63402 73990 13485 43822 -20167 -386178 -48551 -164858 44722 279640
18833 279640 -27641 155693 53218 194406 -255794 95876 -265690 -198513 -145656 57776 -203927
$$ packed form
18914a51393C5941P0769K19B5852c6461A10493a7419B81829a205j31626c7371
18902f8440k45583H0579B2144i2938a2500A15039a73641A53888i4875j73014L1692
18891b36197F3784I380a07330A26722a06857o0692D8099O4023b40644K1538j26669
18880c45775E01057b19158N42e5604A8369O3573J59533q3255b70930B31090a09198
18868C50938H8513J4298e2549F3248c9559C14521b81006E6982K19552b0749J0159
18857a0590k02020B15422H4253b78980o5238B05193b65646e9989A37701K572b16033
18845b6401f496e74F3402J0588A3485L0337b0167l66011d8551j16307D4722K34918
18833B79640b7641A55693E3218J41188b55794I5876b65690O7177N2857E7776b03927
$$ plain form
18821 245761 133352 99740 -210658 -21293 -20237 -71677 -279412 -176972 5378 -71678 -127001
18810 -127001 57190 -133642 -292733 -229550 -58499 -190348 111137 -85018 -161767 316151
18799 -164018 -63279 -6245 106194 -41142 356834 17245 -68689 -120886 -255135 -332520 -63042
18787 373951 -83972 128102 111340 -59964 -68917 36152 39938 30660 -130315 -209677 25921 6878
18774 -237771 25387 -96587 -108256 -3623 21347 -123389 -187225 -419011 -166281 57768 -95840
18762 78340 -48871 -475897 14300 379279 238884 -117722 97614 -86496 34264 198669 -261532
18750 -32323 166641 -76507 -205990 260831 -13925 -121357 -14899 -105552 -79868 -283093 -55101
18738 -103029 40517 -188297 -124862 14739 -108982 -99072 270168 -129363 95668 -64886 48335
$$ packed form
18821B45761j12409l3612b10658b1293J056n1440k07735J02440E378g1678n5323
18810a27001E7190a33642j59091O3183e8499j31849A11137h5018p6749C16151
18799a64018f3279f245A06194d1142C56834A7245f8689n2197j34249p7385f3042
18787C73951h3972A28102j6762e9964q953C6152L786r278a30315p9362B5921F878
18774b37771B5387i6587j1669c623B1347a23389o3836k31786a66281E7768i5840
18762G8340d8871m27026A4300L64979j40395a17722I7614h6496C4264J64405b61532
18750c2323A66641g6507j29483B60831a3925j07432a4899r0653K5684k03225e5101
18738a03029D0517a88297O3435A4739a08982R910B70168a29363I5668f4886D8335
$$ plain form
18726 199030 113818 -185623 -190540 -240618 -103767 2456 -163826 -34953 -10492 37219 61998
18715 61998 -132516 -37550 229364 -135083 -219874 -132157 -61455 8500 99788 -131309 -126795
18704 -126795 -15259 -140868 18853 85538 32464 362740 -181252 -337031 -397710 -436396 -210782
18692 -403998 -114885 189609 -159274 -74212 -1093 -203275 177587 188025 -4287 6166 -18399
18680 -301031 22522 -124683 -173114 913 -223143 -77463 -66288 386487 -199368 151544 12614
18668 -179357 -200055 -64977 -51168 -177332 -287361 8521 159767 -113126 106179 84795 36611
18656 -154215 70154 84111 -292408 -35705 -163274 -394493 47941 -257579 -294245 -142629
18645 315913 35285 -99377 205135 -282830 -204799 95809 -64284 -113716 -96313 94876 37256
$$ packed form
18726A99030q5212a85623m917n0078a03767B456a63826c4953a0492C7219K4779
18715F1998a32516c7550B29364a35083q4791Q7717f1455H500R1288a31309M514
18704a26795a5259j25609A8853O6685C2464L30276a81252j55779o0679l8686b10782
18692d03998a14885A89609a59274g4212a093k02182A77587J0438d287F166a8399
18680c01031B2522a24683m8431I13b23143g7463J1175C86487a99368A51544A2614
18668a79357k0698f4977J3809j26164j10029H521J51246a13126A06179k1384C6611
18656a54215G0154J3957b92408c5705j27569k31219D7941b57579l6666a42629
18645C15913C5285i9377B05135b82830P8031I5809f4284m9432J7403I4876C7256
$$ plain form
18633 -403451 303518 81188 228338 -488502 -15442 -188935 -240305 -177079 -236435 313731
18622 -315596 -49173 90849 -223103 -114910 -236934 -46054 133883 -36491 -18234 298326
18611 -27266 142444 -305407 58239 -25903 -4739 -173523 -304688 21590 -35208 -202825 -387698
18600 -387698 35787 12330 -418420 85154 -243012 95549 -140857 47850 75674 -403258 -138412
18588 -107015 -297875 -60062 -177735 21982 -215609 -81709 -277650 71219 44775 100044 60574
18577 60574 267810 11883 -107926 -15541 -99434 33617 422711 -416873 335875 372547 156337
18565 -194779 -43299 104733 -161081 -82821 -165044 7498 -77681 14320 45578 75053 -208872
18553 208130 -157707 -86235 85751 164377 173924 -16461 84331 -272177 90273 -277231 77978
$$ packed form
18633d03451C03518H1188J47150d88502a5442j73493n1370O3226n9356C13731
18622c15596d9173I0849b23103J08193j22024d6054A33883c6491a8234B98326
18611b7266A42444c05407E8239b5903d739j68784j31165B1590c5208j67617j84873
18600c87698C5787A2330d18420H5154b43012I5549a40857D7850K7824d03258a38412
18588a07015j90860f0062j17673B1982b15609h1709j95941G1219k6444N5269l9470
18577F0574K07236A1883a07926a5541q3893C3617L89094d16873C35875L6672A56337
18565a94779d3299A04733a61081P8260q2223G498g7681A4320L1258K9475b08872
18553B08130a57707P1472H5751P8626R547a6461H4331b72177I0273b77231G7978
$$ plain form
18541 -115729 33586 -357598 105798 -32851 -61339 -433436 133122 -353381 -36585 -105461
18531 -105461 -105267 -120674 174203 163931 -307552 -156130 -194812 -244912 221694 -52992 -283658
18520 -283658 166633 -193517 -63665 -402758 4060 94258 19589 -133243 19218 -118759 -157628
18509 -157628 91748 55795 -29971 113692 -235831 59815 51618 -84926 -9481 200741 -248463
18497 124004 -486055 -156571 5433 -5027 249616 -5074 179266 -177224 91399 -100521 287151
18485 114831 138970 -91237 228275 -297689 -208804 -111020 -295162 -48737 -187965 -156157 183725
18473 -184523 -154569 -361724 -71899 -158019 171503 -139160 57797 -172270 60076 -251051
18462 -143282 -47491 -153176 -272340 -167564 144039 -44090 -215297 295702 -159438 1667
$$ packed form
18541a15729C3586c57598A05798c2851k8488l72097A33122c53381c6585o8876
18531a05461J94j5407A74203j0272c07552J51422l8682n0100B21694e2992k30666
18520b83658A66633a93517f3665l39093D060R0198A9589a33243A9218a18759l8869
18509a57628I1748l5953b9971A13692b35831E9815q197h4926i481B00741b48463
18497A24004d86055a56571E433e027B49616e074A79266a77224I1399a00521B87151
18485A14831K4139i1237B28275b97689Q8885R7784j84142d8737j39228L1808A83725
18473a84523K9954k07155g1899q6120A71503a39160E7797a72270F0076b51051
18462a43282d7491j05685j19164J04776A44039d4090j71207B95702a59438A667
$$ plain form
18451 78289 29222 -331313 187442 175005 -11098 -409647 33301 -147035 119155 -136326
18440 37 -36964 -221272 -36990 196784 112424 -80713 -217711 63329 33665 -101055 8079 172747
18428 172747 60430 -6016 201666 -442077 22792 -238107 36389 -141903 72579 72030 -129092
18416 46572 -300300 243737 -68623 46638 -66400 -71451 11205 -43503 -192172 -98589 282015
18404 -62437 101802 -42821 -320010 -31748 -120723 -132942 223876 -50006 -102654 244220 -85589
18392 31163 -160712 -328561 359404 -13065 340970 14319 -40962 -96554 -272156 -71927 -304766
18381 -304766 -6152 -242117 55856 72627 -247795 -137637 -85808 -92011 76415 -30493 -133739
18370 -133739 35544 -89872 100986 -158757 -318174 171930 286293 -370261 93525 -214872
$$ packed form
18451G8289B9222c31313A87442j2437a1098l98549C3301a47035A19155a36326
18440C7c6964j84308c6990A96784q4360h0713j36998F3329k9664a01055H079J64668
18428A72747F0430f016B01666d42077B2792b38107C6389a41903G2579n49a29092
18416D6572c00300B43737f8623D6638f6400n051A1205d3503j48669R3583B82015
18404f2437A01802d2821k77189c1748q8975j2219B23876e0006n2648B44220h5589
18392C1163a60712j67849C59404a3065C40970A4319d0962n5592j75602g1927k32839
18381c04766f152k35965E5856J6771b47795J10158N1829o203G6415c0493j03246
18370a33739C5544h9872A00986a58757j59417A71930J14363c70261I3525b14872
$$ plain form
18359 -7072 56010 -42839 -4460 -52467 81573 -34475 -229380 24631 -12236 -53326 358893 -141202
18346 -28878 -288836 -7249 167201 -76074 -209844 -148939 149848 -249383 -155531 -32491 57142
18334 -61766 186126 -132551 65127 -97344 61464 254969 -154033 34831 -10266 -35302 -40669
18323 -40669 81608 -253562 -98377 10264 -23017 195801 -84239 59676 39647 44686 -326031
18311 -53495 -38880 267148 -23108 -241247 -7837 -215550 -96807 110062 -20905 -192720 -150289
18300 -150289 -214151 33445 -187600 -30581 -32507 258564 -106607 139895 -178540 114976
18289 141905 105171 -26699 -15974 17185 -98797 -152017 -161465 51074 47911 -114114 -397394
18278 -397394 -76333 -295431 27986 114307 58330 -12315 130101 147483 136225 -498 105374
$$ packed form
18359g072E6010d2839d460m8007H1573c4475j94905B4631a2236m1090C58893a41202
18346b8878k59958g249A67201g6074j33770O0905A49848b49383R3852c2491E7142
18334f1766A86126a32551F5127i7344F1464J93505a54033C4831a0266k5036n367
18323d0669H1608b53562i8377A0264b3017A95801h4239E9676k0029N039c26031
18311e3495J4615B67148b3108k18139g837k07713i6807A10062b0905j71815M2431
18300a50289o3862C3445a87600c0581j926B58564a06607A39895a78540A14976
18289A41905l6734b6699J0725A7185i8797n3220r448E1074l163a14114k83280
18278c97394g6333k19098B7986Q6321n5977a2315A30101J7382j1258d98A05374
$$ plain form
18266 49303 -101608 -145377 -191662 201943 139233 306744 2481 123484 -82196 118668 -95304
18254 -7495 -69830 406618 -145950 -71104 -47142 -181177 -89689 -206040 -302100 87940 -88134
18242 -18337 -272426 -49342 41199 396248 171422 69637 -207561 13064 -82122 -20695 -239444
18231 -239444 165882 47858 -3662 147464 91556 -192952 -23270 139270 172674 -187551 199981
18219 48184 -102249 -302802 -38898 -83019 -195363 -290302 -340132 130555 -334646 -142521
18208 216884 75831 127422 185526 -58752 14646 291181 98862 -76236 85299 -38468 185226
18196 -280583 126609 -353217 139487 4099 215505 87827 29816 -47620 61798 18119 -49898
18184 -67305 54231 -9695 126573 238462 -31862 -177684 -168991 -132458 -88845 -93087 -65505 -215811
$$ packed form
18266D9303a01608m3769m6285B01943o2710J67511B481J21003h2196A18668i5304
18254g495o2335D06618a45950g1104K3962j34035h9689j16351r6060H7940h8134
18242a8337k54089d9342D1199L55049A71422F9637b07561A3064h2122b0695k18749
18231b39444A65882D7858c662A47464n5908a92952b3270A39270L3404a87551A99981
18219D8184a02249k00553c8898m4121j12344r4939m9830A30555c34646a42521
18208B16884G5831N1591N8104e8752A4646K76535I8862g6236H5299c8468A85226
18196b80583A26609c53217A39487D099K11406H7827B9816d7620F1798A8119d9898
18184f7305E4231i695A26573J11889c1862j45822Q693L6533M3613m242K7582j50306
$$ plain form
18172 -215811 -166578 107838 64618 85357 -29087 -481532 71341 -102580 -10017 -17772 -189588
18161 -189588 -327362 -274079 -259522 -12649 8711 -66042 -79489 -11114 -18199 -110724 -96849 279490
18148 58820 -151100 -104360 78671 -22166 -366655 198136 140229 -318317 -297809 -25007 120196
18136 363068 -145603 -120788 -352082 -66810 -288375 -224078 127581 26496 -19289 -119765
18126 -119765 -127722 -280674 -69912 59067 93816 -47117 -342282 -75703 174948 223783 -147182
18114 302919 -280772 -238211 -253178 -183062 1482 -34060 -16823 -53929 136284 -3202 52216
18102 125335 -57008 -368295 -199239 172332 -12961 8860 -51230 24568 329135 -141372 -28192
18090 -69469 221397 37705 271153 75175 -20080 11737 73452 -284830 -208125 185600 268994
$$ packed form
18172b15811M9233A07838m3220K0739b9087m52445G1341a02580a0017p755j71816
18161a89588j37774N3283J4557a2649H711f6042j3447a1114p085r2525J3875B79490
18148E8820a51100M6740G8671b2166l44489A98136n7907c18317K0508b5007A20196
18136C63068a45603K4815k31294f6810k21565O4297A27581B6496a9289j00476
18126a19765p957j52952f9912E9067L4749d7117k95165g5703A74948M8835a47182
18114C02919b80772M2561j4967P0116A482c4060a6823l7106A36284c202E2216
18102A25335e7008l11287J69056A72332a2961H860e1230B4568L04567a41372b8192
18090f9469B21397C7705K33448G5175b0080A1737O1715b84830P6705A85600Q3394
$$ plain form
18079 268994 -225395 67594 53108 -290580 47138 273824 -6906 -267986 -42728 115081 -41545
18067 -219197 84032 11756 -531853 -46489 -95748 67167 -123749 -119805 -37216 36595 -274921
18055 -17342 214684 -61042 -87051 165844 -52873 -177702 347875 81606 406086 -153442
18044 -66347 -132091 -175800 -43950 215617 154125 -390546 -89055 -16777 161093 -195196 -27667
18032 -82877 -138610 -311327 37054 123795 54033 159560 -310550 -245516 -78462 -146774 156907
18020 450252 125586 434900 -174231 -63258 -141254 236190 -241265 30133 181802 329377
18010 329377 2812 -139177 299425 271549 -218012 -129183 -139728 42649 136056 -383861 290475
17998 -281448 64591 -144162 -189948 100106 -38338 -168055 156779 -204889 95799 -176166
$$ packed form
18079B68994b25395F7594j4486b90580D7138K26686f906k61080d2728A15081d1545
18067b19197H4032A1756e31853d6489m9259F7167a23749L944c7216C6595b74921
18055a7342B14684f1042k6009A65844e2873j24829C47875H1606L24480a53442
18044f6347o5744m3709d3950B15617o1492c90546h9055a6777A61093a95196b7667
18032h2877n5733j72717C7054Q6741E4033J05527c10550O5034g8462o8312A56907
18020D50252A25586L09314a74231f3258p7996B36190b41265C0133J51669J47575
18010C29377B812a39177B99425k7876b18012Q8829j0545D2649R3407c83861B90475
17998b81448F4591a44162m5786A00106c8338j29717A56779b04889I5799a76166
$$ plain form
17987 49521 -54320 -248315 -181191 -189132 151509 -142112 -149289 -49625 -47366 -480276 86190
17975 -23026 98974 -21207 56324 -213335 -91986 -101600 154527 487367 109653 97013 6713
17963 -1049 48477 117309 -84182 -153017 -189004 170242 93358 -365517 93821 -15447 -175324
17952 -175324 -394549 -39051 246321 -46208 51581 -181306 -296498 45946 -77651 -174196 46845
17940 -184077 257349 20998 -268544 44751 52975 -60981 -162590 73992 167182 -372645 -312506
17929 -312506 -106007 327635 -49928 -38099 -144650 118051 -384690 -21518 1228 -65822 155126
17917 87513 6050 225020 -26018 -239077 118653 114383 -64126 47716 221588 -19181 -184972
17906 -184972 62609 -90917 -66999 191822 169326 124960 -132525 159840 -17270 269364 13060
$$ packed form
17987D9521e4320j93995O7124p941A51509a42112p177d9625K259m32910H6190
17975b3026I8974b1207E6324b13335i1986r614A54527L32840A09653j2640F713
17963a049D8477O8832h4182o8835l5987A70242p6884c65517I3821a5447j59877
17952a75324k19225c9051B46321d6208E1581a81306j15192D5946g7651r6545D6845
17940a84077B57349B0998b68544D4751Q224f0981j01609G3992R3190c72645O0139
17929c12506a06007C27635d9928J1829j06551A18051c84690b1518A228f5822A55126
17917H7513F050K18970b6018k13059A18653m270f4126D7716J73872a9181j65791
17906a84972F2609i0917K3918A91822k2496m4366a32525A59840a7270B69364A3060
$$ plain form
17894 -6772 201930 -97535 82865 -240588 -115938 -4877 315362 268118 169877 -260422 -162393
17883 -162393 41605 -31085 -36190 231203 158623 72633 -228138 -75497 230460 79066 317695
17872 317695 570478 32786 284041 37271 -7742 -56816 -38928 -349866 -296657 106711 -220128
17860 132513 90838 269800 28119 -383953 -323689 168637 1636 -278229 -160054 -91493 178058
17848 3691 206591 -78589 -7527 97970 -113513 240555 80306 69771 -7532 190627 87889
17836 160574 -20320 -34758 223883 109940 -260112 231694 62610 89224 226710 108102
17825 -51097 281378 -252998 -4387 -7532 201192 -1844 -152996 -153420 22226 119476 178548 -110234
17812 -171009 -225688 -1375 -54588 42013 -417588 -51800 209448 -50528 96027 -41801 22225
$$ packed form
17894f772B01930i7535H2865b40588a15938d877C15362m7244r8241b60422R8029
17883a62393D1605c1085n105B31203p2580G2633b28138g5497B30460G9066K38629
17872C17695K52783C2786K51255C7271g742m9074J7888l10938N3209A06711b20128
17860A32513m1675J78962B8119c83953O0264A68637A636b78229J18175O8561A78058
17848C691K02900g8589g527I7970a13513B40555H0306j0535g532A90627H7889
17836A60574b0320j4438B23883A09940b60112B31694F2610K6614J37486A08102
17825e1097B81378b52998d387l145B01192a844j51152m24B2226R7250N9072a10234
17812a71009n4679a375n3213D2013d17588e1800B09448e0528I6027d1801B2225
$$ plain form
17800 -102883 29822 131960 -79278 -210668 -128255 -99134 -36888 168186 164005 -104321 -48626
17788 -42109 203798 -136076 153126 178409 -130073 -96860 -382923 -327022 61841 69178 -45030
17776 -133799 48906 21844 -36490 -233013 21002 96763 33187 99044 13622 63068 119027
17765 119027 -145080 -3262 297316 -43006 -109056 60538 127733 74759 53398 -54822 -129994
17754 -129994 11255 -181199 149152 118504 73422 -115530 108461 105311 255123 -133870
17743 -186267 -31397 156368 180134 -90542 194615 -174082 354499 -97066 -193619 67547 -239696
17731 -509471 140900 33878 5228 21249 -16517 73566 40072 -252102 -122689 37547 192527
17720 192527 252541 -173121 30850 -125921 43574 210625 -76287 -151162 -47455 185650 -40901
$$ packed form
17800a02883B9822J02138g9278j31390Q2413K9121c6888A68186m181a04321d8626
17788d2109B03798a36076A53126K5283a30073L3213k86063N5901F1841P337d5030
17776a33799D8906B1844c6490j96523B1002P5761C3187O5857A3622M9446N5959
17765A19027a45080c262B97316d3006o6050F0538O7195n2974k1361e4822p5172
17754a29994A1255a81199A49152l0648m5082a15530A08461l150J49812a33870
17743a86267c1397A56368K3766i0542A94615a74082C54499i7066r6553F7547b39696
17731e09471A40900C3878E228J6021a6517G3566l3494b52102a22689C7547J54980
17720A92527O0014a73121C0850a25921D3574J67051g6287p4875d7455A85650d0901
$$ plain form
17708 -104075 -93141 -200908 -131015 137959 9839 349485 90572 -109001 -19798 113082 -113245
17696 107033 -124110 -296081 47807 -121633 -18491 -17131 210121 -157386 -57600 -114809 11494
17684 102720 285191 -137534 -14095 -52596 -41486 -33725 217065 -15181 87539 54193 -54722
17672 -236130 -43879 295503 16697 167577 -48860 -67016 -192090 430449 159877 -270921
17661 289718 280925 50425 44864 -82390 79581 69292 -46710 238221 146052 -37365 162822
17649 -86349 40997 93249 78427 -779 -118250 127018 118124 183820 -161080 -117269 -79876 -264081
17637 -264081 -131050 997 39203 89786 108489 188088 273740 -48939 54741 -59304 -253122
17626 -253122 101159 -304358 -5223 25767 -112818 380984 298351 -334621 -233000 -280799
$$ packed form
17708a04075J0934j07767O9893A37959I839L39646I0572a09001a9798A13082a13245
17696A07033a24110j71971D7807a21633a8491J360B10121a57386e7600n7209A1494
17684A02720J82471a37534a4095l8501J1110P761B17065a5181H7539l3346e4722
17672b36130d3879B95503A6697J50880d8860j8156j25074D30449A59877b70921
17661B89718q793E0425n561h2390G9581j0289d6710B38221r2169c7365A62822
17649h6349D0997N2252j4822g79j17471A27018q894O5696a61080M3811L7393j84205
17637b64081a31050I97L8206N0583J8703P9599Q5652d8939E4741e9304j93818
17626b53122A01159c04358e223B5767a12818C80984q2633c34621J01621m7799
$$ plain form
17616 -280799 -316942 -75217 123061 389527 306070 262075 155267 -32288 99286 336169 -35764
17604 62912 53642 -142646 -97683 134220 -108711 183964 165822 179216 -162693 -274720 -11493
17592 142132 16213 47358 -25658 -237214 86627 153830 -8944 -174940 -190148 80553 3914
17580 96028 -182131 -149903 247287 82351 279876 -231291 26637 4863 49729 155720 -44553
17568 -101424 299276 -9033 93726 373969 310801 -9501 59932 114183 149105 189656 42700
17556 -63153 -114702 291038 282077 -15668 304977 131501 12347 107817 -34115 95564 -109696
17544 49175 180673 -250945 -225395 -92723 35018 -29310 271748 189284 343839 -7238 196648
17532 -137108 -8078 191500 -72303 268898 381315 33122 -162760 197068 102576 -149720
$$ packed form
17616b80799l6143g5217A23061K66466q3457m3995j06808c2288I9286K36883c5764
17604F2912r270a42646M4963A34220a08711A83964j8142J3394a62693j12027a1493
17592A42132A6213L1145b5658k11556H6627O7203h944j65996j5208H0553C914
17580I6028a82131L2228B47287H2351J97525b31291B6637D863M4866J05991d4553
17568a01424B99276i033I3726K80243o3168i501E9932N4251L4922M0551D2700
17556f3153n1549B91038q961a5668C04977A31501A2347R5470c4115I5564a09696
17544D9175J31498b50945K5550i2723C5018b9310B71748q2464J54555g238A96648
17532a37108h078A91500g2303B68898J12417C3122a62760A97068r4492a49720
$$ plain form
17521 -96136 -62400 187459 71671 -188802 9813 -22349 -52730 -205393 61329 24353 -111946
17509 -50253 117934 257315 140740 36552 -109042 225383 296746 -121040 10215 82742
17499 82742 351920 150124 -74161 106397 -158098 30245 320107 193690 52669 -51301
17488 45242 101661 53168 147533 142844 -166077 213058 -50103 -172000 324156 49333 181329
17477 181329 237254 -38913 -72882 -10330 281311 125005 282006 16626 -56202 243615 -52696
17465 309787 99271 105371 20690 144593 -39982 40019 -200017 -140362 74318 103569 329340
17454 329340 180709 568765 16722 -225400 -49325 -32065 270365 41893 -196319 468279
17443 30534 344673 -36367 -89689 153957 313284 -268126 -154110 213790 215726 198970 -59582
$$ packed form
17521i6136L3736A87459G1671a88802I813b2349l0381j52663F1329B4353a11946
17509e0253A17934J39381j16575C6552a09042B25383P1363a21040A0215P2527
17499H2742K69178A50124g4161A06397a58098C0245K89862j26417E2669e1301
17488D5242N6419m8493R4365m689a66077B13058e0103j21897C24156D9333J31996
17477A81329N5925c8913l3969a0330B81311A25005J57001A6626e6202B43615e2696
17465C09787I9271O100B0690J23903c9982D0019b00017N9655G4318K9251K25771
17454C29340j48631L88056A6722b25400d9325J7260B70365D1893a96319D68279
17443C0534L14139c6367n3322A53957J59327b68126J14016B13790J936j6756e9582
$$ plain form
17431 402753 489804 102509 368465 195319 226709 73700 323076 339797 143018 34129
17420 128984 168255 64446 77384 510096 85263 75600 366772 365739 279513 290704 376274
17409 376274 207640 -40751 45688 167246 121031 474258 89513 188623 351873 305341 489645
17398 489645 283718 76482 37082 196614 132387 26169 64219 269779 -115807 256857
17387 -149928 166057 208023 215220 182146 -14259 -70378 80080 353000 169287 79962 174460
17376 174460 155225 473210 158478 218609 -54928 209643 265583 215529 -124899 257182
17365 31170 189232 348884 -90562 64635 258787 -80874 19080 182159 303901 -186775
17354 552900 50335 239624 389870 397402 50465 404387 260712 282300 38646 273487 445140
$$ packed form
17431D02753Q7051A02509K65956j73146L1390G3700K49376J6721A43018C4129
17420A28984L9271F4446J2938M32712H5263r663K91172j033q6226J1191Q5570
17409C76274j68634d0751D5688J21558m6215L53227H9513R9110J63250m6532J84304
17398D89645k05927G6482C7082J59532o4227B6169L8050K05560a15807B56857
17387a49928A66057M1966P197l3074a4259n6119H0080K72920A69287G9962R4498
17376A74460j9235L17985A58478O0131e4928B09643N5940n0054a24899B57182
17365C1170J58062J59652i0562F4635J94152h0874A9080J63079J21742a86775
17354E52900E0335J89289J50246P532E0465L53922j43675K1588C8646K34841J71653
$$ plain form
17343 445140 7887 145554 367007 -2105 125785 161299 -263119 140849 -68497 -240164 -160260
17332 -160260 308189 205492 -33424 129550 169685 -75448 443252 93021 -147916 384508
17321 141141 161728 58140 62561 156051 110856 8279 215397 86610 203447 287623 103432
17309 -87063 177130 -211033 203686 -25780 67955 359770 124660 147576 271264 193884
17299 193884 282906 220885 102674 47215 19249 -1699 -170153 183654 383626 43575 18990
17287 18233 -253498 93892 311442 142087 -33557 65218 -60034 96616 -111544 62684 304192
17276 304192 261893 23196 86382 31934 56204 330407 -11638 57033 30757 295887 355563
17265 355563 397049 -23324 256650 -36244 264167 -2896 117311 -184526 58583 48947 83674
$$ packed form
17343D45140G887J37667K21453b105A25785L5514b63119A40849f8497j71667P9904
17332a60260C08189j02697c3424A29550M0135g5448D43252I3021a47916C84508
17321A41141K0587E8140M421R3490m5195H279K07118H6610J16837Q4176A03432
17309h7063A77130b11033B03686b5780F7955K91815A24660K2916J23688p7380
17299A93884Q9022o2021A02674D7215A9249a699j68454A83654J99972D3575A8990
17287A8233b53498I3892K17550A42087c3557F5218f0034I6616a11544F2684K41508
17276C04192m2299B3196O3186C1934K4270K74203a1638E7033k6276K65130N9676
17265C55563M1486b3324B56650c6244B64167b896A17311a84526E8583r636L4727
$$ plain form
17254 83674 -59388 -11961 127705 218077 115301 101757 365832 339648 217084 92252 -181033
17242 288032 250966 -121245 132214 190566 261859 432152 -84074 112291 345905 284973
17232 284973 255062 463437 92955 220790 -63679 207273 294684 192044 -184245 198196
17221 418711 541369 394368 148827 299494 137788 174245 3235 43409 157605 205642
17211 205642 124168 419922 127362 496244 447139 145689 147235 423252 352117 301746 282626
17200 282626 -130429 122537 -124628 245340 91108 152680 422341 306096 390169 189624
17189 147679 383099 67 344940 42103 268078 -12546 64633 -21108 67045 214997 459331
17178 459331 204187 145689 87930 261984 229885 -42286 441153 400308 368675 391813 140809
$$ packed form
17254H3674e9388a1961A27705R0372j02776j3544K64075k6184j22564I2252a81033
17242B88032l7066a21245A32214N8352P1293J70293h4074A12291K33614o0932
17232B84973k9911K08375I2955J27835f3679B07273Q7411j02640a84245A98196
17221D18711J22658j47001A48827J50667A37788L6457C235M0174J14196M8037
17211B05642q1474K95754A27362L68882m9105A45689J546K76017p1135n0371j9120
17200B82626a30429A22537a24628B45340I1108O1572K69661j16245Q4073A89624
17189A47679K35420F7L44873D2103K25975a2546F4633b1108F7045J47952K44334
17178D59331B04187n8498n7759J74054l2099d2286D41153m0845l1633K3138A40809
$$ plain form
17166 415290 330147 324569 109271 -76464 141490 464173 257647 270097 402358 278023
17156 278023 200090 309869 528070 286190 243638 182650 335357 479407 385832 439563
17146 439563 299201 140441 527072 176789 238390 810815 512218 285075 204584 193818
17136 193818 526089 217701 228113 436124 354910 412394 34911 253604 243484 159865 103575
17125 103575 292145 265477 211285 453902 366113 563787 274646 161966 142682 128567
17115 128567 73023 260713 430702 188597 -169192 293192 478691 513830 434389 187422
17104 170672 203414 234098 278321 402351 363541 374839 504105 322359 677356 248908
17093 378566 172905 309002 423325 430242 281446 326172 503193 388938 313365 283615
$$ packed form
17166D15290q5143n578A09271g6464A41490L22683k06526J2450J32261j24335
17156B78023p7933J09779K18201k41880m2552o0988J52707J44050r3575N3731
17146D39563j40362A40441L86631A76789O1601N72425k98597k27143q0491j0766
17136A93818L32271B17701J0412K08011q1214N7484C4911K18693j0120q3619n6290
17125A03575J88570k6668n4192K42617q7789J97674B74646j12680j9284j4115
17115A28567n5544J87690J69989A88597a69192B93192J85499L5139p9441A87422
17104A70672L2742L0684M4223J24030l8810J1298J29266j81746L54997B48908
17093C78566A72905J36097J14323O917j48796M4726J77021j14255p5573k9750
$$ plain form
17083 283615 295030 536353 369938 55741 651303 521642 492935 162958 329463 540741
17073 540741 311044 571222 382174 330454 567589 434350 147725 81065 337342 467010
17063 467010 312883 494085 474302 542658 453926 748857 387222 482911 422456 438962 621151
17052 621151 195411 540106 538751 508161 825625 537200 425435 429481 367118 428078 494576
17041 494576 467138 500531 350110 469381 714932 755059 77592 362779 481080 730874
17031 730874 806507 412009 142992 696450 267680 524790 421863 501555 460315 352918
17021 352918 920225 522158 325786 724942 530924 441509 519147 692486 1043772 571102
17011 571102 487046 476625 514367 866212 440296 502178 999280 469646 659040 797201
$$ packed form
17083B83615J1415K41323j66415E5741N95562j29661k8707A62958J66505K11278
17073E40741k29697K60178j89048n1720K37135j33239A47725o6660K56277J29668
17063D67010j54127J81202j9783O8356q8732K94931l61635R5689o0455J6506J82189
17052F21151A95411L44695j355l0590L17464k88425j11765M046o2363O0960O6498
17041D94576k7438L3393j50421J19271K45551M0127G7592K85187J18301K49794
17031G30874P5633l94498A42992N53458B67680K57110j02927P9692m1240j07397
17021C52918N67307l98067j96372L99156j94018q9415P7638J73339L51286m72670
17011E71102q4056j0421L7742L51845m25916O1882M97102D69646J89394J38161
$$ plain form
17001 797201 766143 292750 755259 810721 563810 886538 794940 1116413 736209 545854
16991 545854 1117995 905060 714836 818496 545897 685710 582929 568768 508993 479957
16981 479957 427667 621995 831549 849502 906747 803728 469511 742783 1006655 954468
16971 954468 767362 920036 828709 957992 942482 738996 779056 549562 876818 1189470
16961 1189470 877864 927554 837307 942820 846758 798142 771844 868059 996578 830495
16951 830495 1005013 1013589 1239203 1138457 1031797 1122524 948209 979017 1113666 902810
16941 902810 971980 818027 666555 822578 1109852 1212038 1556563 1071052 1012480 1176387
16931 1176387 1018740 889405 984787 1131802 1149229 964951 1220050 1183031 1352580 989073
$$ packed form
17001G97201l1058B92750M62509N5462k46911L22728r1598L21473l80204j90355
16991E45854N72141k12935j90224J03660k72599J39813j02781j4161n9775k9036
16981D79957n2290J94328K09554J7953N7245j03019l34217K73272K63872n2187
16971I54468j87106J52674r1327J29283j5510k03486M0060k29494L27256L12652
16961A189470l11606M9690r0247J05513r6062m8616k6298R6215J28519j66083
16951H30495J74518Q576K25614j00746j06660R0727j74315L0808J34649k10856
16941I02810O9170j53953j51472J56023K87274J02186L44525m85511n8572J63907
16931A176387j57647j29335R5382J47015J7427j84278K55099l7019J69549l63507
$$ plain form
16921 989073 917448 1274866 1424231 1164697 1398339 1173501 1282679 1322089 1422187 1401930
16911 1401930 1620382 1336767 1174689 1323702 1471824 1404586 1317040 1647639 1125855 1374359
16901 1374359 1640096 1309355 1310300 1428151 1344662 1423852 1672937 1645304 1354569 1859213
16891 1859213 2131941 1572009 1398158 1682315 1855731 1328419 1740587 1688219 1999725 1998913
16881 1998913 1602125 2031116 1703721 2152899 1631963 1862273 1814073 1766400 1991982 1860625
16871 1860625 2065682 2060468 2276651 2010377 1847542 2386766 1879184 2452995 1962240 2458370
16861 2458370 2176247 2614308 2353715 2594956 2655651 2358609 2724830 2484533 2633516 2384001
16851 2384001 2731693 2925238 2885171 2744481 2627576 2769334 2631605 3030606 2722443 2906274
$$ packed form
16921I89073p1625L57418J49365k59534K33642k24838J09178L9410J00098k0257
16911A401930K18452k83615j62078J49013J48122o7238q7546L30599n21784K48504
16901A374359K65737l30741R45J17851q3489P9190K49085k7633k90735N04644
16891A859213K72728n59932j73851K84157J73416n27312M12168n2368L11506q12
16881A998913l96788M28991l27395M49178n20936K30310m8200m7673K25582j31357
16871A860625K05057n214K16183k66274j62835N39224n07582N73811m90755M96130
16861B458370k82123M38061k60593K41241O0695k97042L66221k40297J48983k49515
16851B384001L47692J93545m0067j40690j16905J41758j37729L99001l08163J83831
$$ plain form
16841 2906274 3158092 3092832 2794166 3423748 3088419 3151728 3370315 2969129 3196798 3441652
16831 3441652 3492628 3335070 3328983 3445427 3779150 3581047 4106785 3710259 3926738 4151987
16821 4151987 4282293 4391850 4450806 4366351 4254387 4612534 4354445 4736727 4674436 4693712
16811 4693712 4606315 5299804 5466521 5100066 5362395 5194108 5265055 5380016 5778228 5733573
16801 5733573 5762518 5961420 6151299 6351872 6245218 6117405 6712578 6861101 7166083 7330880
16791 7330880 7511489 7452072 7627882 7470074 7873463 7649667 8369770 8623983 8686650 9126649
16781 9126649 9365944 9098879 9657081 9778346 10440745 10356695 10739074 11141241 11305382 11614159
16771 11614159 11878077 12514449 12520303 13074298 13691158 13637956 13983397 14827715 15269525 15572033
$$ packed form
16841B906274K51818o5260k98666O29582l35329O3309K18587m01186K27669K44854
16831C441652N0976j57558o087J16444L33723j98103N25738l96526K16479K25249
16821D151987J30306J09557N8956q4455j11964L58147k58089L82282o2291J9276
16811D693712q7397O93489J66717l66455K62329j68287P0947J14961L98212m4655
16801E733573K8945J98902J89879K00573j06654j27813N95173J48523L04982J64797
16791G330880J80609n9417J75810j57808M03389k23796P20103K54213O2667M39999
16781I126649K39295k67065N58202J21265O62399q4050L82379M02167J64141L08777
16771A1614159K63918O36372N854N53995O16860n3202L45441Q44318M41810L02508
$$ plain form
16761 15572033 16506048 16973411 17465988 17793276 18437604 19295197 19916957 20328215 21402470
16752 21402470 22260261 23024332 23754552 24482113 25775518 26848174 28068947 28953898 30405577
16743 30405577 31928086 33137775 34786923 36296428 38044349 40065138 41669202 43546533
16735 43546533 46293705 48180875 50594849 53565485 56511463 59330946 62908570 66099654
16727 66099654 69705976 73759593 77804515 82206226 86623688 91738809 97111982 102356360
16719 102356360 107754808 113312749 119066490 124920775 130888794 137042594 142973125 148085203
16711 148085203 153060172 157737637 162032640 165265502 167923184 169514847 170504731 170145324
16703 170145324 169259153 167294566 164013098 160733758 156404004 151408482 146482799 140383767
$$ packed form
16761A5572033R34015M67363M92577L27288O44328Q57593O21760M11258J074255
16752B1402470Q57791P64071P30220P27561J293405J072656J220773Q84951J451679
16743C0405577J522509J209689J649148J509505J747921K020789J604064J877331
16735D3546533K747172J887170K413974K970636K945978K819483L577624L191084
16727F6099654L606322M053617M044922M401711M417462N115121N373173N244378
16719A02356360N398448N557941N753741N854285N968019O153800N930531N112078
16711A48085203M974969M677465M295003L232862K657682J591663R89884l59407
16703A70145324q86171j964587l281468l279340m329754m995522m925683o099032
$$ plain form
16695 140383767 134584474 128721400 122596355 116897806 111067102 105577229 99931989 94720756
16687 94720756 89458127 84513254 80108633 75725085 71530984 67819933 64143185 60736113
16679 60736113 57748772 54405056 51602570 49327632 46892415 44047945 42305052 39946432
16671 39946432 38296282 36556877 34844530 33218250 31739693 30385902 28954247 27642084
16663 27642084 26756712 25734234 24443642 23472969 22680950 21379386 20775970 20156512 19525540
16654 19525540 18742046 17857789 17309570 16992983 16305987 15767816 15359686 14637841 14096064
16645 14096064 13729564 13165161 12986180 12626560 12089523 11666176 11186628 11114023 10884040
16636 10884040 10289080 10042217 9724813 9694765 9326011 9515848 9073353 8838575 8581836
$$ packed form
16695A40383767n799293n863074o125045n698549n830704n489873n645240n211233
16687I4720756n262629m944873m404621m383548m194101l711051l676748l407072
16679F0736113k987341l343716k802486k274938k435217k844470j742893k358620
16671C9946432j650150j739405j712347j626280j478557j353791j431655j312163
16663B7642084q85372j022478j290592r70673p92019j301564o03416o19458o30972
16654A9525540p83494q84257n48219l16587o86996n38171m08130p21845n41777
16645A4096064l66500n64403j78981l59620n37037m23347m79548p2605k29983
16636A0884040n94960k46863l17404l0048l68754J89837m42495k34778k56739
$$ plain form
16627 8581836 8059823 8066655 7857633 7612393 7125620 7218055 6958021 6894945 6683646 6712449
16617 6712449 6124251 6334595 6116526 5978392 5818245 5694590 5615379 5613172 5539576 5254219
16607 5254219 4968839 5142201 5066205 4648434 4977653 4373074 4776162 4413550 4039362 4758098
16597 4758098 4478408 4137008 4592920 3850081 4349307 3786261 3816762 3663779 3536004 3635943
16587 3635943 3686328 3645627 3416035 3196654 3410379 3118229 3402837 3246702 2707876 2991014
16577 2991014 2703840 3359836 3075493 2791099 2479312 2909453 2634155 2486163 2892251
16568 2892251 2501462 2802458 2622189 2890595 2249255 2409083 2245505 2263275 2313449 2137381
16558 2137381 2329931 2126786 2176730 2111776 2510165 1903123 2109433 1818053 1980188 2328356
$$ packed form
16627H581836n22013O832k09022k45240m86773R2435k60034o3076k11299K8803
16617F712449n88198K10344k18069j38134j60147j23655p9211k207p3596k85357
16607E254219k85380J73362p5996m17771L29219o04579M03088l62612l74188P18736
16597D758098k79690l41400M55912p42839M99226n63046L0501j52983j27775R9939
16587C635943N0385m0701k29592k19381K13725k92150K84608j56135n38826K83138
16577B991014k87174O55996k84343k84394l11787M30141k75298j47992M06088
16568B892251l90789L00996j80269K68406o41340J59828j63578J7770N0174j76068
16558B137381J92550k03145M9944o4954L98389o07042K06310k91380J62135L48168
$$ plain form
16548 2328356 1883076 2084152 1970476 1882664 1831901 2150890 1788233 1638133 1546411 1906821
16538 1906821 1825832 1594516 1458973 1680968 1599199 1483879 1430845 1649669 1683674 1612966
16528 1612966 1291285 1636399 1514982 1490837 1559128 1457748 1079678 1207543 950902 1122630
16518 1122630 1406679 899459 1487613 975024 1267727 1371600 1250921 1349968 1152321 1352026
16508 1352026 1217893 1165841 1057367 1209094 999836 869586 1046470 933545 1165681 695529
16498 695529 1245433 1145386 631163 1195083 1029757 854663 724826 956326 1377363 806383
16488 806383 1014784 1097302 761427 949201 982244 740729 679466 716369 880438 746586
16478 746586 670559 864310 820247 1025693 835873 447246 861409 851434 872850 786900 783588
$$ packed form
16548B328356m45280K01076j13676q7812n0763L18989l62657j50100r1722L60410
16538A906821q0989k31316j35543K21995q1769j15320n3034K18824L4005p0708
16528A612966l21681L45114j21417k4145O8291j01380l78070J27865k56641J71728
16518A122630K84049n07220N88154n12589K92703J03873j20679R9047j97647J99705
16508A352026j34133n2052j08474J51727k09258j30250J76884j12925K32136m70152
16498F95529N49904j00047n14223N63920j65326j75094j29837K31500M21037n70980
16488H06383K08401Q2518l35875J87774L3043k41515o1263L6903J64069j33852
16478G46586p6027J93751m4063K05446j89820l88627M14163r975K1416q5950l312
$$ plain form
16467 783588 730700 821058 680539 587161 946140 793046 839008 714694 470168 813810
16457 813810 696980 680217 594133 674447 696896 571096 621150 505876 621226 628461 732442
16446 732442 705345 595624 572365 263583 635573 537972 552406 358271 545488 1235575
16436 1235575 627274 789728 424045 445906 450418 751708 623090 805468 694304 404168
16426 404168 398218 659098 376477 685271 437850 408023 480482 350168 531212 456837
16416 456837 505541 449285 130680 422779 473996 432445 175338 425037 461503 255818
16406 255818 408466 569191 480897 554977 312522 401425 349313 419495 615042 261508
16395 414744 516793 281690 467259 721572 636235 285986 497567 244987 385389 316088
$$ packed form
16467G83588n2888R0358j40519r3378L58979j53094M5962j24314k44526L43642
16457H13810j16830j6763q6084Q0314K2449j25800N0054j15274J15350P235J03981
16446G32442k7097j09721k3259B63583L71990r7601J4434j94135J87217O90087
16436A235575o08301J62454l65683K1861M512L01290j28618J82378j11164k90136
16426D04168n950K60880k82621L08794k47421k9827P2459j30314J81044p4375
16416D56837M8704n6256A30680K92099N1217m1551A75338K49699L6466k05685
16406B55818J52648J60725q8294P4080k42455Q8903n2112P0182J95547B61508
16395D14744J02049k35103J85569K54313q5337B85986K11581B44987J40402o9301
$$ plain form
16385 316088 484462 411622 196293 78575 263437 599922 571171 642470 346685 370650
16375 370650 289616 546627 478246 161473 325343 291060 286793 262258 146313 484960 343940
16364 343940 316645 301293 288810 302164 308893 193091 270116 493809 259549 284304 366453
16353 366453 142216 782624 39111 300558 334342 243085 -98797 334193 90271 455764
16343 455764 375041 135993 337064 73782 188376 -8821 138869 291155 489938 67005
16332 351540 331557 195150 190895 430222 187212 251372 38342 399481 145384 48278 -61185
16320 339646 38948 -50518 45400 147981 214163 440484 204373 87334 118087 56967 174380
16309 174380 640973 393291 173815 412348 310942 503278 256244 569533 234662 173264
$$ packed form
16385C16088J68374p2840A96293G8575J84862L36485k8751P1299k95785K3965
16375C70650q1034K57011o8381A61473J63870l4283m267k4535j15945L38647j41020
16364C43940k7295j5352j2483J3354O729j15802P7025K23693k34260K4755Q2149
16353C66453A42216O40408C9111K61447L3784r1257i8797C34193I0271L65493
16343D55764q0723A35993K01071G3782J14594h821A38869J52286J98783F7005
16332C51540j9983j36407m255K39327A87212O4160C8342L61139A45384D8278f1185
16320C39646C8948e0518D5400J02581O6182K26321B04373H7334L0753E6967J17413
16309A74380M66593k47682A73815K38533j01406J92336k47034L13289B34662o1398
$$ plain form
16299 173264 453026 223238 346742 120745 186763 438211 187987 127894 200807 136720
16289 136720 238463 7820 9608 980 194063 -21901 158897 57293 123901 227914 -96044
16277 244780 134929 113988 -2664 9807 478556 243062 305119 65827 115150 166116 133706
16266 133706 -26004 365302 10413 143609 236785 121942 -45012 167611 58561 5661 -169779
16254 135033 308255 49013 -85822 -39084 328272 65064 167254 134721 -80273 313561 -100783
16242 40328 -19587 -164313 -145791 26192 -56693 36523 81428 40887 131119 -72489 101026
16230 99908 160421 22317 21619 12170 -41920 -62060 77515 186716 307650 210476 170612 161260
16218 161260 179278 -21723 152626 -69673 307733 289262 316737 77367 -25244 15234 393651
$$ packed form
16299A73264K79762B23238J23504A20745O6018K51448A87987o0093P2913o4087
16289A36720J01743G820J788I80J93083b1901A58897E7293O6608J04013i6044
16277B44780j09851k0941b664I807M68749k35494O2057F5827M9323N0966l2410
16266A33706b6004C65302A0413J33196R3176j14843d5012A67611E8561E661a69779
16254A35033J73222D9013h5822c9084C28272F5064J02190l2533h0273C13561a00783
16242D0328a9587j44726J8522B6192e6693C6523M4905m0541R0232g2489A01026
16230I9908O0513B2317o98r449d1920k0140G7515J09201J20934r7174l9864r352
16218A61260J8018b1723A52626f9673C07733j8471K7475G7367b5244A5234L78417
$$ plain form
16207 393651 281460 115672 89897 396568 16108 306729 -110231 67765 -152651 122594
16196 79051 257152 292237 175686 142717 22420 130492 198329 48327 112463 353 281472
16185 281472 78880 75830 -62395 116647 43242 169539 87040 -31007 -58796 -31626 -251692
16174 -251692 -40362 -157363 219668 235679 -44500 -10200 11778 -207107 -95589 90559 137447
16163 137447 54348 132590 -92714 437134 92188 211591 -309552 86383 -233841 236300
16152 370929 116532 215609 179290 -45176 -1221 77056 117834 -183876 -151587 2243 155593
16141 155593 114111 256060 -175916 273051 -150554 205113 258097 -130814 -3328 79460
16130 212952 -97072 -316083 191458 228672 47706 10831 -107605 133178 -174885 209761
$$ packed form
16207C93651j12191A15672k5775L06671A6108K90621a10231F7765a52651A22594
16196G9051J78101L5085j16551l2969B2420J08072O7837D8327O4136C53K81119
16185B81472G8880l050f2395A16647D3242J26297q2499c1007k7789K7170k20066
16174b51692d0362j17001B19668J6011d4500a0200A1778b07107i5589I0559M6888
16163A37447E4348P8242i2714D37134I2188J19403c09552H6383b33841B36300
16152C70929A16532R9077l6319d5176a221G7056M0778a83876L2289B243J53350
16141A55593m1482J41949a75916B73051a50554B05113N2984a30814c328G9460
16130B12952i7072k19011A91458L7214D7706A0831a07605A33178a74885B09761
$$ plain form
16119 140011 -211145 -131734 13980 147229 -275356 -367334 -346318 -185575 -175348 -72127 -147687
16108 -147687 -30779 229381 -107826 160918 -23092 136215 36155 358345 11351 191399
16098 191399 201422 -129847 178637 452221 301716 182441 59572 94117 -54297 -123334
16088 -123334 -84338 127770 302115 -12860 146617 -86781 281486 117359 176789 38394
16077 -399491 220578 -197281 -116859 -69946 55359 -1176 1053 425108 246713 -148149 123688
16065 29579 39124 -312254 -106472 10497 205990 -242569 -46119 147452 -59218 150724 -102925
16053 166048 121540 -193843 -254528 -173072 35328 -44504 117948 2483 94392 -36271 -118532
16042 -118532 -189717 239534 -237260 -70222 126475 34893 -11158 -192434 -59661 82071 -151580
$$ packed form
16119A40011b11145P9411A3980J33249b75356r1978K1016J60743J0227g2127p5560
16108a47687c0779B29381a07826A60918b3092A36215C6155L22190A1351J80048
16098A91399J0023a29847A78637K73584j50505j19275E9572L4545e4297o9037
16088a23334L8996A27770J74345a2860A46617h6781B81486A17359N9430C8394
16077c99491B20578a97281Q0422M6913E5359a176A053M24055j78395a48149A23688
16065B9579R545c12254a06472A0497J95493b42569d6119A47452e9218A50724a02925
16053A66048m4508a93843o0685Q1456C5328d4504A17948B483R1909c6271q2261
16042a18532p1185B39534b37260g0222A26475C4893a1158j81276e9661H2071a51580
$$ plain form
16030 -41673 -257393 189727 46858 -351859 46281 226767 24572 -161453 -264419 -301754
16020 -301754 -166234 29850 53888 -140688 -174652 424792 118482 74790 2449 256771 143177
16009 143177 78221 -462039 -9320 9913 -21514 -209 -375626 23112 -228949 151015 8350 -76991
15996 131300 80347 -168163 -310852 -112128 92800 -3370 61165 72072 -106467 91828 -291615
15984 213609 -106770 108858 189907 -127291 221906 -159287 -227183 -72824 13075 27477
15974 27477 104469 164781 113592 236995 155031 382855 204419 282846 -37273 228264 29724
15962 75259 144585 78145 100066 -77542 87616 -138808 -31774 -48155 32098 -71829 -229378
15951 -229378 -199464 -96205 -25987 20192 -21785 187489 -235516 93479 347668 -326050 9050
$$ packed form
16030d1673k15720A89727D6858c51859D6281J80486B4572a61453j02966l7335
16020c01754J35520B9850K4038a40688l3964D24792A18482m3692B449K54322j13594
16009A43177o4956d62039i320I913b1514b09l75417B3112b28949A51015H350g6991
15996A31300n0953a68163j42689a12128I2800c370F1165J0907a06467I1828b91615
15984B13609a06770A08858Q1049a27291B21906a59287o7896g2824A3075J4402
15974B7477P6992O0312n1189J23403q1964K27824j78436P8427c7273B28264B9724
15962G5259O9326o6440K1921g7542H7616a38808c1774j6381C2098g1829j57549
15951b29378K9914i6205b5987B0192b1785A87489b35516I3479K54189c26050I050
$$ plain form
15939 -301877 -182935 -146864 97168 -391256 -33085 -180171 -293232 -17603 -89613 -134039 254967
15927 -30304 -203617 99021 -62500 -150773 -22883 -41820 -94592 -18836 165721 -119562 31965
15915 -65192 43930 14035 -43416 -88100 22901 -137908 -85004 14853 -27990 -81368 -253804
15904 -253804 -121670 41451 291067 151951 -212864 -81848 -149061 1423 -421206 378558
15893 -35374 -644260 -86414 -177295 -161362 -22488 -63055 -287785 123914 10063 196701 -245751
15881 -95459 97167 42679 -83267 -21261 -309988 40551 46207 50326 -15982 114254 207008 -117176
15868 -223661 309912 100265 4455 -120519 -67546 -51778 -99764 97707 129881 -103485 -199939
15857 -199939 209855 -144369 40435 138791 -254312 322146 -190410 112061 -90287 -114528
$$ packed form
15939c01877J18942L6071I7168c91256c3085j47086j13061a7603p2010m4426B54967
15927c0304j73313I9021f2500q8273b2883j8937n2772a8836A65721a19562C1965
15915f5192D3930A4035d3416m4684B2901a37908N2904A4853b7990n3378j72436
15904b53804a21670D1451K49616j39116b12864h1848o7213A423d21206C78558
15893c5374o08886h6414r0881J5933b2488m0567k24730A23914A0063J86638b45751
15881i5459I7167D2679h3267b1261k88727D0551N656M119a5982A14254R2754a17176
15868b23661C09912A00265D455a20519N2973J5768m7986I7707L2174a03485r6454
15857a99939B09855a44369D0435R8356b54312C22146a90410A12061i0287k4241
$$ plain form
15847 -114528 -105474 48955 -12038 -155865 -48471 253865 -75375 66088 243727 122771 115856
15836 115856 -151369 -217847 -108183 -156254 300668 55966 -265302 137527 487425 -192072
15825 11012 254197 -308022 -147797 40704 24320 -59182 -48301 -221669 44881 -29146 -29608
15814 -29608 151005 -320695 -6811 289430 -111399 96002 347316 158037 63239 -23401 89539
15802 110673 60849 -78275 -72023 -227958 -63151 19131 110529 -146488 68363 70822 21918
15790 -158293 63926 -185437 129195 -71186 55218 -188943 -63915 -43241 11018 -149735 198554
15778 97144 -387644 -123643 35633 -232768 194810 -149903 -49002 -24067 61220 304451
15768 304451 -114761 -88367 128968 -201233 -62782 -92669 265941 -243954 -47443 53048
$$ packed form
15847a14528R054D8955a2038j43827d8471B53865g5375F6088J77639j20956o915
15836A15856a51369o6478a08183m8071C00668E5966b65302A37527L49898a92072
15825A1012K43185c08022a47797D0704j6384e9182J0881j73368D4881b9146m62
15814b9608A51005c20695f811B89430a11399I6002K51314A58037F3239b3401H9539
15802A10673m9824g8275O252j55935f3151A9131R1398a46488F8363K459B1918
15790a58293F3926a85437A29195g1186E5218a88943f3915K0674A1018a49735A98554
15778I7144c87644a23643C5633b32768A94810a49903d9002b4067F1220K43231
15768C04451a14761K6394A28968b01233f2782k9887B65941b43954d7443E3048
$$ plain form
15757 -126650 147482 6151 225553 -285670 -139254 -204688 415123 -213692 46175 -17040
15746 -116366 201939 -42184 352974 -358359 -213347 -161954 -81127 159511 105641 -106855
15735 230095 227843 245091 48771 264465 -144749 570475 319976 -11380 -275462 35649 20818
15724 20818 26659 94332 -163979 -117545 28637 53008 -149854 -102241 -6853 -10305 90643 -137833
15711 -176355 -58893 -199985 -84149 -13491 -109622 -65676 -1014 222234 250604 -224423 90217
15699 -344966 -131804 23303 -25465 37686 -144190 -603013 -237294 -56103 -19839 162725
15688 188219 -161667 -17873 -247301 37967 -131908 -294430 -74195 82232 131756 -206740
15677 165640 -222096 538811 -241093 160407 164760 -95861 97942 169393 -64947 -133456 94287
$$ packed form
15757a26650A47482F151K19402b85670a39254o5434D15123b13692D6175a7040
15746a16366B01939d2184C52974c58359J45012N1393Q0827A59511n3870a06855
15735B30095k252J7248D8771K15694a44749E70475k50499a1380k64082C5649j4831
15724B0818N841O7673a63979M6434B8637K4371a49854M7613f853l452I0643a37833
15711a76355e8893j41092h4149a3491r6131M3946a014B22234K8370b24423I0217
15699c44966a31804B3303b5465C7686a44190m58823b37294e6103a9839A62725
15688A88219a61667a7873k29428C7967a31908j62522g4195H2232M9524b06740
15677A65640b22096E38811b41093A60407M353i5861I7942P1451f4947o8509I4287
$$ plain form
15665 195133 128372 -344038 -111557 -127284 27596 -78501 176495 16373 10458 141901 14514
15653 213015 104737 -158649 118941 -51404 150330 -199492 497183 52025 12101 34315
15643 34315 -137950 -60652 -77949 -212441 -72605 -27912 133022 294020 1722 50077 -118805
15631 175405 219291 90063 74890 -63401 -132489 -170005 -156383 -155101 1396 -215172 15528 -99502
15618 -341937 -202548 16219 -233954 34452 382053 11210 120036 346158 -87693 -231361
15608 -231361 113827 -45842 -53860 -101616 -7540 3332 252768 -26688 60740 -187019 -12739
15596 -120846 -92534 239103 141217 -239559 -43544 -149684 -231865 -48833 123511 21839 -86585
15584 -73820 -282353 -146730 301735 -48983 -379807 -198424 224189 40054 222292 -57552
$$ packed form
15665A95133o6761c44038a11557j5727B7596g8501A76495A6373n915J31443A4514
15653B13015A04737a58649A18941e1404A50330a99492D97183E2025A2101K2214
15643C4315a37950f0652j7297j34492g2605b7912A33022J60998A722M8355a18805
15631A75405M3886I0063j5173f3401o9088l7516J3622J282A396b15172A5528i9502
15618c41937J39389A6219b33954C4452L47601A1210J08826K26122h7693j43668
15608b31361A13827d5842q018m7756g540C332K49436b6688F0740a87019a2739
15596a20846K8312B39103r7886b39559d3544j06140q2181d8833A23511B1839h6585
15584g3820k08533J35623C01735d8983l30824J81383B24189D0054J82238e7552
$$ plain form
15573 -118333 -87513 123591 124902 -49928 -88831 -470324 10664 -47613 -14107 -154156 -92691
15562 -92691 211297 -130546 -96727 -135822 -44210 65388 -228614 280575 97993 -177003 60001
15550 89215 -166604 -267710 73908 -55087 -154912 -212935 10695 70562 -64748 -89939 -18684
15538 11903 17196 -225628 73274 202351 -20394 -104715 -31195 335868 133488 168496 -8324
15526 -112704 47588 14965 143204 143181 -6045 -6970 248563 -31813 -37920 -217276 223369 123065
15514 123065 136048 -27574 266469 -281806 -80577 -147428 -183681 413617 -211717 11597 -59554
15502 -291696 -164859 51822 79521 -85426 -175724 -214671 -8080 100901 108413 -146826 80276
15490 2805 -76741 -220379 -147993 -21593 -19447 -111049 -81516 -469939 -2475 43565 18128 57967
$$ packed form
15573a18333L0820A23591J311d9928l8903l81493A0664d7613a4107j40049O1465
15562i2691B11297a30546L3819l9095d4210F5388b28614B80575I7993a77003F0001
15550H9215a66604j01106G3908e5087r9825n8023A0695N9867f4748k5191a8684
15538A1903N293b25628G3274J29077b0394q4321c1195C35868A33488L5008h324
15526a12704D7588A4965J28239k3f045r25B48563c1813o107j79356B23369j00304
15514A23065J2983b7574B66469b81806h0577o6851l6253D13617b11717A1597e9554
15502b91696J26837E1822K7699h5426r0298l8947h080A00901P512a46826H0276
15490B805g6741j43638P2386b1593K146r1602K9533l88423b475D3565A8128L9839
$$ plain form
15478 57967 -337227 -69451 -114048 -79158 13163 -1850 -131568 44561 -54508 191521 -209098
15466 134801 228627 -187680 2295 22784 217349 -310426 207868 241100 197605 -244370 -103383
15454 -328743 212253 -21862 244501 -232640 91725 196248 -184548 -197873 -18768 116517
15443 -70981 353307 86833 229186 -79752 -74538 -17282 86798 -305523 -202526 127809 56083
15431 -93548 93956 -297130 30927 -14699 -43710 145443 -19162 -171295 109941 130252 -92314
15419 -20753 -251801 -51818 15468 -5336 31189 2452 265720 522728 -175985 -297610 235216
15407 212152 -94461 -128264 -114303 -108485 7115 -328838 17599 74858 -229434 -141494 -46839
15395 82266 74975 -89673 89730 191649 -6937 -181477 -42158 117928 -170474 -300407 -16815
$$ packed form
15478E7967c37227f9451m4597L4890A3163a850j29718D4561e4508A91521b09098
15466A34801R3826a87680B295K0489J94565c10426B07868L3232m3495b44370a03383
15454c28743B12253b1862B44501b32640I1725J04523a84548j3325a8768A16517
15443g0981C53307H6833J42353g9752N214a7282H6798c05523J02997A27809E6083
15431i3548I3956b97130C0927a4699k9011A45443a9162j52133A09941K0311i2314
15419b0753k31048e1818A5468e336C1189B452K63268K57008a75985j21625B35216
15407B12152i4461l3803J3961N818G115c28838A7599N7259b29434Q7940d6839
15395H2266p291h9673H9730J01919f937j74540d2158A17928a70474j29933a6815
$$ plain form
15383 -22121 201680 -154370 162741 90004 -26394 14829 -309971 -2054 -36567 29013 -95287
15371 9756 -175117 156425 329080 22441 -178629 -93892 68354 73608 -152016 -209831 -152673
15360 -152673 124154 -147727 -26369 23081 -84533 44875 195133 -78745 2483 156606 96712
15349 96712 -78666 -116227 269279 -124465 258964 251888 5512 262677 -183960 11317 126771
15338 126771 146707 235035 -304894 221428 -116037 59707 128228 -228124 -212876 125 -34167
15326 -342762 -62676 -245788 120525 -168767 -96080 -35436 173822 94491 3526 -376209 -82331
15314 -200155 265531 -324613 112875 181734 41245 -152513 78715 92412 -22174 99962 96869
15303 96869 143158 -103106 251 -191431 -205745 187665 12031 28840 283398 224015 -102199
$$ packed form
15383b2121B01680a54370A62741p2737b6394A4829c09971b054l4513B9013i5287
15371I756a75117A56425J72655B2441a78629Q4737F8354N254a52016n7815N7158
15360a52673A24154a47727b6369B3081h4533D4875J50258g8745B483J54123n9894
15349I6712g8666l7561B69279a24465B58964p076E512K57165a83960A1317J15454
15338A26771J9936Q8328c04894B21428a16037E9707O8521b28124J5248A25c4167
15326c42762f2676j83112A20525a68767P2687c5436A73822p9331C526c76209h2331
15314b00155B65531c24613A12875O8859D1245a52513G8715J3697b2174I9962l093
15303I6869M6289a03106B51a91431j4314A87665A2031J6809K54558n9383a02199
$$ plain form
15291 -89231 -218299 163272 -144193 104050 321353 194607 10328 154948 479157 -162842
15280 330830 62010 -37480 -16764 -180045 196652 52866 -242596 208269 28550 -34250 -80473
15269 -80473 286471 184140 -9474 -272320 -180691 -28632 -194521 -189625 -118287 233034 196312
15258 196312 158438 -114020 -119358 -191216 108009 75791 -102941 -72044 104423 161961 -165705
15246 -87292 399858 -128723 24610 30911 -82343 217865 407561 89419 186288 389097 470457
15235 470457 391300 848785 930618 1053031 990733 996993 448955 319838 -44045 244143 -185450
15223 330276 65237 391915 -30474 86056 -69228 -109834 -179862 65663 128733 86506 -92347
15211 227715 -36216 -8767 157295 11826 -25248 68999 63572 -453519 -170253 212187 -110783
$$ packed form
15291h9231j29068A63272a44193A04050K17303j26746A0328J44620L24209a62842
15280C30830F2010c7480a6764j63281A96652E2866b42596B08269B8550c4250m6223
15269h0473B86471j02331i474k62846R1629b8632j65889M896P1338B33034l6722
15258A96312l7874a14020n338p1858A08009l2218a02941L0897A04423N7538a65705
15246h7292C99858a28723B4610O301h2343B17865J89696H9419R6869K02809Q1360
15235D70457p9157M57485Q1833J22413o2298O260D48955j29117d4045B44143a85450
15223C30276F5237L26678c0474H6056f9228m0606p0028F5663O3070m2227i2347
15211B27715c6216h767A57295A1826b5248F8999n427d53519a70253B12187a10783
$$ plain form
15199 144253 392553 46344 47164 6082 217284 312904 -115828 139821 72083 58274 320590
15188 320590 -486878 69023 124404 110583 -222834 -11557 317247 268066 114681 -15620 366216
15176 -40861 98043 29035 140880 -308509 22868 -17405 77994 129129 -127171 461785 -301182
15164 -148864 306998 26979 196890 19411 -80442 122828 232078 118937 -111277 190094
15153 132625 282310 121550 100817 106181 -26950 21757 277998 93915 -285006 121757 198662
15142 198662 -81250 -29262 118748 410108 -11659 50397 151798 -182461 -29069 26909 12871
15130 182355 -116206 192283 38992 142269 191938 -5311 -68776 11055 21312 16158 138733
15119 138733 -23628 72099 175878 113538 1315 175287 168411 262469 47974 241691 -84366
$$ packed form
15199A44253K48300D6344Q20F082K11202R5620a15828A39821o7738j3809K62316
15188C20590d86878F9023N5381j3821b22834a1557C17247m9181A14681a5620C66216
15176d0861I8043B9035J11845c08509B2868a7405G7994N1135a27171D61785c01182
15164a48864C06998B6979J69911A9411h0442A22828J09250j13141a11277A90094
15153A32625J49685A21550k0733N364b6950B1757K56241I3915b85006A21757P6905
15142A98662h1250b9262A18748K91360a1659E0397J01401a82461b9069B6909A2871
15130A82355a16206A92283C8992J03277M9669e311o3465A1055J0257n154J22575
15119A38733b3628G2099J03779o2340A315J73972o876R4058D7974J93717h4366
$$ plain form
15107 -64960 99614 245931 -262964 82892 84077 165548 -11502 -11125 239038 159490 153184 -129470
15094 205092 23669 110741 276700 -184085 54505 4056 -12695 -139496 -61041 53649 237907
15083 237907 68223 248306 34826 311395 36335 53852 -64574 281284 369114 -16615 12204
15071 21899 481419 13474 338859 134879 -66466 244246 -185202 313825 194728 268277
15061 268277 140231 78240 322771 428 -38267 -126130 -90541 418390 50984 98021 -31004
15049 -461 37408 455850 525163 -4172 259668 -137226 -43840 6415 146620 112479 27605 -222114
15036 255284 306183 670410 -83700 19740 235580 -9029 -41456 158075 -39098 65308 333095
15025 333095 370557 -63714 108207 251340 361500 450639 317786 459573 427531 135943
$$ packed form
15107f4960I9614J46317b62964H2892J185Q1471a1502L77B39038p9548o306a29470
15094B05092B3669Q7072J65959a84085E4505D056a2695j26801f1041E3649J84258
15083B37907F8223J80083C4826K76569C6335J7517f4574B81284Q7830a6615A2204
15071B1899M59520A3474L25385A34879f6466B44246a85202C13825j19097P3549
15061B68277j28046o1991K44531D28c8267q7863L5589D18390E0984M7037c1004
15049d61C7408M18442O9313d172B59668a37226d3840F415J40205l4141B7605b22114
15036B55284N0899L64227h3700A9740K15840i029l2427A58075c9098F5308K67787
15025C33095L7462f3714A08207J43133J10160Q9139j32853J41787l2042A35943
$$ plain form
15014 125521 93422 452605 364592 186492 -9613 -35461 198346 -106965 442013 280315
15004 280315 112867 -6919 174335 177146 107415 40907 -214704 -79189 -122205 54135 -29455
14992 90472 93261 437153 236090 146761 233682 70112 36360 -149607 501387 238954 268778
14981 268778 -29793 192995 106570 -104957 171693 -75067 78098 297189 31087 275068
14971 275068 417191 272405 -29114 189099 -60193 264014 10152 68781 69107 134114 167507
14960 167507 276852 16879 245681 205482 360319 -29464 144417 -136368 82989 142293
14950 142293 429968 89489 603244 239843 542931 151001 239014 34021 114256 70695
14940 70695 243763 374982 262974 90448 743925 413036 88991 384848 335948 224667
$$ packed form
15014A25521l2099L59183q8013j78100i613k5848A98346a06965D42013j61698
15004B80315A12867f919A74335K811o9731D0907b14704g9189m3016E4135b9455
14992I0472K789L43892k01063q9329Q6921G0112l3752a49607E01387B38954K9824
14981B68778b9793A92995q6425a04957A71693g5067G8098K19091C1087K43981
14971B75068J42123j44786b9114A89099f0193B64014A0152N8629L26O5007L3393
14960A67507J09345A6879K28802m0199J54837b9464A44417a36368H2989N9304
14950A42293K87675H9489N13755B39843L03088A51001Q8013C4021Q0235m3561
14940G0695J73068J31219j12008I0448O53477l30889H8991K95857m8900j11281
$$ plain form
14930 224667 48701 218322 20714 346881 349243 161492 49540 230984 213119 515537 170979
14918 352931 293122 558223 77392 155899 248762 124724 384787 472533 157263 297210
14908 297210 522191 347737 329938 280943 159527 319318 391583 262520 530175 346971
14898 346971 215859 166404 160702 376807 285956 497020 286791 311496 20989 -282691 310235
14886 454100 86558 351668 245174 287479 331606 489648 266343 166477 432233 459603
14876 459603 425494 -6450 530855 138223 413113 286484 367456 529183 222983 70395
14865 385172 4207 157728 261685 560547 -65777 251755 318538 362142 271561 274766 512419
14854 512419 587004 369801 582035 164747 310762 746649 333800 473188 209205 471025
$$ packed form
14930B24667D8701J69621B0714L26167K362A61492D9540J81444j7865L02418A70979
14918C52931n9809K65101G7392P8507R2863j24038K60063Q7746A57263J39947
14908B97210K24981j74454j7799m8995j21416J59791P2265j29063K67655j83204
14898C46971j31112m9455n702K16105r0851K11064k10229K4705B0989b82691C10235
14886D54100H6558K65110j06494M2305M4127J58042k23305r9866K65756K7370
14876D59603l4109f450E30855A38223K74890j26629Q0972J61727B22983G0395
14865C85172D207J53521J03957K98862f5777B51755O6783M3604r0581L205K37653
14854E12419P4585k17203K12234A64747J46015M35887C33800J39388B09205K61820
$$ plain form
14844 471025 417920 118628 702552 323038 391155 191407 548190 452847 382531 358342
14834 358342 427686 217903 289565 251722 272860 486495 561797 555858 333022 185286 581235
14823 581235 265211 138750 479405 351527 119708 342254 469659 379909 314491 305943
14813 305943 214762 413881 362931 366444 579030 161879 168793 301088 175951 504991 429838
14802 429838 226929 392523 747579 484725 503434 521158 230508 696595 399117 233350
14792 233350 281537 801490 584648 207831 398569 646866 388288 378338 179675 -2379
14781 697864 375948 489031 390813 305724 326236 378343 544138 482874 255452 438714
14771 438714 480753 578264 624672 580252 680577 333784 334385 817209 294019 474355 673060
$$ packed form
14844D71025n3105A18628N83924C23038O8117A91407L56783r5343p0316k4189
14834C58342O9344k09783P1662l7843K1138K13635P5302n939k22836j47736L95949
14823E81235B65211j26461L40655j27878A19708K22546J27405q9750o5418q548
14813C05943r1181J99119n0950L513K12586A61879O914J32295j25137L29040p5153
14802D29838k02909J65594L55056k62854J8709J7724B30508M66087k97478j65767
14792B33350M8187N19953k16842B07831J90738K48297k58578r950A79675b379
14781F97864l21916J13083r8218q5089K0512N2107J65795o1264k27422J83262
14771D38714M2039R7511M6408m4420J00325C33784O01M82824B94019J80336J98705
$$ plain form
14760 673060 588207 490875 844975 634181 446015 421988 538758 531789 553591 495582 500447
14749 500447 744925 701293 535397 799488 440230 412127 360411 651551 356581 486506
14739 486506 594414 708327 447935 614963 216908 750263 877650 410893 650039 492462
14729 492462 805564 514927 747385 568524 625150 434116 776110 509666 720402 672328
14719 672328 823127 598122 288201 453320 658505 681261 629950 619709 509785 440329
14709 440329 787273 878785 792043 591340 961221 817194 588966 851524 350788 642032
14699 642032 543309 969071 670944 402376 489081 717352 554418 907420 984374 1034993
14689 1034993 707162 630127 686326 565364 948970 562501 667458 748620 408603 752919
$$ packed form
14760F73060q4853r7332L54100k10794j88166k4027J16770o969K1802n8009M865
14749E00447K44478m3632j65896K64091l59258k8103n1716K91140k94970J29925
14739D86506J07908J13913k60392J67028B16908N33355J27387D10893K39146j57577
14729D92462L13102k90637K32458j78861N6626j91034L41994k66444K10736m8074
14719F72328J50799k25005B88201J65119K05185K2756n1311j0241j09924o9456
14709D40329L46944R1512q6742k00703L69881j44027k28228K62558C50788K91244
14699F42032r8723M25762k98127k68568Q6705K28271j62934L53002P6954N0619
14689A034993l27831p7035N6199j20962L83606l86469J04957Q1162l40017L44316
$$ plain form
14679 752919 987928 767624 889505 685310 969456 845240 623876 858654 887969 677731
14669 677731 1066579 863532 383888 690449 569264 887078 783568 827431 1115695 606492
14659 606492 1040300 1073253 988587 1118957 1228000 879917 975853 1011509 720190 884958
14649 884958 1092796 1038962 1016607 1110407 1012176 1220909 995063 850113 554240 790640
14639 790640 1086456 836277 942308 1030170 1227763 1462996 802125 1066129 1031548 1081706
14629 1081706 958519 1046658 1000569 1296524 1064673 879650 1422964 1208009 852719 1239445
14619 1239445 1290775 1266955 1214862 1183884 1019111 1150648 1087227 1172680 1181126 1344765 1203761
14608 1203761 881395 947870 1301850 806770 955814 1442959 1201645 1096571 1319534 1494694
$$ packed form
14679G52919K35009k20304J21881k04195K84146j24216k21364K34778K9315k10238
14669F77731L88848k03047C83888L06561j21185L17814j03510M3863K88264n09203
14659F06492M33808L2953q4666J30370J09043l48083R5936L5656k91319J64768
14649H84958K07838n3834k2355R3800r8231K08733k25846j44950k95873K36400
14639G90640K95816k50179J06031Q7862J97593K35233o60871K64004l4581N0158
14629A081706j23187Q8139m6089K95955k31851j85023N43314k14955l55290L86726
14619A239445N1330k3820n2093l0978j64773J31537o3421Q5453Q446J63639j41004
14608A203761l22366O6475L53980m95080J49044M87145k41314j05074K22963J75160
$$ plain form
14598 1494694 1464202 1607558 1541886 1356320 1439915 1273349 1622099 1106915 1701496 1464107
14588 1464107 1427389 1532532 1571487 1229679 1306616 1372290 1729892 1583378 1523443 1473552
14578 1473552 1572566 1565629 1325556 1984451 1711939 2130396 1940778 1726318 1602448 1511932
14568 1511932 2120259 1490332 1801897 1721630 1831444 1618002 1714217 1904023 1861982 2006192
14558 2006192 1627955 2010897 1831685 1996162 1809359 2095207 2071589 2014944 2064211 2341683
14548 2341683 2327806 2191924 2527829 2153716 2463966 2915652 2618455 3129197 3829316 3701056
14538 3701056 4426956 4873401 6002306 7533681 9827239 13002189 19208837 30060730
14530 30060730 28785015 18309683 11102006 6680752 4181937 3228030 3336683 2699160
$$ packed form
14598A494694l0492J43356o5672j85566Q3595j66566L48750n15184N94581k37389
14588A464107l6718J05143L8955l41808P6937O5674L57602j46514n9935m9891
14578A473552R9014o937k40073O58895k72512M18457j89618k14460j23870r0516
14568A511932O08327o29927L11565q0267J09814k13442R6215J89806m2041J44210
14558B006192l78237L82942j79212J64477j86803K85848k3618n6645M9267K77472
14548B341683j3877j35882L35905l74113L10250M51686k97197N10742P00119j28260
14538C701056P25900M46445J128905J531375K293558L174950O206648J0851893
14530C0060730j275715j0475332p207677m421254k498815r53907J08653o37523
$$ plain form
14522 2699160 2208943 2067489 2213792 2098519 2173848 2165708 2083813 2105237 2166566 1870044
14512 1870044 2078789 2040705 2079264 2111017 2120295 1994267 2401198 2544521 2135639 2182747
14502 2182747 2393003 2330165 2416158 2582466 2559696 2338267 2334782 2544510 2481465 2171266
14492 2171266 2983110 2632481 2559020 3003684 2567367 2707778 2585983 2754862 2822849 2679737
14482 2679737 2765157 2648080 2980447 3087207 2632261 2877892 3067970 3040675 3290901 3082455
14472 3082455 3416676 2985622 3159491 3265636 3347829 3497100 3437294 3224431 3425751 3291751
14462 3291751 3579391 3291875 3776847 3608162 3883056 3419706 3919457 3847304 3726240 3728871
14452 3728871 4136186 4468055 3719029 3825793 4295844 4019399 4335471 4270829 4533352 4312998
$$ packed form
14522B699160m90217j41454J46303j15273P5329q140q1895K1424O1329k96522
14512A870044K08745l8084L8559L1753R278j26028M06931J43323m08882M7108
14502B182747K10256o2838Q5993J66308k2770k21429l485K09728o3045l10199
14492B171266Q11844l50629p3461M44664m36317J40411j21795J68879O7987j43112
14482B679737Q5420j17077L32367J06760m54946K45631J90078k7295K50226k08446
14472C082455L34221m31054J73869J06145Q2193J49271n9806k12863K01320j34000
14462C291751K87640k87516M84972j68685K74894m63350M99751p2153j21064K631
14452C728871M07315L31869p49026J06764M70051k76445L16072o4642K62523k20354
$$ plain form
14442 4312998 4375956 4221615 4641204 4631046 4853786 4822036 4592040 4946227 4601268 4729315
14432 4729315 4585625 5072609 5155565 4985566 5110699 5340585 5300639 5374070 5299405 5672853
14422 5672853 5872015 5957488 6027762 6001662 6020836 5802094 6022276 5891555 6189499 6251172
14412 6251172 6595950 6483825 6620729 6681017 6652082 7042295 6945684 6978655 7522520 7220821
14402 7220821 7579753 7472696 7588600 7469698 7567747 7953450 8065997 8291644 8090282 8251609
14392 8251609 8825656 8677886 8781466 9005849 8726460 9136003 9138322 9310561 9572745 9835950
14382 9835950 9712857 9660895 10080121 10293413 10609889 10766453 10623433 11101305 11337522 11536020
14372 11536020 11530128 11921549 11872356 12410685 12597746 12484546 13073084 13244642 13296439 13452199
$$ packed form
14442D312998O2958j54341M19589j0158K22740l1750k29996L54187l44959J28047
14432D729315j43690M86984Q2956j69999J25133K29886l9946P3431p4665L73448
14422E672853J99162Q5473P0274k6100J9174k18742K20182j30721K97944O1673
14412F251172L44778j12125J36904O0288k8935L90213r6611L2971N43865l01699
14402G220821L58932j07057J15904j18902R8049L85703J12547K25647k01362J61327
14392H251609N74047j47770J03580K24383k79389M09543K319J72239K62184K63205
14382I835950j23093n1962M19226K13292L16476J56564j43020M77872K36217J98498
14372A1536020n892L91421m9193N38329J87061j13200N88538J71558N1797J55760
$$ plain form
14362 13452199 13806156 14069950 14263947 14927507 15382312 15463266 15621270 15770368 16289598
14353 16289598 16456284 17204001 17645219 17315216 18212620 18235616 19085017 19164573 19759366 20443686
14343 20443686 20501921 21454975 21619024 22226983 22637953 22871779 23996556 24212944 24771989
14334 24771989 25285741 26273588 26804305 27312191 28377501 29064585 29718448 30657828 31265253
14325 31265253 32416257 33644264 34226082 35159599 36364426 37149925 38613950 39579879 40818786
14316 40818786 42375664 43619336 44699931 46026592 47838373 49395846 51209978 52375525
14308 52375525 54659528 56924383 58557696 60734151 63609524 65880489 68631375 71178276
14300 71178276 73925391 77279602 80527241 83678821 87333965 91158180 95211259 99431767
$$ packed form
14362A3452199L53957K63794J93997O63560M54805Q0954J58004J49098N19230
14353A6289598J66686P47717M41218l30003Q97404K2996Q49401P9556N94793O84320
14343B0443686N8235R53054J64049O07959M10970K33826J124777K16388N59045
14334B4771989N13752R87847N30717N07886J065310O87084O53863R39380O07425
14325C1265253J151004J228007N81818R33517J204827P85499J464025R65929J238907
14316D0818786J556878J243672J080595J326661J811781J557473J814132J165547
14308E2375525K284003K264855J633313K176455K875373K270965K750886K546901
14300G1178276K747115L354211L247639L151580L655144L824215M053079M220508
$$ plain form
14292 99431767 103922576 108530272 113952892 119598630 125638304 131632229 138557130 145842950
14284 145842950 153270919 161779453 170251091 179627966 189442759 199347162 210436456 222016501
14276 222016501 234143394 247526108 260764466 274833577 289024167 303398975 317938818
14269 317938818 332627289 347396593 361699565 375401363 387900356 399905850 410723893
14262 410723893 420686566 429461010 437465685 442606475 444089729 445033200 446546179 447532810
14254 447532810 443158315 434496203 429761897 422099029 409895059 397503897 383811800
14247 383811800 369378818 355100384 340552345 325822095 311505930 297327163 283258208
14240 283258208 270243154 257349237 244649871 232814527 221650428 210535497 199696686
$$ packed form
14292I9431767M490809M607696N422620N645738O039674N993925O924901P285820
14284A45842950P427969Q508534Q471638R376875R814793R904403J1089294J1580045
14276B22016501J2126893J3382714J3238358J4069111J4190590J4374808J4539843
14269C17938818J4688471J4769304J4302972J3701798J2498993J2005494J0818043
14262D10723893R962673Q774444Q004675N140790J483254R43471J512979R86631
14254D47532810m374495q662112m734306p662868j2203970j2391162j3692097
14247C83811800j4432982j4278434j4548039j4730250j4316165j4178767j4068955
14240B83258208j3015054j2893917j2699366j1835344j1164099j1114931j0838811
$$ plain form
14233 199696686 189939129 180056694 170263514 161562727 153335933 145756764 138147785 131443288
14225 131443288 125401256 119417077 114117034 109116213 103477719 99207003 94868461 90559291
14217 90559291 87231559 83524236 80241477 77155243 73937465 71069741 68417307 65893370
14209 65893370 63044469 60868492 58759578 56757355 54931356 52819819 51141890 49563952
14201 49563952 47613404 46143682 45137019 43628652 42368362 40852911 39737643 38509816
14193 38509816 37586703 36587592 35612616 34612276 33424804 32378397 31774860 30697906 30592163
14184 30592163 29325989 28448455 27583028 27067969 26220109 25916244 25062368 24533567 23809382
14175 23809382 23372400 22787147 22293279 21646119 21344027 20645774 20375017 19968564 19551220
$$ packed form
14233A99696686r757557r882435r793180q700787q226794p579169p608979o704497
14225A31443288o042032n984179n300043n000821n638494m270716m338542m309170
14217I0559291l327732l707323l282759l086234l217778k867724k652434k523937
14209F5893370k848901k175977k108914k002223j825999k111537j677929j577938
14201D9563952j950548j469722j006663j508367j260290j515451j115268j227827
14193C8509816r23113r99111r74976j000340j187472j046407o03537j076954j05743
14184C0592163j266174q77534q65427n15059q47860l03865q53876n28801p24185
14175B3809382m36982n85253m93868o47160l02092o98253k70757m06453m17344
$$ plain form
14166 19551220 19177186 18459059 18163876 17643792 17350900 17162758 16914215 16479326 16259155
14157 16259155 15846512 15517012 15408735 14982870 14480234 14624500 14239596 14021454 13690178
14148 13690178 13341880 13136477 12579445 12551570 12555693 12200963 12052084 11998619 11563992 11360338
14138 11360338 11083130 10788260 10958882 10520687 10190346 10483544 10264335 9834038 9983327
14129 9983327 9534714 9476071 9148518 9329626 8813762 9124653 9005795 8455340 8439088 8561562
14119 8561562 8456884 8138293 8117582 8031033 7746681 7773130 8080972 7519964 7191227 7202540
14109 7202540 7167157 7180092 7064704 6937890 6997483 6871285 6863887 6639065 6203071 6173244
14099 6173244 6216700 6498269 6030957 5947995 5858857 5940502 6292694 6051461 5604780 5813107
$$ packed form
14166A9551220l74034p18127k95183n20084k92892j88142k48543m34889k20171
14157A6259155m12643l29500j08277m25865n02636J44266l84904k18142l31276
14148A3690178l48298k05403n57032k7875M123l54730j48879n3465m34627k03654
14138A1360338k77208k94870J70622m38195l30341K93198k19209m30297J49289
14129I983327m48613n8643l27553J81108n15864L10891j18858n50455j6252J22474
14119H561562j04678l18591k0711q6549k84352K6449L07842n61008l28737J1313
14109G202540l5383J2935j15388j26814N9593j26198p398k24822m35994k9827
14099F173244M3456K81569m67312q2962q9138Q1645L52192k41233m46681K08327
$$ plain form
14089 5813107 5455328 5453556 5473001 5485484 5356267 5345390 5283482 5175202 4908943 5079335
14079 5079335 4850221 5113629 4909665 4728155 4735952 4733460 4971013 4435740 4363998 4274208
14069 4274208 4418158 4343993 4385725 4357576 4169799 3932897 4108548 4302236 4165979 3986721
14059 3986721 3756266 3968448 3737982 3887801 3878749 4028692 3736611 3838712 3557433 3620413
14049 3620413 3373091 3468758 3585735 3725878 3697574 3571419 3593802 3529207 3446178 3522824
14039 3522824 3380560 3326687 3284694 3087533 2967537 3215394 3012915 2951082 2999572 2892567
14029 2892567 2256164 2739932 2962169 2906056 2734390 2766586 2910773 3070719 3066955 2795400
14019 2795400 2584459 2452495 2880716 2448306 2649239 2902584 2526596 2509884 2593995 2546126
$$ packed form
14089E813107l57779j772J9445J2483j29217j0877o1908j08280k66259J70392
14079E079335k29114K63408k03964j81510P797k492K37553n35273p1742q9790
14069D274208J43950p4165M1732k8149j87777k36902J75651J93688j36257j79258
14059C986721k30455K12182k30466J49819r052J49943k92081J02101k81279O2980
14049C620413k47322R5667J16977J40143k8304j26155K2383o4595q3029P6646
14039C522824j42264n3873m1993j97161j19996K47857k02479o1833M8490j07005
14029B892567o36403M83768K22237n6113j71666L2196J44187J59946l764k71555
14019B795400k10941j31964M28221m32410K00933K53345l75988j6712Q4111m7869
$$ plain form
14009 2546126 2738998 2344335 2084357 2176959 2301653 2527673 2100462 2310660 2320768 2494623
13999 2494623 2348331 2158341 2110173 1835617 1871666 1873290 2089902 1942867 1771528 2074726
13989 2074726 2235055 2131046 1733162 2108650 2127652 2017615 2492695 2185747 2401145 2594663
13979 2594663 2226812 2581186 3005998 3415133 4364194 6173105 9172596 14375739 25511944
13970 25511944 29183196 19533722 13513095 8834013 6479702 5282985 4309627 3540003
13962 3540003 3535457 3260840 3104378 2588425 2680408 2476927 2242112 2305112 2071762 2040133
13952 2040133 2166588 2409347 2233323 1967091 1854436 1930568 2073787 1885273 1743907 1945718
13942 1945718 1962048 1695658 1691557 1791351 1825449 1426689 1541086 1738889 1648351 1838249
$$ packed form
14009B546126J92872l94663k59978R2602J24694K26020m27211K10198J0108J73855
13999B494623j46292j89990m8168k74556L6049J624K16612j47035j71339L03198
13989B074726J60329j04009l97884L75488J9002j10037M75080l06948K15398J93518
13979B594663l67851L54374M24812M09135R49061J808911K999491N203143J1136205
13970B5511944L671252r649474o020627m679082k354311j196717r73358p69624
13962C540003m546k74617j56462n15953R1983k03481k34815O3000k33350l1629
13952B040133J26455K42759j76024k66232j12655P6132J43219j88514j41366K01811
13942A945718J6330k66390m101R9794L4098l98760J14397J97803r0538J89898
$$ plain form
13932 1838249 1674901 1536331 1725003 1604638 1518566 1779395 1705603 1270157 1400706 1394991
13922 1394991 1731093 1610904 1596602 1728920 1626271 1629681 1694712 1433165 1586875 1609091
13912 1609091 1192282 1377954 1682539 1231046 1221812 1489587 1504850 1481161 1611097 1354793
13902 1354793 1517857 1283054 1189918 1301430 1162177 1339037 1396857 1255191 1133194 1270548
13892 1270548 1505994 821737 867729 1149357 1398230 1355352 1288277 1319978 1110462 1215285
13882 1215285 1025540 940757 1166297 1291002 918366 1352869 1689159 1237887 1560249 874994
13872 874994 957492 1189292 912461 1058662 1217851 1253321 1321917 1065781 1199772 977719
13862 977719 944085 964819 882807 1177960 944358 931857 898538 1015090 993866 963182 745593
$$ packed form
13932A838249j63348j38570J88672j20365q6072K60829p3792m35446J30549n715
13922A394991L36102j20189j4302J32318j02649L410O5031k61547J53710K2216
13912A609091m16809J85672L04585m51493r234K67775J5263k3689J29936k56304
13902A354793J63064k34803r3136J11512j39253J76860N7820j41666j21997J37354
13892A270548K35446o84257M5992K81628K48873m2878o7075L1701k09516J04823
13882A215285j89745q4783K25540J24705l72636M34503L36290m51272L22362o85255
13872H74994Q2498K31800k76831J46201J59189L5470O8596k56136J33991k22053
13862I77719l3634K0734q2012K95153k33602j2501l3319J16552k1224l0684k17589
$$ plain form
13851 745593 1070557 1050229 919077 1077836 585293 1026321 725649 702707 806144 1069810
13841 1069810 751149 926475 802774 1082206 1008929 742654 936204 772832 522799 943195
13831 943195 662835 810093 940575 1129270 644351 579095 736730 940869 979377 851531
13821 851531 877412 869278 935410 779488 646917 1119829 746290 736048 678287 699066 558656
13810 558656 635088 680444 1226279 517567 514967 789761 731278 647949 733033 774154 1001377
13799 1001377 343243 615517 584322 586399 793576 735555 626943 719152 618800 792857
13789 792857 768216 951476 912199 784897 1124430 391739 649347 452341 374292 671111
13779 671111 603781 607410 779753 679867 759764 600500 658614 802079 675443 258865 1063050
$$ packed form
13851G45593L24964k0328j31152J58759m92543M41028l00672k2942J03437K63666
13841A069810l18661J75326j23701K79432p3277k66275J93550j63372k50033M20396
13831I43195k80360J47258J30482J88695m84919o5256J57635K04139L8508j27846
13821H51531K5881q134O6132j55922j32571M72912l73539j0242n7761K0779j40410
13810E58656P6432M5356N45835E17567k600K74794n8483q3329Q5084M1121K27223
13799A001377C43243K72274l1195K077K07177n8021j08612R2209j00352J74057
13789G92857k4641J83260l9277j27302L39533C91739K57608j97006p8049K96819
13779F71111o7330L629J72343r9886P9897j59264N8114J43465j26636B58865Q04185
$$ plain form
13768 1063050 663893 620561 686538 825815 793897 435182 664025 636195 740929 476768
13758 476768 926016 716453 489363 201028 739375 670664 996965 398360 630010 430537
13748 430537 425204 395511 674758 241478 720438 546381 551528 838306 700100 697082 678283
13737 678283 -88175 947742 476420 441567 669069 664919 917628 358736 388809 499188
13727 499188 440321 407496 796923 573960 410236 709873 548515 415570 599706 500769
13717 500769 500669 187682 498852 658759 729804 373272 352317 667535 432529 346684 551660
13706 551660 365909 901861 453884 569736 709455 531953 410603 814733 406840 645359
13696 645359 290227 278741 779140 615858 560734 472727 532803 579138 729939 583509
$$ packed form
13768A063050l99157m3332O5977J39277l1918l58715K28843k7830J04734k64161
13758D76768M49248k09563k27090B01028N38347o8711L26301C98360K31650j99473
13748D30537n333k9693K79247B41478M78960j74057N147K86778j38206l018j8799
13737F78283h8175I47742m71322l4853K27502m150K52709C58736L0073J10379
13727D99188n8867l2825L89427k22963j63724K99637j61358j32945J84136r8937
13717E00769j00A87682L11170J59907P1045l56532k0955L15218k35006q5845K04976
13706E51660j85751N35952m47977J15852J39719j77502j21350M04130D06840K38519
13696F45359B90227j1486N00399j63282n5124q8007O0076M6335J50801j46430
$$ plain form
13686 583509 206832 412817 259220 490279 226568 444079 54419 346581 578072 837570
13676 837570 580254 214042 266954 427574 445787 362982 484579 348871 278998 403736
13666 403736 501740 421924 279959 588162 483725 177783 244041 527641 608459 689985
13656 689985 350018 305170 453438 595159 442482 391274 393324 397632 506426 401765 115745
13644 604827 306011 323151 380675 529433 413467 488557 680709 179060 256490 498081
13634 498081 611182 229718 237963 137661 206184 101624 294587 296479 373926 574239 643166
13623 643166 207102 125717 287833 661386 688306 489111 351866 629504 592786 395932
13613 395932 498104 173000 367121 508650 210855 673838 455941 257807 263598 328719
$$ packed form
13686E83509B06832K05985j53597K31059B26568K17511E4419K92162K31491K59498
13676H37570k57316B14042N2912J60620J8213q2805J21597j35708o9873J24738
13666D03736R8004p9816j41965L08203j04437A77783O6258K83600Q0818Q1526
13656F89985l39967m4848J48268J41721j52677n1208K050M308J08794j04661A15745
13644F04827k98816J7140N7524J48758j15966P5090J92152A79060P7430K41591
13634D98081J13101B29718Q245j00302O8523A01624J92963J892P7447K00313O8927
13623F43166B07102q1385J62116L73553K6920j99195j37245K77638l6718j96854
13613C95932J02172A73000J94121J41529B10855M62983k17897j98134N791O5121
$$ plain form
13603 328719 123042 198412 321432 225159 -164912 562238 257323 334079 267955 259299 378817
13592 378817 484561 171437 294526 322714 245228 247236 403437 262480 199102 191088 377196
13581 377196 189237 235044 374016 105242 347197 651732 80449 311284 247498 247451 547351
13570 547351 621880 522216 436318 625825 306233 193452 135868 477820 -105874 568684
13559 586915 407902 -11188 412324 484747 146260 431965 426764 625060 366406 447746
13549 447746 164547 383113 480713 143521 545188 100162 257359 195450 -163477 578032
13538 314705 495337 99742 202242 529910 190411 38373 402255 355948 214274 161561
13528 161561 237007 510411 236163 97094 447331 153765 444086 431484 87236 -441283
$$ packed form
13603C28719A23042P5370J23020r6273a64912E62238B57323P6756o6124q656J19518
13592C78817J05744A71437J23089K8188p7486K008J56201j40957o3378q014J86108
13581C77196j87959M5807J38972A05242K41955L04535H0449K30835o3786m7K99900
13570E47351P4529r9664q5898J89507C06233j12781n7584L41952a05874E68684
13559E86915j79013a1188D12324P2423A46260K85705n201J98296k58654Q1340
13549D47746A64547K18566R7600A43521M01667A00162J57197o1909a63477E78032
13538C14705J80632I9742J02500L27668A90411C8373L63882m6307j41674n2713
13528A61561P5446K73404B36163I7094L50237A53765K90321j2602H7236d41283
$$ plain form
13517 449763 319918 323231 -79123 89563 41523 -136405 276091 50984 247402 406868 399255
13506 399255 -20738 301660 219628 243282 325222 159770 294240 256363 307170 512487 211459
13494 213849 -8466 439027 400820 364255 154178 446528 275235 177736 617676 5099 -19993
13482 169501 334686 252068 111884 158139 65844 254058 389066 76547 221924 383212
13472 383212 196373 -74461 294640 195006 371833 -76775 8966 157365 -150911 62318 203277
13461 203277 -6173 180801 192065 109851 485095 -63693 283464 235011 293669 170207 221672
13450 221672 246922 281534 277911 105349 -77032 266593 84971 241947 -112036 168962 257620
13439 257620 21603 238249 -318243 -43648 88194 81567 65546 7362 177627 210595 58953
$$ packed form
13517D49763j29845L313g9123H9563D1523a36405B76091E0984J96418J59466p613
13506C99255b0738C01660q2032K3654Q1940A59770J34470l7877N0807K05317B11459
13494B13849h466D39027l8207l6565A54178K92350j71293r7499M39940E099a9993
13482A69501J65185q2618A11884M6255F5844J88214J35008G6547J45377J61288
13472C83212j86839g4461B94640r9634J76827g6775H966J48399a50911F2318J40959
13461B03277f173A80801J1264q2214L75244f3693B83464m8453N8658j23462N1465
13450B21672K5250L4612l623A05349g7032B66593H4971J56976a12036A68962Q8658
13439B57620B1603K16646c18243d3648H8194o627j6021G362J70265L2968E8953
$$ plain form
13427 407612 209391 -25743 526289 269064 329678 163767 232778 163230 46458 235140
13417 235140 14332 4760 251090 181860 363451 123759 139365 214641 348881 153967 53408
13405 188463 199839 77333 143374 216469 296868 263613 310541 -125906 91791 456661 -102024
13393 -77053 91359 697646 347348 405826 193966 378484 406631 406738 163268 -113192 97502
13381 284218 125519 12250 195751 -49794 24889 -91150 -39355 353970 263336 283228 -30030
13369 199869 339268 451902 129278 137168 300095 313383 308748 191986 -28920 86237 136614
13358 136614 523208 240701 265774 56792 155065 122718 90711 229477 48074 28808 384069
13347 384069 225848 100020 -82825 273433 -164965 76875 150162 244008 117776 46604
$$ packed form
13427D07612j98221b5743E26289k57225O0614A63767O9011o9548D6458J88682
13417B35140A4332D760K46330o9230J81591A23759J5606P5276J34240A53967E3408
13405A88463J1376G7333O6041P3095Q0399l3255M6928a25906I1791L64870a02024
13393g7053I1359O06287C47348N8478A93966J84518K8147J07A63268a13192I7502
13381B84218A25519A2250J83501d9794B4889i1150c9355C53970r0634J9892c0030
13369A99869J39399J12634A29278P890J62927J3288m635j16762b8920H6237N0377
13358A36614L86594B40701K5073E6792R8273l2347l2007J38766D8074j9266L55261
13347C84069j58221A00020h2825B73433a64965G6875P3287R3846A17776D6604
$$ plain form
13336 -101169 574525 167155 296005 352454 149279 436308 374500 239113 472036 142123
13325 336556 437929 383036 119762 -77645 190808 -62148 77305 373560 312291 58233 144240
13314 144240 169357 95101 151595 274235 122668 399384 318926 456816 80672 325759
13304 325759 208313 354285 326913 229084 172772 -55917 209704 311290 166877 -48553
13293 -10136 203825 155319 109137 18051 236464 151474 -27512 -247026 385374 188214 -25410
13281 269151 140533 119540 -116320 65425 92369 149362 651719 117685 122629 148414 403872
13270 403872 -47725 159828 -208399 374265 62220 305395 64150 140323 524350 9996 148262
13259 148262 135264 -264322 7350 178217 75190 275837 -53432 219886 335218 167203
$$ packed form
13336a01169E74525A67155J28850N6449A49279K87029o1808j35387K32923A42123
13325C36556J01373n4893A19762g7645A90808f2148G7305K96255o1269E8233Q6007
13314A44240K5117p4256N6494J22640A22668K76716q0458J37890H0672K45087
13304C25759j17446J45972k7372r7829n6312e5917B09704J01586j44413d8553
13293a0136B03825m8506m6182A8051K18413q4990b7512k19514C85374A88214b5410
13281B69151j28618k0993a16320F5425K6944N6993N02357A17685M944K5785K55458
13270D03872d7725A59828b08399C74265F2220K43175F4150P6173L84027I996J38266
13259A48262j2998b64322G350J70867G5190K00647e3432B19886J15332A67203
$$ plain form
13248 234261 15075 370678 84030 -34769 72217 -172786 -12329 37381 40225 358186 264608
13237 264608 262820 84474 529038 32370 -131470 289525 10506 -147052 88243 368497 -80909
13225 142564 216153 192941 297967 111465 -378518 262801 -28100 124252 -199421 -57772
13214 113094 -86492 -67568 88276 147427 -216198 184947 370753 16005 22377 33479 -126244
13202 67109 -40928 105858 230562 353491 131368 81952 30176 283978 -42118 245806
13191 158013 216932 303556 -259599 49235 120131 10476 80675 379079 -420888 210584 428236
13180 428236 277510 -221368 355194 -57695 137030 53183 71938 84904 -125091 108829
13169 72603 -5702 47912 162062 -83229 -199065 256540 -16381 -15190 20324 8296 169381
$$ packed form
13248B34261A5075L55603H4030c4769G2217a72786a2329C7381K844L17961r3578
13237B64608j788H4474M44564C2370a31470B89525A0506a47052H8243K80254h0909
13225A42564P3589k3212J05026A11465c78518B62801b8100A24252a99421e7772
13214A13094h6492J8924H8276N9151b16198A84947J85806A6005O372J1102a26244
13202F7109d0928A05858J24704J22929A31368m9416C0176K53802d2118B45806
13191A58013N8919Q6624b59599D9235P0896A0476P0199K98404d20888B10584K17652
13180D28236j50726b21368C55194e7695A37030E3183J8755J2966a25091A08829
13169G2603e702D7912J14150h3229j15836B56540a6381J191B0324H296J61085
$$ plain form
13158 169381 213171 232685 -1211 -136136 56451 76776 -155961 313158 -282410 13558 -264136
13146 70352 203393 90853 268880 -454337 468051 407854 126201 -58860 -85145 125200
13135 47271 146140 7267 260142 127177 193003 66247 167612 -219270 85681 -15212 121825
13123 103888 -65105 162534 -162238 -1610 293243 -224071 21120 10279 -192134 53090 -247345
13111 101546 72840 229709 -222841 -166965 6649 127924 87573 181996 221724 235857 12743
13099 136625 48582 112835 17158 183964 285021 -294348 -131764 188756 -184041 192770
13088 8413 524036 86978 -138414 -133458 98494 385403 -183385 -59108 190907 -1295 -216204
13077 -216204 -360844 242978 144602 -124164 50364 182803 -59360 143114 33831 127398
$$ packed form
13158A69381M3790J9514a211j34925E6451K0325a55961C13158b82410A3558b64136
13146G0352J33041I0853J78027d54337D68051o0197A26201e8860k6285A25200
13135D7271R8869G267K52875A27177O5826F6247J01365b19270H5681a5212A21825
13123A03888f5105A62534a62238a610B93243b24071B1120A0279a92134E3090b47345
13111A01546k8706J56869b22841N5876F649J21275m0351R4423L9728J4133A2743
13099A36625D8582O4253A7158J66806J01057b94348a31764A88756a84041A92770
13088H413N15623H6978a38414M956I8494K86909a83385e9108A90907a295k14909
13077b16204j44640B42978r8376a24164E0364J32439e9360A43114C3831R3567
$$ plain form
13067 127398 185064 13696 7651 -148913 53884 42713 -157768 51838 39006 156867 -216352
13055 91168 284421 28137 -67543 -36936 139258 194344 -168146 132946 130099 102080 45944
13043 245176 -251120 58190 186542 218214 80898 -124735 201261 64460 124495 153757 187206
13032 187206 315781 282568 369025 39433 122512 437547 -119402 127621 -357663 -133576
13021 -40868 20592 -36027 170955 232446 145635 -105491 229912 35811 -73189 108403 144546
13010 144546 101678 -134777 59292 47396 -72769 -4515 23603 190128 -120854 159794 194182
12999 194182 180652 -78145 366558 107552 102812 230397 -67304 373764 -10604 -2516 -62979
12988 -62979 92199 387413 147356 -19874 241484 123351 -100875 -273683 25839 -8985 12407
$$ packed form
13067A27398N7666A3696o045a48913E3884j1171a57768E1838j2832J17861b16352
13055I1168J93253B8137f7543L0607A39258N5086a68146A32946k847k8019D5944
13043B45176b51120E8190J28352L1672H0898a24735B01261F4460O0035K9262L3449
13032A87206J28575l3213Q6457C9433Q3079L15035a19402A27621c57663a33576
13021d0868B0592c6027A70955O1491q6811a05491B29912C5811g3189A08403L6143
13010A44546m2868a34777E9292j1896g2769d515B3603J66525a20854A59794L4388
12999A94182j3530g8145C66558A07552m740J27585f7304C73764a0604b516o0463
12988f2979I2199K95214A47356a9874B41484j18133a00875j72808B5839h985A2407
$$ plain form
12976 222081 7642 -218727 362173 -13082 80734 -346377 148628 -101991 123077 128328 106084
12965 106084 -17029 -229697 277520 111225 128907 -48909 165972 -28401 139236 -28949
12954 -109205 -22608 -105121 84446 -82534 -142124 343418 12152 -177996 141557 -64573 149902
12942 25519 -167203 -21083 116560 132212 38631 -161781 -148330 269657 194014 111326 173787
12931 173787 -70049 -281532 167966 -37155 227253 24867 115278 -36140 -24097 41469 -66222
12919 522510 -47977 351123 -114936 167454 -222514 112207 71191 99199 198381 -27744
12908 -96707 106808 -146227 113359 168851 -135858 -77746 -67522 100168 -283812 -31373
12897 65963 196383 125623 -118331 38140 -23742 -291632 46141 -31373 329678 -117021 -3987
$$ packed form
12976B22081G642b18727C62173a3082H0734c46377A48628a01991A23077N251k2244
12965A06084a7029k12668B77520A11225J7682d8909A65972b8401A39236b8949
12954a09205b2608q2513H4446h2534n9590C43418A2152a77996A41557f4573A49902
12942B5519a67203b1083A16560J5652C8631a61781J3451B69657p5643q2688O2461
12931A73787g0049k11483A67966c7155B27253B4867R0411c6140J2043D1469f6222
12919E22510d7977C51123a14936A67454b22514A12207m1016K8008R9182b7744
12908i6707A06808a46227A13359N5492a35858N8112J0224A00168b83812c1373
12897F5963J30420p0760a18331C8140b3742k67890D6141c1373C29678a17021c987
$$ plain form
12885 -74831 258983 -195040 -90706 -11000 155733 113897 136850 261952 322287 127322 187991
12874 187991 264239 -35984 42253 -16181 -77600 -25612 8327 -174317 33402 243212 257541
12863 257541 -77847 65267 43382 109175 361213 101755 -204006 239791 138471 120328
12853 120328 6086 -94583 25062 363597 -98745 -59044 -248172 -45884 58114 331504 -78000
12841 -371737 122786 138516 -45223 314341 56883 -42820 210184 197156 -269524 373844
12830 -72620 -89550 15008 15448 -169447 124562 19352 603644 79455 73311 26414 -152385
12818 170707 273944 25835 -419831 -193031 -168685 192616 -29176 18984 -85739 -81539 176718
12806 45937 36067 -79031 192621 -40766 189860 80174 -371129 196307 -10325 -214776 133398
$$ packed form
12885g4831B58983a95040i0706a1000A55733m1836K2953J25102O0335A27322O0669
12874A87991P6248c5984D2253a6181o1419b5612H327a74317C3402K09810J4329
12863B57541g7847F5267k1885O5793K52038A01755b04006B39791j01320j8143
12853A20328F086i4583B5062L38535i8745L9701j89128d5884E8114K73390g8000
12841c71737A22786J5730d5223C14341E6883d2820B10184j3028b69524C73844
12830g2620j6930A5008M40a69447A24562A9352N84292G9455o144B6414a52385
12818A70707J03237B5835d19831a93031K4346A92616b9176A8984h5739M200A76718
12806D5937r870g9031A92621d0766A89860H0174c71129A96307a0325k04451A33398
$$ plain form
12794 315898 74644 -185415 -3132 179665 175474 11204 -126552 -100419 157743 -294266 -243987
12783 -243987 78136 -342945 26481 -106938 -41839 -62432 60881 -90846 -60345 302217 -318405
12771 -35422 -61107 116867 -190202 -213908 28873 -265371 -154561 -173470 -90883 154112 -202192
12759 244120 36921 -31405 7353 -2584 -406709 259838 -101376 -388915 249663 70128 61711
12748 61711 -159257 -22105 336688 -68582 118719 -262849 -27847 -35904 147544 -70369 -155637
12737 -155637 214946 285901 -263295 4250 -199347 150954 -116395 7394 -71408 -90021 11196
12725 58174 -38678 155366 161160 -107597 170634 15036 231280 -82496 -56980 172431 -311582
12713 111286 117997 81221 -220679 -66226 65135 -135183 180634 16619 -222545 202234 -364727
$$ packed form
12794C15898G4644a85415c132A79665m191A1204a26552K6133A57743b94266N0279
12783b43987G8136c42945B6481a06938d1839k0593F0881i0846L0501C02217c18405
12771c5422k5685A16867a90202k3706B8873b65371J10810j8909Q2587A54112b02192
12759B44120C6921c1405G353b584m04125B59838a01376k87539B49663G0128q417
12748F1711a59257b2105C36688f8582A18719b62849b7847q057A47544g0369q5268
12737a55637B14946P0955b63295D250a99347A50954a16395G394g1408j8613A1196
12725E8174c8678A55366N794a07597A70634A5036K16244h2496K5516A72431c11582
12713A11286O711l6776b20679f6226F5135a35183A80634A6619b22545B02234c64727
$$ plain form
12701 -213032 -61139 -66188 -36085 22586 118463 106244 -383755 131003 218445 -69090 -159850
12690 -159850 355945 827837 105526 -29558 362481 168961 -123500 307297 -59324 107486
12679 -128775 98603 72286 -19988 -116199 283485 86795 -49642 -227823 7599 148716 187559
12668 187559 267509 -44955 -2057 50646 -2353 234039 138494 39244 39940 175348 -10319 191273
12655 114556 1250 190583 529179 228666 168722 101953 -206180 -177504 22926 -78964 95895
12643 50544 -113887 209126 181514 173655 130679 527852 107867 115891 -126980 -200209 188391
12631 214448 128808 -145840 -105210 362493 -60422 -15043 127385 281347 -159837 210574
12620 6172 -240210 292035 -87194 168071 286899 -66736 65196 200602 609043 78600 323184
$$ packed form
12701b13032f1139n049L0103B2586R5877j2219c83755A31003Q7442f9090r0760
12690a59850C55945M71892A05526b9558C62481A68961a23500C07297e9324A07486
12679a28775I8603k6317a9988r6211B83485H6795d9642j78181G599J41117L8843
12668A87559P9950d4955b057E0646b353B34039r5545C9244O96J35408a0319A91273
12655A14556A250J89333L38596B28666n9944o6769b06180K8676B2926g8964I5895
12643E0544a13887B09126k7612p859m2976L97173A07867Q024a26980p3229A88391
12631B14448q5640a45840M0630C62493f0422a5043A27385J53962a59837B10574
12620F172b40210B92035h7194A68071J18828f6736F5196J35406M08441G8600K44584
$$ plain form
12609 323184 21337 205707 89838 128400 -103377 510 126999 267311 -74217 163344 9826
12597 -66897 167252 159473 -2752 -75882 -49529 240414 -52734 54289 -4454 -80242 63652 67246
12585 67246 -164613 293202 392004 -47581 115938 -175529 79568 165939 -1949 14618 -87498
12573 74579 437306 -75647 -97691 270818 -23440 -58685 228082 236792 -216814 -178658 -226382
12562 -226382 299856 -52747 215085 -20758 -70184 -23788 73932 -4181 -186135 -10800 -55766
12551 -55766 -58063 117211 34324 20006 59867 9421 -235862 34951 93905 5750 78866 250475
12539 250475 328127 387906 -165365 -6407 4963 -286860 66589 90463 -132197 87965 60782
12528 60782 -71644 77671 74037 -163475 -81577 145296 -31016 -143747 4356 -246795 85992
$$ packed form
12609C23184B1337J84370H9838L8562a03377E10J26489J40312g4217A63344I826
12597f6897A67252p779b752p3130K6353B40414e2734E4289d454p5788F3652L594
12585F7246a64613B93202R8802d7581A15938a75529G9568Q6371a949A4618h7498
12573G4579L62727g5647k2044B70818b3440l5245B28082Q710b16814L8156m7724
12562b26382B99856e2747B15085b0758m9426b3788G3932d181j81954a0800m4966
12551e5766k297A17211C4324j4318L9861I421b35862C4951N8954E750P3116J71609
12539B50475P7652N9779a65365f407D963b86860F6589K3874a32197H7965k7183
12528F0782g1644G7671l634a63475h1577A45296c1016j12731D356b46795H5992
$$ plain form
12516 120380 128723 49214 157779 1799 -134953 -52678 -94486 11572 123551 -281521 -6555
12504 -92232 279489 -139772 56454 -354364 -270106 -85935 40344 82481 242605 -130185 -492
12492 8321 76257 -18719 66501 -230102 -185108 332184 368301 -103323 204550 266513 -93365
12480 -45272 -293162 15346 -221383 -166614 124277 168409 63260 -46592 -32332 66998 -185243
12468 98311 309643 102702 110037 -94250 -59238 -109970 -237822 -16629 -71712 -107066 120040
12456 -76700 -187837 66585 131977 1610 -196173 88184 142839 71415 -117964 -256719 -132851
12445 -132851 -149111 -93078 -229437 97510 136619 -4956 -30289 -58055 14689 -201763 189248
12433 -182868 316949 -99973 -79076 230259 80891 296873 174442 -55705 196454 30391
$$ packed form
12516A20380Q343D9214J08565A799a34953e2678m1808A1572J11979b81521f555
12504i2232B79489a39772E6454c54364Q4258h5935D0344M2137J60124a30185d92
12492H321O7936a8719F6501b30102M4994C32184L6117a03323B04550O1963i3365
12480d5272k47890A5346b21383N4769A24277M4132F3260d6592J4260F6998a85243
12468I8311K11332A02702P335i4250L5012n0732j27852a6629n5083l5354A20040
12456g6700j11137F6585O5392A610a96173H8184N4655G1415a17964j38755J23868
12445a32851j6260N6033j36359I7510L9109d956k5333k7766A4689b01763A89248
12433a82868C16949i9973K0897B30259H0891K15982j22431e5705A96454C0391
$$ plain form
12422 182705 72485 20553 -242150 157541 -123454 -181460 200687 -297459 52526 12766
12411 -268621 214558 23663 -56419 -115088 -57748 328135 58580 85315 229687 168549 267735
12400 267735 15795 -392319 -35099 255653 -17288 -82392 93508 -70157 -31567 238842 -45955
12388 240635 -206671 -40500 -6616 -278214 -57688 -336047 82088 -155977 -90599 224757 136186
12377 136186 -138603 336801 -122366 230891 -255143 -49451 2624 254384 -367163 -9072
12366 271899 343841 12659 134272 19914 -176837 89855 -305312 -89653 53401 -62845 -50880
12355 -50880 -89533 -321405 72153 128168 -320716 155640 152345 407048 -20170 184446 -289462
12343 -102540 -124363 135995 6998 -254902 230404 14708 -146236 -317385 15502 -10937 19406
$$ packed form
12422A82705G2485B0553b42150A57541a23454n8006B00687b97459E2526A2766
12411b68621B14558B3663e6419n8669N7340C28135E8580K6735J44372o1138R9186
12400B67735A5795c92319c5099B55653a7288o5104I3508g0157c1567B38842d5955
12388B40635b06671d0500f616k71598e7688k78359H2088a55977O5378B24757q8571
12377A36186a38603C36801a22366B30891b55143d9451B624K51760c67163i072
12366B71899P1942A2659J21613A9914a76837H9855c05312h9653E3401f2845J1965
12355e0880l8653k31872G2153N6015c20716A55640l295K54703b0170A84446b89462
12343a02540k1823A35995F998b54902B30404A4708a46236j71149A5502a0937A9406
$$ plain form
12331 -33262 -219134 155601 -76583 104472 286875 23185 188740 118212 61394 210038
12321 210038 -108832 -227581 -170755 50717 -54859 -27204 -62929 -62542 -12893 -142727 12421
12309 -43015 389447 124774 -20730 9451 -360715 -435516 -27082 -244262 -4954 132307 110985
12298 110985 -194939 110925 179267 2286 -106635 -125542 -131123 258162 162643 78806 48147
12287 48147 34032 -123816 255493 -144061 -182517 273840 36843 23979 36771 -46064 198524
12275 60741 70630 9823 126617 105535 -14362 -130326 218381 98852 219068 -305194 234905
12263 26678 143312 141939 191316 371785 61078 36468 501581 -279451 274062 367806 228819
12252 228819 155822 77356 -25591 -69835 82123 76466 228932 -110341 123280 6471 437473
$$ packed form
12331c3262j85872A55601g6583A04472J82403B3185J65555p0528n6818J48644
12321B10038a08832j18749N6826E0717e4859b7204l5725L87a2893j29834A2421
12309d3015C89447A24774b0730I451c60715p4801b7082k17180d954A32307k1322
12298A10985a94939A10925O8342B286a06635j8907n581B58162r5519G8806l0659
12287D8147j4115a23816B55493a44061l8456B73840C6843j2864J2792d6064A98524
12275F0741R889I823J16794k1082a4362j15964B18381I8852J20216c05194B34905
12263B6678J16634j373M9377J80469F1078k4610M65113b79451B74062R3744j38987
12252B28819p2997G7356b5591m4244H2123n657J52466a10341A23280F471M31002
$$ plain form
12241 437473 75759 322167 -123728 -186549 195678 200817 331639 3298 333664 111603 195251
12230 195251 -21025 -159811 188375 47358 -69145 -34393 80878 374242 -234043 256940
12219 249193 278729 315331 -130839 326231 -10875 -97807 -31555 56416 268118 469685 -35858
12207 39455 231348 248834 161369 -25636 32455 146691 166062 -98914 291043 240792 -75156
12195 335777 102101 -118937 86463 191133 217584 245131 -96705 -20614 77669 -133310 229794
12183 103044 177165 27703 44763 81103 175122 71096 389609 207338 163637 200195 -138478
12171 187273 -44445 31602 -127244 53232 139476 79661 130004 39130 234611 46197 175103
12160 175103 235948 401739 422324 175312 -72668 1312 -51334 276089 66310 103792 265608
$$ packed form
12241D37473G5759K46408a23728o2821A95678N139J30822C298L30366A11603Q3648
12230A95251b1025j38786A88375D7358f9145c4393H0878K93364b34043B56940
12219B49193K9536L6602a30839C26231a0875q6932c1555E6416K11702K01567c5858
12207C9455J91893J7486q7465b5636C2455J14236J9371i8914B91043n0251g5156
12195C35777A02101a18937H6463J04670K6451K7547i6705b0614G7669a33310B29794
12183A03044P4121B7703J7060L6340R4019G1096L18513j82271m3701L6558a38478
12171A87273d4445C1602a27244E3232Q6244n9815N0343C9130J95481D6197J28906
12160A75103O0845J65791K0585A75312g2668A312e1334B76089F6310L7482J61816
$$ plain form
12149 265608 213214 85953 220671 111995 -79169 -60240 -239529 202334 45010 190304
12139 190304 -325266 76184 59163 52222 129618 217610 -222838 47803 -70083 82467 136234
12128 136234 19468 158913 -57925 -10045 -203512 -51337 -169583 -153124 79627 246809 129605
12117 129605 -110965 22572 -36309 -54523 77794 -114725 187265 -51988 -45345 -58819 -90120
12106 -90120 -58778 -102775 -187379 294060 88935 -192588 33699 95338 -153974 -5024 -504102
12095 -504102 164684 -171311 34727 303917 96838 -97713 250772 40832 -47829 -280439
12085 -280439 67033 -37581 -205623 59854 -153230 258128 29984 175724 143200 182072 -136596
12073 -150348 -17571 289799 -117975 158080 -178508 334169 309995 -280455 297722 504148
$$ packed form
12149B65608n2394H5953J34718j08676g9169J8929j79289B02334D5010J45294
12139A90304c25266G6184j7021o941P7396Q7992b22838D7803g0083H2467N3767
12128A36234A9468J39445e7925a0045j93467e1337j18246J6459G9627J67182j17204
12117A29605a10965B2572c6309j8214G7794a14725A87265e1988O643j3474l1301
12106i0120L1342m3997q4604B94060H8935a92588C3699O1639a53974e024m99078
12095e04102A64684a71311C4727K69190I6838i7713B50772D0832d7829k32610
12085b80439F7033c7581j68042E9854a53230B58128B9984J45740l2524L8872a36596
12073a50348a7571B89799a17975A58080a78508C34169k4174b80455B97722K06426
$$ plain form
12063 504148 1000997 1382774 462136 438748 380026 19685 -56272 -125338 -47377 -239233 -116581
12051 12675 135977 -104259 -128336 338067 71999 -242003 -284261 30135 296898 -9574 27022
12039 18167 -104997 -80735 -116585 -63093 -138988 -6828 12195 50871 -88576 80356 312214
12028 312214 69009 233512 -325202 -398541 13960 -27376 -471589 -99313 -243333 -121083
12017 -172841 -266401 107042 25769 130932 -410579 14964 11784 -326530 -33570 -288475 -214919
12006 -214919 224132 142603 124716 251143 169012 -151801 -90054 -133459 116038 -261615
11995 134589 -53448 -5390 -7380 -159117 -17329 -64739 188782 -72173 -320342 -1944 117985
11983 35064 230100 -285436 -72810 -71715 168916 99496 51239 32108 84348 -85212 145352
$$ packed form
12063E04148M96849L81777D62136k3388n8722A9685e6272o9066d7377j91856a16581
12051A2675J23302a04259k4077C38067G1999b42003m2258C0135K66763i574B7022
12039A8167a04997K4262l5850N3492p5895f828A2195L8676h8576H0356K31858
12028C12214F9009J64503c25202p3339A3960b7376m44213i9313j44020a21083
12017a72841r3560A07042B5769J05163d10579A4964l180c26530c3570k54905P3556
12006b14919B24132q1529j7887J26427q2131a51801O1747m3405A16038b61615
11995A34589e3448e390j990j51737a7329m7410A88782g2173k48169a944A17985
11983C5064J95036b85436g2810J095A68916o9420m8257j9131N2240h5212A45352
$$ plain form
11971 -210793 51141 -654639 11552 -224795 14113 -162927 -124307 -151308 -202634 -63007 135581
11959 386078 140226 -160109 -41669 131810 210395 387088 284349 137466 -221699 -96861
11948 -67525 -91509 -356857 89346 50410 -77802 -172908 74784 22865 -116976 -96125 -33105
11936 -159070 -182638 115056 138470 248177 -10261 -12957 -26886 -25321 -119393 42677 -239641
11924 -17223 -27173 182198 92208 158731 80179 81230 39754 31836 385430 15596 144775 95574
11912 95574 -35667 -73401 292424 -143782 -298045 -227284 -39976 -179399 -648762 -109702
11901 -214408 72379 -59292 -95605 -28044 -32872 43610 -239672 -108076 -184686 69202 -168873
11889 16745 -106348 -68952 -52297 51603 90705 -394446 3025 -174271 -73618 8523 -27173
$$ packed form
11971b10793E1141f54639A1552b24795A4113a62927L8620k7001n1326f3007A35581
11959C86078A40226a60109d1669A31810P8585J76693j02739A37466b21699i6861
11948f7525k3984k65348H9346l8936g7802r5106G4784B2865a16976K0851c3105
11936a59070k3568A15056K3414J09707a0261k696j3929J565r4072D2677b39641
11924a7223r950A82198q9990O6523p8552J051C9754p918L53594A5596J29179m9201
11912I5574c5667l7734B92424a43782j54263P0761c9976j39423m69363a09702
11901b14408G2379e9292l6313b8044m828D3610b39672a08076p6610F9202a68873
11889A6745a06348L7396J6655E1603L9102c94446C025a74271g3618H523b7173
$$ plain form
11877 218430 220602 25135 -149530 -201619 216432 -281628 138886 -60286 158020 90912 -311154
11865 -72616 -26877 -357821 104451 -405116 -81073 -50185 -91541 239373 297402 -147147 151946
11853 -18564 175538 -75989 -36916 96638 300799 218012 94741 -69299 -407728 -80360 36938
11841 -75625 -88207 73005 147521 268693 385253 152736 121953 -89879 -25814 -217802 38839
11829 -59361 -115186 67611 43114 175335 -94384 -108146 -120373 -276408 -140361 -64188 252736
11817 238865 -62967 -25039 94203 -50253 6421 -222630 -123762 -59085 197410 -111074 -186468
11806 -186468 154943 24595 -281216 24167 -132968 100642 -263331 242800 -42021 -124947
11796 -124947 -426501 17926 202586 112874 42852 -2046 -25291 -99488 -196384 -9782 -81158
$$ packed form
11877B18430K172B5135a49530n2089B16432b81628A38886f0286A58020o7108c11154
11865g2616b6877l30944A04451d05116h1073L0888m1356B39373N8029a47147A51946
11853a8564A75538g5989c6916I6638K04161q2787I4741f9299l38429h0360C6938
11841g5625j2582G3005P4516J21172J16560A52736l0783h9879b5814j91988C8839
11829e9361n5825F7611k4497J32221i4384j3762j2227j56035J36047f4188B52736
11817B38865f2967b5039I4203e0253F421b22630R8868e9085A97410a11074p5394
11806a86468A54943B4595b81216B4167a32968A00642b63331B42800d2021q2926
11796a24947l01554A7926J84660q9712D2852b046k3245p4197r6896i782p1376
$$ plain form
11785 -81158 -146173 -232934 -61279 -189841 -211031 -248223 -73643 -14179 251692 -150844 157286
11773 229363 335304 220031 -222488 94567 -9529 -208062 18294 161812 -93510 132967
11762 -65790 111073 -215393 200763 23370 -81360 -357414 -158799 -58398 61243 126496 58314
11750 -36367 -110011 9437 57753 185756 47992 -164570 -80597 -64813 -174584 315121 257061
11739 257061 -86772 -445066 72704 -242451 44964 311266 -313988 -193400 -247572 -256631 -110894
11727 -166689 239348 -74965 -17909 43683 198920 266632 208247 -15648 35148 -185103 88043
11715 -191022 283307 12137 279682 -250815 82283 -47981 151978 78622 11352 -365815
11704 -11960 -86470 -21613 -90759 -89911 168390 13331 -61593 177936 -125059 -23908 -42206
$$ packed form
11785h1158o5015q6761f1279j28562k1190l7192g3643a4179B51692a50844A57286
11773B29363J05941j15273b22488I4567i529j98533A8294J43518i3510A32967
11762f5790A11073b15393B00763B3370h1360k76054a58799e8398F1243O5253E8314
11750c6367p3644I437M8316J28003D7992a64570h0597J5784j09771C15121n8060
11739B57061h6772l58294G2704b42451D4964K66302c13988J20588n4172r059a10894
11727a66689B39348g4965a7909D3683J55237O7712n8385a5648C5148a85103H8043
11715a91022B83307A2137K67545b50815H2283d7981A51978p3356A1352c65815
11704a1960p4510b1613o9146Q48A68390A3331f1593A77936a25059b3908j8298
$$ plain form
11693 -42206 212722 -81024 -405657 -194546 30752 -301369 17135 112418 7610 68327 -107567
11681 92395 194504 -202578 -195505 -82153 121569 -26528 309885 -444519 459261 251622
11671 251622 93083 -135845 -88121 55255 -96190 -6654 -240762 245346 -113783 -491794 38092
11659 166785 178313 -182496 -27431 382947 -13860 -380688 -192856 -6488 -123408 -5242 10693
11647 124533 104722 -159378 -237545 -304366 89330 206132 45097 -145520 -13964 -75496 -241655
11636 -241655 -67494 -188926 138731 13361 -153010 -302503 201979 157284 52492 -131622
11625 102355 -171322 -270518 -38421 222554 -96832 -145992 -15720 -278431 30869 -144043 -269782
11614 -269782 189073 -183883 -187390 547487 140814 -44590 194384 95230 -14376 143070
$$ packed form
11693d2206B12722h1024l24633a94546C0752c01369A7135R5283G610O0717a07567
11681I2395J02109b02578P073h2153A21569b6528C09885d44519D59261k07639
11671B51622I3083a35845M7724E5255i6190f654k34108B45346a13783l78011C8092
11659A66785J1528a82496b7431C82947a3860l66828J87832f488j16920e242A0693
11647A24533j9811a59378p8167o6821H9330J16802D5097a45520a3964o1532j66159
11636b41655f7494j21432A38731A3361a53010j49493B01979m4695E2492a31622
11625A02355a71322r9196c8421B22554i6832m9160a5720k62711C0869a44043j25739
11614b69782A89073a83883l507E47487A40814d4590A94384I5230a4376A43070
$$ plain form
11603 -24606 47007 -352396 -233741 265903 137099 -19147 -3234 97018 -225056 320836 -153476
11591 -391976 -246180 -174094 135824 232254 12183 175368 -232151 135803 -101456 18069
11580 278779 224690 -162030 429254 -110833 -128571 196738 133212 -86721 180299 314316
11570 314316 -147801 -18977 103281 -66225 434244 61167 -14835 -70096 -107068 -28025 -29018
11559 -29018 -107550 85618 31155 -158554 87837 188053 111229 -41359 10503 -360721 -67850
11547 -306098 217445 168275 205940 -81709 34400 -112780 131739 145306 21680 -73265 361001
11535 -22874 35353 34488 -40685 55737 164117 424371 33789 -216224 -29526 211143 -176138
11523 -58494 59082 67009 357901 -269437 90792 219383 261275 32144 62634 -54015 261268
$$ packed form
11603b4606D7007c52396J18655B65903j28804a9147c234I7018b25056C20836a53476
11591c91976J45796P2086A35824R6430A2183J63185b32151A35803a01456A8069
11580B78779n4089a62030D29254a10833j7738A96738o3526h6721A80299J34017
11570C14316a47801a8977A03281f6225D34244F1167a4835n5261l6972b8025r93
11559b9018p8532H5618C1155a58554H7837J00216p6824d1359A0503c60721f7850
11547c06098B17445m9170L7665h1709C4400a12780A31739J3567B1680g3265C61001
11535b2874C5353q65d0685E5737J08380K60254C3789b16224b9526B11143a76138
11523e8494E9082P927K90892b69437I0792J28591M1892C2144L0490e4015B61268
$$ plain form
11511 -298705 11231 -137353 -79972 283295 220753 290634 -307850 -221895 181764 40949 217418
11500 217418 215356 68271 52421 -23805 118817 -75206 -240018 84508 104386 21931 282188
11489 282188 320153 29834 126542 193484 155199 347956 336113 -440 95395 301699 -16335
11477 -20639 313890 -168889 311581 81027 -48845 -180180 107640 -69294 76809 -1233 128888
11465 359142 -55093 128638 207590 60366 35599 -221117 80234 33667 -260375 -171588 314611
11453 19958 372091 41838 237222 169137 181600 255368 332331 -158162 -30177 -51885 102962
11441 251215 140464 -101268 -158539 126644 -147847 69944 234649 -290756 349272 65597
11430 44481 -92226 138973 -243657 185001 164667 156286 160468 353322 110623 103870 132771
$$ packed form
11511b98705A1231a37353N7381B83295o2542O9881c07850Q5955A81764D0949J76469
11500B17418k062F8271j5850b3805A18817g5206j64812H4508J9878B1931K60257
11489B82188L7965B9834R6708O6942l8285J92757j1843d40I5395K06304a6335
11477b0639C13890a68889C11581H1027d8845j31335A07640f9294G6809a233A28888
11465C59142e5093A28638P8952F0366k4767b21117H0234C3667b60375Q8787C14611
11453A9958L52133D1838J95384o8085J2463P3768P6963a58162c0177k1708A02962
11441B51215j10751a01268n7271A26644a47847F9944J64705b90756C49272F5597
11430D4481i2226A38973b43657A85001k0334q381M182J92854A10623o753K8901
$$ plain form
11419 132771 38004 202719 -106778 236156 -32165 -532653 137879 -183732 5990 218414
11409 218414 91132 -180146 62653 -98013 3588 -211800 -44106 65394 40401 -147495 175467
11397 -176205 -154954 -65338 -298040 48302 -69199 61780 -115934 110678 -55011 -469351 184301
11385 13393 -97382 44998 -53113 -97535 -29162 224936 32349 -84036 -153476 -220275 104539
11373 -338548 82211 -378493 -292883 252270 8405 276479 35449 -48256 286817 -83467 -10570
11361 220330 -133248 33407 147959 347990 168602 -146541 61982 355348 29902 -125740
11350 29349 44083 -233566 -38979 -83937 -146469 -135449 -249251 -193964 -124031 61896 -78587
11338 -223907 -170573 -51761 -192545 -112710 -97847 -43157 -275859 271898 -82318 -48436 76918
$$ packed form
11419A32771C8004J64715a06778B36156c2165n00488A37879a83732E990K12424
11409B18414I1132a80146F2653i8013C588b11800d4106F5394k4993a47495A75467
11397a76205K1251f5338k32702D8302f9199F1780a15934A10678e5011m14340A84301
11385A3393i7382D4998e3113m4422b9162B24936C2349h4036o9440o6799A04539
11373c38548H2211c78493Q5610B52270H405K68074C5449d8256B86817h3467a0570
11361B20330a33248C3407J14552K00031A68602a46541F1982K93366B9902a25740
11350B9349J4734b33566c8979m4958o2532J1020j13802N5287O9933F1896g8587
11338b23907N3334e1761j40784P9835J4863d3157k32702B71898h2318L3882G6918
$$ plain form
11326 -204626 164668 -135922 261764 -63409 128368 222153 -73652 138286 127381 80950
11316 80950 186994 54708 51351 64494 -155435 -132632 -44829 -141952 19007 71871 58250
11305 58250 308190 285155 34875 70541 9982 194131 158578 -241425 -58801 33588 -19457
11293 -401603 -57520 -171187 181652 21448 -330424 -424710 -88288 -660 405200 210738 -7275
11281 -283385 -545115 -229751 -102042 281766 28008 -165396 -185361 -17173 -50576 144228
11270 -368811 -26377 199933 -136587 -41081 -4892 271014 4061 2409 -102558 87547 26661
11258 -53206 48585 94691 -15249 -116509 -14001 2983 -21027 70894 -19461 -187497 -318288
11247 -318288 -22746 -106407 -276395 -16354 -51856 -70299 204608 -112024 -347512 -184731
$$ packed form
11326b04626A64668a35922B61764f3409A28368R3785g3652A38286j0905m6431
11316H0950J06044E4708l357J3143a55435K2803d4829r7123A9007N2864j3621
11305E8250K49940k3035C4875L5666I982J84149l5553b41425e8801C3588a9457
11293d01603e7520j13667A81652B1448c30424r4286h8288f60D05200j94462g275
11281b83385k61730b29751a02042B81766B8008a65396j9965a7173l3403A44228
11270c68811b6377A99933a36587d1081d892B71014D061j652a02558H7547B6661
11258e3206D8585M6106a5249j01260a4001B983b1027G0894a9461j68036j30791
11247c18288b2746q3661j69988a6354l5502j8443B04608a12024k35488J62781
$$ plain form
11237 -184731 280760 334011 -200474 229454 -111265 23000 -22925 -109396 58514 -227057
11226 -58301 216285 -18055 -52600 94414 22257 167378 226988 -103282 19748 -125803 311947
11214 -395912 -304570 296188 -45658 -55503 -165810 -24584 27287 -397511 -182158 198992 -69994
11202 5196 82941 -315301 -337269 120399 -244169 88800 -285913 -17223 -324189 -232282 130712
11190 -12323 -162375 -267297 20938 -348360 -40973 -232450 38883 4304 135641 -143170 18545
11178 -235507 94337 1072 -66286 -239923 -72861 132389 282588 153174 -259088 -194813 62630
11166 225309 -41085 -76815 -8762 -183168 -57303 31617 -72512 -45700 113192 27087 -39773
11154 206665 -36292 79627 54028 175269 -42529 4095 -45891 -90204 177611 97031 234604
$$ packed form
11237a84731B80760N3251b00474B29454a11265B3000b2925q6471E8514b27057
11226e8301B16285a8055l4545I4414B2257J45121N9610a03282A9748a25803C11947
11214c95912R1342B96188d5658r845j10307b4584B7287c97511a82158A98992f9994
11202E196P7745c15301k1968A20399b44169H8800b85913a7223l06966R1907A30712
11190a2323j50052j04922B0938c48360d0973j91477C8883D304J31337a43170A8545
11178b35507I4337A072f6286j73637g2861A32389J50199j29414b59088O4275F2630
11166B25309d1085l5730h762j74406e7303C1617g2512K6812A13192B7087c9773
11154B06665c6292G9627k5599J21241d2529D095d5891m4313A77611q0580J37573
$$ plain form
11143 234604 198766 -81871 -3625 22218 -83127 -41773 -12132 -301151 7801 -112668 13975
11131 -88176 124022 47505 143176 -41211 -179353 224962 33575 -408041 -335025 -60179 296077
11119 387766 -25837 -117827 19837 4511 -327777 150588 2137 -228659 -190971 -53231 -29129
11108 -29129 108742 315699 346782 -131683 102328 65251 -163048 -205916 257903 174407
11098 174407 -237305 -138851 33743 17890 329593 -109277 79263 283280 38783 181784
11088 181784 -10086 504127 184700 -70313 20053 -59109 97215 268505 292994 -61343 -59176
11077 -59176 148209 118938 87758 515372 10613 146541 338527 111351 -187700 382770
11066 35470 258518 227369 150220 485519 402118 258913 -4156 158633 503402 -150676 44254
$$ packed form
11143B34604l5838h1871c625B2218h3127M1354a2132k89019G801a12668A3975
11131h8176A24022D7505R5671d1211j38142B24962C3575d08041P3016f0179B96077
11119C87766b5837r1990A9837D511c27777A50588B137b28659L7688e3231K4102
11108b9129A08742K06957L1083a31683A02328l7077a63048m2868B57903q3496
11098A74407b37305R8454C3743j5853L11703a09277G9263K04017C8783J43001
11088A81784a0086E04127A84700g0313B0053e9109I7215J71290K4489f1343K167
11077e9176A48209k9271l1180M27614A0613J35928J91986A11351a87700C82770
11066C5470K23048l1149p7149L35299q3401j43205d156A58633L44769a50676D4254
$$ plain form
11054 244664 525595 329266 219555 201356 332104 249668 239120 491784 484914 322742
11044 322742 548698 367554 537634 617066 432889 593203 844819 274089 342446 912438
11034 912438 543349 573622 860018 738982 776909 694368 675582 537306 453022 775735
11024 775735 751585 514448 336777 461933 567085 752603 636666 915552 398817 651886
11014 651886 642133 665280 653514 901040 699913 575421 667539 717630 280003 627194 438486
11003 438486 625531 766608 422836 536263 682444 669101 559283 512510 362445 725910
10993 725910 935840 728510 307105 606007 573660 613833 645382 569712 659378 451005
10983 451005 388556 762643 428439 626734 662214 694959 489080 695995 451497 698851
$$ packed form
11054B44664K80931j96329j09711j8199J30748q2436j0548K52664o870j62172
11044C22742K25956j81144J70080P9432j84177J60314K51616B74089O8357N69992
11034I12438l69089L0273K86396j21036L7927q2541j8786j38276q4284L22713
11024G75735k4150k37137j77671J25156J05152J85518j15937K78886C98817K53069
11014F51886r753K3147j1766K47526k01127j24492R2118N0091B80003L47191j88708
11003D38486J87045J41077l43772J13427J46181j3343j09818m6773j50065L63465
10993G25910K09930k07330C07105K98902l2347M0173L1549p5670Q9666k08373
10983D51005o2449L74087l34204J98295L5480L2745k05879K06915k44498K47354
$$ plain form
10973 698851 655818 967619 827678 899218 1018476 654628 1014721 1307873 1093069 1040235
10963 1040235 1076111 1132874 1913746 1674796 1516932 2082556 2516751 2315796 2356453 2036666
10953 2036666 2173206 2116884 2132821 1873126 1765945 2051181 1434610 1481458 1477003 1688553
10943 1688553 1353140 1663659 1566596 1592086 1470227 1824069 1317633 1367890 1045627 570668
10933 570668 542928 747461 386875 364157 395471 217548 311249 189116 282571 215537 107237
10921 302409 121959 -2246 73222 -13387 258330 168333 -124282 222898 -57474 -5806 239264
10909 178117 344325 -7343 14228 203379 -55128 91515 -380609 64992 248510 -177496 -141358
10898 -141358 -180209 -63691 -198580 -136293 351483 109355 141388 197856 -57362 -150090 215111
$$ packed form
10973F98851m3033L11801j39941P1540J19258l63848L60093K93152k14804n2834
10963A040235L5876N6763P80872k38950j57864N65624M34195k00955M0657l19787
10953B036666J36540n6322J5937k59695j07181K85236o16571M6848m455K11550
10943A688553l35413L10519r7063K5490j21859L53842n06436N0257l22263m74959
10933E70668k7740K04533l60586k2718L1314j77923R3701j22133R3455o7034A07237
10921C02409A21959b246G3222a3387B58330q9997a24282B22898e7474e806B39264
10909A78117J66208g343A4228J89151e5128I1515c80609F4992J83518a77496L6138
10898a41358l8851f3691j34889O2287C51483A09355L2033N6468e7362r2728B15111
$$ plain form
10886 128367 -106364 62714 28401 -230969 -236889 -90932 165826 -289107 30922 -182123 106097
10874 303708 376336 -63374 -208112 -23456 12207 -99455 -226773 315464 180067 -168464
10863 -134860 80943 -174505 -3790 22592 -181524 -58029 -300336 -42675 -70279 -162343 231242
10851 164087 111066 -37937 179398 -312596 -301401 -148573 -105154 20344 -62597 139303 -30238
10839 -125582 -108275 170995 26987 -298148 -252434 -267669 -272594 306307 -422246 -243051 146474
10827 -317295 350273 -349567 -31978 37759 -136691 59475 42857 -77931 19490 262671 215828
10816 215828 -105060 -53828 -356438 338551 18851 215659 -256354 -96615 -24201 -83398
10806 -83398 7370 -142500 -52008 182027 -90020 277461 -373730 268061 -119078 12024 14699
$$ packed form
10886A28367a06364F2714B8401b30969n920i0932A65826b89107C0922a82123A06097
10874C03708P2628f3374j44738b3456A2207i9455j27318C15464j35397a68464
10863a34860H0943a74505c790B2592a81524e8029k42307d2675k7604r2064B31242
10851A64087n3021c7937A79398c12596J1195a48573M3419B0344f2597A39303c0238
10839a25582J7307A70995B6987b98148M5714j5235m925C06307d22246J79195A46474
10827c17295C50273c49567c1978C7759a36691E9475j6618g7931A9490K43181m6843
10816B15828a05060N1232l02610C38551A8851J96808b56354i6615b4201n9197
10806h3398G370a42500e2008A82027i0020B77461c73730B68061a19078A2024K675
$$ plain form
10795 14699 -10343 -339923 89111 -71415 -170761 192017 44299 -151420 -401703 -274611 27255
10783 12374 -123793 155353 -268597 -116338 -30394 115217 -66410 12365 69077 201556
10773 201556 -29159 -156902 -357788 -135224 -239374 -53880 159635 -94071 265592 -160901
10762 -236715 -61470 218878 296420 31202 69866 -188949 43760 -146975 13443 -41192 -123024
10751 -123024 -133089 213406 -157257 158209 -10573 -19265 57433 -11438 -62684 -154596 -152676
10740 -152676 21569 -217526 88096 365772 76595 -399178 -119365 -267805 88703 -161706
10729 41956 13776 -52515 49000 -13493 -36955 105090 -426771 -291572 -54810 98419 -314537
10717 -158723 -208693 -61028 -16049 -10380 20195 268311 -150038 11146 -140813 93332 114341
$$ packed form
10795A4699a0343l29580H9111g1415r9346A92017D4299a51420k50283J27092B7255
10783A2374a23793A55353b68597a16338c0394A15217f6410A2365N6712J32479
10773B01556b9159j27743k00886a35224j04150e3880A59635i4071B65592a60901
10762b36715f1470B18878P7542C1202L8664a88949D3760a46975A3443d1192q1832
10751a23024j0065B13406a57257A58209a0573q692E7433a1438n1246r1912J920
10740a52676B1569b17526H8096K77676G6595c99178a19365j48440H8703a61706
10729D1956A3776e2515D9000a3493k3462A05090d26771J35199e4810I8419c14537
10717a58723m9970f1028a6049N669B0195K48116a50038A1146a40813I3332K1009
$$ plain form
10706 114341 316640 330950 37214 -39116 -249579 -5710 -103626 135437 299001 -273138 -174715
10695 -174715 -3984 -151856 97211 34304 -301145 -128635 -327611 254582 65052 -29988 61530
10683 -46885 55053 -2742 -22715 -106470 -106692 70309 -330558 -95910 -157026 341351 -196536 71181
10670 108722 -109844 -153193 57155 65150 73880 242766 84913 227396 -125270 -326024 -333140
10659 -333140 214760 111593 123029 -101563 33326 99727 105487 -238881 175449 -95982 259243
10647 -108878 -194336 -198194 -178514 -326707 -149954 3530 15306 36639 84477 5418 -40171 -22051
10635 -22051 -71830 -458628 203258 -152644 -262590 9394 225246 -42351 -10080 -288038 364496
10623 317991 9775 -362672 -212893 -186682 -36144 -337678 -590800 -254582 -108959 -155821
$$ packed form
10706A14341K02299J4310C7214c9116k10463e710r7916A35437J63564b73138R8423
10695a74715c984j47872I7211C4304c01145a28635j98976B54582F5052b9988F1530
10683d6885E5053b742j9973q3755k22G0309c30558i5910o1116C41351a96536G1181
10670A08722a09844m3349E7155P995Q730J68886H4913J42483a25270k00754p116
10659c33140B14760j03167J1436a01563C3326O6401N760b38881A75449i5982B59243
10647a08878q5458l858J9680j48193a49954C530J1776K1333M7838E418d0171J8120
10635b2051m9779l86798B03258a52644j09946I394K15852d2351a0080k77958C64496
10623C17991I775c62672J49779K6211c6144l01534k53122b54582a08959m6862
$$ plain form
10613 -155821 96804 -107937 -132753 -541519 -58075 62761 -381724 -144332 -310385 -252282
10603 -252282 236478 -11389 -57808 -177227 14793 33700 107873 89809 -471530 10533 172573
10592 172573 -150813 -219094 -293237 333788 -41943 60572 -89161 -186821 108226 -113910 35646
10580 -42994 -139179 -286201 296360 -145578 147400 -249960 -75156 -88684 22113 -44116 244726
10568 -87596 -110898 -229077 -59392 -130053 187518 31338 268661 -304683 -126305 -269046
10558 -269046 -156665 -222394 -46171 -191669 -1623 128275 10248 -313502 198730 -177071
10547 -113898 -192737 253450 -78204 -7258 -197484 72772 -242077 107686 -260566 -30082 -146247
10536 -146247 41939 -113617 148359 82248 -192462 -32390 -109062 -106833 -240037 30622 -173586
$$ packed form
10613a55821I6804a07937k4816m08766e8075F2761c81724a44332j66053N8103
10603b52282B36478a1389m6419j19419A4793J8907P4173j8064d71530A0533J62040
10592A72573a50813o8281p4143C33788d1943F0572h9161r7660A08226a13910C5646
10580d2994r6185j47022B96360a45578A47400b49960g5156j3528B2113d4116B44726
10568h7596k3302j18179e9392p0661A87518C1338K37323c04683a26305j42741
10558b69046J12381o5729d6171j45498a623A28275A0248c13502A98730a77071
10547a13898p8839B53450g8204g258j90226G2772b42077A07686b60566c0082j16165
10536a46247D1939a13617A48359o6111a92462c2390p6672K229j33204C0622a73586
$$ plain form
10524 64240 -59051 194489 267096 4494 -224061 238438 -32121 -1178 -120356 -264464 -483542
10513 -483542 274649 17763 -79863 286118 -36164 75693 190616 -27319 134930 60279 61961
10502 61961 268466 99499 -60571 -415570 -56875 -18094 -283657 -149805 44808 93448 -139704
10490 298304 1906 100842 -213181 -103632 -122147 -153657 166678 278780 -135877 -37347 -1474
10478 -168434 -60718 452897 95376 -172528 -125245 -26263 46124 -65174 29151 -20223 113518
10466 -172354 135547 218133 155561 351500 -148936 -77713 159229 -51165 18725 11262 160541
10455 160541 -167372 -311855 76057 -4306 54445 203646 -209345 -39872 -418242 124019
10444 -83380 -354804 -106849 183549 197603 -33487 22797 -162405 -82013 50953 -229324 60968
$$ packed form
10524F4240e9051A94489P2607D494b24061B38438c2121a178j19178j44108k19078
10513d83542B74649A7763g9863B86118c6164G5693J14923b7319A34930F0279J682
10502F1961K06505I9499f0571l54999e6875a8094k65563J33852D4808M8640a39704
10490B98304A906R8936b13181a03632j8515l1510A66678J12102a35877c7347a474
10478a68434f0718D52897I5376a72528M7283b6263D6124f5174B9151b0223A13518
10466a72354A35547Q2586o2572J95939a48936P1223A59229e1165A8725p463J49279
10455A60541a67372j44483G6057d306E4445J49201b09345c9872l78370A24019
10444h3380k71424a06849A83549J4054c3487B2797a62405Q0392E0953b29324F0968
$$ plain form
10432 -75776 -139206 -191004 305878 -8971 107858 336021 -169159 177774 -106649 -242345
10422 -242345 -178776 80332 -192271 242795 -172390 300457 53478 297098 -395675 98539
10411 108044 -165127 232834 -49287 -152738 -294624 105865 -118426 34066 -77861 -151186
10401 -151186 191071 252638 179419 -204415 -42345 -169392 -45756 67570 -282794 -169141
10391 -169141 -43554 -15793 -38456 -164344 -169523 11214 21900 26209 -114634 65920 -159961
10379 -108589 -239989 74414 -295185 75408 94182 95522 173073 -37706 -91817 157378 173536
10368 173536 396135 259503 176735 -189113 110162 281391 122539 214825 -161297 140121
10357 396545 25292 -116597 315466 353636 -18589 257959 113164 386326 288814 79782
$$ packed form
10432g5776o3430n1798C05878h971A07858K28163a69159A77774a06649j35696
10422b42345O3569H0332a92271B42795a72390C00457E3478K43620c95675I8539
10411A08044a65127B32834d9287j03451j41886A05865a18426C4066g7861p3325
10401a51186A91071O1567p3219b04415d2345j27047d5756F7570b82794J13653
10391a69141d3554a5793k2663j25888n179A1214J0686M309a14634F5920a59961
10379a08589j31400G4414b95185G5408J8774J340P7551c7706n4111A57378J6158
10368A73536K22599j36632q2768a89113A10162J71229A22539R2286a61297A40121
10357C96545B5292a16597C15466L8170a8589B57959A13164K73162r7512G9782
$$ plain form
10346 233574 218810 49071 369674 134532 206412 211729 252516 59519 138424 391792 594801
10335 594801 229739 419430 355173 74443 425861 100113 468987 372708 239370 273783
10325 273783 -56904 261562 344282 323302 -40824 301311 279072 54777 24759 201473 32840
10313 222518 -169935 -31238 253121 133509 90169 -235771 146845 170681 192708 49049
10302 208797 129596 293186 100883 458461 -274695 -211001 154249 -85574 -39935 -224426
10292 -224426 -277934 -66853 236858 -73886 212057 9129 258947 182444 48492 138684 72944
10281 72944 146916 -83443 93813 314057 -121302 -131457 -180593 174852 69938 -11679 -52915
10270 -52915 -6608 -215131 389991 -271108 10480 -129608 -165433 -49738 -33865 63674 16243
$$ packed form
10346B33574j4764D9071L20603A34532P1880N317M0787E9519P8905K53368K03009
10335E94801B29739J89691o4257G4443L51418A00113L68874r6279j33338L4413
10325B73783e6904B61562Q2720k0980d0824C01311k2239E4777B4759J76714C2840
10313B22518a69935c1238B53121j19612m3340b35771A46845K3836K2027D9049
10302B08797p9201J63590A00883L57578b74695O3694A54249h5574c9935j84491
10292b24426n3508f6853B36858g3886B12057I129K49818p6503D8492R0192o5740
10281G2944P3972h3443I3813K20244a21302j0155m9136A74852F9938a1679m1236
10270e2915f608k08523C89991b71108A0480a29608l5825d9738J5873F3674A6243
$$ plain form
10258 82521 42621 -73630 -80868 20856 82380 34476 -130589 -196869 83011 125955 -36017 63164
10245 -23555 -9394 -185933 400256 268874 277149 166981 110140 149372 84336 -146673 -220074
10234 -220074 -144568 -57760 -12356 -53426 200289 -73567 -19540 -170548 80035 -66018 -212145
10223 -212145 -1555 -202234 -51053 -143054 112416 -268683 70188 -5137 211476 -67387 93529
10211 38697 -133164 -103438 -89943 -100712 -138169 -134626 -345628 58636 44264 -296195 190848
10199 123392 -243964 -110602 -517542 137125 -215721 36223 -168487 -216641 -11509 -265764
10189 -265764 -240203 -92475 301132 -34327 102149 40390 176865 304877 -111428 67073
10178 108316 -33185 -87249 -144087 -89890 -289044 -70907 -51589 -181805 -12498 91214 9723
$$ packed form
10258H2521l9900g3630p238B0856O1524C4476a30589o6280H3011M2944c6017F3164
10245b3555i394j76539D00256j31382Q275j10168n6841L9232o5036a46673p3401
10234b20074P5506e7760a2356m1070B00289g3567a9540j51008H0035f6018j46127
10223b12145a555k00679e1053r2001A12416b68683G0188e137B11476f7387I3529
10211C8697a33164K9726J3495j0769l7457L543k11002E8636j4372b96195A90848
10199A23392b43964a10602m06940A37125b15721C6223a68487m8154a1509k54255
10189b65764K5561i2475C01132c4327A02149D0390J36475J28012a11428F7073
10178A08316c3185n4064n6838N4197j99154g0907J9318j30216a2498I1214I723
$$ plain form
10166 -268113 135999 -933 104680 2924 -195513 -70398 78186 -19545 124559 -33345 -89675
10155 -89675 25956 160476 131476 -440940 136066 116288 -62981 8151 209871 203053 70883
10143 6607 -267173 -374025 -227841 -380386 -206297 -162332 -170501 -330517 156745 -145543
10132 -157793 -223413 -181076 -103652 -256764 245417 243769 -300143 110037 179614 -255866 -91275
10120 -90901 -60642 -29373 -197136 146912 -275003 76347 -130379 -60837 -212893 -200607 3260
10108 115283 -232830 -102965 91282 -41020 -82702 -40208 -78802 11854 -254872 -14699 -209594
10097 -209594 14273 -1863 -86255 -898 195511 -131206 9317 125115 225695 390283 26451
10085 -3583 -180894 95840 -87856 43309 304983 239845 -147380 406132 87110 -34642 63895
$$ packed form
10166b68113A35999i33A04680B924a95513g0398G8186a9545A24559c3345n6330
10155h9675B5956J34520k9000d40940A36066j9778f2981H151K01720o818G0883
10143F607b67173j06852J46184j52545J74089M3965q169j60016A56745a45543
10132a57793o5620M2337P7424j53112B45417j648c00143A10037O9577b55866i1275
10120i0901L0259b9373j67763A46912b75003G6347a30379f0837j52056J2286C260
10108A15283b32830a02965I1282d1020m1682d0208l8594A1854b54872a4699j94895
10097b09594A4273a863q4392h98A95511a31206I317J15798J00580J64588B6451
10085c583j77311I5840h7856D3309K61674o5138a47380D06132H7110c4642F3895
$$ plain form
10073 -129353 -86039 -154719 -51277 241487 95085 -24391 -127362 118991 108394 -175882 -199393
10062 -199393 -258983 -400286 -43276 -112405 -61405 -144371 27117 -123129 328917 -159875 -312468
10051 -312468 -396308 188912 15661 78122 136040 -223663 253822 -137517 -26726 86661 -143260
10039 91626 -198711 -216512 -238388 179268 167972 -118284 73729 36094 -188142 -340111 65278
10027 66501 -156602 42926 -265004 -312068 6934 215241 -119581 -9626 -138809 -238356 -278760
10016 -278760 24234 112037 42313 -143826 41508 -271507 120116 15221 1368 -4572 -79076
10005 -79076 -122387 -81195 -111531 120493 -509661 128786 -195810 301658 -263647 83676
9994 -256834 64462 -47869 -9971 45771 52526 -8156 -501524 -107745 171350 98719 101874 -39933
$$ packed form
10073a29353M3314o8680e1277B41487I5085b4391j02971A18991j0597a75882k3511
10062a99393n9590j41303d3276o9129N1000q2966B7117a23129C28917a59875j52593
10051c12468q3840A88912A5661O2461N7918b23663B53822a37517b6726H6661a43260
10039I1626a98711j7801k1876A79268j1296a18284G3729C6094a88142j51969F5278
10027F6501a56602D2926b65004m7064F934K08307a19581i626j29183r9547m0404
10016b78760B4234Q7803D2313a43826D1508b71507A20116A5221A368d572p4504
10005g9076m3311M1192l0336A20493e09661A28786a95810C01658b63647H3676
9994b56834F4462d7869i971D5771O755h156m93368a07745A71350p2631L155c9933
$$ plain form
9981 96649 141261 325942 -35051 -9300 60238 -122632 -79649 -29023 105599 -247585 -178766
9970 -178766 219256 -27768 37723 -160324 -220059 -407156 321716 -11867 449358 -104095
9959 -193766 -29788 122241 -195594 -368712 -40999 270446 36421 -312869 -166530 56642
9948 -176480 159283 -85462 20235 167701 138922 -296009 -207226 46741 -220054 -125617 -173814
9937 -173814 -215648 -46749 -115067 -268994 42674 -57864 34314 -33585 -290383 74317 -116071
9925 -109513 -64705 -68891 -117152 -178685 56574 163348 -328107 8712 45296 38950 -358762 -198461
9913 -198461 -155622 125906 -50527 22911 89606 -52238 66543 -315672 -612 283789 16069
9901 48260 -195068 -65623 -362696 -98387 200995 -74428 203825 -252433 -120395 101805
$$ packed form
9981I6649M4612J84681c5051i300F0238a22632M2983b9023A05599b47585O8819
9970a78766B19256b7768C7723a60324n9735j87097C21716a1867D49358a04095
9959a93766b9788A22241a95594j73118d0999B70446C6421c12869J46339E6642
9948a76480A59283h5462B0235J47466k8779b96009Q8783D6741b20054R4437m8197
9937a73814m1834d6749o8318j53927D2674e7864C4314c3585k56798G4317a16071
9925a09513M4808m186m8261o1533E6574J06774c28107H712L6584o346c58762J60301
9913a98461M2839A25906e0527B2911O6695e2238F6543c15672f12B83789A6069
9901D8260a95068f5623k97073i8387B00995g4428B03825b52433a20395A01805
$$ plain form
9890 224101 -14574 134326 257864 115006 -59364 -28281 -152158 41317 -72051 -46188 -414601
9879 -414601 -397304 86765 170501 -194592 -136619 -83858 -66055 -77612 -50020 157132 -112025
9867 114261 41286 -63281 101057 12150 3436 -20611 -102009 59378 -70597 -272990 130551
9855 37904 53847 -175839 208639 -76856 -14336 -101545 -298196 -157435 -262788 -217047 -4863
9843 13082 23462 -120693 159232 -274961 -287004 -232927 -177032 123688 -294381 212116 -117111
9831 -132199 14499 -56780 293069 -290836 29022 -52790 60690 -98003 -153792 54208 -12502
9819 320542 -4356 -252973 -78597 12061 -236112 102449 -44642 73471 -44857 94228 92303
9808 92303 51365 -55464 -114739 -58334 -26207 6771 120162 -122620 -56249 46947 -90082 50730
$$ packed form
9890B24101a4574A34326J23538A15006e9364b8281j23877D1317g2051K5863l68413
9879d14601J7297H6765Q3736a94592N7973N2761J7803j1557K7592A57132a12025
9867A14261D1286f3281A01057A2150C436b0611q1398E9378g0597k02393A30551
9855C7904J5943a75839B08639g6856a4336q7209j96651J40761j05353M5741d863
9843A3082J0380a20693A59232b74961j2043N4077N5895A23688b94381B12116a17111
9831a32199A4499e6780B93069b90836B9022e2790F0690i8003n5789E4208a2502
9819C20542d356k48617g8597A2061b36112A02449d4642G3471d4857I4228j925
9808I2303m0938e5464n9275N6405b6207F771J13391a22620e6249D6947i0082E0730
$$ plain form
9795 158626 -53129 -139324 450140 -101090 78612 -53431 263337 183039 -31279 149377 -406492
9783 34827 65037 -188685 -55577 -138973 48511 -149985 -152988 4835 -136399 -138954 -355907 7436
9770 -239805 197455 -58474 -58430 -146523 -158930 -111510 -205476 65651 -212251 -241829 -86961 -14512
9757 72227 -376493 -32257 -164047 304086 40709 -117413 -110202 -5648 -91045 -122710 -241700
9746 -241700 -184007 40738 278892 -271023 74187 108781 232822 -61903 -65185 222890 -104368
9734 173777 -162671 236522 -426640 -227154 -47867 -15374 -28957 -63693 33 440020 157432
9722 -188886 -80751 -384005 -53742 -17909 102914 -61933 -169607 -36221 -308327 -279131 -345076
9711 -345076 297177 112021 35404 41448 -21954 -192287 -160659 -12882 75716 -222851 -194583
$$ packed form
9795A58626e3129q6195D50140a01090G8612e3431B63337q0298c1279A49377d06492
9783C4827L0210a88685e5577q3396D8511a49985l003D835a36399k555k16953G436
9770b39805A97455e8474M4q8093j2407M7420r3966F5651b12251k9578h6961a4512
9757G2227c76493c2257j31790C04086D0709a17413P211e648q5397l1665j18990
9746b41700N7693D0738K38154b71023G4187L4594J24041f1903l282B22890a04368
9734A73777a62671B36522d26640J99486d7867a5374j3583l4736C3M39987A57432
9722a88886h0751l03254e3742a7909A02914f1933j07674c6221k72106K9196o5945
9711c45076B97177A12021C5404O044b1954j70333L1628a2882G5716b22851K8268
$$ plain form
9700 -194583 -334944 227299 25155 94018 -123851 -64474 -95454 -155231 -206214 -56699 -220413
9689 -220413 -294106 -87846 -114378 -105992 -52386 42839 5050 -116162 -145920 -271556 -145444
9678 -145444 300235 -238072 -3652 240123 -302833 252805 -246110 97932 158741 210366 -327396
9666 226872 -142387 -9863 236968 -98018 -430899 115325 -28640 -42779 280080 -12193 -62323
9655 -62323 82852 -192705 -183731 -50010 93337 -122229 -288586 15861 -204776 172458 -188031
9643 77830 211547 224250 -68406 -245796 90946 52497 -277005 338657 -201842 -10100 -219938
9632 -219938 -274906 -109875 25328 -163765 662 -120831 -132408 -187411 43286 -479574 -71241
9620 -29627 -154788 -380960 47618 -393958 134684 -137447 187874 -238222 283019 96014
$$ packed form
9700a94583j40361B27299B5155O8863a23851N9377l0980n9777n0983e6699j63714
9689b20413p3693h7846k6532Q386e2386D2839E050a16162k9758j25636J26112
9678a45444C00235b38072c652B40123c02833B52805b46110I7932O0809N1625c27396
9666B26872a42387i863B36968i8018l32881A15325b8640j4139B80080a2193n0130
9655f2323H2852a92705Q974e0010I3337a22229j66357A5861b04776A72458a88031
9643G7830J33717J2703f8406j77390I0946l8449b77005C38657b01842a0100k09838
9632b19938n4968a09875B5328a63765F62a20831j1577n5003D3286d79574g1241
9620b9627j25161k26172D7618c93958A34684a37447A87874b38222B83019I6014
$$ plain form
9609 66739 191666 54606 110374 -226461 28719 -261005 -179143 -283224 -27030 -28828 200222
9597 63536 -265980 38912 -139555 53566 -76899 -48205 -7980 -7559 294515 223059 -19337 -170284
9585 -170284 173057 -42764 245140 -214848 -155355 -213024 11933 26185 11379 -317659 333435
9573 63244 -225045 -311820 -160715 -143031 -168101 -376734 -232346 63771 -226245 -171563 62008
9561 95249 -163343 -301664 371114 -97453 -212740 -13493 90288 -170829 -180647 89392 35806
9549 -182219 -94187 103714 154790 37927 -426742 -44400 -98903 -85570 -212721 -50762 55165
9537 455 -87347 19685 -110609 59550 -186009 107955 -151636 -8082 -208321 -308486 173554
9525 -96502 -308761 134824 10872 128060 -25965 -260901 14523 122945 -66827 27762 -31104
$$ packed form
9609F6739J24927E4606N5768b26461B8719b61005Q1862j04081b7030j798B00222
9597F3536b65980C8912a39555E3566g6899K8694g980M21B94515p1456a9337j50947
9585a70284A73057d2764B45140b14848N9493n7669A1933J4252A1379c17659C33435
9573F3244b25045q6775J51105J7684k5070k08633J44388F3771b26245N4682F2008
9561I5249a63343j38321C71114i7453j15287a3493I0288a70829r818H9392C5806
9549a82219Q8032A03714N1076C7927d26742d4400n4503J3333j27151e0762E5165
9537D55h7347A9685a10609E9550a86009A07955a51636h082k00239j00165A73554
9525i6502k12259A34824A0872J17188b5965k34936A4523J08422f6827B7762c1104
$$ plain form
9513 -127288 93621 194493 47358 -128711 52011 130903 -99757 -161093 342948 -116290 -168104
9502 -168104 161850 -125337 -50181 112517 -229616 242160 63320 339740 -293300 78272
9491 -144973 -166813 -71051 -124938 -25543 104644 4611 103930 178011 -170484 44321 -226565
9479 -38774 83051 -477318 -151192 104598 -274884 154041 -76738 -151552 395641 6083 -280894
9467 -50782 -393630 -185398 294616 -19833 -395507 -401675 37953 -147449 -187734 -46306 -325168
9456 -325168 28414 -108770 -130831 -27429 1573 -239833 -58557 -146172 102242 -44843 143988
9444 -270511 -66932 27145 -138258 31042 16964 -69256 113092 -100626 -113310 -281397 -211269
9433 -211269 -506919 97205 132387 -183493 75455 112621 -102323 -398262 -60844 -107164 104942
$$ packed form
9513a27288I3621J00872D7358a28711E2011P8892i9757o1336C42948a16290n1814
9502a68104A61850a25337e0181A12517b29616B42160F3320K76420b93300G8272
9491a44973k1840g1051n3887b5543A04644D611R9319P4081a70484D4321b26565
9479c8774H3051d77318a51192A04598b74884A54041g6738p4814C95641F083b80894
9467e0782l42848a85398B94616a9833l75674o168C7953a47449m0285d6306k78862
9456c25168B8414a08770k2061b7429A573b39833e8557q7615A02242d4843A43988
9444b70511f6932B7145a38258C1042j4078f9256A13092a00626j2684j68087P0128
9433b11269k95650I7205L5182a83493G5455L7166a02323k95939f0844m6320A04942
$$ plain form
9421 -207967 -130281 422429 -150136 -221440 -27850 -336568 -126570 -153723 -46237 -165323 -200450
9410 -200450 -84825 -131948 -182739 -57613 -204512 159170 78590 -112680 99762 303121 -129851
9398 -29389 -122364 35031 -78284 12892 184308 -86652 -192060 183792 -50093 -317833 33084
9386 124152 -8497 -6385 -101972 -295247 21191 -156005 -13937 201021 100491 -335488 -224164
9375 -224164 -54642 319430 271145 -393249 193641 -66755 -199942 -19505 -34699 -323591 -212823
9364 -212823 -52470 98883 -214095 -106906 -320752 -97056 -118872 -105387 -90352 -394661 -222551
9353 -222551 -215819 -295666 -252971 193970 2023 -58342 -148066 131409 -21807 274255 -281895
9341 -115723 38327 141323 -176135 67003 274816 -123381 -65375 -118040 422614 30405 -170903
$$ packed form
9421b07967P7686D22429a50136p1304b7850l08718a26570k7153d6237j19086l5127
9410b00450h4825m7123n0791e7613j46899A59170G8590a12680I9762K03359a29851
9398b9389r2975C5031g8284A2892J71416h6652j05408A83792e0093k67740C3084
9386A24152h497K112r5587j93275B1191a56005a3937B01021A00491c35488J11324
9375b24164e4642C19430m8285c93249A93641f6755j33187a9505j5194k88892J10768
9364b12823e2470I8883b14095a06906k13846i7056k1816J3485J5035l04309J72110
9353b22551O732p9847M2695A93970B023e8342q9724A31409b1807B74255b81895
9341a15723C8327J02996a76135F7003K07813a23381N8006n2665D22614C0405a70903
$$ plain form
9329 -209212 113282 -220711 10362 180542 127588 132417 -333859 -140426 -90838 -252361 10787
9317 118087 157411 -231494 -254474 -43421 312154 -235888 -144141 -150445 -65377 157101 -86821
9305 -115825 37009 78319 -279637 -278378 252440 337725 -235175 -111139 -42629 -170872 110758
9293 -286588 146648 273725 -438491 32583 123751 -299778 14417 -29308 -59049 7188 -171758
9281 -224570 -299443 143497 92131 -73647 76666 -5835 -162820 -136942 -494 -175467 -147724 30580
9268 -140025 -145514 -75511 -109764 -139859 -80635 -3632 -406819 210249 -91596 121351 84116
9257 84116 157761 -131130 -28415 260196 -998 -234061 149995 112434 -191138 -221425 488593
9245 2292 153944 -277736 129 209495 -220219 -226043 51239 51307 181235 -27648 38084 1548
$$ packed form
9329b09212A13282b20711A0362J70180n2954M829c33859a40426M9588j61523A0787
9317A18087L9324b31494k2980d3421C12154b35888R1747o304f5377A57101h6821
9305a15825C7009M1310b79637J259B52440Q5285b35175a11139d2629j28243A10758
9293b86588A46648J27077d38491C2583R1168b99778A4417b9308k9741G188a71758
9281b24570p4873A43497n1366g3647G6666e835j56985K5878d94j74973K7743C0580
9268a40025n489P0003l4253l0095N9224c632m03187B10249i1596A21351l7235
9257H4116P3645a31130b8415B60196i98k33063A49995l7561a91138l0287D88593
9245B292J51652b77736A29K09366b20219n824E1239O8J29928b7648C8084A548
$$ plain form
9232 212179 81377 18633 -201630 -177803 -117523 75997 -255544 -178368 -47210 42976 124408
9221 124408 62588 -382217 -145876 -140288 301212 -167775 -105505 33703 -253081 29045 -393932
9209 -150942 -359110 -208106 -464171 -183295 -52613 223043 -179096 64970 -194056 -51822
9198 -389315 -27451 -307207 326062 -285798 -89361 -251456 33123 -88090 -80158 26065 -41475
9186 24920 -110272 -381220 212139 68445 90932 139255 -61033 -141456 -166888 -71210 -53889
9175 -53889 133013 -251804 -83063 -210987 -121343 -334814 -166019 -296949 -285851 345532
9164 -103435 37495 -223008 -4380 398199 -29693 40073 -529039 21170 -242535 -87456 -99778
9153 -99778 -121520 -235031 -21079 -189611 29191 355690 -110179 305742 -299929 -285958 -178644
$$ packed form
9232B12179H1377A8633b01630K3827O0280G5997b55544P7176d7210D2976Q1432
9221A24408o1820c82217a45876N588C01212a67775O2270C3703b53081B9045c93932
9209a50942k08168J51004k56065a83295e2613B23043a79096F4970a94056e1822
9198c89315b7451k79756C26062b85798h9361j62095C3123h8090P932B6065d1475
9186B4920a10272k70948B12139F8445K2487M8323f1033q0423k5432g1210J7321
9175e3889A33013b51804h3063j27924Q9644k13471a66019j30930J1098C45532
9164a03435C7495b23008d380C98199b9693D0073e29039B1170b42535h7456j2322
9153i9778k1742j13511b1079j68532B9191L26499a10179C05742b99929J3971J07314
$$ plain form
9142 -178644 -12065 -33860 144921 -93622 -161848 12104 -191702 168567 -101390 -256887 90261
9130 -21429 132589 31926 128965 -4732 -137539 106020 326943 2499 -49241 10733 304794
9119 304794 -387446 -227833 -268325 109224 203552 -297358 -290109 1891 339122 18616 37598
9108 37598 232433 -316250 -124866 151720 272655 83212 -22813 -171413 -28269 -32729 -71245
9097 -71245 -274442 -216531 -320079 -233162 -296720 -81246 -123954 -23322 200414 -98992 202139
9085 -176619 -202256 51828 172944 256650 303755 70698 60651 -88348 -166885 -9426 266848
9073 123259 -89074 61974 91819 -83546 -282652 44967 83972 -80169 -103270 -104287 113252
9061 49239 -111406 -296956 243050 -329608 -15262 25571 -20548 -350593 -334905 -53081 -275465
$$ packed form
9142a78644a2065k1795A44921i3622o8226A2104a91702A68567a01390j55497I0261
9130b1429A32589C1926R7039d732j32807A06020K20923B499d9241A0733K94061
9119C04794c87446J59613m0492A09224R4328b97358P249A891L37231A8616J8982
9108C7598J94835c16250a24866A51720J20935H3212b2813j48600b8269m460l8516
9097g1245k03197N7911j03548Q6917o3558h1246m2708b3322B00414i8992B02139
9085a76619k5637E1828J21116Q3706M7105G0698j0047h8348p8537i426B66848
9073A23259h9074F1974K9845h3546j99106D4967L9005h0169k3101j017A13252
9061D9239a11406j85550B43050c29608a5262B5571b0548l30045J5688e3081k22384
$$ plain form
9050 -275465 205152 -80103 -116416 33985 239343 161911 126893 14674 -44165 201716 114915
9039 114915 74625 -59540 -366578 -348852 77790 -154621 -206922 -216053 -256346 -31689 206117
9027 -72344 -75051 428399 -108496 71910 -149814 -157349 -75845 255261 10745 -248001 95709
9015 -136439 -54579 -92868 -28831 -186568 -168402 -11475 205166 -289251 -93849 1021 -30740
9003 56335 -252881 -122101 -224583 50180 -222929 -288063 -221758 80967 -234903 66043 167661
8992 167661 -232693 9710 195950 116862 -83756 89551 -87591 -86998 -76006 118871 -177010
8980 114510 -39357 -110155 66139 62057 -109817 144110 -113928 371697 -104317 -237879 69712
8968 225547 -197521 -212618 -6887 -268654 -286035 -157618 32653 -327769 -138633 -296274 -403800
$$ packed form
9050b75465B05152h0103l6313C3985K05358p7432l5018A4674d4165B01716q6801
9039A14915m0290e9540l07038J7726G7790a54621n2301r131m0293c1689B06117
9027g2344k707D28399a08496G1910a49814p535g5845B55261A0745b48001I5709
9015a36439e4579l8289b8831j57737J8166a1475B05166b89251i3849A021c0740
9003E6335b52881a22101j02482E0180b22929o5134O6305H0967b34903F6043J01618
8992A67661b32693I710J86240p9088h3756H9551h7591N93J0992A18871a77010
8980A14510c9357p0798F6139m082a09817A44110a13928C71697a04317j33562F9712
8968B25547a97521j5097f887k61767j7381J28417C2653c27769a38633j57641j07526
$$ plain form
8957 -403800 -219625 81792 -75706 90657 -161464 -100623 109418 30351 -112286 -240191 107170
8945 7135 -9521 -26595 167712 -117751 -90185 197746 -473585 -172560 18003 -84408 -258908
8934 -258908 -17359 -134078 -234094 -102384 63321 -22823 50179 103598 -244725 74590 85511
8923 85511 -227571 -312321 -124832 -48788 79576 80045 -26306 295723 145577 328682 261187
8912 261187 222223 239366 619156 544965 1394285 2020392 4295865 8592708 4461473 2493854
8902 2493854 1050857 901451 533855 122510 216493 302698 -31158 210776 -49193 -56993
8892 -56993 281481 -127070 120323 -157127 110096 22747 142623 135956 53593 -79227 -93356
8881 -93356 205579 -30705 18985 104058 -155078 -261201 235996 125558 -35718 101983 -241415
$$ packed form
8957d03800J84175H1792g5706I0657a61464O0841A09418C0351a12286j27905A07170
8945G135i521j7074A67712a17751K7566A97746d73585a72560A8003h4408j74500
8934b58908a7359j16719j00016a02384F3321b2823E0179N3419b44725G4590J0921
8923H5511b27571q4750a24832d8788G9576M69b6306B95723A45577J83105o7495
8912B61187l8964J7143L79790p4191Q49320O26107K275473M296843m131235j967619
8902B493854A050857j49406l67596A22510R3983Q6205c1158B10776d9193p800
8892e6993B81481a27070A20323a57127A10096B2747J19876o667E3593g9227j4129
8881i3356B05579c0705A8985Q5073a55078j06123B35996j10438c5718A01983b41415
$$ plain form
8869 34639 136475 224200 -227625 -94253 -213205 259549 52985 65885 -5388 -189463 21118
8857 22725 38857 171240 -273358 -19165 47609 175288 3112 -174487 -218988 -2840 153080
8845 -131083 -115747 -3843 -66817 175868 166708 185537 199444 -115435 29524 -278522 -142493
8834 -142493 -97370 262195 240884 -219800 164013 -94894 -290899 -163185 90887 -153295
$$ packed form
8869C4639J01836Q7725b27625i4253j18952B59549E2985J2900e388j84075B1118
8857B2725J6132J32383b73358a9165D7609J27679C112a74487m4501b840A53080
8845a31083J5336c843o2974A75868r160J8829J3907a15435B9524b78522J36029
8834a42493M5123B62195k1311b19800A64013i4894j96005J27714I0887a53295
$$ [...]
##END NTUPLES=NMR SPECTRUM
##END=
