
##TITLE=UV1163_M6-1005-1000_6307324_defswcotjv
##JCAMPDX= 6.0         $$ Bruker NMR JCAMP-DX V2.0
##DATA TYPE= NMR SPECTRUM
##DATA CLASS= NTUPLES
##ORIGIN= BRUKER
##OWNER= Administrator
$$ 1.72 TOPSPIN		Version 2.1
$$ 2012-06-07 06:16:33.734 -0500  Administrator@TOPSPIN
$$ Compression mode = diff/dup
##.OBSERVE FREQUENCY= 400.13188235
##.OBSERVE NUCLEUS= ^1H
##.ACQUISITION MODE= SIMULTANEOUS (DQD)
##.ACQUISITION SCHEME= undefined
##.AVERAGES= 64
##.DIGITISER RES= 22
##SPECTROMETER/DATA SYSTEM= spect
##.PULSE SEQUENCE= noesygpps1d.comp
##.SOLVENT NAME= COFFEE_meoh
##.SHIFT REFERENCE= INTERNAL, COFFEE_meoh, 1, 14.96703
##AUDIT TRAIL= $$ (NUMBER, WHEN, WHO, WHERE, PROCESS, VERSION, WHAT)
$$ ##TITLE= Audit trail, TOPSPIN		Version 2.1
$$ ##JCAMPDX= 5.01
$$ ##ORIGIN= Bruker BioSpin GmbH
$$ ##OWNER= Administrator
$$ $$ C:\Bruker\TOPSPIN/data/COFFEE/nmr/UV1163_M6-1005-1000_6307324_defswcotjv/12/pdata/1/auditp.txt
$$ ##AUDIT TRAIL=  $$ (NUMBER, WHEN, WHO, WHERE, PROCESS, VERSION, WHAT)
(   1,<2012-06-07 06:16:28.562 -0500>,<Administrator>,<TOPSPIN>,<go>,<TOPSPIN 2.1>,
      <created by zg
	started at 2012-06-07 06:04:58.421 -0500,
	POWCHK enabled, PULCHK disabled,
       configuration hash MD5:
       D5 CA 7A 23 FE 6B EE E2 50 67 74 61 24 F7 5E 3B
       data hash MD5: 64K
       FE 78 4F 0E 26 B9 A7 91 BD F2 38 AF 53 D2 05 02>)
(   2,<2012-06-07 06:16:31.421 -0500>,<Administrator>,<TOPSPIN>,<proc1d>,<TOPSPIN 2.1>,
      <Start of raw data processing
       efp LB = 0.3 FT_mod = 6 PKNL = 1 PHC0 = 0 PHC1 = 0 SI = 128K 
       data hash MD5: 128K
       64 73 64 9A FC D6 EC 7B 71 52 90 19 B6 17 A1 54>)
(   3,<2012-06-07 06:16:32.593 -0500>,<Administrator>,<TOPSPIN>,<proc1d>,<TOPSPIN 2.1>,
      <pk PHC0 = 30.6958 PHC1 = 0 
       data hash MD5: 128K
       F1 34 55 52 AE F2 2B 33 83 39 6E 25 AC ED A3 37>)
(   4,<2012-06-07 06:16:33.406 -0500>,<Administrator>,<TOPSPIN>,<proc1d>,<TOPSPIN 2.1>,
      <abs ABSG = 1 
       data hash MD5: 128K
       B0 72 94 0F 3C 4F D8 3B A6 4B 4E 81 B8 BC 84 9F>)
(   5,<2012-06-07 06:16:33.484 -0500>,<Administrator>,<TOPSPIN>,<proc1d>,<TOPSPIN 2.1>,
      <abs ABSG = 2 
       data hash MD5: 128K
       E7 83 C6 7F 0C B8 D9 81 EB 34 FC AC 9B 18 CE 41>)
(   6,<2012-06-07 06:16:33.546 -0500>,<Administrator>,<TOPSPIN>,<proc1d>,<TOPSPIN 2.1>,
      <abs ABSG = 3 
       data hash MD5: 128K
       11 C3 AF F5 9D 95 49 7C 03 73 82 C2 1D 15 8D 64>)
(   7,<2012-06-07 06:16:33.609 -0500>,<Administrator>,<TOPSPIN>,<proc1d>,<TOPSPIN 2.1>,
      <abs ABSG = 4 
       data hash MD5: 128K
       9E 3F F9 46 77 9E 4C 28 47 58 00 B5 ED 3D 3A A3>)
(   8,<2012-06-07 06:16:33.656 -0500>,<Administrator>,<TOPSPIN>,<proc1d>,<TOPSPIN 2.1>,
      <abs ABSG = 5 
       data hash MD5: 128K
       73 FA 83 8D CE 8C 24 6C 49 AF E4 E6 BE A3 AD 34>)
$$ ##END=
$$ 
$$ $$ hash MD5
$$ $$ F9 9B 03 08 9D 35 D5 16 C4 D4 F1 72 DE 2C 01 C9
##$RELAX= 
##$RELAX= 
##$RELAX= 
##$RELAX= 
##$RELAX= 
##$RELAX= 
##$RELAX= 
##$RELAX= 
$$ Bruker specific parameters
$$ [...]
##$TP07= 0
##$TPNAME0= <>
##$TPNAME1= <>
##$TPNAME2= <>
##$TPNAME3= <>
##$TPNAME4= <>
##$TPNAME5= <>
##$TPNAME6= <>
##$TPNAME7= <>
##$TPOAL= (0..7)
0.5 0.5 0.5 0.5 0.5 0.5 0.5 0.5
##$TPOFFS= (0..7)
0 0 0 0 0 0 0 0
##$TUNHIN= 0
##$TUNHOUT= 0
##$TUNXOUT= 0
##$USERA1= <user>
##$USERA2= <user>
##$USERA3= <user>
##$USERA4= <user>
##$USERA5= <user>
##$V9= 5
##$VALIST= <valist>
##$VCLIST= <CCCCCCCCCCCCCCC>
##$VD= 0
##$VDLIST= <DDDDDDDDDDDDDDD>
##$VPLIST= <PPPPPPPPPPPPPPP>
##$VTLIST= <TTTTTTTTTTTTTTT>
##$WBST= 2048
##$WBSW= 25
##$XGAIN= (0..3)
0 0 0 0
##$XL= 0
##$YL= 0
##$YMAX_a= 10622018
##$YMIN_a= -9366485
##$ZGOPTNS= <>
##$ZL1= 120
##$ZL2= 120
##$ZL3= 120
##$ZL4= 120
##$ABSF1= 14.96703
##$ABSF2= -5.585501
##$ABSG= 5
##$ABSL= 3
##$ALPHA= 0
##$AQORDER= 0
##$ASSFAC= 0
##$ASSFACI= 0
##$ASSFACX= 0
##$ASSWID= 0
##$AUNMP= <proc_prof1d_extract.lims>
##$AXLEFT= 0
##$AXNAME= <>
##$AXNUC= <1H>
##$AXRIGHT= 0
##$AXTYPE= 0
##$AXUNIT= <>
##$AZFE= 0.1
##$AZFW= 0.1
##$BCFW= 0
##$BC_mod= 0
##$BYTORDP= 0
##$COROFFS= 0
##$CY= 15
##$DATMOD= 1
##$DC= 0
##$DFILT= <>
##$DTYPP= 0
##$F1P= 0
##$F2P= 0
##$FCOR= 0.5
##$FTSIZE= 131072
##$FT_mod= 6
##$GAMMA= 0
##$GB= 0
##$INTBC= 1
##$INTSCL= 1
##$ISEN= 128
##$LB= 0.3
##$LEV0= 0
##$LPBIN= 0
##$MAXI= 10000
##$MC2= 0
##$MEAN= 0
##$ME_mod= 0
##$MI= 0
##$NCOEF= 0
##$NC_proc= -1
##$NLEV= 6
##$NOISF1= 0
##$NOISF2= 0
##$NSP= 0
##$NTH_PI= 0
##$NZP= 0
##$OFFSET= 14.96703
##$PC= 1
##$PHC0= 30.6958
##$PHC1= 0
##$PH_mod= 1
##$PKNL= yes
##$PPARMOD= 0
##$PPDIAG= 0
##$PPIPTYP= 0
##$PPMPNUM= 2147483647
##$PPRESOL= 1
##$PSCAL= 4
##$PSIGN= 0
##$PYNMP= <proc.py>
##$REVERSE= no
##$SF= 400.130005433162
##$SI= 131072
##$SIGF1= 0
##$SIGF2= 0
##$SINO= 400
##$SIOLD= 131072
##$SPECTYP= <>
##$SREGLST= <1H.CDCl3>
##$SSB= 0
##$STSI= 131072
##$STSR= 0
##$SW_p= 8223.68421052632
##$SYMM= 0
##$S_DEV= 0
##$TDeff= 65536
##$TDoff= 0
##$TI= <>
##$TILT= no
##$TM1= 0
##$TM2= 0
##$TOPLEV= 0
##$USERP1= <user>
##$USERP2= <user>
##$USERP3= <user>
##$USERP4= <user>
##$USERP5= <user>
##$WDW= 1
##$XDIM= 131072
##$YMAX_p= 107935596
##$YMIN_p= -395013123
##$CURPLOT= <Network HP LaserJet P1505>
##$CURPRIN= <$Network HP LaserJet P1505>
##$DFORMAT= <normdp>
##$LAYOUT= <+/1D_H.xwp>
##$LFORMAT= <normlp>
##$PFORMAT= <normpl>
##$SURQMSG= 1
$$ End of Bruker specific parameters
$$ ---------------------------------
##NTUPLES= NMR SPECTRUM
##VAR_NAME=  FREQUENCY,     SPECTRUM/REAL,   SPECTRUM/IMAG
##SYMBOL=    X,             R,               I
##VAR_TYPE=  INDEPENDENT,   DEPENDENT,       DEPENDENT
##VAR_FORM=  AFFN,          ASDF,            ASDF
##VAR_DIM=   131072,        131072,          131072
##UNITS=     HZ,            ARBITRARY UNITS, ARBITRARY UNITS
##FACTOR=    0.0627417313425165, 1,          1
##FIRST=     8223.62146879498, -99,          -19108
##LAST=      0,             659,             -19265
##MIN=       0,             -395013123,      0
##MAX=       8223.62146879498, 107935596,    0
$$ Real data points
##PAGE= N=1
##DATA TABLE= (X++(R..R)), XYDATA
$$ [...]
63109D19329M375L684K626J224j97j408k539l827n306o809q104q998r446r693
$$ 419329 423704 427388 430014 431238 431041 429633 427094 423267 417961 411152 403048 394050 384604 374911
63095C74911j0061j0524j0696j0364r815r425r148q647p819o915o173n629n250
$$ 374911 364850 354326 343630 333266 323451 314026 304878 296231 288412 281497 275324 269695 264445
63082B64445n043m923m637l925k815j669r65r00j155j179p48j52K85O68J282K037
$$ 264445 259402 254479 249842 245917 243102 241433 240468 239568 238413 237234 236486 236334 236619 237287 238569 240606
63066B40606K502K467K191J990J861J686J502J395J255Q98L66o2j65K9K71K35
$$ 240606 243108 245575 247766 249756 251617 253303 254805 256200 257455 258353 258719 258657 258492 258521 258792 259027
63050B59027k16q06j030p14k40n6r9k0K11L18K81M35Q35J051P77L08P8L6n1k1
$$ 259027 258811 258005 256975 256261 256021 255965 255866 255846 256057 256375 256656 257091 257926 258977 259754 260062 260140 260176 260125 260104
63030B60104M81J258J672J506J223J218J294J162J030J288J866K334K515K617
$$ 260104 260585 261843 263515 265021 266244 267462 268756 269918 270948 272236 274102 276436 278951 281568
63016B81568K828L143L515L928M256M380M450M743N256N698N949O264O877P694
$$ 281568 284396 287539 291054 294982 299238 303618 308068 312811 318067 323765 329714 335978 342855 350549
63002C50549Q524R394J0408J1430J2168J2553J2884J3556J4695J6065J7264J8065
$$ 350549 359073 368467 378875 390305 402473 415026 427910 441466 456161 472226 489490 507555
62990E07555J8564J8951J9269J9479J9670J9958K0151J9846J8999J8103J7649
$$ 507555 526119 545070 564339 583818 603488 623446 643597 663443 682442 700545 718194
62979G18194J7580J7475J7083J6456J5684J4775J3762J2609J1117R090O596L842
$$ 718194 735774 753249 770332 786788 802472 817247 831009 843618 854735 863825 870421 874263
62967H74263Q68k396n782q893j1503j3742j5782j7571j8924j9733j9911j9431
$$ 874263 875131 872735 866953 858060 846557 832815 817033 799462 780538 760805 740894 721463
62955G21463j8447j7242j5930j4348j2420j0417q619o882m784k282J26J937L211
$$ 721463 703016 685774 669844 655496 643076 632659 624040 617158 612374 610092 610218 612155 615366
62942F15366M428N848P216Q138Q578Q908R426J0029J0413J0504J0467J0359R973
$$ 615366 619794 625642 632858 640996 649574 658482 667908 677937 688350 698854 709321 719680 729653
62929G29653R146Q058P064O251N339L980K075k02k622n027p393r780j2233j4685
$$ 729653 738799 746857 753921 760172 765511 769491 771566 771364 768742 763715 756322 746542 734309 719624
62915G19624j6943j8785k0082k0849k1202k1262k1080k0640j9945j9078j8167
$$ 719624 702681 683896 663814 642965 621763 600501 579421 558781 538836 519758 501591
62904E01591j7301j6421j5446j4388j3405j2638j2036j1428j0753j0165r816r586
$$ 501591 484290 467869 452423 438035 424630 411992 399956 388528 377775 367610 357794 348208
62892C48208r132q309p419o956p078p406p428p036o510o020n404m543l750l469
$$ 348208 339076 330767 323348 316392 309314 301908 294480 287444 280934 274914 269510 264967 261217 257748
62878B57748l652l717l237k429j847j748j943k104k042j760j434j310j433j557
$$ 257748 254096 250379 247142 244713 242866 241118 239175 237071 235029 233269 231835 230525 229092 227535
62864B27535j412j078q85r97j237j353j272j073q45o78o90r87j523k063k275j984
$$ 227535 226123 225045 224160 223163 221926 220573 219301 218228 217383 216705 216015 215028 213505 211442 209167 207183
62848B07183j363p93n06m79o53j036j482j582j119m40j09k38m53m83l90k77n7
$$ 207183 205820 205027 204521 204042 203389 202353 200871 199289 198170 197730 197621 197383 196930 196447 196057 195780 195723
62831A95723L04O50Q11P82N87K42q6j59lQ8j1j30k18n55j212j677j417o50j36
$$ 195723 196027 196677 197488 198270 198857 199099 199013 198854 198851 198939 198928 198798 198580 198025 196813 195136 193719 193069 192933
62812A92933k26n61o91o25o00n93l94k5J34k04q24j173r69m96k00j26M7M63Q91
$$ 192933 192707 192146 191455 190830 190230 189637 189243 189218 189352 189148 188324 187151 186182 185686 185486 185360 185407 185870 186761
62793A86761J078J011P81M32R6KJ63K58O9k63n25p33q82p29j66M20N70L77K76
$$ 186761 187839 188850 189631 190063 190159 190161 190324 190582 190651 190388 189863 189130 188248 187519 187353 187773 188343 188720 188996
62774A88996L52L29J46O8K02L49M23N64P35O82M26M25R24J554J799J636J455J537
$$ 188996 189348 189677 189823 189891 190093 190442 190865 191429 192164 192846 193272 193697 194621 196175 197974 199610 201065 202602
62756B02602J875K344K774K988K962K866K818K715K473K266K348K743L252L669
$$ 202602 204477 206821 209595 212583 215545 218411 221229 223944 226417 228683 231031 233774 237026 240695
62742B40695L909M015M211M735N546O311O820P223P743Q361Q972R664J0578J1646
$$ 240695 244604 248619 252830 257565 263111 269422 276242 283465 291208 299569 308541 318205 328783 340429
62728C40429J2759J4036J5662J7452J8945J9945K0775K1885K3429K5184K6761
$$ 340429 353188 367224 382886 400338 419283 439228 460003 481888 505317 530501 557262
62717E57262K7768K8001K7539K6656K5561K4260K2551K0128J6799J2753Q488M348
$$ 557262 585030 613031 640570 667226 692787 717047 739598 759726 776525 789278 797766 802114
62705H02114K82l845p887j1605j5036j8301k1167k3197k4383k5225k6052k6617
$$ 802114 802396 798551 790664 779059 764023 745722 724555 701358 676975 651750 625698 599081
62693E99081k6550k5891k4940k3850k2603k1273k0030j8930j7904j6882j5825
$$ 599081 572531 546640 521700 497850 475247 453974 433944 415014 397110 380228 364403
62682C64403j4636j3199j1475r576p836o716o426o521o218n226m064l342l058
$$ 364403 349767 336568 325093 315517 307681 300965 294539 288018 281800 276574 272510 269168 266110
62669B66110k815k440j998j449p25l7L73O87J244J888K178K258K874M236N544
$$ 266110 263295 260855 258857 257408 256683 256646 257019 257706 258950 260838 263016 265274 268148 272384 277928
62654B77928O077O172O592P351P917Q311R165J0675J2220J3280J4086J5138J6475
$$ 277928 284005 290177 296769 304120 312037 320348 329513 340188 352408 365688 379774 394912 411387
62641D11387J7801J8965J9996K0895K1694K2503K3277K3718K3642K3176K2344
$$ 411387 429188 448153 468149 489044 510738 533241 556518 580236 603878 627054 649398
62630F49398K0748J8025J4459J0719P079L296p80m892q749j2345j5712j8672k1001
$$ 649398 670146 688171 702630 713349 720428 723724 722944 718052 709303 696958 681246 662574 641573
62617F41573k2674k3793k4395k4490k4177k3609k2904k2129k1311k0392j9278
$$ 641573 618899 595106 570711 546221 522044 498435 475531 453402 432091 411699 392421
62606C92421j7949j6502j5059j3729j2643j1800j0979r937q796p976p653p493
$$ 392421 374472 357970 342911 329182 316539 304739 293760 283823 275027 267051 259398 251905
62594B51905p106o533o063n698n120m208l314k907l046l323l299k891k378k051
$$ 251905 244799 238266 232203 226505 221385 217177 213863 210956 207910 204587 201288 198397 196019 193968
62580A93968j927j775j416r35n99n97q57j138j258j238j217j221j083o38N8P20
$$ 193968 192041 190266 188850 187915 187316 186719 185862 184724 183466 182228 181011 179790 178707 178069 178127 178847
62564A78847J083J069Q28O50P74J161J518J640J643J759J987K138K140K120K198
$$ 178847 179930 180999 181827 182477 183251 184412 185930 187570 189213 190972 192959 195097 197237 199357 201555
62549B01555K455K985L769M507M863M937N191N858O712P569Q544R691J0686J1230
$$ 201555 204010 206995 210764 215271 220134 225071 230262 236120 242832 250401 258945 268636 279322 290552
62535B90552J1506J1905J2455J2865J2988J2915J2629J1930J0731R140P270N219
$$ 290552 302058 313963 326418 339283 352271 365186 377815 389745 400476 409616 416886 422105
62523D22105L181J356l45k244m472o729q545r670j0263j0723j1331j1915j2007
$$ 422105 425286 426642 426297 424053 419581 412852 404307 394637 384374 373651 362320 350405 338398
62510C38398j1468j0797j0539j0564j0257r377q279p340o559n834n239m772m223
$$ 338398 326930 316133 305594 295030 284773 275396 267117 259777 253218 247384 242145 237373 233150
62497B33150l541l042k992l141k990k374j551q58m80m80p24q74o77k49R8K37L18
$$ 233150 229609 226567 223575 220434 217444 215070 213519 212661 212181 211701 210977 210103 209426 209177 209275 209512 209830
62480B09830M81P59J112J449J596J520J457J647J987K233K451K963L787M520M927
$$ 209830 210311 211070 212182 213631 215227 216747 218204 219851 221838 224071 226522 229485 233272 237792 242719
62465B42719N286N952O823P513P919Q316Q976R912J0997J2047J2855J3337J3707
$$ 242719 248005 253957 260780 268293 276212 284528 293504 303416 314413 326460 339315 352652 366359
62452C66359J4300J5108J5719J5801J5489J5139J4794J4107J2781J0886Q803O880
$$ 366359 380659 395767 411486 427287 442776 457915 472709 486816 499597 510483 519286 526166
62440E26166N251L857K603J530Q35O70R68J507K202L199M606O214P619Q616R393
$$ 526166 531417 535274 537877 539407 540242 540912 541880 543387 545589 548788 553394 559608 567227 575843 585236
62425E85236J0282J1352J2336J2857J2670J1668R867P430M713K073m04k967n929
$$ 585236 595518 606870 619206 632063 644733 656401 666268 673698 678411 680484 680080 677113 671184
62412F71184r325j2845j6009j8465k0197k1524k2765k3824k4212k3580k2196k0720
$$ 671184 661859 649014 633005 614540 594343 572819 550054 526230 502018 478438 456242 435522
62400D35522j9555j8572j7443j6063j4523j2916j1299r765q382p084n788m549
$$ 435522 415967 397395 379952 363889 349366 336450 325151 315386 307004 299920 294132 289583
62388B89583l567k942k561k180j645j027n29k23N7N16J055J301J011L63k65o81
$$ 289583 286016 283074 280513 278333 276688 275661 275132 274909 274966 275482 276537 277838 278849 279212 278947 278266
62372B78266r90j344j771k224k678l151l625l991m094l904l618l469l452l371
$$ 278266 277276 275932 274161 271937 269259 266108 262483 258492 254398 250494 246876 243407 239955 236584
62358B36584l183l071l086k954k481j930j732j888j980j747j400j221j162r64
$$ 236584 233401 230330 227244 224290 221809 219879 218147 216259 214279 212532 211132 209911 208749 207785
62344B07785n50j32N0J0J6L23Q85J355J447J271J217J516J994K277K166J784J446
$$ 207785 207235 207103 207153 207163 207179 207502 208387 209742 211189 212460 213677 215193 217187 219464 221630 223414 224860
62327B24860J406J676K100K535K912L167L287L409L717M119M315M259M317M727
$$ 224860 226266 227942 230042 232577 235489 238656 241943 245352 249069 253188 257503 261762 266079 270806
62313B70806N213N431N564O050O839P455P749Q112Q851R808J0799J1910J3176
$$ 270806 276019 281450 287014 293064 299903 307358 315107 323219 332070 341878 352677 364587 377763
62300C77763J4321J5148J5893J6851J7861J8491J8554J8148J7282J5803J3725
$$ 377763 392084 407232 423125 439976 457837 476328 494882 513030 530312 546115 559840
62289E59840J1335Q939O587M145J538j044l247m957o502q253j0059j1407j2149
$$ 559840 571175 580114 586701 590846 592384 591340 588093 583136 576634 568381 558322 546915 534766
62276E34766j2665j3172j3349j2886j2044j1266j0570r765q968q443q084p573
$$ 534766 522101 508929 495580 482694 470650 459384 448814 439049 430081 421638 413554 405981
62264D05981o950o576o550o630o664o728o793o731o624o668o742o460n827n316
$$ 405981 399031 392455 385905 379275 372611 365883 359090 352359 345735 339067 332325 325865 320038 314722
62250C14722n182n129m827m408m131l952l680l330l046k843k647k418k083j606
$$ 314722 309540 304411 299584 295176 291045 287093 283413 280083 277037 274194 271547 269129 267046 265440
62236B65440j214j199j398j191l37N96J019J105J339J685J757J641J798K224K410
$$ 265440 264226 263027 261629 260438 260101 260697 261716 262821 264160 265845 267602 269243 271041 273265 275675
62221B75675K232K257K819L465L651L561L735M197M521M608M858N534O386P058
$$ 275675 277907 280164 282983 286448 290099 293660 297395 301592 306113 310721 315579 321113 327499 334557
62207C34557P559Q136Q891R735J0602J1518J2476J3403J4282J5237J6405J7706
$$ 334557 342116 350252 359143 368878 379480 390998 403474 416877 431159 446396 462801 480507
62195D80507J8836J9482J9534J9021J7941J6217J3900J1248Q536N873L238O01
$$ 480507 499343 518825 538359 557380 575321 591538 605438 616686 625222 631095 634333 634934
62183F34934k079m877p756j0430j2546j4041j5212j6366j7499j8297j8434j7848
$$ 634934 632855 627978 620222 609792 597246 583205 567993 551627 534128 515831 497397 479549
62171D79549j6807j5726j4860j4101j3187j2033j0831r749q769p816o961o275
$$ 479549 462742 447016 432156 418055 404868 392835 382004 372255 363486 355670 348709 342434
62159C42434n681n065m485m080l780l356k738k141j795j686j606j335p49J12R51
$$ 342434 336753 331688 327203 323123 319343 315987 313249 311108 309313 307627 306021 304686 303937 304049 305000
62144C05000J378J295J039J016J292J676K071K517K917L048K869K642K629K788
$$ 305000 306378 307673 308712 309728 311020 312696 314767 317284 320201 323249 326118 328760 331389 334177
62130C34177K904K877K787K734K760K859K956K962K926L091L584M119M193L718
$$ 334177 337081 339958 342745 345479 348239 351098 354054 357016 359942 363033 366617 370736 374929 378647
62116C78647L192L168L668M340N021N889P016Q104Q871R429J0093J0887J1507
$$ 378647 381839 385007 388675 393015 398036 403925 410941 419045 427916 437345 447438 458325 469832
62103D69832J1734J1630J1257J0459R060P170N129L237J590J23j358l029m868
$$ 469832 481566 493196 504453 514912 523972 531142 536271 539508 541098 541221 539863 536834 531966
62090E31966o619q103r450j0865j2216j3049j3079j2513j1806j1201j0606r843
$$ 531966 525347 517244 507794 496929 484713 471664 458585 446072 434266 423065 412459 402616
62078D02616q887p885p024o358n791n179m526m035l892m030m160m053l785l574
$$ 402616 393729 385844 378820 372462 366671 361492 356966 352931 349039 345009 340849 336796 333011 329437
62064C29437l415k969j968o23M78R61R48P54M38j20q97j609j992j997j737j391
$$ 329437 326022 323053 321085 320462 320940 321901 322849 323603 324041 323921 323024 321415 319423 317426 315689 314298
62048C14298j177j274j675k232k822l404l861l960l584k943k428k221k126j768
$$ 314298 313121 311847 310172 307940 305118 301714 297853 293893 290309 287366 284938 282717 280591 278823
62034B78823r97p9N41O99O62P83J087J384J664K135K848L547M049M524N191N886
$$ 278823 277826 277747 278288 278987 279649 280432 281519 282903 284567 286702 289550 293097 297146 301670 306861 312747
62018C12747O243O246O323O810P601Q352Q890R228R385R383R375R562R952J0289
$$ 312747 318990 325236 331559 338369 345970 354322 363212 372440 381825 391208 400583 410145 420097 430386
62004D30386J0325J0070R708R329Q792P856O395M505K460N45j109k563l964n385
$$ 430386 440711 450781 460489 469818 478610 486466 492861 497366 499826 500371 499262 496699 492735 487350
61990D87350o820q252r645j0922j2013j2914j3656j4140j4218j3899j3382j2820
$$ 487350 480530 472278 462633 451711 439698 426784 413128 398988 384770 370871 357489 344669
61978C44669j2164j1373j0597j0043r712r436r047q416p431o181n091m587m597
$$ 344669 332505 321132 310535 300492 290780 281344 272297 263881 256450 250269 245178 240591 235994
61965B35994m669m524m293m090l756l224k827k883l161l106k589k070j956k115
$$ 235994 231325 226801 222508 218418 214662 211438 208611 205728 202567 199461 196872 194802 192846 190731
61951A90731k134j829j324p82l23r4j92m62n75l66J1L38O06Q97J129J126R06P40
$$ 190731 188597 186768 185444 184662 184339 184245 184053 183591 183016 182650 182661 182999 183605 184502 185631 186757 187663 188403
61933A88403P84Q46O52J88l38p62j052j218j292j374j537j691j735j757j904k058
$$ 188403 189187 190033 190685 190873 190535 189773 188721 187503 186211 184837 183300 181609 179874 178117 176213 174155
61917A74155j896j348p43m20l88m59n18n28m61l69l68m33l90k27k15m78o71m05
$$ 174155 172259 170911 170168 169748 169360 168901 168383 167855 167394 167025 166657 166224 165834 165607 165392 164914 164243 163838
61899A63838J52M61L48J86L42P94J356J959K531K893K989L082L460M058M511M597
$$ 163838 163990 164451 164799 164985 165327 166121 167477 169436 171967 174860 177849 180931 184391 188449 192960 197557
61883A97557M418M234M220M366M566M788N149N709O237O353O005N574N374N195
$$ 197557 201975 206209 210429 214795 219361 224149 229298 235007 241244 247597 253602 259176 264550 269745
61869B69745M642L732K920K484K247J916J446Q77J71o04j099j018n26o1J82L64
$$ 269745 274387 278119 281039 283523 285770 287686 289132 290009 290180 289576 288477 287459 286933 286872 287054 287418
61853B87418O40R93J455K158L031L717L947L813L513L073K527K093J904J697J118
$$ 287418 288058 289051 290506 292664 295695 299412 303359 307172 310685 313758 316285 318378 320282 321979 323097
61838C23097K35n91j236j823k239k155j651j361j698k300k549k398k301k505k836
$$ 323097 323332 322741 321505 319682 317443 315288 313637 312276 310578 308278 305729 303331 301030 298525 295689
61823B95689l099l334l617l892m072m134m054l813l485l203k972k671k202j561
$$ 295689 292590 289256 285639 281747 277675 273541 269487 265674 262189 258986 256014 253343 251141 249580
61809B49580q03o2M67P18Q82J197J644K040K343K697L182L782M538N483O405O967
$$ 249580 248777 248715 249182 249900 250782 251979 253623 255663 258006 260703 263885 267667 272205 277688 284093 291060
61793B91060P183P452Q053Q792R309R470R345Q985Q439P807P110O215N082L945
$$ 291060 298243 305695 313748 322540 331849 341319 350664 359649 368088 375895 383005 389220 394302 398247
61779C98247L004K089R02m44j444j775j675j531j392r85k12O07J086J235J428
$$ 398247 401251 403340 404242 403798 402354 400579 398904 397373 395981 394996 394784 395391 396477 397712 399140
61764C99140J872K257K128J469P43K33l57j487l083m534n353n641n861o313o922
$$ 399140 401012 403269 405397 406866 407609 407842 407485 405998 402915 398381 393028 387387 381526 375213 368291
61749C68291p425p654p625p438p189o945o757o630o501o273n946n593n279m995
$$ 368291 360866 353212 345587 338149 330960 324015 317258 310628 304127 297854 291908 286315 281036 276041
61735B76041m727m462m137l695l214k877k701k484k100j734j623j682j573j157
$$ 276041 271314 266852 262715 259020 255806 252929 250228 247744 245644 243910 242287 240605 239032 237875
61721B37875o90m72n43p21q25p44l99J67O89Q31N04K2j53J91Q40J402J663J762
$$ 237875 237185 236713 236170 235449 234624 233880 233481 233648 234337 235168 235672 235694 235541 235732 236572 237974 239637 241399
61703B41399J991K478L031L271K975K330J790J657J756J607R14j68j240j992k354
$$ 241399 243390 245868 248899 252170 255145 257475 259265 260922 262678 264285 265199 265031 263791 261799 259445
61688B59445k439k461k589k847l116l301l386l341l073k590k081j761j672j694
$$ 259445 257006 254545 251956 249109 245993 242692 239306 235965 232892 230302 228221 226460 224788 223094
61674B23094j739j767j712j493j131p85o18o64q05q71p81o32n73o16o39o11o48
$$ 223094 221355 219588 217876 216383 215252 214467 213849 213185 212380 211509 210728 210096 209523 208907 208268 207657 207009
61657B07009p90q53o65l03j1O4p6m02q26j170j313j357j434j486j401j281j315
$$ 207009 206219 205366 204701 204398 204387 204451 204375 203973 203147 201977 200664 199307 197873 196387 194986 193705 192390
61640A92390j426j344j065r27j130j413j433j204j009j004j123j239j275j200
$$ 192390 190964 189620 188555 187628 186498 185085 183652 182448 181439 180435 179312 178073 176798 175598
61626A75598j080j048j162j326j419j433j375j167p74l41r2j17l32n28m65q5K91
$$ 175598 174518 173470 172308 170982 169563 168130 166755 165588 164814 164473 164381 164264 163932 163404 162939 162854 163145
61609A63145J98l70p93n32J55N46L97J57K78O90J096J426J716J830J602J134O96
$$ 163145 163343 162973 162180 161648 161803 162349 162746 162903 163181 163871 164967 166393 168109 169939 171541 172675 173371
61592A73371L95J64K8J19M12O83Q35J026J383J704J664J228P22M76N48P81J015
$$ 173371 173766 173930 173958 174077 174489 175172 176007 177033 178416 180120 181784 183012 183734 184210 184758 185539 186554
61575A86554J104Q77K76m81j008j149j123j221j448j605j632j668j722j571j117
$$ 186554 187658 188535 188811 188330 187322 186173 185050 183829 182381 180776 179144 177476 175754 174183 173066
61560A73066o68o04q82j076r50p24p17r19j103j172j231j328j349j206r66p81
$$ 173066 172398 171794 170912 169836 168886 168162 167445 166526 165423 164251 163020 161692 160343 159137 158171 157390
61544A57390p87j038j439j741j743j533j382j375j315j096q87q57q73p29m97m36
$$ 157390 156603 155565 154126 152385 150642 149109 147727 146352 145037 143941 143054 142197 141324 140595 140098 139662
61528A39662n67o93p18p39p48n64j40K69L95K19j53o02r06p64j98L39M36K52K33
$$ 139662 139095 138402 137684 136945 136197 135633 135493 135762 136157 136376 136223 135621 134715 133951 133753 134092 134528 134780 135013
61509A35013M72O33N18L47L86N56N67L28N5L0L20O91Q21O32L67L17M83O27N78
$$ 135013 135485 136118 136636 136983 137369 137925 138492 138820 138875 138905 139225 139916 140737 141369 141736 142053 142536 143163 143741
61490A43741M02K81L33N38P08O35L69K54M63P05O23L71M15P76R37N98P4k35l51
$$ 143741 144143 144424 144757 145295 146003 146638 147007 147261 147724 148429 149052 149423 149838 150614 151551 152149 152223 151988 151637
61471A51637m17k58K82Q61R59N94K78K52K02j91p57j071r38n04l5K66K98J02j62
$$ 151637 151220 150962 151244 152105 153064 153658 153936 154188 154390 154199 153442 152371 151433 150929 150894 151160 151458 151560 151398
61452A51398k58j0N09R17Q42L68LN6K86L59L82O33R97J107R93J051J358J544J409
$$ 151398 151140 151130 151639 152556 153398 153766 153769 153825 154111 154470 154852 155485 156482 157589 158582 159633 160991 162535 163944
61433A63944J222J183J091P92N52N77O07L49M9J79O82J039R48N83K06p1j64k6
$$ 163944 165166 166349 167440 168232 168784 169361 169968 170317 170366 170545 171227 172266 173214 173797 174003 173932 173768 173742
61415A73742J60J19j63m56o65q74j024q91m90j79j88l30l16j52j7N2J53K95L59
$$ 173742 173902 174021 173858 173402 172737 171863 170839 169948 169458 169279 169091 168761 168445 168293 168276 168328 168481 168776 169135
61396A69135K54Nk30k48mK65L00J88K67O07Q99R26Q47Q59Q92Q46Q75J101J277
$$ 169135 169389 169394 169164 168916 168912 169177 169477 169665 169932 170539 171438 172364 173211 174070 174962 175808 176683 177784 179061
61377A79061J102P30O01Q33J120J244J289J342J281J055Q10O74N31K63J9O2M36
$$ 179061 180163 180893 181494 182327 183447 184691 185980 187322 188603 189658 190468 191142 191673 191936 191955 192017 192453
61360A92453Q77J081R78P74P13P40N47K5m24l30K09N84M34L7k07k82l93n26m83
$$ 192453 193330 194411 195389 196163 196876 197616 198163 198188 197764 197434 197643 198227 198661 198698 198491 198209 197816 197290 196807
61341A96807k12J51M78P10P81O85N40L99J11m28r44j038o87l20k98n55p82p58
$$ 196807 196595 196746 197224 197934 198715 199400 199940 200339 200450 200022 199078 198040 197353 197033 196735 196180 195398 194640
61323A94640m51L7N42R06J066R84O05j2n54o78l99k5K41M37N34L84O2k7L38Q27
$$ 194640 194189 194226 194768 195674 196740 197724 198329 198317 197763 197085 196686 196661 196902 197339 197873 198257 198319 198292 198630 199457
61303A99457R51O92M27L61L61L33M30Q30J464K088K488K573K358J985J615J321
$$ 199457 200408 201100 201527 201888 202249 202582 203012 203842 205306 207394 209882 212455 214813 216798 218413 219734
61287B19734J104J005J097J321J485J453J265R94O25J77j27KN84J223J451J195
$$ 219734 220838 221843 222940 224261 225746 227199 228464 229458 230083 230260 230133 230135 230719 231942 233393 234588
61271B34588Q00N67M22J67r0o0K07K93L3j45J84Q30J251J344J468J777J976J850
$$ 234588 235388 235955 236377 236544 236454 236394 236601 236894 236927 236782 236966 237796 239047 240391 241859 243636 245612 247462
61253B47462J646J723K097K597L215L975M631M790M366L676L041K509J985J446
$$ 247462 249108 250831 252928 255525 258740 262715 267346 272136 276502 280178 283219 285728 287713 289159
61239B89159R45M66o1o33j146j530j842k181k499k645k601k571k680k789k677
$$ 289159 290104 290570 290509 289876 288730 287200 285358 283177 280678 278033 275432 272861 270181 267392 264715
61224B64715k388k158k068k020j959j933j881j614j108n67j66J13L06L70L59M73
$$ 264715 262327 260169 258101 256081 254122 252189 250308 248694 247586 247019 246853 246966 247272 247642 248001 248474
61208B48474P97J170J473J793K169K428K465K454K540K551K277J882J679J645
$$ 248474 249271 250441 251914 253707 255876 258304 260769 263223 265763 268314 270591 272473 274152 275797
61194B75797J475J054N63J50j79l61l16j54j12k15k68j94j41k14l49m86o12o04
$$ 275797 277272 278326 278889 279039 278860 278499 278183 278029 277917 277702 277434 277240 277099 276885 276536 276050 275438 274834
61176B74834l02K04N65N77L96K55K27L21O11J100J623K032K316K511K610K649
$$ 274834 274532 274736 275301 275878 276274 276529 276756 277077 277688 278788 280411 282443 284759 287270 289880 292529
61160B92529K734K859K903K828K726K597K288J775J281R90Q35P05O98R45J342
$$ 292529 295263 298122 301025 303853 306579 309176 311464 313239 314520 315510 316345 317050 317748 318693 320035
61145C20035J689J963K269K615K899L062L099L011K906L033L494L994M084L660
$$ 320035 321724 323687 325956 328571 331470 334532 337631 340642 343548 346581 350075 354069 358153 361813
61131C61813L016K390J718Q65l4o70r38j097j485k126k743l091l218l264l230
$$ 361813 364829 367219 368937 369802 369768 369098 368160 367063 365578 363452 360709 357618 354400 351136 347906
61116C47906l066k908k942l097l122k997k990l205l363l201k827k553k521k695
$$ 347906 344840 341932 338990 335893 332771 329774 326784 323579 320216 317015 314188 311635 309114 306419
61102C06419k991l215l083k484j678j019o13l49j05K64Q84J594J906J559Q92M14
$$ 306419 303428 300213 297130 294646 292968 291949 291336 290987 290882 291146 292030 293624 295530 297089 297981 298395
61086B98395J89j0j33M7L86M60K66L20Q72J480J698J773K245L126L900M282M560
$$ 298395 298584 298574 298441 298488 298874 299334 299600 299920 300792 302272 303970 305743 307988 311114 315014 319296 323856
61069C23856N091N798O344O663P049P744Q616R321R748J0135J0716J1403J1903
$$ 323856 328947 334745 341089 347752 354801 362545 371161 380482 390230 400365 411081 422484 434387
61056D34387J2108J2173J2236J2249J2115J1930J1904J2080J2198J1880J0991
$$ 434387 446495 458668 470904 483153 495268 507198 519102 531182 543380 555260 566251
61045E66251R787Q661P744O821N660M295K938J683M39r35k454l966n196o006o570
$$ 566251 576038 584699 592443 599264 604924 609219 612157 613840 614279 613344 610890 606924 601728 595722 589152
61030E89152p209p972q571q865r123r605j0091j0122r639r015q585q373q315q323
$$ 589152 581943 573971 565400 556535 547412 537807 527716 517594 507955 498940 490355 481982 473667 465344
61016D65344q144p504o559n837n600n491n025m217l437k837k242j552r66o73n57
$$ 465344 457200 449696 443137 437300 431700 426209 421184 416967 413530 410693 408451 406899 405933 405260 404703
61001D04703l16J67P43J271J814K464L088L455L594L851M481N430O515P636Q640
$$ 404703 404387 404554 405297 406568 408382 410846 413934 417389 420983 424834 429315 434745 441260 448896 457536
60986D57536R313R733J0393J1606J2989J3904J4309J4781J5697J6902J8148J9456
$$ 457536 466849 476582 486975 498581 511570 525474 539783 554564 570261 587163 605311 624767
60974F24767K0854K2193K3438K4862K6668K8677L0538L2167L3755L5529L7597
$$ 624767 645621 667814 691252 716114 742782 771459 801997 834164 867919 903448 941045
60963I41045L9991M2708M5845M9631N4266N9651O5542P1900P8995Q7232R7075
$$ 941045 981036 1023744 1069589 1119220 1173486 1233137 1298679 1370579 1449574 1536806 1633881
60952A633881J08984J23051J38831J55907J74618J95804K20131K48313K81842
$$ 1633881 1742865 1865916 2004747 2160654 2335272 2531076 2751207 2999520 3281362
60943C281362L22462L70846M26851M90486N58969O19537O47021O15285N17238
$$ 3281362 3603824 3974670 4401521 4892007 5450976 6070513 6717534 7332819 7850057
60934G850057L75164K29727J16718N1930L3151M8966Q1148J02051P9969l713j39491
$$ 7850057 8225221 8454948 8571666 8623596 8656747 8705713 8786861 8888912 8968881 8965168 8825677
60923H825677k93222m26727n17401n62713n72173n58157n31355m99133m64962
$$ 8825677 8532455 8105728 7588327 7025614 6453441 5895284 5363929 4864796 4399834
60914D399834m29504l92883l55790l18850k82299k46774k13750j84660j60026
$$ 4399834 3970330 3577447 3221657 2902807 2620508 2373734 2159984 1975324 1815298
60905A815298j39604j22854j09015r7221q6964p8125p0477o3534n7063n1246m6165
$$ 1815298 1675694 1552840 1443825 1346604 1259640 1181515 1111038 1047504 990441 939195 893030
60894H93030m1597l7485l4106l1531k9372k7369k5718k4497k3233k1568j9840
$$ 893030 851433 813948 779842 748311 718939 691570 665852 641355 618122 596554 576714
60883E76714j8570j7648j6636j5575j4892j4629j4304j3607j2773j2142j1718
$$ 576714 558144 540496 523860 508285 493393 478764 464460 450853 438080 425938 414220
60872D14220j1247j0539r680q983q704q678q458p895p352p121o963o533n954n558
$$ 414220 402973 392434 382754 373771 365067 356389 347931 340036 332684 325563 318600 312067 306113 300555
60858C00555n280m805m213l908l943l946l733l526l422l163k622k161k170k551
$$ 300555 295275 290470 286257 282349 278406 274460 270727 267201 263779 260616 257994 255833 253663 251112
60844B51112k884k918k671k235j752j435j405j565j744j914k099k221k165j996
$$ 251112 248228 245310 242639 240404 238652 237217 235812 234247 232503 230589 228490 226269 224104 222108
60830B22108j936k084k236k064j520j019j050j577j998j870j439j211j221j103
$$ 222108 220172 218088 215852 213788 212268 211249 210199 208622 206624 204754 203315 202104 200883 199780
60816A99780p89o38p62p82l99J21L67L35L16M05N23O84R41J175J272J345J515
$$ 199780 198991 198353 197591 196809 196410 196531 196898 197233 197549 197954 198477 199161 200102 201277 202549 203894 205409
60799B05409J555J146M26r2j55k7j%J73L98L54r6p32j214j353j225j084j110j268
$$ 205409 206964 208110 208536 208444 208289 208262 208261 208261 208434 208832 209186 209090 208358 207144 205791 204566 203482 202372 201104
60780B01104j446j674k073k570k876k830k598k433k368k289k179k121k104k016
$$ 201104 199658 197984 195911 193341 190465 187635 185037 182604 180236 177947 175768 173647 171543 169527
60766A69527j827j616j425j225j058j032j139j169r56o40m99n78o34n07l56m31
$$ 169527 167700 166084 164659 163434 162376 161344 160205 159036 158080 157440 156941 156363 155729 155222 154866 154435
60750A54435o90q40o63k25K15M20L08K1j36MK42K54M5p4O0K50K85K25J80P3j43
$$ 154435 153745 152905 152242 152017 152232 152652 152960 152981 152845 152849 153091 153345 153390 153316 153376 153626 153911 154136 154316 154389 154246
60729A54246k89k68l27o77j012q61l03R1M7j56k72m05o04o32m07k71m44n87k82
$$ 154246 153957 153689 153362 152685 151673 150812 150509 150600 150647 150491 150219 149814 149210 148578 148171 147900 147456 146869 146587
60710A46587K66M94K66%J0J64J97K5k98o50q09o00j62J26J03qM3K12K99K48J78
$$ 146587 146853 147347 147613 147613 147623 147787 147984 148009 147711 147061 146252 145652 145490 145616 145719 145711 145754 145966 146265 146513 146691
60689A46691K08L35M74N34N30N62O53O48L98K0j94j03J31K29L0l99p93q43m86
$$ 146691 146899 147234 147708 148242 148772 149334 149987 150635 151033 151053 150859 150756 150887 151116 151146 150747 149954 149111 148625
60670A48625J4L30L93L26K22J15J14K83M54M17K67L36P27J128J178P98K18k43
$$ 148625 148639 148969 149362 149688 149910 150025 150139 150422 150876 151293 151560 151896 152623 153751 154929 155727 155945 155702
60652A55702l79k97l57p37j181j347j289j309j408j363j204j175j181q39j83K10
$$ 155702 155323 155026 154669 153932 152751 151404 150115 148806 147398 146035 144831 143656 142475 141636 141453 141663
60636A41663N3k06p6K63L43Q1k93o71r47p82m2P62R58N76K70M33Q28J097J180
$$ 141663 141716 141510 141434 141697 142040 142121 141828 141157 140210 139428 139386 140148 141106 141682 141952 142385 143213 144310 145490
60617A45490J155J071R84R63R55Q42O36L90O0l51o21n60l63l31l68j52K61M26
$$ 145490 146645 147716 148700 149663 150618 151460 152096 152486 152546 152195 151574 151014 150651 150320 149952 149800 150061 150487
60599A50487J43l03o30q55r87q01k14M73Q79Q97O47K73k9o3J15K07R7L3K08M14
$$ 150487 150630 150327 149697 148842 147855 147054 146840 147313 148192 149089 149736 150009 149980 149917 150032 150239 150336 150369 150577 150991
60579A50991L05j37o06q10o74l30l6qj85k82j25J63M00N40N69M07R0j65j99r3
$$ 150991 151296 151159 150553 149743 149069 148739 148703 148695 148510 148228 148103 148266 148666 149206 149775 150182 150272 150107 149908 149815
60559A49815L1K17M64N50L09m3j11J26K87J38p2Q7O45J143J140P23L53K70K24
$$ 149815 149846 150063 150527 151077 151386 151343 151232 151358 151645 151783 151711 151798 152443 153586 154726 155449 155802 156072 156296
60540A56296l9k88r1M98R54R66P62O40N64M12L18M13N36M65L03K92M16M90N60
$$ 156296 156257 155969 155878 156376 157330 158296 159058 159698 160262 160674 160992 161405 161941 162406 162709 163001 163417 163907 164467
60521A64467Q37J261J466J269R10P48Q91J197J510J773K038K434L004L572L879
$$ 164467 165304 166565 168031 169300 170210 170958 171849 173046 174556 176329 178367 180801 183805 187377 191256
60506A91256L877L789L790L739L389K721K014J517J188Q23L72%j86k91m63n94
$$ 191256 195133 198922 202712 206451 209840 212561 214575 216092 217280 218103 218475 218475 218289 217998 217535 216941
60490B16941m06K39J145J964K476K707K885L200L623M006M386M966N757O396O653
$$ 216941 216535 216774 217919 219883 222359 225066 227951 231151 234774 238780 243166 248132 253889 260285 266938
60475B66938O826P306P897Q066P748P357O957O012M211K069L24q77j801k566l122
$$ 266938 273764 281070 288967 297033 304781 312138 319095 325107 329318 331387 331711 330834 329033 326467 323345
60460C23345l565l983m171l883l260k659k156j548p61O2P91J339J578J564J739
$$ 323345 319780 315797 311626 307743 304483 301824 299668 298120 297359 297421 298212 299551 301129 302693 304432
60445C04432K555L945N469O902Q332R737J0899J1833J2840J4055J5197J5846J5748
$$ 304432 306987 310932 316401 323303 331635 341372 352271 364104 376944 390999 406196 422042 437790
60432D37790J4878J3436J1812J0302Q861P431O350N986N940N224L367R13j480
$$ 437790 452668 466104 477916 488218 497079 504510 510860 516846 522786 528010 531377 532290 530810
60419E30810l933o950j0447j3736j6248j7867j8592j8442j7765j7191j7045j6940
$$ 530810 526877 519927 509480 495744 479496 461629 443037 424595 406830 389639 372594 355654
60407C55654j6273j4958j3502j2371j1501j0555r460q471p727p042o204n321m648
$$ 355654 339381 324423 310921 298550 287049 276494 267034 258563 250836 243794 237590 232269 227621
60394B27621m187l692l058k485k236k343k583k653k401j972j655j532j401j131
$$ 227621 223434 219742 216684 214199 211963 209620 207037 204384 201983 200011 198356 196824 195423 194292
60380A94292r21r71j093r85p32p00r26j048q44m92k24q2r0l11n64n00j03J98J64
$$ 194292 193371 192400 191307 190322 189590 188890 187964 186916 186072 185580 185356 185274 185184 184873 184309 183809 183706 183904 184068
60361A84068P0J87L01J23j47j23J35K54J79J88L17K92N8m5J96N32O62O54P35R09
$$ 184068 184138 184325 184626 184749 184602 184479 184614 184868 185047 185235 185552 185844 185902 185857 186053 186585 187247 187901 188636 189545
60341A89545J015J035J040J004Q77P99R76J294J345R55N05N13J001J471J523J286
$$ 189545 190560 191595 192635 193639 194516 195315 196291 197585 198930 199885 200390 200903 201904 203375 204898 206184
60325B06184J134J137J052P83O04Q17J313J645J531J178J040J273J547J448J021
$$ 206184 207318 208455 209507 210290 210894 211711 213024 214669 216200 217378 218418 219691 221238 222686 223707
60310B23707O82O22N67K69j8J19O17J007J098J163J385J585J671J949K609L256
$$ 223707 224389 225011 225578 225847 225829 225948 226565 227572 228670 229833 231218 232803 234474 236423 239032 242288
60294B42288L410L221L242L548L596L010K063J211N43r7p75j469k185k764k879
$$ 242288 245698 248919 252161 255709 259305 262315 264378 265589 266132 266035 265260 263791 261606 258842 255963
60279B55963k464k004j996k286k325k010j813k015k268k147j708j266r16o31n54
$$ 255963 253499 251495 249499 247213 244888 242878 241065 239050 236782 234635 232927 231661 230745 230114 229560
60264B29560p65r34o51p3K43J43O0L56R00J473K101K771L206L260L193L240L215
$$ 229560 228795 227861 227210 227137 227380 227523 227583 227939 228839 230312 232413 235184 238390 241650 244843 248083 251298
60247B51298K922K683K947L591M065M087L739L014J834M74n78j367k452l984n280
$$ 251298 254220 256903 259850 263441 267506 271593 275332 278346 280180 280654 280076 278709 276257 272273 266993
60232B66993n621n128m494m137l991l892l788l618l318k955k709k665k735k765
$$ 266993 261372 256244 251750 247613 243622 239730 235942 232324 229006 226051 223342 220677 217942 215177
60218B15177k639k361k022j725j449j182j055j169j312j098n04J0Rm34r09j097
$$ 215177 212538 210177 208155 206430 204981 203799 202744 201575 200263 199165 198661 198671 198680 198246 197337 196240
60202A96240r36n45j72k4n5k9J57L68N22P06R41J084J067J037J059R89P92O96
$$ 196240 195304 194759 194587 194563 194508 194479 194636 195004 195526 196232 197173 198257 199324 200361 201420 202409 203201 203897
60184B03897Q12R04P75O07O46P59O56L72J71J06L3o2k4K22O25J156J713K008J835
$$ 203897 204709 205613 206388 206995 207641 208400 209056 209428 209599 209705 209738 209676 209652 209874 210499 211655 213368 215376 217211
60165B17211J420J206J354J646J859J957J990K006K077K225K386K569K914L363
$$ 217211 218631 219837 221191 222837 224696 226653 228643 230649 232726 234951 237337 239906 242820 246183
60151B46183L564L328K997K979L143L055K704K473K497K501K335K165K055J780
$$ 246183 249747 253075 256072 259051 262194 265249 267953 270426 272923 275424 277759 279924 281979 283759
60137B83759J224O12K05O2J58L93M28q0r13j387j204q25p69r46r83q87r48j181
$$ 283759 284983 285595 285800 285862 286020 286413 286841 286761 285848 284461 283257 282432 281663 280717 279734 278847 277899 276718
60119B76718j317j239j107j004p80l34J28K33j79q43j263j198r14q40j035j176
$$ 276718 275401 274162 273055 272051 271271 270937 271065 271298 271119 270276 269013 267815 266901 266061 265026 263850
60103B63850j060p84n03k67k12m79q69q80l82J45K48J00P2J20m4l06k36K59P85
$$ 263850 262790 262006 261503 261236 261024 260545 259676 258796 258414 258559 258807 258907 258979 259099 259055 258749 258513 258772 259557
60084B59557R69P86L62j51m60k49L86R67J174J173J263J437J459J234R08O97P41
$$ 259557 260526 261312 261674 261523 261063 260814 261200 262167 263341 264514 265777 267214 268673 269907 270815 271512 272253
60067B72253R71J106R06N35N01J060J856K289K189J864J648J609J699J901K105
$$ 272253 273224 274330 275236 275771 276272 277332 279188 281477 283666 285530 287178 288787 290486 292387 294492
60052B94492K096J781J372J124J040R36P52O35O89Q00P94O43M87M40M65M28K24
$$ 294492 296588 298369 299741 300865 301905 302841 303593 304228 304917 305717 306511 307154 307641 308081 308546 308974 309198
60035C09198p3k66k66k38m20p79j012r51q53j109j785k536k947k916k703k705
$$ 309198 309125 308859 308593 308355 307935 307156 306144 305193 304340 303231 301446 298910 295963 293047 290344 287639
60019B87639l086l578l744l463l046k803k687k527k374k333k278k066j923k177
$$ 287639 284553 280975 277231 273768 270722 267919 265232 262705 260331 257998 255720 253654 251731 249554
60005B49554k608k562j863j131j005j346j571j448j186r49o98m95n40q14r83p70
$$ 249554 246946 244384 242521 241390 240385 239039 237468 236020 234834 233885 233187 232692 232152 231338 230355 229585
59989B29585k86J61M43O94J042J396J510J250P76M10L40M75N96N63L70J25KJ21
$$ 229585 229299 229460 229903 230597 231639 233035 234545 235795 236571 236981 237321 237796 238392 238955 239325 239450 239452 239573
59971B39573L26K49k97j033j518j639j688j914k215k347k302k315k508k671k493
$$ 239573 239899 240148 239851 238818 237300 235661 233973 232059 229844 227497 225195 222880 220372 217701 215208
59956B15208j961j393j072r29p45n22m56n75o15l57N1K51M1m66r52j109q75m86
$$ 215208 213247 211854 210782 209853 209108 208586 208130 207555 206940 206583 206634 206885 206926 206460 205508 204399 203524 203038
59938B03038k52k32k47j74j00p2M1L02N23N13L75L61N36P44Q68R42J008J047J012
$$ 203038 202786 202554 202307 202133 202033 201961 202002 202304 202827 203340 203715 204076 204612 205356 206224 207166 208174 209221 210233
59919B10233Q52N20O6l68o70q32q21n54j60m5m51j050j272r73n06j73M0J75J12
$$ 210233 211085 211605 211671 211303 210633 209801 208980 208426 208266 208221 207770 206720 205448 204475 203969 203796 203836 204011 204123
59900B04123j54l19j24K81N11M48L41M56P26Q43O14J94k6J79N93P38L70k47o13
$$ 204123 203969 203650 203526 203807 204318 204766 205107 205563 206289 207132 207746 207940 207914 208093 208686 209424 209794 209547 208934
59881B08934m96j15J61K22K71N16R05J229J413J537J662J773J918K154K286J958
$$ 208934 208438 208323 208484 208706 208977 209493 210398 211627 213040 214577 216239 218012 219930 222084 224370 226328
59865B26328J135K61k42m39n68n61k12K87N07M41N18R08J247J221J021R72J060
$$ 226328 227463 227724 227482 227043 226475 225914 225702 225989 226496 226937 227455 228363 229610 230831 231852 232824 233884
59848B33884J106J122J190J162Q44L47n9k98m95p04q79r87r46n68J50P76Q39M23
$$ 233884 234990 236112 237302 238464 239308 239655 239596 239298 238803 238099 237220 236233 235287 234719 234869 235645 236484 236907
59830B36907Q6K27P74J460K000K091J622R79P68J115J557J770J937K257K478K306
$$ 236907 236993 237220 237994 239454 241454 243545 245167 246146 246914 248029 249586 251356 253293 255550 258028 260334
59814B60334J908J641J489J241R91J005J173J078O16J05k22m35m98j91M09P89
$$ 260334 262242 263883 265372 266613 267604 268609 269782 270860 271476 271581 271359 270924 270426 270235 270644 271433
59798B71433O43L39M22R54J611K166K537K588K327K138K379K776K704K031J262
$$ 271433 272076 272415 272837 273791 275402 277568 280105 282693 285020 287158 289537 292313 295017 297048 298310
59783B98310P58L04k98o89l94M21J026Q86N6j050j984k383k148j616j362j614
$$ 298310 299068 299372 299074 298385 297991 298412 299438 300324 300380 299330 297346 294963 292815 291199 289837 288223
59767B88223j999k015j646j383j588k059k265j949j381r99r29r27p22k76K10M79
$$ 288223 286224 284209 282563 281180 279592 277533 275268 273319 271938 270939 270010 269083 268361 268085 268295 268774
59751B68774L74k8m46o11n23l90l73m42n16n98p18q55r30q36m64J45O86P71L38
$$ 268774 269148 269120 268674 268063 267540 267150 266777 266335 265819 265221 264503 263648 262718 261882 261418 261563 262249 263020 263358
59732B63358k51n96o65p11r71j470j999k189j787r96m49n57j054j348j235j014
$$ 263358 263107 262511 261846 261135 260164 258694 256695 254506 252719 251723 251274 250717 249663 248315 247080 246066
59716B46066r12q17o06m34m48m62j62M24R56J255J494J851K183K232K001J811
$$ 246066 245154 244337 243731 243297 242849 242387 242225 242649 243605 244860 246354 248205 250388 252620 254621 256432
59700B56432J927K322K789L135L237L082K882K952L352L694L560K993K406K017
$$ 256432 258359 260681 263470 266605 269842 272924 275806 278758 282110 285804 289364 292357 294763 296780
59686B96780J689J291R62Q57R46J146J462J788J855J581J270J188J108O16k24
$$ 296780 298469 299760 300722 301579 302525 303671 305133 306921 308776 310357 311627 312815 313923 314539 314315
59671C14315q46q62m60q7K6o2j63j13J31L68K85k24q75j243j104o02p9K34M02
$$ 314315 313469 312607 312147 312060 312086 312024 311861 311748 311879 312247 312532 312308 311433 310190 309086 308484 308405 308639 309041
59652C09041O87J171J616J766J685J665J875K263K723L171L468L546L537L575
$$ 309041 309728 310899 312515 314281 315966 317631 319506 321769 324492 327663 331131 334677 338214 341789
59638C41789L550L297L003L048L337L239K370J195N22N79Q82Q56L69l39r44j271
$$ 341789 345339 348636 351639 354687 358024 361263 363633 364828 365350 365929 366811 367667 368036 367697 366753 365482
59622C65482j337j318j405j692k160k711l183l418l373l094k619k058j701j816
$$ 365482 364145 362827 361422 359730 357570 354859 351676 348258 344885 341791 339172 337114 335413 333597
59608C33597k245k477k229j686j093m17L61R29J005Q54R98J530K043K259K294
$$ 333597 331352 328875 326646 324960 323867 323450 323811 324740 325745 326599 327597 329127 331170 333429 335723
59593C35723K243J923J193K83m27q15j037j276j637k158k819l528m183m660m838
$$ 335723 337966 339889 341082 341365 340938 340123 339086 337810 336173 334015 331196 327668 323485 318825 313987
59578C13987m707m459m279m104l748l289l043l090l105k884k679k839l260l557
$$ 313987 309280 304821 300542 296438 292690 289401 286358 283268 280163 277279 274600 271761 268501 264944
59564B64944l619l673l818l864l629l191k714k270j950j908k139k323k093j440
$$ 264944 261325 257652 253834 249970 246341 243150 240436 238166 236216 234308 232169 229846 227753 226313
59550B26313p16k97l05n93q70q31l62L13P61P10L15K0J18M85P16N51J19j98j47
$$ 226313 225597 225300 224995 224402 223532 222701 222339 222652 223413 224123 224438 224458 224576 225061 225777 226328 226447 226249 226102
59531B26102J48L16J70q4j07R2R5l68r62j107p39l96n00q30r23p19m97l67j80
$$ 226102 226250 226566 226736 226652 226545 226637 226732 226364 225402 224295 223556 223160 222660 221830 220907 220188 219691 219324 219144
59512B19144O8J47qj55j02M4J18J51J89J14j55m32m76l20j97k01k21j51K4L02
$$ 219144 219212 219359 219351 219196 219094 219138 219256 219407 219596 219710 219555 219123 218647 218327 218130 217929 217708 217557 217581 217883
59492B17883O17Q18Q43Q79J131J488J690J785K142K916L773M323M638N121N921
$$ 217883 218500 219318 220161 221040 222171 223659 225349 227134 229276 232192 235965 240288 244926 250047 255968
59477B55968O629O528N181K856M37j185j734j580j218q28l82O3L17K74L4k22l93
$$ 255968 262597 269125 274306 277162 277599 276414 274680 273100 271882 271054 270672 270735 271052 271326 271360 271138 270745
59460B70745n29p37j017j227j277j322j627k204k739k878k555k022j619j553j769
$$ 270745 270216 269479 268462 267235 265958 264636 263009 260805 258066 255188 252633 250611 248992 247439 245670
59445B45670k000k030j907j806j739j514j057n36j27J30K41J99J24K52N99Q36
$$ 245670 243670 241640 239733 237927 236188 234674 233617 233081 232954 233084 233325 233524 233648 233900 234499 235335
59429B35335P28M84N00Q19J127J195J127J066J016R58J013J299J711J977J927
$$ 235335 236063 236547 237047 237866 238993 240188 241315 242381 243397 244355 245368 246667 248378 250355 252282
59414B52282J625J247Q66M44K2k05o9L35P38R88J127J192J126R26P02N81O15Q68
$$ 252282 253907 255154 256020 256464 256486 256281 256212 256547 257285 258273 259400 260592 261718 262644 263346 263927 264542 265410
59396B65410J377J981K377K400K156J839J590J580J935K425K485J815P45j40o27
$$ 265410 266787 268768 271145 273545 275701 277540 279130 280710 282645 285070 287555 289370 290115 289975 289348
59381B89348q68r66q27m36K0K79K27rj13J25N11O70O03P47J301J871K069K144
$$ 289348 288480 287514 286687 286251 286271 286550 286777 286768 286655 286780 287291 287961 288564 289311 290612 292483 294552 296696
59363B96696K586L380M093M553M952N346N592N799O376P484Q736R540R414Q016
$$ 296696 299282 302662 306755 311308 316260 321606 327198 332997 339373 346857 355593 365133 374547 382563
59349C82563N370K165n65k239l021l257l013k280j221n9R43J299M76j446l647
$$ 382563 387933 390098 389533 387294 384273 381016 378003 375723 374502 374443 375386 376685 377161 375715 372068
59334C72068n331o358o947p149o955o579o221n705m796l692k845k304j751j088
$$ 372068 366737 360379 353432 346283 339328 332749 326528 320823 316027 312335 309490 307186 305435 304347
59320C04347o48o22p08m94K0N33R39J389J910K207K002J477J100J111J287J374
$$ 304347 303699 303077 302369 301875 301895 302428 303367 304756 306666 308873 310875 312352 313452 314563 315850 317224
59304C17224J414J571J755J778J708J818K148K448K572K638K735K778K723K702
$$ 317224 318638 320209 321964 323742 325450 327268 329416 331864 334436 337074 339809 342587 345310 348012
59290C48012K806K998L262L624L902L761L178K560K224K027J711J326J029O94
$$ 348012 350818 353816 357078 360702 364604 368365 371543 374103 376327 378354 380065 381391 382420 383114
59276C83114J17o06j223j751k429l269l962m258m227m126m163m372m595m623m474
$$ 383114 383231 382625 381402 379651 377222 373953 369991 365733 361506 357380 353217 348845 344250 339627 335153
59261C35153m424m615m746m433l803l368l375l512l389l053k849k884k870k440
$$ 335153 330729 326114 321368 316935 313132 309764 306389 302877 299488 296435 293586 290702 287832 285392
59247B85392j606p67k89q6K66J044K130L209M043M413M042K873J293j36j176j969
$$ 285392 283786 283019 282730 282644 282910 283954 286084 289293 293336 297749 301791 304664 305957 305821 304645 302676
59231C02676k636l035k970k496j885j388j062q08n05j03L64Q06J178J525J995
$$ 302676 300040 297005 294035 291539 289654 288266 287204 286396 285891 285788 286152 286958 288136 289661 291656
59216B91656K648L323L789M086M535N194N559N115M138L448L391L493L235K740
$$ 291656 294304 297627 301416 305502 310037 315231 320790 325905 330043 333491 336882 340375 343610 346350
59202C46350K404K216J886J336P46J32o39j540k314k779k961k957k867k813k841
$$ 346350 348754 350970 352856 354192 354938 355070 354431 352891 350577 347798 344837 341880 339013 336200 333359
59187C33359k807k560k216k079k308k760l152l227k911k367j888j614j432j240
$$ 333359 330552 327992 325776 323697 321389 318629 315477 312250 309339 306972 305084 303470 302038 300798
59173C00798j156j298j517j563j411j248j219j331j556j825j949j788j432j130
$$ 300798 299642 298344 296827 295264 293853 292605 291386 290055 288499 286674 284725 282937 281505 280375
59159B80375j024j095j253j402j436j308j065p53m00r8L1K5K2J2j51m20n75o39
$$ 280375 279351 278256 277003 275601 274165 272857 271792 271039 270639 270541 270572 270597 270619 270631 270480 270060 269485 268846
59141B68846q98j317j387q83l32l42p19q28n25k18j25j8K71O01Q24R33Q72N42
$$ 268846 267948 266631 265244 264361 264029 263687 262968 262140 261615 261397 261272 261254 261525 262126 262950 263883 264755 265297
59123B65297M7l48n57o72o98n61l63l07m04n15o44q41r77q95p45p51p97o18l15
$$ 265297 265344 264996 264439 263767 263069 262508 262145 261838 261434 260919 260275 259434 258457 257562 256817 256066 255269 254651 254336
59104B54336j85j58Q3M10L47j43n18n03m91q51j362j618j567j336r61n63m83q70
$$ 254336 254151 253993 254076 254486 254833 254690 254172 253669 253178 252327 250965 249347 247780 246444 245483 244920 244437 243567
59086B43567j385j646j666j648j605j478j346j273j154r35q13r08j038r51o57
$$ 243567 242182 240536 238870 237222 235617 234139 232793 231520 230366 229431 228618 227710 226672 225721 225064
59071B25064k92R7M50O16O21P50J152J585J794J905K141K457K725L063L627M201
$$ 225064 224772 224869 225319 225935 226556 227306 228458 230043 231837 233742 235883 238340 241065 244128 247755 251956
59055B51956M425M277M029L776L379K820K349K150K137K111J974J797J678J561
$$ 251956 256381 260658 264687 268463 271842 274662 277011 279161 281298 283409 285383 287180 288858 290419
59041B90419J199M39m17q37p19n44o90r20q47n81n29p05p62n86n04p44j133j394
$$ 290419 291618 292057 291640 290803 290084 289540 288850 287930 287083 286502 285973 285268 284506 283920 283416 282672 281539 280145
59023B80145j449j392j329j381j642k029k327k406k335k210k079j979j966j991
$$ 280145 278696 277304 275975 274594 272952 270923 268596 266190 263855 261645 259566 257587 255621 253630
59009B53630j888j579j217j043j124j269j225r63p32q04j158j503j606j479j253
$$ 253630 251742 250163 248946 247903 246779 245510 244285 243322 242590 241786 240628 239125 237519 236040 234787
58994B34787j008p91o55n95n50n13n50o29n78l27k3J81L28N15O65O19L89J74J62
$$ 234787 233779 232988 232333 231738 231188 230675 230125 229496 228918 228591 228568 228749 229077 229592 230257 230876 231265 231439 231601
58975B31601L78P17J007J117J034Q62P40Q03J157J788K493L047L382L518L389
$$ 231601 231979 232696 233703 234820 235854 236716 237456 238259 239416 241204 243697 246744 250126 253644 257033
58960B57033L001K646K652K895K923K549K017J504R48M24K44M28M70J5o27r66
$$ 257033 260034 262680 265332 268227 271150 273699 275716 277220 278168 278592 278836 279264 279734 279749 279122 278156
58944B78156r83r26p11j08P03J216J243J058R12Q05O99O41O07N47N29O17O75N15
$$ 278156 277173 276247 275536 275428 276131 277347 278590 279648 280560 281365 282064 282705 283312 283859 284388 285005 285680 286195
58926B86195K34N9k2j49j91J28P08J115J265J622K510L572M180M215M098M196
$$ 286195 286429 286488 286466 286317 286126 286254 286962 288077 289342 290964 293474 297046 301226 305441 309539 313735
58910C13735M433M493M225L806L518L449L370K995K260J373N88M6k88n66r46j438
$$ 313735 318168 322661 326886 330692 334210 337659 341029 344024 346284 347657 348245 348291 348003 347437 346491 345053
58894C45053j909k289k687l196l720m126m431m684m762m525m087l753l663l685
$$ 345053 343144 340855 338168 334972 331252 327126 322695 318011 313249 308724 304637 300884 297221 293536
58880B93536l584l203k488j608r02n88n16m18l11m03o40o63l23N0M1l50p43q14
$$ 293536 289952 286749 284261 282653 281751 281163 280647 280229 279918 279515 278875 278212 277889 277939 277980 277630 276887 276073
58862B76073n69k42m2QNL2J01K19M36P49J058J278J443J628J826K014K224K523
$$ 276073 275504 275262 275220 275228 275233 275265 275366 275585 276021 276770 277828 279106 280549 282177 284003 286017 288241 290764
58844B90764K950L544M256M826M917M482L883L497L378L414L609M008M495M884
$$ 290764 293714 297258 301514 306340 311257 315739 319622 323119 326497 329911 333520 337528 342023 346907
58830C46907N125N262N293N267N316N416N281M701L868L154K676K346K141K017
$$ 346907 352032 357294 362587 367854 373170 378586 383867 388568 392436 395590 398266 400612 402753 404770
58816D04770J698R11j60r84j268j172r85q33p63q64j218j808k478k915k908k703
$$ 404770 406468 407379 407219 406235 404967 403795 402810 401977 401214 400350 399132 397324 394846 391931 389023 386320
58800C86320k859l540m225m391m228m276m633n003n266n484n478n039m492m427
$$ 386320 383461 379921 375696 371305 367077 362801 358168 353165 347899 342415 336937 331898 327406 322979
58786C22979m836n106m964m758m649m249l404k675k573k809k816k624k602k678
$$ 322979 318143 313037 308073 303315 298666 294417 291013 288338 285765 282956 280140 277516 274914 272236
58772B72236k432j834j298j006p04k62N3Kk48l34j00L66Q93J242J214Q58N37N77
$$ 272236 269804 267970 266672 265666 264962 264700 264753 264755 264507 264173 264073 264439 265332 266574 267788 268646 269183 269760
58754B69760Q91J073Q80M68J28m8k04m62q66j431k091k524k339j615r77r73j416
$$ 269760 270651 271724 272604 273072 273200 273152 272948 272486 271620 270189 268098 265574 263235 261620 260643 259670 258254
58737B58254j696j583j427j546j755j648j120m59k3N2j34l23k48K18R46J584J772
$$ 258254 256558 254975 253548 252002 250247 248599 247479 247020 246997 247049 246915 246592 246344 246562 247508 249092 250864
58720B50864J496J213J423K051K486K290J676J102O66J94l15o82r00j127j399
$$ 250864 252360 253573 254996 257047 259533 261823 263499 264601 265267 265461 265146 264464 263564 262437 261038
58705B61038j634j881k227k544k631k595k690k818k602j993j399j151j146j162
$$ 261038 259404 257523 255296 252752 250121 247526 244836 242018 239416 237423 236024 234873 233727 232565
58691B32565j150j119r83p43n59m94l84q1L78Q79J315J527J434J228J222J414
$$ 232565 231415 230296 229313 228570 228011 227517 227133 227052 227430 228309 229624 231151 232585 233813 235035 236449
58675B36449J547J523J499J507J409J310J541K034K210J730J003O65Q20J153J463
$$ 236449 237996 239519 241018 242525 243934 245244 246785 248819 251029 252759 253762 254427 255247 256400 257863
58660B57863J760K042K307K628K943K963K527J910J467J167P71K69k04p24j482
$$ 257863 259623 261665 263972 266600 269543 272506 275033 276943 278410 279577 280348 280617 280413 279689 278207
58645B78207k398l167l758m405n137n613n651n576n841o378o637o230n360m528
$$ 278207 275809 272642 268884 264479 259342 253729 248078 242502 236661 230283 223646 217416 212056 207528
58631B07528l932l398k786k282k132k276k400k257j809j172n76k78k77k52lK01
$$ 207528 203596 200198 197412 195130 192998 190722 188322 186065 184256 183084 182508 182230 181953 181701 181698 181899
58615A81899qm75o76m34l1L39P57J168J325J336J739K652L356L137K221J431J088
$$ 181899 181891 181416 180740 180306 180275 180614 181371 182539 183864 185200 186939 189591 192947 196084 198305 199736 200824
58598B00824Q11K16n78j246j653j857j911j830j657j527j603j876k048j812j251
$$ 200824 201635 201851 201273 200027 198374 196517 194606 192776 191119 189592 187989 186113 184065 182253 181002
58583A81002q31q30j005r69o96m75m73n46m68k11K3J9j90l42k69r4j1K3Q9N7j40
$$ 181002 180171 179341 178336 177367 176671 176196 175723 175177 174709 174498 174521 174540 174350 174008 173739 173645 173634 173657 173746 173803 173663
58562A73663j22N18J435J795J410J044J276J683J591J109Q76J065J269J214J042
$$ 173663 173541 174059 175494 177289 178699 179743 181019 182702 184293 185402 186278 187343 188612 189826 190868
58547A90868R32R17J012J210J309J124Q25P83J004J130R55O76N07L99K62K27N01
$$ 190868 191800 192717 193729 194939 196248 197372 198197 198980 199984 201114 202069 202745 203252 203651 203913 204140 204641
58530B04641J072J694K128K296K276K211K248K457K789L111L301L344L255L024
$$ 204641 205713 207407 209535 211831 214107 216318 218566 221023 223812 226923 230224 233568 236823 239847
58516B39847K683K443K530K880L163L255L399L767M184M537N092O004O802O965
$$ 239847 242530 244973 247503 250383 253546 256801 260200 263967 268151 272688 277780 283784 290586 297551
58502B97551O770O934P524P850P462O565N376L841K191J043N68J67o28j474j880
$$ 297551 304321 311255 318779 326629 334091 340656 346032 349873 352064 353107 353675 353842 353214 351740 349860
58487C49860j991k205k513k713k964l539m343n083n726o322o701o741o703o823
$$ 349860 347869 345664 343151 340438 337474 333935 329592 324509 318783 312461 305760 299019 292316 285493
58473B85493o868o479n772n169m794m503m225l930l427k689k146k210k595k648
$$ 285493 278625 272146 266374 261205 256411 251908 247683 243753 240326 237637 235491 233281 230686 228038
58459B28038k195j666j409j343j286j252j298j389j455j465j430j382j279r35
$$ 228038 225843 224177 222768 221425 220139 218887 217589 216200 214745 213280 211850 210468 209189 208254
58445B08254k82L35M37R3j29PJ29L9J31O59J142J098Q53R97J446J668J586J614
$$ 208254 207972 208307 208744 208837 208708 208715 208844 208883 209014 209673 210815 211913 212766 213763 215209 216877 218463 220077
58427B20077J910K272K619L057L526L833L991M105M110L981L993M302M509M113
$$ 220077 221987 224259 226878 229935 233461 237294 241285 245390 249500 253481 257474 261776 266285 270398
58413B70398L225K311J484N57l85j084j585k067k352k158j715j482j386r39r5
$$ 270398 273623 275934 277418 277975 277590 276506 274921 272854 270502 268344 266629 265147 263761 262822 262727
58398B62727O72J112J428J743J926K006K245K607K662K139J239K94n02j089j540
$$ 262727 263399 264511 265939 267682 269608 271614 273859 276466 279128 281267 282506 282800 282298 281209 279669
58383B79669k079k774l304l337k996k595k154j602j197j191j320j159q00n79l51
$$ 279669 277590 274816 271512 268175 265179 262584 260430 258828 257631 256440 255120 253961 253161 252582 252231
58368B52231K85J149J625J583J487J521J362Q81M05J41j01m27o72q26j162j719
$$ 252231 252516 253665 255290 256873 258360 259881 261243 262124 262529 262670 262569 262142 261470 260644 259482 257763
58352B57763k147k179j927j596j317j233j391j527j328r23o71n43j98L76P89Q30
$$ 257763 255616 253437 251510 249914 248597 247364 245973 244446 243118 242195 241524 240981 240783 241159 241948 242778
58336B42778O84N81O28Q86J229J277Q94O08R31J523J638J240R66J074J173R50
$$ 242778 243462 244043 244671 245557 246786 248063 248957 249565 250496 252019 253657 254897 255863 256937 258110 259060
58320B59060N57J62k02l35k8M86P89R42J315J840K118K164K368K772L072L286
$$ 259060 259617 259779 259577 259242 259214 259700 260489 261431 262746 264586 266704 268868 271236 274008 277080 280366
58304B80366L692M124M108L670L277L014K581K087J948K050J854J391J272J577
$$ 280366 284058 288182 292290 295960 299237 302251 304832 306919 308867 310917 312771 314162 315434 317011
58290C17011J690J335R46Q40Q23Q82J334K103K631K784L001L437L695L670L815
$$ 317011 318701 320036 320982 321822 322645 323527 324861 326964 329595 332379 335380 338817 342512 346182 349997
58275C49997M304M725M837M850M749M223L427K984L027L035K859K976L478L673
$$ 349997 354301 359026 363863 368713 373462 377685 381112 384096 387123 390158 393017 395993 399471 403144
58261D03144L123K225J515J098J059J550K288K718K960L679M831N541N432N144
$$ 403144 406267 408492 410007 411105 412164 413714 416002 418720 421680 425359 430190 435731 441163 446307
58247D46307N190N277N157N149N441N721N905O366P078P461P377P419P870Q296
$$ 446307 451497 456774 461931 467080 472521 478242 484147 490513 497591 505052 512429 519848 527718 536014
58233E36014Q445Q655R046R270R318R600J0046J0117R905J0140J0906J1512J1782
$$ 536014 544459 553114 562160 571430 580748 590348 600394 610511 620416 630556 641462 652974 664756
58220F64756J2251J2945J3305J3553J4586J6254J7296J7365J7569J8535J9610
$$ 664756 677007 689952 703257 716810 731396 747650 764946 782311 799880 818415 838025
58209H38025K0488K1852K3778K5259K6098K7526L0035L2361L3589L4568L6111
$$ 838025 858513 880365 904143 929402 955500 983026 1013061 1045422 1079011 1113579 1149690
58198A149690L7615L8563L9791M1868M3827M4896M6047M8420N1497N4179N6483
$$ 1149690 1187305 1225868 1265659 1307527 1351354 1396250 1442297 1490717 1542214 1596393 1652876
58187A652876N8952O1598O4517O8322P2927P7205Q0744Q4608Q9495R4787J00207
$$ 1652876 1711828 1773426 1837943 1906265 1979192 2056397 2137141 2221749 2311244 2406031 2506238
58176B506238J06590J14055J21406J28403J36616J46888J58011J69049J80728
$$ 2506238 2612828 2726883 2848289 2976692 3113308 3260196 3418207 3587256 3767984
58167C767984J93371K05842K17884K31000K45667K60340K74652K90673L09471
$$ 3767984 3961355 4167197 4385081 4616081 4861748 5122088 5396740 5687413 5996884
58158E996884L29529L50367L74366M03038M34908M69242N08054N52134N99148
$$ 5996884 6326413 6676780 7051146 7454184 7889092 8358334 8866388 9418522 10017670
58149A0017670O48396P03370P66976Q39052R21592J020919J140646J277838J430284
$$ 10017670 10666066 11369436 12136412 12975464 13897056 14917975 16058621 17336459 18766743
58140A8766743J601892J797191K018146K271390K569850K920857L321933L774096
$$ 18766743 20368635 22165826 24183972 26455362 29025212 31946069 35268002 39042098
58132C9042098M286524M863949N515383O286072P221599Q212335Q864644Q623773
$$ 39042098 43328622 48192571 53707954 59994026 67215625 75427960 84292604 92916377
58124I2916377P136758M541728J406663j606474m040079n715645o655839o995754
$$ 92916377 100053135 104594863 106001526 104395052 100354973 94639328 87983489 80987735
58116H0987735o923315o623762o233029n824605n423987n027300m618932m190955
$$ 80987735 74064420 67440658 61207629 55383024 49959037 44931737 40312805 36121850
58108C6121850l753030l324485k921626k555176k232645j955902j719149j514353
$$ 36121850 32368820 29044335 26122709 23567533 21334888 19378986 17659837 16145484
58100A6145484j337187j185223j054208r40038q41792p59126o88974o27695n74108
$$ 16145484 14808297 13623074 12568866 11628828 10787036 10027910 9338936 8711241 8137133
58091H137133n27566m85422m45384m08243l75514l46220l18588k93073k70902
$$ 8137133 7609567 7124145 6678761 6270518 5895004 5548784 5230196 4937123 4666221
58082D666221k51248k32394k14516j98951j85760j74029j63586j54590j46322
$$ 4666221 4414973 4182579 3968063 3769112 3583352 3409323 3245737 3091147 2944825
58073B944825j38022j30049j22901j16082j09159j02737r7239r1947q6405q1434
$$ 2944825 2806803 2676754 2553853 2437771 2328612 2225875 2128636 2036689 1950284 1868850
58063A868850p7607p4024o9866o5762o2455n9479n6416n3989n2583n1055m8493
$$ 1868850 1791243 1717219 1647353 1581591 1519136 1459657 1403241 1349252 1296669 1245614 1197121
58052A197121m5863m4394m3509m1925l9759l7944l6501l4904l3398l2511l1881
$$ 1197121 1151258 1106864 1063355 1021430 981671 943727 907226 872322 838924 806413 774532
58041G74532l0839k9569k8513k7340k5638k3888k2690k1679k0260j8715j7534
$$ 774532 743693 714124 685611 658271 632633 608745 586055 564376 544116 525401 507867
58030E07867j6396j4874j3433j2659j2188j1391j0475r964r706r389r314r670
$$ 507867 491471 476597 463164 450505 438317 426926 416451 406487 396781 387392 378078 368408
58018C68408r778r033p944p273o865o294n894o030o124n483m595m375m729m903
$$ 368408 358630 349597 341653 334380 327515 321221 315327 309297 303173 297690 293095 288720 283991 279088
58004B79088m805m885n088n030m791m691m569m211l985m224m442m082l521l436
$$ 279088 274283 269398 264310 259280 254489 249798 245229 241018 237033 232809 228367 224285 220764 217328
57990B17328l633l506l119k926k825k502k238k443k744k554k120k064k265k202
$$ 217328 213695 210189 207070 204144 201319 198817 196579 194136 191392 188838 186718 184654 182389 180187
57976A80187k013k179k468k281j772j634j933k191k368k765l143k983k516k464
$$ 180187 178174 175995 173527 171246 169474 167840 165907 163716 161348 158583 155440 152457 149941 147477
57962A47477k808k807k227j590j224r38p05p83j050j037p31n76o42n22j36P1j17
$$ 147477 144669 141862 139635 138045 136821 135883 135178 134395 133345 132308 131577 131001 130359 129837 129701 129772 129655
57945A29655m16o02p21o68k28L66N02K7n18o12l05M1J20k20q87j512j835k017
$$ 129655 129239 128637 127916 127248 127020 127386 127888 127915 127397 126785 126480 126521 126641 126421 125534 124022 122187 120170
57927A20170k300k545k504k301k190k063j692j240j018r61q43p82r68j139r20
$$ 120170 117870 115325 112821 110520 108330 106267 104575 103335 102317 101356 100513 99731 98763 97624 96704
57912I6704m57p9L23R46J365J043L28J17M98O63J79m21n64l55j55m2Jj40n10r35
$$ 96704 96247 96168 96491 97437 98802 99845 100173 100290 100788 101451 101630 101209 100645 100290 100135 100093 100094 99954 99444 98509
57892I8509j234j323j140p59m98n28n50k76rk18o79p19j99M12Q81J402J924K012
$$ 98509 97275 95952 94812 94053 93555 93027 92477 92201 92192 91974 91295 90576 90377 90789 91670 93072 94996 97008
57874I7008J557J074R77J072R50N22%l52m02l30n54j176j676j608j323j452j860
$$ 97008 98565 99639 100616 101688 102638 103160 103160 102808 102406 102076 101522 100346 98670 97062 95739 94287 92427
57857I2427j835j275q84j106j513j499j013l83Q5J79j58o35q60q11p44o78m36
$$ 92427 90592 89317 88433 87327 85814 84315 83302 82919 83004 83183 83025 82390 81530 80719 79975 79297 78861
57840G8861j31r1k84m23n70j055j697j821j194l79Q5K47L33L33K60L14N21N91
$$ 78861 78730 78639 78355 77932 77362 76307 74610 72789 71595 71216 71301 71548 71881 72214 72474 72788 73309 73900
57822G3900M04J91O8j37m52o04m85l36k84j47J48M01N99J017J638J993J845J553
$$ 73900 74304 74495 74563 74426 73974 73370 72885 72549 72265 72118 72266 72667 73266 74283 75921 77914 79759 81312
57804H1312J459J373J035O37M67M77M94N93Q78J172J267J202J051P05J50l45n66
$$ 81312 82771 84144 85179 85816 86283 86760 87254 87847 88725 89897 91164 92366 93417 94122 94272 93927 93361
57787I3361o62q36j020j073j071j078r51n94k09k6n1k07m66o75o14m14m91q80
$$ 93361 92699 91863 90843 89770 88699 87621 86670 86076 85867 85841 85790 85583 85117 84442 83828 83414 82923 82043
57769H2043r98m93J72L78K15J87L46L10L7q7R2K34P3j73j41J75M22K57l28j002
$$ 82043 81045 80552 80724 81102 81317 81504 81850 82160 82197 82110 82202 82436 82509 82336 82195 82370 82792 83049 82721 81719
57749H1719j367j345j261j456j893k251k329k233k127j980j618j011m46l13o47
$$ 81719 80352 79007 77746 76290 74397 72146 69817 67584 65457 63477 61859 60848 60402 60089 59442
57734E9442j011r93o89n13o48q86j011j005q84o59m83n23o30m48O2N23O37M86
$$ 59442 58431 57438 56749 56236 55588 54702 53691 52686 51802 51143 50660 50137 49507 49059 49121 49644 50281 50767
57716E0767K41l3k15q4K99N34L72Ll47p24j143j331j111p88p71j033j257j283
$$ 50767 51008 50975 50760 50676 50975 51509 51881 51884 51537 50813 49670 48339 47228 46440 45669 44636 43379 42096
57698D2096j127p58k04K28L00K52N60J256J866K033J925J928K167K449K515K281
$$ 42096 40969 40211 40007 40235 40535 40787 41347 42603 44469 46502 48427 50355 52522 54971 57486 59767
57682E9767J913J668J650J733J761J715J615J376R15L17j98m52m02j36J21J66
$$ 59767 61680 63348 64998 66731 68492 70207 71822 73198 74113 74430 74232 73780 73378 73242 73363 73529
57666G3529J3j47k51m45q00j119j173j006q33p69q11r53j153j275j230j124j110
$$ 73529 73542 73395 73144 72699 71899 70780 69607 68601 67768 66999 66188 65235 64082 62807 61577 60453 59343
57649E9343j176j180j044q23n83l50j44l3j14l87o67p13n49m96p01p83l28L96
$$ 59343 58167 56987 55943 55120 54537 54187 54043 54010 53896 53509 52842 52129 51580 51084 50383 49600 49272 49668
57631D9668O51K10l10k84J87O25Q87J132J366J410J278J217J429J905K526L113
$$ 49668 50319 50529 50219 49935 50122 50747 51634 52766 54132 55542 56820 58037 59466 61371 63897 67010
57615F7010L513L782M170M821N575O311P224Q523R947J0840J0643R100O173K150
$$ 67010 70523 74305 78475 83296 88871 95182 102406 110929 120876 131716 142359 151459 157632 159782
57601A59782k175n793q166r460j0074j0194r880r360q951q706q309p421o110m831
$$ 159782 157607 151814 143648 134188 124114 113920 104040 94680 85729 77023 68714 61293 55183 50352
57587E0352l953l386k782k059j509j348j369j201p59l19j38j98l29m26m83m61
$$ 50352 46399 43013 40231 38172 36663 35315 33946 32745 31986 31667 31529 31331 31002 30576 30093 29632
57571B9632k45J52M14J50n90j229j273r18p77j115j613j908j962j856j635j454
$$ 29632 29387 29539 29953 30103 29513 28284 27011 26093 25316 24201 22588 20680 18718 16862 15227 13773
57555A3773j587j989k198j895j373j124j166j130D02d40j193j718j964j723j185
$$ 13773 12186 10197 7999 6104 4731 3607 2441 1311 402 -440 -1633 -3351 -5315 -7038 -8223
57540h223o48k86j30j31k03k41k35l31o60j045j072n70Q6L70J92j42m22o58q33
$$ -8223 -8871 -9157 -9287 -9418 -9621 -9862 -10097 -10428 -11088 -12133 -13205 -13775 -13689 -13319 -13127 -13269 -13691 -14349 -15182
57521a5182q43p87r01j179j368j385j436j591j629j454j268j209j157j093j296
$$ -15182 -16025 -16812 -17713 -18892 -20260 -21645 -23081 -24672 -26301 -27755 -29023 -30232 -31389 -32482 -33778
57506c3778j826k214k048j604j437j572j532j094n64k74k07j55l9Q0R0q0l76n90
$$ -33778 -35604 -37818 -39866 -41470 -42907 -44479 -46011 -47105 -47669 -47943 -48150 -48305 -48344 -48264 -48174 -48254 -48630 -49220
57488d9220n86m44l20k22n2J57L13M43O69R68J124R53N22J19K2K33M53M01J13
$$ -49220 -49806 -50250 -50570 -50792 -50844 -50687 -50374 -49931 -49262 -48294 -47170 -46217 -45695 -45576 -45554 -45321 -44868 -44467 -44354
57469d4354j77m06o89r75j026q29p29r68j343j568j681j853k033k098k156k414
$$ -44354 -44531 -44937 -45626 -46601 -47627 -48456 -49185 -50153 -51496 -53064 -54745 -56598 -58631 -60729 -62885 -65299
57453f5299k795l006k936k739k524k241j851j427j077q53p53o99n85l98k54k66
$$ -65299 -68094 -71100 -74036 -76775 -79299 -81540 -83391 -84818 -85895 -86748 -87501 -88200 -88785 -89183 -89437 -89703
57437h9703m51p50r92r03l79K33M06R9k01k02j65l57n40l96r7o5l39n78n92m64
$$ -89703 -90154 -90904 -91896 -92799 -93178 -92945 -92539 -92440 -92641 -92843 -93008 -93365 -93905 -94301 -94398 -94463 -94802 -95380 -95972 -96436
57417i6436l03j66j96m81q02q57o26l37j18M5J00n3l95q32j273j571j532j230
$$ -96436 -96739 -96905 -97101 -97582 -98384 -99241 -99867 -100204 -100322 -100277 -100177 -100230 -100625 -101457 -102730 -104301 -105833 -107063
57399a07063j059j197j291j026p11q18j207j335j132j034j193j253j049r17j087
$$ -107063 -108122 -109319 -110610 -111636 -112347 -113165 -114372 -115707 -116839 -117873 -119066 -120319 -121368 -122285 -123372
57384a23372j276j167r23q65r19p57l06J67M21M32K85O8j12j25P5L53M45J93k35
$$ -123372 -124648 -125815 -126738 -127603 -128522 -129279 -129585 -129418 -128997 -128565 -128280 -128212 -128324 -128449 -128374 -128021 -127576 -127383 -127618
57365a27618m69l53j39j76n17r55j316j526j550j446j371j392j337j080q04p49
$$ -127618 -128087 -128440 -128579 -128755 -129272 -130227 -131543 -133069 -134619 -136065 -137436 -138828 -140165 -141245 -142049 -142798
57349a42798q45q86r33j193j549j626j345j052j027j164j231j209j231j387j650
$$ -142798 -143643 -144529 -145462 -146655 -148204 -149830 -151175 -152227 -153254 -154418 -155649 -156858 -158089 -159476 -161126
57334a61126j899j937j689j368j304j541j836j973j955j870j768j721j755j789
$$ -161126 -163025 -164962 -166651 -168019 -169323 -170864 -172700 -174673 -176628 -178498 -180266 -181987 -183742 -185531
57320a85531j745j738j914k164k203j947j611j419j438j677k116k560k721k497
$$ -185531 -187276 -189014 -190928 -193092 -195295 -197242 -198853 -200272 -201710 -203387 -205503 -208063 -210784 -213281
57306b13281k061j631j308j144j184j398j640j738j569j172q44r82j647k399k763
$$ -213281 -215342 -216973 -218281 -219425 -220609 -222007 -223647 -225385 -226954 -228126 -228970 -229952 -231599 -233998 -236761
57291b36761k713k519k299j978j608j376j370j543j857k248k529k577k545k640
$$ -236761 -239474 -241993 -244292 -246270 -247878 -249254 -250624 -252167 -254024 -256272 -258801 -261378 -263923 -266563
57277b66563k797k826k752k784k962l119l081k790k336k062k304k869l079k689
$$ -266563 -269360 -272186 -274938 -277722 -280684 -283803 -286884 -289674 -292010 -294072 -296376 -299245 -302324 -305013
57263c05013k337k624l114k973k216j630j554j616j612j812k305k757k989l200
$$ -305013 -307350 -309974 -313088 -316061 -318277 -319907 -321461 -323077 -324689 -326501 -328806 -331563 -334552 -337752
57249c37752l399l321l054l058l355l389k961k640k827l115l036k823k903l185
$$ -337752 -341151 -344472 -347526 -350584 -353939 -357328 -360289 -362929 -365756 -368871 -371907 -374730 -377633 -380818
57235c80818l367l521l766l794l300k608k287k364k466k505k653k805k638k179
$$ -380818 -384185 -387706 -391472 -395266 -398566 -401174 -403461 -405825 -408291 -410796 -413449 -416254 -418892 -421071
57221d21071j801j660j517j124n02K21Q98J360J549J615J654J495R51K04l98q36
$$ -421071 -422872 -424532 -426049 -427173 -427675 -427454 -426556 -425196 -423647 -422032 -420378 -418883 -417932 -417728 -418126 -418962
57205d18962j379k089k686k943k987l120l481l931m232m276m198m183m196m096
$$ -418962 -420341 -422430 -425116 -428059 -431046 -434166 -437647 -441578 -445810 -450086 -454284 -458467 -462663 -466759
57191d66759l974m121m573m983n068m955m908m961m989m926m731m380m047m052
$$ -466759 -470733 -474854 -479427 -484410 -489478 -494433 -499341 -504302 -509291 -514217 -518948 -523328 -527375 -531427
57177e31427m410m735m797m869n292n917o353o526o662o868p079p315p650p997
$$ -531427 -535837 -540572 -545369 -550238 -555530 -561447 -567800 -574326 -580988 -587856 -594935 -602250 -609900 -617897
57163f17897q185q275q493q924r405r693r623r176q569q139q031q062q015p855
$$ -617897 -626082 -634357 -642850 -651774 -661179 -670872 -680495 -689671 -698240 -706379 -714410 -722472 -730487 -738342
57149g38342p635p365p146p126p224p132o815o681o996p511p900q250q742r152
$$ -738342 -745977 -753342 -760488 -767614 -774838 -781970 -788785 -795466 -802462 -809973 -817873 -826123 -834865 -844017
57135h44017r191r099r397j0152j1008j1817j2773j3912j4992j5861j6594j7182
$$ -844017 -853208 -862307 -871704 -881856 -892864 -904681 -917454 -931366 -946358 -962219 -978813 -995995
57123i95995j7457j7455j7432j7464j7351j7047j6858j7064j7619j8354j9210
$$ -995995 -1013452 -1030907 -1048339 -1065803 -1083154 -1100201 -1117059 -1134123 -1151742 -1170096 -1189306
57112a189306k0084k0684k0793k0589k0507k0832k1513k2412k3523k4967k6758
$$ -1189306 -1209390 -1230074 -1250867 -1271456 -1291963 -1312795 -1334308 -1356720 -1380243 -1405210 -1431968
57101a431968k8697l0506l2101l3662l5433l7482l9665m1823m3992m6503m9753
$$ -1431968 -1460665 -1491171 -1523272 -1556934 -1592367 -1629849 -1669514 -1711337 -1755329 -1801832 -1851585
57090a851585n3862n8565o3630o9242p5698q2795q9903r6714j03632j11198j19437
$$ -1851585 -1905447 -1964012 -2027642 -2096884 -2172582 -2255377 -2345280 -2441994 -2545626 -2656824 -2776261
57079b776261j27979j36604j45392j54550j64288j74765j86011j98002k10891
$$ -2776261 -2904240 -3040844 -3186236 -3340786 -3505074 -3679839 -3865850 -4063852 -4274743
57070d274743k24928k40100k56116k72900k90927l10813l32883l57279l84266
$$ -4274743 -4499671 -4739771 -4995887 -5268787 -5559714 -5870527 -6203410 -6560689 -6944955
57061f944955m14088m46804m82550n21904n65692o14645o69543p31606q02451
$$ -6944955 -7359043 -7805847 -8288397 -8810301 -9375993 -9990638 -10660181 -11391787 -12194238
57052a2194238q83744r77203j084925j209441j353366j519184j709504j927656
$$ -12194238 -13077982 -14055185 -15140110 -16349551 -17702917 -19222101 -20931605 -22859261
57044b2859261k178402k468554k807249l205714l676749m234303m893118n667962
$$ -22859261 -25037663 -27506217 -30313466 -33519180 -37195929 -41430232 -46323350 -51991312
57036e1991312o572086p615361q802956j0135164j1608641j3218586j4959183
$$ -51991312 -58563398 -66178759 -74981715 -85116879 -96725520 -109944106 -124903289
57029a24903289j6816798j8754640k0700483k2553968k4207193k5540608k6369410
$$ -124903289 -141720087 -160474727 -181175210 -203729178 -227936371 -253476979 -279846389
57022b79846389k6387969k5211548k2552527j8425409j3209184p501860j878237
$$ -279846389 -306234358 -331445906 -353998433 -372423842 -385633026 -393134886 -395013123
57015c95013123L277514P792395J1634154J4835600J7448641J9521600K1091569
$$ -395013123 -391735609 -383943214 -372309060 -357473460 -340024819 -320503219 -299411650
57008b99411650K2187379K2832241K3038810K2806425K2134292K1045962J9605523
$$ -299411650 -277224271 -254392030 -231353220 -208546795 -186412503 -165366541 -145761018
57001a45761018J7913392J6086854J4237561J2454710J0798094R300920P977234
$$ -145761018 -127847626 -111760772 -97523211 -85068501 -74270407 -64969487 -56992253
56994e6992253O827871N843676N008667M303971L710647L210895K788963K432049
$$ -56992253 -50164382 -44320706 -39312039 -35008068 -31297421 -28086526 -25297563 -22865514
56986b2865514K130052J874374J657249J471943J312807J175029J054708R49136
$$ -22865514 -20735462 -18861088 -17203839 -15731896 -14419089 -13244060 -12189352 -11240216
56978a1240216Q56527P75413P04452O42390N87781N38893M94301M53397M16068
$$ -11240216 -10383689 -9608276 -8903824 -8261434 -7673653 -7134760 -6640459 -6187062 -5770994
56969e770994L82133L51193L22718K96098K71306K49799K33845K24099K18251
$$ -5770994 -5388861 -5037668 -4714950 -4418852 -4147546 -3897747 -3663902 -3439803 -3221552
56960c221552K12762K05579J96593J86202J74645J62546J50908J40180J29920
$$ -3221552 -3008790 -2803211 -2606618 -2420416 -2245771 -2083225 -1932317 -1792137 -1662217
56951a662217J19635J09438R9741R0774Q2553P4935O7624O0329N3027M5858L8867
$$ -1662217 -1542582 -1433144 -1333403 -1242629 -1160076 -1085141 -1017517 -957188 -904161 -858303 -819436
56940h19436L2031K5461J9303J3592Q387L884K06k646m476m912m055k733j657
$$ -819436 -787405 -761944 -742641 -729049 -720662 -716778 -716572 -719218 -723694 -728606 -732661 -735394 -737051
56927g37051p04N24J848K759L222L623M118M632N298O261P180P576P543P569P677
$$ -737051 -737755 -737231 -735383 -732624 -729402 -725779 -721661 -717029 -711731 -705470 -698290 -690714 -683171 -675602 -667925
56912f67925P410O649N866N448N312N279N346N504N712O069O700P452Q116Q869
$$ -667925 -660515 -653866 -648000 -642552 -637240 -631961 -626615 -621111 -615399 -609330 -602630 -595178 -587062 -578193
56898e78193R979J1159J1752J1597J1143J0698J0132R431Q896Q580Q109P332O657
$$ -578193 -568214 -557055 -545303 -533706 -522563 -511865 -501733 -492302 -483406 -474826 -466717 -459385 -452728
56885d52728O390O228N771N197M985N212N508N602N557N581N790O204O746P296
$$ -452728 -446338 -440110 -434339 -429142 -424157 -418945 -413437 -407835 -402278 -396697 -390907 -384703 -377957 -370661
56871c70661P739P927P682O983O122N445M940M319L495K744K349K317K526K837
$$ -370661 -362922 -354995 -347313 -340330 -334208 -328763 -323823 -319504 -316009 -313265 -310916 -308599 -306073 -303236
56857c03236L071L078K932K842K817K711K610K819L373L866L951L777L726L876
$$ -303236 -300165 -297087 -294155 -291313 -288496 -285785 -283175 -280356 -276983 -273117 -269166 -265389 -261663 -257787
56843b57787L964L804L520L401L596L931M109M068M088M388M736M715M318L984
$$ -257787 -253823 -250019 -246499 -243098 -239502 -235571 -231462 -227394 -223306 -218918 -214182 -209467 -205149 -201165
56829b01165M018M275M488M658M953N360N607N409M757L992L529L412L290K932
$$ -201165 -197147 -192872 -188384 -183726 -178773 -173413 -167806 -162397 -157640 -153648 -150119 -146707 -143417 -140485
56815a40485K591K584K788K844K773K935L433L969M355M776N428O261P154Q076
$$ -140485 -137894 -135310 -132522 -129678 -126905 -123970 -120537 -116568 -112213 -107437 -102009 -95748 -88594 -80518
56801h0518Q928R491R632R328Q488P048N290L672K330J084nn70n62m87o97q51
$$ -80518 -71590 -62099 -52467 -43139 -34651 -27603 -22313 -18641 -16311 -15227 -15232 -15802 -16364 -16851 -17548 -18399
56785a8399m29N68J736K845L901M856G45O558P766R228J0646J1870J2860J3325
$$ -18399 -18828 -18260 -16524 -13679 -9778 -4922 745 7303 15069 24297 34943 46813 59673 72998
56771G2998J2756J0893P982M548J136j773l809m932n438n663n706n450m851m051
$$ 72998 85754 96647 104629 109177 110313 108540 104731 99799 94361 88698 82992 77542 72691 68640
56757F8640l212k305j211rJ035J853K780M164N854P346Q297Q604Q041O296L518
$$ 68640 65428 63123 61912 61903 62938 64791 67571 71735 77589 84935 93232 101836 109877 116173 119691
56742A19691M78k102m094n706o889p377p212o820o539o264n677m705l633k787
$$ 119691 120169 118067 113973 108267 101378 94001 86789 79969 73430 67166 61489 56784 53151 50364
56728E0364k160j477n74L89J207J986K969M070M819M787L939K495P13j136k795
$$ 50364 48204 46727 46153 46542 47749 49735 52704 56774 61593 66380 70319 72814 73527 72391 69596
56713F9596m127n104n672n844n817n808n712n272m562m005l801l678l392l071
$$ 69596 65469 60365 54693 48849 43032 37224 31512 26240 21678 17673 13872 10194 6802 3731
56699C731I06a472j555p35m87p53r19o46k19j4L8K12N03O29M31Q6j20j24j19k48
$$ 3731 906 -1472 -3027 -3762 -4249 -5002 -5921 -6567 -6786 -6800 -6762 -6550 -6047 -5418 -4987 -4901 -5021 -5145 -5264 -5512
56679e512m02l93k40j51j76j24R4K85K35N5M1K81O08Q61J039J149J141b17F35
$$ -5512 -5914 -6307 -6547 -6698 -6874 -6998 -6904 -6619 -6384 -6329 -6288 -6007 -5399 -4538 -3499 -2350 -1209 -217 635
56659A550J217J583J799J823J767J644J308P51L49M85J003J306J056N84M26P26
$$ 1550 2767 4350 6149 7972 9739 11383 12691 13442 13791 14276 15279 16585 17641 18225 18651 19377
56643A9377J171J387J210P60L40J98K63K71J73J98M34O02M82L01M56R41J365J462
$$ 19377 20548 21935 23145 23905 24245 24443 24706 24977 25150 25348 25782 26384 26866 27167 27623 28564 29929 31391
56625C1391J347J283J353J448J411J248J143J258J463J429J089P83Q46J187J491
$$ 31391 32738 34021 35374 36822 38233 39481 40624 41882 43345 44774 45863 46646 47492 48679 50170
56610E0170J646J731J747J605J327J052Q90Q95J081J306J317J110J056J407J863
$$ 50170 51816 53547 55294 56899 58226 59278 60168 61063 62144 63450 64767 65877 66933 68340 70203
56595G0203J925J566J187R84P70M85L15K96J51k40o04p41q69j240j655j816j866
$$ 70203 72128 73694 74881 75865 76635 77120 77435 77731 77882 77642 77038 76297 75428 74188 72533 70717 68851
56578F8851k214k827l223l163k928k781k557k041j449j226j449j798k010k064
$$ 68851 66637 63810 60587 57424 54496 51715 49158 47117 45668 44442 42993 41195 39185 37121
56564C7121j931j477o87K04R51J437J510J018J52n11n95l79l58n34m76j6N41R10
$$ 37121 35190 33713 33026 33230 34181 35618 37128 38146 38298 37787 37192 36813 36455 35921 35445 35429 35970 36880
56546C6880J108J168R40M13o2j43J07L55M36M41M98O51Q74J073J099R34P62P70
$$ 36880 37988 39156 40096 40509 40447 40304 40411 40766 41202 41643 42141 42792 43666 44739 45838 46772 47534 48304
56528D8304Q93R04O63K29k60o81r54r96p56k90J67L43K30J33L06N82O32M50L64
$$ 48304 49197 50101 50764 50993 50733 50052 49098 48102 47346 47056 47223 47566 47796 47929 48235 48817 49449 49899 50263
56509E0263N51Q76J214J604K010K250K315K428K677K847K782K608K454K236J913
$$ 50263 50814 51690 52904 54508 56518 58768 61083 63511 66188 69035 71817 74425 76879 79115 81028
56494H1028J664J549J385J110R89J118J107O41M1j88j39k98p41j071j101j023
$$ 81028 82692 84241 85626 86736 87725 88843 89950 90591 90632 90444 90305 90007 89266 88195 87094 86071
56478H6071r49p64n20n07p52q96p26m57l43l12k47k58l99m23r9L44M83K54Ll1
$$ 86071 85122 84358 83838 83331 82579 81683 80957 80500 80157 79845 79598 79340 78941 78518 78419 78763 79246 79500 79503 79472
56458G9472N5P4N2R5J68J38L9M6J68J26k40o57o86l34n3o7n6L33Q70J032O99K37
$$ 79472 79527 79601 79653 79748 79916 80054 80093 80139 80307 80433 80193 79536 78850 78516 78463 78396 78340 78673 79543 80575 81274 81511
56436H1511o9l01o43j035j243j118p41l98l46m96m81j15L22M58L25K18J76K9j55
$$ 81511 81442 81141 80498 79463 78220 77102 76361 75963 75617 75121 74640 74525 74847 75305 75630 75848 76024 76053 75898
56417G5898p1K95N45M11Q8j10j52j32J6L61O83O14Q2n95j044j107q45l91O4L35
$$ 75898 75827 76122 76667 77078 77166 77056 76904 76772 76788 77149 77832 78446 78528 77933 76889 75782 74937 74546 74610 74945
56397G4945L64L08L65N25N48K99j5r9K0P2j4j1J69K87J93J40L60O17N33J84k6
$$ 74945 75309 75617 75982 76507 77055 77354 77339 77240 77260 77332 77318 77307 77476 77763 77956 78096 78456 79073 79606 79790 79764
56376G9764L3Q5q0l69o15p15n46p9M13N39L16J48K19K53k7m41o19m58j72M2J48
$$ 79764 79797 79882 79802 79433 78818 78103 77557 77478 77891 78430 78746 78894 79113 79366 79339 78898 78279 77821 77649 77691 77839
56355G7839K04K70L47L77L53L93N75P10N12M1k52j3O15J153J259R60N22K24J55
$$ 77839 78043 78313 78660 79037 79390 79783 80358 81068 81580 81621 81369 81356 81971 83124 84383 85343 85865 86089 86244
56336H6244K08K32J97J99L37O51J018J121P19O0k31J34P36J016R82J001J169J289
$$ 86244 86452 86684 86881 87080 87417 88068 89086 90207 90926 90986 90755 90889 91625 92641 93623 94624 95793 97082
56318I7082J325J348J176N79j38m01j91p7k58k47K79Q34Q24L89J39K64M28M19
$$ 97082 98407 99755 100931 101510 101372 100971 100780 100703 100445 100198 100477 101311 102135 102524 102663 102927 103355 103774
56300A03774L84N20P75R53R12O46K75k5j75j83n9J65L13J87j14k81j91k1J37M20
$$ 103774 104158 104678 105453 106406 107318 107964 108239 108214 108039 107856 107797 107962 108275 108462 108348 108067 107876 107855 107992 108412
56280A08412Q35J063Q34L22n4q1J71N73J033J467J799J921J700J135N24K37L35
$$ 108412 109247 110310 111144 111466 111412 111331 111502 112075 113108 114575 116374 118295 119995 121130 121654 121891 122226
56263A22226N89Q74J193J349J058M80J88M41Q36R23P74O72O37O17P55J122J429
$$ 122226 122815 123689 124882 126231 127289 127769 127957 128398 129234 130157 130931 131603 132240 132857 133612 134734 136163
56246A36163J417J293J423J799K124K296K402K437K379K398K648K948L000K845
$$ 136163 137580 138873 140296 142095 144219 146515 148917 151354 153733 156131 158779 161727 164727 167572
56232A67572K765K829K871K828K827K974L319L951M794N419N406M901M521M633
$$ 167572 170337 173166 176037 178865 181692 184666 187985 191936 196730 202149 207555 212456 216977 221610
56218B21610N017N257N277N354N774O565P465Q161Q544Q769R059R572J0386J1446
$$ 221610 226627 231884 237161 242515 248289 254854 262319 270480 279024 287793 296852 306424 316810 328256
56204C28256J2455J3138J3657J4504J5888J7521J9174K1004K3130K5284K7247
$$ 328256 340711 353849 367506 382010 397898 415419 434593 455597 478727 504011 531258
56193E31258K9313L1813L4532L7016L9320M1849M4530M6729M8023M8588M8724
$$ 531258 560571 592384 626916 663932 703252 745101 789631 836360 884383 932971 981695
56182I81695M8389M7353M5473M2636L8681L3581K7571K0946J3847O356j307q747
$$ 981695 1030084 1077437 1122910 1165546 1204227 1237808 1265379 1286325 1300172 1306528 1305221 1296474
56170A296474j5607k1769k7301l2166l6112l8991m1110m2910m4314m4797m4172
$$ 1296474 1280867 1259098 1231797 1199631 1163519 1124528 1083418 1040508 996194 951397 907225
56159I07225m2932m1595m0129l8302l6228l4224l2397l0726k9246k7843k6154
$$ 907225 864293 822698 782569 744267 708039 673815 641418 610692 581446 553603 527449
56148E27449k4052k1969k0344j9030j7668j6282j5061j3852j2415j0959r885r127
$$ 527449 503397 481428 461084 442054 424386 408104 393043 379191 366776 355817 345932 336805
56136C36805q330p489o886o478n963n336m847m440l858l234k957k974k818k387
$$ 336805 328475 320986 314100 307622 301659 296323 291476 287036 283178 279944 276987 274013 271195 268808
56122B68808k109k197k354k280j968j414n78K03M29J98J91O86J179J235J159J417
$$ 268808 266699 264502 262148 259868 257900 256486 255908 256111 256540 256738 256929 257615 258794 260029 261188 262605
56106B62605J920K312K575K871L142L253L380L814M538N242N739O027O165O241
$$ 262605 264525 266837 269412 272283 275425 278678 282058 285872 290410 295652 301391 307418 313583 319824
56092C19824O413O859P678Q885J0351J1769J2928J4030J5506J7448J9517K1398
$$ 319824 326237 333096 340774 349659 360010 371779 384707 398737 414243 431691 451208 472606
56080D72606K3036K4372K5153K5175K4454K3072K1126J8853J6591J4522J2667
$$ 472606 495642 520014 545167 570342 594796 617868 638994 657847 674438 688960 701627
56069G01627J1075R688Q145O085L722J665J66j066k265l316m217n362p174r799
$$ 701627 712702 722390 730535 736620 740342 742007 742173 741107 738842 735526 731309 725947 718773 708974
56055G08974j3197j7072k0613k2869k3668k3755k3755k3439k2278k0315j8089
$$ 708974 695777 678705 658092 635223 611555 587800 564045 540606 518328 498013 479924
56044D79924j5994j4061j2206j0390q667p217o198n469m702l857l209k834k421
$$ 479924 463930 449869 437663 427273 418606 411389 405191 399722 395020 391163 387954 385120 382699
56031C82699j756j012m02J60Q04J440J891K080K024J882K020K647L389L651L465
$$ 382699 380943 379931 379529 379689 380493 381933 383824 385904 387928 389810 391830 394477 397866 401517 404982
56016D04982L445L851M267M364M433M803N257N460N498N663N977O288O564O818
$$ 404982 408427 412278 416545 420909 425342 430145 435402 440862 446360 452023 458000 464288 470852 477670
56002D77670O971P025P134P383P681P987Q329Q611Q707Q727Q819Q813Q529Q351
$$ 477670 484641 491666 498800 506183 513864 521851 530180 538791 547498 556225 565044 573857 582386 590737
55988E90737Q763R491R788R671R946J0900J1899J2509J3114J3966J4552J4502
$$ 590737 599500 608991 618779 628450 638396 649296 661195 673704 686818 700784 715336 729838
55976G29838J4322J4650J5392J6148J6911J7779J8596J9307K0201K1351K2487
$$ 729838 744160 758810 774202 790350 807261 825040 843636 862943 883144 904495 926982
55965I26982K3700K5527K7899K9887L1029L2060L3679L5499L6968L8463M0566
$$ 926982 950682 976209 1004108 1033995 1065024 1097084 1130763 1166262 1203230 1241693 1282259
55954A282259M2943M4953M6804M9175N2082N5003N7759O0563O3518O6653P0107
$$ 1282259 1325202 1370155 1416959 1466134 1518216 1573219 1630978 1691541 1755059 1821712 1891819
55943A891819P3785P7359Q0965Q5268R0372R5538J00424J05758J12146J19220
$$ 1891819 1965604 2042963 2123928 2209196 2299568 2395106 2495530 2601288 2713434 2832654
55933B832654J26616J34762J43975J53811J64070J75290J87460J99458K10820
$$ 2832654 2959270 3094032 3238007 3391818 3555888 3731178 3918638 4118096 4328916
55924D328916K22744K36256K50668K65080K80144K97026L15922L36946L61183
$$ 4328916 4551660 4787916 5038584 5303664 5583808 5880834 6196756 6533702 6894885
55915F894885L89453M21338M56719M96618N41230N89064O39850O96256P61069
$$ 6894885 7284338 7705676 8162395 8659013 9200243 9789307 10429157 11125413 11886482
55906A1886482Q35265R21148J024466J150051J297582J464650J651361J858803
$$ 11886482 12721747 13642895 14667361 15817412 17114994 18579644 20231005 22089808
55898B2089808K086817K338207K622622K952748L341879L810366M386130N087370
$$ 22089808 24176625 26514832 29137454 32090202 35432081 39242447 43628577 48715947
55890D8715947N907956O822482P774368Q606922Q998112Q534347O950934M362232
$$ 48715947 54623903 61446385 69220753 77827675 86825787 95360134 102311068 106673300
55882A06673300J262296j721266m117856n746601o665902p048120p077150o895776
$$ 106673300 107935596 106214330 102096474 96349873 89683971 82635851 75558701 68662925
55874F8662925o592578o213625n781914n310728m810643m295847l787423l308403
$$ 68662925 62070347 55856722 50074808 44764080 39953437 35657590 31870167 28561764
55866B8561764k875407k495856k170695j896403j665603j469747j302442j159343
$$ 28561764 25686357 23190501 21019806 19123403 17457800 15988053 14685611 13526268
55858A3526268j036101r28591q34611p53286o83007o21467n67167n19288m76514
$$ 13526268 12490167 11561576 10726965 9973679 9290672 8669205 8102038 7582750 7106236
55849G106236m37421m01726l69777l41169l15042k91238k69966k50757k32909
$$ 7106236 6668815 6267089 5897312 5556143 5241101 4949863 4679897 4429140 4196231
55840D196231k16560k02169j89345j77277j65984j55943j46875j37977j29179
$$ 4196231 3979671 3777502 3588157 3410880 3244896 3088953 2942078 2804101 2674922
55831B674922j21159j14199j07898j01854r5889q9781q3531p7635p2493o7906
$$ 2674922 2553763 2439564 2331666 2229812 2133923 2044142 1960611 1882976 1810483 1742577
55821A742577o3709o0409n8423n7173n5734n3965n2249n0588m8850m7454m6823
$$ 1742577 1678868 1618459 1560036 1502863 1447129 1393164 1340915 1290327 1241477 1194023 1147200
55810A147200m6413m5265m3337m1401l9814l8204l6346l4478l2791l1295l0175
$$ 1147200 1100787 1055522 1012185 970784 930970 892766 856420 821942 789151 757856 727681
55799G27681k9587k9149k8252k6844k5312k3766k2045k0266j8749j7451j6107
$$ 727681 698094 668945 640693 613849 588537 564771 542726 522460 503711 486260 470153
55788D70153j4822j3936j3378j2778j2128j1716j1466j0975j0220r613r309q983
$$ 470153 455331 441395 428017 415239 403111 391395 379929 368954 358734 349121 339812 330829
55776C30829q357p521o687n994n567n417n289m956m542m253m012l735l654l940
$$ 330829 322472 314951 308264 302270 296703 291286 285997 281041 276499 272246 268234 264499 260845 256905
55762B56905m227m129l906m043m401m426m082l814l702l371k770k312k146j914
$$ 256905 252678 248549 244643 240600 236199 231773 227691 223877 220175 216804 214034 211722 209576 207662
55748B07662j415r06n89k97J29N84R39J158J171R83R25J275J677J449N32m32j038
$$ 207662 206247 205341 204752 204455 204584 205168 206107 207265 208436 209419 210344 211619 213296 214745 215277 214845 213807
55731B13807j530k169k720k907k841k743k618k486k537k783k896k629k165j779
$$ 213807 212277 210108 207388 204481 201640 198897 196279 193793 191256 188473 185577 182948 180783 179004
55717A79004j443r84l48M37J410K501L408L756L303J991P4j816l054l615l983
$$ 179004 177561 176577 176229 176666 178076 180577 183985 187741 191044 193035 193109 191293 188239 184624 180641
55702A80641m410m603m243l535k984k840k999l214l271l055k671k431k569l024
$$ 180641 176231 171628 167385 163850 160866 158026 155027 151813 148542 145487 142816 140385 137816 134792
55688A34792l488l630l323k789k437k389k282j761j051p29r67j348j474j358j219
$$ 134792 131304 127674 124351 121562 119125 116736 114454 112693 111642 110913 109946 108598 107124 105766 104547
55673A04547j116j049j090j302j621j925k084j957j519r78o19n23o00p72r65r82
$$ 104547 103431 102382 101292 99990 98369 96444 94360 92403 90884 89906 89287 88764 88164 87392 86427 85445
55657H5445o94k46J44N07R34J265J270J101J077J116Q31J93l39m78m59o44j095
$$ 85445 84751 84505 84649 85156 86090 87355 88625 89726 90803 91919 92750 92943 92604 92126 91667 91023 89928
55640H9928j660k118k203j857j480j503j732j595j050o95q27j034r29o73m79j52
$$ 89928 88268 86150 83947 82090 80610 79107 77375 75780 74730 74035 73208 72174 71245 70572 70093 69941
55624F9941M05P67N89K73M73J186J814J978J797J482J097P04L94J92J10J96L72
$$ 69941 70346 71113 71702 71975 72448 73634 75448 77426 79223 80705 81802 82506 82900 83092 83202 83398 83770
55607H3770L90J58r7k14l38n61o22k99J20K31J37K21M87N87M83M87O65O83L80
$$ 83770 84160 84318 84221 84007 83669 83108 82486 82187 82307 82538 82675 82896 83383 83970 84453 84940 85605 86288 86668
55588H6668L8j04k23n25q34q41o29n95r28j435j845k089k216k224k084j866j652
$$ 86668 86706 86602 86379 85854 85020 84179 83550 82955 82027 80592 78747 76658 74442 72218 70134 68268 66616
55571F6616j403j012n54l02m23p51r78r78q15n84l94m04o02p00n10l19n21r49
$$ 66616 65213 64201 63647 63345 62922 62171 61193 60215 59400 58816 58422 58018 57416 56716 56206 55887 55366 54417
55553E4417j033o35k53k75n04o63q84j293j542j191l99K63N19N25M16J30l18p38
$$ 54417 53384 52749 52496 52221 51717 51054 50170 48877 47335 46144 45745 46008 46527 47052 47468 47598 47280 46542
55535D6542r90j079j001p04k41K04M48L76Om49p09p21o89o75m68m0K11j5l93l69
$$ 46542 45552 44473 43472 42768 42527 42731 43179 43555 43561 43112 42403 41682 40993 40318 39850 39810 40021 40006 39613 39244
55515C9244N6L72L23J64J95M07O37P66O61K65j94l57k02o1j26k05p8J60K85L22
$$ 39244 39300 39672 39995 40159 40354 40761 41398 42164 42825 43090 42896 42539 42337 42276 42150 41945 41867 42027 42312 42634
55495D2634M80P97J009Q17K60k49l30q6L8j19j99Q5M22L10j80m92l74j52j42k05
$$ 42634 43114 43911 44920 45737 45997 45748 45418 45332 45370 45251 45052 45137 45559 45869 45689 45197 44823 44671 44529 44324
55475D4324j09O8J00l7k03l45n02o65p71p88o84m72k55k02l38n19o39p75j030
$$ 44324 44215 44283 44383 44346 44143 43798 43296 42631 41860 41072 40388 39916 39661 39459 39121 38602 37963 37188 36158
55456C6158j333j475j309q96m77k81l08l23j80LQ2J88N18R05R47N93K88L84O76
$$ 36158 34825 33350 32041 31145 30668 30387 30079 29756 29576 29579 29661 29849 30367 31272 32219 32812 33100 33484 34160
55437C4160P51N22K16n4l67o96p92n07k5K84K77J32Q1J26J30J11K16M15M45J68
$$ 34160 34911 35433 35649 35595 35228 34532 33740 33233 33208 33492 33769 33901 33982 34108 34238 34349 34565 34980 35425 35593
55417C5593j87k96j18K20O49J063J142O52j05n39m77k69k37l25m15n89q73j010
$$ 35593 35406 35110 34992 35212 35861 36924 38066 38718 38613 38074 37597 37328 37091 36766 36351 35762 34889 33879
55399C3879p23r5N41Q90Q23M06o7k69j61L3J63K72K84J5m33o11l31K8Q1k5NJ8
$$ 33879 33156 33061 33602 34492 35315 35721 35654 35385 35224 35257 35420 35692 35976 35991 35558 34947 34616 34644 34725 34700 34705 34723
55377C4723k49n29l14K68N28J89k25k19L1J14R8L14P44R99Q07K48m27r14r11l96
$$ 34723 34474 33945 33631 33899 34427 34616 34391 34172 34203 34317 34415 34729 35473 36472 37279 37527 37100 36186 35275 34879
55357C4879K10M13J97k9n9q5k65m37m14l02k46j47J53M75M81J57j67k86l03l38
$$ 34879 35089 35502 35699 35670 35611 35526 35261 34824 34410 34108 33862 33715 33868 34343 34824 34981 34814 34528 34225 33887
55337C3887l31k79l74o85r15p09j49L45M59K38j05l82m47k43R8L17K89J29L4Q3
$$ 33887 33556 33277 32903 32218 31303 30594 30445 30790 31249 31487 31382 31000 30553 30310 30408 30725 31014 31143 31177 31260
55317C1260J83J77j7l09n12n11l66k11j03n1q9k03l00k87j97j39j62k29k57j47
$$ 31260 31443 31620 31603 31294 30782 30271 29905 29694 29591 29540 29451 29248 28948 28661 28464 28325 28163 27934 27677 27530
55297B7530J40M58O02N51N08N47N04K85P2Qn5k41l14k8L61L65m7m51o05o33n83
$$ 27530 27670 28128 28730 29281 29789 30336 30840 31125 31197 31205 31150 30909 30595 30567 30928 31293 31246 30795 30190 29557 28974
55276B8974k85K13N54N45L69J81j11m78o17l95j19p5j61k14l11m38k66K95O86
$$ 28974 28689 28902 29456 30001 30370 30551 30440 29962 29345 28950 28831 28756 28595 28381 28070 27632 27366 27661 28347
55257B8347L80k76m85j24J76M6j54j7K92L71J71m0p6N1K22K62M8k53k79N1L34
$$ 28347 28727 28451 27966 27842 28018 28064 27910 27893 28185 28556 28727 28687 28611 28662 28884 29146 29194 28941 28662 28713 29047
55236B9047J99j61k32J28N14N36L22K61M57N83L41j24m10l28j09p3k47m09m19
$$ 29047 29246 29085 28853 28981 29495 30031 30353 30614 31071 31654 31995 31871 31461 31133 31024 30951 30704 30295 29876
55217B9876l33k38q4J87M41M37J00l05m34k35RM4o4o8J13L47N19O15N97L75ml32
$$ 29876 29543 29305 29221 29408 29849 30286 30386 30081 29647 29412 29421 29465 29401 29333 29446 29793 30312 30927 31524 31899 31895 31563
55195C1563m85n31n25l64L2M66O33M40J07p7J6K74M27K52k28p37r50p13j25M91
$$ 31563 31078 30547 30022 29658 29690 30156 30789 31229 31336 31259 31275 31549 31976 32228 32000 31263 30313 29600 29475 29966
55175B9966P85O87N00N10N57K45m20r29q80m29J7K58K98J54r0k48k59k72l06j39
$$ 29966 30751 31438 31938 32448 33005 33250 32830 31901 31021 30592 30609 30867 31165 31319 31229 30981 30722 30450 30144 30005
55155C0005K60M97K57j69l02j56o7k8K63P74J080R98P65N34J76k78m80l00j06
$$ 30005 30265 30762 31019 30850 30548 30392 30325 30297 30560 31334 32414 33412 34177 34711 34887 34609 34129 33829 33723
55136C3723k34n04n92n41n39m74j42K69L17m0l28j80K02L66J85n6r7PP1P0J48
$$ 33723 33489 32985 32393 31852 31313 30839 30697 30966 31283 31243 30915 30735 30937 31303 31488 31432 31335 31342 31413 31483 31631
55115C1631L12L62J64j24k71k58k05r3J67M77N92M62K78J62M4o6k1J73K74K01
$$ 31631 31943 32305 32469 32345 32074 31816 31611 31518 31685 32162 32754 33216 33494 33656 33700 33634 33613 33786 34060 34261
55095C4261K11M53N77J66n65r44o61j14J42M3j00p2P2J99K35J14j73m56m82k11
$$ 34261 34472 34925 35502 35668 35103 34159 33498 33384 33526 33569 33469 33397 33469 33668 33903 34017 33844 33388 32906 32695
55075C2695J01K11J93K51L55L16J20m5j20k87n39n72k43R8O1j84j67J99N42O21
$$ 32695 32796 33007 33200 33451 33806 34122 34242 34197 34077 33790 33251 32679 32436 32534 32595 32411 32244 32443 32985 33606
55055C3606N66N20M47L39K97L07K36J14J17J57q2n58p06j63O45R76O51J58J0K36
$$ 33606 34172 34692 35139 35478 35775 36082 36318 36432 36549 36706 36624 36066 35360 35197 35842 36818 37469 37627 37637 37873
55035C7873M70L29k46q38q71k18N88R17O91L46K82N02P08O09K16p9J10O31Q77
$$ 37873 38343 38672 38426 37588 36717 36499 37087 38004 38695 39041 39323 39825 40533 41142 41358 41279 41389 42020 42897
55016D2897N55L5k09k32l32m25j85K96N30L09k6j44j13j63l17m75n98o77o43m49
$$ 42897 43452 43487 43278 43046 42714 42289 42104 42400 42930 43239 43213 43069 42956 42793 42476 42001 41403 40726 40083 39634
54996C9634j55J44L90M99L95J16k11n20p72q67p12m41k80k51j59K9J30M7q1j48
$$ 39634 39479 39623 40013 40512 40907 41023 40812 40292 39520 38653 37941 37500 37220 36969 36810 36839 36969 37016 36935 36787
54976C6787k35l35k23J68N09M70K23J94M49O17M45R9j80m03o27p02m68j02K5j09
$$ 36787 36552 36217 35994 36162 36671 37141 37364 37558 38007 38624 39069 39168 38988 38585 37958 37256 36788 36686 36711 36602
54956C6602p3M62J251J693J481Q06N8m86o95n95m23m69o87o47q1P07J149J069
$$ 36602 36529 36991 38242 39935 41416 42222 42280 41794 41099 40504 40081 39612 38925 38278 38197 38904 40053 41122
54938D1122P38M19J20j88l92m37m19l80j53L13O76N00j40o05l90K95P93P56M27
$$ 41122 41860 42279 42399 42211 41819 41382 40963 40583 40430 40743 41419 41919 41779 41174 40784 41079 41872 42628 43055
54919D3055J87P8o2k15j69O8K25J24j17l25m72m97k53K13M90K96q1j21K26N37
$$ 43055 43242 43320 43258 43043 42874 42942 43167 43291 43174 42849 42377 41880 41627 41840 42330 42626 42545 42424 42650 43187
54899D3187N65N20O04O45M08m2m34o55p80q38p44m12O4M11L71m9m89n38j34M18
$$ 43187 43752 44272 44876 45521 45929 45887 45453 44798 44018 43180 42436 42024 42088 42499 42870 42821 42332 41794 41660 42078
54879D2078P85Q32N87K03m4P7M86Q60R94R43Q04N86L82M18P90J304J675J793J729
$$ 42078 42863 43695 44282 44485 44441 44518 45004 45864 46858 47801 48605 49191 49573 49991 50781 52085 53760 55553 57282
54860E7282J593J512J533J545J375J066Q22O98N05J03m06r00j389j848k078j991
$$ 57282 58875 60387 61920 63465 64840 65906 66728 67426 67931 68034 67628 66728 65339 63491 61413 59422
54844E9422j731j461j141p47m74m64n88o64p39q86r00n27J02N90P65P63O78M39
$$ 59422 57691 56230 55089 54342 53868 53404 52816 52152 51413 50527 49627 49100 49202 49792 50557 51320 51998 52437
54826E2437O0k36k64k7L63Q00J196J537J884K244K476K463K247J916J445Q38K67
$$ 52437 52497 52261 51997 51970 52333 53133 54329 55866 57750 59994 62470 64933 67180 69096 70541 71379 71646
54809G1646j67o26j216j664j665j441j496j857k043j826j559j573j701j601j233
$$ 71646 71479 70853 69637 67973 66308 64867 63371 61514 59471 57645 56086 54513 52812 51211 49978
54794D9978p88m30l35o45j176j426j168p88p21q18o43k06O0J2NK65M70J87m33
$$ 49978 49190 48760 48425 47780 46604 45178 44010 43222 42501 41683 41040 40834 40894 40906 40911 41176 41646 41833 41400
54775D1400p56m11K20M16n7o73p46k05L83N27K65o4k69l51l17j81m1M4J64L92
$$ 41400 40644 40233 40453 40869 40812 40139 39393 39188 39571 40098 40363 40299 40030 39679 39362 39181 39140 39184 39348 39740
54755C9740O08O40N36M86N35N72N51N30N09L73J39j2K0Q8l1l31n59m63m9M56Q21
$$ 39740 40348 40988 41524 42010 42545 43117 43668 44198 44707 45080 45219 45207 45227 45315 45284 44953 44394 43931 43882 44338 45159
54734D5159R52Q12L99j13l28l2M19M45K2k58n3K14K6l54k57L91R67J070R85J097
$$ 45159 46111 46923 47322 47209 46881 46849 47268 47713 47735 47477 47424 47638 47664 47310 47053 47444 48411 49481 50466 51563
54714E1563J269J152P75N10N79Q66J155J335J419J467J509J512J424J272J099
$$ 51563 52832 53984 54759 55269 55848 56714 57869 59204 60623 62090 63599 65111 66535 67807 68906
54699F8906Q56N02J28j39l92q12j311j580j568j583j756j740j224m81n8j02l26
$$ 68906 69762 70264 70392 70253 69861 69049 67738 66158 64590 63007 61251 59511 58287 57806 57748 57646 57320
54682E7320n20p40r63r77o61j73K68N72P00N99L19M1j15j49j6L45P96J012R50
$$ 57320 56800 56060 55097 54120 53459 53286 53554 54126 54826 55425 55744 55785 55670 55521 55505 55850 56646 57658 58608
54663E8608R90J415J900J887J366Q79P33O50L40k8k25m92j159j936k155j732j273
$$ 58608 59598 61013 62913 64800 66166 67045 67778 68428 68768 68740 68515 68023 66864 64928 62773 61041 59768
54646E9768j180j133p83m08m26o41n35j19J10m2k81m19n78p47p04n08n38p71o66
$$ 59768 58588 57455 56672 56264 55838 55197 54662 54543 54653 54611 54330 53911 53333 52586 51882 51374 50836 50065 49399
54627D9399o7L04j74j018j239o74p4j3l22o30q18q31n64j56lk18m45l59n4K02
$$ 49399 49332 49636 49462 48444 47205 46531 46457 46444 46122 45492 44674 43843 43279 43123 43120 42902 42457 42098 42044 42246
54607D2246L29L31J32k30m57l33m7L6j54l21k06J51M88N41K83l6r0J62M61N32
$$ 42246 42575 42906 43038 42808 42351 42018 41971 42007 41853 41532 41326 41477 41965 42506 42789 42753 42663 42825 43286 43818
54587D3818L14j09o10r63r35n51j04K07M84Q43J113J001M48k97q90j037o41J4
$$ 43818 44132 44023 43413 42450 41515 40964 40860 41067 41551 42394 43507 44508 44956 44659 43769 42732 42091 42105
54569D2105M26M09L31N59Q65O95m0p77r49n74o0K94M76N81O08M76J30l19o22n71
$$ 42105 42531 42940 43271 43830 44695 45390 45350 44573 43624 43050 42990 43284 43760 44341 44949 45425 45555 45236 44614 44043
54549D4043j87K80N27L82m4l70k62J71M52L03j5r8R5L06L99M28L77J56j29k53
$$ 44043 43856 44136 44663 45045 45001 44631 44369 44540 44992 45295 45280 45182 45277 45583 45982 46410 46787 46943 46814 46561
54529D6561k43m02q51j276j283q17j35M75Q15Q22N79K99J50J52K69M18M38J67
$$ 46561 46318 45916 45065 43789 42506 41689 41554 42029 42844 43666 44245 44544 44694 44846 45115 45533 45971 46138
54511D6138l02o13n23j65J37K35K31K73L58L63J83j13l12k59rK87N32O41M59L2
$$ 46138 45836 45223 44700 44535 44672 44907 45138 45411 45769 46132 46315 46202 45890 45631 45622 45909 46441 47082 47541 47573
54491D7573k19J16Q18J216J014N91L50J96n8k28q3J33L5k52k93n1O0r1j65K3J63
$$ 47573 47354 47470 48288 49504 50518 51109 51459 51655 51597 51369 51286 51419 51454 51202 50909 50858 50918 50827 50662 50685 50848
54470E0848m1l91n41m90m14k76N2M05N06M01M06N86O44L92M1j22j24j79l34m45
$$ 50848 50807 50416 49875 49385 48971 48695 48747 49152 49658 50059 50465 51051 51695 52087 52128 52006 51882 51703 51369 50924
54450E0924m11k87j92k07l59n61n96l28R5L65L56K16J07N8Q5K60M78M37M5k54
$$ 50924 50513 50226 50034 49827 49468 48907 48311 47983 48078 48443 48799 49015 49122 49180 49265 49525 50003 50440 50485 50231
54430E0231J6O53R33N35n5k31KK89N02O92O79K43l78o13l08J54M88Q42J246J270
$$ 50231 50247 50900 51833 52368 52313 52082 52084 52373 52875 53567 54246 54489 54111 53498 53190 53344 53832 54674 55920 57190
54410E7190O36j19k12L56Q16P04L96L93N71M50k6m14m09k11j84l96o21o71n85
$$ 57190 57826 57707 57495 57851 58667 59371 59767 60160 60731 61181 61155 60741 60332 60121 59937 59541 58920 58249 57664
54391E7664n01m58l90k66j66j62j89j47p6j36l28m11k18R2K44K23K39L40L44J69
$$ 57664 57163 56705 56315 56049 55883 55721 55532 55385 55309 55173 54845 54434 54216 54308 54552 54775 55014 55354 55698 55867
54371E5867L0J01J92j2m79q19p35l27J00L15K37n7l04k10K06N61N23K15L2J52
$$ 55867 55897 55998 56190 56178 55699 54880 54145 53818 53918 54233 54470 54413 54109 53899 54105 54666 55189 55404 55436 55588
54351E5588L68M17K46jj09Q0N00P75N71P2r2M05J108J267O96r4n23m79j85J60
$$ 55588 55956 56373 56619 56618 56509 56589 57089 57864 58435 58507 58415 58820 59928 61195 61891 61797 61274 60795 60610 60770
54331F0770M54N99M98J74k26n43o99p02n87l46N3N48R17R53P02M37L59M13M10
$$ 60770 61224 61823 62321 62495 62269 61726 61027 60325 59738 59392 59445 59993 60910 61863 62565 63002 63361 63774 64184
54312F4184K41Mn7K76R26J449J450J045P22O69N02j47r96j385j064m30j1N9l5
$$ 64184 64425 64429 64372 64648 65574 67023 68473 69518 70240 70909 71411 71264 70268 68883 67819 67389 67378 67437 67402
54293F7402j04j21j68k91m22m62m79o44r28j002o94k88j21q9P5K00j07o78q06
$$ 67402 67298 67177 67009 66718 66296 65834 65355 64711 63783 62781 62087 61799 61678 61589 61664 61864 61757 61079 60273
54274F0273k78K33J06l43l83O0M37M41L38M13N87O64N95M20J65j02l13m86o18
$$ 60273 59995 60228 60334 59991 59608 59668 60105 60546 60884 61297 61884 62548 63143 63563 63728 63626 63313 62827 62209
54255F2209n69k72J2n2m02o41n93m86n42o95q02q33p73n50j99J31L77N65N82K52
$$ 62209 61640 61368 61380 61328 60926 60285 59692 59206 58664 57969 57167 56334 55561 55011 54812 54943 55320 55885 56467 56719
54235E6719k75n44l14J75O15R45J092P64q4r01j028m74J18K93J65N1K2p8l50o66
$$ 56719 56444 55900 55586 55761 56376 57321 58413 59177 59093 58192 57164 56690 56808 57101 57266 57317 57339 57261 56911 56245
54215E6245p72n32j31O4p4k50j35K36N80P61Q04P07M77L22N06R62J316J299R78
$$ 56245 55473 54941 54810 54874 54800 54550 54415 54651 55231 55992 56796 57503 57980 58302 58808 59770 61086 62385 63363
54196F3363N55J61j05j47j1J16R3p1k95n20o54n99l81j63n6nJ15L53O50Q24O72
$$ 63363 63918 64079 63974 63827 63816 63932 64025 63954 63659 63139 62485 61886 61505 61342 61286 61281 61396 61749 62399 63223 63895
54175F3895K08k64m43l87m08n96p19o09m07l01k49j10P1J38R9J01J68J03k26o31
$$ 63895 64103 63839 63396 63009 62601 62005 61286 60677 60270 59969 59720 59610 59681 59819 59918 60019 60187 60290 60064 59433
54155E9433p36l77J75M83L94J37j8k0M3J40K26J67o5k70k93k98m92o60m13J69
$$ 59433 58697 58320 58495 58978 59372 59509 59491 59471 59514 59654 59880 60047 59982 59712 59419 59121 58629 57969 57556 57725
54135E7725N45M93M28O75Q74N06k54p08n55j61R5K66M94O04L65l6j37K32P54J015
$$ 57725 58270 58763 59191 59866 60740 61246 60992 60284 59729 59568 59663 59929 60423 61027 61392 61356 61219 61451 62205 63220
54115F3220R22O36L07k2l02m68n65p37j005j165r99n22N0N22P68O97L16j72m68
$$ 63220 64142 64778 65085 65063 64761 64293 63728 62991 61986 60821 59822 59300 59350 59872 60640 61337 61653 61481 61013
54096F1013m58k59o3nj40l75m43j69K46M25K94J31J14R5m4j47m9J30J85J56K01
$$ 61013 60555 60296 60233 60228 60088 59713 59270 59101 59347 59772 60066 60197 60311 60406 60362 60215 60166 60296 60481 60637 60838
54075F0838L00K95J73L1j08k50k59j9L10M54M23M71O98Q92Q64P08O47P96J126
$$ 60838 61138 61433 61606 61637 61529 61279 61020 61001 61311 61765 62188 62659 63357 64249 65113 65821 66468 67264 68390
54056F8390J521J775J667J200O69M19M99O06L98j48o76q21o08m16m61n58m28j32
$$ 68390 69911 71686 73353 74553 75222 75641 76140 76746 77144 76996 76320 75499 74891 74475 74014 73456 73028 72896
54038G2896M0n9l39o40p75n72j07J50j63p36q57l13L44N58L83J82O1j13l11l31
$$ 72896 72936 72877 72538 71898 71123 70551 70444 70594 70431 69695 68838 68525 68869 69427 69810 69992 70053 69940 69629 69298
54018F9298r3K75N78O69M87J57m6O8M12P54R56J020R87R08P83N15P8k55j09M21
$$ 69298 69205 69480 70058 70727 71214 71371 71325 71393 71805 72559 73515 74535 75522 76430 77213 77728 77806 77551 77442 77863
53998G7863P49N42K08K59N12M14k4j82K43Q37J139J238J406J557J462J238J218
$$ 77863 78612 79154 79362 79621 80133 80547 80523 80341 80584 81421 82560 83798 85204 86761 88223 89461 90679
53981I0679J450J704J876K112K454K722K775K718K736K848K908K794K521K213
$$ 90679 92129 93833 95709 97821 100275 102997 105772 108490 111226 114074 116982 119776 122297 124510
53967A24510K040K056K117K006J645J190Q40O48N23L96K57J09j22m81r03j243
$$ 124510 126550 128606 130723 132729 134374 135564 136404 137052 137575 137971 138228 138337 138215 137734 136831 135588
53951A35588j465j660j825j796j493j216j403k081k765k973k693k210j738j361
$$ 135588 134123 132463 130638 128842 127349 126133 124730 122649 119884 116911 114218 112008 110270 108909
53937A08909j168j198j278j210j027r06q22o04k90j27j77j84%J96K30L10P62J510
$$ 108909 107741 106543 105265 104055 103028 102122 101300 100696 100406 100279 100102 99918 99918 100114 100344 100654 101416 102926
53919A02926K115K242J937J416P93O1p54j493j925j955j784j710j767j668j251
$$ 102926 105041 107283 109220 110636 111429 111490 110736 109243 107318 105363 103579 101869 100102 98434 97183
53904I7183p59n07m68l59r6J48K03Q5j14k40o8M54J028J308J331J394J492J323
$$ 97183 96424 95917 95449 95090 94994 95142 95345 95430 95316 95076 95008 95462 96490 97798 99129 100523 102015 103338
53886A03338Q78O14Q87J505K046K269K073J414O00K81P70J592K037J998J856J780
$$ 103338 104216 104830 105717 107222 109268 111537 113610 115024 115624 115905 116675 118267 120304 122302 124158 125938
53870A25938J660J606J893K376K501K127J858K230K981L440L398L174L021K863
$$ 125938 127598 129204 131097 133473 135974 138101 139959 142189 145170 148610 152008 155182 158203 161066
53856A61066K641K547K746L090L301L270L131L034L008K983K855K487J746P00
$$ 161066 163707 166254 169000 172090 175391 178661 181792 184826 187834 190817 193672 196159 197905 198605
53842A98605k88q00p85n61m08l60m65r66j921k869l274l212l203l406l432l074
$$ 198605 198317 197517 196732 196171 195763 195403 194938 193972 192051 189182 185908 182696 179493 176087 172655 169581
53826A69581k724k786l099l281l321l450l618l542l217k936k812k656k363k084
$$ 169581 166857 164071 160972 157691 154370 150920 147302 143760 140543 137607 134795 132139 129776 127692
53812A27692j921j754j541j537j970k597k842k366j474q46r02j387j642j330q15
$$ 127692 125771 124017 122476 120939 118969 116372 113530 111164 109690 108844 107942 106555 104913 103583 102768
53797A02768p07j109j510j442j040p53p50p68n69l22l77p55j028q60m52l04n24
$$ 102768 102061 100952 99442 98000 96960 96207 95457 94689 94120 93798 93421 92666 91638 90778 90326 90022 89498
53780H9498o65l60J56L94K79J81L09M52L46L5k51l44j64K52O80Q49P71P52R05
$$ 89498 88833 88473 88629 89023 89302 89483 89792 90244 90590 90625 90374 90030 89866 90118 90798 91647 92418 93170 94075
53761I4075R47O59L07L07O27Q71Q83Q89J008J048Q68O95Q10J156J465J665J889
$$ 94075 95022 95681 95988 96295 96922 97793 98676 99565 100573 101621 102489 103184 103994 105150 106615 108280 110169
53744A10169K174K370K370K256K175K195K310K486K605K507K161J728J422J337
$$ 110169 112343 114713 117083 119339 121514 123709 126019 128505 131110 133617 135778 137506 138928 140265
53730A40265J416J543J608J512J189O61K8n61r62j110j098j139j381j748k030
$$ 140265 141681 143224 144832 146344 147533 148194 148222 147661 146699 145589 144491 143352 141971 140223 138193
53715A38193k127k141k196k293k381k471k587k645k488k105j687j448j402j383
$$ 138193 136066 133925 131729 129436 127055 124584 121997 119352 116864 114759 113072 111624 110222 108839
53701A08839j267j094r94j040j223j476j641j511j017m27j98n14j049j309j145
$$ 108839 107572 106478 105484 104444 103221 101745 100104 98593 97576 97149 96951 96437 95388 94079 92934
53686I2934p79m37j51N5Q0o0j57j06o7j36q1K98O93N81j5m52l18N6J65P2K04N95
$$ 92934 92155 91718 91567 91622 91702 91642 91485 91379 91312 91176 91095 91393 92086 92667 92652 92200 91882 91938 92103 92175 92379 92974
53664I2974Q19O74M80N79Q36Q84O61M09L01L00L66N21O75O39M06K58M73R55J352
$$ 92974 93793 94467 94947 95526 96362 97246 97907 98316 98617 98917 99283 99804 100479 101118 101524 101782 102255 103210 104562
53645A04562J459J395J358J367J298J120R54R24R92J043J080J208J409J457J156
$$ 104562 106021 107416 108774 110141 111439 112559 113513 114437 115429 116472 117552 118760 120169 121626 122782
53630A22782O82M28N25O78N66K49K2k8o8k27m28n68o51p30p82p24m39J29P99J169
$$ 122782 123464 123892 124417 125095 125661 125910 125932 125904 125836 125609 125181 124613 123962 123232 122450 121726 121287 121416 122215 123384
53610A23384J033O82N22M76J52l71n26j50J21k38p71o98q8K73N1k89l11j37N4
$$ 123384 124417 125099 125621 126097 126249 125878 125352 125202 125323 125085 124314 123616 123528 123801 123852 123563 123252 123115 123169
53591A23169L92R03J182R10L69P1J30L73P34J188J436J195O97N03Q09J234J365
$$ 123169 123561 124464 125646 126556 126925 126996 127126 127499 128233 129421 130857 132052 132749 133252 134061 135295 136660
53574A36660J152P73M06K45M73R82J346J212O86J99Q8L61P84J075J082Q42N56
$$ 136660 137812 138585 138991 139236 139709 140691 142037 143249 143935 144134 144222 144583 145367 146442 147524 148366 148922
53557A48922M40N62P96R25R02R24J176J517J600J320R80Q83R65J020J063J244
$$ 148922 149362 149924 150720 151645 152547 153471 154647 156164 157764 159084 160064 160947 161912 162932 163995 165239
53541A65239J473J463J139P41M86L55K21N5p6r5NJ04K3k34l83j65K79N41M05J0
$$ 165239 166712 168175 169314 170055 170541 170896 171117 171172 171096 171001 171006 171110 171133 170899 170516 170351 170630 171171 171576 171586
53521A71586m15p17q01o70m82l65k10N4R6m83j435j935j546p14j08J04O7j93n85
$$ 171586 171171 170454 169653 168983 168501 168136 167926 167980 168076 167593 166158 164223 162677 161963 161855 161959 162026 161833 161248
53502A61248o63j07O94J015O82J65j80m00m90k30L22O72N24K60L89Q39J135J144
$$ 161248 160585 160478 161172 162187 162869 163034 162854 162454 161964 161734 162056 162728 163252 163512 163901 164740 165875 167019
53484A67019J165J314J332J098R59J297J949K378K354K179K236K517K739K770
$$ 167019 168184 169498 170830 171928 172887 174184 176133 178511 180865 183044 185280 187797 190536 193306
53470A93306K736K808L032L409L958M658N381N947O239O236O022N740N547N544
$$ 193306 196042 198850 201882 205291 209249 213907 219288 225235 231474 237710 243732 249472 255019 260563
53456B60563N811O353P011P499P696P880Q396R153R652R648R454R488R725R863
$$ 260563 266374 272727 279738 287237 294933 302813 311209 320362 330014 339662 349116 358604 368329 378192
53442C78192R802R703R638R490R204Q924Q753Q593Q302P927P666P623P652P484
$$ 378192 387994 397697 407335 416825 426029 434953 443706 452299 460601 468528 476194 483817 491469 498953
53428D98953P060O712O823P314P639P373O709O171O017O100O188O189O082N866
$$ 498953 506013 512725 519548 526862 534501 541874 548583 554754 560771 566871 573059 579248 585330 591196
53414E91196N558N129M447L464K366J383N34k77r87j478j894k570l585m585n168
$$ 591196 596754 601883 606330 609794 612160 613543 614077 613800 612813 611335 609441 606871 603286 598701 593533
53399E93533n226m978m785m982n631o391o830o900o905p048p197p201p122p078
$$ 593533 588307 583329 578544 573562 567931 561540 554710 547810 540905 533857 526660 519459 512337 505259
53385E05259p039o914o663o279n749n117m455l791l165k693k370j912j133l30
$$ 505259 498220 491306 484643 478364 472615 467498 463043 459252 456087 453394 451024 449112 447979 447649
53371D47649L3K8K19Q66J635K194K581K899L124L402M097N177O112O635P138P929
$$ 447649 447682 447710 447929 448795 450430 452624 455205 458104 461228 464630 468727 473904 480016 486651 493789 501718
53355E01718Q671R029R378J0135J0922J1082J0840J1037J1883J2768J3304J3777
$$ 501718 510389 519418 528796 538931 549853 560935 571775 582812 594695 607463 620767 634544
53343F34544J4410J4970J5365J5957J6918J7857J8404J8733J9150J9577J9805
$$ 634544 648954 663924 679289 695246 712164 730021 748425 767158 786308 805885 825690
53332H25690J9935K0194K0580K0953K1256K1374K1114K0524J9963J9606J9149
$$ 825690 845625 865819 886399 907352 928608 949982 971096 991620 1011583 1031189 1050338
53321A050338J8264J7048J5780J4510J3203J1981J0880R656Q122O474M917L269
$$ 1050338 1068602 1085650 1101430 1115940 1129143 1141124 1152004 1161660 1169782 1176256 1181173 1184442
53309A184442J267q98k826m521o349q471j0709j2890j4912j6579j7741j8537j9187
$$ 1184442 1185709 1184811 1181985 1177464 1171115 1162644 1151935 1139045 1124133 1107554 1089813 1071276 1052089
53296A052089j9618j9651j9522j9672k0072k0159j9618j8787j8165j7855j7657
$$ 1052089 1032471 1012820 993298 973626 953554 933395 913777 894990 876825 858970 841313
53285H41313j7417j7096j6709j6352j6103j5827j5297j4609j4109j3872j3503
$$ 841313 823896 806800 790091 773739 757636 741809 726512 711903 697794 683922 670419
53274F70419j2663j1507j0442r611q898q240p692p271o901o513o091n725n588
$$ 670419 657756 646249 635807 626196 617298 609058 601366 594095 587194 580681 574590 568865 563277
53261E63277n753n992n935n507m946m412l855l335l102l144l018k392j518q54
$$ 563277 557524 551532 545597 540090 535144 530732 526877 523542 520440 517296 514278 511886 510368 509514
53247E09514m60q0L66P86J245J898K617L110L399L838M587N412O091O692P324
$$ 509514 509054 508974 509340 510126 511371 513269 515886 518996 522395 526233 530820 536232 542323 549015 556339
53232E56339P866Q155Q211Q182Q136Q117Q157Q209Q159P999P789P420O607N287
$$ 556339 564205 572360 580571 588753 596889 605006 613163 621372 629531 637530 645319 652739 659346 664633
53218F64633L834K701J970J462J021N12l38j718l363m703n477n976o563p229p745
$$ 664633 668467 671168 673138 674600 675621 676133 675795 674077 670714 666011 660534 654558 647995 640766 633021
53203F33021q103q556r273j0128j0829j1153j1101j0926j0992j1412j1879j1964
$$ 633021 624918 616362 607089 596961 586132 574979 563878 552952 541960 530548 518669 506705
53191E06705j1628j1232j1011j0795j0386r959r821r903r839r531r259r210r174
$$ 506705 495077 483845 472834 462039 451653 441694 431873 421970 412131 402600 393341 384131 374957
53178C74957q916q560q353q240q006p654p352p062o517n657m830m397m342m422
$$ 374957 366041 357481 349128 340888 332882 325228 317876 310814 304297 298640 293810 289413 285071 280649
53164B80649m512m693m995n202n024m471l978m004m480m879m905m897n249n708
$$ 280649 276137 271444 266449 261247 256223 251752 247774 243770 239290 234411 229506 224609 219360 213652
53150B13652n620m848l976l512l346l170l033l121l330l404l360l389l466l394
$$ 213652 208032 203184 199208 195696 192350 189180 186147 183026 179696 176292 172932 169543 166077 162683
53136A62683l196l105l175l208l077k887k752k642k508k325k050j697j462j560
$$ 162683 159487 156382 153207 149999 146922 144035 141283 138641 136133 133808 131758 130061 128599 127039
53122A27039j877k091k084k005j868j517j025q12j038j282j120p77p78j138j371
$$ 127039 125162 123071 120987 118982 117114 115597 114572 113760 112722 111440 110320 109543 108765 107627 106256
53107A06256j237j011r63r72q29o07m89m25k33R8M12N86O09M69J67k05m85n86
$$ 106256 105019 104008 103045 102073 101244 100637 100148 99723 99490 99588 100000 100586 101195 101664 101831 101626 101141 100555
53089A00555n30l93k57j60q4J3J00M2k05m92o20n51l83j54J53M51N47M06K57L24
$$ 100555 100025 99632 99375 99215 99131 99144 99244 99286 99081 98589 97969 97418 97035 96881 97034 97485 98032 98438 98695 99019
53069I9019N35O01L94J23Q8L14N38N33L89L88O32R07R82R03Q93R59Q45M05j51
$$ 99019 99554 100155 100549 100672 100760 101074 101612 102145 102534 102922 103554 104461 105443 106346 107239 108198 109043 109448 109297
53050A09297m90n26l98j87R5L30K87q7n32p30o35m33l30m39p66j180j400j219
$$ 109297 108807 108281 107883 107696 107791 108121 108408 108321 107789 107059 106424 105991 105661 105222 104456 103276 101876 100657
53032A00657p10k11K5J8l7nO5ll19p66j097j166j045q13m34N3L40J35l67n99k89
$$ 100657 99947 99736 99761 99779 99742 99737 99802 99799 99480 98714 97617 96451 95406 94593 94159 94212 94552 94687 94320 93721 93432
53011I3432K09M01K63J24J56K18J89J15%k63o87r93q92m16R2L44L56L23L50L56
$$ 93432 93641 94042 94305 94429 94585 94803 94992 95107 95107 94844 94157 93164 92272 91856 91948 92292 92648 92971 93321 93677
52991I3677K69J89K76M75M75J06l70n18k94j10l25p62r38o36j32J59J00j24k84
$$ 93677 93946 94135 94411 94886 95361 95467 95097 94579 94285 94175 93850 93088 92150 91514 91382 91541 91641 91517 91233
52972I1233k96j96l3J84M29O53P99Q14O53L36Qj50q3O3J22Q2L1Nl5q5p7QP1J2
$$ 91233 90937 90741 90708 90892 91321 91974 92773 93587 94240 94576 94584 94434 94351 94414 94536 94618 94649 94654 94619 94534 94457 94465 94536 94548
52948I4548j12j35L4K66L35J80mPJ42J40o4j99n6J71J41j40l16j56K05N10O67
$$ 94548 94436 94301 94335 94601 94936 95116 95112 95119 95261 95401 95337 95138 95082 95253 95394 95254 94938 94782 94987 95497 96164
52927I6164P20P29P51Q15Q38O75L47Q1M7J74L18M59O32P61P13M64J29j50k60j75
$$ 96164 96884 97613 98364 99179 100017 100692 101039 101120 101167 101341 101659 102118 102750 103511 104224 104688 104817 104667 104407 104232
52907A04232j3jk16m81n12j83M11J041J407J265O34j59p49j004j014q91o98m93
$$ 104232 104219 104218 104002 103521 103009 102826 103237 104278 105685 106950 107584 107425 106676 105672 104658 103767 103069 102576
52889A02576l24j99j27j18r5L2J61N6k70m45k70n5j83m64m15l5J49j29m96n25
$$ 102576 102252 102053 101926 101808 101713 101745 101906 101962 101692 101247 100977 100922 100739 100275 99860 99825 99974 99845 99349 98824
52869I8824k71j6J73L26K88o6m75n49k84j7Q9J35J58J7k39k80L9L58K35k34n21
$$ 98824 98553 98537 98710 99036 99324 99258 98783 98234 97950 97933 98022 98157 98315 98332 98093 97813 97852 98210 98445 98211 97690
52848I7690l46J6J85J46J01L4k37o37p77m56L2K68K40K51M25N99O86P72Q42O75
$$ 97690 97344 97360 97545 97691 97792 97826 97589 96952 96175 95719 95751 96019 96259 96510 96935 97534 98220 98992 99834 100509
52828A00509K31j33r6J68K06r5m13m46k68r1L7K35N64Q83R46O20J00j95k5M20
$$ 100509 100740 100607 100511 100679 100885 100790 100377 99931 99663 99572 99609 99844 100408 101291 102237 102857 102957 102762 102737 103157
52808A03157P42Q28Q64R46Q69M29k61q75j244j411j418j207p83l69k69n75j022
$$ 103157 103899 104727 105591 106537 107406 107835 107574 106699 105455 104044 102626 101419 100636 100267 99998 99423 98401
52791I8401j209r91o45n76q38j091j004o51l61k67k00rJ79J56l0j06M9K83M15
$$ 98401 97192 96201 95556 94980 94142 93051 92047 91396 91035 90768 90568 90559 90738 90894 90864 90758 90807 91090 91505
52772I1505M48M04K03j07j66K94R22R77K58n62p72m95l75o02p49n33k57k69l88
$$ 91505 91953 92357 92560 92453 92287 92581 93503 94480 94738 94176 93404 92909 92534 91932 91183 90650 90393 90124 89736
52753H9736j57M69J017J027N45N4oL35N97L79j69n32m76k73j83q0K10M38K43k76
$$ 89736 89579 90048 91065 92092 92637 92691 92685 93020 93617 93996 93827 93295 92819 92546 92363 92283 92493 92931 93174 92898
52733I2898o25n67l37j81m2J88L89L91K02p8m02o86p49n38k60j26q9mJ05J28J02
$$ 92898 92273 91706 91369 91188 91146 91334 91723 92114 92316 92238 91836 91150 90401 89863 89603 89477 89388 89384 89489 89617 89719
52712H9719J23J34Rj80k22o6J15K00K25K75L52M25M13K08j51l33r2L17L70Kk74
$$ 89719 89842 89976 89985 89805 89583 89517 89632 89832 90057 90332 90684 91109 91522 91730 91579 91246 91154 91471 91841 91843 91569
52691I1569p4L50N58N42N81P05O71M35K45K52L41L95M85O97R34J015Q75O02L74
$$ 91569 91495 91845 92403 92945 93526 94231 94902 95337 95582 95834 96175 96570 97055 97752 98686 99701 100576 101178 101552
52672A01552L13L58L28J73R9K33L61K00j22j96M4J99j2l76n77o24o43n38k39k5
$$ 101552 101865 102223 102551 102724 102823 103056 103417 103617 103495 103299 103343 103542 103530 103154 102577 101953 101310 100772 100533 100508
52652A00508j88m72l48J56L55j45q12q60k46L49M17J08j85k79j78J14M73N63J73
$$ 100508 100320 99848 99500 99656 100011 99866 99054 98194 97948 98297 98714 98822 98637 98358 98180 98294 98767 99330 99503
52633I9503m68r16r81q02m99p4L14L55Kl50l34m7J24L1j58k46j72O6L78N54M64
$$ 99503 99035 98119 97138 96336 95837 95763 96077 96432 96434 96084 95750 95703 95827 95858 95700 95454 95282 95348 95726 96280 96744
52612I6744K90L36O01P76O92N06L67K48J48J97L99M51J36l04m02l3M88P87Q12
$$ 96744 97034 97370 97971 98747 99439 99945 100312 100560 100708 100905 101304 101755 101891 101587 101185 101152 101640 102427 103239
52593A03239P81Q70R92Q85M68Oj95j81j98k40p6K57L53L0l77n58o82r55j076o54
$$ 103239 104020 104890 105882 106767 107235 107241 107046 106865 106667 106427 106351 106608 106961 106991 106614 106056 105374 104419 103343 102689
52573A02689O5M42L37K27M37P62R73J142J286J157O52J05j88l72o96j006r33m78
$$ 102689 102754 103196 103533 103760 104197 104959 105932 107074 108360 109517 110169 110274 110086 109714 109018 108012 107079 106601
52555A06601j7J65R3j02l30m90m88l35j28P5K20J88n9l46m16k32J9K12L82N52
$$ 106601 106584 106749 106842 106740 106410 105920 105432 105097 104969 105044 105264 105452 105393 105047 104631 104399 104418 104630 105012 105564
52535A05564O17M86K37M4j5o0k46n64p69o52l14p5m5MK95O65P59M79P2j67j43
$$ 105564 106181 106667 106904 106948 106933 106873 106627 106063 105294 104642 104328 104253 104208 104212 104507 105172 105931 106410 106482 106315 106172
52514A06172N4K37K45Q1p4o8K3M1j2j5Oq3k69l20q9K73M83L68k2m70p33p70p82
$$ 106172 106226 106463 106708 106789 106715 106647 106670 106711 106699 106684 106690 106607 106338 106018 105929 106202 106685 107053 107031 106561 105828 105058 104276
52491A04276r27j007o61Q2P49R65Q24N84L04o0l80m75l79k61j55J0J81K38K43
$$ 104276 103349 102342 101681 101763 102512 103477 104301 104885 105189 105129 104749 104274 103895 103634 103479 103489 103670 103908 104151
52472A04151L36M27K65j20l41j69J23J50n6j24J15M47N96N05K74J7j53j06J64
$$ 104151 104487 104914 105179 105059 104718 104549 104672 104822 104766 104642 104757 105204 105800 106305 106579 106596 106443 106337 106501
52453A06501N12P81R56J067J046P87L55L4N9L62O12N23J05l84o95p78p24o33n21
$$ 106501 107013 107794 108750 109817 110863 111650 112005 112039 112098 112460 113072 113595 113700 113316 112621 111843 111119 110486 109965
52434A09965l88k73k28k93m53o32p00n60k53M0J88K25K57K85K01Qj06M3M20P64
$$ 109965 109577 109304 109076 108783 108330 107698 106998 106438 106185 106225 106413 106638 106895 107180 107381 107389 107283 107326 107746 108510
52414A08510Q43O50L85K50K81L16J99j0p4J38M43N63M87M59O42Q97R92Q93O71
$$ 108510 109353 110003 110388 110638 110919 111235 111434 111424 111350 111488 111931 112494 112981 113440 114082 114979 115971 116864 117535
52395A17535L02k92r59j347j244q36n03m37n26n42l49mK76K67m2l73m44k97k57
$$ 117535 117837 117545 116586 115239 113995 113159 112656 112219 111693 111151 110802 110798 111074 111341 111299 110926 110482 110185 109928
52376A09928m89p69p17k76J97K99J4k66j70K44N83N89M01K89K65J56k1%K89N26
$$ 109928 109439 108670 107953 107677 107874 108173 108187 107921 107751 107995 108578 109167 109568 109857 110122 110278 110257 110257 110546 111072
52356A11072M23J78K60P74J319J524J451J382J408J428J454J638J989K235K076
$$ 111072 111495 111673 111933 112707 114026 115550 117001 118383 119791 121219 122673 124311 126300 128535 130611
52341A30611J516Q30K92l8k50m72p79j128j307j075m90Nn3o62j314j502j159n86
$$ 130611 132127 132957 133249 133211 132961 132489 131710 130582 129275 128200 127710 127715 127662 127000 125686 124184 123025 122439
52323A22439q3K52M64N88N88M16J31k2J91P14J199J372J323J299J353J361J270
$$ 122439 122356 122608 123072 123660 124248 124664 124795 124773 124964 125678 126877 128249 129572 130871 132224 133585 134855
52306A34855J153J039Q69O32L93K05J43L49Q49J311J306Q35L55K03K65L30M60
$$ 134855 136008 137047 137916 138548 138941 139146 139289 139638 140487 141798 143104 143939 144294 144497 144762 145092 145552
52289A45552P74J111J196J071J035J224J490J693J825J867J788J677J710J874
$$ 145552 146326 147437 148633 149704 150739 151963 153453 155146 156971 158838 160626 162303 164013 165887
52275A65887J967J925J969K314K840L257L446L550L773M196M724N156N352N433
$$ 165887 167854 169779 171748 174062 176902 180159 183605 187155 190928 195124 199848 205004 210356 215789
52261B15789N710O331P016P266O904O297O024O305O832P139P111P004P024P051
$$ 215789 221499 227830 234846 242112 249016 255313 261337 267642 274474 281613 288724 295728 302752 309803
52247C09803O877O542O247O052N882N776N859O024N934N485N010M843M836M572
$$ 309803 316680 323222 329469 335521 341403 347179 353038 359062 364996 370481 375491 380334 385170 389742
52233C89742L894L016K159J353N93m1m89p90j003j149j204j138r35p15o91q74
$$ 389742 393636 396652 398811 400164 400757 400716 400227 399437 398434 397285 396081 394943 394008 393293 392602 391728
52217C91728r57o87k55m8l4K43R86J824K321K515K701K957L165L350L665M071
$$ 391728 390771 390084 389829 389781 389747 389990 390976 392800 395121 397636 400337 403294 406459 409809 413474 417545
52201D17545M354M441M482M591M694M712M701M746M851M926M830M441L810L207
$$ 417545 421899 426340 430822 435413 440107 444819 449520 454266 459117 464043 468873 473314 477124 480331
52187D80331K865K688K363J761J048L94k24r03j636k361l008l472l662l660l692
$$ 480331 483196 485884 488247 490008 491056 491450 491226 490323 488687 486326 483318 479846 476184 472524 468832
52172D68832l873m095m196m130l928l584l108k560k029j637j546j774k039j985
$$ 468832 464959 460864 456668 452538 448610 445026 441918 439358 437329 435692 434146 432372 430333 428348
52158D28348j663j479j580j557r90m8O91R29Q61Q20R17J086J218J243J163J084
$$ 428348 426685 425206 423626 422069 421079 421031 421722 422651 423512 424332 425249 426335 427553 428796 429959 431043
52142D31043J147J421J845K160K032J427Q75R60J528J792J419J037J289J872K012
$$ 431043 432190 433611 435456 437616 439648 441075 441950 442910 444438 446230 447649 448686 449975 451847 453859
52127D53859J628J309J286J123M99l09r16j314j674k019k324k591k719k557k256
$$ 453859 455487 456796 458082 459205 459704 459395 458479 457165 455491 453472 451148 448557 445838 443281 441025
52112D41025k137k183k016j536j143j083j060p39l07j09j08p5k4p3q6J51N21O99
$$ 441025 438888 436705 434689 433153 432010 430927 429867 429128 428821 428712 428604 428529 428505 428432 428346 428497 429018 429717
52094D29717N97L69J28m2J7L31O52P76Q41J005J041O91J88n2o5j94l60j02O25
$$ 429717 430314 430683 430811 430769 430786 431117 431769 432545 433386 434391 435432 436123 436311 436259 436194 436000 435640 435538 436163
52075D36163J273J454J434J635K066K509K968L572M295M980N541N979O289O476
$$ 436163 437436 438890 440324 441959 444025 446534 449502 453074 457369 462349 467890 473869 480158 486634
52061D86634O614O767O992P412Q083Q797R188R143Q916Q742Q551Q167P598P013
$$ 486634 493248 500015 507007 514419 522502 531299 540487 549630 558546 567288 575839 584006 591604 598617
52047E98617O536O161N781N285M677M155L866L658L256K630J979J356N96l39j247
$$ 598617 605153 611314 617095 622380 627057 631212 635078 638736 641992 644622 646601 647957 648553 648214 646967
52032F46967k000k717l514m336n093n736o095n951n406m894m657m469m038l433
$$ 646967 644967 642250 638736 634400 629307 623571 617476 611525 606119 601225 596568 592099 588061 584628
52018E84628k887k450k044j668j286p24L3O70R30J035J414K123K844L371L763
$$ 584628 581741 579291 577247 575579 574293 573569 573602 574272 575202 576237 577651 579774 582618 585989 589752
52003E89752M066M201M150M051M016M036M068M060L923L612L191K727K148J373
$$ 589752 593818 598019 602169 606220 610236 614272 618340 622400 626323 629935 633126 635853 638001 639374
51989F39374N17j99p21j216j834k580l389m204m997n747o382o730o655o306o068
$$ 639374 639891 639692 638971 637755 635921 633341 629952 625748 620751 615004 608622 601892 595237 588931 582863
51974E82863o129o256o168n884n627n468n413n547n860o076n989n817n859n944
$$ 582863 576734 570478 564310 558426 552799 547331 541918 536371 530511 524435 518446 512629 506770 500826
51960E00826n666n079m712m790m968m901m730m677m625m406m200m355m887n507
$$ 500826 495160 490081 485369 480579 475611 470710 465980 461303 456678 452272 448072 443717 438830 433323
51946D33323n998o349o587o755o965p304p673p868p761p302o495n555m958n059
$$ 433323 427325 420976 414389 407634 400669 393365 385692 377824 370063 362761 356266 350711 345753 340694
51932C40694n656o122o014n463m942m810n086n515n774n705n399n074m853m752
$$ 340694 335038 328916 322902 317439 312497 307687 302601 297086 291312 285607 280208 275134 270281 265529
51918B65529m793m998n259n286m842l961k963k234j944j898j680j015l7Q80J490
$$ 265529 260736 255738 250479 245193 240351 236390 233427 231193 229249 227351 225671 224656 224619 225499 226989
51903B26989J805J933J893J678J335R29N21K47L00O90J113J233J067R42J111J524
$$ 226989 228794 230727 232620 234298 235633 236562 237083 237330 237630 238320 239433 240666 241733 242675 243786 245310
51887B45310K011K485K974L609M596N954P242P797P397O465N399M066K279M47
$$ 245310 247321 249806 252780 256389 260985 266939 274181 281978 289375 295840 301239 305305 307584 308031
51873C08031p60j334j927k891l860m452m855n343n726n718n587n878o582p075
$$ 308031 307271 305937 304010 301119 297259 292807 287952 282609 276883 271165 265578 259700 253118 246043
51859B46043o898o221n513n037m788m626m372l947l469l078k681k113j467j021
$$ 246043 239145 232924 227411 222374 217586 212960 208588 204641 201172 198094 195413 193300 191833 190812
51845A90812q11n44m8M34N90M51L10K70J53k42q52j409j714j821j951k195k393
$$ 190812 190001 189457 189409 189843 190433 190884 191194 191464 191617 191375 190523 189114 187400 185579 183628 181433 179040
51828A79040k338k024j626j270r52o03j80L27Q50J270J541J727J825J719J406
$$ 179040 176702 174678 173052 171782 170830 170227 170047 170374 171224 172494 174035 175762 177587 179306 180712
51813A80712J106R85R57Q97Q58Q61O67J14n19q13p92p80p90n47n4L58N49O43N81
$$ 180712 181818 182803 183760 184657 185515 186376 187043 187157 186638 185825 185033 184253 183463 182916 182862 183220 183769 184412 184993
51794A84993J38m85p03l95j50m11q85j193j466j872k060j734j326j452j913j970
$$ 184993 185131 184646 183943 183548 183398 182987 182102 180909 179443 177571 175511 173777 172451 170999 169086 167116
51778A67116j463r51q14q07o51m58m17m83n41n40l55Q4M81M03r9m73m11k17k44
$$ 167116 165653 164702 163888 163081 162430 161972 161555 161072 160531 159991 159636 159720 160201 160604 160505 160032 159621 159404 159160
51759A59160l92l89k28n4J41L99N89N28K45q7l17l57j79O7J22o0k37k49k23k66
$$ 159160 158768 158379 158151 158097 158238 158637 159226 159754 159999 159912 159595 159238 159059 159126 159248 159188 158951 158702 158479 158213
51739A58213k33QK92M18M76O18O67L13l60q84r39o74m20k94j79N7L96O55O22K84
$$ 158213 157980 157988 158280 158698 159174 159792 160459 160772 160412 159528 158589 157915 157495 157201 157022 157079 157475 158130 158752 159036
51719A59036j11k81j71P1L08N01O50P96J004J269J501J656J788J888J800J492
$$ 159036 158925 158644 158473 158544 158852 159353 160003 160799 161803 163072 164573 166229 168017 169905 171705 173197
51703A73197J249J314J454J134J87r69j830k251k364k273k018j707j471j363j335
$$ 173197 174446 175760 177214 178348 178535 177566 175736 173485 171121 168848 166830 165123 163652 162289 160954
51688A60954j317j229j030p85o23o01o32o05m50j05M32J018J448J703J952K242
$$ 160954 159637 158408 157378 156593 155970 155369 154737 154132 153682 153577 154009 155027 156475 158178 160130 162372
51672A62372K339K010J405R44R04J208J579J794J791J652J470J170N35m75j512
$$ 162372 164711 166721 168126 169070 169974 171182 172761 174555 176346 177998 179468 180638 181173 180698 179186
51657A79186k085j975j364o28j48k23q57j607j903j593j039n86j70L73Q97J110
$$ 179186 177101 175126 173762 173134 172986 172763 171906 170299 168396 166803 165764 165178 165008 165381 166278 167388
51641A67388R94P74N20Q4n14r55j006q18o68n80l95r7J23Q3k38p18j140j250j032
$$ 167388 168382 169156 169676 169760 169246 168291 167285 166467 165799 165219 164824 164727 164850 164933 164695 163977 162837 161587 160555
51622A60555p71p46q08n90p1L56M79N89R79J387J315P59K55K04N16R62J511K145
$$ 160555 159784 159038 158230 157640 157569 157925 158404 158993 159972 161359 162674 163433 163688 163892 164408 165370 166881 169026
51604A69026K599K570K062J340O50J38j32k80n86j141j565j405p18rM09O62Q95
$$ 169026 171625 174195 176257 177597 178247 178385 178253 177973 177387 176246 174681 173276 172558 172549 172958 173620 174515
51587A74515R56O76J95k30n41q20j057j216j405j732k110k361k441k364k075j624
$$ 174515 175471 176147 176342 176112 175571 174751 173694 172478 171073 169341 167231 164870 162429 160065 157990 156366
51571A56366j327j436j687j612j206r02q18n23K23R07Q46M7q50j364j503j397
$$ 156366 155039 153603 151916 150304 149098 148196 147378 146855 147078 147985 148831 148878 148028 146664 145161 143764
51555A43764j072o42l73l73m23k65P6L87N54O06N75M56L25L42O10J076J583J999
$$ 143764 142692 142050 141677 141304 140881 140616 140692 141079 141633 142239 142814 143270 143595 143937 144547 145623 147206 149205
51537A49205K281K458K603K809L082L200K818J850P17J4j12n8k30n93q50q16m57
$$ 149205 151486 153944 156547 159356 162438 165638 168456 170306 171023 171037 170925 170867 170637 170044 169194 168378 167921
51520A67921K34J157J995K497K760L025L231L112K695K394K548L048L544L759
$$ 167921 168155 169312 171307 173804 176564 179589 182820 185932 188627 191021 193569 196617 200161 203920
51506B03920L563K998K386K218K697L552M369N024N661O374P087P596P660P144
$$ 203920 207483 210481 212867 215085 217782 221334 225703 230727 236388 242762 249849 257445 265105 272249
51492B72249O201N200M348L472K334J003k16j191k059k956l785m336m582m799
$$ 272249 278450 283650 287998 291470 293804 294807 294591 293400 291341 288385 284600 280264 275682 270883
51478B70883n345o231o981p124o798o587o719o755o252n430m812m459l987l266
$$ 270883 265538 259307 252326 245202 238404 231817 225098 218343 212091 206661 201849 197390 193403 190137
51464A90137k654k446k534k669k763k792k640k313k070k116k301k291j965j487
$$ 190137 187483 185037 182503 179834 177071 174279 171639 169326 167256 165140 162839 160548 158583 157096
51450A57096j056o98l69j06m2k48n66o78m51j26l6k03l64l71k90j58R6M18N55
$$ 157096 156040 155342 154973 154867 154825 154577 154011 153333 152882 152756 152720 152517 152153 151782 151492 151334 151430 151848 152403
51431A52403M19K43K43K81J19k02m49n29n01l87j96q7k30n38p69q80j042j312
$$ 152403 152822 153065 153308 153589 153708 153506 153057 152528 152027 151640 151444 151357 151127 150589 149820 148940 147898 146586
51413A46586j504j424j140r01r26j225j570j583j099l43K70N38N05K46j68n17
$$ 146586 145082 143658 142518 141617 140691 139466 137896 136313 135214 134871 135141 135679 136184 136430 136262 135745
51397A35745n25j92K40O44J111J624J924J867J654J571J675J935K400L032L548
$$ 135745 135220 135028 135268 135912 137023 138647 140571 142438 144092 145663 147338 149273 151673 154705 158253
51382A58253L717L677L643L471K845J846R41L55j44p69j336j575j568j631j934
$$ 158253 161970 165647 169290 172761 175606 177452 178393 178748 178604 177835 176499 174924 173356 171725 169791
51367A69791k394k817k970k686k106j675j660j819j711j314r87q91p45k59M00
$$ 169791 167397 164580 161610 158924 156818 155143 153483 151664 149953 148639 147652 146761 146016 145757 146157
51352A46157Q17P94N16L47N38J039J502J547J132O47M86O59R09J091J285J534
$$ 146157 146974 147768 148284 148631 149169 150208 151710 153257 154389 155036 155522 156181 157090 158181 159466 161000
51336A61000J724J744J667J658J813K089K392K633K813L019L316L659L996M444
$$ 161000 162724 164468 166135 167793 169606 171695 174087 176720 179533 182552 185868 189527 193523 197967
51322A97967N163O102O962P567Q043Q581R147R566R740R653R247Q474P405O129
$$ 197967 203130 209232 216194 223761 231804 240385 249532 259098 268838 278491 287738 296212 303617 309746
51308C09746M562K602M03j655l355m784o077p189q025q655r255r844j0238j0190
$$ 309746 314308 316910 317313 315658 312303 307519 301442 294253 286228 277573 268318 258474 248236 238046
51294B38046r632q779p962p338o759o005n112m319l721l184k639k277k259k449
$$ 238046 228414 219635 211673 204335 197576 191571 186459 182140 178419 175235 172596 170319 168060 165611
51280A65611k554k462k289k146j986j699j245p77n61p29j056j164j003r28j185
$$ 165611 163057 160595 158306 156160 154174 152475 151230 150453 149892 149163 148107 146943 145940 145012 143827
51265A43827j490j408r68n88m62l69j22J21J01j55l96l99j07L58O97O01O8n25
$$ 143827 142337 140929 139961 139373 138911 138542 138420 138541 138642 138487 138091 137692 137585 137943 138640 139241 139309 138784
51247A38784p73n78j24L54O59O57L86Q2o7j28k21k44oL86N21J84l28n34l28j8
$$ 138784 138011 137433 137309 137663 138322 138979 139365 139447 139380 139252 139031 138787 138781 139167 139688 139872 139544 139010 138682 138664
51227A38664J40K38M77P93R61R68J069J378J619J439Q96M09K53K84K35P1k5Q4
$$ 138664 138804 139042 139519 140312 141273 142241 143310 144688 146307 147746 148642 149051 149304 149588 149823 149894 149869 149953
51209A49953L44O09P39O51M04K09K35L86L48o6o53j020j006q06o75o12m53k20
$$ 149953 150297 150906 151645 152296 152700 152909 153144 153530 153878 153812 153159 152139 151133 150327 149652 149040 148587 148367
51191A48367j69m55q78j082r00m65k7J97J49l9j50j56k77o80j198j509j469j121
$$ 148367 148198 147743 146865 145783 144883 144418 144391 144588 144737 144698 144548 144392 144115 143435 142237 140728 139259 138138
51173A38138n08K56P70O44J6m91m90k39j65l04l45r8L58Q36J141J143R13P21P29
$$ 138138 137630 137886 138656 139300 139316 138825 138335 138096 137931 137627 137282 137184 137542 138378 139519 140662 141575 142296 143025
51154A43025Q09P97P75Q82R93Q69N65L95N16P73R65J048J037R06O73M43L17L06
$$ 143025 143834 144631 145406 146288 147281 148150 148715 149110 149626 150399 151364 152412 153449 154355 155028 155471 155788 156094
51136A56094L67L85J97k36o79q43p24n30l36k1L88N83L27k25o78p45m34L2L47
$$ 156094 156461 156846 157043 156807 156128 155285 154561 154031 153695 153674 154062 154645 154972 154747 154069 153324 152890 152922 153269
51117A53269L37J27njp5l14m58k56Q6J26k47o54p40n59l86l01j21K95Q20J171
$$ 153269 153606 153733 153728 153727 153652 153338 152880 152624 152710 152836 152589 151935 151195 150636 150250 149949 149828 150123 150943 152114
51097A52114J192R35N47J14l02n74n62k78O3K44K40J74J19Pk32n10o66o44n44
$$ 152114 153306 154241 154788 154902 154600 154026 153464 153186 153249 153493 153733 153907 154026 154033 153801 153291 152625 151981 151437
51078A51437m38k73j8J69J10r3r1K59O26N81J13l50m11l3N32R77J103R16O41N16
$$ 151437 150999 150726 150708 150877 150987 150894 150803 151062 151688 152269 152382 152032 151621 151588 152120 153097 154200 155116 155757 156273
51058A56273N51N58M34L17L96O94J065J322J348J115O80J60l14n91n81l64j25
$$ 156273 156824 157382 157816 158133 158529 159223 160288 161610 162958 164073 164753 164913 164599 164008 163427 163063 162938
51041A62938Q8M25R10J227J067O18L89N58P81P13M52K97L56N45P77R30Q18M38
$$ 162938 163026 163451 164361 165588 166655 167273 167662 168220 169001 169714 170166 170463 170819 171364 172141 173071 173889 174327
51023A74327J04J28M31O84P39P17P34P52O94N65M28M07O62J195J703J852J687
$$ 174327 174431 174559 174990 175674 176413 177130 177864 178616 179310 179875 180303 180710 181372 182567 184270 186122 187809
51006A87809J608J885K407K910L299L624L967M409M986N483N483M801L791K996
$$ 187809 189417 191302 193709 196619 199918 203542 207509 211918 216904 222387 227870 232671 236462 239458
50992B39458K554K235J997K123K598K773K020O33m13o03m32o53j367k121k577
$$ 239458 242012 244247 246244 248367 250965 253738 255758 256391 255978 255375 254943 254290 252923 250802 248225
50977B48225k727k595k217j861j860k159k351k289k288k555k775k526j877j254
$$ 248225 245498 242903 240686 238825 236965 234806 232455 230166 227878 225323 222548 220022 218145 216891
50963B16891q41m83p0L06O11J004J595K228K635K728K668K707K915L084K938K508
$$ 216891 216050 215567 215497 215803 216414 217418 219013 221241 223876 226604 229272 231979 234894 237978 240916 243424
50947B43424K171K209K433K427K080J660J371J139Q76P19P96R51R02O63N86R68
$$ 243424 245595 247804 250237 252664 254744 256404 257775 258914 259790 260509 261305 262256 263158 263821 264407 265375
50931B65375J671K242K363K193K228K843L965N202O213O910P349P584P675P729
$$ 265375 267046 269288 271651 273844 276072 278915 282880 288082 294295 301205 308554 316138 323813 331542
50917C31542P819P894P910P994Q393R179J0124J0974J1771J2786J4089J5406J6444
$$ 331542 339361 347255 355165 363159 371552 380731 390855 401829 413600 426386 440475 455881 472325
50904D72325J7268J8184J9291K0384K1230K1768K2023K1956K1541K0844J9979
$$ 472325 489593 507777 527068 547452 568682 590450 612473 634429 655970 676814 696793
50893F96793J8965J7731J6190J4359J2404J0568Q931P336N659M103K996K350J837
$$ 696793 715758 733489 749679 764038 776442 787010 795941 803277 808936 813039 816035 818385 820222
50880H20222J276P91M43rp89j812k902m044n202o156o869p735r142j0895j2482
$$ 820222 821498 822289 822732 822723 821934 820122 817220 813176 807974 801818 794949 787214 778072 767177 754695
50865G54695j3792j5095j6424j7438j7999j8400j8865j9180j9070j8628j8142
$$ 754695 740903 725808 709384 691946 673947 655547 636682 617502 598432 579804 561662
50854E61662j7668j7072j6277j5328j4266j3157j2110j1161j0225r302q555q092
$$ 561662 543994 526922 510645 495317 481051 467894 455784 444623 434398 425096 416541 408449
50842D08449p763p324o684n918n136m496m133l966l649k951k068j393j041q13
$$ 408449 400686 393362 386678 380760 375624 371128 366995 363029 359380 356429 354361 352968 351927 351114
50828C51114n44k61nL01P02J106J396J630K012K723L723M709N310N388N176N094
$$ 351114 350570 350309 350304 350605 351307 352413 353809 355439 357451 360174 363897 368606 373916 379304 384480 389574
50812C89574N430O231P323Q394R180R667J0073J0563J1085J1566J2152J3024J4135
$$ 389574 395004 401235 408558 416952 426132 435799 445872 456435 467520 479086 491238 504262 518397
50799E18397J5334J6666J8278K0093K1910K3819K6162K8962L1714L3970L5865
$$ 518397 533731 550397 568675 588768 610678 634497 660659 689621 721335 755305 791170
50788G91170L7809L9886M1918M3896M5965M7954M9347M9844M9644M9000M7752
$$ 791170 828979 868865 910783 954679 1000644 1048598 1097945 1147789 1197433 1246433 1294185
50777A294185M5521M2166L7872L2887K7481K2024J6861J2070P561L393j54k877
$$ 1294185 1339706 1381872 1419744 1452631 1480112 1502136 1518997 1531067 1538628 1542021 1541867 1538990
50765A538990m832o175o952p166o839o034m908l897l600m325n881p961j0626j4148
$$ 1538990 1534158 1527983 1521031 1513865 1507026 1500992 1496084 1492187 1488587 1484262 1478381 1470420 1459794 1445646
50751A445646j8460k3068k7490l1533l5126l8115m0410m2136m3466m4350m4591
$$ 1445646 1427186 1404118 1376628 1345095 1309969 1271854 1231444 1189308 1145842 1101492 1056901
50740A056901m4083m2858m0977l8518l5697l2837l0147k7620k5165k2711k0167
$$ 1056901 1012818 969960 928983 890465 854768 821931 791784 764164 738999 716288 696121
50729F96121j7430j4581j1983r987q579p397o207n155m511m238m039l759l536
$$ 696121 678691 664110 652127 642140 633561 626164 619957 614802 610291 606053 602014 598255 594719
50716E94719l524l653l795m009m438n035n570n887o050o186o330o479o665o871
$$ 594719 591195 587542 583747 579738 575300 570265 564695 558808 552758 546572 540242 533763 527098 520227
50702E20227o940o723o263n726n150m437l630l020k732k406j514m4J454K565L473
$$ 520227 513287 506564 500301 494575 489425 484988 481358 478338 475606 473200 471686 471642 473096 475661 479134
50687D79134M531N713O794P840R099J0502J1710J2706J3843J5234J6517J7477
$$ 479134 483665 489378 496172 504012 513111 523613 535323 548029 561872 577106 593623 611100
50675F11100J8480J9932K1637K3026K3838K4270K4600K4979K5447K5859K5908
$$ 611100 629580 649512 671149 694175 718013 742283 766883 791862 817309 843168 869076
50664H69076K5442K4687K3831K2627K0705J8126J5230J2087Q561M859J487j393
$$ 869076 894518 919205 943036 965663 986368 1004494 1019724 1031811 1040372 1045231 1046718 1045325
50652A045325m074o671q793j0007j0309r903q932p614o295n117l880k538j482
$$ 1045325 1041251 1034580 1025787 1015780 1005471 995568 986636 979022 972727 967610 963730 961192 959710
50639I59710j147j464k136l205n024p715j0966j4306j7307j9614k1059k1827k2253
$$ 959710 958563 957099 954963 951758 946734 939019 928053 913747 896440 876826 855767 833940 811687
50626H11687k2439k2191k1341j9971j8259j6318j4223j2090j0032q065o113m108
$$ 811687 789248 767057 745716 725745 707486 691168 676945 664855 654823 646758 640645 636537
50614F36537k034P5K198M281O166P635Q591R149R417R395R151Q944Q920Q840Q435
$$ 636537 634503 634578 636776 641057 647223 654858 663449 672598 682015 691410 700561 709505 718425 727265 735700
50599G35700P942P882Q280Q580Q427Q099P942P841P591P360P425P680P850Q005
$$ 735700 743642 751524 759804 768384 776811 784910 792852 800693 808284 815644 823069 830749 838599 846604
50585H46604Q432R138R922J0801J1949J3247J4277J4867J5267J5725J6176J6374
$$ 846604 855036 864174 874096 884897 896846 910093 924370 939237 954504 970229 986405 1002779
50573A002779J6156J5449J4322J3044J1904J0924R899Q745P523O127M228J616
$$ 1002779 1018935 1034384 1048706 1061750 1073654 1084578 1094477 1103222 1110745 1116872 1121100 1122716
50561A122716j546m836p772r844j0701j0471r728q970q250p351o210m960l755
$$ 1122716 1121170 1116334 1108562 1098718 1088017 1077546 1067818 1058848 1050598 1043247 1037037 1032077 1028322
50548A028322k697j946j708k056k862l934n287p166r745j2769j5699j8217k0439
$$ 1028322 1025625 1023679 1021971 1019915 1017053 1013119 1007832 1000666 990921 978152 962453 944236 923797
50535I23797k2522k4281k5443k6036k6268k6125k5448k4369k3268k2270k1083
$$ 923797 901275 876994 851551 825515 799247 773122 747674 723305 700037 677767 656684
50524F56684j9474j7610j5774j4039j2382j0866r562q395p217n961m565k973j314
$$ 656684 637210 619600 603826 589787 577405 566539 556977 548582 541365 535404 530839 527866 526552
50511E26552J01J074J741K367L075L865M729N649O540P395Q293R223J0020J0631
$$ 526552 526653 527727 529468 531835 534910 538775 543504 549153 555693 563088 571381 580604 590624 601255
50497F01255J1236J1954J2587J2923J3111J3507J4203J4964J5565J5887J5796
$$ 601255 612491 624445 637032 649955 663066 676573 690776 705740 721305 737192 752988
50486G52988J5257J4629J4503J5071J5907J6533J6997J7713J8943K0613K2523
$$ 752988 768245 782874 797377 812448 828355 844888 861885 879598 898541 919154 941677
50475I41677K4456K6168K7560K8855L0358L2046L3615L4997L6506L8355M0248
$$ 941677 966133 992301 1019861 1048716 1079074 1111120 1144735 1179732 1216238 1254593 1294841
50464A294841M1718M2657M3265M3521M3066M1591L9175L6131L2700K8915K4622
$$ 1294841 1336559 1379216 1422481 1466002 1509068 1550659 1589834 1625965 1658665 1687580 1712202
50453A712202J9581J3715P247N59o099j2550j8490k3596k7819l1297l3911l5268
$$ 1712202 1731783 1745498 1752745 1753304 1747205 1734655 1716165 1692569 1664750 1633453 1599542 1564274
$$ [...]
##END NTUPLES=NMR SPECTRUM
##END=
