
##TITLE=UV1164_M6-1005-1000_6306959_pwj7lQewCS
##JCAMPDX= 6.0         $$ Bruker NMR JCAMP-DX V2.0
##DATA TYPE= NMR SPECTRUM
##DATA CLASS= NTUPLES
##ORIGIN= BRUKER
##OWNER= Administrator
$$ 1.72 TOPSPIN		Version 2.1
$$ 2012-06-07 01:06:11.562 -0500  Administrator@TOPSPIN
$$ Compression mode = diff/dup
##.OBSERVE FREQUENCY= 400.13188235
##.OBSERVE NUCLEUS= ^1H
##.ACQUISITION MODE= SIMULTANEOUS (DQD)
##.ACQUISITION SCHEME= undefined
##.AVERAGES= 8
##.DIGITISER RES= 22
##SPECTROMETER/DATA SYSTEM= spect
##.PULSE SEQUENCE= zg30
##.SOLVENT NAME= COFFEE_meoh
##.SHIFT REFERENCE= INTERNAL, COFFEE_meoh, 1, 14.98061
##AUDIT TRAIL= $$ (NUMBER, WHEN, WHO, WHERE, PROCESS, VERSION, WHAT)
$$ ##TITLE= Audit trail, TOPSPIN		Version 2.1
$$ ##JCAMPDX= 5.01
$$ ##ORIGIN= Bruker BioSpin GmbH
$$ ##OWNER= Administrator
$$ $$ C:\Bruker\TOPSPIN/data/COFFEE/nmr/UV1164_M6-1005-1000_6306959_pwj7lQewCS/10/pdata/1/auditp.txt
$$ ##AUDIT TRAIL=  $$ (NUMBER, WHEN, WHO, WHERE, PROCESS, VERSION, WHAT)
(   1,<2012-06-07 01:06:02.375 -0500>,<Administrator>,<TOPSPIN>,<go>,<TOPSPIN 2.1>,
      <created by zg
	started at 2012-06-07 01:04:55.828 -0500,
	POWCHK enabled, PULCHK disabled,
       configuration hash MD5:
       D5 CA 7A 23 FE 6B EE E2 50 67 74 61 24 F7 5E 3B
       data hash MD5: 64K
       1F 9A 45 1E 0B C5 1A C5 75 65 0C 84 6D F7 F7 4C>)
(   2,<2012-06-07 01:06:06.875 -0500>,<Administrator>,<TOPSPIN>,<proc1d>,<TOPSPIN 2.1>,
      <Start of raw data processing
       efp LB = 0 FT_mod = 6 PKNL = 1 PHC0 = 0 PHC1 = 0 SI = 32K 
       data hash MD5: 32K
       73 CA 6B 4C 60 92 FB 84 DE C5 6C 38 2E 49 80 EE>)
(   3,<2012-06-07 01:06:07.359 -0500>,<Administrator>,<TOPSPIN>,<proc1d>,<TOPSPIN 2.1>,
      <pk PHC0 = 209.3555 PHC1 = 0 
       data hash MD5: 32K
       D7 E9 D0 AF BC 12 F4 CA 65 FA 9B D7 64 C8 03 6A>)
(   4,<2012-06-07 01:06:07.468 -0500>,<Administrator>,<TOPSPIN>,<proc1d>,<TOPSPIN 2.1>,
      <abs ABSG = 1 
       data hash MD5: 32K
       C2 5C 07 38 33 A0 A2 6F 67 D5 99 E3 FF 73 51 2D>)
(   5,<2012-06-07 01:06:07.500 -0500>,<Administrator>,<TOPSPIN>,<proc1d>,<TOPSPIN 2.1>,
      <abs ABSG = 2 
       data hash MD5: 32K
       FD 08 A9 A3 1F 14 8C DB 57 C8 26 78 1C 85 EF 42>)
(   6,<2012-06-07 01:06:07.531 -0500>,<Administrator>,<TOPSPIN>,<proc1d>,<TOPSPIN 2.1>,
      <abs ABSG = 3 
       data hash MD5: 32K
       3C C2 5E A4 51 74 68 C8 46 9E AC 54 BE D9 B0 4F>)
(   7,<2012-06-07 01:06:07.562 -0500>,<Administrator>,<TOPSPIN>,<proc1d>,<TOPSPIN 2.1>,
      <abs ABSG = 4 
       data hash MD5: 32K
       FD 1F 7C E6 F4 7D 07 6C 77 E5 AD ED 31 CA DF 5D>)
(   8,<2012-06-07 01:06:07.609 -0500>,<Administrator>,<TOPSPIN>,<proc1d>,<TOPSPIN 2.1>,
      <abs ABSG = 5 
       data hash MD5: 32K
       F1 B1 B2 A5 48 07 C0 41 B9 F5 7E 6C 5E A9 6C 18>)
$$ ##END=
$$ 
$$ $$ hash MD5
$$ $$ 3F 91 B3 DA C7 5D D5 3D E3 14 18 6F A2 1A F3 1C
##$RELAX= 
##$RELAX= 
##$RELAX= 
##$RELAX= 
##$RELAX= 
##$RELAX= 
##$RELAX= 
$$ Bruker specific parameters
$$ --------------------------
$$ [...]
150 150 150 150 150 150 150 150
##$TP07= 0
##$TPNAME0= <>
##$TPNAME1= <>
##$TPNAME2= <>
##$TPNAME3= <>
##$TPNAME4= <>
##$TPNAME5= <>
##$TPNAME6= <>
##$TPNAME7= <>
##$TPOAL= (0..7)
0.5 0.5 0.5 0.5 0.5 0.5 0.5 0.5
##$TPOFFS= (0..7)
0 0 0 0 0 0 0 0
##$TUNHIN= 0
##$TUNHOUT= 0
##$TUNXOUT= 0
##$USERA1= <user>
##$USERA2= <user>
##$USERA3= <user>
##$USERA4= <user>
##$USERA5= <user>
##$V9= 5
##$VALIST= <valist>
##$VCLIST= <CCCCCCCCCCCCCCC>
##$VD= 0
##$VDLIST= <DDDDDDDDDDDDDDD>
##$VPLIST= <PPPPPPPPPPPPPPP>
##$VTLIST= <TTTTTTTTTTTTTTT>
##$WBST= 2048
##$WBSW= 25
##$XGAIN= (0..3)
0 0 0 0
##$XL= 0
##$YL= 0
##$YMAX_a= 535390
##$YMIN_a= -656301
##$ZGOPTNS= <>
##$ZL1= 120
##$ZL2= 120
##$ZL3= 120
##$ZL4= 120
##$ABSF1= 14.98061
##$ABSF2= -5.57192
##$ABSG= 5
##$ABSL= 3
##$ALPHA= 0
##$AQORDER= 0
##$ASSFAC= 0
##$ASSFACI= 0
##$ASSFACX= 0
##$ASSWID= 0
##$AUNMP= <proc_prof1d_extract_pilot.lims>
##$AXLEFT= 0
##$AXNAME= <>
##$AXNUC= <1H>
##$AXRIGHT= 0
##$AXTYPE= 0
##$AXUNIT= <>
##$AZFE= 0.1
##$AZFW= 0.1
##$BCFW= 0
##$BC_mod= 0
##$BYTORDP= 0
##$COROFFS= 0
##$CY= 15
##$DATMOD= 1
##$DC= 0
##$DFILT= <>
##$DTYPP= 0
##$F1P= 0
##$F2P= 0
##$FCOR= 0.5
##$FTSIZE= 32768
##$FT_mod= 6
##$GAMMA= 0
##$GB= 0
##$INTBC= 1
##$INTSCL= 1
##$ISEN= 128
##$LB= 0
##$LEV0= 0
##$LPBIN= 0
##$MAXI= 10000
##$MC2= 0
##$MEAN= 0
##$ME_mod= 0
##$MI= 0
##$NCOEF= 0
##$NC_proc= -8
##$NLEV= 6
##$NOISF1= 0
##$NOISF2= 0
##$NSP= 0
##$NTH_PI= 0
##$NZP= 0
##$OFFSET= 14.98061
##$PC= 1
##$PHC0= 209.3555
##$PHC1= 0
##$PH_mod= 1
##$PKNL= yes
##$PPARMOD= 0
##$PPDIAG= 0
##$PPIPTYP= 0
##$PPMPNUM= 2147483647
##$PPRESOL= 1
##$PSCAL= 4
##$PSIGN= 0
##$PYNMP= <proc.py>
##$REVERSE= no
##$SF= 400.13
##$SI= 32768
##$SIGF1= 0
##$SIGF2= 0
##$SINO= 400
##$SIOLD= 32768
##$SPECTYP= <>
##$SREGLST= <1H.CDCl3>
##$SSB= 0
##$STSI= 32768
##$STSR= 0
##$SW_p= 8223.68421052632
##$SYMM= 0
##$S_DEV= 0
##$TDeff= 65536
##$TDoff= 0
##$TI= <>
##$TILT= no
##$TM1= 0
##$TM2= 0
##$TOPLEV= 0
##$USERP1= <user>
##$USERP2= <user>
##$USERP3= <user>
##$USERP4= <user>
##$USERP5= <user>
##$WDW= 1
##$XDIM= 32768
##$YMAX_p= 460964380
##$YMIN_p= -648231
##$CURPLOT= <Network HP LaserJet P1505>
##$CURPRIN= <$Network HP LaserJet P1505>
##$DFORMAT= <normdp>
##$LAYOUT= <+/1D_H.xwp>
##$LFORMAT= <normlp>
##$PFORMAT= <normpl>
##$SURQMSG= 1
$$ End of Bruker specific parameters
$$ ---------------------------------
##NTUPLES= NMR SPECTRUM
##VAR_NAME=  FREQUENCY,     SPECTRUM/REAL,   SPECTRUM/IMAG
##SYMBOL=    X,             R,               I
##VAR_TYPE=  INDEPENDENT,   DEPENDENT,       DEPENDENT
##VAR_FORM=  AFFN,          ASDF,            ASDF
##VAR_DIM=   32768,         32768,           32768
##UNITS=     HZ,            ARBITRARY UNITS, ARBITRARY UNITS
##FACTOR=    0.250966925370066, 1,           1
##FIRST=     8223.43324360095, -46575,       -244311
##LAST=      0,             35107,           -184930
##MIN=       0,             -648231,         0
##MAX=       8223.43324360095, 460964380,    0
$$ Real data points
##PAGE= N=1
##DATA TABLE= (X++(R..R)), XYDATA
$$ [...]
19536a57594d3215k71301j54753e2233B55100b81470i6196B58360b6970n3089
$$ -157594 -43215 -314516 -469269 -52233 255100 -281470 -96196 258360 -26970 -80059
19526h0059k55292a52062c0942m1920j69041c7681G8947d80481J18427j05767
$$ -80059 -335351 -152062 -30942 -72862 -241903 -37681 78947 -480481 -362054 -467821
19516d67821B1304h0807C4288b25697j2707D607L6832K04400b17944A45909d481
$$ -467821 21304 -80807 34288 -225697 -238404 4607 41439 245839 -217944 145909 -4481
19504A66151a9804C9887r528A2720d9685B02563I7458a92107B5548c59284B90113
$$ 166151 -19804 39887 30359 12720 -49685 202563 97458 -192107 25548 -359284 290113
19492F2026c02344b0877H5756h739l01166A3462b850l6835m1183B1691Q1980c78046
$$ 62026 -302344 -20877 85756 -8739 -309905 13462 -2850 -39685 -80868 21691 103671 -378046
19479D7634a52405e7278F316b9349I7548c32316J4817G3435J89140d0495k79552
$$ 47634 -152405 -57278 6316 -29349 97548 -332316 -317499 73435 262575 -40495 -320047
19468c20047h2723A3858f5514A88336F830O6181B1692i5783M4340j03530d2502
$$ -320047 -82723 13858 -65514 188336 6830 73011 21692 -95783 -51443 -154973 -42502
19456C4132L9486b5839B23315b22024j3871e9815I7829l9910c43809D4926a04643
$$ 34132 73618 -25839 223315 -222024 -235895 -59815 97829 57919 -343809 44926 -104643
19444b08677f1767E4787K55451a25254k6487m8320d8774k98043d682p1106j10768
$$ -208677 -61767 54787 310238 -125254 -151741 -200061 -48774 -346817 -4682 -75788 -186556
19433a86556a4080q9637m0598r9905n0483g3350l01820A49572a87416j55035A4011
$$ -186556 -14080 -103717 -144315 -244220 -294703 -73350 -375170 149572 -187416 -342451 14011
19421a59893p8159o5200J47041j23740O9842b969B66722c7877j36204A28566q760
$$ -159893 -238052 -303252 -156211 -279951 -210109 -2969 266722 -37877 -174081 128566 119806
19410A19806a02414A78894d7209D1533e7653B80237a12425n944k52551a14165
$$ 119806 -102414 178894 -47209 41533 -57653 280237 -112425 -118369 -370920 -114165
19399E3093j4199a17563k27493J18671e1264j47826j13172a03120j72905I7961
$$ 53093 38894 -117563 -345056 -226385 -51264 -199090 -312262 -103120 -276025 97961
19388d0084A14916e5298A62617g994A26780j6782a27387j27138A72529b41696
$$ -40084 114916 -55298 162617 -7994 126780 109998 -127387 -254525 172529 -241696
19377b61515m7556A416K40501a71763a8421H8290C2090b72962A61377a47303q3670
$$ -261515 -309071 1416 241917 -171763 -18421 88290 32090 -272962 161377 -147303 -230973
19366b30973A63771b54755h0119m74808b59461A1568R8272q362b1733k04235R1442
$$ -230973 163771 -254755 -80119 -554927 -259461 11568 109840 101478 -21733 -225968 -134526
19355a34526B8170c81794i2262A22031b97113A72936q5382l6167A8834f233k28662
$$ -134526 28170 -381794 -92262 122031 -297113 172936 87554 51387 18834 -6233 -234895
19344b34895a9132j06598p6125N4029B33551f2187b9142A51131c3110A50567g7509
$$ -234895 -19132 -125730 -201855 -147826 233551 -62187 -29142 151131 -33110 150567 -77509
19332A43300b32963A34510j029b20317A08805l1164a18027p4062c7706A7643e2309
$$ 143300 -232963 134510 133481 -220317 108805 77641 -118027 -192089 -37706 17643 -52309
19320b21182a01764j04889E7966a6100M448m54862c3490m195j04772l7809f8108
$$ -221182 -101764 -206653 57966 -16100 -11652 -466514 -33490 -37685 -142457 -180266 -68108
19308E535J58985B4994h2523A67311g5879C40294j35061J72679d62447h0606E4885
$$ 5535 164520 24994 -82523 167311 -75879 340294 205233 377912 -462447 -80606 54885
19296g6401p9031F8652a88435C05955b28064c7594A10059b54263H0242L5651l366
$$ -76401 -155432 68652 -188435 305955 -228064 -37594 110059 -254263 80242 115893 112527
19285A12527b37712K6609B10998l4843m6506a38257f5866j00348E0738a71016
$$ 112527 -237712 -211103 210998 176155 129649 -138257 -65866 -166214 50738 -171016
19274e4736A28762c03097J31153o2986N9874f6663j39408i5058j7448l35615B47352
$$ -54736 128762 -303097 -171944 -234930 -175056 -66663 -206071 -95058 -112506 -448121 247352
19262e5242A37592a96454d0605A38565d9761A55741D3956d2592C6879M20402a10570
$$ -55242 137592 -196454 -40605 138565 -49761 155741 43956 -42592 36879 457281 -110570
19250a7449k00864B48012N0594b58402A12633b75477d9498k90779a30275r5980
$$ -17449 -218313 248012 298606 -258402 112633 -275477 -49498 -340277 -130275 -226255
19240b26255P7681A29909h4207A31154L08767a73427O1538E7407b16765E9662
$$ -226255 -148574 129909 -84207 131154 439921 -173427 -111889 57407 -216765 59662
19229C8981c05125b7682k33791A8328b51971K1906J7124e8046q7007B36305a33879
$$ 38981 -305125 -27682 -261473 18328 -251971 -230065 -212941 -58046 -145053 236305 -133879
19217B840J27966c6467j45861B9708h2349j82968h3220l6069e7270E5158c90247
$$ 2840 130806 -36467 -182328 29708 -82349 -265317 -83220 -119289 -57270 55158 -390247
19205a34291A30613g1407j11527e4252m0975l66987b6311O18D3017c75420a80568
$$ -134291 130613 -71407 -182934 -54252 -95227 -462214 -26311 -25693 43017 -375420 -180568
19193h3473j79675J30599f4380C2550a34119j33448R0303d5711j73887O6615B50946
$$ -83473 -263148 -132549 -64380 32550 -134119 -267567 -177264 -45711 -219598 -152983 250946
19181i0957p4989M3367A36395a43488c8862n5318D5328a27999G3619a13511A41401
$$ -90957 -165946 -122579 136395 -143488 -38862 -94180 45328 -127999 73619 -113511 141401
19169C8502M1602B8053g6096k27812E1700P92k466R2133b775A74986a94383d6122
$$ 38502 80104 28053 -76096 -303908 51700 52492 50026 142159 -2775 174986 -194383 -46122
19156f3540A70059d1193A37144k5581i3538K3215c681l16361a35096G854R4960
$$ -63540 170059 -41193 137144 111563 -93538 -70323 -3681 -320042 -135096 7854 102814
19145A02814K11755H7077a13949K8248c1352n288d934A67252b18162c6348B84030
$$ 102814 314569 87077 -113949 -85701 -31352 -36640 -4934 167252 -218162 -36348 284030
19133b82378m9112a44854m3179F0527a46439i900k02512C99247B1456K57282b87918
$$ -282378 -331490 -144854 -188033 60527 -146439 -9900 -212412 399247 21456 278738 -287918
19121G1084P223a84488D18728b48548A06387d39005A70082e9400C0501g3079j65762
$$ 71084 78307 -184488 418728 -248548 106387 -439005 170082 -59400 30501 -73079 -238841
19110b38841P5042A61130h4479E6080e4812I3991l9629b75056a0197A23228a42283
$$ -238841 -163799 161130 -84479 56080 -54812 93991 54362 -275056 -10197 123228 -142283
19098f2225F9918c28396N1732N8594J00061D10940h7902n3102G6302l0911O433
$$ -62225 69918 -328396 -276664 -218070 -118009 410940 -87902 -141004 76302 45391 51824
19087E1824A4789i0368C6384e6109j07983A94345b83256j1627f8874l45431B27421
$$ 51824 14789 -90368 36384 -56109 -164092 194345 -283256 -294883 -68874 -414305 227421
19075a58638E6785c68851d2294j29712K679r5152f0134J8243E8502A4197e602
$$ -158638 56785 -368851 -42294 -172006 -169327 -264479 -60134 -41891 58502 14197 -5602
19063a11314A97851K7516b34667a09028m2781F8906b39660b122B41313d0285k82434
$$ -111314 197851 225367 -234667 -109028 -151809 68906 -239660 -2122 241313 -40285 -322719
19052c22719a41364j61942A33120h0156I0851j6890f5818j39747O7789f6108j7598
$$ -322719 -141364 -303306 133120 -80156 90851 73961 -65818 -205565 -137776 -66108 -83706
19041h3706o5511L7593k05373B65621e008B12917b23016B7221a90193K735I749
$$ -83706 -149217 -111624 -316997 265621 -5008 212917 -223016 27221 -190193 -187458 9749
19029A69222o0626c31218A37479a13925N5279A47916g1061B88604a32721A18407
$$ 169222 108596 -331218 137479 -113925 -58646 147916 -71061 288604 -132721 118407
19018A75397l3478a48974l5785j06252c1187o5774k56250a31399G874a46417A9413
$$ 175397 141919 -148974 -184759 -291011 -31187 -96961 -353211 -131399 7874 -146417 19413
19006d5250q4538A5929a91680J2315r316m0163c4779I0680L0860a09349k16283
$$ -45250 -129788 15929 -191680 -179365 -188681 -228844 -34779 90680 121540 -109349 -325632
18995c25632A66445i928k57802q964A00841f8628A95562b09779k3245n1739A05150
$$ -325632 166445 -9928 -267730 -276694 100841 -68628 195562 -209779 -233024 -284763 105150
18983A88138b01497K6024d7088E8112b84640e2228A51450B0854i4111A23945l1831
$$ 188138 -201497 -175473 -47088 58112 -284640 -52228 151450 20854 -94111 123945 92114
18972I2114m2975i1586J1130l987A97029N3547o3860b2250A58144a37665A9033
$$ 92114 49139 -91586 -80456 -84443 197029 250576 186716 -22250 158144 -137665 19033
18960C17420D9231J60539d022A93319r2046a00060a596A44428d32899J86829a04581
$$ 317420 49231 209770 -4022 193319 101273 -100060 -1596 144428 -432899 -246070 -104581
18948F0254b59025Q3119p5223H0831C9780a99384B8103b33988g1206A4528b64276
$$ 60254 -259025 -175906 -251129 80831 39780 -199384 28103 -233988 -71206 14528 -264276
18936c863C02099c5613k52689H6884Q798a0257D6323e45305b63290b1572A27472
$$ -3863 302099 -35613 -288302 86884 95682 -10257 46323 -545305 -263290 -21572 127472
18924h1646b5473b521l03650a45724G7820d1604k7168A23035K63739b51641L671
$$ -81646 -25473 -2521 -306171 -145724 77820 -41604 -68772 123035 386774 -251641 -247970
18913b47970B4537A1504L9886M3618J13933i780C05457C1034a45336J1173A69540
$$ -247970 24537 11504 51390 95008 208941 -9780 305457 31034 -145336 -134163 169540
18901C33504a62376G8221B3328c5759m17986K12665A27529A3239i6898l9843m30334
$$ 333504 -162376 78221 23328 -35759 -453745 -241080 127529 13239 -96898 -136741 -567075
18890e67075B0382L6357a90969j10697A13645e8416B051J92286a25800C47262
$$ -567075 20382 56739 -190969 -301666 113645 -58416 2051 194337 -125800 347262
18879a36504F5034R8664Q3181l7869e97937A08707b31664e1260G5287a30342C778
$$ -136504 65034 163698 246879 209010 -597937 108707 -231664 -51260 75287 -130342 3778
18867i3252D0550a57562A99142d1489A90364h7632j35456M2861j07067H9815Q4108
$$ -93252 40550 -157562 199142 -41489 190364 -87632 -223088 -180227 -287294 89815 173923
18856A73923f086k9777l03735J3669p6325b00181C32021j26988a41273d8741A25162
$$ 173923 -6086 -35863 -339598 -325929 -402254 -200181 332021 205033 -141273 -48741 125162
18844c58964a36270A08456b93166A17663a98223A99353i2099o7444L0570j65519
$$ -358964 -136270 108456 -293166 117663 -198223 199353 -92099 -159543 -128973 -294492
18834b94492a07727A20000J21976i7464j7428j8421m6296A59277p2632Q6315b63889
$$ -294492 -107727 120000 241976 -97464 -114892 -133313 -179609 159277 86645 172960 -263889
18822c8029B3039J81155b57325J24608A95088b49275J22192D1595b00055c1786
$$ -38029 23039 204194 -257325 -132717 195088 -249275 -127083 41595 -200055 -31786
18811C8115c1118R966A79938c41195J09999g9829F9561i0089C2158c8290B10875
$$ 38115 -31118 -21152 179938 -341195 -231196 -79829 69561 -90089 32158 -38290 210875
18799A99212o4315L4807J08092M2522a62279h792B95018b5320B6311L3291a01287
$$ 199212 134897 169704 277796 320318 -162279 -8792 295018 -25320 26311 59602 -101287
18787d35829L7057c2071j72104A17208a34709B63270b67105A05751c95873a2680
$$ -435829 -398772 -32071 -204175 117208 -134709 263270 -267105 105751 -395873 -12680
18776c9472l25054h0450c9871D9316J59278i2994A66842a8639l62091A1137a97327
$$ -39472 -364526 -80450 -39871 49316 208594 -92994 166842 -18639 -380730 11137 -197327
18764b2165j48197M8578m4968B06098a76247N0028B2826c9261j94344A52354a96109
$$ -22165 -170362 -121784 -166752 206098 -176247 -126219 22826 -39261 -233605 152354 -196109
18752b30421E2980b93273J40848E8576J26492b47449a00114B34191I5328K0415
$$ -230421 52980 -293273 -152425 58576 185068 -247449 -100114 234191 95328 115743
18742A15743a37909G1501J34632b17079j331D4157a46230F3345M5083a04698k01008
$$ 115743 -137909 71501 206133 -217079 -218410 44157 -146230 63345 108428 -104698 -305706
18731c05706i9918R1a262I2378B4248R0488b67077B7533c36961A72999b93114
$$ -305706 -99918 -99827 -1262 92378 24248 114736 -267077 27533 -336961 172999 -293114
18719C68703a62398P8790B111J52487b31338q107C41207G3202d24704J03930a04991
$$ 368703 -162398 -83608 2111 154598 -231338 -239445 341207 73202 -424704 -320774 -104991
18707a79322B52746R9705d8147l30632D75463c09288A82865b3032m7446j35499
$$ -179322 252746 352451 -48147 -378779 475463 -309288 182865 -23032 -70478 -205977
18697b05977a01998L000K8410A05498k5665b38559B7538c15339I6133a76426Q5509
$$ -205977 -101998 -98998 -70588 105498 79833 -238559 27538 -315339 96133 -176426 -90917
18686i0917j06535A04355b19436A49352h8321l38531B24970a99908C772b47512
$$ -90917 -197452 104355 -219436 149352 -88321 -426852 224970 -199908 3772 -247512
18675F9894b14651b95j84823m4523B9911a15183A43220Q733G1306C2567h1340
$$ 69894 -214651 -295 -185118 -229641 29911 -115183 143220 151953 71306 32567 -81340
18663h3921A87668c61114a23454j25132a23833C73330b85529B4877Q3608a07089
$$ -83921 187668 -361114 -123454 -248586 -123833 373330 -285529 24877 108485 -107089
18652b53848D6497K9584c30374J60651D0537a01732H2813O5332b04235A8729c2246
$$ -253848 46497 76081 -330374 -169723 40537 -101732 82813 148145 -204235 18729 -32246
18640b23815D3515a27007e2003b571A2848g1226b3595B77790i5382C8087e1247
$$ -223815 43515 -127007 -52003 -2571 12848 -71226 -23595 277790 -95382 38087 -51247
18628I8729l1721a44152k4484o846a192k1347k55317B8409c52833e2727j06791
$$ 98729 67008 -144152 -168636 -175482 -1192 -22539 -277856 28409 -352833 -52727 -159518
18617a59518B29557r3701M3662c96437A67959f1975B6683K53128A20317O5646
$$ -159518 229557 135856 179518 -396437 167959 -61975 26683 279811 120317 185963
18607A85963b09689A21420d5419D29258E8169a90306C03472B6405a6640l19208
$$ 185963 -209689 121420 -45419 429258 58169 -190306 303472 26405 -16640 -335848
18597c35848B1705K8106b51882c2381J5809G0614K5911c16418a11344q8110B34896
$$ -335848 21705 49811 -251882 -32381 -16572 70614 96525 -316418 -111344 -199454 234896
18585A16770a16846N2236b2261p5552H9949J69520J31389A31738c9390G5584F687
$$ 116770 -116846 -64610 -22261 -97813 89949 259469 390858 131738 -39390 75584 6687
18573A41014c3269k10631P6089B41861a15943k4476B38J60565a0061j50191i357
$$ 141014 -33269 -243900 -167811 241861 -115943 -140419 238 160803 -10061 -160252 -9357
18561a84871r8747J34559j97967I7193D1038J7010J23915C0400K525a28758A35546
$$ -184871 -283618 -149059 -347026 97193 41038 58048 181963 30400 32925 -128758 135546
18549d2601G6135g9903m9667O3813k18839A99428a78607E4408M4491M9652a03024
$$ -42601 76135 -79903 -129570 -65757 -284596 199428 -178607 54408 98899 148551 -103024
18537H7310E553g1283l31083J75304L9536F7856a95560b1110B37734f6109B0359
$$ 87310 5553 -71283 -402366 -227062 -187526 67856 -195560 -21110 237734 -66109 20359
18525a02268C15213j25561l0622b29495j87133G204h7023j09884bj69579B69124
$$ -102268 315213 189652 159030 -229495 -416628 7204 -87023 -196907 -2 -169581 269124
18513b09471b3066B48311c06578J46642j92992B84716C1760a39983F0653f1913
$$ -209471 -23066 248311 -306578 -159936 -352928 284716 31760 -139983 60653 -61913
18502a94485B49395a80527b5977B4967J05811b50829B81530a515j11420d5372
$$ -194485 249395 -180527 -25977 24967 130778 -250829 281530 -1515 -112935 -45372
18491b70699N3526b3920j0243j62438E222L0478e234j819j20565n3359A79815
$$ -270699 -217173 -23920 -34163 -196601 5222 35700 -5234 -7053 -127618 -180977 179815
18479i5532A31224n7177e53j68265h271C43673a24153e7513C08977A38905k7845
$$ -95532 131224 74047 -553 -168818 -8271 343673 -124153 -57513 308977 138905 111060
18468A11060g1329J948k47816j3843Q0815P7782N3107A23363J29563I1717j4858
$$ 111060 -71329 -69381 -317197 -331040 -250225 -172443 -119336 123363 252926 91717 76859
18457G6859B4662a30645M2623M0962F3605f22767a23223b8873j210k7323B22789
$$ 76859 24662 -130645 -88022 -47060 63605 -622767 -123223 -28873 -30083 -57406 222789
18445a06529j2609A97833E3885d2858F7422F748a72509k35192a19081h950E0007
$$ -106529 -119138 197833 53885 -42858 67422 6748 -172509 -407701 -119081 -8950 50007
18433E4000R464b34240J03708k1502B0513c13805C40981b84233B2086b6324p6235
$$ 54000 63464 -234240 -130532 -152034 20513 -313805 340981 -284233 22086 -26324 -102559
18422a02559d5083m63B01133a20719j12011a07384J9669j4284I4312a03719H9595
$$ -102559 -45083 -45546 201133 -120719 -232730 -107384 -87715 -101999 94312 -103719 89595
18410a40753f4719m9916A19409J5126L6299a69742A20230a12191B11006g8744
$$ -140753 -64719 -114635 119409 134535 170834 -169742 120230 -112191 211006 -78744
18399A48457a76917A398K49693a11585M6940K8340r5952a0640A61754g8304E1890
$$ 148457 -176917 1398 251091 -111585 -64645 -36305 -132257 -10640 161754 -78304 51890
18387c8280j78679D8804c86580I2965b44754c397A4382h9251A14354J1834c61848
$$ -38280 -216959 48804 -386580 92965 -244754 -3397 14382 -89251 114354 126188 -361848
18375a87568i3616j26588D53762c3115j71995L8428B680a02489c5515j16720j23598
$$ -187568 -93616 -220204 453762 -33115 -205110 -166682 2680 -102489 -35515 -152235 -275833
18364b75833A07729c6604J1812l04058Q4961C8638d5736A23199i8728A25384B3322
$$ -275833 107729 -36604 -24792 -328850 -243889 38638 -45736 123199 -98728 125384 23322
18352B31437M9940b64791f9712B43759a37670B6500i6036b9568a3820j27899b4434
$$ 231437 281377 -264791 -69712 243759 -137670 26500 -96036 -29568 -13820 -141719 -24434
18340E582a01737H4398a71403B3859M2852l776J57653f8581j61102C22411c5762
$$ 5582 -101737 84398 -171403 23859 66711 62935 220588 -68581 -229683 322411 -35762
18328a66462n3054a01867m4531G0746i6569H2465b31266j66874J47355a23606
$$ -166462 -219516 -101867 -146398 70746 -96569 82465 -231266 -398140 -250785 -123606
18317H6715f3353H1419Q8590g0403j52094R4257F4409a57718n9982P8854a8670
$$ 86715 -63353 81419 170009 -70403 -222497 -128240 64409 -157718 -217700 -138846 -18670
18305D28800c18857G8795a50827G4121A602J74721c58886R7572M9435f9714m1173
$$ 428800 -318857 78795 -150827 74121 1602 176323 -358886 -261314 -211879 -69714 -110887
18294a10887a1089J703A06556c45717A44815d37256J99042o7581H0351b30843
$$ -110887 -11089 -9386 106556 -345717 144815 -437256 -238214 -305795 80351 -230843
18283H6752a50200C2312J46475D4717b99013D2395a32668E5091a12898d1370A08837
$$ 86752 -150200 32312 178787 44717 -299013 42395 -132668 55091 -112898 -41370 108837
18271A23321h7947D5035a10500i221l48106b2879m5185p6014j40747l7387a2793
$$ 123321 -87947 45035 -110500 -9221 -357327 -22879 -68064 -144078 -284825 -322212 -12793
18259b63121R3972o8130A48027J42788O1447I6630a81357J2324D6713a12094A50699
$$ -263121 -169149 -237279 148027 290815 352262 96630 -181357 -169033 46713 -112094 150699
18247D8099b50694j74326A57220a99678A9359c4213B22980k4327k2912e4832I3982
$$ 48099 -250694 -425020 157220 -199678 19359 -34213 222980 198653 175741 -54832 93982
18235e2520j09786m8920Q0367C00895b64386H3071J68419i0828m0837p3860f941
$$ -52520 -162306 -211226 -130859 300895 -264386 83071 251490 -90828 -131665 -205525 -6941
18223A17565K9112d8182A6919f5933A67893b08058A95574k434m1004b43711H1030
$$ 117565 146677 -48182 16919 -65933 167893 -208058 195574 193140 152136 -243711 81030
18211A87005I1211c7436j35042a9773k2876A94221a1295B37994f4758j57509F6765
$$ 187005 91211 -37436 -172478 -19773 -42649 194221 -11295 237994 -64758 -222267 66765
18199B27844c18538a13100E7322c67387A15713b09073A32228E7021a7073k13169
$$ 227844 -318538 -113100 57322 -367387 115713 -209073 132228 57021 -17073 -230242
18189b30242I8703b51166A87916I759b19306r2788R6252A20147J34686d5274F1363
$$ -230242 98703 -251166 187916 9759 -219306 -312094 -215842 120147 254833 -45274 61363
18177a58635C8912a47782q2223F1890b93502F3154a06384l2726J0975C0359B420
$$ -158635 38912 -147782 -230005 61890 -293502 63154 -106384 -139110 -128135 30359 2420
18165B18290a83507B17099I9074a92723C84046j35126a19875m09997g3712A1503
$$ 218290 -183507 217099 99074 -192723 384046 248920 -119875 -529872 -73712 11503
18154b22691n7634g0148j77138i3698j62434J0256a8817A23472c00781G9050F328
$$ -222691 -280325 -70148 -247286 -93698 -256132 -245876 -18817 123472 -300781 79050 6328
18142b81207A48419a23450k5301C79988a32755j12809N8449f6726J4171I494b10284
$$ -281207 148419 -123450 -148751 379988 -132755 -245564 -187115 -66726 -52555 9494 -210284
18130b29686l9028H3978a77611h7796K0690A21309b97799f5270A07467d589A09209
$$ -229686 -268714 83978 -177611 -87796 -67106 121309 -297799 -65270 107467 -4589 109209
18118a78606n7962n8914J37203A99651E2309b3269B4981a24339j16034o3874E0343
$$ -178606 -236568 -295482 -158279 199651 52309 -23269 24981 -124339 -240373 -304247 50343
18106a21645B05286b49861B4989b67910J31219l2168d645B32738b00560b6757
$$ -121645 205286 -249861 24989 -267910 -136691 -168859 -4645 232738 -200560 -26757
18095A31015a14270F5888i9114j33944B05628o3114a90411l4941P1205A31340
$$ 131015 -114270 65888 -99114 -233058 205628 142514 -190411 -225352 -154147 131340
18084i9594l1327A9233K8662A2196b02477F2769J06118g6999L1117j82761f2802
$$ -99594 -130921 19233 47895 12196 -202477 62769 168887 -76999 -45882 -228643 -62802
18072E2203b18703A35234d8166A8771M5859I689J00779a22221A96698a77054J706
$$ 52203 -218703 135234 -48166 18771 64630 9689 110468 -122221 196698 -177054 -175348
18061a75348f6823K644A16017A467K03475b77633h4493H7087k9364a45722j1043
$$ -175348 -66823 -64179 116017 1467 204942 -277633 -84493 87087 57723 -145722 -156765
18050a56765k2128g9155n5767j3148l9855d8044l71636d8841j94473B92470b54265
$$ -156765 -178893 -79155 -134922 -148070 -187925 -48044 -419680 -48841 -243314 292470 -254265
18038C11931l646B7401c23345A21124a22467c7632F9760a19603G6976a25295K1820
$$ 311931 308285 27401 -323345 121124 -122467 -37632 69760 -119603 76976 -125295 -103475
18027a03475b3103j04228A19856g9A27907b09655c4763k05542B7119J3100j7463
$$ -103475 -23103 -127331 119856 -79 127907 -209655 -34763 -240305 27119 40219 22756
18016B2756g8433K9737A10052i4982A49438a92872A50000f2538q0783A05311J77127
$$ 22756 -78433 -48696 110052 -94982 149438 -192872 150000 -62538 -143321 105311 282438
18005B82438d97420g9011l4361C17361r2505A04303c84699i1871C6548j3466c64867
$$ 282438 -497420 -79011 -113372 317361 224856 104303 -384699 -91871 36548 23082 -364867
17993e4236A13242B775J31145a67366j34982J20467j4946G4737a04709m9575j1020
$$ -54236 113242 2775 133920 -167366 -302348 -181881 -196827 74737 -104709 -154284 -165304
17982a65304A01006J27421c7050j78741i4134B778a09999m0213H8908J21702d673
$$ -165304 101006 228427 -37050 -215791 -94134 2778 -109999 -150212 88908 210610 -4673
17970E9570b72210C96157A9566P5637j1787J62894j0832b19802r8368B07907O8957
$$ 59570 -272210 396157 19566 95203 83416 246310 235478 -219802 -318170 207907 276864
17959B76864b05511A32400F4274a38297A31545O5920b9474k20641E4144d9698
$$ 276864 -205511 132400 64274 -138297 131545 197465 -29474 -250115 54144 -49698
17948a65377c1714A12080b7928D4883a28213E1809e9131F3306j4915J03715F7272
$$ -165377 -31714 112080 -27928 44883 -128213 51809 -59131 63306 48391 152106 67272
17936i2273A06456m7751a69526O8393k208A61039F8224k1963a61812I6375L8742
$$ -92273 106456 58705 -169526 -101133 -103341 161039 68224 46261 -161812 96375 135117
17925A35117o2982e2024j89694i4099H8621c74828D4877b03613a9356h254B2632
$$ 135117 72135 -52024 -241718 -94099 88621 -374828 44877 -203613 -19356 -8254 22632
17913C32311b35226A69572b28795f4425I1920l9266e463C1697c097j08174B41413
$$ 332311 -235226 169572 -228795 -64425 91920 52654 -5463 31697 -3097 -111271 241413
17901a9605j85982L7739a7676j58882A62238R3473A12603m4937L781N7389j1711
$$ -19605 -205587 -167848 -17676 -176558 162238 255711 112603 67666 71447 128836 117125
17890A17125R3183a24959A10966k9076j7401a18720J0236M628j74918m6166B06713
$$ 117125 210308 -124959 110966 81890 64489 -118720 -108484 -103856 -278774 -324940 206713
17878a74164C0257N5587b09874A87651m6380R6979d1186k2729A9964b91537Q4541
$$ -174164 30257 85844 -209874 187651 141271 238250 -41186 -63915 19964 -291537 -206996
17867b06996C35327b9711I3308l3579b24718A55662R6393a36006B3694f9443J7893
$$ -206996 335327 -29711 93308 59729 -224718 155662 252055 -136006 23694 -69443 -51550
17856e1550B37631d8993I8874N378b0843E9388a39031H3455A942K12772n9581
$$ -51550 237631 -48993 98874 104252 -20843 59388 -139031 83455 1942 214714 155133
17845A55133J64985A6444a08380j48418J09861J2476j74017J15509g6600a9820
$$ 155133 320118 16444 -108380 -256798 -146937 -134461 -308478 -192969 -76600 -19820
17834a85994Q2218j6767B2108a15856C1672a66973g1234A73398F4647J82890h599
$$ -185994 -103776 -120543 22108 -115856 31672 -166973 -71234 173398 64647 247537 -8599
17822B07174H6443m2540J42252J2490a2260j34190k49476h8531A13509L7731a10908
$$ 207174 86443 43903 186155 198645 -12260 -146450 -395926 -88531 113509 151240 -110908
17810a39043l0471h4140n3450F2486R7920c9632f797k40714a18221A79984g9514
$$ -139043 -169514 -84140 -137590 62486 160406 -39632 -6797 -247511 -118221 179984 -79514
17798a36037c2873E0241R3068L43763a84980A03251a8435D28587B08956K1286
$$ -136037 -32873 50241 143309 487072 -184980 103251 -18435 428587 208956 230242
17788B30242i7339b1857B57749n0291B7550h4451A6235d02399c2633j36045j980
$$ 230242 -97339 -21857 257749 207458 27550 -84451 16235 -402399 -32633 -168678 -170658
17777a70658A46467a35123C19658i8403B51296d11045J05734A2094a21461A31945
$$ -170658 146467 -135123 319658 -98403 251296 -411045 -305311 12094 -121461 131945
17766c0622B29687a9460P071k9497B02727F3402b11988a8607B11568c31931a12858
$$ -30622 229687 -19460 -12389 -41886 202727 63402 -211988 -18607 211568 -331931 -112858
17754d3398C79274b700j88835H9236L1142a73978L4137A66116c86403A45409a32750
$$ -43398 379274 -2700 -191535 89236 120378 -173978 -139841 166116 -386403 145409 -132750
17742i2764I2813d2535A11101i2136b0364m7381k054B61053k5718A02464K735
$$ -92764 92813 -42535 111101 -92136 -20364 -67745 -69799 261053 235335 102464 105199
17731A05199C0885c09124J38237b8701l13962c352j12098C4187a27259D44349
$$ 105199 30885 -309124 -170887 -28701 -342663 -3352 -115450 34187 -127259 444349
17720g8639a7964j27743k00471C7308j6936A709b26147A948g5387J6705B29467
$$ -78639 -17964 -145707 -346178 37308 20372 1709 -226147 1948 -75387 -58682 229467
17708h9028N072K2158B78999b76624i8308p4122c5282j44097n989F6142P1860
$$ -89028 -83956 -61798 278999 -276624 -98308 -172430 -35282 -179379 -185368 66142 138002
17697A38002E7478J40385d88851h3123L8361E04063b2229j55624P0397C2122c8995
$$ 138002 57478 197863 -488851 -83123 -44762 504063 -22229 -177853 -107456 32122 -38995
17685g3546A67654a22463p8174F3283o663J11870a8821m74D9008e6896j09555
$$ -73546 167654 -122463 -200637 63283 56620 168490 -18821 -19295 49008 -56896 -166451
17674a66451j46741c8627l28597B49107a7639A3036J43235p6622C3850J49764
$$ -166451 -313192 -38627 -367224 249107 -17639 13036 156271 79649 33850 183614
17664A83614b02368L7580p79M3917B04399g5205B02472B8056R188K91124b06737
$$ 183614 -202368 -164788 -165567 -121650 204399 -75205 202472 28056 37244 328368 -206737
17652D6814Q9910J10591B4829A1691b41519D2795j7658J48331a10966D2867j5666
$$ 46814 136724 247315 24829 11691 -241519 42795 25137 173468 -110966 42867 27201
17641B7201J18060a63480j46000A0522K10954M1015r7600g7934F7109a78185K2659
$$ 27201 145261 -163480 -309480 10522 221476 262491 164891 -77934 67109 -178185 -155526
17630a55526k53591b9433B76916A25809J95328A42244i6214j62548a6788B14345
$$ -155526 -409117 -29433 276916 125809 321137 142244 -96214 -258762 -16788 214345
17619b36287b7364k87074B42469e6482D8772J9741g8224o5960j24462B99353k6546
$$ -236287 -27364 -314438 242469 -56482 48772 68513 -78224 -144184 -268646 299353 272807
17608B72807d2633B97298A17648a99962d6780H6572J94262a89436B0029L643a58897
$$ 272807 -42633 297298 117648 -199962 -46780 86572 280834 -189436 20029 23672 -158897
17596e5343j23110k3154e0388B62511r7009a6832A35550a07513B37842e0051B73599
$$ -55343 -178453 -201607 -50388 262511 165502 -16832 135550 -107513 237842 -50051 273599
17584d522j11990E8347K35008G7848a13989n8209a6411r9723n1940C16858a92772
$$ -4522 -116512 58347 293355 77848 -113989 -172198 -16411 -116134 -168074 316858 -192772
17572E6741M2052a57604a2452B33687a74017k3924B7890J81090A03261K034J47192
$$ 56741 98793 -157604 -12452 233687 -174017 -197941 27890 208980 103261 105295 252487
17561B52487j02465R4946E0006P0938a3136o4312G02966b32621J01729H7980Q3740
$$ 252487 150022 244968 50006 120944 -13136 -77448 702966 -232621 -130892 87980 171720
17550A71720b10090A61615j890j8964h8603D10812A31507a3265j07452G4523b6154
$$ 171720 -210090 161615 159725 140761 -88603 410812 131507 -13265 -120717 74523 -26154
17538i6053A13070c22197B21133O0766J41208D2176J37253F3263a93557C51381
$$ -96053 113070 -322197 221133 281899 423107 42176 179429 63263 -193557 351381
17527A67126p205m3081c04997c5632o6142A63193i2367C95953I7316c9021k13287
$$ 167126 159921 116840 -304997 -35632 -101774 163193 -92367 395953 97316 -39021 -252308
17516b52308D40856e2966p6136d7535B86774C6054e6937A12141N1504J75961A55647
$$ -252308 440856 -52966 -129102 -47535 286774 36054 -56937 112141 163645 339606 155647
17504D44027F5694K41654i4289L973k41109A53205A9461O7120K21610e4428k7630
$$ 444027 65694 307348 -94289 -90316 -331425 153205 19461 86581 308191 -54428 -82058
17493h2058A59415a00565k25344D7940J54176Q1109A34155e8197C41222c0178
$$ -82058 159415 -100565 -325909 47940 202116 283225 134155 -58197 341222 -30178
17482E8935L05290e716m8856F4160h7219C93797d9135j39176A06711J78033C5315
$$ 58935 364225 -5716 -54572 64160 -87219 393797 -49135 -188311 106711 284744 35315
17470B16070n6328p5007A4318i5436A82366c9574L415C31079r7370H7569l114
$$ 216070 159742 84735 14318 -95436 182366 -39574 -36159 331079 233709 87569 84455
17459H4455c2572A92830F6874K60174a95145A19297n8432K76142k146i2387A03269
$$ 84455 -32572 192830 66874 327048 -195145 119297 60865 337007 334861 -92387 103269
17447e4709j10437C70071c7188B3022K51764m1265A15985J46402h4885B29728
$$ -54709 -165146 370071 -37188 23022 274786 233521 115985 262387 -84885 229728
17436A44792P8992R0504a22654B43107J71048j27002L246n7153O6526A28399e499
$$ 144792 223784 314288 -122654 243107 414155 287153 290399 233246 299772 128399 -5499
17424C04742b5329B05119j0920R0804M974m8386K87546j65430k6802o5009J6648
$$ 304742 -25329 205119 194199 285003 289977 241591 529137 363707 336905 271896 288544
17413B88544r73J00087j07661K38330G0483L67521A43434d5530C29392R1538B09644
$$ 288544 287571 387658 279997 518327 70483 438004 143434 -45530 329392 420930 209644
17401B53201O5560l0122L79512C03035l1892j23821A0308b61391C09596j03891
$$ 253201 318761 288639 668151 303035 271143 147322 10308 -261391 309596 205705
17391B05705K708L13680a94150B4065J31262N9737g9073n1743E45107f5595A9496
$$ 205705 208413 522093 -194150 24065 155327 215064 -79073 -130816 545107 -65595 19496
17379A95062H7366R5000p4509L3015K25470J9464j67877A01779a45536e0143A77101
$$ 195062 87366 182366 107857 140872 366342 385806 217929 101779 -145536 -50143 177101
17367A21821J72955A33540a67308H557J0187K67998J31107j00798A06140J20622
$$ 121821 294776 133540 -167308 8557 18744 286742 417849 317051 106140 226762
17357B26762b21263O9772A49856K16546L3616i72l23659D97900b61863A00554
$$ 226762 -221263 -151491 149856 366402 400018 -972 -324631 497900 -261863 100554
17346a17209C1599i4075B11953R0966A43983j9694L3543F1615b31635B10278k6481
$$ -117209 31599 -94075 211953 302919 143983 124289 157832 61615 -231635 210278 183797
17335A83797n9499E0410B0679K12629I7178K46472r6060J56278A87775J37238
$$ 183797 124298 50410 20679 233308 97178 343650 247590 403868 187775 325013
17325C25013A28464J10946J22339I5970k5626N1931K40214d3992B11656d36441
$$ 325013 128464 239410 361749 95970 70344 122275 362489 -43992 211656 -436441
17314B24942p5864b10440h7588D7855K00897n6381P2518l8243J0573m4785n3920
$$ 224942 149078 -210440 -87588 47855 248752 192371 264889 226646 237219 192434 138514
17303A38514K99288c6699a1011A88167J22009j13284A5364M29907A951K2400c1027
$$ 138514 437802 -36699 -11011 188167 310176 196892 15364 445271 1951 24351 -31027
17291B02011J31788B6038c6996A30736i4315C66156A38563K08937C9291L83445
$$ 202011 333799 26038 -36996 130736 -94315 366156 138563 347500 39291 422736
17281D22736k2697H2714A82L92922i1588M4084j23580B92152j21217J980N9636
$$ 422736 400039 82714 182 393104 -91588 -47504 -171084 292152 170935 172915 232551
17270B32551m62A14969m1302J55210c6243l9687D55909j2868I2287P1191B8883
$$ 232551 232089 114969 73667 228877 -36243 -75930 455909 443041 92287 163478 28883
17258C77734a11642E68311k40193j54963m8197Q6645l9929n4793d7137B01461
$$ 377734 -111642 568311 328118 173155 124958 211603 171674 116881 -47137 201461
17247C05140j24015J06151K7828M429F9086N718b5020A79216R7342G1035Q5862
$$ 305140 181125 287276 315104 319533 69086 74804 -25020 179216 276558 71035 156897
17236A56897J19963J7138p0981p6840a80859b4988B64406A28799J31420j05568
$$ 156897 276860 293998 223017 146177 -180859 -24988 264406 128799 260219 154651
17226A54651K57460o3481J56356F9144M9474K2857n479k9756K37996P9717B11203
$$ 154651 412111 348630 504986 69144 118618 141475 135996 106240 344236 423953 211203
17214D15284a72641L0454A73421J46818A1147N3382Q8942f8254B39088E5682a40390
$$ 415284 -172641 -142187 173421 320239 11147 64529 153471 -68254 239088 55682 -140390
17202A7714N0981Q1766a45739B09915J01918A21410L52664J3180B24991a42298
$$ 17714 68695 150461 -145739 209915 311833 121410 474074 487254 224991 -142298
17191E9515M77967r4163j90862J32027j04541H8206J3698P3753P953J92272c1988
$$ 59515 537482 443319 252457 384484 279943 88206 101904 175657 183610 375882 -31988
17179A52345R7058m827C88L846K40520F8001K94121p0951A36470M5933Q2486J2328
$$ 152345 249403 244576 388 4234 244754 68001 362122 291171 136470 182403 264889 277217
17167B77217f981A20156J00730O0235L64196k86701j09281o1J00541Q6968j04817
$$ 277217 -6981 120156 220886 281121 645317 358616 249335 249274 349815 436783 331966
17156C31966r0318K25260E8592J00669J55694E1689a20799B24667L33059A39805
$$ 331966 241648 466908 58592 159261 314955 51689 -120799 224667 557726 139805
17145D67079c0172G3935K27356j30117K81542p6173K1131K34920B40607Q6612
$$ 467079 -30172 73935 301291 171174 452716 376543 397674 632594 240607 327219
17135C27219P4328A65713k0306K33220K38919o5588B00103Q9217J16823j17398
$$ 327219 401547 165713 145407 378627 617546 551958 200103 289320 406143 288745
17125B88745m0659j18290k5718m8479M49870I9462J31303j5169K37538j97595
$$ 288745 248086 129796 104078 55599 505469 99462 230765 215596 453134 255539
17115B55539J52770J05503j99138K62637J41377l25492O2569N7432j1227O2212
$$ 255539 408309 513812 314674 577311 718688 393196 455765 513197 501970 564182
17105E64182k66146L71938j16053B41662K71469j78006J56227p4597K9723p8297
$$ 564182 298036 669974 553921 241662 513131 335125 491352 416755 446478 368181
17095C68181p6964L02503k78475l1875j41413L27749A86061K54447j93482L19824
$$ 368181 291217 593720 315245 283370 141957 469706 186061 440508 247026 566850
17085E66850j92244J31350F4153K93131K3921l4752A32468M65868j27512J34312
$$ 566850 374606 505956 64153 357284 381205 346453 132468 598336 470824 605136
17075F05136R3381n7288k20275A62198J55500J98641A90007K46843M67217C66494
$$ 605136 698517 641229 420954 162198 317698 516339 190007 436850 904067 366494
17064D08697l3357J55889k27961K56639k53115L04650L9983k64524k4066L31133
$$ 408697 375340 531229 303268 559907 306792 611442 651425 386901 362835 693968
17054F93968M4386k13431J90506J40374k81449J16136l11314J43281m3168J41981
$$ 693968 738354 524923 715429 855803 574354 690490 379176 522457 479289 621270
17044F21270j73596R4382L2193J29312j0056j90269N4577p1386n8699R3284j5495
$$ 621270 447674 542056 574249 703561 693505 503236 557813 486427 427728 521012 505517
17033E05517K68448k29881K00019K15910D27057J63763j9112q1643J0575M8645
$$ 505517 773965 544084 744103 960013 427057 590820 571708 490065 500640 549285
17023E49285J11319n9194R8152j85777J52592N891N1875l13173j28276J83429
$$ 549285 660604 601410 699562 513785 666377 672268 724143 410970 282694 466123
17013D66123p8744M25801j35778j5125Q6619R0430K72258D83228J33752k20899
$$ 466123 387379 813180 677402 662277 748896 839326 1111584 483228 616980 396081
17003C96081L34476j31354j2982K46769B62819L07922M76535j79224k48731J46935
$$ 396081 730557 599203 586221 832990 262819 570741 1047276 868052 619321 766256
16993G66256N987O0725j87825K76170J86788j53645l4058J67122k16524j5717
$$ 766256 772243 832968 645143 921313 1108101 954456 920398 1087520 870996 855279
16983H55279M5717k14793M0367k26605J76958K380J42335o4408M0752L02203m08181
$$ 855279 900996 686203 726570 499965 676923 679303 821638 757230 797982 1100185 692004
16972F92004j06689M50039j66931K57328k56907j18591J62172j39426j25175L1500
$$ 692004 585315 1035354 868423 1125751 868844 750253 912425 772999 647824 679324
16962F79324N7157L06461K15562O9140m10567j44108J92918k53733K91679j21491
$$ 679324 736481 1042942 1258504 1327644 917077 772969 965887 712154 1003833 882342
16952H82342J59714L44039l10253j08662L58609l08382l73505L89280J77438J44421
$$ 882342 1042056 1386095 1075842 967180 1325789 1017407 643902 1033182 1210620 1355041
16942A355041l58686N7777N28752l17064k55968M85812j58731p4104j42854j1827
$$ 1355041 996355 1054132 1582884 1265820 1009852 1495664 1336933 1262829 1119975 1108148
16932A108148q2037L14582J17690q5037l6290K7883l1263k61619N44713k63187
$$ 1108148 1026111 1340693 1458383 1373346 1337056 1364939 1333676 1072057 1616770 1353583
16922A353583J8194N4934L9546k79076K79865j18962Q2932q4578K39527N4518
$$ 1353583 1371777 1426711 1466257 1187181 1467046 1348084 1431016 1346438 1585965 1640483
16912A640483r1121N301J30464j37948J10696j99756J766J93888K8426n9716J33368
$$ 1640483 1549362 1554663 1685127 1547179 1657875 1458119 1459885 1653773 1682199 1622483 1755851
16901A755851P5950k94349J99493L79754k51867J27207l61505k131K04286j43193
$$ 1755851 1831801 1537452 1736945 2116699 1864832 1992039 1630534 1628403 1832689 1689496
16891A689496p8077K71965k2044n050m1289J73972k00654O9403J70570K73734
$$ 1689496 1611419 1883384 1861340 1856290 1815001 1988973 1788319 1857722 2028292 2302026
16881B302026l87580K88737P1165k94160J8502M0245J7966P3163J20235p7911
$$ 2302026 1914446 2203183 2274348 1980188 1998690 2038935 2056901 2130064 2250299 2172388
16871B172388o5324N46700o06113K73824q3607j4913L87843m8653J94983l87463
$$ 2172388 2107064 2653764 2047651 2321475 2237868 2222955 2610798 2562145 2757128 2369665
16861B369665K79485o692m9934J10977J37586k5528J99489Q6296Q4111j98845
$$ 2369665 2649150 2642458 2592524 2703501 2841087 2815559 3015048 3101344 3185455 2986610
16851B986610j25590L38593o6372k3660K64237k50109M6355L87308k03663M14325
$$ 2986610 2861020 3199613 3133241 3109581 3373818 3123709 3170064 3557372 3353709 3768034
16841C768034k07337N4592J28869k08125K01350J71801j03041k99602Q40017j52468
$$ 3768034 3560697 3615289 3744158 3536033 3737383 3909184 3806143 3506541 4346558 4194090
16831D194090K3512j80068J99565j1496J17063m1630M35355l58507L22091J2755
$$ 4194090 4217602 4037534 4237099 4225603 4342666 4301036 4736391 4377884 4699975 4712730
16821D712730j19074K48345K03604J96975n95009Q68714j25009Q5678N23K39079
$$ 4712730 4593656 4842001 5045605 5242580 4647571 5516285 5391276 5476954 5477477 5716556
16811E716556l5825J44273q2063M15622j2458O8257L71392R131J99746J41194
$$ 5716556 5680731 5825004 5742941 6158563 6146105 6214362 6585754 6594885 6794631 6935825
16801F935825L10657j77526n3306M78779k08781L01889L61413J31775R4817K18740
$$ 6935825 7246482 7068956 7015650 7494429 7285648 7587537 7948950 8080725 8175542 8394282
16791H394282L4877M27749J03650L30923J99604J91355L04179N71882K43215k40113
$$ 8394282 8429159 8856908 8960558 9291481 9491085 9682440 9986619 10558501 10801716 10561603
16781A0561603O25891j16986K50040N01651K10430N45294L85602j8318J60065
$$ 10561603 11187494 11070508 11320548 11822199 12032629 12577923 12963525 12945207 13105272
16772A3105272Q54892P11103R592M59338N60891N25695K0670P20718M88298P46918
$$ 13105272 13960164 14671267 14680859 15140197 15701088 16226783 16247453 16968171 17456469 18203387
16762A8203387M07247O42366N17711J097121L2951J100775N96527J090255P75458
$$ 18203387 18610634 19253000 19770711 20867832 20900783 22001558 22598085 23688340 24463798
16753B4463798J035915J054627O72969J487166P56480J387232J337664J464060
$$ 24463798 25499713 26554340 27227309 28714475 29470955 30858187 32195851 33659911
16745C3659911J127240J651531J152781J869540J670858K238899K083202J817441
$$ 33659911 34787151 36438682 37591463 39461003 41131861 43370760 45453962 47271403
16737D7271403K516111K143299K513286L072400K789004L249638L308113L168269
$$ 47271403 49787514 51930813 54444099 57516499 60305503 63555141 66863254 70031523
16729G0031523L730742M077651L987536M265887M505247N146205N266459N147161
$$ 70031523 73762265 77839916 81827452 86093339 90598586 95744791 101011250 106158411
16721A06158411N745435N421995O044088O048054N982179O093968N916121N410445
$$ 106158411 111903846 117325841 123369929 129417983 135400162 141494130 147410251 152820696
16713A52820696N554132M969604M688931M018680L677935K290468J976354Q28249
$$ 152820696 158374828 163344432 168033363 172052043 175729978 178020446 179996800 180825049
16705A80825049l56727p05490k201212k789831l644140m505803m911101n140534
$$ 180825049 180468322 179762832 177561620 174771789 171127649 166621846 161710745 156570211
16697A56570211n922188n900451n780903o307466n965423o206486n888993o026549
$$ 156570211 150648023 144747572 138966669 132659203 126693780 120487294 114598301 108571752
16689A08571752n572945n242068n184765m787706m452817m352512m354796m215302
$$ 108571752 102998807 97756739 92571974 87784268 83331451 78978939 74624143 70408841
16681G0408841l443580l539550l413207k689498l097288k450083k564697k435191
$$ 70408841 66965261 63425711 60012504 57323006 54225718 51775635 49210938 46775747
16673D6775747k287083j952534k029934k203338j818896j087424j483070j932613
$$ 46775747 44488664 42536130 40506196 38302858 36483962 35396538 33913468 31980855
16665C1980855j122445j455595q36229r49052j466065j074631r31694p63351p13082
$$ 31980855 30858410 29402815 28566586 27617534 26151469 25076838 24145144 23381793 22668711
16656B2668711j239943k86681r77519p11901n37172q05808o70915p02034n54583
$$ 22668711 21428768 21142087 20164568 19452667 18915495 18109687 17438772 16736738 16182155
16647A6182155m10271k57237n13026j080931R7024n90031m30092p7688p58186
$$ 16182155 15771884 15514647 15001621 13920690 14017714 13427683 12997591 12919903 12161717
16638A2161717J9986o42663m41340K15788n29737l29802j38556o61626j57089
$$ 12161717 12181703 11539040 11097700 11313488 10783751 10453949 10315393 9653767 9496678
16629I496678k3800l69025j38808P1044q17966K75334o55543L96701m05402n8859
$$ 9496678 9472878 9103853 8965045 9036089 8218123 8493457 7837914 8234615 7829213 7770354
16619G770354l29576k1838l98687j97554k35348q3290j52424L9819m74979K89154
$$ 7770354 7440778 7418940 7020253 6822699 6587351 6504061 6351637 6391456 5916477 6205631
16609F205631j40604l16912j02468J09074j75133j43045k15286J40343j30396
$$ 6205631 6065027 5748115 5645647 5754721 5579588 5436543 5221257 5361600 5231204
16600E231204m88092J54636l22312K39346p4302O702l84046q0442P8693l17956
$$ 5231204 4743112 4897748 4575436 4814782 4740480 4747182 4363136 4282694 4361387 4043431
16590D043431M6279j60854J04798j27834J78219P6724j42107n32567N34474n52375
$$ 4043431 4089710 3928856 4033654 3905820 4084039 4160763 4018656 3486089 4020563 3468188
16580C468188R3279l45385Q3917p9710K5536R9673j88300j90296m5081j23283
$$ 3468188 3561467 3216082 3299999 3220289 3245825 3345498 3157198 2966902 2921821 2798538
16570B798538M44430l01909K78634l76784M8229j21438M0929l99698O0419M0745
$$ 2798538 3242968 2941059 3219693 2842909 2891138 2769700 2810629 2410931 2471350 2512095
16560B512095q435k0349n7786m2679k45189K59565P7602j30997k01769q5839L25622
$$ 2512095 2503660 2483311 2425525 2382846 2137657 2397222 2474824 2343827 2142058 2056219 2381841
16549B381841l3726j19622j73440J19822r5342k87213J49004m9796K07496m59126
$$ 2381841 2348115 2228493 2055053 2174875 2079533 1792320 1941324 1891528 2099024 1639898
16539A639898L68327k90065J54574j91051K72870J1755j03157L74097k92305q9047
$$ 1639898 2008225 1718160 1872734 1681683 1954553 1966308 1863151 2237248 1944943 1855896
16529A855896j84107L7806J26053n21266J73780k06432K19445Q7264N4397j80666
$$ 1855896 1671789 1709595 1835648 1314382 1488162 1281730 1501175 1588439 1642836 1462170
16519A462170k35281J86846j14545M30897o00255K36577J56574m27272M04797
$$ 1462170 1226889 1413735 1299190 1730087 1129832 1366409 1522983 1095711 1500508
16510A500508l30448J76025P1947r8679j95452K875J11608k14603K98830J38026
$$ 1500508 1170060 1346085 1418032 1319353 1123901 1126776 1238384 1023781 1322611 1460637
16500A460637k94686o7165K1384K15817k4988k32299M6301L7510L661o9229j84449
$$ 1460637 1165951 1098786 1120170 1335987 1310999 1078700 1125001 1162511 1166172 1096943 912494
16489I12494M53174k50036l0454q514j30450K97595k98109Q2781k58109M1656
$$ 912494 1365668 1115632 1085178 1076664 946214 1243809 945700 1028481 770372 812028
16479H12028M30715n87342K68581L72861l12964Q8725j17648K14000j80042l02818
$$ 812028 1242743 655401 923982 1296843 983879 1072604 954956 1168956 988914 686096
16469F86096J7122K89693l13470K10612k18958O4975j26079J87078J00677k26416
$$ 686096 703218 992911 679441 890053 671095 736070 609991 797069 897746 671330
16459F71330K16403L38708E74951K76064J3726O8085J64192l48072J61367j50396
$$ 671330 887733 1226441 574951 851015 864741 932826 1097018 748946 910313 759917
16449G59917J1432l66516j41010M39380k5363J5478j26265J35734L40026m98026
$$ 759917 771349 404833 263823 703203 677840 693318 567053 702787 1042813 544787
16439E44787K45810B47995O01415j38635k5806k29197r2729L61146m3003j55507
$$ 544787 790597 247995 849410 710775 684969 455772 363043 724189 681186 525679
16429E25679K38921j08687j5622r0138j92263B8351Q11066l71818P539A12435
$$ 525679 764600 655913 640291 550153 357890 28351 839417 467599 475138 112435
16418C90689p0491J17150A25338J07887L94105j76224k2384N4994l4712L22207
$$ 390689 320198 437348 125338 233225 627330 451106 428722 483716 449004 771211
16408G71211j52479k63883j39112J88875M84331l34708l718J24914l03936J82939
$$ 771211 618732 354849 215737 404612 888943 554235 550517 675431 371495 554434
16398E54434j15089J99498N8303k32419J4255K3023o7947l0881K52450j32299
$$ 554434 439345 638843 697146 464727 478982 502005 434058 403177 655627 523328
16388E23328K05713B07021L16534J15899l2301j06923o6932j79034n8262K20366
$$ 523328 729041 207021 523555 639454 607153 500230 433298 254264 196002 416368
16378D16368D2492K54926J72793L5083j31128Q3654r2295M8276J11263J7263N025
$$ 416368 42492 297418 470211 505294 374166 457820 365525 413801 525064 542327 547352
16367E47352j61487p0823H8357K2997J85583j28605L80517G1556d34683C00828
$$ 547352 385865 315042 88357 111354 296937 168332 548849 71556 -434683 300828
16356A98806J81693K81336l28038l4218K7641r0896R0804A37178M49170k66310
$$ 198806 380499 661835 333797 299579 327220 236324 327128 137178 586348 320038
16346C20038o0544J13240A15569K59004L68024k14378j42054J21158j23195p722
$$ 320038 259494 372734 115569 374573 742597 528219 386165 507323 384128 376406
16336C76406C3770K38837J7625M13800k78327H0312L4075M75589A00418J90026
$$ 376406 33770 272607 290232 704032 425705 80312 114387 589976 100418 290444
16326B90444r235g2589D63753k28070D3215K08181r3674L6452H9840L24310B00422
$$ 290444 281209 -72589 463753 235683 43215 251396 157722 194174 89840 414150 200422
16314G2404K36143j0850F1912M61426O7913k59089g1668C5656J86323P631O0951
$$ 72404 308547 297697 61912 523338 591251 332162 -71668 35656 221979 229610 290561
16303B90561E3580J30823l6290K45249Q6351j93269a45781B83628M6844A04712
$$ 290561 53580 184403 148113 393362 479713 286444 -145781 283628 330472 104712
16292A679K77897j23197K37352A64808J48263r7240H5590J19231O9118j12768
$$ 1679 279576 156379 393731 164808 313071 215831 85590 204821 273939 161171
16282A61171D9788O2713Q1898q2765J66496b8482B0322D622L62648R218M453q1257
$$ 161171 49788 112501 194399 111634 278130 -28482 20322 4622 367270 376488 380941 299684
16270B99684o5051K7268o0080J6992O5085j04688O7053a44376H4898D294J22313
$$ 299684 234633 261901 201821 218813 283898 179210 246263 -144376 84898 4294 126607
16259A26607J29144M83A16380f660C9752K51344j05645P5274h9535k6617B84024
$$ 126607 255751 256234 116380 -6660 39752 291096 185451 260725 -89535 -116152 284024
16247g4548A07596l0697L1729A4845J6744K1212O32b28484A13311J37845C4635
$$ -74548 107596 76899 108628 14845 31589 52801 53433 -228484 113311 251156 34635
16235a53277B22011K84724H5429J01156J80164A01895J74903J04286k6627o7620
$$ -153277 222011 506735 85429 186585 366749 101895 276798 381084 354457 286837
16225B86837q0926j0105i7310A65182F5919L28620H698M3725J83332I5269K7316
$$ 286837 205911 195806 -97310 165182 65919 394539 8698 52423 235755 95269 122585
16214A22585L37352A62214a09811H4074J73267G9839B6963a1107C63643q898g5126
$$ 122585 459937 162214 -109811 84074 257341 79839 26963 -11107 363643 354745 -75126
16202c3840E3378b4604A0074M5324M7622N3294G3296k879N8946d4510j64810R1694
$$ -33840 53378 -24604 10074 55398 103020 156314 73296 70417 129363 -44510 -209320 -117626
16190a17626B05841c39k9070D5983a64974B03832C1837J8783J38439b24081E47562
$$ -117626 205841 -339 -29409 45983 -164974 203832 31837 50620 189059 -224081 547562
16178a42848D8040L14074A65464a02983j02849I8932N3964J94231j31098j07275
$$ -142848 48040 362114 165464 -102983 -205832 98932 152896 347127 216029 108754
16168A08754M3511i9696j51008m9376d3427j35907A83480i252p9056a1038k2422
$$ 108754 152265 -99696 -250704 -300080 -43427 -179334 183480 -9252 -88308 -11038 -33460
16157c3460B81688A32967A531M3085L23113h024G6126R2241c7690j92252C1511
$$ -33460 281688 132967 1531 44616 367729 -8024 76126 168367 -37690 -229942 31511
16145a41408M3460F0325M4197h6969e692A19589h7315l3059A74387b62383A19231
$$ -141408 -97948 60325 104522 -86969 -5692 119589 -87315 -120374 174387 -262383 119231
16133E0900K1640b10252A87669K9333f7122j06160B2594K51704a9474D6825J48094
$$ 50900 72540 -210252 187669 217002 -67122 -173282 22594 274298 -19474 46825 194919
16122A94919a00954d800j45784C14375j49983J9709A6008K01309K94584B44543
$$ 194919 -100954 -4800 -150584 314375 164392 184101 16008 217317 511901 244543
16111B66706A7502c7442A29688b74217F6759N8291n9754J57107F7859e9010Q540
$$ 266706 17502 -37442 129688 -274217 66759 125050 65296 222403 67859 -59010 -50470
16100e0470A85609k7119a20527m009G953J83787C3990B437g6960G5622i3479A21714
$$ -50470 185609 158490 -120527 -124536 7953 191740 33990 2437 -76960 75622 -93479 121714
16087d6907B18779a50407d2559k25517A53964c55156D30371G0371k8399c15162
$$ -46907 218779 -150407 -42559 -268076 153964 -355156 430371 70371 41972 -315162
16076f6705j69323c5334B24507Q5091j40385a64691C2507K40572b8597E9057b42265
$$ -66705 -236028 -35334 224507 309598 169213 -164691 32507 273079 -28597 59057 -242265
16064A29008J2614K22318i6046I0782m2444c57909a69704B5905b8623B10049J53969
$$ 129008 141622 363940 -96046 90782 48338 -357909 -169704 25905 -28623 210049 364018
16053C64018A1912K7624j7299d8827j07770j1610L9394j04087A31344k9170P8795
$$ 364018 11912 39536 22237 -48827 -156597 -168207 -128813 -232900 131344 102174 180969
16042A80969d9905H1576a75056j82896e754o5571K475G3161M34373A66216b11707
$$ 180969 -49905 81576 -175056 -357952 -5754 -71325 -68850 73161 507534 166216 -211707
16030b00062i2234H898J26472O0149a04674C23358a40240A70967G6821B1708g8420
$$ -200062 -92234 8898 135370 195519 -104674 323358 -140240 170967 76821 21708 -78420
16018a09141A10169D3973a45247A40845k8499a89789C3611L51995d5095q9302
$$ -109141 110169 43973 -145247 140845 112346 -189789 33611 385606 -45095 -134397
16008a34397B03740f9933k2182o6267N3421H037L57822a24632q1169C1583a24919
$$ -134397 203740 -69933 -92115 -158382 -104961 8037 365859 -124632 -205801 31583 -124919
15996H7952J22209k4107c91343H8824H208h5468F7697J0943J24738f3487a2693
$$ 87952 210161 186054 -391343 88824 8208 -85468 67697 78640 203378 -63487 -12693
15984b89580A9690b56403B289a41436B27129D5606J7494a44228b5575E6267b48798
$$ -289580 19690 -256403 2289 -141436 227129 45606 63100 -144228 -25575 56267 -248798
15972a12416j55781C73442A81958J89989j4724j26362D9216N12629a53243B52772
$$ -112416 -268197 373442 181958 371947 357223 230861 49216 561845 -153243 252772
15961g3219A83682K3761E0812K67347j56115b60894l1011g0316F0687f3602q4363
$$ -73219 183682 207443 50812 318159 162044 -260894 -291905 -70316 60687 -63602 -147965
15950a47965j58300A61336B5687N2007Q1581a1075k67267B7523R4981a24727F621
$$ -147965 -306265 161336 25687 77694 159275 -11075 -278342 27523 122504 -124727 6621
15938A6112b40880J00806B17356A9658a49204A05283E0177O6926c5777A10901
$$ 16112 -240880 -140074 217356 19658 -149204 105283 50177 117103 -35777 110901
15927e5682k07343A13960a70041A37314b0328j87196k5142B24715f3499m512B95122
$$ -55682 -263025 113960 -170041 137314 -20328 -207524 -232666 224715 -63499 -68011 295122
15915C567d72999a62128A8188P0233a29697C02309h7173A8532J17841F2952J69471
$$ 3567 -472999 -162128 18188 88421 -129697 302309 -87173 18532 136373 62952 232423
15904B32423g9667C3679J09470B5993R9441a98957b1447j32536A38142f4152k8172
$$ 232423 -79667 33679 143149 25993 125434 -198957 -21447 -153983 138142 -64152 -92324
15893i2324A4681J43317D4075J6141c13966C6151c9519j59571j41477D3262K37002
$$ -92324 14681 157998 44075 60216 -313966 36151 -39519 -199090 -340567 43262 280264
15882B80264i6285m2302H1319m611d6917j35452c2236E224b87215B52014H8581
$$ 280264 -96285 -138587 81319 76708 -46917 -182369 -32236 5224 -287215 252014 88581
15870b79673a21660A52293b7715B7070b73312l1944a9078q8520o171k25020m9411
$$ -279673 -121660 152293 -27715 27070 -273312 -305256 -19078 -107598 -113769 -338789 -388200
15859c88200e7676A80650a3581j52081j2270j089D1726a02437A59799f8127j51021
$$ -388200 -57676 180650 -13581 -165662 -177932 -179021 41726 -102437 159799 -68127 -219148
15848b19148R1292D13503b76410A01276b8309C94583a01212D33125b78886C05078
$$ -219148 -127856 413503 -276410 101276 -28309 394583 -101212 433125 -278886 305078
15837B10255l0967H1536A6448a42245l8996e8190A19878K58402a9591j05514p6379
$$ 210255 179288 81536 16448 -142245 -181241 -58190 119878 378280 -19591 -125105 -201484
15826b01484A09988m0977K31635c03510n0938h7080A47844b98208H4117a32530
$$ -201484 109988 69011 300646 -303510 -354448 -87080 147844 -298208 84117 -132530
15815a5536C00926j47927F716Q5997e5939G9928b00860B43216a49480j60518J39739
$$ -15536 300926 152999 6716 92713 -55939 79928 -200860 243216 -149480 -309998 -170259
15804a70259B9232O6710c76827f9403k61623A4023Q5562B1841a84419j3148c6406
$$ -170259 29232 95942 -376827 -69403 -331026 14023 99585 21841 -184419 -197567 -36406
15792E3642e8997C97801A53487a48684d6525k25534A42218c77070a33309e3069
$$ 53642 -58997 397801 153487 -148684 -46525 -272059 142218 -377070 -133309 -53069
15781h2636k36866A73059b05741R4269m444K2220Q657k43977E7739J18945a48070
$$ -82636 -319502 173059 -205741 -111472 -115916 -93696 -85039 -329016 57739 176684 -148070
15769A1751a80456A74821c18158A16130J87705e0968o8650H1447g3356p6631j17320
$$ 11751 -180456 174821 -318158 116130 303835 -50968 -119618 81447 -73356 -149987 -267307
15758b67307a372B7889R3176c2738m71968a95134P6564N5633j57661a8251A95419
$$ -267307 -1372 27889 121065 -32738 -504706 -195134 -118570 -62937 -220598 -18251 195419
15746b16005B88021f159k67611a08317c7038B89995C818c891E71239I7245g675
$$ -216005 288021 -6159 -273770 -108317 -37038 289995 3818 -3891 571239 97245 -7675
15734g8565B82259g3572A29432F58N1931d01711a69965D3251h8957A45727a6382
$$ -78565 282259 -73572 129432 658 52589 -401711 -169965 43251 -88957 145727 -16382
15722b0496j95083A86037a39270k80330E7456k5296J08579b0059i281m3587D3961
$$ -20496 -215579 186037 -139270 -419600 57456 32160 140739 -20059 -9281 -52868 43961
15710b81927E0706a54893g5740A32392M2739A0192J71581i5459M7088D9093c11769
$$ -281927 50706 -154893 -75740 132392 175131 10192 181773 -95459 -48371 49093 -311769
15698B10612a36949A7311b11687N613a01027H076i2331A73602e9124j18352G4197
$$ 210612 -136949 17311 -211687 -206074 -101027 8076 -92331 173602 -59124 -177476 74197
15686c84226b1794j03079H6139L017l9084a08850r0623E8614i3936p2529A05063
$$ -384226 -21794 -124873 86139 89156 50072 -108850 -199473 58614 -93936 -166465 105063
15674b22963J7708K6280A93921R891M3487i3224F9818H825c702A86156e0284k3161
$$ -222963 -205255 -178975 193921 203812 247299 -93224 69818 8825 -3702 186156 -50284 -73445
15662g3445A49444b05072j78930a36032L6360p7411B4913Q7424J26115D5514J2600
$$ -73445 149444 -205072 -384002 -136032 -99672 -177083 24913 112337 238452 45514 58114
15651E8114J31934a13842L1809b1960A65060b77292m2461f6416A9115a59700A50705
$$ 58114 190048 -113842 -82033 -21960 165060 -277292 -319753 -66416 19115 -159700 150705
15639G801i541C1544K05771c8637q807j80068a07271G5773F892b1228j67950g5914
$$ 7801 -9541 31544 237315 -38637 -47444 -227512 -107271 75773 6892 -21228 -189178 -75914
15626D850b51020C70952c75784A60001n3803L87344a34683F1111R4847J15839
$$ 4850 -251020 370952 -375784 160001 106198 493542 -134683 61111 155958 271797
15616B71797b02993k03208a49860g4101I2036O6117J58872a64632C89860H3588
$$ 271797 -202993 -406201 -149860 -74101 92036 158153 317025 -164632 389860 83588
15605e8180E3599J70537f7540G2403K37662e4149j4911j875J7785B47111b27738
$$ -58180 53599 224136 -67540 72403 310065 -54149 -69060 -70935 -53150 247111 -227738
15593a29406E9007c52943a73055a8652j06819B30249E3613P2746l0329R1024a44877
$$ -129406 59007 -352943 -173055 -18652 -125471 230249 53613 126359 96030 187054 -144877
15581b0833D24011g2102k08223A2844d5861k45918a14520H8285K10469i5268M0898
$$ -20833 424011 -72102 -280325 12844 -45861 -291779 -114520 88285 298754 -95268 -54370
15570e4370m9309b2610k38948J00839C13409C1164b6966j05903H2754b24869i6073
$$ -54370 -103679 -22610 -261558 -160719 313409 31164 -26966 -132869 82754 -224869 -96073
15558G0147N6993e57000C50344b71250A04716c32019a51533b8009F7783N4271
$$ 70147 127140 -557000 350344 -271250 104716 -332019 -151533 -28009 67783 122054
15548A22054C458J81453J33134a02010J2176B04045F6478h4617A17048a90473
$$ 122054 3458 184911 318045 -102010 -89834 204045 66478 -84617 117048 -190473
15537g4259L3305A70658d419A78400b33953K818a09901I8584P5213D0831J8273
$$ -74259 -40954 170658 -4419 178400 -233953 -231135 -109901 98584 173797 40831 59104
15526E9104a74493Q2217j11082O1414A92606b62935F421O5163a21186l02247e1244
$$ 59104 -174493 -92276 -203358 -141944 192606 -262935 6421 71584 -121186 -423433 -51244
15514b64712f9965C10709n9793q1705K57574a69027C6501b32326h7649L5678r249
$$ -264712 -69965 310709 250916 169211 426785 -169027 36501 -232326 -87649 -51971 -61220
15503f1220A58541b63724a6276B04801a33725p9467P2441r0567L95J12428C07874
$$ -61220 158541 -263724 -16276 204801 -133725 -213192 -140751 -231318 -230923 -118495 307874
15491b94592E8574b05937C27275j58754J88966C7266f2110j1974A70582c4903
$$ -294592 58574 -205937 327275 168521 357487 37266 -62110 -74084 170582 -34903
15480b8960k19408a8425k55959A16626a52205R507c756k60801C8542a96199c6224
$$ -28960 -248368 -18425 -274384 116626 -152205 -142698 -3756 -264557 38542 -196199 -36224
15468A42509M1806J29812b61243C34510b9093F0060h3047b3124C82919G9414j8351
$$ 142509 184315 314127 -261243 334510 -29093 60060 -83047 -23124 382919 79414 61063
15457F1063a0052B70246i8517M8675o7868A63018i4445C75532j47304a25415o3339
$$ 61063 -10052 270246 -98517 -49842 -117710 163018 -94445 375532 228228 -125415 -188754
15446a88754g9581D24519G6770d8308a5152B66863f8692B74782A30224O7869a2010
$$ -188754 -79581 424519 76770 -48308 -15152 266863 -68692 274782 130224 198093 -12010
15434d10896a99247p292e5623B4796L4552K36754b0151A25790Q4610a96519A41157
$$ -410896 -199247 -206539 -55623 24796 59348 296102 -20151 125790 210400 -196519 141157
15422I8338g4783E9933a72075n566C34222A0355L00510a74112b0361E7598b6479
$$ 98338 -74783 59933 -172075 -177641 334222 10355 310865 -174112 -20361 57598 -26479
15410a17043n4652j22247a2879j58211A45853b58878a23089k52992C06561d18514
$$ -117043 -171695 -293942 -12879 -171090 145853 -258878 -123089 -376081 306561 -418514
15399A73949J08668r0826A0237P6422b41730a01835K7593G7016J32332m69f8893
$$ 173949 282617 191791 10237 86659 -241730 -101835 -74242 77016 209348 208879 -68893
15387A115b45684K8583M1094K9299m4298j60141i8355I1571a12834j21438f7672
$$ 1115 -245684 -217101 -176007 -146708 -191006 -351147 -98355 91571 -112834 -234272 -67672
15375B86851c14842A43574J38024b13793I7441k7511h2810G2908O9161b56087
$$ 286851 -314842 143574 281598 -213793 97441 69930 -82810 72908 142069 -256087
15364a02636r4656A16421R2528N2057i8623A93545k4595N2308c61633a36887A3419
$$ -102636 -197292 116421 208949 261006 -98623 193545 168950 221258 -361633 -136887 13419
15352A22580a94889C7907d4808j19683h1058A65451g355A02603b63675C44771
$$ 122580 -194889 37907 -44808 -164491 -81058 165451 -7355 102603 -263675 344771
15341f2029q6414E9931a47318k25877J29359C6938c6682B11618o6346j1187O7371
$$ -62029 -148443 59931 -147318 -373195 -243836 36938 -36682 211618 145272 134085 201456
15330B01456m5215a73463p0869F5462b62887B6737a40919C07344a65790a2750
$$ 201456 156241 -173463 -244332 65462 -262887 26737 -140919 307344 -165790 -12750
15319E2620J9516k4602K17579r5744O7471c3158B8733K6169g1153D02808a43178
$$ 52620 72136 47534 265113 169369 236840 -33158 28733 54902 -71153 402808 -143178
15307a4459O070j81A88081g1335b8700j2365k4618A74045J13836j13955P1194
$$ -14459 -8389 -8570 188081 -71335 -28700 -41065 -65683 174045 287881 173926 245120
15296B45120P8451c31887G9262a46214d3464A55697l6944a88426B51101p7772
$$ 245120 323571 -331887 79262 -146214 -43464 155697 118753 -188426 251101 173329
15286A73329c42448a45407k2669I0626R2262J84965B1240a90562d4393I9837a0444
$$ 173329 -342448 -145407 -168076 90626 182888 367853 21240 -190562 -44393 99837 -10444
15274A23240Q2611C3984O7662J42405j08498C0296b73303g8752B99167J16520
$$ 123240 205851 33984 101646 244051 135553 30296 -273303 -78752 299167 415687
15264D15687H5747J93086N1437A29889N9401E3666J51668I5836O3310a7086E88416
$$ 415687 85747 278833 330270 129889 189290 53666 205334 95836 159146 -17086 588416
15252b9785B53159C2956M34408B045J69374h5779B26859i5294A7543K99811a78075
$$ -29785 253159 32956 467364 2045 171419 -85779 226859 -95294 17543 317354 -178075
15240D17997A29575J70124J04892j16533K34863j49417O79854J47130J85370L63751
$$ 417997 129575 299699 404591 288058 522921 373504 1053358 1200488 1385858 1749609
15230A749609m79410n32005B04201K31042o5995Q0764A73808a38751A23443a48018
$$ 1749609 1270199 738194 204201 435243 369248 450012 173808 -138751 123443 -148018
15219B69091D9575f3895j150j5160A66674j2452O9476K08679b17243C8332b15040
$$ 269091 49575 -63895 -65045 -80205 166674 154222 223698 432377 -217243 38332 -215040
15207c9087I2783l8810P6413N6975l1288e9323A35089g7497b2978C6762b51385
$$ -39087 92783 53973 130386 187361 156073 -59323 135089 -77497 -22978 36762 -251385
15195A37854a08646A04683B2444d3704p2735a167H0999a35424B85599g6744o3638
$$ 137854 -108646 104683 22444 -43704 -116439 -1167 80999 -135424 285599 -76744 -140382
15184a40382I216L4201b3844A30546a48637H7809f2758C3113Q7080a34635D04394
$$ -140382 9216 43417 -23844 130546 -148637 87809 -62758 33113 120193 -134635 404394
15172a4854j25171h223b963A59780l0514K84348A74126b87079A70224b49232d0170
$$ -14854 -140025 -8223 -2963 159780 129266 413614 174126 -287079 170224 -249232 -40170
15160a01602K6929K523j41234l67470A88028a75586e7396J2799B81158e1118D9239
$$ -101602 -74673 -72150 -213384 -580854 188028 -175586 -57396 -44597 281158 -51118 49239
15148f3080l5326H8206Q4136O0643c30014A57929E9441P4266C4830J62525o5454
$$ -63080 -98406 88206 172342 232985 -330014 157929 59441 133707 34830 197355 131901
15137A31901f7748p4739E0149J35604R7308o8168a33994l6902a0526A89946B7012
$$ 131901 -67748 -142487 50149 185753 283061 214893 -133994 -170896 -10526 189946 27012
15125A4272b8325k85773C06988F0514P3132n1626J83095J25784j42947N3610j28431
$$ 14272 -28325 -314098 306988 60514 133646 82020 265115 390899 247952 301562 173131
15114A73131e5051a1202A62793K9498P3793m8923g1251A98138I3708O2724m0003
$$ 173131 -55051 -11202 162793 192291 266084 217161 -71251 198138 93708 156432 116429
15103A16429L894a41779A72193R1027k1873J33930E4734L2818A7588O093K3L18428
$$ 116429 120323 -141779 172193 263220 241347 375277 54734 87552 17588 23681 23704 342132
15091C42132m117j15254L09883G7149c2824B25635L56630k00426j56414P9790
$$ 342132 338015 222761 532644 77149 -32824 225635 582265 381839 225425 305215
15081C05215a6836A1071M859L04700a0951A71866L92310G5922f1998A06928K01807
$$ 305215 -16836 11071 15930 320630 -10951 171866 564176 75922 -61998 106928 308735
15070C08735I7635C8046K23943q4322J49215Q0109A3490J16712J84387m7136G3702
$$ 308735 97635 38046 261989 177667 326882 406991 13490 130202 314589 267453 73702
15058A57392K46342a54328B32040a47877B19086b46450A99807P252L80657B48209
$$ 157392 403734 -154328 232040 -147877 219086 -246450 199807 207059 587716 248209
15047c28558C30629g9035A40030a16898C56029c0002l1051f626A42165J20447
$$ -328558 330629 -79035 140030 -116898 356029 -30002 -61053 -6626 142165 262612
15037B62612R3001B4164L01357p3450I0687h3754D0862e354j54280A45404R3239
$$ 262612 355613 24164 325521 252071 90687 -83754 40862 -5354 -159634 145404 238643
15026B38643n5969m8673J21619Q4917j2027j60203l8060F3178N0696P4202J85543
$$ 238643 182674 134001 255620 340537 328510 168307 130247 63178 113874 188076 373619
15015C73619J34492E9974P9329l8171N1626a11327D30742A99096J56730e3679
$$ 373619 508111 59974 139303 101132 152758 -111327 430742 199096 355826 -53679
15004C16005I3400O3777L64519a523A84122a87159C49223i6187E05622E7720Q0196
$$ 316005 93400 157177 521696 -1523 184122 -187159 349223 -96187 505622 57720 137916
14993A37916K01095m6554G418L6234h7164J0169A86736q1726J38955M3763r7349
$$ 137916 339011 292457 7418 43652 -87164 -76995 186736 105010 243965 287728 190379
14982A90379K49107A27692K7464F9417J65661J1574p497a3695A04064J25533k0502
$$ 190379 439486 127692 155156 69417 235078 246652 239155 -13695 104064 229597 209095
14971B09095F9771J10205L9873a3060D67489j63371j40406N765K50716j90773
$$ 209095 69771 179976 219849 -13060 467489 304118 163712 169477 420193 229420
14961B29420r1788K84847q3385a28034C11198m1602C8339J57731C6074L5353J57332
$$ 229420 137632 422479 339094 -128034 311198 269596 38339 196070 36074 71427 228759
14950B28759p8074K36000d7879B56329j8251n6041J87967E3199J39556J26144
$$ 228759 150685 386685 -47879 256329 238078 182037 370004 53199 192755 318899
14940C18899A39231k450J91713e1670C56636F7269N87805a77C04416N0442F3058
$$ 318899 139231 136781 328494 -51670 356636 67269 655074 -177 304416 354858 63058
14928A26404O0092R9473O2776F7563K64463b26529H1837L74961C4658K16460N2930
$$ 126404 186496 285969 348745 67563 332026 -226529 81837 456798 34658 251118 304048
14917C04048J26455L14973H4835K13252M6556O8074A88358O601L6466H4061C3748
$$ 304048 430503 745476 84835 298087 344643 412717 188358 194959 231425 84061 33748
14905C22032Q1778J08152o7053k19005L10456k37981J35208j17715J58875j41664
$$ 322032 403810 511962 444909 225904 536360 298379 433587 315872 474747 333083
14895C33083K98639j36585B01435M6870K8452Q2567M8738A15562R7505k3629J02592
$$ 333083 631722 495137 201435 248305 276757 359324 408062 115562 213067 189438 292030
14884B92030K2813J55268q3424O0937j31226K45262k37065J3654J88162j94051
$$ 292030 314843 470111 386687 447624 316398 561660 324595 338249 526411 332360
14874C32360n6072k0847K10660R5942B66309q9791L1775L19625H3004k309K16392
$$ 332360 276288 255441 466101 562043 266309 176518 208293 527918 83004 80695 297087
14863B97087A39835L84919q7581J50048A84431K20984K54135C06681p1863j3989
$$ 297087 139835 524754 437173 587221 184431 405415 659550 306681 234818 220829
14853B20829M31506k47707r4871K8184R076J1618j62831K23395o5363J69517B48349
$$ 220829 652335 404628 309757 337941 347017 358635 195804 419199 353836 523353 248349
14841D60052P3928J58278A01617M7995J05323M21230l22907R3046k21975J78986
$$ 460052 533980 692258 101617 149612 254935 676165 353258 446304 224329 403315
14831D03315j65180L04028L49923C75309N90179B07607K95818n8739K9816k15778
$$ 403315 238135 542163 892086 375309 965488 207607 503425 444686 474502 258724
14821B58724L849m0203L1898J21130J51015K41265l22378N291k20430J93416k02188
$$ 258724 262573 222370 254268 375398 526413 767678 445300 450591 230161 423577 221389
14810B21389J54009R6917J1221K07562j75879J5178k38594P4956I3415K82857
$$ 221389 375398 472315 483536 691098 515219 530397 291803 366759 93415 376272
14800C76272l7849J60719J14654O055B28340L88655j7898K06750B84886N7844
$$ 376272 338423 499142 613796 619851 228340 616995 599097 805847 284886 342730
14790C42730J89610l0177j10651K17197B45073K10343L31809j66249j56806M3292
$$ 342730 532340 502163 391512 608709 245073 455416 787225 620976 464170 507462
14780E07462J54563J67046m00541j27511K5079K2508o944J11253K86956l05818
$$ 507462 662025 829071 428530 301019 326098 348606 341662 452915 739871 434053
14770D34053O7572K12269j87066J41961p3728M233B41183J77117K58862j54478
$$ 434053 501625 713894 526828 668789 595061 599294 241183 418300 677162 522684
14760E22684J18936A76080M01696A85457M91853j10110J5611R7101N6196L3086
$$ 522684 641620 176080 577776 185457 677310 567200 582811 679912 736108 769194
14750G69194j02671n2623L15952k57940J73452j57300k8148A54017O45437J32401
$$ 769194 666523 613900 929852 671912 845364 688064 659916 154017 799454 931855
14740I31855l20910K3846j38646N2910l7317Q4992l2130K89842O0398k37270R9074
$$ 931855 610945 634791 496145 549055 511738 596730 564600 854442 914840 677570 776644
14729G76644l5982j88828J59817J07654k09026L8161R9927k8735q7201Q3022K6434
$$ 776644 740662 551834 711651 819305 610279 648440 748367 719632 632431 715453 741887
14718G41887j88380Q1377M16904l66418J47887J9189N1099J22579r6757o0584
$$ 741887 553507 634884 1051788 685370 833257 852446 903545 1026124 929367 868783
14708H68783Q6373k29098o3836L01534j99493k66759N30642D71985M04144J0262
$$ 868783 955156 726058 662222 963756 764263 497504 1028146 471985 876129 886391
14698H86391k13113j50226L16368q8181K43235o8294K83972D09566L20775J82985
$$ 886391 673278 523052 839420 751239 994474 926180 1210152 409566 730341 913326
14688I13326j48664Q2163J15039J24594k58283r9702j66113M14530j57284L53093
$$ 913326 764662 846825 961864 1086458 828175 728473 562360 976890 819606 1172699
14678A172699m72526M9497L0431O7451J08696k16177K51527N7197j69941O5048
$$ 1172699 700173 749670 780101 847552 956248 740071 991598 1048795 878854 943902
14668I43902N9516j54624L0418K15315k29350j0778K19890M5010l27893K45650
$$ 943902 1003418 848794 879212 1094527 865177 854399 1074289 1119299 791406 1037056
14658A037056J85770m44415K62139q8062L36441o27917O29850m60907K35508k5130
$$ 1037056 1222826 778411 1040550 952488 1288929 661012 1290862 829955 1065463 1040333
14648A040333j6630K90692l91503k0582J36199J90853j63189J02555J24432n5842
$$ 1040333 1023703 1314395 922892 902310 1038509 1229362 1066173 1168728 1293160 1237318
14638A237318P5974q4400J84860k90653J43848j36639L0384L40148k05131j80156
$$ 1237318 1313292 1228892 1413752 1123099 1266947 1130308 1160692 1500840 1295709 1115553
14628A115553k68413L80540k23896K01279K14460m94994N52874l15010L62653
$$ 1115553 847140 1227680 1003784 1205063 1419523 924529 1477403 1162393 1525046
14619A525046l23960j6047L32803l23620K99257k93015J72363j71485J29949J86540
$$ 1525046 1201086 1185039 1517842 1194222 1493479 1200464 1372827 1201342 1331291 1517831
14609A517831m27233L15762L3954j97484j5650M37437P0361k28330P3151L6949
$$ 1517831 1090598 1406360 1440314 1242830 1227180 1664617 1734978 1506648 1579799 1616748
14599A616748r1141Q0001m9779K5013L1237J47959j29665J63963m73225O34372
$$ 1616748 1525607 1605608 1555829 1580842 1612079 1760038 1630373 1794336 1321111 1955483
14589A955483k68700o2302q3218j9041L80319k08642j87589O9921Q6551L7712
$$ 1955483 1686783 1624481 1541263 1522222 1902541 1693899 1506310 1576231 1662782 1700494
14579A700494J57771J68889L4605j48864j93464J5675K22295l29017N02953L6225
$$ 1700494 1858265 2027154 2061759 1912895 1719431 1735106 1957401 1628384 2131337 2167562
14569B167562q0202j19611j33461M06742l09568K74631m68753L04428J06442j45120
$$ 2167562 2087360 1967749 1834288 2241030 1931462 2206093 1737340 2041768 2148210 2003090
14559B003090K45739q620m2192k26596N8293L94319n12742N91467j39306L03093
$$ 2003090 2248829 2240209 2198017 1971421 2029714 2424033 1911291 2502758 2363452 2666545
14549B666545j27493K20582k9341J39864K62487m24084O80472J3731J80484O12027
$$ 2666545 2539052 2759634 2730293 2870157 3132644 2708560 3389032 3402763 3583247 4195274
14539D195274M14414K91451Q37025Q80032J597365K060482M258602P420136J0603355
$$ 4195274 4609688 4901139 5738164 6618196 8215561 10276043 14534645 21954781 32558136
14530C2558136j420685j1273511q274765m432819k090084j417613n30558J08951
$$ 32558136 31137451 19863940 11589175 7156356 5066272 3648659 3118101 3227052
14522C227052m00051J65638j91347k62798n68002M18426l10893L58924l0377j5605
$$ 3227052 2827001 2992639 2801292 2538494 1970492 2388918 2078025 2436949 2406572 2390967
14512B390967O6757j78827K1449M30640p2493k05220J49124J75540L30870n42524
$$ 2390967 2457724 2278897 2300346 2730986 2658493 2453273 2602397 2777937 3108807 2566283
14502B566283L86522k2235j75769m3232j5019J5430M5977M5396L01950k64871
$$ 2566283 2952805 2930570 2754801 2711569 2696550 2711980 2757957 2803353 3105303 2840432
14492B840432m0326N02938k20302O6356j07935J91802M7883K28042k58305n4991
$$ 2840432 2800106 3303044 3082742 3149098 3041163 3232965 3280848 3508890 3250585 3195594
14482C195594K53903J24537m2885k56933O7176K85615k15019J83363j54260J58376
$$ 3195594 3449497 3574034 3531149 3274216 3341392 3627007 3411988 3595351 3441091 3599467
14472C599467K32367Q137k3545O9684p2405j5744K24802L1094m5858p4224N76475
$$ 3599467 3831834 3839971 3816426 3886110 3813705 3797961 4022763 4053857 4007999 3933775 4510250
14461D510250k61521N2203L725j50405L55523m3834L1291m07060J76525M75124
$$ 4510250 4248729 4300932 4304657 4154252 4509775 4465941 4497232 4090172 4266697 4741821
14451D741821J80235l00953n0185L46053j39302J46144J33993j20437J04654m5667
$$ 4741821 4922056 4621103 4570918 4916971 4777669 4923813 5057806 4937369 5042023 4996356
14441D996356L23200K78234m02696K31465L0200j58407J82471L80003M2131J97848
$$ 4996356 5319556 5597790 5195094 5426559 5456759 5298352 5480823 5860826 5902957 6100805
14431F100805j44233K39865l62107K91679L48724k59787K62389J56932k82897
$$ 6100805 5956572 6196437 5834330 6126009 6474733 6214946 6477335 6634267 6351370
14422F351370K71101Q370L33767J53523k68539M48409j11678m3031K06959K07225
$$ 6351370 6622471 6630841 6964608 7118131 6849592 7298001 7186323 7143292 7350251 7557476
14412G557476j72365K66646L90579l48555K97228M33004O1790m08523L17304L69012
$$ 7557476 7385111 7651757 8042336 7693781 7991009 8424013 8485803 8077280 8394584 8763596
14402H763596J4558K67952R5694j32310J11423J97736K25272K64202j74111R8503
$$ 8763596 8778154 9046106 9141800 9009490 9120913 9318649 9543921 9808123 9634012 9732515
14392I732515L09375K58811k24568M73958K26908l66904Q06484q2034L02262J15386
$$ 9732515 10041890 10300701 10076133 10550091 10776999 10410095 11216579 11134545 11436807 11552193
14382A1552193J59699m7650P53805O4572n2302N04909k39286O79315j55199L83537
$$ 11552193 11711892 11664242 12418047 12482619 12430317 12935226 12695940 13375255 13220056 13603593
14372A3603593R5287M44635J28861M00087j70015Q15799k48668O03446M24674
$$ 13603593 13698880 14143515 14272376 14672463 14502448 15318247 15069579 15673025 16097699
14363A6097699K72496K08309J98586O24711N72756j28697M19564N87477J56351
$$ 16097699 16370195 16578504 16777090 17401801 17974557 17845860 18265424 18852901 19009252
14354A9009252M92498N22565l2230N11786O77051K84320O46495K18012K40675
$$ 19009252 19501750 20024315 19992085 20503871 21180922 21465242 22111737 22329749 22570424
14345B2570424P85787O94629L18808N22501O71453O91316Q40831O91662K35556
$$ 22570424 23356211 24050840 24369648 24892149 25563602 26254918 27095749 27787411 28022967
14336B8022967N61802J181551O19312J050577P06812O71239P74762J044430J095068
$$ 28022967 28584769 29766320 30385632 31436209 32143021 32814260 33589022 34633452 35728520
14327C5728520P57026J314375P06181J296100R33504R77464J099808J587970J278125
$$ 35728520 36485546 37799921 38506102 39802202 40735706 41713170 42812978 44400948 45679073
14318D5679073J641477J352515J397892J410318J755100J944612J832311J741086
$$ 45679073 47320550 48673065 50070957 51481275 53236375 55180987 57013298 58754384
14310E8754384K069137J787677K451408K286529K464404K490876K782143K445009
$$ 58754384 60823521 62611198 65062606 67349135 69813539 72304415 75086558 77531567
14302G7531567L337844K454888L582411L438475L839704L733798L892872M353575
$$ 77531567 80869411 83324299 86906710 90345185 94184889 97918687 101811559 106165134
14294A06165134M672075M629532M764286N504566N706192O126579O226235O734854
$$ 106165134 110837209 115466741 120231027 125735593 131441785 137568364 143794599 150529453
14286A50529453P104468P471603P686069Q668654Q956808R606047R783622J0224763
$$ 150529453 157633921 165105524 172791593 181460247 190417055 200023102 209806724 220031487
14278B20031487J0909178J1711763J1800880J3270218J3030540J4241815J4093671
$$ 220031487 230940665 242652428 254453308 267723526 280754066 294995881 309089552
14271C09089552J4636586J4747958J3860380J3990492J3467201J2436371J1822305
$$ 309089552 323726138 338474096 352334476 366324968 379792169 392228540 404050845
14264D04050845J0977721R297836P756001Q351937O917731O663466L720101J651359
$$ 404050845 415028566 424326402 432082403 440434340 447352071 454015537 457735638 459386997
14256D59386997K41952J335431k784951o986312n819877r588100j0715207r927376
$$ 459386997 459628949 460964380 458179429 451193117 445373240 435785140 425069933 415142557
14248D15142557j2922243j3013201j3749849j3761236j3394595j4290003j4060760
$$ 415142557 402220314 389207113 375457264 361696028 348301433 334011430 319950670
14241C19950670j3156600j3225809j2786927j3218783j2127129j2118785j1395419
$$ 319950670 306794070 293568261 280781334 267562551 255435422 243316637 231921218
14234B31921218j1076627j1154609j0460209j0373728r310068q533100q589355
$$ 231921218 220844591 209689982 199229773 188856045 179545977 171012877 162423522
14227A62423522p908580p211710o769175o805678n683143n396717n291382n257096
$$ 162423522 154514942 147303232 140534057 133728379 128045236 122648519 117357137 112100041
14219A12100041m666115m417291m085796l602160m084122l692683k961001l443234
$$ 112100041 107433926 103016635 98930839 95328679 91244557 87551874 84590873 81147639
14211H1147639k939981l131051k630513k557262k678635k097761j865047k127448
$$ 81147639 78207658 75076607 72446094 69888832 67210197 65112436 63247389 61119941
14203F1119941k387892j545321k210285j608554j538420j439617j686844j496060
$$ 61119941 58732049 57186728 54976443 53367889 51829469 50389852 48703008 47206948
14195D7206948j226431j478349o31062j081971j565336j250102j083339q73879
$$ 47206948 45980517 44502168 43871106 42789135 41223799 39973697 38890358 38016479
14187C8016479j296435q95712p10887q72010j047953p05687o94125j005379o11990
$$ 38016479 36720044 35824332 35113445 34241435 33193482 32487795 31793670 30788291 30176301
14178C0176301o21708q53409q57978n48922p29161p32195m89526o60302j73970
$$ 30176301 29554593 28701184 27843206 27294284 26565123 25832928 25343402 24683100 24509130
14169B4509130p84560n95352k85208r19883L3621n45599o29788r5125m63877m52298
$$ 24509130 23724570 23129218 22844010 21924127 21957748 21412149 20782361 20687236 20223359 19771061
14159A9771061n44703k86796m45091k66773n59102j34019m24713j14712n65763
$$ 19771061 19226358 18939562 18494471 18227698 17668596 17534577 17109864 16995152 16429389
14150A6429389k32482k76516n91859L17954n02581Q2722n77598q1029P2277p60025
$$ 16429389 16196907 15920391 15328532 15646486 15143905 15226627 14649029 14568000 14640277 13880252
14140A3880252o88861O2924J76525k75529m32501j51565k68131l7623l06282k72283
$$ 13880252 13191391 13254315 13430840 13155311 12722810 12571245 12303114 12265491 11959209 11686926
14130A1686926k45438J47858j72160j74060p39777M19561m55401q6128m9926j38150
$$ 11686926 11441488 11589346 11417186 11243126 10503349 10922910 10467509 10381381 10331455 10193305
14120A0193305j59854l28677k21656P9454N9407j33710p9312n14884J94396k61664
$$ 10193305 10033451 9704774 9483118 9562572 9621979 9488269 9408957 8894073 9088469 8826805
14110H826805l73188K18227j30451n49177M73754l85527P1104j65241J32051n75053
$$ 8826805 8453617 8671844 8541393 7992216 8465970 8080443 8151547 7986306 8118357 7543304
14100G543304M33175m33177j82315k44590m6179L8926j445j63833k43269K46070
$$ 7543304 7976479 7543302 7360987 7116397 7070218 7109144 7107699 6943866 6700597 6946667
14090F946667l6061l00748J07887k20719J39269l47026p7068l76893K37625o0695
$$ 6946667 6910606 6609858 6717745 6497026 6636295 6289269 6212201 5835308 6072933 6012238
14080F012238k12583J08109O3215m8937j36129M3176l71382q0315j24182L97650
$$ 6012238 5799655 5907764 5970979 5922042 5785913 5829089 5457707 5377392 5253210 5650860
14070E650860m33533j89756J67722m8894k43964K4678L11448l88591n6605L43074
$$ 5650860 5217327 5027571 5195293 5146399 4902435 4927113 5238561 4849970 4793365 5136439
14060E136439l77267j14264j76611L19606n6743l37173L00665m28260J37517j82173
$$ 5136439 4759172 4644908 4468297 4787903 4731160 4393987 4694652 4266392 4403909 4221736
14050D221736M28703n27311L98084m6589l78896J03024M4850J61045m92150L00005
$$ 4221736 4650439 4123128 4521212 4474623 4095727 4198751 4243601 4404646 3912496 4212501
14040D212501j23449j16563K36223k92180J3252j95058J75649k4885l90932K39081
$$ 4212501 4089052 3972489 4208712 3916532 3929784 3734726 3910375 3885490 3494558 3733639
14030C733639O7933j11607k19247k59399L81090P0836l53542K35354j86007j83219
$$ 3733639 3801572 3689965 3470718 3211319 3592409 3663245 3309703 3545057 3359050 3175831
14020C175831M2482j33215J97516L42103l2765n93141M10601m85614N48874k50190
$$ 3175831 3218313 3085098 3282614 3624717 3591952 2998811 3409412 2923798 3472672 3222482
14010C222482o1040l16235K26066l19686J43434q3018j40728M17621j53375n2952
$$ 3222482 3161442 2845207 3071273 2751587 2895021 2812003 2671275 3088896 2935521 2882569
14000B882569j13166K0628l15321j9827j15163J54414O0736O8271j42418l13094
$$ 2882569 2769403 2790031 2474710 2454883 2339720 2494134 2554870 2623141 2480723 2167629
13990B167629L08633k59621J61413K4959N7919k92274K39228L19952k37507j33621
$$ 2167629 2476262 2216641 2378054 2403013 2460932 2168658 2407886 2727838 2490331 2356710
13980B356710M38447K80292M10235Q4324Q38261P89398J356299L538220O510662
$$ 2356710 2795157 3075449 3485684 3570008 4408269 5197667 6553966 10092186 16602848
13971A6602848J0987126M566755j0374205p658967m126973k686146j473119p55971
$$ 16602848 27589974 32156729 21782524 14123557 9996584 7310438 5837319 5081348
13963E081348p43640l97863n3909l64626k08167j78561l15709K9072j25256K25779
$$ 5081348 4337708 3939845 3885936 3521310 3313143 3134582 2818873 2847945 2722689 2948468
13953B948468k64855o7558J7321n2999l31584J72023j23175l11139M80880j58341
$$ 2948468 2683613 2616055 2633376 2580377 2248793 2420816 2297641 1986502 2467382 2309041
13943B309041j93381M49291k82173k22615K71580j41046l8416l0818N8424p5310
$$ 2309041 2115660 2564951 2282778 2060163 2331743 2190697 2152281 2121463 2179887 2104577
13933B104577j34554J3101j9662K47296l62609L5407p3527L4488R5634k21107
$$ 2104577 1970023 1983124 1963462 2210758 1848149 1883556 1810029 1844517 1940151 1719044
13923A719044j16136J08134P2770M78471m91057j31049Q6705J73008r6077m19291
$$ 1719044 1602908 1711042 1783812 2262283 1771226 1640177 1726882 1899890 1803813 1384522
13913A384522L35547K11048l59866K01682J91240k35050Q3583l25020N8466K15165
$$ 1384522 1720069 1931117 1571251 1772933 1964173 1729123 1812706 1487686 1546152 1761317
13903A761317k43994K5838o121L0268J12849k64773M8107J05905J34442j43349
$$ 1761317 1517323 1543161 1537040 1567308 1680157 1415384 1463491 1569396 1703838 1560489
13893A560489J35877n3518J07767k06575j03721J3037J1112Q058j39288K16949
$$ 1560489 1696366 1642848 1750615 1544040 1440319 1453356 1464468 1472526 1333238 1550187
13883A550187n32412J57497J20523j4977k2490M02181n11918P8748O1551k2009
$$ 1550187 1017775 1175272 1295795 1280818 1258328 1660509 1148591 1227339 1288890 1266881
13873A266881J91501l7864k88286M13289l33600J95085j17382K61163J72502j87443
$$ 1266881 1458382 1420518 1132232 1545521 1211921 1407006 1289624 1550787 1723289 1535846
13863A535846l91484N0221J04980j18505Q3620K67192l09950m6149J05682m10398
$$ 1535846 1144362 1194583 1299563 1181058 1264678 1531870 1221920 1175771 1281453 871055
13853H71055K00204Q7238K25140k37529L6423j08760j23119L63357M1173N8651
$$ 871055 1071259 1158497 1383637 1146108 1182531 1073771 950652 1314009 1355182 1413833
13843A413833l65982J34710k20023J36774m82299O73166l93187n989M31936k31355
$$ 1413833 1047851 1182561 962538 1099312 617013 1290179 896992 891003 1322939 1091584
13833A091584R3925N4820k74442L69711m43524K90653J7907p0463j79847K28234
$$ 1091584 1185509 1240329 965887 1335598 892074 1182727 1200634 1130171 950324 1178558
13823A178558q5249J95445n22882J79797N4584J62898q3719k48536m7599L02101
$$ 1178558 1093309 1288754 765872 945669 1000253 1163151 1079432 830896 783297 1085398
13813A085398j3130o6097J60512k02557J38503j66361k60682L12893k01675J16734
$$ 1085398 1072268 1006171 1166683 964126 1102629 936268 675586 988479 786804 903538
13803I03538K86550j48625q2894m6950j07918k7123M4856M7288l303q4516j19413
$$ 903538 1190088 1041463 958569 911619 803701 776578 821434 868722 865419 780903 661490
13792F61490R4236R5107o3424Q5406J02820k39349Q839K63530k95640J99403j40549
$$ 661490 755726 850833 787409 872815 975635 736286 745125 1008655 713015 912418 771869
13781G71869K77349j73795k00990K93441l68724K75070p4550L8131J31559k4131
$$ 771869 1049218 875423 674433 967874 599150 874220 799670 837801 969360 945229
13771I45229p3583N9279n2486J38072D93635j9762K68816O9125r2374j91484K57783
$$ 945229 871646 930925 878439 1016511 493635 473873 742689 811814 719440 527956 785739
13760G85739O1166K05062l11500n8738m8674k6240L65589l22800J34218j39736
$$ 785739 846905 1051967 740467 681729 633055 606815 972404 649604 783822 644086
13750F44086L10755k94203Q5455M1740j10520Q5685l72827L52186j29150o9783
$$ 644086 954841 660638 746093 787833 677313 762998 390171 742357 613207 543424
13740E43424K84570p7967j25235m6347J94482j26548J9595o8264L7452L8171k47537
$$ 543424 827994 750027 624792 578445 772927 646379 665974 597710 635162 673333 425796
13729D25796r259J20152J28871P7116j0499k33046N9330J85168n2776l056n2649
$$ 425796 416537 536689 665560 742676 732177 499131 558461 743629 690853 687797 635148
13718F35148K05684k77379J38312K18026j53359M9222r1057J83871j70105j08331
$$ 635148 840832 563453 701765 919791 766432 815654 724597 908468 738363 630032
13708F30032m3939B59370K43579J23970j28751n0597N03450j20454k70641j1445
$$ 630032 586093 259370 502949 626919 498168 447571 951021 830567 559926 548481
13698E48481n6380M01308m24062j05922L53079j72943K7672M20492k93706m1876
$$ 548481 492101 893409 469347 363425 716504 543561 571233 991725 698019 656143
13688F56143O3717k66041M52383m38297j03480K04094n7813k4605j48787M94298
$$ 656143 719860 453819 906202 467905 364425 568519 510706 486101 337314 831612
13678H31612k05846M8286B64458L98997B31264K46142n6887N3216K50641J05429
$$ 831612 625766 674052 264458 663455 231264 477406 420519 473735 724376 829805
13668H29805j28200B87139K49099j12592L85677l61413J26455j80599K25533j18707
$$ 829805 701605 287139 536238 423646 809323 447910 574365 393766 619299 500592
13658E00592o1161P5484n9610M23713D06685L3931K26399p5414J35670B75238
$$ 500592 439431 514915 455305 879018 406685 440616 667015 591601 727271 275238
13647C80365J17937o7596l5781M61570l33750n5639p8858L28520A20405M47940
$$ 380365 498302 430706 394925 856495 522745 467106 388248 716768 120405 568345
13637E68345K11675k22366P704k72737L62699n7814J20908j05067k83497q6762
$$ 568345 780020 557654 565358 292621 655320 597506 718414 613347 329850 243088
13627B43088Q1931J6699J28107Q5929l6390j46432L6177L1351j11160P8891L08765
$$ 243088 325019 341718 469825 555754 519364 372932 409109 440460 329300 408191 716956
13616G16956j42243B00465L09906K97253C80217Q6860k9437j76m3036q2122K12065
$$ 716956 574713 200465 510371 807624 380217 467077 437640 437464 394428 312306 524371
13605E24371N5320r1304j40534J22517L98183C53898J22509o9393J24955J7219
$$ 524371 579691 488387 347853 470370 868553 353898 476407 407014 531969 549188
13595E49188p6549j26273K17816R6418k62776L2985j16467K42121j55516l874
$$ 549188 472639 346366 564182 660600 397824 430809 314342 556463 400947 397073
13585C97073M25135l94477A86174J23305K66207B53689K82849n2981r3966K20638
$$ 397073 822208 427731 186174 309479 575686 253689 536538 483557 389591 610229
13575F10229j67062j65479L3377C330b55441E13520j84925L3442o5592k9980J14209
$$ 610229 443167 277688 311065 3330 -255441 513520 328595 362037 296445 266465 380674
13564C80674q357Q3407J98225l15639j07467K37773J39698B51464m5702K62608
$$ 380674 372317 455724 653949 338310 230843 468616 608314 251464 205762 468370
13554D68370j39533q3326K00742p7420j39214K19422K43953l12132A29955L12527
$$ 468370 328837 245511 446253 368833 229619 449041 692994 380862 129955 442482
13544D42482p1033j22549J78148K25624k82765J49761k895j45202L603P6313d4876
$$ 442482 371449 248900 427048 652672 369907 519668 516773 371571 375174 451487 -44876
13532E18455H678K00958L52763A0901M82208J2662r3424c7693G61264A42197R2502
$$ 518455 8678 209636 562399 10901 493109 505771 412347 -37693 761264 142197 234699
13521B34699L26039A72747J00249J16376j04882j17093J99200n9094A14914K09690
$$ 234699 560738 172747 272996 389372 284490 167397 366597 307503 114914 324604
13511C24604Q44N6873K8563p4253k9747L47717k53239q1416K91585j87329A57094
$$ 324604 325448 382321 410884 336631 306884 654601 401362 319946 611531 424202 157094
13499C30777j42391N99081l61333r5451J6247K4789A10722M00760G8690M25814
$$ 330777 188386 787467 426134 330683 346930 371719 110722 511482 78690 504504
13489E04504k05726i0456C62296B3056K33647l0900m9567K45819A71038J63628
$$ 504504 298778 -90456 362296 23056 256703 225803 176236 422055 171038 334666
13479C34666N7190J86445A49702L70900B15140L25165n9883j85300O9614G8586
$$ 334666 391856 578301 149702 520602 215140 540305 480422 295122 364736 78586
13468A60567J77397j02807R4478J16988k20895K17089A99330J09252R2620j7416
$$ 160567 337964 235157 329635 446623 225728 442817 199330 308582 401202 383786
13458C83786o4537G2453p428J66235K6870n2810J51201A68733K52925j6361A63094
$$ 383786 319249 72453 65025 231260 258130 205320 356521 168733 421658 405297 163094
13446A35233L99060A68419O154J63093I6409L31454k8400j63154J9122J964N6945
$$ 135233 534293 168419 174573 337666 96409 427863 399463 236309 255431 257395 314340
13435C14340K4155a49709B21449j639L17432A67444K32080J0849E3837L73606
$$ 314340 338495 -149709 221449 219810 537242 167444 399524 410373 53837 427443
13425D27443A66537n9570n3372J42308Q1497A38290M39350k86344o390J24185
$$ 427443 166537 106967 53595 195903 277400 138290 577640 291296 284906 409091
13415D09091a57002A45303J44386j28315p3309a50574B10371m6718F1851K91273
$$ 409091 -157002 145303 289689 161374 88065 -150574 210371 163653 61851 353124
13405C53124A55516M7367P6371k594A06161l0337R5504C9188h6799C66407j74766
$$ 353124 155516 202883 279254 276660 106161 75824 171328 39188 -86799 366407 191641
13394A91641n1779J46463A28361N00239A46914J77437q0299n5061K37905q9301
$$ 191641 139862 286325 128361 628600 146914 324351 244052 188991 426896 337595
13384C37595k0057R467N6069A54959a01654C11298R2975m6373j73193N2511b8435
$$ 337595 317538 327005 383074 154959 -101654 311298 404273 357900 184707 237218 -28435
13372A24610n8461J45115J75768a44932H4221L70888j93362m6334M3765P5255
$$ 124610 66149 211264 387032 -144932 84221 455109 261747 215413 259178 334433
13362C34433Q0902p9827j3517n2434O4650j10804J84629e2399A66693J12990R5094
$$ 334433 415335 335508 321991 269557 334207 223403 408032 -52399 166693 279683 374777
13351C74777j79323K10568R020B05938K44945j72414J16134j10468M7278r8194
$$ 374777 195454 406022 415042 205938 450883 278469 394603 284135 331413 233219
13341B33219J79532a82979A58672J31148l7928J8025A33692o283L28834j56675
$$ 233219 412751 -182979 158672 289820 251892 269917 133692 127409 456243 299568
13331B99568p2550J90188R1837B31369M5805P30P0551J49100n7847p1301j77530
$$ 299568 227018 417206 509043 231369 277174 277904 348455 497555 439708 368407 190877
13320A90877M0961J42515N4096j9553A31908L988E7289K3286j3183L387l0883
$$ 190877 231838 374353 428449 408896 131908 135896 57289 80575 67392 70779 39896
13309C9896L77420g3617D05018j9960A85369j5403J86830J43269B1546K42285
$$ 39896 417316 -73617 405018 385058 185369 169966 356796 500065 21546 263831
13299B63831K54720E1527j6205H675L62219q3124B1845P0304J35896A12929d5320
$$ 263831 518551 51527 35322 8675 370894 287770 21845 92149 228045 112929 -45320
13287F1197h7456A12002J30591M9719A06334J371d3456A28753a16635A46526A9412
$$ 61197 -87456 112002 242593 292312 106334 107705 -43456 128753 -116635 146526 19412
13275c5520J7109k5448b1063A62509p8162L23159d5396A62908p014l79Q1416j02003
$$ -35520 -18411 -43859 -21063 162509 84347 407506 -45396 162908 155894 155515 236931 134928
13263A34928J76900A36003k1622L66935A65339p919F6847L5122M872M69808A44647
$$ 134928 311828 136003 114381 481316 165339 157420 66847 101969 106841 576649 144647
13251D01491p1099d8746A25877O4411L25476B15302b5134A14367b352B57344A20126
$$ 401491 330392 -48746 125877 190288 515764 215302 -25134 114367 -2352 257344 120126
13239b1604D6215k0781K58465I2809O8628n596J77714l532A55737D8490b99606
$$ -21604 46215 25434 283899 92809 161437 155841 333555 330023 155737 48490 -299606
13227a14016A65913R4336M5660j06960L42831I6281n540A5823a08567A00195J50931
$$ -114016 165913 260249 305909 198949 541780 96281 90741 15823 -108567 100195 251126
13216B51126b6117C13458m3048N1748m1742D5821J7733b906C28431F8104g7122
$$ 251126 -26117 313458 270410 322158 280416 45821 63554 -2906 328431 68104 -77122
13204B25550D4956k896b6400A21324J97257d3607D50457k21729G8905C6053a57768
$$ 225550 44956 42060 -26400 121324 318581 -43607 450457 228728 78905 36053 -157768
13192A66362I339P1480C4633O9362j2469R8088E3488L16436F5495K48032a3820
$$ 166362 9339 80819 34633 103995 91526 189614 53488 369924 65495 313527 -13820
13180a96903g6568B71211J44611a72263I9364j0849J71384H8506a8750q6924B43557
$$ -196903 -76568 271211 415822 -172263 99364 88515 259899 88506 -18750 -105674 243557
13168a57936C02130G2213e143B71273F4135K60212A50174J6048A2956K43714E075
$$ -157936 302130 72213 -5143 271273 64135 324347 150174 166222 12956 256670 5075
13156C3076A3665L20849a3060j69412A99768J13880B8645J23932g5906A97420
$$ 33076 13665 334514 -13060 -182472 199768 313648 28645 152577 -75906 197420
13145C82395b2552A95458G6229N6749J7188n1243j3480R7419N3376a98803B4627
$$ 382395 -22552 195458 76229 132978 150166 98923 85443 182862 236238 -198803 24627
13133B52372H1625M61192i2044A95414O6921A01678a4101A05516J21315C063K39166
$$ 252372 81625 542817 -92044 195414 262335 101678 -14101 105516 226831 3063 242229
13122B42229j20794b5467A3170K2701K14871G5890K44241K9532p8060a68429A08667
$$ 242229 121435 -25467 13170 35871 250742 75890 320131 349663 271603 -168429 108667
13110I9933d7279A60774N8538I4749Q9179a44900B75823j31834A0535a57548f118
$$ 99933 -47279 160774 219312 94749 183928 -144900 275823 143989 10535 -157548 -6118
13098A20602M727E8163i7434C0105K38915j21635o3945a70731C93163A82547J62274
$$ 120602 125329 58163 -97434 30105 269020 147385 83440 -170731 393163 182547 344821
13087C44821H3636d5424A78089J5103i5616D0897d1601E905K09082a90661C35995
$$ 344821 83636 -45424 178089 193192 -95616 40897 -41601 5905 214987 -190661 335995
13075A23505a27129A37650a3286n1937F419c83977h5034k58210H6846N5925E1777
$$ 123505 -127129 137650 -13286 -65223 6419 -383977 -85034 -343244 86846 142771 51777
13063D5656j9492b6670C35611a09789d8027B56855L8204j00362R1950b0603D34363
$$ 45656 26164 -26670 335611 -109789 -48027 256855 295059 194697 286647 -20603 434363
13051B22687Q6336Q186b45480A31332M0537F9688b00741B63530A25073a53245
$$ 222687 309023 317209 -245480 131332 171869 69688 -200741 263530 125073 -153245
13040B40835m1804a4623B22535n9895o2517K01256G168K80871j34782n9132J61071
$$ 240835 199031 -14623 222535 162640 100123 301379 7168 288039 153257 94125 255196
13029B55196g5071q7863B8482a38481A23397e3053A40865F8508J76577A0303L86425
$$ 255196 -75071 -162934 28482 -138481 123397 -53053 140865 68508 245085 10303 396728
13018C96728h0686B76910m5797D9016B3873c3378B48758k8714J68037j46033d2087
$$ 396728 -80686 276910 231113 49016 23873 -33378 248758 220044 388081 242048 -42087
13006a96525I6401J39664b23530C25158J78980C2313J64255Q8325j37339L42722
$$ -196525 96401 236065 -223530 325158 504138 32313 196568 284893 147554 490276
12996D90276B04013f9764C73289B2159N388K09431F8755L104J9368G00J19159
$$ 490276 204013 -69764 373289 22159 27547 236978 68755 71859 91227 700 119859
12985A19859B1993c57011A31049R2612J10967A17610E7761J01220J39408b8001
$$ 119859 21993 -357011 131049 223661 334628 117610 57761 158981 298389 -28001
12974B82865A39477F9204b08737C41606g2787A93936O2158r5014L58359a26793
$$ 282865 139477 69204 -208737 341606 -72787 193936 256094 161080 519439 -126793
12963b22437C22904D5986a15170A1723a78741A62209a00688G9047i6208C8093
$$ -222437 322904 45986 -115170 11723 -178741 162209 -100688 79047 -96208 38093
12952D0529j1534K71102H1610e8253j7017k10176C06662c3743j77154A08519j9488
$$ 40529 28995 300097 81610 -58253 -75270 -285446 306662 -33743 -210897 108519 89031
12941H9031b7284q7828G856L84129i4935l752M6900j5399A34052J11051a72087
$$ 89031 -27284 -115112 7856 391985 -94935 -98687 -51787 -67186 134052 245103 -172087
12929G7107b80337C16798E1852O9764E7935J51883O258J3766m6857H8643B5565
$$ 77107 -280337 316798 51852 121616 57935 209818 216076 229842 182985 88643 25565
12917c8537j48768A5470K39814a27457D0359R4004J03203A06703d6515l48127
$$ -38537 -187305 15470 255284 -127457 40359 134363 237566 106703 -46515 -394642
12907c94642A21318J31444A5601a36467B96080c35661F6966g2689j4623q7266
$$ -394642 121318 252762 15601 -136467 296080 -335661 66966 -72689 -87312 -174578
12897a74578N0831B41298H9989K93014e6111o3502A32241K50038a03683K7352
$$ -174578 -123747 241298 89989 383003 -56111 -119613 132241 382279 -103683 -76331
12887g6331B3965K11166D9126J45079R6720a4008q2088A43158R7368r4866a58108
$$ -76331 23965 235131 49126 194205 290925 -14008 -96096 143158 240526 145660 -158108
12875B71525A32553C0079a44375e2887A56052J13051A1821N7132J12774h8304
$$ 271525 132553 30079 -144375 -52887 156052 269103 11821 68953 181727 -88304
12864F8800M2052a32866k5023e2051C13163E5258J06540f9451A47205D5618P1635
$$ 68800 110852 -132866 -157889 -52051 313163 55258 161798 -69451 147205 45618 117253
12853A17253K5384J73673b48583A18479J87474j18262q8621B1078a5568C04910
$$ 117253 142637 316310 -248583 118479 305953 187691 99070 21078 -15568 304910
12842A75899q3716J1246B8911f6299q3135A2983J55832f8784j1425A83126c045
$$ 175899 92183 103429 28911 -66299 -149434 12983 168815 -68784 -80209 183126 -3045
12830A18081L4342h0779A28210K16932b32883H4859a23380J6335A45401E9625
$$ 118081 152423 -80779 128210 345142 -232883 84859 -123380 -107045 145401 59625
12819B39696a4075A926J4453L25601A0894L9342J720e929l6890G6059f3723C73606
$$ 239696 -14075 1926 16379 341980 10894 50236 51956 -5929 -42819 76059 -63723 373606
12806A72720e2823I6799m1282L108Q2225O9500G9307e814A32685k2799c506B1380
$$ 172720 -52823 96799 55517 58625 140850 210350 79307 -5814 132685 109886 -3506 21380
12793g6340r1461k19607A14734D9460c3434k3346D6294d8668A13629c3590p7632
$$ -76340 -167801 -387408 114734 49460 -33434 -56780 46294 -48668 113629 -33590 -111222
12782a11222o351C06921j37730N0928j04397d92624a99776d1039a7415F30J62318
$$ -111222 -117573 306921 169191 220119 115722 -492624 -199776 -41039 -17415 630 162948
12771A62948b18228d9357A19710q485b05646E8691O3135l1124k6263J20541E4880
$$ 162948 -218228 -49357 119710 111225 -205646 58691 121826 90702 64439 184980 54880
12759g5785C07995C0507J27755b06257A50056C6649J01963b9198F3674q692c0312
$$ -75785 307995 30507 158262 -206257 150056 36649 138612 -29198 63674 54982 -30312
12747A33876B817a13721p1730B8439J79964a08099B33748b56547G4536k8090a58831
$$ 133876 2817 -113721 -185451 28439 208403 -108099 233748 -256547 74536 46446 -158831
12735A45537L43386H7481n811g2938E9190J49044l2179D859N3651B896J64119
$$ 145537 488923 87481 81670 -72938 59190 208234 176055 4859 58510 2896 167015
12724A67015q2360a99508B70564J4348j37120E2559K43239A23486J26382H2053
$$ 167015 84655 -199508 270564 284912 147792 52559 295798 123486 249868 82053
12713H8464h2547J4995j07678e1545A31983O1348n2154a66277f0043q466D1904
$$ 88464 -82547 -67552 -175230 -51545 131983 193331 141177 -166277 -60043 -68509 41904
12701b55820N2601D86884B32021p2881o7483Q2572D116a06748I8177a24145B18532
$$ -255820 -203219 486884 232021 159140 91657 174229 4116 -106748 98177 -124145 218532
12689B89008O0650a03067b3489C05611j19614r2829J60730J2897q5991K9440a79731
$$ 289008 349658 -103067 -23489 305611 185997 93168 253898 266795 180804 210244 -179731
12677b09126e7418G196P2720a53567k98031c8200I0628h2545A70092J93216j31597
$$ -209126 -57418 7196 79916 -153567 -451598 -38200 90628 -82545 170092 363308 231711
12666B31711H6799J64277Q7663D9563c68951C51646c5727j26892A49635K11485
$$ 231711 86799 251076 338739 49563 -368951 351646 -35727 -162619 149635 361120
12656C61120h3078A78411a46132I2993a39457K6573B66191D4018M2777B2145J50618
$$ 361120 -83078 178411 -146132 92993 -139457 -112884 266191 44018 86795 22145 172763
12645A72763f1215A4313J36584P7457P027B4662k898K5503j6306a5462A60620
$$ 172763 -61215 14313 150897 228354 235381 24662 21764 47267 30961 -15462 160620
12633C73326D1683a44381b1395B14602k4029b21909i774B81302o9783Q700J76920
$$ 373326 41683 -144381 -21395 214602 190573 -221909 -9774 281302 211519 220219 397139
12622C97139a65148P1539m8394O9914B6435L46820C6845R1720n2321J47137K1152
$$ 397139 -165148 -93609 -142003 -72089 26435 373255 36845 128565 76244 223381 244533
12611B44533a03715B74414D8776L81284A49437m5307K61456A75016o0946K22312
$$ 244533 -103715 274414 48776 430060 149437 104130 365586 175016 114070 336382
12601C36382J30126D3233i2012M1102A77526J26980r7017F9916b17747A47962
$$ 336382 466508 43233 -92012 -50910 177526 304506 207489 69916 -217747 147962
12590a20563a8178C8674J94639g6245m9190B43349l0614P5111j41562M2749i0984
$$ -120563 -18178 38674 233313 -76245 -125435 243349 212735 287846 146284 189033 -90984
12578C5494a31202A82958H6879R3487H2868a38763B35871A16813a1188B48120
$$ 35494 -131202 182958 86879 180366 82868 -138763 235871 116813 -11188 248120
12567b9733B37492j03786a50263G5351f8412A08998J71538D0265J78326M4507
$$ -29733 237492 133706 -150263 75351 -68412 108998 280536 40265 218591 263098
12557B63098F5660R7337e609j11628j40893C15624H2044K16851h7053r823G7177
$$ 263098 65660 162997 -5609 -117237 -258130 315624 82044 298895 -87053 -96876 77177
12545C89147a08522d3362J9712A70863c26332C6911a17860D7468K4912C4253b59658
$$ 389147 -108522 -43362 -23650 170863 -326332 36911 -117860 47468 72380 34253 -259658
12533F3535a10801j43581D43989c00960A46435a71509C45606h7769A14534a51850
$$ 63535 -110801 -254382 443989 -300960 146435 -171509 345606 -87769 114534 -151850
12522A37741c81C2186K1361b37358B49985a49818H9672a75321D9492a6197j8025
$$ 137741 -381 32186 53547 -237358 249985 -149818 89672 -175321 49492 -16197 -34222
12511c4222A51627G560K77819a98069N4700B16883o3374b51893D4180a32531N4188
$$ -34222 151627 7560 285379 -198069 -143369 216883 153509 -251893 44180 -132531 -78343
12500g8343C53039D0447L9563N7868h9568G8590N8230a59328B88176A3529R266
$$ -78343 353039 40447 80010 137878 -89568 78590 136820 -159328 288176 13529 22795
12489B2795b97248B07109l0690l1554R899i2147B66945j28131f0898A0087L66270
$$ 22795 -297248 207109 176419 144865 154764 -92147 266945 138814 -60898 10087 376357
12478C76357j42001J7337b8258F3459K4214N7712J10589c10952A2211e8343G3225
$$ 376357 234356 251693 -28258 63459 87673 145385 255974 -310952 12211 -58343 73225
12466a84751O1379J0987b2648A96503a93972r429f7177l7878j82616c530F4975
$$ -184751 -123372 -112385 -22648 196503 -193972 -203401 -67177 -105055 -287671 -3530 64975
12454A31533c1229k71473a35054B12918G836J50520i4921j5625D429K67326B9752
$$ 131533 -31229 -302702 -135054 212918 7836 158356 -94921 -110546 4429 271755 29752
12442E7147a3970B77298e3407m1186L6379A56372l5245K21242b23868F3521f9783
$$ 57147 -13970 277298 -53407 -94593 -58214 156372 121127 342369 -223868 63521 -69783
12430a93536A65911B0772b40065A79090k59a79706A10764b68719g2226A64446
$$ -193536 165911 20772 -240065 179090 178831 -179706 110764 -268719 -72226 164446
12419a27066B81753a07203G668K15026J25180a21269n5615A592h7122C5250b31044
$$ -127066 281753 -107203 7668 222694 347874 -121269 -176884 1592 -87122 35250 -231044
12407b4936k4354E966K40977a5043j87810P2245j50653G8442c37750L9028F664
$$ -24936 -49290 5966 246943 -15043 -202853 -130608 -281261 78442 -337750 -298722 6664
12395b36657A21008b00155A71953a2486I0954M4613f7038A16860C4406h7919A4528
$$ -236657 121008 -200155 171953 -12486 90954 135567 -67038 116860 34406 -87919 14528
12383b21282B68893h8136B95807a19583k39942a35354B33449n9951a79670C9501
$$ -221282 268893 -88136 295807 -119583 -359525 -135354 233449 173498 -179670 39501
12372a96978p0854A74281G7242a62374q8096B1214K10142F9209K304L18744j67122
$$ -196978 -267832 174281 77242 -162374 -250470 21214 231356 69209 71513 390257 223135
12361B23135j09167j1866b05330B2574a17893A84261a85612j9871A11635P7393
$$ 223135 113968 102102 -205330 22574 -117893 184261 -185612 -205483 111635 189028
12351A89028E1187a19262K2126A65769J52222E3451K20630A25213e20205B57115
$$ 189028 51187 -119262 -97136 165769 317991 53451 274081 125213 -520205 257115
12340a52164E6813q995J67579D3798c8262A96496L15205i5025A82341i6899D066
$$ -152164 56813 47818 215397 43798 -38262 196496 511701 -95025 182341 -96899 4066
12328D08861A07669d0668r6007A40893h7294A35488i4672j34933B90838b24151
$$ 408861 107669 -40668 -136675 140893 -87294 135488 -94672 -229605 290838 -224151
12317A00913C4942K7708b68133J28377G0385a62141M8306G16c3409m3891H5348
$$ 100913 34942 62650 -268133 -139756 70385 -162141 -113835 716 -33409 -77300 85348
12305e7448G2657k8346e0626E9118b22468d3052C1949a49303A03014b55838C843
$$ -57448 72657 44311 -50626 59118 -222468 -43052 31949 -149303 103014 -255838 3843
12293b01511M1180n9805d9690K1391A51833J31081b41708a2596B38087a89244
$$ -201511 -160331 -220136 -49690 -28299 151833 282914 -241708 -12596 238087 -189244
12282a47947P1595E205P1816i6015A39514J51155c2167B55310a27559C19749e3960
$$ -147947 -76352 5205 77021 -96015 139514 290669 -32167 255310 -127559 319749 -53960
12270a06280A76823b51453i3760A99659F8876r21P7469b11468B34450G491J76560
$$ -106280 176823 -251453 -93760 199659 68876 67955 145424 -211468 234450 7491 184051
12259A84051K0483o2752i1861A37622K21199b4378E6700b62470h0478b6947C45590
$$ 184051 204534 141782 -91861 137622 358821 -24378 56700 -262470 -80478 -26947 345590
12247F2839a96700A5474K2947M5841R5571D7468N9399J65572c2753D5536J70951
$$ 62839 -196700 15474 38421 84262 179833 47468 106867 272439 -32753 45536 216487
12236B16487a32819C63355F7017J24050b3150B5249Q1435J94141F1711a39869
$$ 216487 -132819 363355 67017 191067 -23150 25249 106684 300825 61711 -139869
12225a20848A88359Q8046j23092f9827A03646e9620k5210b423k6939C8998K50880
$$ -120848 188359 276405 153313 -69827 103646 -59620 -84830 -2423 -29362 38998 289878
12214B89878c1024A03184J3627a64273A51272J53281K49554B48641k214j3223
$$ 289878 -31024 103184 116811 -164273 151272 304553 554107 248641 246427 233204
12204B33204L16596B21611J50815J08669A72712H2777b9602D71551j66856E2914
$$ 233204 549800 221611 372426 481095 172712 82777 -29602 471551 304695 52914
12193A44813l8871a29240L8165B78268D0648P4908J33273A00997N0556J97254
$$ 144813 105942 -129240 -91075 278268 40648 115556 248829 100997 151553 348807
12183C48807m5314d0734C40096q3761q5285c0870B41389J68182o8412J74817B43226
$$ 348807 303493 -40734 340096 256335 171050 -30870 241389 409571 341159 515976 243226
12171C48891r6368B3207K95711E3201K90648j46024Q6610n4255b2811B28310p8052
$$ 348891 252523 23207 318918 53201 343849 197825 284435 230180 -22811 228310 150258
12160A50258b1147H406N02276a8356A51085g3115C04657r6582g7468b0265a649
$$ 150258 -21147 8406 510682 -18356 151085 -73115 304657 208075 -77468 -20265 -1649
12148I760J90780r2863n2728J00615B7166J80494o3274E497O7362b6377A24560
$$ 9760 200540 107677 54949 155564 27166 207660 144386 5497 72859 -26377 124560
12136A4097K34034e5528A85479r1203J5353i4129A18259M53050k44115M217F4965
$$ 14097 248131 -55528 185479 94276 109629 -94129 118259 571309 327194 331411 64965
12124A06000J83262a00227A78R7141d6528J8093A64738e7668F5622a72440A0329
$$ 106000 289262 -100227 178 97319 -46528 -28435 164738 -57668 65622 -172440 10329
12112B25805a06923B35722F9281k5439J96794N3509h779H9884e005G1712J63064
$$ 225805 -106923 235722 69281 43842 240636 294145 -8779 89884 -5005 71712 234776
12101B34776H2430b8485j42112j31486a4261j71185D13109G6546j282C5259O4650
$$ 234776 82430 -28485 -170597 -302083 -14261 -185446 413109 76546 75264 35259 99909
12090I9909L5798c19126A07135c5281a5118n8464L6329q7907B51259j04956R1769
$$ 99909 135707 -319126 107135 -35281 -15118 -73582 -37253 -125160 251259 146303 238072
12079B38072D5334k1767K12905E014a13716k21363A02399g3453b4985m7252F6691
$$ 238072 45334 23567 236472 5014 -113716 -335079 102399 -73453 -24985 -72237 66691
12067C02376b72608R463D46213A57691J83033N87714Q7958m63138L9694i4960
$$ 302376 -272608 -263145 446213 157691 340724 928438 1016396 553258 592952 -94960
12056A33529J93834A52219g9360C0289J04840P1772a17318G0415P8804J98895
$$ 133529 327363 152219 -79360 30289 135129 206901 -117318 70415 149219 348114
12046C48114a41791B66684p950a87356I576c02052e0741H9374I579M3495J16350
$$ 348114 -141791 266684 258734 -187356 9576 -302052 -50741 89374 9579 53074 169424
12035A69424E5302A016K60861E225a55245D5891a08980A23728d0848k27536R9393
$$ 169424 55302 1016 261877 5225 -155245 45891 -108980 123728 -40848 -268384 -168991
12024a68991I3816E638M7235A3935Q1816J73184d49264b07663B06331g3288C59365
$$ -168991 93816 5638 52873 13935 95751 268935 -449264 -207663 206331 -73288 359365
12012B19369g5081G7426M2329Q8647h7960A97642b36726f4299A10004b23125a7133
$$ 219369 -75081 77426 119755 208402 -87960 197642 -236726 -64299 110004 -223125 -17133
12000A0456a54098H5268f8205i622G2240B6983d12278B35991H3796B325K01324
$$ 10456 -154098 85268 -68205 -9622 72240 26983 -412278 235991 83796 2325 203649
11989B03649b6527E41465g298j37916B4881d11256e8047B43435a04330j05077
$$ 203649 -26527 541465 -7298 -145214 24881 -411256 -58047 243435 -104330 -209407
11979b09407a1619j33059F5113f9499F2327c17264J06895f1845j33258G4157J69646
$$ -209407 -11619 -144678 65113 -69499 62327 -317264 -210369 -61845 -195103 74157 243803
11968B43803c25547R8916j33786H3456a36391k5361A31178C1431c40080A6946
$$ 243803 -325547 -226631 -360417 83456 -136391 -161752 131178 31431 -340080 16946
11957i6072A24983c0578A8533a18297K7374k7708Q07K3027A25364G960b11533
$$ -96072 124983 -30578 18533 -118297 -90923 -118631 -117824 -94797 125364 7960 -211533
11945f7830A9380a7544j28525A0356c8423j60332N0166D1520P1112d8500r1443
$$ -67830 19380 -17544 -146069 10356 -38423 -198755 -148589 41520 112632 -48500 -139943
11934a39943b7515j68709i0044L9838m7775n2389j72377a60707k53291A68284
$$ -139943 -27515 -196224 -90044 -50206 -97981 -150370 -322747 -160707 -413998 168284
11923E138K28389c01919A34071o5928J30045h5228A82055b28656G7444e7811A96997
$$ 5138 233527 -301919 134071 68143 198188 -85228 182055 -228656 77444 -57811 196997
11911a3605B5062n847b10800H4893L3976l5302P652f8472E889J5351a76687I1783
$$ -13605 25062 19215 -210800 84893 118869 83567 91219 -68472 5889 21240 -176687 91783
11898A15831e1047n175n1015A00737J48769b00056e6258A23513O3618d18387C6342
$$ 115831 -51047 -56222 -107237 100737 249506 -200056 -56258 123513 187131 -418387 36342
11886f0784m7083j01691B24148a77791G6468J16111o5309N1129c01423A05101
$$ -60784 -107867 -209558 224148 -177791 76468 192579 127270 178399 -301423 105101
11875f5208D5389h0152q0183B61205b42252A5512J9947b0037A2835b43641j2588
$$ -65208 45389 -80152 -160335 261205 -242252 15512 35459 -20037 12835 -243641 -256229
11864b56229P1140A3674l067b30699B56589b53038d3755k08302Q5883A5177a62464
$$ -256229 -185089 13674 10607 -230699 256589 -253038 -43755 -252057 -166174 15177 -162464
11852a08839E339K41544C8850m258J61114e2409A5835b00638N9735O7805e750
$$ -108839 5339 246883 38850 34592 195706 -52409 15835 -200638 -140903 -73098 -5750
11840I5115g7064n8291I4377g6654j03503d0436k78721a04991c9306p8861r4680
$$ 95115 -77064 -135355 94377 -76654 -180157 -40436 -319157 -104991 -39306 -118167 -212847
11829b12847k46498D3429B0263J26243a20036b028A5128P5096d116o5426J6590
$$ -212847 -459345 43429 20263 146506 -120036 -2028 15128 90224 -4116 -69542 -52952
11818e2952B31050b15666H328a1267r0067b7466j48738f4118F7624l0552g3403
$$ -52952 231050 -215666 8328 -11267 -101334 -27466 -176204 -64118 67624 37072 -73403
11806a57831j6533j60326B0266K79040r7319f3821A17883h2600j18193M5035k04945
$$ -157831 -174364 -334690 20266 299306 201987 -63821 117883 -82600 -200793 -155758 -360703
11795c60703J69069A63924j4233p4385a6004p8803k00153d6870B54316p153b91937
$$ -360703 -191634 163924 149691 75306 -16004 -94807 -294960 -46870 254316 247163 -291937
11783f4253k5273A18020a37259d8595j52540A15810d9434j32375K572A10366J69804
$$ -64253 -89526 118020 -137259 -48595 -201135 115810 -49434 -181809 -179237 110366 280170
11772B80170b58340m5774A36354M3713q3599Q0072G7143Q4113a413k31956B24861
$$ 280170 -258340 -304114 136354 180067 96468 176540 77143 161256 -1413 -233369 224861
11760b26845d5761j30390B03611C6159a50619n1320h6016A56907b98619R0078
$$ -226845 -45761 -176151 203611 36159 -150619 -201939 -86016 156907 -298619 -208541
11750b08541C4143c7683E3594L32994j80920j5128O6720o688p7928g6559I1667
$$ -208541 34143 -37683 53594 386588 205668 190540 257260 250572 172644 -76559 91667
11738C3094K5518e6029k22457L5883a6262A57103g2936C19795A5556Q4460b40384
$$ 33094 58612 -56029 -278486 -242603 -16262 157103 -72936 319795 15556 100016 -240384
11726h3755B30534D07J4183J83811H3567j350J65292D2163N4572A4525a28096
$$ -83755 230534 407 14590 198401 83567 82217 247509 42163 96735 14525 -128096
11714a74418g1418J52p631k1960A3302a91498f3891E4341j0112J2110a73150e8581
$$ -174418 -71418 -71266 -78897 -100857 13302 -191498 -63891 54341 44229 56339 -173150 -58581
11701b50611K5802A73933i6406m0495g210H6422J11033k7513a10787G8435J72635
$$ -250611 -224809 173933 -96406 -136901 -7210 86422 197455 169942 -110787 78435 251070
11690B51070b23781A21714K99585A06582A8201J37903D0653P0247J18264B09a11690
$$ 251070 -223781 121714 421299 106582 18201 156104 40653 110900 229164 209 -111690
11678A62685a84043P2505A31856f629j75057C88590G5671K59851B929a49977D2171
$$ 162685 -184043 -111538 131856 -6629 -181686 388590 75671 335522 2929 -149977 42171
11666a79565P1469a4155j38393A21602K73005a245C46977C3232a84020D3222g1317
$$ -179565 -108096 -14155 -152548 121602 394607 -1245 346977 33232 -184020 43222 -71317
11654B77704Q5772b46218E11124a75562b5949j12981C1194b70810B86378f0517
$$ 277704 363476 -246218 511124 -175562 -25949 -138930 31194 -270810 286378 -60517
11643A26390h847G1817a89395B89950E533a19850A75789i4859D7545P4467M2963
$$ 126390 -8847 71817 -189395 289950 5533 -119850 175789 -94859 47545 122012 164975
11632A64975q0636b48260c195E7866K41192a09475b2687K334l91787R1758A33603
$$ 164975 84339 -248260 -3195 57866 299058 -109475 -22687 -20353 -412140 -320382 133603
11620E6311a09597j10513A01117J2582H867G71O1682b36135G9315b49967b4821
$$ 56311 -109597 -220110 101117 113699 8867 771 62453 -236135 79315 -249967 -24821
11608B41227A6676g7361j03241M3371B42110B718J4377b9266A92999r5213a45742
$$ 241227 16676 -77361 -180602 -137231 242110 2718 17095 -29266 192999 97786 -145742
11596D15269I2624J91714b465A89642a5186A05127a94209f4089k68076h290H7765
$$ 415269 92624 284338 -2465 189642 -15186 105127 -194209 -64089 -332165 -8290 87765
11584E7635J3474e4321q1640D16991b78620a23184D2773L1305K58540G3768K7894
$$ 57635 71109 -54321 -135961 416991 -278620 -123184 42773 74078 332618 73768 101662
11573A01662b26036C75429A00867K45344b06157d6683B30048D8029a2121A03854
$$ 101662 -226036 375429 100867 346211 -206157 -46683 230048 48029 -12121 103854
11562B55013a0791J017A98197E4482h313j72201B73253N737B0227e2515A15100
$$ 255013 -10791 -9774 198197 54482 -8313 -180514 273253 278990 20227 -52515 115100
11550A28900i6080a4920m0544k5397D6808h8116r3705B39045a24484A12876g6090
$$ 128900 -96080 -14920 -55464 -80861 46808 -88116 -181821 239045 -124484 112876 -76090
11538b7709D11116c19210J17212J2192H0313b26973B49182a02472l23683A4656
$$ -27709 411116 -319210 -201998 -189806 80313 -226973 249182 -102472 -426155 14656
11527c9178A13543J4817J2095D0575J37987E0611M69555k34183a9397A85024c6190
$$ -39178 113543 128360 140455 40575 178562 50611 520166 285983 -19397 185024 -36190
11515A93904O7721b52776b771B82417d6610h502r5333B21816J52263j27255d4881
$$ 193904 261625 -252776 -2771 282417 -46610 -8502 -103835 221816 374079 246824 -44881
11503g3584p4750C00762K1353C3348J67148c1489o6224A26191N8040H5654K56296
$$ -73584 -148334 300762 322115 33348 200496 -31489 -97713 126191 184231 85654 341950
11492C41950N6425j98764J89405A0051c02948A28480j4603d7828A52927N7800
$$ 341950 398375 199611 389016 10051 -302948 128480 113877 -47828 152927 210727
11482B10727a04807b4970A95793F9876K12904r7441F0483K43267G6526L23584
$$ 210727 -104807 -24970 195793 69876 282780 185339 60483 303750 76526 400110
11472D00110j87995N9148K54619k06582e0395n2260A89390a37400A74804n3667
$$ 400110 212115 271263 525882 319300 -50395 -102655 189390 -137400 174804 121137
11462A21137K63941A39711J17208H5163L9618c4500A964M03962A35595c1494A33039
$$ 121137 385078 139711 256919 85163 124781 -34500 1964 405926 135595 -31494 133039
11450A57764D7691K15591j104Q3461A44801J16002m4011C7167j1632K06234I5972
$$ 157764 47691 263282 262178 345639 144801 260803 216792 37167 25535 231769 95972
11438B97501E9549b3163A58142d25184J99129C86856A71337G1296c8521B42952
$$ 297501 59549 -23163 158142 -425184 -226055 386856 171337 71296 -38521 242952
11427d8472I9798m2279K61075A40681d3280A33265f9480A66745g3473A46524a3970
$$ -48472 99798 57519 318594 140681 -43280 133265 -69480 166745 -73473 146524 -13970
11415H7861J99843a92115B4637J52189N6887g6913b9429k75056a0690A02200K5960
$$ 87861 287704 -192115 24637 176826 233713 -76913 -29429 -304485 -10690 102200 128160
11404A28160i4778o5362A48262b0064i588A83923D9485L59260i3928C2660J5003
$$ 128160 -94778 -160140 148262 -20064 -9588 183923 49485 408745 -93928 32660 47663
11393D7663N8463a41640L5790L4369j85226L2767a07120M0163C1347a8061k68620
$$ 47663 106126 -141640 -105850 -71481 -256707 -223940 -107120 -66957 31347 -18061 -286681
11382b86681J22032E57L67857B1744a26650b0187l4563A35273b60460A58995M7702
$$ -286681 -164649 557 368414 21744 -126650 -20187 -54750 135273 -260460 158995 206697
11371B06697b62911D2266c2335P138A29473a73715B70808n2208a93982h1326A96513
$$ 206697 -262911 42266 -32335 -25197 129473 -173715 270808 218600 -193982 -81326 196513
11359b14022d7826A54777n4003g683D5352b09088C0372K33427c09172A48699c9792
$$ -214022 -47826 154777 100774 -7683 45352 -209088 30372 263799 -309172 148699 -39792
11347A924K20046g4036C38875F8119c6959l0478D2303d1096B09075q3844e0679
$$ 1924 221970 -74036 338875 68119 -36959 -67437 42303 -41096 209075 125231 -50679
11335A08832J23960i5690K6290b5073C10928j47728b52331g9646j2193N495B41086
$$ 108832 232792 -95690 -69400 -25073 310928 163200 -252331 -79646 -91839 -86344 241086
11323c8917I3924b5480B0053a8984m0490j03110A13063g7670K8450B15992a42720
$$ -38917 93924 -25480 20053 -18984 -59474 -162584 113063 -77670 -49220 215992 -142720
11311a83097N8910j7291b5903A8143J29198g9074J2894L0569j4717C22283A08098
$$ -183097 -124187 -141478 -25903 18143 147341 -79074 -66180 -35611 -50328 322283 108098
11299b99842B81574e7618A41053O7390a54337a6084G0535a52733r809H0622b3313
$$ -299842 281574 -57618 141053 208443 -154337 -16084 70535 -152733 -162542 80622 -23313
11287c63409M865A67135n9538O9408h636B7955O926i5811r4007a1506j25899q640
$$ -363409 -358544 167135 107597 177005 -8636 27955 34881 -95811 -189818 -11506 -137405 -146045
11275a46045r9441A6937e6547a0546j13345p2525A08505a97465e1577C40670A2297
$$ -146045 -245486 16937 -56547 -10546 -123891 -196416 108505 -197465 -51577 340670 12297
11263A99290N5012A24783k5594k9816N9893a42797A81814g040G6300K5518b6701
$$ 199290 254302 124783 99189 69373 129266 -142797 181814 -7040 76300 101818 -26701
11251B5273J56456D3181L6613b14750G7902e5603m289j50506g1653q6303j03427
$$ 25273 181729 43181 79794 -214750 77902 -55603 -59892 -210398 -71653 -157956 -261383
11240b61383B2922f7863e901A55133c08197O4488M317I5791c4285E6354g6636
$$ -261383 22922 -67863 -5901 155133 -308197 -243709 -239392 95791 -34285 56354 -76636
11228g5671j14940b2580n76728G2989b48590b0141j49505A91J94272K21314a82136
$$ -75671 -190611 -22580 -599308 72989 -248590 -20141 -169646 191 194463 415777 -182136
11216c819A45753f7739B5679K22570B1716J50555a05639I5712c02758B83889q6011
$$ -3819 145753 -67739 25679 248249 21716 172271 -105639 95712 -302758 283889 197878
11205A97878A3401J24172b07230O8513e1971a1141j57234B6810K27332F2419b8858
$$ 197878 13401 137573 -207230 -138717 -51971 -11141 -168375 26810 254142 62419 -28858
11193h695n071j94025C4623a56908a0522j37961f8661j3531B0045g7582C978c26169
$$ -8695 -13766 -207791 34623 -156908 -10522 -148483 -68661 -82192 20045 -77582 3978 -326169
11180a76653B67960c25408B4305c2474l7702F3023a22820j4726E3784c4343j04945
$$ -176653 267960 -325408 24305 -32474 -70176 63023 -122820 -137546 53784 -34343 -139288
11169a39288A2104J3936e407k10898C7805b7911j65177D4291b19717B12666i7454
$$ -139288 12104 26040 -5407 -216305 37805 -27911 -193088 44291 -219717 212666 -97454
11157a33664o8998i5487J4217l70783a21830B33084c68548D70266g5424B04071
$$ -133664 -202662 -95487 -81270 -452053 -121830 233084 -368548 470266 -75424 204071
11146A32303a22138j33282I8311b58310J4171n9316A10916C1837b01293K4886
$$ 132303 -122138 -255420 98311 -258310 -244139 -303455 110916 31837 -201293 -176407
11136a76407A95673l3926c2590B16399b24146i8698C47974g6996A7548b18498
$$ -176407 195673 161747 -32590 216399 -224146 -98698 347974 -76996 17548 -218498
11125A34379e5547A46891B7791a14711C51559a00395E4679K64495o4952E8305
$$ 134379 -55547 146891 27791 -114711 351559 -100395 54679 319174 254222 58305
11114f0169a5452q580I4026J17075I1921a90693B2392K85719J13242l3282A50851
$$ -60169 -15452 -24032 94026 211101 91921 -190693 22392 308111 421353 388071 150851
11102B24986E7526J6857c05575b994m9180g608j33327E0160L16358A53344k9966
$$ 224986 57526 74383 -305575 -2994 -52174 -7608 -140935 50160 366518 153344 123378
11091A23378J13813j13141a2834A59486O0406j05389a01142A11452J27425a26690
$$ 123378 237191 124050 -12834 159486 219892 114503 -101142 111452 238877 -126690
11080B13878J35998O6941j62395p7686J1256H0271C0580M4492M6467R2929J13180
$$ 213878 349876 416817 254422 176736 187992 80271 30580 75072 121539 214468 327648
11069C27648K02379j98377D0285K46626N8668j7241E4494M24628I6886L62406
$$ 327648 530027 331650 40285 286911 345579 328338 54494 479122 96886 459292
11059D59292j81178K82M4901A33812M2452L52797M3899K0925k57381J07522k0634
$$ 459292 278114 278396 323297 133812 176264 529061 572960 593885 336504 444026 423392
11048D23392O1266j75212P3577J63257J05216l20403L66758M2460p3783j05590
$$ 423392 484658 309446 383023 546280 651496 331093 697851 740311 666528 560938
11038E60938L6900L5565j58310K32557q23j0168k3675J0551L62896m80217K98556
$$ 560938 597838 633403 475093 707650 706827 696659 672984 683535 1046431 566214 864770
11027H64770j98850j98733J09211K35181J40442D36232L907J01045L44143l59715
$$ 864770 665920 467187 576398 811579 952021 436232 440139 541184 885327 525612
11017E25612Q0861L04525r4710k66684J86122J93391C49591J32544K49195j04801
$$ 525612 606473 910998 816288 549604 735726 929117 349591 482135 731330 626529
11007F26529n902j89781K99449k16801L48421l32790J85507q601n4566q4538J77853
$$ 626529 620627 430846 730295 513494 861915 529125 714632 706031 651465 566927 744780
10996G44780j04954R7363J31220k85400J12995n9268k6406K20872K2227p3721
$$ 744780 639826 737189 868409 583009 696004 636736 610330 831202 853429 779708
10986G79708j6695l04834L83490k84653J825N3441N943K56058k01193J36838n7443
$$ 779708 763013 458179 841669 557016 558841 612282 618225 874283 673090 809928 752485
10975G52485j21643K70083j06399k56574M52784k23417K78581L19598m09663J7025
$$ 752485 630842 900925 794526 537952 990736 767319 1045900 1365498 955835 972860
10965I72860L26280k53527K60229J35191N57332m6709L28528J64969K08353j05685
$$ 972860 1299140 1045613 1305842 1441033 1998365 1951656 2280184 2445153 2653506 2547821
10955B547821J83511J46399l1971k87974r6025o0107l27181l62207n4606k75529
$$ 2547821 2731332 2877731 2845760 2557786 2461761 2401654 2074473 1712266 1657660 1382131
10945A382131N8099J35850Q1324K71189o34315K74942k37078n2624p2011l8531
$$ 1382131 1440230 1576080 1657404 1928593 1294278 1569220 1332142 1279518 1207507 1168976
10935A168976o0603K84694E40020J09059L8517j00707l8539j66256j42261K25730
$$ 1168976 1108373 1393067 540020 649079 687596 586889 548350 382094 239833 465563
10925D65563q7757A70807h6308B70882K6832H0970b1204A70222o8744a87266B63915
$$ 465563 377806 170807 -86308 270882 297714 80970 -21204 170222 101478 -187266 263915
10913C2393P6187D322J26054K43126b6985B56852F2110h5764d026k09890Q7817
$$ 32393 108580 4322 130376 373502 -26985 256852 62110 -85764 -4026 -213916 -126099
10902a26099K5722A00386Q5877O4378a11774j39825C46182A32729K44049A56314
$$ -126099 -100377 100386 186263 250641 -111774 -251599 346182 132729 376778 156314
10891c33799c9762E7370f1724j8411n404B64559K1528c88211d4664P622A22638
$$ -333799 -39762 57370 -61724 -80135 -85539 264559 286087 -388211 -44664 -37042 122638
10879a52862A75953b8971B9363N1523K90784I9016a00730A06678E249J51409R4853
$$ -152862 175953 -28971 29363 80886 371670 99016 -100730 106678 5249 156658 251511
10868B51511C6582a93305M500B6755b00411R9477B87411a91056g2766D22055e4734
$$ 251511 36582 -193305 -188805 26755 -200411 -100934 287411 -191056 -72766 422055 -54734
10856h2395k1016m3155C1777J64101a58596C1027b61977J30564B995J14767c32754
$$ -82395 -103411 -146566 31777 195878 -158596 31027 -261977 -131413 2995 117762 -332754
10844a4707C9600b58681b6887D5518f2800A13445L4528E1978a03902A95163a00060
$$ -14707 39600 -258681 -26887 45518 -62800 113445 147973 51978 -103902 195163 -100060
10832a4755B70870a93295H0538b67537J19384j77876H3524J70813b60653R4182
$$ -14755 270870 -193295 80538 -267537 -148153 -326029 83524 254337 -260653 -166471
10822a66471b1180B58039r231b05583H0248c96405a28068E6283L35865a3292C304
$$ -166471 -21180 258039 248808 -205583 80248 -396405 -128068 56283 392148 -13292 3304
10810D3777P1158O6567i5843c1768j84040A31419a5714A4297K36402h6472M1506
$$ 43777 114935 181502 -95843 -31768 -215808 131419 -15714 14297 250699 -86472 -44966
10799d4966j31715k4299k7367A62531A0179L8591e207l2914G7483c10952c3588
$$ -44966 -176681 -200980 -228347 162531 10179 48770 -5207 -38121 77483 -310952 -33588
10787c70723B92155C6689j7343O4190b87797A45650e5480j9904B78062b01469
$$ -370723 292155 36689 19346 83536 -287797 145650 -55480 -75384 278062 -201469
10776A78946J36600a25732k3475B9205Q7739h7387c1147j21802c6197m6018Q542
$$ 178946 315546 -125732 -149207 29205 116944 -87387 -31147 -152949 -36197 -82215 -73673
10765g3673b6234j94074o924k04253b7550q675j16014A5073b43191a03982A72132
$$ -73673 -26234 -220308 -227232 -431485 -27550 -36225 -152239 15073 -243191 -103982 172132
10753B43890b53986J23570A95642b15743A37985b5942a858n1639B75913a42273
$$ 243890 -253986 -130416 195642 -215743 137985 -25942 -1858 -53497 275913 -142273
10742D0394g2036D41604A41813A5243d84244a76326n7590A47130D6943J24095
$$ 40394 -72036 441604 141813 15243 -484244 -176326 -233916 147130 46943 171038
10732A71038a63552k13187H229a75752K0939j1047m8768A67751L16957g3438A37606
$$ 171038 -163552 -376739 8229 -175752 -154813 -165860 -214628 167751 484708 -73438 137606
10720A76728J502m4752a16304D3075a29112j46714C22408b4273A70554h9153C39413
$$ 176728 178230 133478 -116304 43075 -129112 -275826 322408 -24273 170554 -89153 339413
10708B478M335c26972g7771G3410J1093b10849k6887D5686K9844K9294e5163G6195
$$ 2478 6813 -326972 -77771 73410 84503 -210849 -237736 45686 75530 104824 -55163 76195
10695c42941B14684b11323A93979b6885k99233J6351i7594p1552J2861A57009
$$ -342941 214684 -211323 193979 -26885 -326118 -309767 -97594 -169146 -156285 157009
10684E5076O8931a27979c348p6066B4813f0138I9485R1879a98222C02526j03517
$$ 55076 124007 -127979 -3348 -79414 24813 -60138 99485 191364 -198222 302526 199009
10673A99009D9079a50930k82669C99990c38347a28360l27970i7304D01820D4427
$$ 199009 49079 -150930 -433599 399990 -338347 -128360 -456330 -97304 401820 44427
10662c01223O1695g7257C75980a73420b0658j845L134j65306e8584C2582d6306
$$ -301223 -239528 -77257 375980 -173420 -20658 -22503 -19369 -184675 -58584 32582 -46306
10650a28199J8785c6135k51318c9033A12816d1429C80956c3540j56848b6542B58884
$$ -128199 -109414 -36135 -287453 -39033 112816 -41429 380956 -33540 -190388 -26542 258884
10638b09823A4465g3001m2430B04424a98941f1164A66629a62028l1903j70863
$$ -209823 14465 -73001 -115431 204424 -198941 -61164 166629 -162028 -193931 -364794
10628c64794H7215K32079j5318c74823D3214J82304b05690j9518G743J66404D5603
$$ -364794 87215 319294 303976 -374823 43214 225518 -205690 -225208 7743 174147 45603
10616B5076l879P8102b86210A91955a7856l50504C715b47239P7128D12500A90219
$$ 25076 21197 99299 -286210 191955 -17856 -368360 3715 -247239 -170111 412500 190219
10604b70570f6691j90901b665l5488p5969c5118k09195h4798A70207f3876k95131
$$ -270570 -66691 -257592 -2665 -38153 -114122 -35118 -244313 -84798 170207 -63876 -359007
10593c59007A22604J30080f0721G5647b79352J2743J06005A65237K3379c66460
$$ -359007 122604 252684 -60721 75647 -279352 -266609 -160604 165237 188616 -366460
10582d8837B44800g0890m29980A5458R5866J29220a62115e1822n3318k6605A81060
$$ -48837 244800 -70890 -500870 15458 111324 240544 -162115 -51822 -105140 -131745 181060
10570E1327B0687J39011H750a9507k01788a6950F4365M3271a44868j91106A1639
$$ 51327 20687 159698 8750 -19507 -221295 -16950 64365 107636 -144868 -335974 11639
10558a52040e9810B510b1912j80683B99566d08518J55081m1016A2437b09949D5472
$$ -152040 -59810 2510 -21912 -202595 299566 -408518 -253437 -294453 12437 -209949 45472
10546a99078R8657A7598a36649A84972p3774M6797e7247A08422b28909j10409
$$ -199078 -100421 17598 -136649 184972 111198 157995 -57247 108422 -228909 -339318
10536c39318B45949j2708m2350b49197B44523c35878a62481c6405r4698j45692
$$ -339318 245949 233241 190891 -249197 244523 -335878 -162481 -36405 -131103 -276795
10526b76795E1435i9156l5276a6967A11617r891J89704b27104A85196J058k4730
$$ -276795 51435 -99156 -134432 -16967 111617 101726 291430 -227104 185196 186254 161524
10515A61524g910E1935b41996A58607G3500h1349B78938i1344C78406f5398b3668
$$ 161524 -7910 51935 -241996 158607 73500 -81349 278938 -91344 378406 -65398 -23668
10503c7814a3753j27912M7179j20939o669c5947C05713e6192k85241A20243a70268
$$ -37814 -13753 -141665 -94486 -215425 -222094 -35947 305713 -56192 -341433 120243 -170268
10491b32811A46465d202D919h5767M25A5443P8467c05191J18742f6418C70189
$$ -232811 146465 -4202 4919 -85767 -85342 15443 93910 -305191 -186449 -66418 370189
10479A76307F6384J15623a09044H9361a16096a9670l23120b6810A98017F2090
$$ 176307 66384 182007 -109044 89361 -116096 -19670 -342790 -26810 198017 62090
10468f5787I4292a62145C46798A57456R6622J1045j24708m299J45794i410k46996
$$ -65787 94292 -162145 346798 157456 254078 265123 140415 136116 281910 -9410 -256406
10457b56406A44149b73480J443D78839A15840N6371f5980j21765a6883A11101
$$ -256406 144149 -273480 -272037 478839 115840 172211 -65980 -187745 -16883 111101
10446C3124M8853b04719j6894A23890b09323b0125k3635A28170e8890o306B8838
$$ 33124 81977 -204719 -221613 123890 -209323 -20125 -43760 128170 -58890 -65196 28838
10434B77876H9455J55710c12787a49194G8154g1919C62980A32952a46673O4301
$$ 277876 89455 245165 -312787 -149194 78154 -71919 362980 132952 -146673 -82372
10424h2372I1223h1302A32494a90492A64598a72862g2716F2542g598k40556a06926
$$ -82372 91223 -81302 132494 -190492 164598 -172862 -72716 62542 -7598 -248154 -106926
10412a28594G3679e0195n8406n1441K5447n6662A93411K7593a12419q264A62489
$$ -128594 73679 -50195 -108601 -160042 -134595 -191257 193411 221004 -112419 -120683 162489
10400D6583J8389A0912g5336A85707N4741C7866d36571c900E34b47629A89333
$$ 46583 64972 10912 -75336 185707 240448 37866 -436571 -3900 534 -247629 189333
10388B71962E1768P0429P2626B0534K2467f9640C26624d05B92677q2723r0021
$$ 271962 51768 122197 194823 20534 43001 -69640 326624 -405 292677 209954 119933
10377A19933J196b58212A15060j8552J43562b555A66876A7751g9682B36048C3253
$$ 119933 121129 -258212 115060 96508 240070 -2555 166876 17751 -79682 236048 33253
10365b2051B60203J69794p290a03392C42717p0828H5290D918K93724A03136J52335
$$ -22051 260203 429997 422707 -103392 342717 271889 85290 4918 298642 103136 255471
10354B55471L4055l5460K29557o0106q9964J16837J37005k93548L3273m4318J05353
$$ 255471 289526 254066 483623 423517 333553 450390 587395 293847 327120 282802 388155
10343C88155b91515A56265q999L206J41017P2085b6562B69429J7231J08033l425
$$ 388155 -291515 156265 147266 150472 291489 363574 -26562 269429 286660 394693 391268
10332C91268J629K99490C39337m3531j7361J83998I8763N12528j73149j70169
$$ 391268 392897 692387 339337 295806 278445 462443 98763 611291 438142 267973
10322B67973p8346g3585B07131H575J77586N9651e5048C93916A51653N1230P1591
$$ 267973 189627 -73585 207131 8575 186161 245812 -55048 393916 151653 202883 274474
10311B74474j03541J12386A27063J37128j23276M6013c1010A89339n2381R073
$$ 274474 170933 283319 127063 264191 140915 186928 -31010 189339 136958 146031
10301A46031e7918D03279f3248A47281M5014K7675p2949d0323B610K40642g029
$$ 146031 -57918 403279 -63248 147281 192295 219970 147021 -40323 2610 243252 -7029
10289i7188G0941K67M1349B4629J93414b10883p3349i5208E2366c4330A52392
$$ -97188 70941 71208 112557 24629 218043 -210883 -284232 -95208 52366 -34330 152392
10277a51988g591A14834K25421g7896m2261K2984A67263a27309m68870i6335A00807
$$ -151988 -7591 114834 340255 -77896 -120157 -97173 167263 -127309 -596179 -96335 100807
10265C19527a88330L8964B9517J19462e0438n5732o3259A00458K6447c27329a61260
$$ 319527 -188330 -149366 29517 148979 -50438 -106170 -169429 100458 126905 -327329 -161260
10253b38019c7806j93203n1503A92291q6378K26511b8708A87364H9657b3202C61584
$$ -238019 -37806 -231009 -282512 192291 105913 332424 -28708 187364 89657 -23202 361584
10241H5162J04000J47716a51396C18900D4695O978r272K03791a9323B20934B5554
$$ 85162 189162 336878 -151396 318900 44695 51673 42401 246192 -19323 220934 25554
10229c36516J48924l8520L4420N5630N3177o3895C585b79669A00880j9150b02379
$$ -336516 -187592 -226112 -191692 -136062 -82885 -146780 3585 -279669 100880 81730 -202379
10217a23569M3207B26643j06326g7984m3117j36007P2759b7432l76796a8964G8839
$$ -123569 -80362 226643 120317 -77984 -121101 -257108 -184349 -27432 -404228 -18964 78839
10205b30826b4665k5063j81775L1519B00556g8320j25581I0802A8969b87234R256
$$ -230826 -24665 -49728 -231503 -199984 200556 -78320 -203901 90802 18969 -287234 -277978
10194b77978h2598k86017e7370p4330M2625A05959a97303l2091B7455C304K38076
$$ -277978 -82598 -368615 -57370 -131700 -89075 105959 -197303 -229394 27455 3304 241380
10183B41380A13893J12593b12250J2785d2328n9579m0969l03103b19631P4491
$$ 241380 113893 226486 -212250 -199465 -42328 -101907 -142876 -445979 -219631 -145140
10173a45140C2216g2229k8264B02843q075a23118j99728h7892C5385A7510b58344
$$ -145140 32216 -72229 -100493 202843 194768 -123118 -322846 -87892 35385 17510 -258344
10161a84231E2572j9413c07944J9848a511r442m17970g1553r5718I2126b72410
$$ -184231 52572 33159 -307944 -288096 -1511 -10953 -428923 -71553 -167271 92126 -272410
10149c09552A41667F0374d4150C52040g4472Q916J1983A61098b57220J22860C7210
$$ -309552 141667 60374 -44150 352040 -74472 -65556 -53573 161098 -257220 -134360 37210
10137h9177q4605L4169A0957a7960p8571k6157l55315K19617d8918j7019c2475
$$ -89177 -173782 -139613 10957 -17960 -96531 -122688 -478003 -258386 -48918 -65937 -32475
10125d3908r3081G5692C1743O606b57031G759a73260i88n0818k15384A3564J15432
$$ -43908 -136989 75692 31743 38349 -257031 7759 -173260 -988 -51806 -267190 13564 128996
10113A28996a11073j73409N3680A61455b4167k57655A27386a02670K4360A1457
$$ 128996 -111073 -284482 -230802 161455 -24167 -281822 127386 -102670 -78310 11457
10102A25119b30305B89381a7134D5341Q3502a4904j23001O5965B07223a30463
$$ 125119 -230305 289381 -17134 45341 128843 -14904 -137905 -71940 207223 -130463
10091a78925k86611I5984b02812j43590D25848b18505A88945h4218C2058K9709
$$ -178925 -465536 95984 -202812 -346402 425848 -218505 188945 -84218 32058 61767
10081F1767p176N3437C457R1511a02160A72774a32684l1244A22950E052b86643
$$ 61767 54591 108028 3457 94968 -102160 172774 -132684 -163928 122950 5052 -286643
10069a05285e0936n0103A24226B9089a50667c8886n3899l9153j80737h554l1395
$$ -105285 -50936 -101039 124226 29089 -150667 -38886 -92785 -131938 -312675 -8554 -39949
10058c9949j09425L737n575A12665b69866l57J21204K0276B14645h983j13499
$$ -39949 -149374 -145637 -151212 112665 -269866 -270223 -149019 -128743 214645 -8983 -122482
10047a22482K8496A5597K8969g6380K8615B63736a71809b0734k47959a3081H7091
$$ -122482 -93986 15597 44566 -76380 -47765 263736 -171809 -20734 -268693 -13081 87091
10035d59143b16944R8650j02474P7894a4406r7171b6491j99818F6493b51519a02635
$$ -459143 -216944 -118294 -220768 -142874 -14406 -111577 -26491 -226309 66493 -251519 -102635
10023D57935b38373a0994A74325a22633A59512a25747j38638D1799L14001D1762
$$ 457935 -238373 -10994 174325 -122633 159512 -125747 -264385 41799 355800 41762
10012c23973a13812m9709r6161I765J44163B3673b21107M4382C42969b43433g7184
$$ -323973 -113812 -163521 -259682 9765 153928 23673 -221107 -176725 342969 -243433 -77184
10000c24481R2221O465I1521c01453j8822b2040q8555d1724l25754B03488b54128
$$ -324481 -232260 -225795 91521 -301453 -320275 -22040 -110595 -41724 -367478 203488 -254128
9988A22714J29527b95909i2814A01550d7884n6824C48534A33009c78096A38648
$$ 122714 252241 -295909 -92814 101550 -47884 -104708 348534 133009 -378096 138648
9977G2727f1291k13520I1524K5615b30016B54382e2646C1429j1528i2903G66b27573
$$ 72727 -61291 -274811 91524 117139 -230016 254382 -52646 31429 19901 -92903 766 -227573
9964I6305a23132B72040f48231h8859D9525a66834M1442M8802j09677N6064D0593
$$ 96305 -123132 272040 -648231 -88859 49525 -166834 -125392 -76590 -186267 -130203 40593
9952A6929O8799K58172c03031h3863l35317a83520P4047k1917j18470B58367d4713
$$ 16929 85728 343900 -303031 -83863 -419180 -183520 -109473 -131390 -249860 258367 -44713
9940h8457B27704b84637c0511j32118N2337K4715G4676f0213K8735Q407A91350
$$ -88457 227704 -284637 -30511 -162629 -110292 -85577 74676 -60213 -31478 -23071 191350
9928a22400A83492p3898b82346C0968b2579I6844A4854J71928H7398g2500B13191
$$ -122400 183492 109594 -282346 30968 -22579 96844 14854 186782 87398 -72500 213191
9916A12785a06901G6120A0828a23548G2895r222b98504Q3604f7043B02217a1176
$$ 112785 -106901 76120 10828 -123548 72895 63673 -298504 -214900 -67043 202217 -11176
9904A61889a8994j13765l24983B37672b86678J09203b4170q2318d6035j24158
$$ 161889 -18994 -132759 -457742 237672 -286678 -177475 -24170 -106488 -46035 -170193
9894a70193j98903b5779o1039j35119G0289e4253A75516h0949D6625a39370H9704
$$ -170193 -369096 -25779 -86818 -221937 70289 -54253 175516 -80949 46625 -139370 89704
9882b53346j20682C1614a8593q92k03765A45532F2804c47546d3355j75777B86684
$$ -253346 -374028 31614 -18593 -19485 -223250 145532 62804 -347546 -43355 -219132 286684
9870F2941J57200a5235A24783K3759l0959e0748C59987i549d520j72218r7776
$$ 62941 220141 -15235 124783 148542 117583 -50748 359987 -9549 -4520 -176738 -274514
9859b74514g5781K2289l6386j70930l1528G8782b24315G8893b33159B21593d5773
$$ -274514 -75781 -53492 -89878 -260808 -292336 78782 -224315 78893 -233159 221593 -45773
9847b02389Q0550A27703A646a058F7742a35124A85426p0218a36988a1971n8164
$$ -202389 -121839 127703 1646 -1058 67742 -135124 185426 115208 -136988 -11971 -70135
9836g0135m4714j13177B0311K82151b54390B2047J05970c26504Q1396I5134a55748
$$ -70135 -114849 -228026 20311 302462 -254390 22047 128017 -326504 -245108 95134 -155748
9824d1735o2363K6545B59443a44700f6434k11662A72199f8135E9000c36103F2677
$$ -41735 -104098 -77553 259443 -144700 -66434 -278096 172199 -68135 59000 -336103 62677
9812g696k00770E2304l555b61500K5820j29936R0278k73411h606j06759E8221
$$ -7696 -208466 52304 48749 -261500 -235680 -365616 -275338 -548749 -8606 -115365 58221
9800a08444j95438a27087B82560a1065E2137b88690A18273b91136f0913B02451
$$ -108444 -303882 -127087 282560 -11065 52137 -288690 118273 -291136 -60913 202451
9789b03E2207a3510G6797l6695i2861b7794C3426d8472h445n0866C15611C5737
$$ -203 52207 -13510 76797 40102 -92861 -27794 33426 -48472 -8445 -59311 315611 35737
9776c22879a48088o103B25125a00309k0866p6055N4427a2675j3241n9046F1677
$$ -322879 -148088 -154191 225125 -100309 -121175 -197230 -142803 -12675 -25916 -84962 61677
9764d8270k43318f1330b7328j94661i0604E1223a4617C2418L8689j9284f9086
$$ -48270 -291588 -61330 -27328 -221989 -90604 51223 -14617 32418 71107 51823 -69086
9752A02771h3450A99453C2864a88020L955J7263l2511i2134k68486g4187A74085
$$ 102771 -83450 199453 32864 -188020 -184065 -166802 -199313 -92134 -360620 -74187 174085
9740a78080c9279A31483J07166j05860c25089g6510m8939p0155d3755l3642J3156
$$ -178080 -39279 131483 238649 132789 -325089 -76510 -125449 -195604 -43755 -77397 -64241
9729f4241l75170C10748A9693J86096C5831P4472c07955q5890A97244i2340l08654
$$ -64241 -439411 310748 19693 205789 35831 110303 -307955 -393845 197244 -92340 -400994
9718d00994J66660P0544c4005G2664d6354A19171m9685c3534j70624P8495m3547
$$ -400994 -234334 -163790 -34005 72664 -46354 119171 69486 -33534 -204158 -125663 -169210
9707a69210C34303b37562j03960B14724q9219b40839k01539J5990i9115K1480
$$ -169210 334303 -237562 -341522 214724 125505 -240839 -442378 -426388 -99115 -77635
9697g7635b8848A03077C125d7931E6166a22320a7779Q177o6936m9208j82146c1242
$$ -77635 -28848 103077 3125 -47931 56166 -122320 -17779 -9602 -76538 -125746 -307892 -31242
9684f1128K5506l09394I70b45400A01858E262i0120j67180a27529k09242a01877
$$ -61128 -35622 -345016 970 -245400 101858 5262 -90120 -257300 -127529 -336771 -101877
9672b2713E2664a2203I0587c96945f906A13916J10676a13705m2694j4841B14575
$$ -22713 52664 -12203 90587 -396945 -6906 113916 224592 -113705 -156399 -171240 214575
9660C7699c42961H2572N4077g220p6034k1438j74508A05947A0728K03079E1922
$$ 37699 -342961 82572 136649 -7220 -83254 -104692 -279200 105947 10728 213807 51922
9648A5613L04725g808k36257j26841A918g4051C54533b41944L4117b4170o248
$$ 15613 320338 -7808 -244065 -370906 1918 -74051 354533 -241944 -207827 -24170 -30418
9637c0418j3915q998p357K8450B62386c26876B558d9022L320j81132O321a00232
$$ -30418 -44333 -53331 -60688 -32238 262386 -326876 2558 -49022 -45702 -226834 -220513 -100232
9624D9852b4125B72249d094l9534o8736P265A51311E9801c56812b5948A17667
$$ 49852 -24125 272249 -4094 -43628 -112364 -105099 151311 59801 -356812 -25948 117667
9612B72074i8707k51757a36224m263j43665B03749c12998D3900j8299c07075A78480
$$ 272074 -98707 -350464 -136224 -140487 -284152 203749 -312998 43900 25601 -307075 178480
9600A0106a70642d2953C10553a94011q6091I7168a57270C53591F3273b22731d4759
$$ 10106 -170642 -42953 310553 -194011 -280102 97168 -157270 353591 63273 -222731 -44759
9588i3713C60916a27941j13031B1600f391B03247c16206C19486a98372j42274
$$ -93713 360916 -127941 -240972 21600 -6391 203247 -316206 319486 -198372 -340646
9578c40646J23823I9895b11831a03324G0694a65943j33102J29403j35351a32950
$$ -340646 -216823 99895 -211831 -103324 70694 -165943 -299045 -169642 -304993 -132950
9567d74579b15403h1551c7820k33614e2124A2271J04977k1096D4674J26588F7738
$$ -474579 -215403 -81551 -37820 -271434 -52124 12271 117248 96152 44674 171262 67738
9555C2001P8397L576j552A1348a23000C7769J36392G3572d8996q5239B2121b76891
$$ 32001 110398 113974 112422 11348 -123000 37769 174161 73572 -48996 -134235 22121 -276891
9542a90466A14665f5256j15630C8799P2139i209j19249L9952p7448a0157k9584
$$ -190466 114665 -65256 -180886 38799 110938 -9209 -128458 -88506 -165954 -10157 -39741
9531c9741q4965j83520a21396j77353Q357a804A0556q44b18613G9467f673k02946
$$ -39741 -124706 -308226 -121396 -298749 -290392 -1804 10556 9712 -218613 79467 -6673 -209619
9519b09619E1460d07767d8239H2912g261B305a18546k5260j15486P1131q1407
$$ -209619 51460 -407767 -48239 82912 -7261 2305 -118546 -143806 -259292 -188161 -269568
9508b69568o213A05628b22229d9215A25683a16241B49281A09163b01863R5117
$$ -269568 -275781 105628 -222229 -49215 125683 -116241 249281 109163 -201863 -106746
9498a06746b510n70390g3283j00465C6987j4721c89071a41483f0703j8275J9478
$$ -106746 -2510 -572900 -73283 -173748 36987 22266 -389071 -141483 -60703 -78978 -59500
9487e9500J1512C06085a06957j86464d2066k51838d5653k16102J00226A61946
$$ -59500 -47988 306085 -106957 -293421 -42066 -293904 -45653 -261755 -161529 161946
9476A25926m2991d1406A82564j6907d47354I4078h1635b2753r3787M1244r8968
$$ 125926 82935 -41406 182564 165657 -447354 94078 -81635 -22753 -116540 -75296 -174264
9465a74264G7888J99818a88967k05204A76195h3436l17734H2122Q5149f0046j20256
$$ -174264 77888 277706 -188967 -394171 176195 -83436 -401170 82122 167271 -60046 -180302
9454a80302M6366p0056D18836a16146M5980C6986b22270R5223l3535o9640G6879
$$ -180302 -133936 -203992 418836 -116146 -70166 36986 -222270 -127047 -160582 -230222 76879
9442a63200A53769d9412n4449K468j34877C5695a66214j22164J32631A52857b36397
$$ -163200 153769 -49412 -103861 -101393 -236270 35695 -166214 -288378 -155747 152857 -236397
9430B15742g498H3215a19336A36895c48946M1065J21271I7198L1368a34734d5291
$$ 215742 -7498 83215 -119336 136895 -348946 -307881 -186610 97198 128566 -134734 -45291
9418a39847l2664D4246A4582e4566A54794b30113M2316A30265k6451a03296B11094
$$ -139847 -172511 44246 14582 -54566 154794 -230113 -187797 130265 103814 -103296 211094
9406a95026N5617n2312H5623a60762A8495d41551a65711G9073P290h0572B64880
$$ -195026 -139409 -191721 85623 -160762 18495 -441551 -165711 79073 86363 -80572 264880
9394b41487P3489D9324d8564j83299L0381B78853a23865A07652C7327b05067Q7114
$$ -241487 -167998 49324 -48564 -231863 -201482 278853 -123865 107652 37327 -205067 -117953
9383a17953A4457a36989k54286a59520A46642h7627r7355f1360K3471q7212n5428
$$ -117953 14457 -136989 -391275 -159520 146642 -87627 -184982 -61360 -37889 -125101 -180529
9372a80529g426B70327A33889b62340A54907E6753a51470j99035a52496j8992
$$ -180529 -7426 270327 133889 -262340 154907 56753 -151470 -350505 -152496 -171488
9362a71488A44241b347B1883a84247A17852M9479d8380l6484B07110D740Q023
$$ -171488 144241 -2347 21883 -184247 117852 167331 -48380 -84864 207110 4740 12763
9351A2763a04445I3268b24601e3955j6090n5312O1399r4989r2184d645k57336
$$ 12763 -104445 93268 -224601 -53955 -70045 -125357 -63958 -158947 -251131 -4645 -261981
9340b61981F3603a00261K7976j03622P8875C0635J07915a93231a307k58128C45698
$$ -261981 63603 -100261 -72285 -175907 -97032 30635 138550 -193231 -1307 -259435 345698
9328a37880n1158a043j7636c064n2402D4272d5438I0751a67393Q2976j09704H7210
$$ -137880 -189038 -1043 -18679 -3064 -55466 44272 -45438 90751 -167393 -84417 -194121 87210
9315a13980j71426K0981I0025h3103B1295K8529a25069K4149e848j7521j36057
$$ -113980 -285406 -264425 90025 -83103 21295 49824 -125069 -100920 -5848 -23369 -159426
9304a59426A2651L18868b50752j68865D3920a06539k05496O7942B21234F1381
$$ -159426 12651 331519 -250752 -419617 43920 -106539 -312035 -244093 221234 61381
9293D6383K13208a42038j04354J21758G4874P0464a72515B7274i7627B32955J59741
$$ 46383 259591 -142038 -246392 -124634 74874 145338 -172515 27274 -97627 232955 392696
9282C92696a00473A24620a60789J0274d5817p6979a5623A52683c4495A19472A729
$$ 392696 -100473 124620 -160789 -150515 -45817 -122796 -15623 152683 -34495 119472 1729
9270A44733b6071j85379R5685m6416B4371l500J61208b9358j02526A15165a68671
$$ 144733 -26071 -211450 -115765 -162181 24371 20871 182079 -29358 -131884 115165 -168671
9258f0063m6151F34a0823j80983G9720e923j46145k36333J91359M4414A44403
$$ -60063 -106214 634 -10823 -191806 79720 -5923 -152068 -388401 -197042 -152628 144403
9246f4185C7750J34515D0899J26527F2687L09007b89545I8462J23356a76746B05077
$$ -64185 37750 172265 40899 167426 62687 371694 -289545 98462 221818 -176746 205077
9234A8768J17374N1531d58376C8452J00223c42028J37550k22436b13369I4139
$$ 18768 136142 187673 -458376 38452 138675 -342028 -204478 -426914 -213369 94139
9223a38658l49548b08507G3137a52545N9600j15176j00091i7300c9378l17131
$$ -138658 -488206 -208507 73137 -152545 -92945 -208121 -308212 -97300 -39378 -356509
9213c56509j2602M0017b0048j96190K9479A92441i3217R980B6659a7509m07909
$$ -356509 -369111 -329094 -20048 -216238 -186759 192441 -93217 -83237 26659 -17509 -425418
9202d25418a04861C30660a26614d19l37166B15122c37480P3763C14103E2620J87496
$$ -425418 -104861 330660 -126614 -419 -337585 215122 -337480 -263717 314103 52620 240116
9191B40116c98420d022F3378a91783A4670a38460H2998a53470j64593f9457D9359
$$ 240116 -398420 -4022 63378 -191783 14670 -138460 82998 -153470 -318063 -69457 49359
9179E8741A6727a81404A19263C0791c58603H0804a42127C3541c1056j5326p7261
$$ 58741 16727 -181404 119263 30791 -358603 80804 -142127 33541 -31056 -46382 -123643
9168a23643q5007c685H0572a58592j49946A5554c31830k2435J43628A96842b92378
$$ -123643 -208650 -3685 80572 -158592 -308538 15554 -331830 -354265 -210637 196842 -292378
9156d5748j37264P9837l3932G6972c2050l43491a15887r7997k09160A09480L8063
$$ -45748 -183012 -103175 -137107 76972 -32050 -375541 -115887 -213884 -423044 109480 147543
9145A47543g6641j76016R9960K9421l7995D9070O4607a34085q7424F0641K50983
$$ 147543 -76641 -252657 -152697 -123276 -161271 49070 113677 -134085 -221509 60641 311624
9134C11624A7540h2363j09938f7554D4507i0595A73805G4370K39906e923A21159
$$ 311624 17540 -82363 -192301 -67554 44507 -90595 173805 74370 314276 -5923 121159
9122c1159B61180f5659K1706j18854A26676a12809g270A32576K3094c06872E9622
$$ -31159 261180 -65659 -43953 -162807 126676 -112809 -7270 132576 155670 -306872 59622
9110H4337a59876K7262e9886A06491c68722f7774j79850N9369d636j69245n8842
$$ 84337 -159876 -132614 -59886 106491 -368722 -67774 -247624 -188255 -4636 -173881 -232723
9099b32723G5351b46051B00485B9813Q7778b45634K5272c8501m5413k06716P7812
$$ -232723 75351 -246051 200485 29813 117591 -245634 -220362 -38501 -83914 -290630 -212818
9088b12818A16294f2364C47818a51539n2561j4911R0191D7246c89679b8631B2646
$$ -212818 116294 -62364 347818 -151539 -204100 -219011 -128820 47246 -389679 -28631 22646
9076a61711b791B43365b15684A95770e62986A7872e2170J3981B65941B5725N3437
$$ -161711 -2791 243365 -215684 195770 -562986 17872 -52170 -38189 265941 25725 79162
9065G9162g038p3326N962B00766b81121O6046B00746a68995o2785a5602j18700
$$ 79162 -7038 -80364 -74402 200766 -281121 -215075 200746 -168995 -231780 -15602 -134302
9054a34302p546K566p6642E6882f3368D79209F1888a31119B70513a80637F5835
$$ -134302 -141848 -139282 -215924 56882 -63368 479209 61888 -131119 270513 -180637 65835
9042a61057D691J52669a86388j73220J17555b2541j0227j59400O1960o1710p38
$$ -161057 4691 157360 -186388 -359608 -242053 -22541 -32768 -192168 -130208 -191918 -192656
9031a92656M9515B97738D2430d91a17I4330b64953L5336e2912n5051j06193O271
$$ -192656 -143141 297738 42430 -491 -117 94330 -264953 -229617 -52912 -107963 -214156 -207885
9019b07885A3956L9866b60225f8163j33835r576N6400g886A25570L23280c72151
$$ -207885 13956 53822 -260225 -68163 -201998 -211574 -155174 -7886 125570 448850 -372151
9007g2404a0813A343i9739o8093c8904F648h0226A14203P0120a67729e0653p8524
$$ -72404 -10813 1343 -99739 -167832 -38904 6648 -80226 114203 184323 -167729 -50653 -129177
8995a29177e9842j07003H7274a5075D4653K43997o6612a15913M5964a2508l0535
$$ -129177 -59842 -166845 87274 -15075 44653 288650 222038 -115913 -69949 -12508 -43043
8984d3043q1151j4910A81027b57494H6299a00425k22882J13560a3437l17161O6533
$$ -43043 -124194 -139104 181027 -257494 86299 -100425 -323307 -209747 -13437 -330598 -264065
8973b64065J06846d5992n0971l21656e9239D968b15460R7094j95735A02946A2666
$$ -264065 -157219 -45992 -96963 -418619 -59239 4968 -215460 -118366 -314101 102946 12666
8961d03668A40602b24252f8121k6969e165j63987C6607c47546B6954h5501A92226
$$ -403668 140602 -224252 -68121 -95090 -5165 -169152 36607 -347546 26954 -85501 192226
8949h7599l0166E460J79038E4918a38081D22211A92441e3968A83004F425K63182
$$ -87599 -117765 5460 184498 54918 -138081 422211 192441 -53968 183004 6425 269607
8938B69607G1682b0649r8023k23364e326E184a33011A30210C0426f2289C0945
$$ 269607 71682 -20649 -118672 -342036 -5326 5184 -133011 130210 30426 -62289 30945
8926A41155e0098b3363l649l1340D6658j9518J92686N0470J29513A73659H5918
$$ 141155 -50098 -23363 -27012 -58352 46658 27140 219826 270296 399809 173659 85918
8914B65748j31644b82424B90192N71342B79360O36584R91888M25534K279102M649576
$$ 265748 134104 -282424 290192 861534 279360 915944 1907832 2333366 4612468 9262044
8904I262044D457772j969402A217023l67179j73616B45803o9802Q9356J41934
$$ 9262044 4457772 2488370 1217023 849844 676228 245803 176001 265357 407291
8895D07291A40057N1432a2862E13391A60701n2656K02226c45184f8437R014A01459
$$ 407291 140057 191489 -12862 513391 160701 108045 310271 -345184 -68437 -59423 101459
8883A74106d70j74918C0172a88362A2818K18960B2142b35029R3864F994M8773
$$ 174106 -470 -175388 30172 -188362 12818 231778 22142 -235029 -141165 6994 55767
8872E5767l568a19170M3639A60108e9042k79662R0050A63046Q6778b0193j20392
$$ 55767 52199 -119170 -75531 160108 -59042 -338704 -248654 163046 249824 -20193 -140585
8861a40585p1796q9276c2806n1182A7997J61343e7982B73862a34948K2733B42642
$$ -140585 -212381 -301657 -32806 -83988 17997 179340 -57982 273862 -134948 -112215 242642
$$ [...]
##END NTUPLES=NMR SPECTRUM
##END=
