
##TITLE=UV1164_M6-1005-1000_6306959_pwj7lQewCS
##JCAMPDX= 6.0         $$ Bruker NMR JCAMP-DX V2.0
##DATA TYPE= NMR SPECTRUM
##DATA CLASS= NTUPLES
##ORIGIN= BRUKER
##OWNER= Administrator
$$ 1.72 TOPSPIN		Version 2.1
$$ 2012-06-07 01:19:12.062 -0500  Administrator@TOPSPIN
$$ Compression mode = diff/dup
##.OBSERVE FREQUENCY= 400.13188235
##.OBSERVE NUCLEUS= ^1H
##.ACQUISITION MODE= SIMULTANEOUS (DQD)
##.ACQUISITION SCHEME= undefined
##.AVERAGES= 64
##.DIGITISER RES= 22
##SPECTROMETER/DATA SYSTEM= spect
##.PULSE SEQUENCE= noesygpps1d.comp
##.SOLVENT NAME= COFFEE_meoh
##.SHIFT REFERENCE= INTERNAL, COFFEE_meoh, 1, 14.96709
##AUDIT TRAIL= $$ (NUMBER, WHEN, WHO, WHERE, PROCESS, VERSION, WHAT)
$$ ##TITLE= Audit trail, TOPSPIN		Version 2.1
$$ ##JCAMPDX= 5.01
$$ ##ORIGIN= Bruker BioSpin GmbH
$$ ##OWNER= Administrator
$$ $$ C:\Bruker\TOPSPIN/data/COFFEE/nmr/UV1164_M6-1005-1000_6306959_pwj7lQewCS/12/pdata/1/auditp.txt
$$ ##AUDIT TRAIL=  $$ (NUMBER, WHEN, WHO, WHERE, PROCESS, VERSION, WHAT)
(   1,<2012-06-07 01:19:06.875 -0500>,<Administrator>,<TOPSPIN>,<go>,<TOPSPIN 2.1>,
      <created by zg
	started at 2012-06-07 01:07:36.687 -0500,
	POWCHK enabled, PULCHK disabled,
       configuration hash MD5:
       D5 CA 7A 23 FE 6B EE E2 50 67 74 61 24 F7 5E 3B
       data hash MD5: 64K
       27 66 14 7F 23 90 84 78 C8 4B DC E7 A0 E2 83 60>)
(   2,<2012-06-07 01:19:09.640 -0500>,<Administrator>,<TOPSPIN>,<proc1d>,<TOPSPIN 2.1>,
      <Start of raw data processing
       efp LB = 0.3 FT_mod = 6 PKNL = 1 PHC0 = 0 PHC1 = 0 SI = 128K 
       data hash MD5: 128K
       EF 02 A6 7F AF 3A 3B 01 89 DD FF 4A C5 09 FE 8B>)
(   3,<2012-06-07 01:19:10.921 -0500>,<Administrator>,<TOPSPIN>,<proc1d>,<TOPSPIN 2.1>,
      <pk PHC0 = 31.69556 PHC1 = 0 
       data hash MD5: 128K
       6D 73 B3 F9 C5 02 B2 37 A4 E9 63 07 E4 46 1B 52>)
(   4,<2012-06-07 01:19:11.718 -0500>,<Administrator>,<TOPSPIN>,<proc1d>,<TOPSPIN 2.1>,
      <abs ABSG = 1 
       data hash MD5: 128K
       CA E3 9D 57 D8 95 AB 62 D9 36 72 DC BB C4 EF A2>)
(   5,<2012-06-07 01:19:11.796 -0500>,<Administrator>,<TOPSPIN>,<proc1d>,<TOPSPIN 2.1>,
      <abs ABSG = 2 
       data hash MD5: 128K
       EE E2 2E 88 85 2F 39 8A D5 BB B4 2F 9D 80 11 A2>)
(   6,<2012-06-07 01:19:11.875 -0500>,<Administrator>,<TOPSPIN>,<proc1d>,<TOPSPIN 2.1>,
      <abs ABSG = 3 
       data hash MD5: 128K
       E7 FB B6 EC A3 A6 C3 D4 B4 31 9F 74 9C 40 20 88>)
(   7,<2012-06-07 01:19:11.921 -0500>,<Administrator>,<TOPSPIN>,<proc1d>,<TOPSPIN 2.1>,
      <abs ABSG = 4 
       data hash MD5: 128K
       FB 74 F0 DC B6 EA 23 E3 D9 14 FC 87 72 CF E7 48>)
(   8,<2012-06-07 01:19:11.984 -0500>,<Administrator>,<TOPSPIN>,<proc1d>,<TOPSPIN 2.1>,
      <abs ABSG = 5 
       data hash MD5: 128K
       F8 B3 68 ED 1E 13 71 89 67 D2 8A E6 AC 65 E2 98>)
$$ ##END=
$$ 
$$ $$ hash MD5
$$ $$ 7E 62 40 8F C0 D3 A0 F2 9D 75 C4 DC 1A A2 DE B8
##$RELAX= 
##$RELAX= 
##$RELAX= 
##$RELAX= 
##$RELAX= 
##$RELAX= 
##$RELAX= 
##$RELAX= 
$$ Bruker specific parameters
$$ [...]
##$TP07= 0
##$TPNAME0= <>
##$TPNAME1= <>
##$TPNAME2= <>
##$TPNAME3= <>
##$TPNAME4= <>
##$TPNAME5= <>
##$TPNAME6= <>
##$TPNAME7= <>
##$TPOAL= (0..7)
0.5 0.5 0.5 0.5 0.5 0.5 0.5 0.5
##$TPOFFS= (0..7)
0 0 0 0 0 0 0 0
##$TUNHIN= 0
##$TUNHOUT= 0
##$TUNXOUT= 0
##$USERA1= <user>
##$USERA2= <user>
##$USERA3= <user>
##$USERA4= <user>
##$USERA5= <user>
##$V9= 5
##$VALIST= <valist>
##$VCLIST= <CCCCCCCCCCCCCCC>
##$VD= 0
##$VDLIST= <DDDDDDDDDDDDDDD>
##$VPLIST= <PPPPPPPPPPPPPPP>
##$VTLIST= <TTTTTTTTTTTTTTT>
##$WBST= 2048
##$WBSW= 25
##$XGAIN= (0..3)
0 0 0 0
##$XL= 0
##$YL= 0
##$YMAX_a= 10537614
##$YMIN_a= -9302672
##$ZGOPTNS= <>
##$ZL1= 120
##$ZL2= 120
##$ZL3= 120
##$ZL4= 120
##$ABSF1= 14.96709
##$ABSF2= -5.585441
##$ABSG= 5
##$ABSL= 3
##$ALPHA= 0
##$AQORDER= 0
##$ASSFAC= 0
##$ASSFACI= 0
##$ASSFACX= 0
##$ASSWID= 0
##$AUNMP= <proc_prof1d_extract.lims>
##$AXLEFT= 0
##$AXNAME= <>
##$AXNUC= <1H>
##$AXRIGHT= 0
##$AXTYPE= 0
##$AXUNIT= <>
##$AZFE= 0.1
##$AZFW= 0.1
##$BCFW= 0
##$BC_mod= 0
##$BYTORDP= 0
##$COROFFS= 0
##$CY= 15
##$DATMOD= 1
##$DC= 0
##$DFILT= <>
##$DTYPP= 0
##$F1P= 0
##$F2P= 0
##$FCOR= 0.5
##$FTSIZE= 131072
##$FT_mod= 6
##$GAMMA= 0
##$GB= 0
##$INTBC= 1
##$INTSCL= 1
##$ISEN= 128
##$LB= 0.3
##$LEV0= 0
##$LPBIN= 0
##$MAXI= 10000
##$MC2= 0
##$MEAN= 0
##$ME_mod= 0
##$MI= 0
##$NCOEF= 0
##$NC_proc= -1
##$NLEV= 6
##$NOISF1= 0
##$NOISF2= 0
##$NSP= 0
##$NTH_PI= 0
##$NZP= 0
##$OFFSET= 14.96709
##$PC= 1
##$PHC0= 31.69556
##$PHC1= 0
##$PH_mod= 1
##$PKNL= yes
##$PPARMOD= 0
##$PPDIAG= 0
##$PPIPTYP= 0
##$PPMPNUM= 2147483647
##$PPRESOL= 1
##$PSCAL= 4
##$PSIGN= 0
##$PYNMP= <proc.py>
##$REVERSE= no
##$SF= 400.130005410124
##$SI= 131072
##$SIGF1= 0
##$SIGF2= 0
##$SINO= 400
##$SIOLD= 131072
##$SPECTYP= <>
##$SREGLST= <1H.CDCl3>
##$SSB= 0
##$STSI= 131072
##$STSR= 0
##$SW_p= 8223.68421052632
##$SYMM= 0
##$S_DEV= 0
##$TDeff= 65536
##$TDoff= 0
##$TI= <>
##$TILT= no
##$TM1= 0
##$TM2= 0
##$TOPLEV= 0
##$USERP1= <user>
##$USERP2= <user>
##$USERP3= <user>
##$USERP4= <user>
##$USERP5= <user>
##$WDW= 1
##$XDIM= 131072
##$YMAX_p= 116030867
##$YMIN_p= -366912263
##$CURPLOT= <Network HP LaserJet P1505>
##$CURPRIN= <$Network HP LaserJet P1505>
##$DFORMAT= <normdp>
##$LAYOUT= <+/1D_H.xwp>
##$LFORMAT= <normlp>
##$PFORMAT= <normpl>
##$SURQMSG= 1
$$ End of Bruker specific parameters
$$ ---------------------------------
##NTUPLES= NMR SPECTRUM
##VAR_NAME=  FREQUENCY,     SPECTRUM/REAL,   SPECTRUM/IMAG
##SYMBOL=    X,             R,               I
##VAR_TYPE=  INDEPENDENT,   DEPENDENT,       DEPENDENT
##VAR_FORM=  AFFN,          ASDF,            ASDF
##VAR_DIM=   131072,        131072,          131072
##UNITS=     HZ,            ARBITRARY UNITS, ARBITRARY UNITS
##FACTOR=    0.0627417313425165, 1,          1
##FIRST=     8223.62146879498, 607,          -20007
##LAST=      0,             427,             -20254
##MIN=       0,             -366912263,      0
##MAX=       8223.62146879498, 116030867,    0
$$ Real data points
##PAGE= N=1
##DATA TABLE= (X++(R..R)), XYDATA
$$ [...]
$$ plain form
63077 267028 264214 261628 259633 258511 258145 258195 258437 258894 259737 261069 262822 264824 266993 269337 271804 274229
63061 274229 276493 278540 280216 281272 281661 281675 281657 281692 281734 281871 282264 282961 283927 285147 286483 287585 288158 288255
63043 288255 288131 287913 287608 287295 287071 286926 286926 287348 288343 289556 290440 290850 290997 290933 290577 290262 290695 292151 294112
63024 294112 295901 297369 298766 300314 302169 304494 307202 309868 312213 314539 317405 320989 325025 329209
63010 329209 333429 337705 342212 347306 353259 359974 367182 374896 383412 392888 403151 413993 425460
62997 425460 437743 450875 464678 478974 493821 509491 526189 543802 561997 580580 599622
62986 599622 619166 638951 658486 677354 695403 712782 729809 746652 763079 778667 793338
62975 793338 807427 821114 834065 845877 856566 866247 874446 880122 882391 880992 876092 867996 857098
$$ packed form
63077B67028k814k586j995j122l66N0K42M57Q43J332J753K002K169K344K467K425
63061B74229K264K047J676J056L89J4j8L5M2J37L93O97R66J220J336J102N73R7
63043B88255j24k18l05l13k24j45%M22R95J213Q84M10J47o4l56l15M33J456J961
63024B94112J789J468J397J548J855K325K708K666K345K326K866L584M036M184
63010C29209M220M276M507N094N953O715P208P714Q516R476J0263J0842J1467
62997D25460J2283J3132J3803J4296J4847J5670J6698J7613J8195J8583J9042
62986E99622J9544J9785J9535J8868J8049J7379J7027J6843J6427J5588J4671
62975G93338J4089J3687J2951J1812J0689R681Q199N676K269j399m900q096j0898
$$ plain form
62962 857098 843813 828423 811139 792373 772835 753326 734555 717060 701040 686275 672475
62951 672475 659814 648906 640219 633744 629294 626853 626479 628097 631580 636831 643572 651195 659091 667129
62937 667129 675648 684988 695150 705853 716746 727534 738057 748303 758287 767848 776610 784143 790149
62924 790149 794506 797151 797905 796442 792459 785828 776561 764630 750017 732963 714070 694032 673332
62911 673332 652262 631154 610378 590142 570393 551011 532024 513626 496065 479591 464401
62900 464401 450486 437519 425032 412775 400886 389659 379195 369327 359845 350690 341966 333847
62888 333847 326429 319579 312944 306249 299629 293528 288255 283754 279793 276136 272499 268629 264624 260973
62874 260973 258010 255476 252889 250237 247974 246405 245363 244536 243752 242909 241925 240936 240265 239984 239695 238978
$$ packed form
62962H57098j3285j5390j7284j8766j9538j9509j8771j7495j6020j4765j3800
62951F72475j2661j0908q687o475m450k441l74J618L483N251O741P623P896Q038
62937F67129Q519R340J0162J0703J0893J0788J0523J0246R984R561Q762P533O006
62924G90149M357K645P54j463l983o631r267j1931j4613j7054j8893k0038k0700
62911F73332k1070k1108k0776k0236j9749j9382j8987j8398j7561j6474j5190
62900D64401j3915j2967j2487j2257j1889j1227j0464r868r482r155q724q119
62888C33847p418o850o635o695o620o101n273m501l961l657l637l870m005l651
62874B60973k963k534k587k652k263j569j042q27p84q43r84r89o71k81k89p17
$$ plain form
62858 238978 237872 236701 235530 234135 232441 230742 229359 228288 227304 226265 225185 224087 222958 221850
62844 221850 220866 220006 219132 218176 217294 216705 216455 216468 216745 217284 217795 217815 217235 216488 216025 215845 215751 215808 216177 216665
62824 216665 216868 216797 216910 217413 217907 217926 217526 217061 216593 215811 214485 212732 210886 209261 208042 207279 206937 206885
62806 206885 206791 206161 204784 203175 202247 202363 202950 203216 203004 202689 202516 202451 202534 202900 203420 203739 203795 203969 204535
62787 204535 205213 205531 205456 205401 205685 206192 206586 206672 206502 206264 206133 206197 206431 206726 206954 207038 206970 206795 206560 206297 206107
62766 206107 206229 206947 208335 210122 211902 213526 215188 217076 219044 220780 222275 223919 226080 228749 231718
62751 231718 234904 238285 241645 244692 247419 250132 253097 256398 260161 264596 269676 274985 280131 285154
62737 285154 290383 296025 302122 308796 316281 324701 334012 344186 355274 367286 380207 394210 409734
$$ packed form
62858B38978j106j171j171j395j694j699j383j071r84j039j080j098j129j108
62844B21850r84q60q74r56q82n89k50J3K77N39N11K0n80p47m63j80r4N7L69M88
62824B16665K03p1J13N03M94J9m00m65m68p82j326j753j846j625j219p63l42n2
62806B06885r4o30j377j609r28J16N87K66k12l15j73o5Q3L66N20L19N6J74N66
62787B04535O78L18p5n5K84N07L94Q6j70k38j31O4K34K95K28Q4o8j75k35k63j90
62766B06107J22P18J388J787J780J624J662J888J968J736J495J644K161K669K969
62751B31718L186L381L360L047K727K713K965L301L763M435N080N309N146N023
62737B85154N229N642O097O674P485Q420R311J0174J1088J2012J2921J4003J5524
$$ plain form
62724 409734 427166 446428 466985 488336 510469 533722 558212 583554 609219 634976 660693
62713 660693 685818 709411 730758 749637 765863 778892 788115 793293 794446 791554 784638 774031
62701 774031 760215 743491 724030 702198 678574 653697 628042 602134 576436 551143 526367
62690 526367 502469 479923 458891 439244 420968 404200 388822 374432 360874 348464 337505
62679 337505 327863 319245 311617 305087 299540 294689 290362 286527 283117 280097 277638 275971 275062 274593 274305
62664 274305 274202 274432 275148 276509 278661 281557 284903 288396 292026 296081 300834 306349 312635 319910 328513
62649 328513 338469 349378 360876 373112 386529 401247 416926 433256 450312 468338 487434 507611
62637 507611 528959 551502 574894 598463 621604 644098 665983 687023 706291 722415 734425
$$ packed form
62724D09734J7432J9262K0557K1351K2133K3253K4490K5342K5665K5757K5717
62713F60693K5125K3593K1347J8879J6226J3029R223N178J153k892o916j0607
62701G74031j3816j6724j9461k1832k3624k4877k5655k5908k5698k5293k4776
62690E26367k3898k2546k1032j9647j8276j6768j5378j4390j3558j2410j0959
62679C37505r642q618p628o530n547m851m327l835l410l020k459j667r09m69k88
62664B74305j03K30P16J361K152K896L346L493L630M055M753N515O286P275Q603
62649C28513R956J0909J1498J2236J3417J4718J5679J6330J7056J8026J9096K0177
62637E07611K1348K2543K3392K3569K3141K2494K1885K1040J9268J6124J2010
$$ plain form
62626 734425 742287 746431 746920 743409 735836 724656 710287 692794 672425 650008 626423 601984 576765
62613 576765 551315 526552 503007 480601 459150 438645 419060 400298 382509 366113 351372
62602 351372 338142 326164 315289 305322 295924 286912 278461 270865 264189 258273 252906 247859 242941
62589 242941 238180 233821 230022 226680 223636 220867 218358 215989 213760 211891 210521 209435 208347 207313
62575 207313 206545 205942 205131 203995 202832 201949 201369 201020 200912 200964 200878 200493 200102 200173 200783 201568 202257 203032 204265
62556 204265 206065 208202 210395 212543 214721 217071 219713 222652 225754 228892 232146 235778 239986 244772
62542 244772 250106 256120 263040 270994 279949 289765 300190 310922 321871 333308 345491 358152 370571
62529 370571 382247 393217 403594 413035 420892 426714 430380 431858 431129 428335 423759 417616 410017 401157
$$ packed form
62626G34425P862M144M89l511p573j1180j4369j7493k0369k2417k3585k4439k5219
62613E76765k5450k4763k3545k2406k1451k0505j9585j8762j7789j6396j4741
62602C51372j3230j1978j0875r967r398r012q451p596o676n916n367n047m918
62589B42941m761m359l799l342l044k769k509k369k229j869j370j086j088j034
62575B07313p68o03q11j136j163q83n80l49j08N2q6l85l91P1O10P85O89P75J233
62556B04265J800K137K193K148K178K350K642K939L102L138L254L632M208M786
62542B44772N334O014O920P954Q955R816J0425J0732J0949J1437J2183J2661J2419
62529C70571J1676J0970J0377R441P857N822L666J478p29k794m576o143p599q860
$$ plain form
62515 401157 391364 380958 370165 359190 348184 337160 326077 315060 304419 294412 285129 276600
62503 276600 268844 261794 255332 249469 244362 240084 236497 233383 230563 227888 225275 222869 220984 219796
62489 219796 219182 218938 218980 219231 219497 219612 219652 219848 220356 221200 222349 223698 225049 226215 227164 228035 229112 230771
62471 230771 233279 236576 240418 244739 249654 255034 260496 266013 272219 279663 288072 296824 305995 316381
62457 316381 328423 341668 355428 369506 384052 399121 414692 430858 447599 464498 480951
62446 480951 496622 511474 525445 538218 549287 558150 564600 568980 572043 574432 576349 577839 579222
62433 579222 581048 583729 587433 592300 598593 606587 616376 627749 640183 653082 666114 679183 691941
62420 691941 703485 712763 719198 722781 723649 721820 717225 709621 698464 683248 664225 642584 619675
$$ packed form
62515D01157r793j0406j0793j0975j1006j1024j1083j1017j0641j0007r283q529
62503B76600p756p050o462n863n107m278l587l114k820k675k613k406j885j188
62489B19796o14k44M2K51K66J15M0J96N08Q44J149J349J351J166R49Q71J077J659
62471B30771K508L297L842M321M915N380N462N517O206P444Q409Q752R171J0386
62457C16381J2042J3245J3760J4078J4546J5069J5571J6166J6741J6899J6453
62446D80951J5671J4852J3971J2773J1069Q863O450M380L063K389J917J490J383
62433E79222J826K681L704M867O293P994R789J1373J2434J2899J3032J3069J2758
62420F91941J1544R278O435L583Q68j829m595p604j1157j5216j9023k1641k2909
$$ plain form
62407 619675 596155 572038 547444 522974 499262 476438 454294 432921 412942 395025 379335
62396 379335 365554 353309 342375 332581 323827 316197 309846 304668 300315 296633 293837 292062 290967
62383 290967 290020 289075 288393 288182 288393 288948 289849 290942 291811 292090 291764 291014 289826 287926 285140 281767 278444
62366 278444 275572 272948 270052 266665 263036 259477 256044 252725 249643 246842 244116 241299 238610 236391
62352 236391 234607 232913 231213 229784 228783 227959 227018 226060 225421 225220 225235 225228 225257 225644 226646 228167 229855
62335 229855 231495 233248 235383 237879 240416 242726 244840 247058 249762 253174 257114 261123 265002 269091
62321 269091 273788 278927 284019 289019 294402 300409 306661 312688 318482 324300 330319 336782 344192 352925
62307 352925 362760 373122 383788 395090 407487 421156 436021 451995 469108 487431 506868 526962
$$ packed form
62407F19675k3520k4117k4594k4470k3712k2824k2144k1373j9979j7917j5690
62396C79335j3781j2245j0934r794q754p630o351n178m353l682k796j775j095
62383B90967r47r45o82k11K11N55R01J093Q69K79l26p50j188j900k786l373l323
62366B78444k872k624k896l387l629l559l433l319l082k801k726k817k689k219
62352B36391j784j694j700j429j001q24r41r58o39k01J5pK9L87J002J521J688
62335B29855J640J753K135K496K537K310K114K218K704L412L940M009L879M089
62321B69091M697N139N092N000N383O007O252O027N794N818O019O463P410Q733
62307C52925R835J0362J0666J1302J2397J3669J4865J5974J7113J8323J9437K0094
$$ plain form
62295 526962 547036 566585 585373 603082 619055 632631 643604 652141 658318 661964 662918 661230 657070
62282 657070 650577 641872 631128 618644 604877 590314 575245 559742 543949 528326 513432 499574
62270 499574 486737 474760 463388 452318 441404 430828 420884 411613 402799 394246 385872 377546 369078
62257 369078 360461 351980 344041 336966 330943 325950 321699 317805 314139 310931 308442 306641 305296 304303
62243 304303 303810 303990 304756 305744 306608 307291 307986 308843 309835 310898 312054 313280 314421 315423 316516 317965
62227 317965 319665 321192 322308 323243 324409 325974 327801 329723 331775 334182 337103 340412 343811 347202
62213 347202 350883 355248 360402 366197 372542 379479 387006 395112 404012 414079 425464 437974 451457
62200 451457 466046 481907 498917 516828 535560 555080 575044 594810 613782 631538 647567
$$ packed form
62295E26962K0074J9549J8788J7709J5973J3576J0973Q537O177L646R54j688m160
62282F57070o493q705j0744j2484j3767j4563j5069j5503j5793j5623j4894j3858
62270D99574j2837j1977j1372j1070j0914j0576r944r271q814q553q374q326q468
62257C69078q617q481p939p075o023m993m251l894l666l208k489j801j345r93
62243C04303m93J80P66R88Q64O83O95Q57R92J063J156J226J141J002J093J449
62227C17965J700J527J116R35J166J565J827J922K052K407K921L309L399L391
62213C47202L681M365N154N795O345O937P527Q106Q900J0067J1385J2510J3483
62200D51457J4589J5861J7010J7911J8732J9520J9964J9766J8972J7756J6029
$$ plain form
62189 647567 661179 671789 679210 683576 685114 684080 680755 675273 667447 656885 643405 627289 609195
62176 609195 589895 570086 550293 530808 511736 493201 475492 458977 443899 430300 418103
62165 418103 407202 397424 388531 380299 372636 365603 359328 353871 349148 345046 341608 339001 337197 335781
62151 335781 334233 332382 330477 328850 327702 327169 327348 328138 329237 330441 331808 333442 335276 337209 339309
62136 339309 341734 344530 347693 351339 355613 360445 365561 370751 375999 381320 386616 391754 396747 401769
62122 401769 406954 412174 417098 421519 425614 429780 434233 438958 443993 449567 455893 463006 470922 479741
62108 479741 489524 500238 511912 524579 537913 551205 563946 576134 587724 597968 605806 610795
62096 610795 613336 614026 613144 610699 606570 600529 592501 582888 572329 561106 549088 536332 523337
$$ packed form
62189F47567J3612J0610P421M366J538j034l325n482p826j0562j3480j6116j8094
62176F09195j9300j9809j9793j9485j9072j8535j7709j6515j5078j3599j2197
62165D18103j0901r778q893q232p663p033o275n457m723m102l438k607j804j416
62151C35781j548j851j905j627j148n33J79P90J099J204J367J634J834J933K100
62136C39309K425K796L163L646M274M832N116N190N248N321N296N138M993N022
62122D01769N185N220M924M421M095M166M453M725N035N574O326P113P916Q819
62108D79741R783J0714J1674J2667J3334J3292J2741J2188J1590J0244P838M989
62096F10795K541O90q82k445m129o041q028r613j0559j1223j2018j2756j2995
$$ plain form
62083 523337 510592 498204 486170 474689 463990 454106 445057 436985 429882 423387 417167 411356 406297
62070 406297 401962 397905 393790 389707 385925 382570 379579 376878 374545 372813 371916 371901 372630 373963 375762
62055 375762 377662 379033 379373 378700 377441 376040 374739 373629 372678 371733 370650 369421 368087 366559 364660
62040 364660 362331 359680 356864 354040 351428 349322 347967 347496 347935 349216 351150 353423 355679 357689 359572
62025 359572 361810 364908 368981 373732 378848 384241 389896 395748 401879 408631 416299 424775 433674 442719
62011 442719 451782 460682 469228 477521 485997 495068 504774 514764 524496 533456 541390 548368 554493 559519
61997 559519 562879 564164 563455 561126 557434 552360 545761 537567 527896 517007 505120 492236 478298
61984 478298 463596 448858 434752 421333 408181 395080 382387 370622 359890 349854 340204 330938
$$ packed form
62083E23337j2745j2388j2034j1481j0699r884r049q072p103o495o220n811n059
62070D06297m335m057m115m083l782l355k991k701k333j732q97j5P29J333J799
62055C75762J900J371L40o73j259j401j301j110r51r45j083j229j334j528j899
62040C64660k329k651k816k824k612k106j355m71M39J281J934K273K256K010J883
62025C59572K238L098M073M751N116N393N655N852O131O752P668Q476Q899R045
62011D42719R063Q900Q546Q293Q476R071R706R990R732Q960P934O978O125N026
61997E59519L360J285p09k329l692n074o599q194r671j0889j1887j2884j3938
61984D78298j4702j4738j4106j3419j3152j3101j2693j1765j0732j0036r650r266
$$ plain form
61972 330938 322195 314025 306460 299653 293759 288670 284029 279565 275360 271664 268507 265546 262342 258726
61958 258726 254838 250848 246801 242824 239310 236634 234710 233060 231404 229956 229023 228581 228443 228633 229239
61943 229239 230056 230711 231132 231560 232100 232611 233067 233662 234377 234811 234652 234039 233203 231994 230105 227598 224878
61926 224878 222200 219517 216816 214281 211993 209698 207070 204142 201350 199123 197457 195929 194147 192182
61912 192182 190501 189505 189227 189466 190024 190733 191395 191876 192203 192467 192716 193046 193715 194980 196843 199039 201297
61895 201297 203504 205689 207943 210381 213084 216094 219495 223458 228131 233491 239343 245417 251479 257476
61881 257476 263643 270362 277786 285683 293698 301618 309325 316621 323347 329610 335672 341606 347191 352159
61867 352159 356439 360113 363214 365567 366837 366842 365864 364558 363416 362430 361358 360178 359091 358235 357705 357840
$$ packed form
61972C30938q743q170p565o807n894n089m641m464m205l696l157k961l204l616
61958B58726l888l990m047l977l514k676j924j650j656j448r33m42j38J90O06
61943B29239Q17O55M21M28N40N11M56N95P15M34j59o13q36j209j889k507k720
61926B24878k678k683k701k535k288k295k628k928k792k227j666j528j782j965
61912A92182j681r96k78K39N58P09O62M81L27K64K49L30O69J265J863K196K258
61895B01297K207K185K254K438K703L010L401L963M673N360N852O074O062N997
61881B57476O167O719P424P897Q015P920P707P296O726O263O062N934N585M968
61867C52159M280L674L101K353J270Nr78j306j142r86j072j180j087q56n30J35
$$ plain form
61851 357840 359208 362135 366424 371568 377081 382548 387550 391786 395238 398058 400212 401350 401143 399759
61837 399759 397851 395961 393994 391404 387871 383592 378975 374277 369654 365275 361173 357125 352896 348500
61823 348500 344030 339419 334602 329781 325272 321129 317157 313232 309372 305544 301737 298216 295394 293353
61809 293353 291809 290639 290181 290827 292527 294904 297725 301052 305010 309644 314979 321082 327996 335677 344054
61794 344054 353121 362944 373552 384815 396457 408215 419926 431418 442423 452708 462221 470959
61782 470959 478722 485162 490069 493479 495452 495911 494778 492292 489085 485915 483244 481084 479324 478190
61768 478190 478167 479433 481592 484131 486906 489895 492691 494612 495315 494884 493280 490061 484858 477877 469758
61753 469758 461082 452124 442921 433390 423439 413094 402550 392080 381932 372246 363002 354091 345558
$$ packed form
61851C57840J368K927M289N144N513N467N002M236L452K820K154J138k07j384
61837C99759j908j890j967k590l533m279m617m698m623m379m102m048m229m396
61823C48500m470m611m817m821m509m143l972l925l860l828l807l521k822k041
61809B93353j544j170m58O46J700K377K821L327L958M634N335O103O914P681Q377
61794C44054R067R823J0608J1263J1642J1758J1711J1492J1005J0285R513Q738
61782D70959P763O440M907L410J973M59j133k486l207l170k671k160j760j134
61768D78190k3J266K159K539K775K989K796J921P03m31j604l219n203o981q119
61753D69758q676q958r203r531r951j0345j0544j0470j0148r686r244q911q533
$$ plain form
61740 345558 337664 330584 324138 318037 312294 307124 302540 298326 294411 290878 287636 284429 281294 278604
61726 278604 276501 274631 272639 270626 268897 267532 266440 265552 264711 263614 262178 260787 259883 259454 259186
61711 259186 258979 259031 259521 260496 261943 263760 265746 267877 270422 273499 276683 279422 281749 284162 286833
61696 286833 289370 291418 293037 294332 295069 294934 293873 291963 289179 285596 281664 277907 274400 270795 266902
61681 266902 263036 259716 257172 255246 253676 252329 251191 250250 249456 248743 248035 247270 246499 245914 245672 245680 245661
61664 245661 245475 245255 245149 245079 244903 244695 244671 244845 244962 244806 244455 244090 243706 243071 241986 240514 238914 237384
61646 237384 235863 234137 232127 229989 227862 225660 223226 220618 218084 215789 213755 212028 210702 209686
61632 209686 208648 207284 205572 203695 201852 200255 199108 198404 197797 196905 195724 194560 193572 192622 191618
$$ packed form
61740C45558p894p080o446o101n743n170m584m214l915l533l242l207l135k690
61726B78604k103j870j992k013j729j365j092q88q41j097j436j391r04m29k68
61711B59186k07N2M90R75J447J817J986K131K545L077L184K739K327K413K671
61696B86833K537K048J619J295P37j35j061j910k784l583l932l757l507l605l893
61681B66902l866l320k544j926j570j347j138r41p94p13p08p65p71n85k42Qj9
61664B45661j86k20j06p0j76k08k4J74J17j56l51l65l84o35j085j472j600j530
61646B37384j521j726k010k138k127k202k434k608k534k295k034j727j326j016
61632B09686j038j364j712j877j843j597j147p04o07q92j181j164r88r50j004
$$ plain form
61617 191618 190737 190139 189642 188942 188079 187430 187274 187559 188127 188907 189771 190417 190588 190356 190079 190138 190733 191833 193168
61598 193168 194443 195656 197130 199017 200938 202274 202818 202919 203054 203498 204301 205322 206201 206618 206724 207134
61582 207134 208326 210167 212093 213642 214706 215410 215932 216374 216681 216671 216195 215274 214074 212772 211457 210075
61566 210075 208497 206674 204727 202809 200971 199251 197807 196759 195991 195297 194659 194161 193661 192880 191795 190613
61550 190613 189321 187621 185425 183038 180701 178327 175904 173766 172130 170660 168919 167036 165499 164406
61536 164406 163338 161966 160422 159040 158035 157476 157330 157403 157384 157025 156247 155162 154076 153325 152958 152704 152404
61519 152404 152301 152668 153281 153598 153359 152765 152130 151686 151654 152134 152891 153507 153844 154110 154482 154924 155418 156065 156909
61500 156909 157842 158770 159639 160279 160498 160383 160299 160511 161000 161685 162555 163509 164301 164786 165033 165117 165024 164865 164968 165611
$$ packed form
61617A91618q81n98m97p00q63o49j56K85N68P80Q64O46J71k32k77N9N95J100J335
61598A93168J275J213J474J887J921J336N44J01J35M44Q03J021Q79M17J06M10
61582B07134J192J841J926J549J064P04N22M42L07j0m76r21j200j302j315j382
61566B10075j578j823j947j918j838j720j444j048p68o94o38m98n00p81j085j182
61550A90613j292j700k196k387k337k374k423k138j636j470j741j883j537j093
61536A64406j068j372j544j382j005n59j46P3j9l59p78j085j086p51l67k54l00
61519A52404j03L67O13L17k39n94o35m44l2M80P57O16L37K66L72M42M94O47Q44
61500A56909R33R28Q69O40K19j15q4K12M89O85Q70R54P92M85K47Q4r3j59J03O43
$$ plain form
61480 165611 166762 168176 169556 170593 171107 171263 171452 171834 172176 172246 172136 172039 171917 171621 171136 170559 169935 169319
61462 169319 168833 168507 168208 167889 167755 167971 168358 168572 168483 168199 167832 167448 167160 167056 167090 167269 167840 169029 170629
61443 170629 172156 173403 174601 175987 177470 178832 180045 181258 182619 184211 186005 187718 188885 189288
61429 189288 189283 189531 190373 191556 192576 193170 193438 193646 194012 194621 195379 196039 196396 196492 196546 196653 196669 196462 196111 195725
61409 195725 195232 194536 193803 193315 193066 192756 192217 191579 190947 190219 189358 188589 188072 187598 186881 185988 185183 184490 183803
61390 183803 183351 183641 184787 186227 187328 188012 188613 189338 190173 191168 192446 193909 195209 196151 196945 197923 199180
61373 199180 200608 202153 203783 205269 206245 206604 206698 207004 207659 208406 208961 209350 209904 211005 212780 214956 216988
61356 216988 218398 219009 218918 218325 217458 216524 215611 214675 213747 213049 212807 212940 213093 212963 212472 211703 210823 210119 209836
$$ packed form
61480A65611J151J414J380J037N14J56J89L82L42P0j10r7j22k96m85n77o24o16
61462A69319m86l26k99l19j34K16L87K14q9k84l67l84k88j04L4J79N71J189J600
61443A70629J527J247J198J386J483J362J213J213J361J592J794J713J167M03
61429A89288nK48Q42J183J020N94K68K08L66O09P58O60L57R6N4J07J6k07l51l86
61409A95725m93o96p33m88k49l10n39o38o32p28q61p69n17m74p17q93q05o93o87
61390A83803m52K90J146J440J101O84O01P25Q35R95J278J463J300R42P94R78J257
61373A99180J428J545J630J486R76L59R4L06O55P47N55L89N54J101J775K176K032
61356B16988J410O11r1n93q67r34r13r36r28o98k42J33J53j30m91p69q80p04k83
$$ plain form
61337 209836 209938 210122 210159 210100 210118 210298 210657 211212 211917 212682 213539 214643 215977 217197 218016 218637 219610 221242
61319 221242 223314 225405 227313 229108 230936 232890 234977 237047 238756 239782 240173 240370 240773 241281 241471
61304 241471 241210 240888 240907 241162 241272 241229 241427 242043 242755 243239 243685 244529 245839 247303 248797 250644 253138 255957
61286 255957 258277 259515 259869 260088 260726 261732 262811 263927 265256 266700 267788 268150 267910 267419 266814 265976
61270 265976 264839 263549 262378 261605 261417 261772 262379 262943 263403 263876 264430 265075 265917 267150 268855 270945 273310
61253 273310 275946 278935 282351 286203 290427 294929 299669 304626 309622 314292 318324 321659 324335 326216
61239 326216 327028 326664 325299 323235 320747 318065 315362 312673 309945 307165 304383 301610 298813 296011 293286
61224 293286 290691 288285 286248 284792 283892 283300 282863 282696 282908 283353 283830 284410 285323 286574 287895 289105
$$ packed form
61337B09836J02J84L7n9J8J80L59N55P05P65Q57J104J334J220Q19O21R73J632
61319B21242K072K091J908J795J828J954K087K070J709J026L91J97M03N08J90
61304B41471k61l22J9K55J10m3J98O16P12M84M46Q44J310J464J494J847K494K819
61286B55957K320J238L54K19O38J006J079J116J329J444J088L62k40m91o05q38
61270B65976j137j290j171p73j88L55O07N64M60M73N54O45Q42J233J705K090K365
61253B73310K636K989L416L852M224M502M740M957M996M670M032L335K676J881
61239C26216Q12l64j365k064k488k682k703k689k728k780k782k773k797k802k725
61224B93286k595k406k037j456r00n92m37j67K12M45M77N80R13J251J321J210
$$ plain form
61208 289105 290319 291740 293418 295314 297436 299797 302324 304937 307633 310373 313000 315415 317726 320072
61194 320072 322344 324292 325805 326874 327288 326755 325416 323941 322909 322292 321730 321052 320282 319328 318071 316675
61178 316675 315458 314447 313341 311951 310408 308941 307706 306901 306725 307133 307864 308848 310347 312519 315036
61163 315036 317357 319239 320808 322276 323801 325545 327653 330104 332687 335148 337345 339268 341001 342598
61149 342598 344065 345476 347031 348859 350783 352494 353962 355538 357584 360191 363289 366826 370725 374816
61135 374816 378964 383136 387258 391090 394316 396686 398027 398314 397783 396820 395695 394508 393361 392273 390921
61120 390921 388834 386019 383069 380418 377815 374775 371278 367627 363847 359690 355152 350620 346435 342575
61106 342575 338801 334918 330879 326797 322855 319102 315433 311876 308743 306312 304490 302975 301627 300505
$$ packed form
61208B89105J214J421J678J896K122K361K527K613K696K740K627K415K311K346
61194C20072K272J948J513J069M14n33j339j475j032o17n62o78p70r54j257j396
61178C16675j217j011j106j390j543j467j235q05j76M08P31R84J499K172K517
61163C15036K321J882J569J468J525J744K108K451K583K461K197J923J733J597
61149C42598J467J411J555J828J924J711J468J576K046K607L098L537L899M091
61135C74816M148M172M122L832L226K370J341K87n31r63j125j187j147j088j352
61120C90921k087k815k950k651k603l040l497l651l780m157m538m532m185l860
61106C42575l774l883m039m082l942l753l669l557l133k431j822j515j348j122
$$ plain form
61092 300505 299690 299287 299419 299955 300412 300409 300080 299717 299201 298193 296775 295434 294407 293497 292585 291907 291664 291748
61074 291748 292063 292823 294275 296326 298688 301281 304299 307972 312341 317255 322526 328119 334166 340715 347565
61059 347565 354483 361519 368941 376902 385365 394245 403380 412442 421132 429469 437641 445564 452869 459316
61045 459316 464984 470039 474577 478713 482506 485690 487719 488209 487251 485321 483059 481026 479340 477580 475345
61030 475345 472875 470794 469258 467797 466092 464527 463767 464129 465511 467649 470240 473084 476278 480124 484733
61015 484733 489960 495769 502340 509731 517672 525817 533927 541767 549228 556624 564450 572647 580496 587490
61001 587490 593894 600187 606339 612040 617329 622596 628060 633608 639004 644076 648823 653529 658572 664011
60987 664011 669636 675532 682201 689905 698337 707257 717038 728145 740424 753450 767326 782613 799658
$$ packed form
61092C00505q15m03J32N36M57ll29l63n16j008j418j341j027r10r12o78k43Q4
61074B91748L15P60J452K051K362K593L018L673M369M914N271N593O047O549O850
61059C47565O918P036P422P961Q463Q880R135R062Q690Q337Q172P923P305O447
61045D59316N668N055M538M136L793L184K029M90r58j930k262k033j686j760k235
61030D75345k470k081j536j461j705j565p60L62J382K138K591K844L194L846M609
61015D84733N227N809O571P391P941Q145Q110P840P461P396P826Q197P849O994
61001E87490O404O293O152N701N289N267N464N548N396N072M747M706N043N439
60987F64011N625N896O669P704Q432Q920R781J1107J2279J3026J3876J5287J7045
$$ plain form
60974 799658 818479 839207 862130 887362 914840 944632 976874 1011468 1048161 1086819 1127401
60963 1127401 1169921 1214791 1262988 1315412 1372311 1433709 1500144 1572468 1651207 1736775 1830210
60952 1830210 1933194 2047629 2175888 2321172 2486743 2674917 2887704 3128267 3400811
60943 3400811 3709371 4058277 4453831 4903616 5413616 5987660 6628434 7331246 8067851
60934 8067851 8776141 9375865 9806939 10059810 10172177 10200068 10193218 10189561 10214909 10271080 10320963
60923 10320963 10294840 10124178 9778529 9276283 8665926 7999406 7317547 6648918 6012819
60914 6012819 5421092 4879779 4391356 3956039 3571777 3234508 2939323 2681381 2455959
60905 2455959 2258454 2084733 1931273 1794860 1672593 1562407 1463248 1374385 1294681 1222720
$$ packed form
60974G99658J8821K0728K2923K5232K7478K9792L2242L4594L6693L8658M0582
60963A127401M2520M4870M8197N2424N6899O1398O6435P2324P8739Q5568R3435
60952A830210J02984J14435J28259J45284J65571J88174K12787K40563K72544
60943C400811L08560L48906L95554M49785N10000N74044O40774P02812P36605
60934H067851P08290N99724M31074K52871J12367K7891o850l657K5348N6171M9883
60923A0320963k6123j70662l45649n02246o10357o66520o81859o68629o36099
60914F012819n91727n41313m88423m35317l84262l37269k95185k57942k25422
60905B455959j97505j73721j53460j36413j22267j10186r9159q8863p9704p1961
$$ plain form
60895 1222720 1157447 1098431 1045488 998153 955524 916541 880370 846510 814570 784108 754820
60884 754820 726771 700255 675414 652111 630121 609245 589269 570068 551807 534837 519220
60873 519220 504491 490064 475842 462274 449821 438484 427933 417974 408712 400257 392441 384994
60861 384994 377872 371250 365195 359568 354273 349390 344917 340570 336062 331476 327197 323484 320279 317389
60847 317389 314691 312081 309414 306606 303764 301105 298652 296099 293068 289563 286025 282822 279815 276599
60833 276599 273109 269676 266507 263439 260327 257323 254573 251940 249301 246858 244820 242939 240809 238499
60819 238499 236498 235015 233739 232384 231083 230081 229339 228655 227960 227310 226730 226268 226085 226312 226907 227777 228919
60802 228919 230326 231850 233347 234868 236519 238164 239498 240462 241387 242588 243899 244802 245032 244927 245024 245419
$$ packed form
60895A222720o5273n9016n2943m7335m2629l8983l6171l3860l1940l0462k9288
60884G54820k8049k6516k4841k3303k1990k0876j9976j9201j8261j6970j5617
60873E19220j4729j4427j4222j3568j2453j1337j0551r959r262q455p816p447
60861C84994p122o622o055n627n295m883m473m347m508m586m279l713l205k890
60847C17389k698k610k667k808k842k659k453k553l031l505l538l203l007l216
60833B76599l490l433l169l068l112l004k750k633k639k443k038j881k130k310
60819B38499k001j483j276j355j301j002p42o84o95o50n80m62j83K27N95Q70J142
60802B28919J407J524J497J521J651J645J334R64R25J201J311R03K30j05R7L95
$$ plain form
60786 245419 245704 245544 245069 244517 243726 242270 240029 237353 234604 231847 229056 226369 223919 221605 219257
60771 219257 216932 214840 213014 211224 209234 207009 204657 202344 200239 198478 197083 195925 194793 193502
60757 193502 191999 190413 188922 187559 186193 184786 183567 182797 182403 181950 181024 179595 178001 176675 175889
60742 175889 175662 175817 176113 176364 176515 176679 177102 177947 179057 179992 180443 180529 180616 180855 181070 181093 181107 181507 182453 183634
60722 183634 184526 184878 184894 184955 185199 185453 185471 185097 184239 182901 181349 180040 179233 178769 178389 178113 178115 178338 178525
60703 178525 178601 178725 178950 179048 178819 178311 177635 176758 175673 174632 173992 173869 174095 174478 174937 175419 175847 176172 176391
60684 176391 176464 176299 175838 175154 174422 173806 173339 172912 172423 171897 171404 170880 170171 169307 168553 168091 167778 167392 167014
60665 167014 166963 167368 168035 168768 169668 170976 172689 174424 175694 176319 176572 176897 177427 177855 177829 177418 177094 177264
$$ packed form
60786B45419K85j60m75n52p91j456k241k676k749k757k791k687k450k314k348
60771B19257k325k092j826j790j990k225k352k313k105j761j395j158j132j291
60757A93502j503j586j491j363j366j407j219p70l94m53r26j429j594j326p86
60742A75889k27J55K96K51J51J64M23Q45J110R35M51Q6Q7K39K15K3J4M00R46J181
60722A83634Q92L52J6O1K44K54J8l74q58j338j552j309q07m64l80k76KK23J87
60703A78525P6J24K25R8k29n08o76q77j085j041o40j23K26L83M59M82M28L25K19
60684A76391P3j65m61o84p32o16m67m27m89n26m93n24p09q64p54m62l13l86l78
60665A67014n1M05O67P33R00J308J713J735J270O25K53L25N30M28k6m11l24J70
$$ plain form
60647 177264 177934 178834 179723 180521 181206 181685 181805 181469 180744 179813 178831 177862 176986 176298 175746 175093 174205 173276 172586
60628 172586 172121 171669 171245 171127 171416 171843 172163 172498 173116 174015 175002 176035 177229 178507 179515 179982 180027 179957
60610 179957 179846 179449 178591 177508 176669 176246 175913 175234 174189 173139 172365 171854 171520 171405 171557 171911 172410 173110
60592 173110 173960 174653 174926 174918 175056 175570 176309 177009 177523 177737 177463 176632 175514 174565 173986 173515 172723 171522 170304
60573 170304 169558 169436 169738 170218 170747 171167 171236 170856 170234 169717 169531 169757 170398 171313 172160 172647 172831 173062 173621
60554 173621 174516 175568 176572 177343 177782 177956 178039 178136 178264 178468 178874 179584 180558 181633 182610 183337 183794 184136
60536 184136 184601 185412 186670 188284 189943 191276 192178 192909 193767 194724 195517 196033 196436 196934 197593 198373 199232
60519 199232 200186 201336 202790 204406 205768 206663 207552 209226 211922 215079 218142 221290 225125 229826 234930
$$ packed form
60647A77264O70R00Q89P98O85M79J20l36p25r31r82r69q76o88n52o53q88r29o90
60628A72586m65m52m24j18K89M27L20L35O18Q99R87J033J194J278J008M67M5p0
60610A79957j11l97q58j083q39m23l33o79j045j050p74n11l34j15J52L54M99P00
60592A73110Q50O93K73qJ38N14P39P00N14K14k74q31j118r49n79m71p92j201j218
60573A70304p46j22L02M80N29M20O9l80o22n17j86K26O41R15Q47M87J84K31N59
60554A73621Q95J052J004P71M39J74Q3R7J28K04M06P10R74J075R77P27M57L42
60536A84136M65Q11J258J614J659J333R02P31Q58R57P93N16M03M98O59P80Q59
60519A99232R54J150J454J616J362Q95Q89J674K696L157L063L148L835M701N104
$$ plain form
60504 234930 239891 244540 248926 252998 256582 259586 262061 264049 265465 266205 266341 266139 265826 265433 264955 264615
60488 264615 264811 265779 267451 269668 272368 275545 279165 283304 288233 294232 301330 309306 317891 326917 336350
60473 336350 346229 356480 366683 376132 384219 390710 395559 398601 399567 398359 395205 390609 385273 379950
60459 379950 375148 370941 367113 363499 360087 356958 354339 352609 352038 352482 353539 355042 357248 360541 365135
60444 365135 371096 378417 387000 396760 407887 420762 435487 451653 468719 486444 504745 523321
60432 523321 541665 559365 576073 591249 604278 614973 623738 631127 637355 642279 645564 646697 645042
60419 645042 640114 631745 619925 604628 586024 564722 541604 517472 493028 469043 446235 424942
60407 424942 405207 387178 371096 356791 343589 330994 319247 308901 300018 292104 284757 278010
$$ packed form
60504B34930M961M649M386M072L584L004K475J988J416P40J36k02l13l93m78l40
60488B64615J96R68J672K217K700L177L620M139M929N999P098P976Q585R026R433
60473C36350R879J0251J0203R449Q087O491M849L042R66j208l154m596n336n323
60459C79950m802m207l828l614l412l129k619j730n71M44J057J503K206L293M594
60444C65135N961P321Q583R760J1127J2875J4725J6166J7066J7725J8301J8576
60432E23321J8344J7700J6708J5176J3029J0695Q765P389O228M924L285J133j655
60419F45042m928q369j1820j5297j8604k1302k3118k4132k4444k3985k2808k1293
60407D24942j9735j8029j6082j4305j3202j2595j1747j0346q883p914p347o747
$$ plain form
60395 278010 272022 266776 262175 258158 254565 251100 247618 244286 241305 238593 235962 233488 231464 229957
60381 229957 228627 227100 225410 223911 222799 221839 220636 219162 217852 217136 216953 216801 216246 215283 214225 213388
60365 213388 212905 212712 212600 212313 211701 210773 209666 208640 208060 208217 209011 209923 210435 210454 210296 210314 210663 211314 212134
60346 212134 212954 213691 214470 215522 216930 218502 219896 220849 221343 221623 222049 222858 224025 225387 226853 228398
60330 228398 229914 231230 232308 233307 234369 235484 236612 237809 239134 240487 241719 242844 244037 245420
60316 245420 246938 248402 249597 250404 250997 251833 253208 254780 255810 256012 255918 256199 256872 257527 258155 259305 261333
60299 261333 263928 266580 269209 272047 275110 278132 280966 283790 286880 290330 293960 297354 300043 301780
60285 301780 302668 302842 302175 300465 297823 294695 291497 288474 285792 283468 281210 278659 275901 273433 271510
$$ packed form
60395B78010n988n246m601m017l593l465l482l332k981k712k631k474k024j507
60381B29957j330j527j690j499j112r60j203j474j310p16j83j52n55r63j058q37
60365B13388m83j93j12k87o12r28j107j026n80J57P94R12N12J9j58J8L49O51Q20
60346B12134Q20P37P79J052J408J572J394R53M94K80M26Q09J167J362J466J545
60330B28398J516J316J078R99J062J115J128J197J325J353J232J125J193J383
60316B45420J518J464J195Q07N93Q36J375J572J030K02r4K81O73O55O28J150K028
60299B61333K595K652K629K838L063L022K834K824L090L450L630L394K689J737
60285C01780Q88J74o67j710k642l128l198l023k682k324k258k551k758k468j923
$$ plain form
60270 271510 269825 267987 266042 264236 262586 260996 259635 258804 258446 258168 257750 257404 257439 257959 258975 260595
60254 260595 262913 265869 269354 273370 277929 282869 287880 292752 297462 302015 306307 310212 313754 317084
60240 317084 320237 322948 324753 325228 324117 321319 316951 311432 305391 299334 293443 287705 282172 277019
60226 277019 272399 268323 264641 261136 257709 254515 251834 249760 248084 246508 244869 243108 241189 239197
60212 239197 237375 235919 234752 233651 232496 231300 230057 228770 227596 226766 226328 226100 225881 225589 225213 224803
60196 224803 224548 224701 225331 226235 227126 227805 228171 228209 228046 227909 227975 228359 229200 230610 232386 234001 235002 235406
60178 235406 235580 235829 236230 236770 237446 238198 238923 239622 240436 241464 242616 243737 244868 246278 248210 250589
60162 250589 253034 255176 256981 258750 260830 263350 266223 269321 272515 275601 278345 280765 283302 286507
$$ packed form
60270B71510j685j838j945j806j650j590j361q31l58k78m18l46L5N20J016J620
60254B60595K318K956L485M016M559M940N011M872M710M553M292L905L542L330
60240C17084L153K711J805M75j111k798m368n519o041o057n891n738n533n153
60226B77019m620m076l682l505l427l194k681k074j676j576j639j761j919j992
60212B39197j822j456j167j101j155j196j243j287j174q30m38k28k19k92l76m10
60196B24803k55J53O30R04Q91O79L66L8j63j37O6L84Q41J410J776J615J001M04
60178B35406J74K49M01N40O76P52P25O99Q14J028J152J121J131J410J932K379
60162B50589K445K142J805J769K080K520K873L098L194L086K744K420K537L205
$$ plain form
60148 286507 290453 294578 298199 301071 303351 305177 306594 307881 309537 311731 313977 315624 316554 317122 317568
60133 317568 317803 317760 317562 317251 316657 315743 314794 314051 313346 312399 311320 310491 310024 309661 309206 308729 308271 307684 306964
60114 306964 306425 306276 306211 305715 304649 303242 301625 299757 297839 296381 295633 295220 294585 293617 292645 291978 291677
60097 291677 291677 291839 291930 291800 291610 291727 292352 293364 294448 295236 295449 295164 294897 295136 295772 296272 296435 296636 297262
60078 297262 298281 299529 301036 302781 304392 305498 306236 307065 308151 309271 310248 311156 312104 313107 314230
60063 314230 315602 317203 318881 320676 322888 325697 328837 331805 334308 336429 338423 340444 342476 344426
60049 344426 346289 348166 350084 351850 353195 354027 354494 354802 355044 355167 355007 354420 353526 352754 352493 352671 352827
60032 352827 352572 351832 350686 349183 347409 345526 343618 341603 339396 337011 334400 331339 327641 323478 319328
$$ packed form
60148B86507L946M125L621K872K280J826J417J287J656K194K246J647R30N68M46
60133C17568K35m3j98l11n94r14r49p43p05r47j079q29m67l63m55m77m58n87p20
60114C06964n39j49o5m96j066j407j617j868j918j458p48m13o35r68r72o67l01
60097B91677%J62R1j30j90J17O25J012J084P88K13k85k67K39O36N00J63K01O26
60078B97262J019J248J507J745J611J106P38Q29J086J120R77R08R48J003J123
60063C14230J372J601J678J795K212K809L140K968K503K121J994K021K032J950
60049C44426J863J877J918J766J345Q32M67L08K42J23j60n87q94p72k61J78J56
60032C52827k55p40j146j503j774j883j908k015k207k385k611l061l698m163m150
$$ plain form
60017 319328 315578 312177 308739 304959 300950 297146 293873 291052 288382 285761 283396 281480 279869 278177
60003 278177 276176 274042 272196 270840 269709 268345 266655 265037 263877 263121 262517 262076 261987 262154 262231 262182 262466
59986 262466 263451 264867 266110 266949 267676 268617 269705 270575 270912 270677 270076 269409 268910 268630 268402 267913 266959 265688
59968 265688 264488 263537 262569 261258 259692 258213 256827 255139 252934 250459 248008 245570 243177 241273 240291
59953 240291 239997 239656 238877 237959 237322 236936 236499 235911 235292 234663 233874 232878 231858 231012 230332 229708 229128 228662
59935 228662 228273 227834 227354 227023 226968 227103 227341 227814 228696 229880 231072 232176 233356 234695 236006 237079 237896
59918 237896 238519 238930 239129 239231 239334 239384 239311 239169 238996 238653 237987 237061 236060 235037 233957 232975 232444 232564
59900 232564 233131 233684 233834 233487 232862 232343 232235 232585 233201 233816 234186 234133 233653 232962 232374 232094 232172 232595 233297
$$ packed form
60017C19328l750l401l438l780m009l804l273k821k670k621k365j916j611j692
60003B78177k001k134j846j356j131j364j690j618j160p56o04m41q9J67P7m9K84
59986B62466R85J416J243Q39P27R41J088Q70L37k35o01o67m99k80k28m89r54j271
59968B65688j200r51r68j311j566j479j386j688k205k475k451k438k393j904r82
59953B40291k94l41p79r18o37l86m37n88o19o29p89r96j020q46o80o24n80m66
59935B28662l89m39m80l31n5J35K38M73Q82J184J192J104J180J339J311J073Q17
59918B37896O23M11J99J02J03N0p3j42j73l43o66r26j001j023j080r82n31J20
59900B32564N67N53J50l47o25n19j08L50O16O15L70n3m80o91n88k80P8M23P02
$$ plain form
59881 233297 234079 234658 234909 235009 235297 235976 236987 238147 239361 240670 242138 243716 245301 246877 248544 250410
59865 250410 252469 254593 256568 258137 259128 259648 260075 260790 261862 263052 264088 264915 265689 266577 267584 268542
59849 268542 269299 269867 270362 270801 271077 271118 271035 271024 271181 271440 271648 271693 271606 271546 271668 272015 272577 273425 274657 276211
59829 276211 277827 279273 280546 281823 283290 285033 287014 289117 291249 293401 295566 297662 299644 301634
59815 301634 303783 306006 308037 309824 311628 313615 315532 316948 317725 318088 318307 318475 318545 318465 318291 318210 318398
59798 318398 318834 319303 319653 319951 320357 320948 321738 322714 323758 324688 325536 326638 328261 330215 331995 333207 333728
59781 333728 333567 332835 331863 331108 330861 331097 331570 331936 331849 331132 329870 328293 326531 324656 322870 321478 320566
59764 320566 319832 318877 317605 316298 315313 314727 314296 313738 312981 312093 311082 309941 308881 308261 308123 308003 307375
$$ packed form
59881B33297P82N79K51J00K88O79J011J160J214J309J468J578J585J576J667J866
59865B50410K059K124J975J569R91N20M27P15J072J190J036Q27P74Q88J007R58
59849B68542P57N68M95M39K76M1q3j1J57K59K08M5q7o0J22L47N62Q48J232J554
59829B76211J616J446J273J277J467J743J981K103K132K152K165K096J982J990
59815C01634K149K223K031J787J804J987J917J416P77L63K19J68P0q0j74q1J88
59798C18398M36M69L50K98M06N91P90R76J044R30Q48J102J623J954J780J212N21
59781C33728j61p32r72p55k47K36M73L66q7p17j262j577j762j875j786j392r12
59764C20566p34r55j272j307r85n86m31n58p57q88j011j141j060o20j38j20o28
$$ plain form
59747 307375 306184 304773 303384 301959 300394 298752 297190 295758 294323 292615 290460 288035 285807 284046
59733 284046 282517 280802 278856 277025 275581 274476 273525 272614 271682 270717 269827 269119 268503 267782 266999 266513 266622
59716 266622 267293 268294 269462 270724 272036 273390 274832 276370 277972 279646 281463 283435 285527 287768
59702 287768 290216 292757 295123 297235 299376 301919 304957 308288 311639 314803 317654 320232 322736 325298
59688 325298 327746 329673 330795 331180 331173 331136 331222 331347 331375 331351 331502 331985 332710 333455 334051 334409 334452 334169 333703 333265
59668 333265 332973 332870 333053 333659 334654 335771 336730 337472 338109 338723 339309 339864 340396 340879 341304 341819 342668 343974
59650 343974 345662 347647 349966 352625 355453 358234 360936 363644 366362 369011 371585 374142 376643 378932
59636 378932 380851 382244 382967 383095 383073 383369 383961 384460 384688 384834 384920 384589 383602 382231 380851 379419 377688
$$ packed form
59747C07375j191j411j389j425j565j642j562j432j435j708k155k425k228j761
59733B84046j529j715j946j831j444j105r51r11r32r65q90p08o16p21p83m86J09
59716B66622O71J001J168J262J312J354J442J538J602J674J817J972K092K241
59702B87768K448K541K366K112K141K543L038L331L351L164K851K578K504K562
59688C25298K448J927J122L85pl7Q6J25K8k4J51M83P25P45N96L58M3k83m66m38
59668C33265k92j03J83O06R95J117R59P42O37O14N86N55N32M83M25N15Q49J306
59650C43974J688J985K319K659K828K781K702K708K718K649K574K557K501K289
59636C78932J919J393P23J28k2K96N92M99K28J46Q6l31r87j371j380j432j731
$$ plain form
59619 377688 375703 373695 371611 369149 366210 363032 359917 357096 354810 353193 352033 350933 349743 348653
59605 348653 347873 347457 347420 347807 348590 349690 351098 352841 354803 356804 358788 360762 362612 364198 365583 366872
59589 366872 367862 368178 367725 366684 365031 362471 358985 355032 351004 346780 342091 337075 332148 327520 323130
59574 323130 318978 315190 311745 308392 304917 301352 297844 294418 290952 287361 283753 280324 277129 274056
59560 274056 271060 268305 265919 263732 261417 258886 256374 254161 252426 251291 250774 250659 250622 250541 250505 250510 250366
59543 250366 249992 249573 249360 249473 249934 250656 251346 251661 251595 251533 251800 252322 252820 253150 253350 253508 253678 253801 253668
59524 253668 253131 252383 251771 251275 250453 249029 247264 245628 244338 243375 242674 242086 241422 240763 240495 240748 241050
59507 241050 240834 240158 239602 239596 240107 240872 241631 242152 242322 242255 242170 242191 242404 242899 243567 244059 244229 244518 245537 247340
$$ packed form
59619C77688j985k008k084k462k939l178l115k821k286j617j160j100j190j090
59605C48653p80m16l7L87P83J100J408J743J962K001J984J974J850J586J385J289
59589C66872R90L16m53j041j653k560l486l953m028m224m689n016m927m628m390
59574C23130m152l788l445l353l475l565l508l426l466l591l608l429l195l073
59560B74056k996k755k386k187k315k531k512k213j735j135n17j15l7q1l6Nj44
59543B50366l74m19k13J13M61P22O90L15o6o2K67N22M98L30K00J58J70J23j33
59524B53668n37p48o12m96q22j424j765j636j290r63p01n88o64o59k68K53L02
59507B41050k16o76n56oN11P65P59N21J70o7q5K1K13M95O68M92J70K89J019J803
$$ plain form
59487 247340 249461 251613 253977 256768 259938 263453 267505 272259 277608 283373 289474 295623 301012 304632
59473 304632 306033 305656 304451 303238 302363 301774 301336 301059 301001 301045 300945 300661 300458 300498 300448 299754 298302 296560
59455 296560 294934 293250 291106 288524 285926 283501 280982 278161 275234 272443 269710 266943 264435 262542
59441 262542 261114 259695 258225 257083 256378 255701 254765 253845 253356 253349 253673 254360 255500 256951 258453 259878 261157
59424 261157 262138 262784 263375 264241 265432 266807 268278 269703 270763 271326 271806 272768 274257 275802 277083 278166
59408 278166 279092 279617 279573 279228 279095 279477 280323 281373 282415 283472 284798 286606 288754 290839 292595 294113
59392 294113 295611 297143 298588 299860 301037 302257 303493 304505 305086 305318 305424 305359 304770 303495 301888 300494
59376 300494 299568 299068 298915 299018 299209 299445 299993 301160 302858 304725 306613 308713 311226 314197 317695 321838
$$ packed form
59487B47340K121K152K364K791L170L515M052M754N349N765O101O149N389L620
59473C04632J401l77j205j213q75n89m38k77n8M4j00k84k03M0n0o94j452j742
59455B96560j626j684k144k582k598k425k519k821k927k791k733k767k508j893
59441B62542j428j419j470j142p05o77r36r20m89pL24O87J140J451J502J425J279
59424B61157R81O46N91Q66J191J375J471J425J060N63M80R62J489J545J281J083
59408B78166R26N25m4l45j33L82Q46J050J042J057J326J808K148K085J756J518
59392B94113J498J532J445J272J177J220J236J012N81K32J06o5n89j275j607j394
59376C00494r26n00j53J03J91K36N48J167J698J867J888K100K513K971L498M143
$$ plain form
59360 321838 326571 331660 336993 342697 348894 355581 362881 371176 380685 390833 400167 407064 410694 411452
59346 411452 410512 408933 407166 405279 403412 401959 401500 402584 405229 408431 410454 410014 407099 402474 396692
59331 396692 389993 382884 376165 370274 365086 360479 356706 353986 352073 350452 348784 347035 345373 344071
59317 344071 343301 342950 342739 342578 342602 342856 343220 343670 344342 345254 346230 347190 348262 349531 350925 352451 354256
59300 354256 356383 358766 361556 365078 369290 373617 377609 381450 385578 390085 394788 399627 404606 409519
59286 409519 414126 418520 422992 427571 431949 435791 438910 441196 442650 443422 443559 442817 440989 438321 435287
59271 435287 431985 428093 423432 418215 412707 406952 400987 395003 389133 383295 377448 371811 366598 361675
59257 361675 356705 351595 346598 342015 337920 334192 330725 327553 324821 322592 320711 318946 317318 316159
$$ packed form
59360C21838M733N089N333N704O197O687P300Q295R509J0148R334O897L630P58
59346D11452r40j579j767j887j867j453m59J084K645L202K023m40k915m625n782
59331C96692o699p109o719n891n188m607l773k720j913j621j668j749j662j302
59317C44071p70l51k11j61K4K54L64M50O72R12R76R60J072J269J394J526J805
59300C54256K127K383K790L522M212M327L992L841M128M507M703M839M979M913
59286D09519M607M394M472M579M378L842L119K286J454P72J37p42j828k668l034
59271D35287l302l892m661n217n508n755n965n984n870n838n847n637n213m923
59257C61675m970n110m997m583m095l728l467l172k732k229j881j765j628j159
$$ plain form
59243 316159 315713 315819 316195 316943 318574 321493 325638 330577 335624 339739 341733 341037 338271 334779 331544
59228 331544 328717 326058 323482 321046 318815 316953 315788 315510 315944 316805 318051 319794 321999 324556 327562
59213 327562 331180 335220 339182 342830 346460 350458 354779 359058 363064 366780 370072 372575 374061 374806
59199 374806 375433 376310 377178 377484 377021 376119 375184 374212 372901 371131 369177 367406 365917 364513 363001 361489
59183 361489 360357 359822 359561 358947 357754 356463 355675 355404 355118 354383 353152 351536 349593 347398 345038 342483
59167 342483 339635 336560 333484 330500 327478 324313 321102 318001 315104 312536 310465 308920 307737 306760
59153 306760 305961 305317 304713 304094 303585 303338 303411 303819 304571 305569 306615 307615 308650 309743 310735 311523 312289 313298
59135 313298 314550 315795 316856 317766 318645 319533 320388 321155 321821 322404 322927 323354 323620 323710 323665 323462 322956 321979
$$ packed form
59243C16159m46J06L76P48J631K919M145M939N047M115J994o96k766l492l235
59228C31544k827k659k576k436k231j862j165k78M34Q61J246J743K205K557L006
59213C27562L618M040L962L648L630L998M321M279M006L716L292K503J486P45
59199C74806O27Q77Q68L06m63r02r35r72j311j770j954j771j489j404j512j512
59183C61489j132n35k61o14j193j291p88k71k86p35j231j616j943k195k360k555
59167C42483k848l075l076k984l022l165l211l101k897k568k071j545j183r77
59153C06760p99o44o04o19n09k47P3M08P52R98J046J000J035J093R92P88P66J009
59135C13298J252J245J061R10Q79Q88Q55P67O66N83N23M27K66R0m5k03n06r77
$$ plain form
59117 321979 320508 318732 316958 315424 314161 313038 311921 310729 309352 307701 305908 304334 303248 302574
59103 302574 302077 301632 301161 300476 299425 298141 296872 295667 294413 293085 291731 290280 288653 286976 285385
59088 285385 283720 281778 279779 278149 276848 275348 273367 271188 269129 267148 265153 263306 261765 260433
59074 260433 259249 258433 258162 258302 258684 259419 260644 262200 263806 265369 266910 268421 270113 272518 275968
59059 275968 280114 284266 288154 292059 296332 301033 305984 310910 315548 319799 323761 327490 330894 333958
59045 333958 336876 339704 342090 343629 344357 344619 344568 344133 343382 342595 341955 341382 340700 339775 338542 337076 335600
59028 335600 334262 332985 331695 330512 329501 328360 326672 324362 321648 318632 315301 311860 308693 305935
59014 305935 303380 300863 298461 296249 294140 292112 290337 288938 287755 286503 285037 283423 281808 280312
$$ packed form
59117C21979j471j776j774j534j263j123j117j192j377j651j793j574j086o74
59103C02574m97m45m71o85j051j284j269j205j254j328j354j451j627j677j591
59088B85385j665j942j999j630j301j500j981k179k059j981j995j847j541j332
59074B60433j184q16k71J40L82P35J225J556J606J563J541J511J692K405L450
59059B75968M146M152L888L905M273M701M951M926M638M251L962L729L404L064
59045C33958K918K828K386J539P28K62n1m35p51p87o40n73o82r25j233j466j476
59028C35600j338j277j290j183j011j141j688k310k714l016l331l441l167k758
59014C05935k555k517k402k212k109k028j775j399j183j252j466j614j615j496
$$ plain form
59000 280312 278967 277737 276632 275733 275029 274322 273420 272365 271304 270255 269198 268332 267973 268154 268546 268837
58984 268837 268976 269017 268943 268754 268612 268748 269229 269913 270589 271206 271986 273188 274711 276049 276816 277256 278049 279662
58966 279662 282039 284868 287947 291260 294885 298904 303283 307853 312430 316881 320966 324276 326507 327761
58952 327761 328374 328561 328427 328196 328080 327931 327379 326420 325593 325428 325956 326864 327910 328991 330037 331032 332039
58935 332039 333019 333723 333935 333755 333465 333136 332556 331545 330227 328929 327902 327175 326624 326102 325603 325384 325912
58918 325912 327537 330129 333144 336150 339236 342786 346963 351568 356325 361036 365438 369197 372200 374661
58904 374661 376843 378837 380707 382557 384248 385313 385406 384704 383575 382026 379768 376720 373116 369137 364760
58889 364760 360024 355171 350439 345886 341500 337330 333458 329992 327092 324850 323113 321586 320143 318901
$$ packed form
59000B80312j345j230j105q99p04p07r02j055j061j049j057q66l59J81L92K91
58984B68837J39M1p4j89j42J36M81O84O76O17P80J202J523J338P67M40P93J613
58966B79662K377K829L079L313L625M019M379M570M577M451M085L310K231J254
58952C27761O13J87j34k31j16j49n52r59q27j65N28R08J046J081J046R95J007
58935C32039R80P04K12j80k90l29n80j011j318j298j027p27n51n22m99k19N28
58918C25912J625K592L015L006L086L550M177M605M757M711M402L759L003K461
58904C74661K182J994J870J850J691J065R3p02j129j549k258l048l604l979m377
58889C64760m736m853m732m553m386m170l872l466k900k242j737j527j443j242
$$ plain form
58875 318901 317966 317237 316556 315886 315266 314663 313981 313207 312503 312083 311961 311833 311361 310563 309807 309357 309104 308866 308769
58856 308769 309135 310042 311230 312373 313351 314255 315270 316568 318258 320431 323156 326322 329602 332822 336337
58841 336337 340659 345670 350596 354944 359046 363409 367958 372348 376699 381472 386760 392201 397516 402728
58827 402728 407909 413118 418506 424117 429560 434293 438195 441511 444291 446290 447393 447790 447687 447205 446545
58812 446545 445860 444939 443421 441379 439311 437497 435717 433659 431216 428303 424827 420962 417104 413358 409413
58797 409413 405019 400248 395158 389583 383483 377216 371232 365750 360859 356611 352831 349099 345163 341147
58783 341147 337184 333100 328688 324089 319690 315791 312511 309824 307549 305456 303554 302121 301318 300898 300431
58768 300431 299703 298807 298017 297601 297619 297826 297919 297916 298116 298718 299694 300989 302493 303806 304431 304353 304108 304137 304332 304329
$$ packed form
58875C18901r35p29o81o70o20o03o82p74p04m20j22j28m72p98p56m50k53k38r7
58856C08769L66R07J188J143R78R04J015J298J690K173K725L166L280L220L515
58841C36337M322N011M926M348M102M363M549M390M351M773N288N441N315N212
58827D02728N181N209N388N611N443M733L902L316K780J999J103L97j03m82o60
58812D46545o85r21j518k042k068j814j780k058k443k913l476l865l858l746l945
58797D09413m394m771n090n575o100o267n984n482m891m248l780l732l936m016
58783C41147l963m084m412m599m399l899l280k687k275k093j902j433q03m20m67
58768C00431p28q96p90m16J8K07R3lK00O02R76J295J504J313O25p8k45K9J95l
$$ plain form
58748 304329 303944 303189 302161 301051 299983 298727 296901 294555 292186 290059 287914 285597 283502 282007 280838
58733 280838 279441 277771 276265 275220 274597 274355 274559 275174 276049 277135 278524 280285 282379 284677 286916
58718 286916 288819 290428 292186 294438 296936 299027 300238 300528 300093 299167 297921 296337 294232 291557 288603
58703 288603 285758 283138 280619 278154 275881 273949 272401 271205 270291 269582 269072 268788 268681 268632 268618 268740 269004
58686 269004 269266 269484 269852 270587 271670 272920 274194 275455 276770 278344 280352 282663 284893 286827 288625
58671 288625 290527 292543 294561 296552 298518 300362 301964 303295 304348 305144 305858 306791 308085 309581 311041
58656 311041 312398 313735 315173 316797 318514 319937 320629 320497 319776 318612 316939 314736 312057 308777 304641
58641 304641 299669 294195 288421 282273 275832 269511 263626 258135 252973 248308 244258 240694 237514 234790
$$ packed form
58748C04329l85p55j028j110j068j256j826k346k369k127k145k317k095j495j169
58733B80838j397j670j506j045o23k42K04O15Q75J086J389J761K094K298K239
58718B86916J903J609J758K252K498K091J211K90m35r26j246j584k105k675k954
58703B88603k845k620k519k465k273j932j548j196r14p09n10k84j07m9j4J22K64
58686B69004K62K18L68P35J083J250J274J261J315J574K008K311K230J934J798
58671B88625J902K016K018J991J966J844J602J331J053P96P14R33J294J496J460
58656C11041J357J337J438J624J717J423O92j32p21j164j673k203k679l280m136
58641C04641m972n474n774o148o441o321n885n491n162m665m050l564l180k724
$$ plain form
58627 234790 232478 230317 228198 226310 224760 223416 222292 221581 221084 220190 218789 217668 217504 217907 218048 217863
58611 217863 218004 218868 220297 222065 224066 226089 227966 229937 232396 235267 237995 240136 241593 242366 242440
58596 242440 241914 240923 239492 237727 235982 234512 233067 231207 228912 226546 224345 222345 220659 219420 218491
58581 218491 217640 216966 216709 216706 216479 215918 215482 215600 216154 216678 216798 216444 215837 215305 214978 214685 214292 213932 213721
58562 213721 213450 212901 212305 212108 212389 212860 213361 214013 214958 216264 217982 219933 221571 222485 222997 223809 225122
58545 225122 226532 227780 229106 230685 232210 233251 233789 234172 234752 235646 236718 237687 238411 239065 239944 241162
58529 241162 242737 244797 247421 250386 253410 256616 260380 264753 269322 273697 277812 281733 285509 289239
58515 289239 293012 296714 300134 303275 306373 309596 313006 316824 321385 326800 332864 339367 346268 353557
$$ packed form
58627B34790k312k161k119j888j550j344j124p11m97q94j401j121j64M03J41j85
58611B17863J41Q64J429J768K001K023J877J971K459K871K728K141J457P73P4
58596B42440n26r91j431j765j745j470j445j860k295k366k201k000j686j239r29
58581B18491q51o74k57lk27n61m36J18N54N24J20l54o07n32l27k93l93l60k11
58562B13721k71n49n96j97K81M71N01O52R45J306J718J951J638R14N12Q12J313
58545B25122J410J248J326J579J525J041N38L83N80Q94J072R69P24O54Q79J218
58529B41162J575K060K624K965L024L206L764M373M569M375M115L921L776L730
58515B89239L773L702L420L141L098L223L410L818M561N415O064O503O901P289
$$ plain form
58501 353557 361182 369089 377056 384521 390896 396104 400533 404360 407225 408671 408654 407471 405403 402640 399458
58486 399458 396257 393307 390441 387093 382771 377537 371898 366222 360435 354292 347712 340746 333544 326498
58472 326498 320118 314515 309255 303983 298918 294488 290762 287540 284692 282054 279283 276261 273447 271399
58458 271399 270129 269266 268617 268104 267419 266294 265013 264128 263701 263297 262671 262015 261526 261184 260954 260835 260703 260437
58440 260437 260183 260174 260369 260597 260927 261543 262354 263143 263998 265199 266794 268659 270852 273500 276414 279294 282245
58423 282245 285657 289613 293835 298160 302687 307441 312280 317060 321562 325372 328159 329982 330988 331050 330092
58408 330092 328530 326896 325191 323092 320663 318410 316754 315855 315740 316130 316445 316540 317155 319071 322054 325252
58392 325252 328297 331288 333984 335874 336919 337397 337124 335679 333334 330881 328549 325980 323271 321101 319643
$$ packed form
58501C53557P625P907P967P465O375N208M429L827K865J446j7j183k068k763l182
58486C99458l201k950k866l348m322n234n639n676n787o143o580o966p202p046
58472C26498o380n603n260n272n065m430l726l222k848k638k771l022k814k048
58458B71399j270q63o49n13o85j125j281q85m27m04o26o56m89l42k30j19j32k66
58440B60437k54rJ95K28L30O16Q11P89Q55J201J595J865K193K648K914K880K951
58423B82245L412L956M222M325M527M754M839M780M502L810K787J823J006O2r58
58408C30092j562j634j705k099k429k253j656q99j15L90L15R5O15J916K983L198
58392C25252L045K991K696J890J045M78k73j445k345k453k332k569k709k170j458
$$ plain form
58377 319643 318255 316516 314831 313721 313183 312996 313046 313164 313268 313726 314963 316651 318011 318940 320096 321752
58361 321752 323415 324686 325660 326248 325993 324877 323533 322313 320870 318989 317055 315326 313438 311084 308611
58346 308611 306593 305322 304928 305375 306088 306245 305789 305563 306187 307365 308533 309572 310599 311647 312824 314259
58330 314259 315741 316934 318066 319699 321803 323795 325604 327833 330695 333664 336393 339071 341638 343607
58316 343607 345030 346702 348968 351230 353066 354946 357305 359791 361960 363986 366131 368256 370409 373144
58302 373144 376740 380723 384611 388503 392521 396449 400284 404394 408678 412368 415131 417592 420320 423094
58288 423094 425596 427996 430352 432300 433898 435965 439021 442656 446422 450532 455195 460106 465125 470599
58274 470599 476493 482100 487120 492095 497239 501846 505461 508642 511910 514948 517549 520326 523700 527142
$$ packed form
58377C19643j388j739j685j110n38j87N0J18J04M58J237J688J360R29J156J656
58361C21752J663J271R74N88k55j116j344j220j443j881j934j729j888k354k473
58346C08611k018j271l94M47P13J57m56k26O24J178J168J039J027J048J177J435
58330C14259J482J193J132J633K104J992J809K229K862K969K729K678K567J969
58316C43607J423J672K266K262J836J880K359K486K169K026K145K125K153K735
58302C73144L596L983L888L892M018L928L835M110M284L690K763K461K728K774
58288D23094K502K400K356J948J598K067L056L635L766M110M663M911N019N474
58274D70599N894N607N020M975N144M607L615L181L268L038K601K777L374L442
$$ plain form
58260 527142 530179 533240 536752 540369 543903 548033 553273 559188 565406 572371 580240 588134 595427 602783
58246 602783 610924 619412 627673 636195 645584 655323 664600 673530 682535 691366 699816 708559 718214 728368
58232 728368 738464 748803 759737 770849 781938 793772 806805 820176 833135 846422 861052
58221 861052 876699 892509 908542 925236 942411 959981 978696 998974 1020017 1041181 1063153
58210 1063153 1086639 1111121 1136163 1162676 1191557 1222334 1254489 1288768 1325727 1364338 1403581
58199 1403581 1444038 1486336 1529492 1572582 1616637 1663074 1711626 1761718 1814464 1871293 1931921
58188 1931921 1995734 2063823 2137562 2216485 2299665 2387846 2482055 2581550 2685366 2794567 2910731
58177 2910731 3033740 3163341 3301365 3449912 3608866 3777606 3957410 4149610 4353209
$$ packed form
58260E27142L037L061L512L617L534M130N240N915O218O965P869P894P293P356
58246F02783Q141Q488Q261Q522R389R739R277Q930R005Q831Q450Q743R655J0154
58232G28368J0096J0339J0934J1112J1089J1834J3033J3371J2959J3287J4630
58221H61052J5647J5810J6033J6694J7175J7570J8715K0278K1043K1164K1972
58210A063153K3486K4482K5042K6513K8881L0777L2155L4279L6959L8611L9243
58199A403581M0457M2298M3156M3090M4055M6437M8552N0092N2746N6829O0628
58188A931921O3813O8089P3739P8923Q3180Q8181R4209R9495J03816J09201J16164
58177B910731J23009J29601J38024J48547J58954J68740J79804J92200K03599
$$ plain form
58168 4353209 4567123 4793018 5033186 5287743 5557025 5844708 6155230 6490086 6849603
58159 6849603 7235565 7648353 8084241 8540035 9018378 9524837 10062853 10635895 11250891
58150 11250891 11913878 12625355 13385853 14203316 15089676 16054632 17110306 18278388 19584872
58141 19584872 21051438 22700184 24562574 26675018 29072033 31795518 34904212 38458497
58133 38458497 42499040 47053555 52158765 57867007 64256147 71452663 79565335 88423326
58125 88423326 97266237 104762974 109534102 110839062 108870849 104469403 98587072 91941056
58117 91941056 84973174 77955894 71081926 64500214 58320318 52605042 47371464 42611603
58109 42611603 38314664 34468314 31047899 28016609 25335377 22966230 20870052 19010536
$$ packed form
58168D353209K13914K25895K40168K54557K69282K87683L10522L34856L59517
58159F849603L85962M12788M35888M55794M78343N06459N38016N73042O14996
58150A1250891O62987P11477P60498Q17463Q86360R64956J055674J168082J306484
58141A9584872J466566J648746J862390K112444K397015K723485L108694L554285
58133C8458497M040543M554515N105210N708242O389140P196516Q112672Q857991
58125H8423326Q842911P496737M771128J304960j968213m401446n882331o646016
58117I1941056o967882p017280o873968o581712o179896n715276n233578m759861
58109D2611603m296939l846350l420415l031290k681232k369147k096178j859516
$$ plain form
58101 19010536 17360436 15898584 14602513 13449297 12421158 11504160 10682903 9941988
58093 9941988 9271299 8664567 8113676 7609022 7144365 6716708 6322142 5955974 5616045
58084 5616045 5301845 5010902 4739638 4487022 4253781 4038669 3838737 3652468 3479282
58075 3479282 3316619 3160889 3010945 2867780 2731407 2600880 2476701 2360209 2250854
58066 2250854 2146752 2047488 1953857 1865409 1780872 1700538 1625679 1555987 1489999 1427605 1369684
58055 1369684 1315652 1263828 1213922 1166793 1122073 1078379 1035709 995292 957172 920144 883980
58044 883980 849580 816931 784964 753492 723399 694898 667430 641223 617133 594970 573700
58033 573700 553266 534514 517393 500980 485209 470882 457987 445646 433696 422685 412326
$$ packed form
58101A9010536j650100j461852j296071j153216j028139r16998q21257p40915
58093I941988o70689o06732n50891n04654m64657m27657l94566l66168l39929
58084E616045l14200k90943k71264k52616k33241k15112j99932j86269j73186
58075C479282j62663j55730j49944j43165j36373j30527j24179j16492j09355
58066B250854j04102r9264r3631q8448q4537q0334p4859o9692o5988o2394n7921
58055A369684n4032n1824m9906m7129m4720m3694m2670m0417l8120l7028l6164
58044H83980l4400l2649l1967l1472l0093k8501k7468k6207k4090k2163k1270
58033E73700k0434j8752j7121j6413j5771j4327j2895j2341j1950j1011j0359
$$ plain form
58022 412326 401626 390567 380103 370453 360953 351622 343264 335902 328602 321050 313878 307329 300925
58009 300925 294598 288840 283628 278455 273484 269428 266245 263139 259839 256705 253682 250392 247171 244669
57995 244669 242544 239854 236707 234123 232283 230329 227900 225499 223241 220645 217812 215447 213545 211306
57981 211306 208520 205752 203031 199706 195780 192113 189052 186124 183295 181146 179501 177235 173928 170463
57967 170463 167549 164823 161900 159179 156995 154974 152818 150913 149631 148795 148221 148055 148238 148331 148159 147937
57951 147937 147613 146833 145708 144786 144179 143483 142652 142065 141678 141052 140255 139798 139637 139280 138871 139008 139359 138795
57933 138795 137195 135843 135549 135618 135211 134571 134232 134067 133880 134045 134728 135225 134825 133786 132816 132165 131733 131527
57915 131527 131461 131197 130662 130283 130330 130497 130421 130109 129585 128712 127664 126982 126885 127005 127028 126990 126818 126287 125600 125280
$$ packed form
58022D12326j0700j1059j0464r650r500r331q358p362p300p552p172o549o404
58009C00925o327n758n212n173m971m056l183l106l300l134l023l290l221k502
57995B44669k125k690l147k584j840j954k429k401k258k596k833k365j902k239
57981B11306k786k768k721l325l926l667l061k928k829k149j645k266l307l465
57967A70463k914k726k923k721k184k021k156j905j282q36n74j66J83R3j72k22
57951A47937l24p80j125r22o07o96q31n87l87o26p97m57j61l57m09J37L51n64
57933A38795j600j352k94O9m07o40l39j65j87J65O83M97m00j039r70o51m32k06
57915A31527o6k64n35l79M7J67p6l12n24q73j048o82r7J20K3l8j72n31o87l20
$$ plain form
57895 125280 125249 124807 123767 122778 122196 121480 120158 118629 117481 116713 116069 115539 115087 114517 113985 114063 114915 116038
57877 116038 117106 118403 120061 121642 122897 124228 125933 127624 128854 129651 130021 129652 128602 127529 126717
57862 126717 125573 123678 121609 120057 118801 117282 115609 114186 112858 111243 109593 108583 108421 108774 109363
57847 109363 110071 110692 111088 111392 111681 111694 111215 110454 109718 109037 108415 108040 107919 107714 107303 107053 107215 107504 107642
57828 107642 107803 108144 108447 108658 109228 110401 111703 112662 113495 114523 115451 115922 116253 116915 117642 117876 117733 117776
57810 117776 118046 118080 117751 117382 117133 116939 116987 117608 118649 119517 119904 120038 120245 120665 121384 122400 123444 124148
57792 124148 124448 124553 124618 124679 124786 124903 124820 124439 124015 123873 123992 124143 124221 124216 124037 123648 123207 122847 122501 122154 122017
57771 122017 122216 122569 122887 123269 123868 124661 125609 126721 127744 128226 128175 128215 128732 129273 129141 128231 126852 125210
$$ packed form
57895A25280l1m42j040r89n82p16j322j529j148p68o44n30m52n70n32P8Q52J123
57877A16038J068J297J658J581J255J331J705J691J230P97L70l69j050j073q12
57862A26717j144j895k069j552j256j519j673j423j328j615j650j010j62L53N89
57847A09363P08O21L96L04K89J3m79p61p36o81o22l75j21k05m11k50J62K89J38
57828A07642J61L41L03K11N70J173J302R59Q33J028R28M71L31O62P27K34j43M3
57810A17776K70L4l29l69k49j94M8O21J041Q68L87J34K07M20P19J016J044P04
57792A24148L00J05O5O1J07J17q3l81m24j42J19J51P8nj79l89m41l60l46l47j37
57771A22017J99L53L18L82N99P93R48J112J023M82n1M0N17N41j32r10j379j642
$$ plain form
57753 125210 123488 122063 120999 119659 117378 114372 111464 109104 107161 105459 103975 102548 100928 99121
57739 99121 97365 95794 94415 93282 92384 91512 90522 89585 88918 88449 88006 87616 87361 87236 87404 88234 89720
57722 89720 91202 92086 92547 93149 94127 95488 97426 100035 102783 104893 106133 106811 107181 107324 107424 107670 107947
57705 107947 108029 107971 107918 107771 107433 107187 107366 107832 108239 108611 109138 109622 109680 109436 109467 110123 111298 112839 114679
57686 114679 116605 118322 119719 120811 121485 121657 121526 121328 120985 120329 119466 118549 117421 115952 114458 113298
57670 113298 112251 110838 109103 107524 106292 105252 104468 104208 104372 104444 104123 103571 103045 102684 102610 102819 103027
57653 103027 102971 102820 102879 103049 103014 102830 102859 103196 103619 104013 104386 104588 104516 104467 104812 105419 105935 106446 107275 108226 108732
57632 108732 108761 108874 109341 109794 109870 109616 109124 108333 107416 106881 107073 107918 109220 110853 112632 114442 116564 119501
$$ packed form
57753A25210j722j425j064j340k281l006k908k360j943j702j484j427j620j807
57739I9121j756j571j379j133q98q72r90r37o67m69m43l90k55j25J68Q30J486
57722H9720J482Q84M61O02R78J361J938K609K748K110J240O78L70J43J00K46K77
57705A07947Q2n8n3j47l38k46J79M66M07L72N27M84N8k44L1O56J175J541J840
57686A14679J926J717J397J092O74J72j31j98l43o56q63r17j128j469j494j160
57670A13298j047j413j735j579j232j040p84k60J64P2l21n52n26l61p4K09K08
57653A03027n6j51N9J70l5j84K9L37M23L94L73K02p2m9L45O07N16N11Q29R51N06
57632A08732K9J13M67M53P6k54m92p91r17n35J92Q45J302J633J779J810K122K937
$$ plain form
57614 119501 123472 128431 134490 141869 150464 160005 170586 182521 195586 208833 221047 230907 236959
57601 236959 238216 234940 228247 218977 207593 195049 182754 171408 160677 150342 141006 133300 127059
57588 127059 121781 117305 113590 110313 107211 104480 102438 101087 100315 100191 100723 101558 102151 102077 101176 99784
57572 99784 98778 98817 99443 99531 98744 97841 97372 96891 95853 94518 93369 92257 90822 89256 87980 86941 85874
57555 85874 84932 84431 84198 83845 83476 83512 83898 84095 83810 83276 82777 82334 81898 81517 81254 81178 81365 81693 81785 81400
57535 81400 80747 80109 79344 78103 76427 74757 73385 72212 71050 69901 68943 68416 68493 69033 69546 69608 69244
57518 69244 68725 68087 67138 65847 64505 63458 62852 62632 62608 62524 62201 61655 61020 60407 59880 59490 59224 58955 58503
57499 58503 57803 57011 56444 56309 56395 56179 55380 54316 53528 53189 53107 53151 53355 53649 53826 53771 53461 52858 52118 51748
$$ packed form
57614A19501L971M959O059P379Q595R541J0581J1935J3065J3247J2214R860O052
57601B36959J257l276o693r270j1384j2544j2295j1346j0731j0335r336p706o241
57588A27059n278m476l715l277l102k731k042j351p72j24N32Q35N93p4r01j392
57572I9784j006L9O26Q8p87r03m69m81j038j335j149j112j435j566j276j039j067
57555H5874r42n01k33l53l69L6L86J97k85n34m99m43m36l81k63p6J87L28R2l85
57535H1400o53o38p65j241j676j670j372j173j162j149r58n27P7N40N13O2l64
57518F9244n19o38r49j291j342j047o06k20k4q4l23n46o35o13n27l90k66k69m52
57499E8503p00p92n67j35Q6k16p99j064p88l39q2M4K04K94J77n5l10o03p40l70
$$ plain form
57479 51748 52125 52926 53489 53680 53874 54196 54415 54593 55117 55951 56559 56842 57419 58652 60074 61280 62747 65118
57461 65118 68102 70700 72320 73228 74091 75450 77390 79405 80837 81692 82654 84089 85538 86544 87415 88627
57445 88627 89951 90850 91364 91905 92418 92456 91961 91355 90912 90572 90358 90438 90740 90957 90976 90932 90897 90835 90829 90974 91120
57424 91120 91036 90781 90614 90602 90625 90618 90568 90415 90269 90463 91058 91566 91573 91384 91561 92078 92538 93025 94073 95763 97511
57403 97511 98850 99888 100843 101638 102188 102691 103365 104167 104910 105476 105848 106130 106571 107356 108372 109397 110404
57386 110404 111463 112462 113236 113923 114857 116166 117738 119491 121307 122836 123762 124271 124895 125935 127328 128991
57370 128991 130836 132542 133760 134598 135494 136638 137922 139410 141301 143365 145011 146083 147115 148564 150239
57355 150239 151730 152993 154203 155417 156663 158074 159611 160939 161909 162921 164440 166286 167783 168584 169016
$$ packed form
57479E1748L77Q01N63J91J94L22K19J78N24Q34O08K83N77J233J422J206J467K371
57461F5118K984K598J620R08Q63J359J940K015J432Q55R62J435J449J006Q71J212
57445H8627J324Q99N14N41N13L8m95o06m43l40k14Q0L02K17J9m4l5o2oJ45J46
57424I1120q4k55j67j2K3pn0j53j46J94N95N08Pj89J77N17M60M87J048J690J748
57403I7511J339J038R55P95N50N03O74Q02P43N66L72K82M41P85J016J025J007
57386A10404J059R99P74O87R34J309J572J753J816J529R26N09O24J040J393J663
57370A28991J845J706J218Q38Q96J144J284J488J891K064J646J072J032J449J675
57355A50239J491J263J210J214J246J411J537J328R70J012J519J846J497Q01M32
$$ plain form
57340 169016 169620 170578 171736 172985 174442 176286 178529 181034 183686 186435 189194 191843 194388 196912 199322
57325 199322 201373 203078 204857 207058 209525 211861 213915 215767 217421 218870 220311 221979 223875 225938
57311 225938 228341 231232 234344 237227 239781 242196 244542 246861 249472 252617 255880 258572 260710 263000
57297 263000 265767 268567 271047 273550 276487 279653 282574 285185 287711 290211 292628 295110 297866 300811
57283 300811 303626 306097 308254 310314 312618 315392 318393 321021 322997 324719 326773 329300 332055 334831
57269 334831 337531 340024 342245 344369 346593 348841 350912 352832 354855 357130 359614 362292 365253 368543
57255 368543 372047 375568 378956 382177 385359 388707 392304 396006 399638 403219 406919 410808 414732 418400
57241 418400 421564 424181 426526 429131 432511 436826 441745 446648 450998 454624 457712 460570 463399 466239
$$ packed form
57340A69016O04R58J158J249J457J844K243K505K652K749K759K649K545K524K410
57325A99322K051J705J779K201K467K336K054J852J654J449J441J668J896K063
57311B25938K403K891L112K883K554K415K346K319K611L145L263K692K138K290
57297B63000K767K800K480K503K937L166K921K611K526K500K417K482K756K945
57283C00811K815K471K157K060K304K774L001K628J976J722K054K527K755K776
57269C34831K700K493K221K124K224K248K071J920K023K275K484K678K961L290
57255C68543L504L521L388L221L182L348L597L702L632L581L700L889L924L668
57241D18400L164K617K345K605L380M315M919M903M350L626L088K858K829K840
$$ plain form
57227 466239 469027 471718 474383 477153 479968 482499 484518 486268 488189 490298 492212 493880 495859 498608
57213 498608 501895 505213 508480 511934 515562 519076 522365 525575 528844 532252 535902 539696 543193 546060
57199 546060 548528 551034 553559 555744 557501 559027 560291 561047 561337 561483 561538 561248 560662 560268 560402 560869 561207
57182 561207 560942 559559 556777 553000 549078 545447 541869 538107 534368 530912 527708 524730 522231 520447
57168 520447 519299 518636 518517 519094 520447 522622 525528 528666 531243 532681 532763 531334 528238 523609 517758
57153 517758 510681 502152 492394 482126 471757 461059 449909 438807 428285 418235 408298 398589
57141 398589 389614 381692 374821 368940 363973 359717 355983 352742 350035 347847 346181 345012 344145 343382 342907
57126 342907 343146 344135 345471 346997 349066 351853 354866 357472 359473 360736 360544 357743 351357 340788 325616
$$ packed form
57227D66239K788K691K665K770K815K531K019J750J921K109J914J668J979K749
57213D98608L287L318L267L454L628L514L289L210L269L408L650L794L497K867
57199E46060K468K506K525K185J757J526J264P56K90J46N5k90n86l94J34M67L38
57182E61207k65j383k782l777l922l631l578l762l739l456l204k978k499j784
57168E20447j148o63j19N77J353K175K906L138K577J438Q2j429l096m629n851
57153E17758p077q529r758j0268j0369j0698j1150j1102j0522j0050r937r709
57141C98589q975p922o871n881m967m256l734l241k707k188j666j169q67p63m75
57126C42907K39R89J336J526K069K787L013K606K001J263j92k801o386j0569j5172
$$ plain form
57111 325616 305568 280596 250741 216035 176694 133224 86221 36195 -16369 -71074 -127753
57100 -127753 -186304 -246234 -306775 -367602 -429109 -491929 -556605 -623816 -694373 -768633 -846258
57089 -846258 -926767 -1009937 -1095558 -1183293 -1273058 -1365103 -1459504 -1556070 -1655032 -1757457 -1864720
57078 -1864720 -1978005 -2098432 -2227089 -2364555 -2510834 -2666043 -2830674 -3005076 -3189419
57069 -3189419 -3384596 -3592507 -3815087 -4053725 -4310175 -4587325 -4888393 -5215768 -5571191
57060 -5571191 -5956588 -6374183 -6826309 -7315750 -7846024 -8421084 -9045467 -9725395 -10469399
57051 -10469399 -11287596 -12191164 -13193195 -14309386 -15557060 -16953876 -18518150 -20270373
57043 -20270373 -22235200 -24444877 -26944399 -29795955 -33080836 -36900241 -41376185 -46650523
$$ packed form
57111C25616k0048k4972k9855l4706l9341m3470m7003C6195a6369n4705n6679
57100a27753n8551n9930o0541o0827o1507o2820o4676o7211p0557p4260p7625
57089h46258q0509q3170q5621q7735q9765r2045r4401r6566r8962j02425j07263
57078a864720j13285j20427j28657j37466j46279j55209j64631j74402j84343
57069c189419j95177k07911k22580k38638k56450k77150l01068l27375l55423
57060e571191l85397m17595m52126m89441n30274n75060o24383o79928p44004
57051a0469399q18197r03568j002031j116191j247674j396816j564274j752223
57043b0270373j964827k209677k499522k851556l284881l819405m475944n274338
$$ plain form
57035 -46650523 -52880597 -60234224 -68886900 -79019192 -90810464 -104428086 -120012282
57028 -120012282 -137655042 -157374622 -179093079 -202618384 -227614379 -253537340 -279549702
57021 -279549702 -304472591 -326858981 -345221771 -358353081 -365592179 -366912263 -362803903
57014 -362803903 -354050518 -341522018 -326049304 -308368210 -289103415 -268781430 -247864175
57007 -247864175 -226779038 -205924368 -185655899 -166274552 -148023365 -131086298 -115584995
57000 -115584995 -101578542 -89069271 -78011174 -68318941 -59879597 -52566109 -46248434
56993 -46248434 -40800150 -36103363 -32052919 -28557608 -25537934 -22923798 -20654151 -18676877
56985 -18676877 -16947471 -15427792 -14085923 -12895895 -11836462 -10889967 -10041958 -9280654
$$ packed form
57035d6650523o230074p353627q652676j0132292j1791272j3617622j5584196
57028a20012282j7642760j9719580k1718457k3525305k4995995k5922961k6012362
57021b79549702k4922889k2386390j8362790j3131310p239098j320084M108360
57014c62803903Q753385J2528500J5472714J7681094J9264795K0321985K0917255
57007b47864175K1085137K0854670K0268469J9381347J8251187J6937067J5501303
57000a15584995J4006453J2509271J1058097R692233Q439344P313488O317675
56993d6248434N448284M696787M050444L495311L019674K614136K269647J977274
56985a8676877J729406J519679J341869J190028J059433R46495Q48009P61304
$$ plain form
56977 -9280654 -8595887 -7978427 -7420066 -6913586 -6452320 -6030157 -5642161 -5284957 -4956459
56968 -4956459 -4655232 -4379782 -4128097 -3898219 -3689407 -3501653 -3332747 -3176250 -3023878
56959 -3023878 -2870465 -2716171 -2564194 -2417531 -2277984 -2146627 -2023922 -1909665 -1803527
56950 -1803527 -1705538 -1615848 -1534338 -1460776 -1394993 -1336710 -1285525 -1241280 -1204114 -1173921 -1150053
56939 -1150053 -1131699 -1118237 -1109039 -1103300 -1100276 -1099449 -1100309 -1102238 -1104735 -1107470 -1110004 -1111748 -1112331 -1111687
56925 -1111687 -1109662 -1105852 -1100004 -1092255 -1082754 -1071380 -1058130 -1043586 -1028644 -1013768 -998724 -983067
56913 -983067 -966757 -950241 -933972 -917936 -901758 -885288 -868826 -852677 -836680 -820447 -803889
56902 -803889 -787252 -770702 -754241 -737969 -722121 -706808 -691981 -677681 -664118 -651518 -640056
$$ packed form
56977i280654O84767O17460N58361N06480M61266M22163L87996L57204L28498
56968d956459L01227K75450K51685K29878K08812J87754J68906J56497J52372
56959c023878J53413J54294J51977J46663J39547J31357J22705J14257J06138
56950a803527R7989Q9690Q1510P3562O5783N8283N1185M4245L7166L0193K3868
56939a150053J8354J3462R198N739L024Q27q60j929k497k735k534j744n83O44
56925a111687K025L810N848P749R501J1374J3250J4544J4942J4876J5044J5657
56913i83067J6310J6516J6269J6036J6178J6470J6462J6149J5997J6233J6558
56902h03889J6637J6550J6461J6272J5848J5313J4827J4300J3563J2600J1462
$$ plain form
56891 -640056 -629870 -620922 -612934 -605682 -599243 -593655 -588494 -583141 -577372 -571259 -564609 -557002 -548425 -539337
56877 -539337 -529922 -519710 -508168 -495342 -481655 -467429 -452884 -438383 -424384 -411235 -399226 -388681
56865 -388681 -379826 -372624 -366864 -362285 -358512 -355044 -351541 -348067 -344877 -341993 -339113 -335964 -332604 -329290
56851 -329290 -326098 -322761 -318983 -314803 -310559 -306495 -302662 -299194 -296321 -293878 -291110 -287348 -282729 -277934
56837 -277934 -273279 -268402 -262840 -256521 -249639 -242371 -234840 -227111 -219082 -210542 -201489 -192292 -183538 -175807
56823 -175807 -169513 -164744 -161213 -158563 -156709 -155729 -155476 -155547 -155625 -155575 -155183 -154111 -152228 -149731 -146779 -143236
56807 -143236 -138883 -133745 -128004 -121725 -114819 -107183 -98758 -89515 -79588 -69436 -59819 -51536 -45168 -41004
56793 -41004 -39096 -39261 -40955 -43274 -45330 -46688 -47342 -47266 -46225 -44059 -40859 -36652 -31145 -24038 -15383
$$ packed form
56891f40056J0186Q948P988P252O439N588N161N353N769O113O650P607Q577R088
56877e39337R415J0212J1542J2826J3687J4226J4545J4501J3999J3149J2009J0545
56865c88681Q855P202N760M579L773L468L503L474L190K884K880L149L360L314
56851c29290L192L337L778M180M244M064L833L468K873K443K768L762M619M795
56837b77934M655M877N562O319O882P268P531P729Q029Q540R053R197Q754P731
56823a75807O294M769L531K650J854R80K53p1p8N0L92J072J883K497K952L543
56807a43236M353N138N741O279O906P636Q425R243R927J0152R617Q283O368M164
56793d1004J908j65j694k319k056j358o54P6J041K166L200M207N507P107Q655
$$ plain form
56778 -15383 -5385 5943 18657 32503 47119 62390 78171 93559 106758 115879 119840 118706 113526
56765 113526 105869 97148 88151 79224 70718 63025 56287 50448 45628 42127 40034 39119 39260 40719 43867
56750 43867 48778 55218 62924 71817 81852 92470 102090 108461 109993 106855 100610 92856 84422 75606
56736 75606 66679 58011 50048 43266 37891 33627 29909 26498 23625 21645 20823 21392 23422 26601 30487
56721 30487 35003 40298 46028 51132 54491 55571 54396 51270 46708 41297 35394 29149 22865 17005
56707 17005 11764 6950 2457 -1486 -4733 -7525 -10189 -12717 -14842 -16346 -17167 -17456 -17628 -18082 -18725 -19060
56691 -19060 -18916 -18729 -18945 -19476 -20032 -20620 -21353 -22015 -22230 -21936 -21358 -20648 -19900 -19400 -19437 -19880 -20233 -20153 -19704 -19092
56671 -19092 -18417 -17730 -17137 -16739 -16571 -16578 -16629 -16570 -16422 -16435 -16815 -17429 -17916 -18066 -17957 -17725 -17383 -16922 -16422 -15984 -15597
$$ packed form
56778a5383e385E943J2714J3846J4616J5271J5781J5388J3199R121L961j134n180
56765A13526p657q721q997q927q506p693o738n839m820l501k093r15J41J459L148
56750D3867M911O440P706Q893J0035J0618R620O371J532l138o245p754q434q816
56736G5606q927q668p963o782n375m264l718l411k873j980q22N69K030L179L886
56721C0487M516N295N730N104L359J080j175l126m562n411n903o245o284n860
56707A7005n241m814B457a486l247k792k664k528k125j504q21k89j72m54o43l35
56691a9060J44J87k16n31n56n88p33o62k15K94N78P10P48N00l7m43l53Q0M49O12
56671a9092O75O87N93L98J68pn1N9J48j3l80o14m87j50J09K32L42M61N00M38L87
$$ plain form
56650 -15597 -15211 -14894 -14772 -14768 -14547 -13860 -12863 -11930 -11178 -10375 -9334 -8131 -6880 -5588 -4389 -3564 -3055 -2309
56632 -2309 -945 637 1789 2533 3479 4883 6360 7557 8561 9518 10333 10967 11636 12469 13302 13945 14338 14327
56614 14327 13703 12697 12040 12202 12849 13326 13431 13398 13373 13294 13169 13143 13304 13616 14026 14527 15153 15942 16733 17083
56594 17083 16670 15862 15518 16074 17147 18197 19162 20166 20971 21230 21083 21082 21601 22600 23898 25336 26734 27949
56576 27949 29024 30112 31277 32502 33757 34907 35706 36074 36300 36752 37460 38150 38586 38671 38387 37835 37308
56559 37308 37056 36966 36664 35958 35062 34400 34225 34399 34486 34099 33228 32184 31262 30580 30193 30144 30332 30551 30748 31054
56539 31054 31492 31883 32108 32280 32526 32808 33049 33255 33437 33626 34024 34850 35967 36953 37638 38250 38923 39435 39677
56520 39677 40017 40886 42240 43701 45007 46076 46862 47438 47976 48472 48737 48885 49453 50731 52279 53523 54513
$$ packed form
56650a5597L86L17J22MK21O87R97R33P52Q03J041J203J251J292J199Q25N09P46
56632b309i45F37J152P44R46J404J477J197J004R57Q15O34O69Q33Q33O43L93j1
56614A4327o24j006o57J62O47M77J05l3k5p9j25k6J61L12M10N01O26P89P91L50
56594A7083m13q08l44N56J073J050R65J004Q05K59j47jN19R99J298J438J398J215
56576B7949J075J088J165J225J255J150P99L68K26M52P08O90M36Q5k84n52n27
56559C7308k52r0l02p06q96o62j75J74Q7l87q71j044r22o82l87m9J88K19J97L06
56539C1054M38L91K25J72K46K82K41K06J82J89L98Q26J117R86O85O12O73N12K42
56520C9677L40Q69J354J461J306J069P86N76N38M96K65J48N68J278J548J244R90
$$ plain form
56503 54513 55711 57268 59023 60994 63284 65610 67457 68774 70032 71536 73059 74265 75110 75671 75913
56488 75913 75834 75683 75779 76171 76581 76677 76422 76138 76153 76394 76455 76114 75537 74925 74202 73266 72301 71578 71084 70595 69999
56467 69999 69332 68611 67875 67277 66928 66730 66523 66298 66127 66024 66059 66421 67173 68069 68811 69315 69559 69406 68799
56448 68799 67960 67146 66365 65529 64690 63878 62943 61815 60735 59926 59266 58568 57989 57800 57938 58173 58548 59255
56430 59255 60138 60734 60786 60470 60135 60046 60309 60790 61162 61255 61221 61198 61059 60705 60379 60366 60589 60804 60983 61122 61002
56409 61002 60557 60267 60659 61545 62249 62501 62595 62715 62668 62341 61937 61653 61474 61413 61628 62195 63005 63901 64693 65131
56389 65131 65186 65264 65811 66757 67664 68391 69190 70184 71136 71813 72249 72561 72794 72987 73195 73402 73587 73769 73870 73691
56369 73691 73280 73055 73235 73389 73007 72347 72178 72762 73591 74118 74274 74223 74134 74245 74763 75549 76241 76726 77146 77494
$$ packed form
56503E4513J198J557J755J971K290K326J847J317J258J504J523J206Q45N61K42
56488G5913p9j51R6L92M10R6k55k84J5K41O1l41n77o12p23r36r65p23m94m89n96
56467F9999o67p21p36n98l49j98k07k25j71j03L5L62P52Q96P42N04K44j53o07
56448F8799q39q14p81q36q39q12r35j128j080q09o60o98n79j89J38K35L75P07
56430E9255Q83N96N2l16l35q9K63M81L72R3l4k3j39l54l26j3K23K15J79J39j20
56409F1002m45k90L92Q86P04K52R4J20m7l27m04k84j79o1K15N67Q10Q96P92M38
56389F5131N5P8N47R46R07P27P99R94R52O77M36L12K33J93K08K07J85J82J01j79
56369G3691m11k25J80J54l82o60j69N84Q29N27J56n1q9J11N18P86O92M85M20L48
$$ plain form
56349 77494 77612 77613 77866 78445 78975 79122 78929 78592 78223 77915 77755 77679 77550 77386 77294 77246 77176 77218 77512 77876 78011
56328 78011 77947 77951 78060 78131 78227 78558 79051 79430 79688 80092 80760 81610 82611 83672 84420 84598 84590 84993 85756 86306 86481
56307 86481 86670 87025 87240 87208 87272 87597 87884 87960 88089 88485 88969 89357 89739 90157 90415 90460 90551 90885 91391 92029 92878
56286 92878 93811 94509 94937 95397 95998 96501 96837 97297 98070 99005 99992 101144 102422 103537 104376 105163 106048 106928
56268 106928 107766 108616 109284 109460 109331 109542 110381 111525 112722 114158 115905 117604 119031 120442 122034 123515
56252 123515 124594 125490 126616 128083 129802 131744 133800 135718 137399 138986 140499 141799 143039 144750
56238 144750 147237 150272 153527 156881 160149 162983 165337 167604 170094 172771 175706 179300 183760 188729
56224 188729 193717 198568 203325 208062 213044 218666 224973 231571 238103 244506 250784 257045 263754 271375
$$ packed form
56349G7494J18JK53N79N30J47j93l37l69l08j60p6j29j64r2m8p0M2K94L64J35
56328G8011o4MJ09P1R6L31M93L79K58M04O68Q50J001J061P48J78qM03P63N50J75
56307H6481J89L55K15l2O4L25K87P6J29L96M84L88L82M18K58M5R1L34N06O38Q49
56286I2878R33O98M28M60O01N03L36M60P73R35R87J152J278J115Q39P87Q85Q80
56268A06928Q38Q50O68J76j29K11Q39J144J197J436J747J699J427J411J592J481
56252A23515J079Q96J126J467J719J942K056J918J681J587J513J300J240J711
56238A44750K487L035L255L354L268K834K354K267K490K677K935L594M460M969
56224A88729M988M851M757M737M982N622O307O598O532O403O278O261O709P621
$$ plain form
56210 271375 279679 288053 296557 305973 316636 328047 339898 352694 366898 382219 398223 415072
56198 415072 433200 452838 474281 498027 524166 552225 582043 614218 649246 686843 726569
56187 726569 768472 812546 858129 904485 951402 998580 1044888 1088917 1129865 1167248 1200099
56176 1200099 1227118 1247370 1260403 1265985 1264247 1255706 1240784 1219655 1192932 1161882 1127509 1089962
56164 1089962 1049461 1007239 964830 922880 881333 840427 800757 762644 726174 691601 659083
56153 659083 628250 598645 570413 544007 519500 496678 475564 456261 438520 421990 406707
56142 406707 392828 380125 368253 357282 347454 338605 330315 322486 315320 308887 303083 297830 293057
56129 293057 288688 284858 281783 279249 276669 273894 271399 269414 267534 265604 264230 263877 264049 264028 263843
$$ packed form
56210B71375Q304Q374Q504R416J0663J1411J1851J2796J4204J5321J6004J6849
56198D15072J8128J9638K1443K3746K6139K8059K9818L2175L5028L7597L9726
56187G26569M1903M4074M5583M6356M6917M7178M6308M4029M0948L7383L2851
56176A200099K7019K0252J3033N582j738q541j4922k1129k6723l1050l4373l7547
56164A089962m0501m2222m2409m1950m1547m0906l9670l8113l6470l4573l2518
56153F59083l0833k9605k8232k6406k4507k2822k1114j9303j7741j6530j5283
56142D06707j3879j2703j1872j0971r828q849q290p829p166o433n804n253m773
56129B93057m369l830l075k534k580k775k495j985j880j930j374l53J72k1j85
$$ plain form
56114 263843 263856 263968 263939 264037 264677 265757 267015 268613 270793 273367 276132 279343 283168 287185 291025 295035
56098 295035 299664 304714 309876 315498 322047 329303 336828 344848 353933 364179 375442 387942 401974
56085 401974 417383 434031 452337 472764 495214 519596 546407 575952 607371 639096 669763
56074 669763 698150 723024 743987 761906 777677 791149 802051 811154 819422 826593 831733 834696
56062 834696 836010 835803 833960 830877 826932 821509 813514 802441 788031 769562 746720 720752 693583
56049 693583 666158 638721 612183 587826 565966 546138 528309 512758 499118 486825 476257
56038 476257 468130 462007 456701 451904 448141 445329 442778 440518 439281 439129 439283 439400 439896 441026 442645
56023 442645 444823 447712 450930 454029 457349 461463 466114 470739 475636 481479 488090 494834 501827 509494
$$ packed form
56114B63843J3J12k9R8O40J080J258J598K180K574K765L211L825M017L840M010
56098B95035M629N050N162N622O549P256P525Q020R085J0246J1263J2500J4032
56085D01974J5409J6648J8306K0427K2450K4382K6811K9545L1419L1725L0667
56074F69763K8387K4874K0963J7919J5771J3472J0902R103Q268P171N140K963
56062H34696J314k07j843l083l945n423p995j1073j4410j8469k2842k5968k7169
56049F93583k7425k7437k6538k4357k1860j9828j7829j5551j3640j2293j0568
56038D76257q127o123n306m797l763k812k551k260j237j52J54J17M96J130J619
56023D42645K178K889L218L099L320M114M651M625M897N843O611O744O993P667
$$ plain form
56009 509494 517404 524881 532359 540781 550004 559179 568310 577964 587829 597096 605973 615314 625059 634487
55995 634487 643669 653113 662404 670843 679108 688541 699052 709437 719503 730139 741538 753161 765270
55982 765270 778633 792920 807188 821757 837790 855179 872795 890566 909369 929023 948492
55971 948492 967983 988833 1011347 1034759 1059209 1085689 1114125 1143610 1174407 1207597 1242875
55960 1242875 1278881 1315605 1354211 1394643 1435780 1477838 1522262 1569368 1618524 1670469 1726872
55949 1726872 1787731 1851878 1919835 1993375 2072385 2155107 2241371 2332629 2428921 2529005 2633508
55938 2633508 2744720 2863273 2988250 3120503 3262350 3414014 3573933 3742601 3922357
55929 3922357 4113472 4314454 4526245 4752009 4992845 5248198 5520536 5814849 6133258
$$ packed form
56009E09494P910P477P478Q422R223R175R131R654R865R267Q877R341R745R428
55995F34487R182R444R291Q439Q265R433J0511J0385J0066J0636J1399J1623J2109
55982G65270J3363J4287J4268J4569J6033J7389J7616J7771J8803J9654J9469
55971I48492J9491K0850K2514K3412K4450K6480K8436K9485L0797L3190L5278
55960A242875L6006L6724L8606M0432M1137M2058M4424M7106M9156N1945N6403
55949A726872O0859O4147O7957P3540P9010Q2722Q6264R1258R6292J00084J04503
55938B633508J11212J18553J24977J32253J41847J51664J59919J68668J79756
55929C922357J91115K00982K11791K25764K40836K55353K72338K94313L18409
$$ plain form
55920 6133258 6474774 6840192 7231735 7647868 8084620 8542945 9029161 9547854 10100715
55911 10100715 10692604 11331391 12020757 12760613 13556053 14418812 15359906 16390355 17531116
55902 17531116 18813381 20267747 21922705 23813785 25981172 28456687 31268132 34461049
55894 34461049 38103499 42269513 47036336 52495356 58733034 65789280 73655645 82285275
55886 82285275 91474565 100609884 108561479 114005273 116030867 114542988 110152819 103752376
55878 103752376 96166708 88041534 79854507 71934358 64486111 57633287 51443951 45930172
55870 45930172 41056090 36767302 33010241 29727230 26852887 24326297 22099510 20131378
55862 20131378 18383348 16825803 15439791 14207729 13108532 12123984 11242242 10451799
$$ packed form
55920F133258L41516L65418L91543M16133M36752M58325M86216N18693N52861
55911A0100715N91889O38787O89366P39856P95440Q62759R41094J030449J140761
55902A7531116J282265J454366J654958J891080K167387K475515K811445L192917
55894C4461049L642450M166014M766823N459020O237678P056246P866365Q629630
55886H2285275R189290R135319P951595N443794K025594j487879m390169o400443
55878A03752376p585668q125174q187027p920149p448247o852824o189336n513779
55870D5930172m874082m288788l757061l283011k874343k526590k226787j968132
55862B0131378j748030j557545j386012j232062j099197r84548q81742p90443
$$ plain form
55854 10451799 9738487 9091272 8504900 7973803 7488759 7041931 6629977 6249727 5895690
55845 5895690 5564148 5255181 4968379 4700603 4449816 4216867 4001552 3800709 3611915
55836 3611915 3435339 3270313 3113855 2964285 2822884 2690430 2565433 2447125 2336707
55827 2336707 2234147 2137099 2044514 1958048 1878463 1803909 1733344 1668292 1609375 1554128 1500207
55816 1500207 1448025 1398378 1350078 1301837 1254142 1207419 1160528 1112780 1065442 1019694 975065
55805 975065 931338 889920 851790 815921 781172 747950 716692 686546 656891 628527 602097
55794 602097 577000 552975 531032 511633 493642 476193 459905 445148 430893 416497 402896
55783 402896 390750 379099 367148 355764 345875 336865 327904 319457 312112 305260 298211 291408 285278
$$ packed form
55854A0451799p13312o47215n86372n31097m85044m46828m11954l80250l54037
55845E895690l31542l08967k86802k67776k50787k32949k15315k00843j88794
55836C611915j76576j65026j56458j49570j41401j32454j24997j18308j10418
55827B336707j02560r7048r2585q6466p9585p4554p0565o5052n8917n5247n3921
55816A500207n2182m9647m8300m8241m7695m6723m6891m7748m7338m5748m4629
55805I75065m3727m1418l8130l5869l4749l3222l1258l0146k9655k8364k6430
55794F02097k5097k4025k1943j9399j7991j7449j6288j4757j4255j4396j3601
55783D02896j2146j1651j1951j1384r889r010q961q447p345o852p049o803o130
$$ plain form
55770 285278 279125 272435 266127 261260 257502 254012 250791 248078 245426 242437 239487 236811 233828 230276
55756 230276 226932 224329 221828 218898 216225 214570 213546 212504 211659 211448 211671 212162 213294 214965 216111
55741 216111 216151 215953 216427 217098 217020 216158 214893 213023 210251 206964 203618 200101 196380 193005 190207 187392
55725 187392 184206 181220 178824 176419 173520 170670 168409 166277 163809 161586 160330 159770 159340 159213 159738
55710 159738 160616 161543 162840 164523 165565 165060 163403 161400 158953 155614 151740 148021 144418 140542 136601
55695 136601 133060 129841 126675 123728 121134 118432 115293 112258 110017 108487 107297 106551 106341 106117 105370
55680 105370 104405 103713 103179 102569 102154 102057 101680 100580 99281 98381 97537 96192 94625 93314 91941 90026 87989
55663 87989 86568 85648 84684 83789 83395 83256 82818 82279 82262 82721 83121 83437 84040 84829 85343 85571 85795 85858 85382
$$ packed form
55770B85278o153o690o308m867l758l490l221k713k652k989k950k676k983l552
55756B30276l344k603k501k930k673j655j024j042q45k11K23M91J132J671J146
55741B16111M0j98M74O71p8q62j265j870k772l287l346l517l721l375k798k815
55725A87392l186k986k396k405k899k850k261k132k468k223j256n60m30j27N25
55710A59738Q78R27J297J683J042n05j657k003k447l339l874l719l603l876l941
55695A36601l541l219l166k947k594k702l139l035k241j530j190p46k10k24p47
55680A05370r65o92n34o10m15r7l77j100j299r00q44j345j567j311j373j915k037
55663H7989j421r20r64q95l94j39m38n39j7M59M00L16O03P89N14K28K24O3m76
$$ plain form
55644 85382 84562 83933 83481 82713 81474 80029 78521 76946 75463 74145 72682 70919 69403 68763 68808 68858 68674
55627 68674 68455 68267 68140 68403 69267 70312 71017 71513 72271 73372 74619 75996 77402 78360 78622 78678 79027 79373
55609 79373 79225 78791 78544 78365 77929 77536 77680 78139 78382 78562 79220 80267 81121 81684 82321 83044 83545 83909 84501
55590 84501 85218 85626 85714 85789 85713 84967 83421 81431 79284 77167 75431 74217 72997 71150 68815 66548 64425
55573 64425 62233 60253 58949 58075 56934 55503 54410 53851 53347 52620 51936 51468 51016 50451 49853 49158 48231
55556 48231 47316 46815 46670 46465 46114 45885 45789 45516 44949 44230 43423 42584 42033 41982 42052 41682 40866 40007 39274 38668
55536 38668 38420 38652 38908 38703 38286 38151 38102 37630 36929 36595 36513 36002 35020 34259 34038 34032 34117 34559 35226 35541 35408
55515 35408 35400 35824 36384 36955 37873 39202 40443 41265 41852 42325 42480 42369 42434 42797 42988 42675 42099 41578 41107
$$ packed form
55644H5382q20o29m52p68j239j445j508j575j483j318j463j763j516o40M5N0j84
55627F8674k19j88j27K63Q64J045P05M96P58J101J247J377J406R58K62N6L49L46
55609G9373j48m34k47j79m36l93J44M59K43J80O58J047Q54N63O37P23N01L64N92
55590H4501P17M08Q8P5p6p46j546j990k147k117j736j214j220j847k335k267k123
55573F4425k192j980j304q74j141j431j093n59n04p27o84m68m52n65n98o95r27
55556D8231r15n01j45k05l51k29r6k73n67p19q07q39n51n1P0l70q16q59p33o06
55536C8668k48K32K56k05m17j35m9m72p01l34q2n11r82p61k21oQ5M42O67L15j33
55515C5408qM24N60N71R18J329J241Q22N87M73J55j11O5L63J91l13n76n21m71
$$ plain form
55496 41107 40690 40506 40506 40327 39800 39098 38280 37264 36350 36160 36847 37899 38870 39760 40516 40839 40755 40821 41396 42164
55476 42164 42638 42767 42754 42697 42608 42464 42091 41349 40498 39998 39909 39874 39681 39370 38835 37951 37068 36743 36841 36582 35628
55455 35628 34491 33669 33031 32309 31617 31102 30597 29940 29250 28637 28019 27434 27085 26922 26581 25912 25144 24460 23865
55436 23865 23530 23711 24175 24325 24027 23772 23832 23870 23632 23360 23263 23164 23000 23132 23768 24594 25275 25836 26280 26369 26140
55415 26140 26092 26509 27037 27292 27404 27584 27672 27476 27114 26673 26000 25241 25036 25679 26565 26996 27101 27369 27666 27443
55395 27443 26717 26169 26261 26759 27188 27338 27296 27232 27243 27246 27079 26791 26673 26891 27264 27561 27809 28140 28544 28966 29451
55374 29451 30039 30650 31160 31416 31158 30209 28828 27591 26841 26536 26625 27176 28051 28898 29565 30177 30677 30743 30330
55355 30330 29828 29542 29405 29376 29633 30099 30300 29993 29561 29462 29654 29830 29881 29809 29540 29114 28732 28388 27805 26981
$$ packed form
55496D1107m17j84%j79n27p02q18j016r14j90O87J052R71Q90P56L23q4O6N75P68
55476D2164M74J29j3n7q9j44l73p42q51n00q9l5j93l11n35q84q83l25R8k59r54
55455C5628j137q22o38p22o92n15n05o57o90o13o18n85l49j63l41o69p68o84n95
55436B3865l35J81M64J50k98k55O0L8k38k72r7r9j64J32O36Q26O81N61M44Q9k29
55415B6140m8M17N28K55J12J80Q8j96l62m41o73p59k05O43Q86M31J05K68K97k23
55395B7443p26n48R2M98M29J50m2o4J1Lj67k88j18K18L73K97K48L31M04M22M85
55374B9451N88O11N10K56k58r49j381j237p50l05Q9N51Q75Q47O67O12N00O6m13
55355C0330n02k86j37k9K57M66K01l07m32r9J92J76N1p2k69m26l82l44n83q24
$$ plain form
55335 26981 26373 26247 26246 25932 25399 24994 24778 24615 24498 24440 24322 24146 24130 24322 24423 24237 23961 23756 23444 22921
55315 22921 22476 22329 22285 22159 22160 22466 22857 23167 23679 24563 25315 25349 24821 24332 24083 23891 23839 24234 25007 25757 26344
55294 26344 26983 27723 28298 28530 28527 28411 28151 27725 27242 26879 26802 27071 27486 27696 27605 27482 27555 27721 27813 27825 27684
55273 27684 27183 26419 25958 26207 26886 27448 27727 27831 27743 27446 27198 27197 27187 26823 26250 25920 25967 26168 26361 26504 26457
55252 26457 26118 25687 25441 25312 25053 24665 24350 24095 23722 23261 22951 22898 23016 23275 23723 24317 24928 25442 25697
55233 25697 25524 25039 24706 24847 25276 25646 25918 26243 26629 27030 27544 28203 28773 29083 29313 29661 29977 30046 29969 29842
55213 29842 29393 28406 27320 26841 27076 27465 27499 27125 26531 25992 25838 26182 26677 26886 26836 26949 27549 28660 30124
55194 30124 31585 32566 32902 32927 32957 32867 32500 32163 32190 32283 31885 31053 30411 30300 30483 30656 30726 30637 30360 30056 29861
$$ packed form
55335B6981o08j26jl14n33m05k16j63j17n8j18j76j6J92J01j86k76k05l12n23
55315B2921m45j47m4j26JL06L91L10N12Q84P52L4n28m89k49j92n2L95P73P50N87
55294B6344O39P40N75K32lj16k60m26m83l63p7K69M15K10r1j23P3J66R2J2j41
55273B7684n01p64m61K49O79N62K79J04q8k97k48jj0l64n73l30M7K01J93J43m7
55252B6457l39m31k46j29k59l88l15k55l73m61l10n3J18K59M48N94O11N14K55
55233B5697j73m85l33J41M29L70K72L25L86M01N14O59N70L10K30L48L16O9p7j27
55213B9842m49r87j086m79K35L89L4l74n94n39j54L44M95K09n0J13O00J111J464
55194C0124J461R81L36K5L0r0l67l37K7R3l98q32o42j11J83J73P0q9k77l04j95
$$ plain form
55173 29861 29586 29015 28357 27969 27732 27257 26594 26226 26356 26730 27141 27614 28072 28339 28517 28910 29502 29947 30101
55154 30101 30120 30071 29890 29705 29726 29786 29518 28984 28601 28417 28051 27448 27118 27413 28079 28723 29259 29671 29791 29592
55134 29592 29336 29204 29115 29036 29106 29262 29152 28649 28109 27885 27913 27961 27971 27936 27742 27375 27033 26880 26884 27046 27488 28151
55112 28151 28697 28866 28728 28487 28308 28452 29216 30534 31864 32709 33028 33065 33017 33022 33216 33619 34114 34637 35180 35587
55092 35587 35603 35217 34702 34272 33948 33736 33598 33239 32373 31267 30591 30596 30866 31028 31195 31489 31679 31607 31531 31630 31603
55071 31603 31200 30792 30864 31259 31448 31414 31647 32316 33009 33368 33518 33654 33608 33095 32199 31330 30807 30617 30578 30611 30820
55050 30820 31333 32127 32985 33675 34104 34322 34416 34446 34459 34556 34862 35416 36038 36436 36504 36437 36469 36607 36736 36853 37063
55029 37063 37401 37837 38352 38824 38965 38638 38136 37884 37913 37890 37664 37445 37415 37453 37344 37035 36623 36277 36184 36398 36713
$$ packed form
55173B9861k75n71o58l88k37m75o63l68J30L74M11M73M58K67J78L93N92M45J54
55154C0101J9m9j81j85K1O0k68n34l83j84l66o03l30K95O66O44N36M12J20j99
55134B9592k56j32q9p9P0J56j10n03n40k24K8M8J0l5j94l67l42j53MJ62M42O63
55112B8151N46J69j38k41j79J44P64J318J330Q45L19L7m8NJ94M03M95N23N43M07
55092C5587J6l86n15m30l24k12j38l59q66j106o76NK70J62J67K94J90p2p6R9k7
55071C1603m03m08P2L95J89l4K33O69O93L59J50J36m6n13q96q69n23j90l9L3K09
55050C0820N13P94Q58O90M29K18R4L0J3R7L06N54O22L98O8o7L2J38J29J17K10
55029C7063L38M36N15M72J41l27n02k52K9k3k26k19l0L8j09l09m12l46r3K14L15
$$ plain form
55008 36713 36873 36907 37046 37329 37549 37548 37359 37050 36678 36387 36277 36193 35904 35484 35208 35101 34905 34530 34181 34007
54988 34007 33914 33808 33725 33672 33643 33774 34169 34570 34589 34305 34211 34525 34965 35314 35690 36106 36297 36199 36159 36348 36407 36035
54966 36035 35566 35578 36170 36971 37612 37897 37753 37377 37225 37488 37778 37637 37167 36850 36871 37029 37167 37316 37444 37430
54946 37430 37311 37303 37498 37757 37932 38011 38011 37895 37633 37285 36980 36859 37020 37483 38218 39140 40039 40609 40704 40527 40363
54925 40363 40197 39825 39290 38884 38704 38537 38278 38140 38280 38563 38845 39256 39957 40822 41545 41939 41988 41785 41505
54906 41505 41293 41129 40969 40973 41349 41936 42302 42298 42146 41946 41531 40938 40560 40575 40654 40559 40591 41097 41842 42284 42218 41805
54884 41805 41220 40623 40282 40353 40661 40955 41227 41542 41809 42007 42417 43310 44558 45860 47134 48425 49619 50568
54866 50568 51361 52166 53020 54030 55533 57716 60239 62597 64707 66818 68991 71005 72616 73547 73431 72153
$$ packed form
55008C6713J60L4J39K83K20jj89l09l72k91j10q4k89m20k76j07j96l75l49j74
54988C4007r3j06q3n3k9J31L95M01J9k84r4L14M40L49L76M16J91r8m0J89N9l72
54966C6035m69J2N92Q01O41K85j44l76j52K63K90j41m70l17K1J58J38J49J28j4
54946C7430j19qJ95K59J75P9%j16k62l48l05j21J61M63P35R22Q99N70R5j77j64
54925D0363j66l72n35m06j80j67k59j38J40K83K82M11P01Q65P23L94M9k03k80
54906D1505k12j64j60ML76N87L66mj52k00m15n93l78J5P9r5L2N06P45M42o6m13
54884D1805n85n97l41P1L08K94K72L15K67J98M10Q93J248J302J274J291J194R49
54866E0568P93Q05Q54J010J503K183K523K358K110K111K173K014J611R31j16j278
$$ plain form
54850 72153 70146 67996 65863 63623 61407 59556 58100 56728 55243 53729 52288 50996 50055 49648 49629
54835 49629 49680 49752 49994 50323 50477 50466 50600 50996 51432 51798 52342 53301 54581 55949 57371 59015 61020 63330
54817 63330 65664 67666 69173 70298 71162 71686 71786 71587 71206 70513 69355 67847 66159 64212 61971 59842
54801 59842 58302 57202 55927 54254 52552 51117 49778 48335 46925 45742 44762 43944 43387 43069 42709 42126
54785 42126 41514 41136 40977 40874 40807 40846 40945 40952 40769 40382 39867 39458 39448 39868 40413 40771 40918 40980 40990 40919 40801 40668
54763 40668 40432 40024 39598 39451 39749 40398 41173 41879 42387 42639 42664 42583 42557 42677 42910 43151 43306 43318 43160 42892
54743 42892 42687 42668 42735 42683 42492 42339 42281 42193 42057 42078 42340 42655 42910 43282 43867 44402 44695 45060 45900 47028 47891
54722 47891 48382 48919 49710 50411 50669 50613 50635 50973 51695 52795 54118 55443 56761 58288 60068 61830 63405
$$ packed form
54850G2153k007k150k133k240k216j851j456j372j485j514j441j292r41m07j9
54835D9629N1P2K42L29J54j1J34L96M36L66N44R59J280J368J422J644K005K310
54817F3330K334K002J507J125Q64N24J00j99l81o93j158j508j688j947k241k129
54801E9842j540j100j275j673j702j435j339j443j410j183r80q18n57l18l60n83
54785D2126o12l78j59j03o7L9R9Pj83l87n15m09j0M20N45L58J47O2J0p1j18j33
54763D0668k36m08m26j47K98O49P75P06N08K52K5q1k6J20K33K41J55J2j58k68
54743D2892k05j9O7n2j91j53n8q8j36K1K62L15K55L72N85N35K93L65Q40J128Q63
54722D7891M91N37P91P01K58n6K2L38P22J100J323J325J318J527J780J762J575
$$ plain form
54705 63405 65025 66971 69090 70897 72089 72738 73028 73005 72623 71902 70973 69967 68911 67728 66366 64896
54689 64896 63432 62005 60593 59232 58029 57078 56415 55984 55606 55100 54497 54081 54076 54394 54781 55131 55494 55916
54671 55916 56410 57000 57627 58106 58369 58646 59192 59994 60984 62416 64681 67714 70878 73472 75140 75815 75560
54654 75560 74550 73003 71019 68632 66011 63456 61179 59245 57642 56244 54819 53342 52240 51965 52298
54639 52298 52443 51913 51006 50253 49751 49260 48745 48492 48676 49048 49157 48808 48240 47777 47395 46834 46147 45814 46075
54620 46075 46491 46500 46193 46066 46170 46021 45398 44681 44271 44132 44085 44136 44240 44129 43713 43382 43587 44254 44893 45142
54600 45142 44970 44504 43929 43517 43498 43863 44356 44659 44540 43956 43139 42455 42060 41759 41311 40790 40500 40607 40954
54581 40954 41253 41432 41726 42381 43294 44042 44325 44253 44089 43900 43659 43513 43626 43850 43892 43782 43843 44185 44571 44855
$$ packed form
54705F3405J620J946K119J807J192O49K90k3l82p21r29j006j056j183j362j470
54689F4896j464j427j412j361j203r51o63m31l78n06o03m16nL18L87L50L63M22
54671E5916M94N90O27M79K63K77N46Q02R90J432K265L033L164K594J668O75k55
54654G5560j010j547j984k387k621k555k277j934j603j398j425j477j102k75L33
54639E2298J45n30r07p53n02m91n15k53J84L72J09l49n68m63l82n61o87l33K61
54620D6075M16Rl07j27J04j49o23p17m10j39m7N1J04j11m16l31K05O67O39K49
54600D5142j72m66n75m12j9L65M93L03j19n84q17o84l95l01m48n21k90J07L47
54581D0954K99J79K94O55R13P48K83p2j64j89k41j46J13K24M2j10O1L42L86K84
$$ plain form
54561 44855 45177 45599 45858 45707 45251 44775 44409 44137 43928 43708 43346 42830 42350 42092 42038 42016 41850 41468 41038 40985
54541 40985 41614 42660 43450 43590 43292 42987 42878 42973 43225 43473 43489 43291 43242 43665 44485 45348 45942 46119 45934 45693
54521 45693 45792 46369 47224 48093 48831 49325 49500 49474 49448 49365 49004 48461 48171 48312 48570 48697 48906 49416 49985 50254
54501 50254 50277 50315 50359 50249 50120 50301 50784 51173 51163 50839 50493 50368 50510 50697 50591 50130 49673 49585 49862 50339 51022
54480 51022 51877 52526 52582 52254 52157 52506 52898 52982 52933 53047 53213 53090 52675 52371 52506 52995 53525 53903 54106 54089 53750
54459 53750 53158 52656 52538 52688 52716 52448 52048 51677 51281 50861 50686 50973 51530 51940 52054 52061 52143 52259 52293 52259 52295
54438 52295 52546 53057 53739 54430 54974 55254 55203 54852 54357 53882 53483 53228 53326 53922 54790 55494 55922 56370 57043 57741
54418 57741 58206 58497 58810 59129 59302 59364 59577 60153 61064 62050 62797 63199 63473 63861 64221 64182 63694 63166 62949 63006
$$ packed form
54561D4855L22M22K59j51m56m76l66k72k09k20l62n16m80k58n4k2j66l82m30n3
54541D0985O29J046P90J40k98l05j09R5K52K48J6j98m9M23Q20Q63N94J77j85k41
54521D5693R9N77Q55Q69P38M94J75k6k6q3l61n43k90J41K58J27K09N10N69K69
54501E0254K3L8M4j10j29J81M83L89j0l24l46j25J42J87j06m61m57q8K77M77O83
54480E1022Q55O49N6l28r7L49L92Q4m9J14J66j23m15l04J35M89N30L78K03j7l39
54459E3750n92n02j18J50K8k68m00l71l96m20j75K87N57M10J14PQ2J16L4l4L6
54438E2295K51N11O82O91N44K80n1l51m95m75l99k55R8N96Q68P04M28M48O73O98
54418E7741M65K91L13L19J73O2K13N76R11R86P47M02K74L88L60l9m88n28k17N7
$$ plain form
54398 63006 63199 63533 63947 64224 64320 64440 64527 64075 62830 61370 60528 60434 60558 60509 60311 60004 59490 58831 58307 58078
54378 58078 58051 58084 58096 57985 57727 57538 57663 57990 58137 57945 57645 57518 57592 57718 57776 57762 57806 58075 58504 58753 58601
54357 58601 58316 58360 58788 59195 59272 59121 58998 58960 58895 58746 58674 58997 59878 61007 61738 61750 61424 61377 61730 62071 62016
54336 62016 61537 60851 60289 60217 60742 61487 61930 61968 61903 61922 61919 61864 61968 62380 62935 63352 63535 63597 63737 64083 64566 64940
54314 64940 65099 65266 65666 66165 66536 66983 67978 69509 70921 71646 71812 71961 72425 73140 73838 74207 74067 73550
54296 73550 73039 72795 72733 72662 72547 72422 72178 71600 70610 69358 68105 67066 66312 65809 65502 65284 64883 64010 62769
54277 62769 61763 61487 61717 61758 61286 60649 60354 60562 61164 61993 62796 63242 63187 62831 62487 62297 62247 62277 62235 61881
54257 61881 61119 60179 59460 59166 59135 59016 58596 57995 57514 57297 57244 57239 57291 57312 57029 56355 55691 55543 55921 56406 56697
$$ packed form
54398F3006J93L34M14K77R6J20Q7m52j245j460q42r4J24m9j98l07n14o59n24k29
54378E8078k7L3J2j11k58j89J25L27J47j92l00j27P4J26N8j4M4K69M29K49j52
54357E8601k85M4M28M07P7j51j23l8o5j49p2L23Q81J129P31J2l26m7L53L41n5
54336F2016m79o86n62p2N25P45M43L8o5J9ln5J04M12N55M17J83O2J40L46M83L74
54314F4940J59J67M00M99L71M47R95J531J412P25J66J49M64P15O98L69j40n17
54296G3550n11k44o2p1j15j25k44n78r90j252j253j039p54n03l07k18m01q73j241
54277F2769j006k76K30M1m72o37k95K08O02Q29Q03M46n5l56l44j90n0L0m2l54
54257F1881p62r40p19k94l1j19m20o01m81k17n3nN2K1k83o74o64j48L78M85K91
$$ plain form
54236 56697 56776 56615 56197 55826 55967 56648 57392 57898 58385 59081 59733 59955 59769 59505 59363 59338 59401 59476 59355 58934
54216 58934 58442 58264 58561 59231 60082 60865 61270 61179 60856 60723 60953 61421 61957 62446 62802 63032 63305 63718 64076
54197 64076 64110 63914 63917 64339 64937 65348 65507 65562 65548 65322 64790 64057 63333 62766 62384 62145 62050 62182 62602 63151 63461
54176 63461 63267 62709 62192 61943 61837 61680 61486 61370 61326 61279 61231 61153 60848 60153 59293 58748 58731 59047 59499 60133 60931
54155 60931 61560 61654 61254 60741 60446 60410 60421 60186 59629 59101 59084 59611 60199 60525 60823 61380 61960 62106 61805 61457
54135 61457 61306 61257 61188 61077 60859 60447 59891 59301 58712 58245 58204 58699 59339 59704 59960 60606 61683 62714 63396
54116 63396 63887 64383 64846 65213 65481 65519 65175 64620 64203 63938 63517 62836 62119 61500 60999 60923 61666 62926 63712
54097 63712 63463 62730 62400 62690 63177 63413 63130 62225 60987 60091 59946 60237 60391 60276 60156 60199 60428 60926 61708
$$ packed form
54236E6697P9j61m18l71J41O81P44N06M87O96O52K22j86k64j42k5O3P5j21m21
54216E8934m92j78K97O70Q51P83M05r1l23j33K30M68N36M89L56K30K73M13L58
54197F4076L4j96LM22N98M11J59N5j4k26n32p33p24n67l82k39r5J32M20N49L10
54176F3461j94n58n17k49j06j57j94j16m4m7m8p8l05o95q60n45j7L16M52O34P98
54155F0931O29R4m00n13k95l6J1k35n57n28j7N27N88L26K98N57N80J46l01l48
54135F1457j51m9o9j11k18m12n56n90n89m67m1M95O40L65K56O46J077J031O82
54116F3396M91M96M63L67K68L8l44n55m17k65m21o81p17o19n01p6P43J260P86
54097F3712k49p33l30K90M87K36k83r05j238q96j45K91J54j15j20M3K29M98P82
$$ plain form
54078 61708 62480 62874 62841 62596 62301 62026 61859 61818 61808 61854 62158 62740 63269 63553 63903 64651 65535 66021 66076 66189 66681
54057 66681 67398 68086 68668 69115 69392 69650 70205 71198 72432 73603 74569 75402 76336 77595 79141 80568 81450
54040 81450 81735 81688 81491 81089 80420 79601 78857 78354 78105 77919 77519 76804 75965 75247 74709 74307 74067 74024 74072 74038
54020 74038 73874 73638 73357 73030 72700 72431 72267 72317 72745 73568 74597 75645 76677 77622 78268 78518 78587 78758 79070
54001 79070 79416 79782 80181 80536 80820 81156 81566 81815 81804 81905 82550 83584 84445 84958 85549 86616 88014 89335
53983 89335 90455 91626 93140 95056 97203 99401 101639 104020 106500 108832 110880 112859 115131 117831
53969 117831 120798 123755 126434 128673 130584 132498 134581 136600 138217 139364 140142 140532 140472 140126 139763 139465
53953 139465 139133 138716 138134 137124 135442 133240 130911 128643 126389 124244 122462 121037 119561 117677 115467
$$ packed form
54078F1708P72L94l3k45k95k75j67m1j0M6L04N82N29K84L50P48Q84M86N5J13M92
54057F6681P17O88N82M47K77K58N55R93J234J171R66Q33R34J259J546J427Q82
54040H1450K85m7j97m02o69q19p44n03k49j86m00p15q39p18n38m02k40m3M8l4
54020G4038j64k36k81l27l30k69j64N0M28Q23J029J048J032R45O46K50O9J71L12
54001G9070L46L66L99L55K84L36M10K49j1J01O45J034Q61N13N91J067J398J321
53983H9335J120J171J514J916K147K198K238K381K480K332K048J979K272K700
53969A17831K967K957K679K239J911J914K083K019J617J147P78L90o0l46l63k98
53953A39465l32m17n82j010j682k202k329k268k254k145j782j425j476j884k210
$$ plain form
53938 115467 113276 111281 109363 107318 105143 103166 101830 101262 101107 100902 100501 100015 99508 98985 98564 98355
53922 98355 98224 97958 97644 97590 97877 98265 98567 98863 99288 99890 100759 102042 103745 105694 107806 110163 112748
53905 112748 115221 117071 117914 117642 116479 114898 113352 112008 110790 109637 108592 107724 107135 106970 107205 107491
53889 107491 107488 107331 107538 108390 109671 111020 112319 113651 115098 116669 118273 119727 120962 122226 123901 126078
53873 126078 128483 130869 133244 135651 137959 139986 141725 143354 145131 147241 149616 151922 153913 155775
53859 155775 157923 160478 163226 166076 169256 172927 176861 180640 184020 186999 189723 192405 195144 197747
53845 197747 199890 201528 202965 204414 205676 206355 206204 205207 203538 201591 199851 198527 197395 196071 194335
53830 194335 192073 189144 185490 181318 177011 172863 169004 165469 162223 159097 155844 152325 148695 145367
$$ packed form
53938A15467k191j995j918k045k175j977j336n68j55k05m01m86n07n23m21k09
53922I8355j31k66l14n4K87L88L02K96M25O02Q69J283J703J949K112K357K585
53905A12748K473J850Q43k72j163j581j546j344j218j153j045q68n89j65K35K86
53889A07491lj57K07Q52J281J349J299J332J447J571J604J454J235J264J675K177
53873A26078K405K386K375K407K308K027J739J629J777K110K375K306J991J862
53859A55775K148K555K748K850L180L671L934L779L380K979K724K682K739K603
53845A97747K143J638J437J449J262O79j51r97j669j947j740j324j132j324j736
53830A94335k262k929l654m172m307m148l859l535l246l126l253l519l630l328
$$ plain form
53816 145367 142697 140622 138689 136548 134289 132204 130340 128489 126487 124290 121843 119195 116667 114608
53802 114608 112953 111330 109606 107991 106576 105172 103715 102422 101360 100203 98722 97242 96305 96047 96185
53787 96185 96442 96729 97012 97275 97590 97988 98302 98263 97752 96897 96010 95472 95499 95883 96107 95889 95514 95474 95897 96450
53767 96450 96734 96605 96179 95660 95215 94954 94983 95413 96199 97042 97649 98114 98836 100023 101475 102900 104188 105285
53749 105285 106113 106800 107715 109069 110713 112541 114808 117762 121122 124308 127077 129603 132037 134330 136494
53734 136494 138678 140861 142760 144187 145340 146613 148212 149959 151410 152146 152077 151521 150891 150302 149522 148295
53718 148295 146621 144744 142926 141208 139376 137188 134704 132289 130218 128409 126628 124777 122824 120638
53704 120638 118202 115897 114238 113253 112440 111425 110367 109517 108640 107246 105315 103468 102327 101915 101793 101609
$$ packed form
53816A45367k670k075j933k141k259k085j864j851k002k197k447k648k528k059
53802A14608j655j623j724j615j415j404j457j293j062j157j481j480r37k58J38
53787I6185K57K87K83K63L15L98L14l9n11q55q87n38K7L84K24k18l75m0M23N53
53767I6450K84j29m26n19m45k61K9M30P86Q43O07M65P22J187J452J425J288J097
53749A05285Q28O87R15J354J644J828K267K954L360L186K769K526K434K293K164
53734A36494K184K183J899J427J153J273J599J747J451P36o9n56o30n89p80j227
53718A48295j674j877j818j718j832k188k484k415k071j809j781j851j953k186
53704A20638k436k305j659r85q13j015j058q50q77j394j931j847j141m12j22j84
$$ plain form
53688 101609 101305 100893 100280 99423 98501 97760 97265 96876 96456 95993 95560 95251 95145 95241 95420 95564 95690 95867 96026
53669 96026 96031 95948 96081 96624 97371 97921 98127 98253 98688 99578 100740 101850 102691 103268 103742 104280 104917 105545 106021
53650 106021 106338 106661 107167 107906 108904 110281 112036 113737 114761 115001 115075 115656 116775 118059 119400 121021
53634 121021 122955 124882 126487 127733 128722 129540 130278 130942 131328 131184 130538 129685 128882 128259 127945 127998 128209 128299
53616 128299 128310 128535 129055 129677 130306 130967 131423 131230 130376 129476 129077 129134 129334 129607 129998 130351 130474 130447 130472 130556
53596 130556 130571 130525 130539 130670 130924 131293 131690 131985 132249 132727 133421 133991 134224 134385 134837 135557 136255 136819 137356 137964
53576 137964 138677 139493 140276 140803 141091 141508 142407 143829 145685 147909 150251 152264 153776 155054 156206 156827
53560 156827 156668 156273 156450 157342 158512 159702 160919 162001 162790 163685 165299 167481 169318 170317 171050 172323
$$ packed form
53688A01609l04m12o13q57r22p41m95l89m20m63m33l09j06R6J79J44J26J77J59
53669I6026Nq3J33N43P47N50K06J26M35Q90J162J110Q41N77M74N38O37O28M76
53650A06021L17L23N06P39R98J377J755J701J024K40P4N81J119J284J341J621
53634A21021J934J927J605J246R89Q18P38O64L86j44o46q53q03o23l14N3K11R0
53616A28299J1K25N20O22O29O61M56j93q54r00l99N7K00K73L91L53J23k7K5Q4
53596A30556J5m6J4J31K54L69L97K95K64M78O94N70K33J61M52P20O98N64N37O08
53576A37964P13Q16P83N27K88M17Q99J422J856K224K342K013J512J278J152O21
53560A56827j59l95J77Q92J170J190J217J082P89Q95J614K182J837R99P33J273
$$ plain form
53544 172323 174204 176197 177966 179530 180914 182025 182795 183265 183547 183798 184152 184623 185121 185551 185792 185676 185197
53527 185197 184650 184320 184109 183745 183268 182959 182779 182327 181449 180494 179766 179048 177944 176454 174970 173820 173019
53510 173019 172356 171590 170660 169794 169307 169248 169394 169616 170014 170616 171153 171348 171323 171475 172013 172728 173221 173305 173171 173177
53490 173177 173492 174017 174662 175537 176730 178090 179448 180929 182736 184731 186580 188238 189953 191803 193640
53475 193640 195537 197884 200865 204187 207518 210863 214406 218261 222597 227637 233248 238772 243616 247870
53461 247870 252173 257108 262909 269541 276800 284471 292561 301250 310445 319677 328662 337707 347259 357284
53447 357284 367441 377672 388184 398913 409467 419633 429579 439507 449401 459202 468934 478571 488003
53434 488003 497180 506118 514737 522999 531205 539816 548851 557762 566094 573985 581799 589524 596916 604057
$$ packed form
53544A72323J881J993J769J564J384J111P70M70K82K51L54M71M98M30K41j16m79
53527A85197n47l30k11l64m77l09j80m52q78r55p28p18j104j490j484j150q01
53510A73019o63p66r30q66m87n9J46K22L98O02N37J95k5J52N38P15M93Q4j34O
53490A73177L15N25O45Q75J193J360J358J481J807J995J849J658J715J850J837
53475A93640J897K347K981L322L331L345L543L855M336N040N611N524M844M254
53461B47870M303M935N801O632P259P671Q090Q689R195R232Q985R045R552J0025
53447C57284J0157J0231J0512J0729J0554J0166R946R928R894R801R732R637R432
53434D88003R177Q938Q619Q262Q206Q611R035Q911Q332P891P814P725P392P141
$$ plain form
53420 604057 611352 618943 626433 633302 639385 644822 649727 654061 657787 660983 663751 666030 667536 667899
53406 667899 666964 664938 662212 658994 655209 650743 645666 640136 634200 627823 621080 614193 607359 600601
53392 600601 593802 586758 579243 571156 562684 554239 546150 538475 531119 524092 517558 511658 506355 501484
53378 501484 496919 492695 488943 485774 483237 481369 480206 479691 479666 480035 480853 482145 483807 485834 488563
53363 488563 492420 497458 503348 509830 516888 524504 532556 541083 550331 560364 570950 582010 593853
53350 593853 606660 620018 633363 646687 660395 674634 689228 704245 720140 737204 755241
53339 755241 773942 793278 813356 834143 855549 877578 900224 923325 946644 970029 993379
53328 993379 1016584 1039532 1062137 1084320 1106030 1127253 1147861 1167467 1185652 1202352 1217845
$$ packed form
53420F04057P295P591P490O869O083N437M905M334L726L196K768K279J506L63
53406F67899r35k026k726l218l785m466n077n530n936o377o743o887o834o758
53392F00601o799p044p515q087q472q445q089p675p356p027o534n900n303m871
53378E01484m565m224l752l169k537j868j163n15k5L69Q18J292J662K027K729
53363D88563L857N038N890O482P058P616Q052Q527R248J0033J0586J1060J1843
53350E93853J2807J3358J3345J3324J3708J4239J4594J5017J5895J7064J8037
53339G55241J8701J9336K0078K0787K1406K2029K2646K3101K3319K3385K3350
53328I93379K3205K2948K2605K2183K1710K1223K0608J9606J8185J6700J5493
$$ plain form
53317 1217845 1232264 1245395 1257007 1267197 1276188 1283932 1290099 1294414 1296812 1297251 1295529 1291326 1284462
53304 1284462 1275045 1263386 1249719 1234125 1216725 1197882 1178022 1157340 1135819 1113567 1090934
53293 1090934 1068286 1045802 1023533 1001553 979945 958777 938134 918114 898783 880169 862189
53282 862189 844498 826530 807959 789154 770946 753878 737884 722685 708216 694569 681774
53271 681774 669894 659186 649900 641912 634724 627822 620938 614015 607082 600258 593792 587979 582928 578418
53257 578418 574060 569651 565319 561327 557831 554882 552486 550554 548939 547701 547189 547650 548878 550472 552338
53242 552338 554642 557383 560419 563909 568344 573950 580420 587397 594927 603189 611998 620907 629690 638511
53228 638511 647578 656847 666088 675122 683893 692319 700181 707283 713698 719693 725272 730007 733491 735787
$$ packed form
53317A217845J4419J3131J1612J0190Q991P744O167M315K398M39j722m203o864
53304A284462r417j1659j3667j5594j7400j8843j9860k0682k1521k2252k2633
53293A090934k2648k2484k2269k1980k1608k1168k0643k0020j9331j8614j7980
53282H62189j7691j7968j8571j8805j8208j7068j5994j5199j4469j3647j2795
53271F81774j1880j0708r286p988p188o902o884o923o933o824o466n813n051m510
53257E78418m358m409m332l992l496k949k396j932j615j238n12M61J228J594J866
53242E52338K304K741L036L490M435N606O470O977P530Q262Q809Q909Q783Q821
53228F38511R067R269R241R034Q771Q426P862P102O415N995N579M735L484K296
$$ plain form
53214 735787 737148 737483 736522 734426 731762 728729 724819 719449 712633 704781 696154 686743 676474 665315
53200 665315 653340 640859 628337 616005 603730 591411 579209 567176 554888 541879 528321
53189 528321 514975 502448 490753 479545 468500 457417 446183 434831 423539 412454 401557
53178 401557 390775 380199 370090 360590 351508 342533 333718 325572 318504 312322 306474 300675 295031
53165 295031 289595 284189 278747 273512 268725 264296 259938 255450 250720 245626 240109 234289 228411 222719
53151 222719 217395 212535 208097 203990 200179 196632 193207 189802 186570 183751 181264 178708 175797 172629
53137 172629 169520 166699 164126 161418 158109 154252 150578 147696 145296 142656 139793 137432 135820 134289
53123 134289 132308 130249 128711 127585 126294 124576 122608 120629 118876 117622 116899 116376 115767 115134 114531
$$ packed form
53214G35787J361L35r61k096k664l033l910n370o816p852q627r411j0269j1159
53200F65315j1975j2481j2522j2332j2275j2319j2202j2033j2288j3009j3558
53189E28321j3346j2527j1695j1208j1045j1083j1234j1352j1292j1085j0897
53178D01557j0782j0576j0109r500r082q975q815q146p068o182n848n799n644
53165B95031n436n406n442n235m787m429m358m488m730n094n517n820n878n692
53151B22719n324m860m438m107l811l547l425l405l232k819k487k556k911l168
53137A72629l109k821k573k708l309l857l674k882k400k640k863k361j612j531
53123A34289j981k059j538j126j291j718j968j979j753j254p23n23o09o33o03
$$ plain form
53108 114531 113766 112798 111956 111376 110588 109159 107454 106233 105742 105661 105736 105930 106103 106064 105875 105698 105458 105022 104577
53089 104577 104414 104456 104426 104361 104531 104948 105374 105717 106011 106151 106060 105998 106286 106797 107175 107420 107794 108283 108618 108730
53069 108730 108687 108312 107448 106521 106242 106710 107376 107887 108409 109065 109701 110332 111248 112444 113461 113995 114226 114368
53051 114368 114346 114130 113912 113743 113387 112755 112089 111507 110832 110056 109525 109388 109291 108913 108433 108111 107751 106994 105890
53032 105890 104820 104020 103442 102945 102396 101749 101193 101036 101290 101581 101636 101560 101518 101455 101328 101290 101381 101353 101083 100870 100972
53011 100972 101118 100859 100238 99757 99760 100160 100672 101017 100926 100267 99220 98191 97516 97269 97267 97188 96835 96348 96057 96063 96130
52990 96130 96064 95955 95979 96189 96609 97277 98082 98768 99241 99634 99928 99881 99485 99194 99364 99721 99713 99212 98599 98276 98399
52969 98399 98945 99784 100681 101409 101827 101805 101272 100453 99804 99561 99545 99570 99725 100061 100334 100372 100430 100799 101297 101522 101436
$$ packed form
53108A14531p65r68q42n80p88j429j705j221m91q1P5J94J73l9j89j77k40m36m45
53089A04577j63M2l0o5J70M17M26L43K94J40r1o2K88N11L78K45L74M89L35J12
53069A08730m3l75q64r27k79M68O66N11N22O56O36O31R16J196J017N34K31J42
53051A14368k2k16k18j69l56o32o66n82o75p76n31j37r7l78m80l22l60p57j104
53032A05890j070q00n78m97n49o47n56j57K54K91N5p6m2o3j27l8R1k8k70k13J02
53011A00972J46k59o21m81LM00N12L45r1o59j047j029o75k47kp9l53m87k91OO7
52990I6130o6j09K4K10M20O68Q05O86M73L93K94m7l96k91J70L57qn01o13l23J23
52969I8399N46Q39Q97P28M18k2n33q19o49k43j6K5J55L36K73L8N8L69M98K25q6
$$ plain form
52948 101436 101282 101107 100781 100412 100288 100394 100401 100236 100288 100900 101937 102988 103794 104373 104870 105401 105926 106211 106030
52929 106030 105441 104814 104555 104821 105422 105943 106077 105905 105823 106093 106611 107146 107617 108033 108307 108379 108373 108474 108710 108988
52909 108988 109212 109257 109021 108647 108528 108888 109536 110191 110798 111317 111511 111292 111052 111242 111753 112068 111923 111449 110760
52890 110760 109844 108849 108044 107451 106830 106103 105442 104944 104527 104179 103985 103850 103523 102966 102399 101907 101327 100622 100040
52871 100040 99766 99683 99616 99595 99717 99992 100440 101109 101849 102257 102027 101232 100190 99238 98669 98649 99058 99592 100126 100759
52851 100759 101427 101785 101635 101241 100996 100956 100891 100641 100220 99724 99317 99167 99252 99334 99282 99230 99305 99409 99534 100006 101085
52830 101085 102432 103379 103688 103697 103698 103582 103241 102951 103070 103511 103815 103716 103434 103384 103767 104481 105304 106077 106752 107357
52810 107357 107967 108687 109607 110704 111800 112653 113157 113390 113410 113084 112262 111124 110143 109567 109052 108039 106431
$$ packed form
52948A01436j54j75l26l69j24J06Pj65N2O12J037J051Q06N79M97N31N25K85j81
52929A06030n89o27k59K66O01N21J34j72q2K70N18N35M71M16K74P2oJ01K36K78
52909A08988K24M5k36l74j19L60O48O55O07N19J94k19k40J90N11L15j45m74o89
52890A10760r16r95q05n93o21p27o61m98m17l48j94j35l27n57n67m92n80p05n82
52871A00040k74q3o7k1J22K75M48O69P40M08k30p95j042r52n69k0M09N34N34O33
52851A00759O68L58j50l94k45m0o5k50m21m96m07j50Q5Q2n2n2P5J04J25M72J079
52830A01085J347R47L09RJj16l41k90J19M41L04r9k82n0L83P14Q23P73O75O05
52810A07357O10P20R20J097J096Q53N04K33K0l26q22j138r81n76n15j013j608
$$ plain form
52793 106431 104682 103212 101991 100796 99594 98469 97345 96106 94938 94250 94196 94441 94494 94131 93461 92710
52777 92710 92054 91604 91454 91657 92137 92651 92967 93102 93276 93574 93828 93929 94066 94428 94834 94947 94798 94785 95129
52758 95129 95621 95996 96246 96443 96531 96502 96606 97107 97926 98753 99435 100050 100595 100814 100427 99446 98183 96986 95996
52739 95996 95154 94387 93724 93186 92642 91919 91055 90315 89912 89802 89832 89977 90267 90617 90863 90996 91231 91775 92554
52720 92554 93210 93421 93248 93133 93469 94163 94754 94941 94903 95029 95473 96085 96656 97047 97143 96892 96430 96030 95808 95613
52700 95613 95251 94765 94403 94340 94534 94826 95124 95481 96027 96826 97737 98440 98730 98748 98843 99133 99353 99261 99065 99258
52680 99258 100069 101279 102567 103801 104897 105656 105926 105814 105565 105280 104916 104513 104209 104082 104134 104416 104975 105627
52662 105627 105975 105731 104989 104117 103463 103174 103160 103204 103165 103120 103218 103389 103316 102789 101951 101107 100353 99573 98773 98205 98086
$$ packed form
52793A06431j749j470j221j195j202j125j124j239j168o88n4K45N3l63o70p51
52777I2710o56m50j50K03M80N14L16J35J74K98K54J01J37L62M06J13j49j3L44
52758I5129M92L75K50J97Q8k9J04N01Q19Q27O82O15N45K19l87r81j263j197r90
52739I5996q42p67o63n38n44p23q64p40m03j10L0J45K90L50K46J33K35N44P79
52720I2554O56K11j73j15L36O94N91J87l8J26M44O12N71L91R6k51m62m00k22j95
52700I5613l62m86l62o3J94K92K98L57N46P99R11P03K90J8R5K90K20r2j96J93
52680I9258Q11J210J288J234J096P59K70j12k49k85l64m03l04j27N2K82N59O52
52662A05627L48k44p42q72o54k89j4M4l9m5R8J71p3n27q38q44p54p80q00n68j19
$$ plain form
52641 98086 98282 98419 98288 98027 97891 98007 98401 99127 100173 101274 102013 102165 101850 101337 100827 100468 100362 100424 100387
52622 100387 100113 99838 99920 100357 100721 100590 99952 99158 98592 98396 98437 98479 98395 98250 98202 98376 98816 99465 100175 100803
52602 100803 101355 101967 102713 103566 104558 105776 107108 108169 108727 109024 109491 110197 110820 111081 110955 110519 109843 109106
52584 109106 108567 108338 108274 108158 107887 107504 107183 107121 107330 107550 107540 107402 107423 107649 107847 107890 107917 108118 108585 109359 110321
52563 110321 111013 110942 110222 109582 109526 109749 109624 109011 108304 107854 107688 107683 107674 107400 106647 105542 104553 104093 104229 104742
52543 104742 105327 105745 105880 105797 105632 105475 105368 105379 105582 105951 106359 106700 106954 107135 107229 107164 106869 106395 106009 106041
52523 106041 106546 107209 107686 107958 108217 108481 108567 108455 108413 108641 108927 108876 108437 108020 108048 108542 109232 109936 110659 111357
52503 111357 111830 111919 111706 111369 110906 110164 109130 108058 107240 106775 106602 106667 106943 107306 107540 107545 107500 107705 108247 108896
$$ packed form
52641I8086J96J37j31k61j36J16L94P26J046J101P39J52l15n13n10l59j06O2l7
52622A00387k74k75Q2M37L64j31o38p94n66j96M1M2q4j45m8J74M40O49P10O28
52602A00803N52O12P46Q53R92J218J332J061N58K97M67P06O23K61j26m36o76p37
52584A09106n39k29o4j16k71l83l21o2K09K20j0j38K1K26J98M3K7K01M67P74R62
52563A10321O92p1p20o40n6K23j25o13p07m50j66nrk74p53j105r89m60J36N13
52543A04742N85M18J35q3j65j57j07J1K03L69M08L41K54J81R4o5k95m74l86L2
52523A06041N05O63M77K72K59K64Q6j12m2K28K86n1m39m17K8M94O90P04P23O98
52503A11357M73Q9k13l37m63p42j034j072q18m65j73O5K76L63K34Nm5K05N42O49
$$ plain form
52483 108896 109386 109699 109933 109980 109625 109015 108725 109136 109921 110399 110320 110043 109976 110104 110126 109831 109245 108566 108057 107908
52463 107908 108094 108423 108725 108951 109157 109444 109888 110408 110793 110947 111017 111127 111154 111031 111133 112001 113634 115403 116720
52444 116720 117492 117839 117743 117194 116412 115660 114990 114334 113700 113113 112559 112120 111957 112024 112029 111888 111943 112471 113169 113472
52424 113472 113233 112727 112115 111291 110302 109520 109262 109477 109943 110590 111478 112565 113658 114563 115238 115796 116338 116830
52406 116830 117195 117558 118172 119030 119731 119946 119885 120020 120459 120840 120852 120553 120119 119566 118888 118259 117903 117815 117708 117246
52386 117246 116318 115124 114025 113247 112742 112378 112170 112204 112424 112683 112970 113401 113970 114506 114918 115307 115749 116130
52368 116130 116297 116239 116065 115914 115947 116311 116966 117695 118347 118967 119569 119937 119864 119538 119465 119978 120977 122153 123307
52349 123307 124412 125486 126581 127857 129514 131601 133904 136100 137989 139557 140769 141394 141152 140084 138668
$$ packed form
52483A08896M90L13K34M7l55o10k90M11P85M78p9k77o7J28K2k95n86o79n09j49
52463A07908J86L29L02K26K06K87M44N20L85J54P0J10K7j23J02Q68J633J769J317
52444A16720P72L47r6n49p82p52o70o56o34n87n54m39j63O7Nj41N5N28O98L03
52424A13472k39n06o12q24r89p82k58K15M66O47Q88J087J093R05O75N58N42M92
52406A16830L65L63O14Q58P01K15o1J35M39L81J2k99m34n53o78o29l56q8j07m62
52386A17246r28j194j099p78n05l64k08L4K20K59K87M31N69N36M12L89M42L81
52368A16130J67n8j74j51L3L64O55P29O52O20O02L68p3l26p3N13R99J176J154
52349A23307J105J074J095J276J657K087K303K196J889J568J212O25k42j068j416
$$ plain form
52334 138668 137461 136619 135859 134865 133595 132178 130702 129252 128082 127513 127616 128113 128630 128988 129226 129485 129923
52317 129923 130607 131406 132099 132711 133565 134856 136285 137387 138143 138991 140209 141590 142818 143922 145146 146508
52301 146508 147691 148336 148360 148007 147654 147531 147594 147728 148038 148782 149938 151101 151898 152348 152698 153110 153727 154856
52283 154856 156721 159039 161159 162742 164119 165855 168119 170630 173121 175666 178522 181757 185150 188464
52269 188464 191695 194987 198424 202064 206119 210853 216194 221665 226828 231682 236512 241526 246831 252588
52255 252588 258917 265665 272516 279319 286127 292948 299665 306229 312734 319248 325743 332224 338785 345434
52241 345434 352045 358548 365074 371742 378333 384313 389247 393160 396456 399463 402120 404193 405724 407011
52227 407011 408099 408572 408095 406988 405913 405083 404124 402772 401317 400221 399588 399235 399058 399055 399140 399249 399591 400520
$$ packed form
52334A38668j207q42p60r94j270j417j476j450j170n69J03M97N17L58K38K59M38
52317A29923O84P99O93O12Q54J291J429J102P56Q48J218J381J228J104J224J362
52301A46508J183O45K4l53l53j23O3J34L10P44J156J163P97M50L50M12O17J129
52283A54856J865K318K120J583J377J736K264K511K491K545K856L235L393L314
52269A88464L231L292L437L640M055M734N341N471N163M854M830N014N305N757
52255B52588O329O748O851O803O808O821O717O564O505O514O495O481O561O649
52241C45434O611O503O526O668O591N980M934L913L296L007K657K073J531J287
52227D07011J088M73m77j107j075q30r59j352j455j096o33l53j77lQ5J09L42R29
$$ plain form
52209 400520 402085 403962 405871 407925 410385 413239 416235 419298 422698 426694 431134 435600 439921 444374
52195 444374 449338 454851 460571 466082 471171 475887 480467 485096 489632 493594 496584 498669 500213 501357
52181 501357 501866 501561 500697 499701 498638 497122 494781 491690 488297 485014 481977 479124 476345 473499 470429
52166 470429 467117 463821 460925 458588 456621 454721 452747 450780 449005 447628 446783 446414 446319 446350 446507 446782
52150 446782 447065 447325 447760 448580 449671 450677 451412 452069 452996 454359 456037 457722 459124 460219 461326 462847
52134 462847 464877 467114 469190 471043 472920 475051 477341 479397 480886 481809 482372 482609 482309 481349 479870
52119 479870 478035 475825 473248 470550 467970 465427 462722 459985 457585 455650 453948 452301 450784 449470
52105 449470 448290 447271 446682 446748 447382 448311 449298 450167 450787 451214 451697 452358 452973 453226 453105 452953 453177 453995
$$ packed form
52209D00520J565J877J909K054K460K854K996L063L400L996M440M466M321M453
52195D44374M964N513N720N511N089M716M580M629M536L962K990K085J544J144
52181E01357N09l05q64r96j063j516k341l091l393l283l037k853k779k846l070
52166D70429l312l296k896k337j967j900j974j967j775j377q45l69r5L1J57K75
52150D46782K83K60M35Q20J091J006P35O57R27J363J678J685J402J095J107J521
52134D62847K030K237K076J853J877K131K290K056J489R23N63K37l00r60j479
52119D79870j835k210k577k698k580k543k705k737k400j935j702j647j517j314
52105D49470j180j019n89O6O34R29R87Q69O20M27M83O61O15K53j21j52K24Q18
$$ plain form
52087 453995 455290 456594 457376 457544 457563 457924 458581 459114 459361 459623 460273 461359 462641 463856 464908 465975 467434
52070 467434 469550 472194 475055 478153 481909 486578 491855 497292 502913 509102 515923 522938 529828 536846
52056 536846 544395 552398 560415 568313 576403 584836 593186 600834 607606 613844 619935 625957 631712 636971
52042 636971 641700 646142 650603 655078 659144 662346 664549 665841 666222 665635 664212 662219 659771 656816 653389
52027 653389 649648 645609 641090 636067 630875 625903 621245 616813 612666 609019 605943 603248 600717 598315
52013 598315 596169 594441 593281 592851 593240 594373 596050 598147 600708 603782 607214 610706 614133 617640 621388
51998 621388 625313 629229 633091 637028 641123 645244 649080 652300 654768 656582 657856 658446 658037 656534 654143
51983 654143 651022 647111 642484 637546 632586 627408 621762 615949 610522 605482 600289 594689 589037 583677
$$ packed form
52087D53995J295J304P82J68J9L61O57N33K47K62O50J086J282J215J052J067J459
52070D67434K116K644K861L098L756M669N277N437N621O189O821P015O890P018
52056E36846P549Q003Q017P898Q090Q433Q350P648O772O238O091O022N755N259
52042F36971M729M442M461M475M066L202K203J292L81n87j423j993k448k955l427
52027F53389l741m039m519n023n192m972m658m432m147l647l076k695k531k402
52013E98315k146j728j160m30L89J133J677K097K561L074L432L492L427L507L748
51998F21388L925L916L862L937M095M121L836L220K468J814J274N90m09j503k391
51983F54143l121l911m627m938m960n178n646n813n427n040n193n600n652n360
$$ plain form
51969 583677 578428 572936 567135 561141 555036 549022 543473 538514 533753 528795 523796 519181 514948 510622
51955 510622 505883 500869 495841 490814 485637 480265 474836 469571 464596 459757 454600 448650 441777 434244
51941 434244 426441 418623 410872 403225 395819 388892 382578 376648 370614 364216 357732 351652 346066 340540
51927 340540 334626 328345 322119 316262 310668 305001 299078 292967 286722 280303 273859 267913 262984 259024
51913 259024 255532 252209 249268 246997 245335 244024 243001 242411 242405 243066 244400 246188 247967 249332 250196 250651
51897 250651 250721 250473 250203 250250 250628 251035 251215 251184 251152 251391 252119 253317 254722 256229 258283 261636 266623 272837
51879 272837 279627 286741 294381 302718 311530 320281 328402 335388 340692 343718 344061 341779 337333 331273
51865 331273 324056 316103 307798 299340 290726 282021 273484 265352 257639 250342 243708 238019 233152 228623
$$ packed form
51969E83677n249n492n801n994o105o014n549m959m761m958m999m615m233m326
51955E10622m739n014n028n027n177n372n429n265m975m839n157n950o873p533
51941D34244p803p818p751p647p406o927o314n930o034o398o484o080n586n526
51927C40540n914o281o226n857n594n667n923o111o245o419o444n946m929l960
51913B59024l492l323k941k271j662j311j023n90oO61J334J788J779J365Q64M55
51897B50651P0k48k70M7L78M07J80l1l2K39P28J198J405J507K054L353M987O214
51879B72837O790P114P640Q337Q812Q751Q121O986N304L026L43k282m446o060
51865C31273p217p953q305q458q614q705q537q132p713p297o634n689m867m529
$$ plain form
51851 228623 224149 219986 216561 213888 211545 209208 207065 205599 204978 204818 204619 204333 204329 204799 205382 205443 204597
51834 204597 202848 200392 197488 194517 191908 189853 188158 186505 184927 183890 183745 184170 184388 184103 183945
51819 183945 184737 186500 188517 190244 191767 193346 194962 196492 197926 199190 200056 200477 200768 201204 201653 201805
51803 201805 201525 200777 199502 197877 196467 195738 195600 195701 195968 196471 196958 197024 196688 196336 196067 195485 194246 192437
51785 192437 190321 188050 185742 183547 181467 179368 177294 175580 174471 173822 173304 172768 172286 171998 172046 172508
51769 172508 173269 173985 174332 174256 173950 173564 172999 172033 170683 169408 168761 168846 169268 169715 170293 171169 172145 172921 173508
51750 173508 174029 174277 173934 173178 172622 172589 172852 173097 173276 173411 173440 173396 173394 173313 172881 172225 171964 172472 173344 173834 173590
51729 173590 172776 171709 170664 169819 169156 168549 168125 168280 169114 170131 170811 171251 171886 172747 173442 173783 174057 174652
$$ packed form
51851B28623m474m163l425k673k343k337k143j466o21j60j99k86mM70N83O1q46
51834B04597j749k456k904k971k609k055j695j653j578j037j45M25K18k85j58
51819A83945P92J763K017J727J523J579J616J530J434J264Q66M21K91M36M49J52
51803B01805k80p48j275j625j410p29j38J01K67N03M87O6l36l52k69n82j239j809
51785A92437k116k271k308k195k080k099k074j714j109o49n18n36m82k88M8M62
51769A72508P61P16L47p6l06l86n65r66j350j275o47Q5M22M47N78Q76R76P76N87
51750A73508N21K48l43p56n56l3K63K45J79J35K9m4kq1m32o56k61N08Q72M90k44
51729A73590q14j067j045q45o63o07m24J55Q34J017O80M40O35Q61O95L41K74N95
$$ plain form
51711 174652 175744 177385 179516 181821 183868 185557 187224 189160 191208 192950 194134 194737 194738 194017 192510
51696 192510 190340 187796 185192 182746 180504 178358 176170 173939 171893 170381 169575 169266 169023 168602 168095
51681 168095 167658 167276 166978 167132 168239 170387 173085 175728 178056 180077 181741 182960 183873 184805 185858 186769
51665 186769 187339 187861 188882 190544 192359 193707 194351 194421 194107 193558 192951 192400 191828 191094 190211 189282 188237
51648 188237 186862 185163 183528 182410 181921 181803 181702 181417 180955 180419 179850 179204 178513 177963 177700 177617 177537 177532 177815
51629 177815 178275 178378 177688 176332 174820 173534 172525 171705 171048 170611 170468 170603 170861 171070 171268 171711 172616
51612 172616 173968 175615 177438 179308 181018 182443 183756 185338 187406 189755 191902 193467 194420 194955 195187
51597 195187 195037 194422 193422 192128 190502 188579 186752 185570 185215 185379 185670 185937 186142 186127 185683 184734 183373
$$ packed form
51711A74652J092J641K131K305K047J689J667J936K048J742J184O03Jp21j507
51696A92510k170k544k604k446k242k146k188k231k046j512q06l09k43m21n07
51681A68095m37l82k98J54J107K148K698K643K328K021J664J219R13R32J053R11
51665A86769N70N22J021J662J815J348O44P0l14n49o07n51n72p34q83r29j045
51648A88237j375j699j635j118m89j18j01k85m62n36n69o46o91n50k63q3q0nK83
51629A77815M60J03o90j356j512j286j009q20o57m37j43J35K58K09J98M43R05
51612A72616J352J647J823J870J710J425J313J582K068K349K147J565R53N35K32
51597A95187j50o15j000j294j626j923j827j182l55J64K91K67K05j5m44r49j361
$$ plain form
51580 183373 181853 180574 179863 179640 179473 179056 178438 177697 176660 175123 173182 171129 169162 167405 166041 165160
51564 165160 164528 163771 162790 161844 161230 161016 161032 160956 160485 159582 158541 157701 157134 156737 156489 156434 156466 156351 156016 155646
51544 155646 155473 155550 155761 156021 156485 157531 159414 161892 164412 166791 169449 172769 176451 179765 182280 183960
51528 183960 184739 184510 183591 182726 182396 182418 182393 182290 182401 182970 184106 185890 188294 191129 194243 197727 201711
51511 201711 206034 210307 214290 218047 221724 225338 228808 232165 235623 239498 243991 249087 254686 260835
51497 260835 267739 275458 283672 291798 299308 305897 311442 315915 319285 321415 322085 321175 318838 315370 310973
51482 310973 305700 299681 293245 286799 280607 274707 269013 263462 258069 252890 247905 242980 237959 232761
51468 232761 227412 222033 216843 212131 208084 204612 201382 198108 194782 191643 188971 186897 185332 184013
$$ packed form
51580A83373j520j279p11k23j67m17o18p41j037j537j941k053j967j757j364q81
51564A65160o32p57r81r46o14k14J6p6m71r03j041q40n67l97k48n5L2j15l35l70
51544A55646j73P7K11K60M64J046J883K478K520K379K658L320L682L314K515J680
51528A83960P79k29r19q65l30K2k5j03J11N69J136J784K404K835L114L484L984
51511B01711M323M273L983L757L677L614L470L357L458L875M493N096N599O149
51497B60835O904P719Q214Q126P510O589N545M473L370K130O70r10k337l468m397
51482C10973n273o019o436o446o192n900n694n551n393n179m985m925n021n198
51468B32761n349n379n190m712m047l472l230l274l326l139k672k074j565j319
$$ plain form
51454 184013 182640 181062 179332 177598 175972 174515 173256 172132 170995 169788 168696 167948 167472 166922 166114
51439 166114 165267 164695 164430 164320 164367 164709 165263 165649 165592 165259 165079 165278 165681 165922 165755 165207 164475 163699 162854
51420 162854 161867 160803 159884 159289 159015 158880 158608 157940 156790 155363 154015 152939 152037 151107 150041 148830
51404 148830 147510 146235 145343 145141 145594 146325 146948 147387 147792 148219 148532 148657 148844 149487 150674 152085 153437
51387 153437 154878 156796 159341 162298 165371 168444 171571 174860 178337 181766 184653 186633 187871 188899
51373 188899 190028 191057 191556 191237 190032 188059 185609 183003 180352 177583 174716 171955 169462 167252 165386
51358 165386 164020 163136 162401 161508 160509 159650 159010 158515 158200 158242 158725 159485 160237 160857 161543 162672 164378 166301
51340 166301 167969 169388 171040 173250 175803 178266 180464 182493 184555 186919 189802 193106 196486 199847
$$ packed form
51454A84013j373j578j730j734j626j457j259j124j137j207j092p48m76n50q08
51439A66114q47n72k65j10M7L42N54L86n7l33j80J99M03K41j67n48p32p76q45
51420A62854r87j064r19n95k74j35k72o68j150j427j348j076r02r30j066j211
51404A48830j320j275q92k02M53P31O23M39M05M27L13J25J87O43J187J411J352
51387A53437J441J918K545K957L073L073L127L289L477L429K887J980J238J028
51373A88899J129J029M99l19j205j973k450k606k651k769k867k761k493k210j866
51358A65386j366q84p35q93r99q59o40m95l15M2M83P60P52O20O86J129J706J923
51340A66301J668J419J652K210K553K463K198K029K062K364K883L304L380L361
$$ plain form
51326 199847 203521 207776 212445 217291 222452 228250 234818 242265 250910 260902 271803 282995 294333
51313 294333 305864 317060 326928 334909 341141 345764 348510 349179 348003 345211 340615 333970 325500 315805
51299 315805 305412 294617 283560 272247 260663 249053 237984 228001 219347 212035 205925 200590
51287 200590 195444 190283 185523 181629 178525 175818 173404 171478 170040 168792 167555 166455 165618 164944 164284
51272 164284 163593 162784 161642 160091 158441 157152 156331 155580 154404 152713 150922 149559 148794 148324 147740 146968
51256 146968 146327 146174 146528 147068 147458 147619 147711 147937 148367 148873 149205 149174 148862 148609 148698 149070 149414 149545 149529 149446
51236 149446 149184 148624 147885 147243 146868 146747 146811 147016 147324 147759 148452 149486 150691 151724 152417 152975 153768 154980
51218 154980 156495 158090 159673 161256 162747 163912 164660 165243 165966 166735 167132 166947 166386 165701 164964 164337 164172
$$ packed form
51326A99847L674M255M669M846N161N798O568P447Q645R992J0901J1192J1338
51313B94333J1531J1196R868P981O232M623K746O69j176k792m596o645q470r695
51299C15805j0393j0795j1057j1313j1584j1610j1069r983q654p312o110n335
51287B00590n146n161m760l894l104k707k414j926j438j248j237j100q37o74o60
51272A64284o91q09j142j551j650j289q21p51j176j691j791j363p65m70n84p72
51256A46968o41j53L54N40L90J61R2K26M30N06L32l1l12k53Q9L72L44J31j6q3
51236A49446k62n60p39o42l75j21O4K05L08M35O93J034J205J033O93N58P93J212
51218A54980J515J595J583J583J491J165P48N83P23P69L97j85n61o85p37o27j65
$$ plain form
51201 164172 164517 164825 164494 163592 162658 161934 161198 160276 159333 158588 158093 157792 157519 156914 155709 154179 152981 152431
51183 152431 152232 151983 151616 151225 150843 150619 150904 151820 152931 153590 153529 152948 152212 151666 151619 152150 152917 153357 153183
51164 153183 152601 152051 151780 151722 151741 151891 152297 152827 153087 152941 152824 153278 154240 155124 155585 155851 156236 156718 157145
51145 157145 157567 158163 159003 160054 161219 162272 162994 163498 164164 165112 165980 166406 166450 166339 166066 165556 164975 164544
51127 164544 164172 163596 162811 162091 161643 161531 161817 162483 163243 163742 163986 164319 164934 165620 166050 166106 165856 165410 164922
51108 164922 164607 164603 164808 164907 164604 163876 163011 162353 161999 161808 161694 161708 161823 161859 161775 161841 162316 163080 163768 164138 164091
51087 164091 163496 162306 160846 159710 159307 159616 160325 161062 161506 161521 161243 160934 160745 160678 160727 160903 161157 161422 161689
51068 161689 161935 162058 162084 162326 163129 164440 165856 167061 168026 168793 169318 169576 169645 169613 169565 169715 170323 171381 172548
$$ packed form
51201A64172L45L08l31r02r34p24p36r22r43p45m95l01k73o05j205j530j198n50
51183A52431j99k49l67l91l82k24K85R16J111O59o1n81p36n46m7N31P67M40j74
51164A53183n82n50k71n8J9J50M06N30K60j46j17M54R62Q84M61K66L85M82M27
51145A57145M22N96Q40J051J165J053P22N04O66R48Q68M26M4j11k73n10n81m31
51127A64544l72n76p85p20m48j12K86O66P60M99K44L33O15O86M30N6k50m46m88
51108A64922l15mK05R9l03p28q65o58l54j91j14J4J15L6q4O6M75P64O88L70m7
51087A64091n95j190j460j136m03L09P09P37M44J5k78l09j89o7M9J76K54K65K67
51068A61689K46J23K6K42Q03J311J416J205R65P67N25K58O9l2m8J50O08J058J167
$$ plain form
51049 172548 173507 174264 174999 175749 176407 176960 177583 178420 179333 179937 179979 179676 179609 180170 181203 182242 183019 183581 184043
51030 184043 184427 184714 184867 184810 184619 184650 185205 186062 186635 186693 186666 187074 187956 189010 190027 190901 191454 191607 191675 192146
51010 192146 193188 194588 196177 197983 199991 202029 204065 206345 209093 212271 215831 219991 225016 230757
50996 230757 236646 242093 246774 250619 253788 256664 259628 262732 265724 268398 270712 272582 273834 274509
50982 274509 274922 275208 274969 273662 271255 268248 265176 262313 259794 257700 255917 254147 252110 249646 246674
50967 246674 243319 240073 237563 236021 235164 234626 234326 234356 234751 235500 236649 238250 240289 242724 245439 248224
50951 248224 250985 253971 257514 261497 265375 268807 271945 274971 277732 280081 282249 284488 286572 288015
50937 288015 288703 288963 289143 289383 289772 290445 291539 293232 295729 299023 302781 306680 310747 315131 319759 324537
$$ packed form
51049A72548R59P57P35P50O58N53O23Q37R13O04M2l03o7N61J033J039P77N62M62
51030A84043L84K87J53n7j91L1N55Q57N73N8k7M08Q82J054J017Q74N53J53O8M71
51010A92146J042J400J589J806K008K038K036K280K748L178L560M160N025N741
50996B30757N889N447M681L845L169K876K964L104K992K674K314J870J252O75
50982B74509M13K86k39j307k407l007l072k863k519k094j783j770k037k464k972
50967B46674l355l246k510j542q57n38l00L0L95P49J149J601K039K435K715K785
50951B48224K761K986L543L983L878L432L138L026K761K349K168K239K084J443
50937B88015O88K60J80K40L89O73J094J693K497L294L758L899M067M384M628M778
$$ plain form
50921 324537 329781 336003 343252 351035 358915 366876 375010 383203 391318 399531 408331 418287 429792 442842
50907 442842 457019 471865 487356 503866 521671 540649 560482 580983 602140 623905 645953
50896 645953 667629 688270 707673 726072 743482 759317 772978 784596 794770 803719 811221 817338
50884 817338 822589 827233 830954 833569 835603 837690 839699 840843 840491 838576 835342 831119 826249 820890
50870 820890 814782 807435 798584 788347 776942 764402 750579 735321 718651 700835 682293 663366
50858 663366 644202 624884 605637 586843 568936 552270 536946 522699 509098 495956 483509
50847 483509 472097 461761 452223 443160 434451 426259 418914 412615 407187 402259 397710 393741 390451 387606
50833 387606 384959 382632 380929 379916 379412 379314 379635 380264 380964 381691 382786 384650 387284 390240 393022 395583
$$ packed form
50921C24537N244O222P249P783P880P961Q134Q193Q115Q213Q800R956J1505J3050
50907D42842J4177J4846J5491J6510J7805J8978J9833K0501K1157K1765K2048
50896F45953K1676K0641J9403J8399J7410J5835J3661J1618J0174Q949P502O117
50884H17338N251M644L721K615K034K087K009J144l52j915l234m223m870n359
50870H20890o108p347q851j0237j1405j2540j3823j5258j6670j7816j8542j8927
50858F63366j9164j9318j9247j8794j7907j6666j5324j4247j3601j3142j2447
50847D83509j1412j0336r538r063q709q192p345o299n428m928m549l969l290k845
50833C87606k647k327j703j013n04r8L21O29P00P27J095J864K634K956K782K561
$$ plain form
50817 395583 398369 401871 406197 411154 416690 422968 429977 437372 444924 452965 462058 472314 483312 494684
50803 494684 506554 519321 533225 548294 564526 581975 600677 620621 641871 664666 689371
50792 689371 716334 745753 777684 812130 849070 888334 929529 972222 1016252 1061795 1108987
50781 1108987 1157426 1206074 1253693 1299369 1342590 1382883 1419571 1451931 1479485 1502049 1519596
50770 1519596 1532287 1540550 1544936 1545906 1543918 1539765 1534580 1529354 1524591 1520483 1517241 1515010 1513553 1512203
50756 1512203 1510165 1506715 1501136 1492604 1480354 1463935 1443249 1418334 1389197 1355968 1319165 1279611
50744 1279611 1238016 1194805 1150466 1105924 1062309 1020390 980462 942769 907770 875916 847376
50733 847376 822079 799850 780439 763556 749033 736804 726708 718431 711718 706376 701986 697899
$$ packed form
50817C95583K786L502M326M957N536O278P009P395P552Q041R093J0256J0998J1372
50803D94684J1870J2767J3904J5069J6232J7449J8702J9944K1250K2795K4705
50792F89371K6963K9419L1931L4446L6940L9264M1195M2693M4030M5543M7192
50781A108987M8439M8648M7619M5676M3221M0293L6688L2360K7554K2564J7547
50770A519596J2691Q263M386R70j988m153n185n226m763m108l242k231j457j350
50756A512203k038l450n579q532j2250j6419k0686k4915k9137l3229l6803l9554
50744A279611m1595m3211m4339m4542m3615m1919l9928l7693l4999l1854k8540
50733H47376k5297k2229j9411j6883j4523j2229j0096q277o713n342m390m087
$$ plain form
50721 697899 693759 689825 686511 683748 681043 678043 674691 670907 666495 661423 655891 649970 643439 636137
50707 636137 628304 620342 612393 604304 595903 587170 578200 569196 560489 552403 545083 538594 533158 529126
50693 529126 526616 525351 524982 525469 527014 529695 533386 538030 543771 550746 558940 568396 579356 591964
50679 591964 605945 620847 636634 653760 672556 692752 713813 735624 758583 782976 808424
50668 808424 834109 859464 884458 909187 933425 956768 979060 1000334 1020301 1038198 1053291
50657 1053291 1065286 1074142 1079727 1081949 1081062 1077516 1071658 1063873 1054922 1045825 1037376 1029995 1023955 1019427
50643 1019427 1016317 1014405 1013660 1014097 1015250 1016154 1015925 1014051 1010093 1003539 994190 982318 968203 951832
50629 951832 933337 913422 892983 872528 852318 832882 814956 798941 784823 772646 762740 755393
$$ packed form
50721F97899m140l934l314k763k705l000l352l784m412n072n532n921o531p302
50707F36137p833p962p949q089q401q733q970r004q707q086p320o489n436m032
50693E29126k510j265l69M87J545K681L691M644N741O975Q194R456J0960J2608
50679E91964J3981J4902J5787J7126J8796K0196K1061K1811K2959K4393K5448
50668H08424K5685K5355K4994K4729K4238K3343K2292K1274J9967J7897J5093
50657A053291J1995Q856N585K222q87l546n858p785q951r097q449p381o040m528
50643A019427l110j912p45M37J153R04k29j874l958o554r349j1872j4115j6371
50629I51832j8495j9915k0439k0455k0210j9436j7926j6015j4118j2177r906p347
$$ plain form
50617 755393 750567 748069 747815 749785 753849 759817 767676 777632 789777 803689 818446 833139 847360
50604 847360 861111 874385 887059 899122 910697 921779 932266 942288 952254 962396 972565 982548
50592 982548 992268 1001479 1009705 1016824 1023449 1030342 1037623 1044941 1052238 1059942 1068488 1078032 1088592 1100101
50578 1100101 1112315 1124997 1138184 1151955 1165925 1179325 1191645 1202958 1213472 1223086 1231475 1238429
50566 1238429 1243967 1248260 1251470 1253502 1253830 1251682 1246491 1238195 1227280 1214742 1201861 1189626 1178333
50553 1178333 1167898 1158554 1150879 1145116 1140808 1137288 1134226 1131519 1128858 1125697 1121505 1115800 1107997 1097496
50539 1097496 1083957 1067434 1048200 1026589 1002962 977732 951338 924277 897149 870585 844965
50528 844965 820242 796195 772969 751262 731771 714500 698792 684088 670460 658390 648246
$$ packed form
50617G55393m826k498k54J970M064N968P859R956J2145J3912J4757J4693J4221
50604H47360J3751J3274J2674J2063J1575J1082J0487J0022R966J0142J0169R983
50592I82548R720R211Q226P119O625O893P281P318P297P704Q546R544J0560J1509
50578A100101J2214J2682J3187J3771J3970J3400J2320J1313J0514R614Q389O954
50566A238429N538M293L210K032L28k148n191q296j0915j2538j2881j2235j1293
50553A178333j0435r344p675n763m308l520l062k707k661l161m192n705p803j0501
50539A097496j3539j6523j9234k1611k3627k5230k6394k7061k7128k6564k5620
50528H44965k4723k4047k3226k1707j9491j7271j5708j4704j3628j2070j0144
$$ plain form
50517 648246 640091 633739 628836 625111 622717 622123 623444 626095 629388 633254 638041 643824 650333 657504
50503 657504 665609 674813 684982 696024 708070 721167 735140 749908 765641 782422 799983 817971
50491 817971 836319 855183 874644 894602 914853 935143 955277 975318 995587 1016381 1037764
50480 1037764 1059687 1082226 1105647 1130354 1156735 1184952 1214825 1246037 1278469 1312191 1347203
50469 1347203 1383389 1420760 1459479 1499616 1541023 1583501 1626848 1670689 1714449 1757571 1799481
50458 1799481 1839267 1875678 1907669 1934796 1956884 1973444 1983655 1986855 1982893 1972061 1954873 1931924
50446 1931924 1903870 1871475 1835625 1797280 1757448 1717300 1678212 1641495 1608075 1578589 1553653
$$ packed form
50517F48246q155o352m903l725k394n94J321K651L293L866M787N783O509P171
50503F57504Q105R204J0169J1042J2046J3097J3973J4768J5733J6781J7561J7988
50491H17971J8348J8864J9461J9958K0251K0290K0134K0041K0269K0794K1383
50480A037764K1923K2539K3421K4707K6381K8217K9873L1212L2432L3722L5012
50469A347203L6186L7371L8719M0137M1407M2478M3347M3841M3760M3122M1910
50458A799481L9786L6411L1991K7127K2088J6560J0211L200l962j0832j7188k2949
50446A931924k8054l2395l5850l8345l9832m0148l9088l6717l3420k9486k4936
$$ [...]
##END NTUPLES=NMR SPECTRUM
##END=
