
##TITLE=UV1165_M6-1005-1000_6307368_x0ENxthYTd
##JCAMPDX= 6.0         $$ Bruker NMR JCAMP-DX V2.0
##DATA TYPE= NMR SPECTRUM
##DATA CLASS= NTUPLES
##ORIGIN= BRUKER
##OWNER= Administrator
$$ 1.72 TOPSPIN		Version 2.1
$$ 2012-06-07 03:33:52.328 -0500  Administrator@TOPSPIN
$$ Compression mode = diff/dup
##.OBSERVE FREQUENCY= 400.13188235
##.OBSERVE NUCLEUS= ^1H
##.ACQUISITION MODE= SIMULTANEOUS (DQD)
##.ACQUISITION SCHEME= undefined
##.AVERAGES= 8
##.DIGITISER RES= 22
##SPECTROMETER/DATA SYSTEM= spect
##.PULSE SEQUENCE= zg30
##.SOLVENT NAME= COFFEE_meoh
##.SHIFT REFERENCE= INTERNAL, COFFEE_meoh, 1, 14.98061
##AUDIT TRAIL= $$ (NUMBER, WHEN, WHO, WHERE, PROCESS, VERSION, WHAT)
$$ ##TITLE= Audit trail, TOPSPIN		Version 2.1
$$ ##JCAMPDX= 5.01
$$ ##ORIGIN= Bruker BioSpin GmbH
$$ ##OWNER= Administrator
$$ $$ C:\Bruker\TOPSPIN/data/COFFEE/nmr/UV1165_M6-1005-1000_6307368_x0ENxthYTd/10/pdata/1/auditp.txt
$$ ##AUDIT TRAIL=  $$ (NUMBER, WHEN, WHO, WHERE, PROCESS, VERSION, WHAT)
(   1,<2012-06-07 03:33:43.953 -0500>,<Administrator>,<TOPSPIN>,<go>,<TOPSPIN 2.1>,
      <created by zg
	started at 2012-06-07 03:32:37.468 -0500,
	POWCHK enabled, PULCHK disabled,
       configuration hash MD5:
       D5 CA 7A 23 FE 6B EE E2 50 67 74 61 24 F7 5E 3B
       data hash MD5: 64K
       46 66 92 6C B3 74 97 4F 0A D8 E5 2B D5 64 BB 1E>)
(   2,<2012-06-07 03:33:48.031 -0500>,<Administrator>,<TOPSPIN>,<proc1d>,<TOPSPIN 2.1>,
      <Start of raw data processing
       efp LB = 0 FT_mod = 6 PKNL = 1 PHC0 = 0 PHC1 = 0 SI = 32K 
       data hash MD5: 32K
       01 9A 02 2D 58 36 D6 A3 BB 20 09 BC 6B DD 13 0E>)
(   3,<2012-06-07 03:33:48.359 -0500>,<Administrator>,<TOPSPIN>,<proc1d>,<TOPSPIN 2.1>,
      <pk PHC0 = 210.0586 PHC1 = 0 
       data hash MD5: 32K
       3C 21 59 38 D7 2F 19 21 E3 82 A8 4A 7C 5D 3E 17>)
(   4,<2012-06-07 03:33:48.468 -0500>,<Administrator>,<TOPSPIN>,<proc1d>,<TOPSPIN 2.1>,
      <abs ABSG = 1 
       data hash MD5: 32K
       4B 56 67 05 4A BB 8B 4D DC EF 5B A9 15 19 66 B6>)
(   5,<2012-06-07 03:33:48.687 -0500>,<Administrator>,<TOPSPIN>,<proc1d>,<TOPSPIN 2.1>,
      <abs ABSG = 2 
       data hash MD5: 32K
       03 DF 50 17 11 F9 18 50 45 EF CE 65 88 0F B9 3C>)
(   6,<2012-06-07 03:33:48.718 -0500>,<Administrator>,<TOPSPIN>,<proc1d>,<TOPSPIN 2.1>,
      <abs ABSG = 3 
       data hash MD5: 32K
       BF 15 CB 69 3D 07 7D 0C 62 33 6A D8 E8 22 F5 21>)
(   7,<2012-06-07 03:33:48.750 -0500>,<Administrator>,<TOPSPIN>,<proc1d>,<TOPSPIN 2.1>,
      <abs ABSG = 4 
       data hash MD5: 32K
       B2 6A A4 00 AE 56 3A EB 82 58 C1 4E 8C 91 36 F0>)
(   8,<2012-06-07 03:33:48.781 -0500>,<Administrator>,<TOPSPIN>,<proc1d>,<TOPSPIN 2.1>,
      <abs ABSG = 5 
       data hash MD5: 32K
       C3 CB 14 4A 00 6E 18 BB BD E8 DA C4 3E 14 6D 0D>)
$$ ##END=
$$ 
$$ $$ hash MD5
$$ $$ 7F 42 3E 5D DB 59 C1 48 2D 2D 86 D6 B5 6F ED A6
##$RELAX= 
##$RELAX= 
##$RELAX= 
##$RELAX= 
##$RELAX= 
##$RELAX= 
##$RELAX= 
$$ Bruker specific parameters
$$ --------------------------
$$ [...]
##$TP= (0..7)
150 150 150 150 150 150 150 150
##$TP07= 0
##$TPNAME0= <>
##$TPNAME1= <>
##$TPNAME2= <>
##$TPNAME3= <>
##$TPNAME4= <>
##$TPNAME5= <>
##$TPNAME6= <>
##$TPNAME7= <>
##$TPOAL= (0..7)
0.5 0.5 0.5 0.5 0.5 0.5 0.5 0.5
##$TPOFFS= (0..7)
0 0 0 0 0 0 0 0
##$TUNHIN= 0
##$TUNHOUT= 0
##$TUNXOUT= 0
##$USERA1= <user>
##$USERA2= <user>
##$USERA3= <user>
##$USERA4= <user>
##$USERA5= <user>
##$V9= 5
##$VALIST= <valist>
##$VCLIST= <CCCCCCCCCCCCCCC>
##$VD= 0
##$VDLIST= <DDDDDDDDDDDDDDD>
##$VPLIST= <PPPPPPPPPPPPPPP>
##$VTLIST= <TTTTTTTTTTTTTTT>
##$WBST= 2048
##$WBSW= 25
##$XGAIN= (0..3)
0 0 0 0
##$XL= 0
##$YL= 0
##$YMAX_a= 536872
##$YMIN_a= -654798
##$ZGOPTNS= <>
##$ZL1= 120
##$ZL2= 120
##$ZL3= 120
##$ZL4= 120
##$ABSF1= 14.98061
##$ABSF2= -5.57192
##$ABSG= 5
##$ABSL= 3
##$ALPHA= 0
##$AQORDER= 0
##$ASSFAC= 0
##$ASSFACI= 0
##$ASSFACX= 0
##$ASSWID= 0
##$AUNMP= <proc_prof1d_extract_pilot.lims>
##$AXLEFT= 0
##$AXNAME= <>
##$AXNUC= <1H>
##$AXRIGHT= 0
##$AXTYPE= 0
##$AXUNIT= <>
##$AZFE= 0.1
##$AZFW= 0.1
##$BCFW= 0
##$BC_mod= 0
##$BYTORDP= 0
##$COROFFS= 0
##$CY= 15
##$DATMOD= 1
##$DC= 0
##$DFILT= <>
##$DTYPP= 0
##$F1P= 0
##$F2P= 0
##$FCOR= 0.5
##$FTSIZE= 32768
##$FT_mod= 6
##$GAMMA= 0
##$GB= 0
##$INTBC= 1
##$INTSCL= 1
##$ISEN= 128
##$LB= 0
##$LEV0= 0
##$LPBIN= 0
##$MAXI= 10000
##$MC2= 0
##$MEAN= 0
##$ME_mod= 0
##$MI= 0
##$NCOEF= 0
##$NC_proc= -8
##$NLEV= 6
##$NOISF1= 0
##$NOISF2= 0
##$NSP= 0
##$NTH_PI= 0
##$NZP= 0
##$OFFSET= 14.98061
##$PC= 1
##$PHC0= 210.0586
##$PHC1= 0
##$PH_mod= 1
##$PKNL= yes
##$PPARMOD= 0
##$PPDIAG= 0
##$PPIPTYP= 0
##$PPMPNUM= 2147483647
##$PPRESOL= 1
##$PSCAL= 4
##$PSIGN= 0
##$PYNMP= <proc.py>
##$REVERSE= no
##$SF= 400.13
##$SI= 32768
##$SIGF1= 0
##$SIGF2= 0
##$SINO= 400
##$SIOLD= 32768
##$SPECTYP= <>
##$SREGLST= <1H.CDCl3>
##$SSB= 0
##$STSI= 32768
##$STSR= 0
##$SW_p= 8223.68421052632
##$SYMM= 0
##$S_DEV= 0
##$TDeff= 65536
##$TDoff= 0
##$TI= <>
##$TILT= no
##$TM1= 0
##$TM2= 0
##$TOPLEV= 0
##$USERP1= <user>
##$USERP2= <user>
##$USERP3= <user>
##$USERP4= <user>
##$USERP5= <user>
##$WDW= 1
##$XDIM= 32768
##$YMAX_p= 459695308
##$YMIN_p= -678032
##$CURPLOT= <Network HP LaserJet P1505>
##$CURPRIN= <$Network HP LaserJet P1505>
##$DFORMAT= <normdp>
##$LAYOUT= <+/1D_H.xwp>
##$LFORMAT= <normlp>
##$PFORMAT= <normpl>
##$SURQMSG= 1
$$ End of Bruker specific parameters
$$ ---------------------------------
##NTUPLES= NMR SPECTRUM
##VAR_NAME=  FREQUENCY,     SPECTRUM/REAL,   SPECTRUM/IMAG
##SYMBOL=    X,             R,               I
##VAR_TYPE=  INDEPENDENT,   DEPENDENT,       DEPENDENT
##VAR_FORM=  AFFN,          ASDF,            ASDF
##VAR_DIM=   32768,         32768,           32768
##UNITS=     HZ,            ARBITRARY UNITS, ARBITRARY UNITS
##FACTOR=    0.250966925370066, 1,           1
##FIRST=     8223.43324360095, 58896,        -74248
##LAST=      0,             -230040,         -41568
##MIN=       0,             -678032,         0
##MAX=       8223.43324360095, 459695308,    0
$$ Real data points
##PAGE= N=1
##DATA TABLE= (X++(R..R)), XYDATA
$$ [...]
$$ plain form
19511 -6584 78181 -72453 -198478 101941 -76219 212384 -102021 -284165 -19806 -345560 193194
19499 89530 -177354 -235445 -35368 -11959 150948 83931 -325510 -227282 -54907 132563 -160836
19487 -282162 -220469 -118542 -320114 65683 -5146 23976 -93790 -190117 285942 20811 109127
19476 109127 174143 -75428 -64845 -145369 -71892 -283621 -179489 -1846 165978 -250917 13386
19464 -6970 -43497 -215140 -39307 -161461 -59196 -174922 -326016 3673 -182132 149278 -42330
19452 26370 3178 -137686 -148713 55861 -167344 -330904 -253716 -141015 -50011 150994 -199442
19440 57832 -434483 -152833 -241398 184498 -327508 -29520 196699 -226263 -20973 -234863
19430 -234863 62797 89380 291687 -87844 -125665 -104713 184248 -104197 -246614 385033
$$ packed form
19511f584G8181g2453j26025A01941g6219B12384a02021j82144a9806l25754A93194
19499H9530a77354n8091c5368a1959A50948o7017c25510R8228e4907A32563a60836
19487b82162O1693J01927k01572F5683e146B3976i3790r6327B85942B0811Q8316
19476A09127O5016g5428J0583q0524g1892k11729J04132a846A65978b50917A3386
19464f970l6527j71643c9307j22154e9196j15726j51094C673a82132A49278d2330
19452B6370C178a37686j1027E5861a67344j63560P7188J12701e0011A50994a99442
19440E7832d34483a52833q8565A84498c27508b9520A96699b26263b0973k13890
19430b34863F2797K6583K02307h7844l7821K0952A84248a04197j42417C85033
$$ plain form
19419 184218 141984 -97628 -40727 116123 -71184 -175579 -320205 -341397 86329 32103 -44249
19407 188765 64589 209253 -131225 78544 -56509 -415633 204170 -122855 143155 -400626
19396 122800 -343807 221906 -95186 -151872 -65031 -53455 -184320 396726 56786 -370445
19385 124134 -370149 -229796 129346 97135 -17504 -142463 -70365 59939 90636 -59239 8778
19373 -225855 13530 58452 41596 100342 -96583 175781 26342 -339500 61053 139117 73453
19362 73453 -137479 -138227 170863 -149934 -135195 -256596 163864 132929 198454 26510 -80214
19350 152537 119078 -17089 -205556 -254005 -78342 205427 -162886 342189 25876 -66231 -79872
19339 -79872 36078 -58813 -56727 -40487 -156130 121611 -110534 7038 226988 -163516 135243
$$ packed form
19419A84218m2234i7628d0727A16123g1184j04395j44626k1192H6329C2103d4249
19407A88765F4589J44664a31225G8544e6509l59124B04170a22855A43155d00626
19396A22800c43807B21906i5186n6686f5031J1576j30865C96726E6786c70445
19385A24134c70149J40353A29346l2211a7504j24959g0365E9939L0697e9239H778
19373b25855A3530M4922j6856N8746i6583A75781B6342c39500F1053P8064o5664
19362G3453a37479p48A70863a49934J4739j21401A63864l0935O5525B6510h0214
19350A52537l3459a7089j88467m8449g8342B05427a62886C42189B5876f6231j3641
19339g9872C6078e8813K086J6240j15643A21611a10534G038K19950a63516A35243
$$ plain form
19327 -108936 -13095 -10623 -167590 60686 184057 -355729 -344559 141119 159203 -286047 -28737
19315 -31329 129400 280899 -147967 -219892 -112331 -327461 -47860 -52432 -42972 -144216 -210278
19304 -210278 152325 -133564 -196739 -202483 40110 27698 152519 329692 -121316 -14947 -91471
19293 -91471 95541 48549 19001 -21444 -119809 -31392 -408428 -211371 -96452 -27559 299389
19281 -176343 106269 36815 -45453 -156148 -270497 -162210 188256 -201647 -92479 -26544
19270 -226080 107626 -154689 -237003 -26412 68854 -345090 -63573 -41031 -120478 -15236 -50363
19259 -50363 -161515 -258538 -173622 -14404 177479 -68553 -49278 -111416 119858 -197296 -128268
19248 -128268 73081 -144235 -18310 -307333 -245451 94105 79288 -438668 123008 -139249
$$ packed form
19327a08936a3095K472j56967F0686J23371c55729J1170A41119J8084b86047b8737
19315c1329A29400J51499a47967p1925J07561k15130d7860m572R460j01244o6062
19304b10278A52325a33564o3175n744D0110j2412J24821J77173a21316a4947p6524
19293i1471I5541m6992A9001b1444r8365c1392l77036J97057i6452b7559B99389
19281a76343A06269C6815d5453j10695j14349J08287A88256b01647i2479b6544
19270b26080A07626a54689q2314b6412F8854c45090f3573K2542p9447a5236l5127
19259e0363j11152r7023Q4916a4404A77479f8553J9275o2138A19858a97296O9028
19248a28268G3081a44235a8310k89023O1882I4105j4817d38668A23008a39249
$$ plain form
19237 189072 11251 67421 -163518 -287882 -147600 -49480 -10638 -340551 -45755 67362 -143421
19225 16274 35857 6404 -241712 -221980 138684 -244775 -96461 -234192 272193 261774 -23922
19213 -88496 -15347 -33976 57587 71865 -90390 279800 -334947 168877 -104065 60027 -70208
19201 16648 -287498 142071 -183088 157797 47770 75794 23622 -87435 -160863 -267826 -334899
19190 -334899 82289 91185 162606 -44024 -263888 -125807 405497 22644 204642 32232 229989
19179 229989 -171074 222328 154099 -179689 -327614 181761 -69791 -252190 -157406 -345565
19169 -345565 78978 -56880 43864 320473 -245773 34518 -167922 -106457 -215590 -12053 -178586
19158 -178586 43270 14429 64436 -10008 24859 -23977 159172 357913 -153221 -126781 13916
$$ packed form
19237A89072A1251N6170a63518j24364J40282d9480a0638l29913d5755F7362a43421
19225A6274J9583F404b41712J9732A38684b44775i6461j37731B72193j0419b3922
19213h8496a5347j8629E7587J4278i0390B79800c34947A68877a04065F0027g0208
19201A6648b87498A42071a83088A57797D7770K8024B3622h7435p3428j06963o7073
19190c34899H2289Q896P1421d4024k19864a25807D05497B2644J81998C2232J97757
19179B29989a71074B22328o8229a79689j47925A81761f9791j82399R4784j88159
19169c45565G8978e6880D3864K76609b45773C4518a67922O1465j09133a2053j66533
19158a78586D3270A4429N0007a0008B4859b3977A59172J98741a53221K6440A3916
$$ plain form
19146 -168314 -109577 -14504 -209152 -329108 -77029 346164 100414 -246224 -122117 -144623
19136 -144623 136885 -47361 -95063 102995 6779 -96060 216011 -176194 -5533 -185484 196179
19124 -155748 -254192 243996 -26170 227892 -84690 -278115 -87340 -102327 177156 36989 -9032
19112 -217091 17887 322125 -74305 -259786 -105542 72273 22537 -117038 -279316 -243271
19102 -243271 -362545 -47496 -150708 95827 -89952 -337735 28366 -334462 55009 -155762
19091 126611 35832 343492 -140845 94707 -160720 128435 59573 155526 -43874 -135121 -121585
19080 -121585 74196 -96474 -113428 -153672 -53450 -53813 173652 4697 194062 -76893 -228444
19069 -228444 -201473 174869 -141426 156774 -45868 62479 71170 43273 -278007 -233754 34874
$$ packed form
19146a68314N8737a4504j94648j19956g7029C46164A00414b46224a22117k2506
19136a44623A36885d7361m7702A02995F779i6060B16011a76194e533j79951A96179
19124a55748r8444B43996b6170B27892h4690j93425h7340j4987A77156C6989i032
19112b17091A7887L04238g4305j85481a05542G2273B2537a17038j62278L6045
19102b43271j19274d7496j03212I5827h9952k47783B8366c34462E5009a55762
19091A26611C5832L07660a40845I4707a60720A28435E9573R5953d3874r1247J3536
19080a21585G4196i6474j6954m0244e3450l63A73652D697J89365g6893j51551
19069b28444K6971A74869a41426A56774d5868F2479Q691k7897b78007M4253C4874
$$ plain form
19057 -107557 -130992 -153740 -5919 -22364 -216923 78814 -48700 311443 -13941 -144771 -122619
19046 -122619 189248 -149878 97155 -95833 12439 122260 -32510 -214301 75899 -39850 39785
19034 177976 -172447 -127286 -138014 77182 -226480 74233 -5470 -79503 -240478 142183 -66065
19022 -112990 -139023 162382 -176387 -229613 -307132 134334 201998 -23701 -129686 -285901
19012 -285901 -16993 131516 17373 96971 53869 -415684 236084 -7670 90608 -203448 18795
19000 317124 -147304 41610 -18211 92427 -277171 56522 65405 160440 -136156 118048 21699
18988 -76347 -44115 161880 -59626 277291 42638 -375879 -214359 59264 -106308 -296235
18978 -296235 194500 182348 187457 -420719 28452 -202302 88624 211702 -389249 88848 140815
$$ packed form
19057a07557k3435k2748e919j6445j94559G8814d8700C11443a3941j30830K2152
19046a22619A89248a49878I7155i5833A2439J09821c2510j81791G5899c9850C9785
19034A77976a72447M5161j0728G7182b26480G4233e470p4033j60975A42183f6065
19022a12990k6033A62382a76387n3226p7519A34334O7664b3701j05985j56215
19012b85901a6993A31516A7373P9598m3102d15684B36084g670I0608b03448A8795
19000C17124a47304D1610a8211I2427b77171E6522Q883R5035a36156A18048B1699
18988g6347L2232A61880e9626B77291D2638c75879J61520E9264a06308j89927
18978b96235A94500j2152N109d20719B8452b02302H8624J23078c89249H8848N1967
$$ plain form
18967 140815 -204107 -213198 115325 129607 1463 78861 -249293 -137030 281705 -180237 195505
18955 -176709 -347626 -95867 -151562 -81041 -173723 -266159 -73350 169483 53014 175589 -164942
18943 24866 -42442 220736 -280933 -144239 -168531 -193551 72935 181730 84622 -49136 -203331
18932 -203331 243892 -148696 5697 164768 -65312 150112 244108 -150997 -159054 96701 226190
18921 226190 -245037 -86439 -63480 -80432 -459502 -154347 217714 96865 -116374 172423
18910 -429227 34337 232116 122560 219373 -148720 156966 125899 243261 -82565 -171808
18900 -171808 -167189 49991 -254920 -94079 -48534 -112986 -133158 -162310 -233685 -185284 18513
18888 23918 -311914 -144352 -232570 30734 -74733 -200603 227468 -49502 -599432 -196569
$$ packed form
18967A40815b04107r091A15325J4282A463P7398b49293J12263B81705a80237A95505
18955a76709j70917i5867n5695P0521r2682r2436g3350A69483E3014J22575a64942
18943B4866d2442B20736b80933J36694k4292k5020G2935J08795H4622d9136j54195
18932b03331B43892a48696E697J59071f5312A50112R3996a50997q057I6701J29489
18921B26190b45037h6439K2959j6952l79070a54347B17714I6865a16374A72423
18910d29227C4337J97779j09556R6813a48720A56966l1067J17362h2565q9243
18900a71808M619D9991b54920i4079M5545o4452k0172k9152p1375M8401A8513
18888B3918c11914a44352q8218C0734g4733j25870B27468d9502n49930a96569
$$ plain form
18877 -81542 38367 -110504 -111077 -316696 131640 -96601 -37094 -132737 228601 -26736 -230124
18866 -230124 -151073 -335405 -72527 -16811 4034 -75560 -346745 -158920 -262873 144 114101
18855 114101 15655 19289 91360 244105 -94795 77882 -4450 153405 -19010 -204300 142258
18843 -51803 -17434 159869 -17120 202588 205425 -107200 -180526 -436367 246142 -257259 264547
18831 -216629 340531 -325911 72810 121478 214543 -65437 -118031 -50063 -136617 -183106 -15955
18819 -12464 -338092 228314 -528147 -41749 -137177 235090 -259046 30808 -175631 36668
18808 -160087 -175716 -32006 -40178 -127415 115023 -16763 118615 121533 -122468 21688 30447
18797 30447 75586 298288 266303 176669 134267 221048 24288 220129 -289699 13049 -254021
$$ packed form
18877h1542C8367a10504n73k05619A31640i6601c7094r5643B28601b6736k03388
18866b30124P9051j84332g2527a6811D034g5560k71185a58920j03953A44J13957
18855A14101A5655L634P2071J52745i4795G7882d450A53405a9010j85290A42258
18843e1803a7434A59869a7120B02588K837a07200p3326k55841B46142b57259B64547
18831b16629C40531c25911G2810M8668R3065f5437n2594e0063q6554m6489a5955
18819a2464l25628B28314e28147d1749r5428B35090b59046C0808a75631C6668
18808a60087j5629c2006q172q7237A15023a6763A18615K918a22468B1688Q759
18797C0447M5139K22702l1985q9634m2402Q6781B4288J95841b89699A3049b54021
$$ plain form
18785 -87090 -116028 190078 -148542 -86495 101060 -33843 -237861 -179230 -152864 48170 -89333
18773 -299313 37908 -68239 -224001 56552 325998 -260791 164664 -94845 -51584 -132022 -13663
18761 -20304 -128633 -168784 125674 67746 -97512 -81700 -125875 -10140 -323185 -139909 98691
18749 267889 139181 -131352 -86570 -252089 -257821 -94935 -66933 -190207 -129804 -344756 -63719
18737 -201667 -39563 -284798 198306 -71707 -209078 160890 -53813 -211342 11691 -48137
18726 78993 -164091 -354057 60758 -168623 -126121 38879 -176616 161326 -33503 -26705 -68128
18715 -68128 -53059 -193685 83683 -546057 -168270 312477 -221961 178798 -280801 -45104
18704 -26308 -150198 -218731 -370026 128234 -368159 -325613 -76885 -388618 -149597 18125
$$ packed form
18785h7090k8938A90078a48542O2047A01060c3843k04018N8631K6366D8170h9333
18773b99313C7908f8239j55762E6552K69446b60791A64664i4845M3261q0438a3663
18761b0304j08329m0151A25674n7928i7512J5812m4175a0140l13045a39909I8691
18749B67889j28708a31352M4782j65519n732i4935K8002j23274O0403k14952f3719
18737b01667c9563k45235A98306g1707j37371A60890e3813j57529A1691d8137
18726G8993a64091j89966F0758a68623M2502C8879a76616A61326c3503O798m1423
18715f8128J5069j40626H3683e46057a68270C12477b21961A78798b80801d5104
18704b6308j23890o8533j51295A28234c68159M2546g6885l11733a49597A8125
$$ plain form
18693 6545 -267503 213279 132603 37782 -4955 22420 -282367 -27894 112619 23973 -113691
18681 -17213 -215815 -162267 128865 -43891 -85880 -180951 57780 109321 -272603 -184905 -12731
18669 191097 58016 -268980 7877 616 -183906 141742 -85544 146264 133635 -65088 -97704
18658 -97704 -237882 -130780 -152739 -128527 207098 42299 80163 -59602 -64772 -118511 -110764
18647 -110764 76708 -249903 159066 -132454 -35010 158768 3538 26695 -311870 -13625 25491
18635 -63697 -170095 317370 16063 -11879 27966 131099 -493210 120501 245211 90179
18624 62747 305763 -129056 121608 8616 416819 -199097 28758 228998 115605 172400
18614 172400 -313649 -132258 -202002 -36548 205833 -12547 -346792 -105238 -146474 62684
$$ packed form
18693F545b67503B13279q0676C7782d955B2420b82367b7894A12619B3973a13691
18681a7213j98602N3548A28865d3891m1989r5071E7780N1541b72603Q7698a2731
18669A91097E8016b68980G877F16a83906A41742h5544A46264j2629f5088l2616
18658i7704j40178J07102k1959K4212B07098D2299L7864e9602n170n3739P747
18647a10764G6708b49903A59066a32454c5010A58768C538K3157c11870a3625B5491
18635f3697j06398C17370A6063a1879B7966J03133d93210A20501J24710I0179
18624F2747K43016a29056A21608H616M08203a99097B8758K00240j13393N6795
18614A72400c13649a32258o9744c6548B05833a2547l34245a05238m1236F2684
$$ plain form
18603 95574 -267170 201938 -252635 -76767 210569 -205125 126248 121084 -141079 52947
18592 -273647 -202041 369581 -231797 -51564 232388 -193965 -257994 25143 -279052 -462060
18582 -462060 108089 -360756 -103100 64557 -147144 212845 -229428 -117978 66599 -173467
18571 -74805 -90846 -212190 -245566 242327 -383109 42184 -98729 -265090 119210 397448
18561 397448 170105 80234 8213 38160 -86020 -50150 -334658 -212976 -279002 164126 9047
18549 -75792 -196727 -245419 1020 -162059 64392 73577 -120836 -271943 -196483 177977 119230
18538 119230 -143405 -168731 -331866 -59039 -86761 -271106 271999 -75890 31260 -64646 104213
18526 130414 -16930 -243144 92570 -363041 44707 58672 -355642 -176289 -23086 -318960
$$ packed form
18603I5574b67170B01938b52635g6767B10569b05125A26248n164a41079E2947
18592b73647P1606C69581b31797e1564B32388a93965o4029B5143b79052j83008
18582d62060A08089c60756a03100F4557a47144B12845b29428J11450F6599a73467
18571g4805j6041j21344l3376B42327c83109D2184i8729j66361A19210K78238
18561C97448A70105H0234H213K9947h6020L5870k84508J21682o6026A64126I047
18549g5792j20935m8692A020a62059F4392R185a20836j51107P5460A77977n8747
18538A19230a43405k5326j63135e9039k7722j84345B71999g5890C1260f4646A04213
18526A30414a6930k26214I2570c63041D4707J3965c55642a76289b3086k95874
$$ plain form
18516 -318960 -66480 81290 9805 54773 399245 196226 -492606 -331200 21385 -105072 -189572
18505 -189572 -53986 -125093 -53886 167303 95498 13691 71373 -334402 77634 169732 -221869
18493 30397 105098 47202 -191215 -146080 -114593 -124273 -212772 43736 291710 -9722 -52463 -286893
18481 -286893 149600 -241633 -70485 2935 94090 -25401 153929 72082 2313 -50622 260936
18469 -154955 -20461 236101 -185486 -209961 -98247 -106229 -264978 -292499 -146775 -187918 -1594
18457 65453 47813 -90684 22919 -111814 -355299 -246901 31064 -118914 -193434 31401 30044
18446 30044 22442 174439 -20353 -197176 107547 -221589 389177 90038 274085 -133195
18435 -325593 -11040 -159137 -220752 -155240 283581 -57676 -172652 328955 -141575 -85242
$$ packed form
18516c18960f6480H1290I805M4968L44472A96226d92606J61406B1385a05072q4500
18505a89572e3986p1107e3886A67303p1805A3691N7682c34402G7634R2098b21869
18493C0397P4701D7202a91215M5135L1487r680q8499D3736K47974i722m2741k34430
18481b86893A49600b41633g0485B935R1155b5401A53929G2082B313e0622B60936
18469a54955b0461B36101a85486k4475i8247p982j58749k7521J45724m1143a594
18457F5453j7640i0684B2919a11814k43485J08398C1064a18914p4520C1401j357
18446C0044p602J51997b0353j76823A07547b21589C89177I0038J84047a33195
18435c25593a1040j48097o1615O5512B83581e7676j14976C28955a41575N6333
$$ plain form
18425 -85242 347331 42383 -9681 -69149 187145 -221430 125081 -224542 -109759 -34964 -53123
18414 -53123 258436 -209992 -225579 -41290 78411 236053 -319471 -74993 -57112 108623 -259375
18402 180054 -20513 -9920 -264951 -544478 -87701 -95740 -58028 -233293 213020 -168533 -513375
18391 -513375 -88929 56189 23069 -135082 -25567 -89116 -110099 -83479 -227102 226665 35005
18379 6692 115692 -164611 156419 252875 -195760 -101062 121816 -133 -24147 -140591 -260028
18368 -260028 -290084 -161669 55706 -71385 -378928 360122 25080 -111367 199499 -29175
18357 -83649 -111189 -123643 -136301 -42418 15016 12711 110938 85139 24678 17510 363192 288296
18345 288296 84393 -297940 -394158 -3759 62865 -144277 86791 -82843 -41657 -163032 90304
$$ packed form
18425h5242C47331D2383i681n9468A87145b21430A25081b24542a09759c4964j8159
18414e3123B58436b09992j5587d1290G8411J57642c19471g4993J7881A08623b59375
18402A80054b0513i920k55031k79527h7701q039L7712j75265B13020a68533l44842
18391e13375h8929E6189B3069a35082b5567o3549k0983K6620j43623B26665C5005
18379F692J09000a64611A56419R6456a95760R4698A21816a33k4014j16444j19437
18368b60028l0056J28415E5706g1385l07543C60122B5080a11367A99499b9175
18357h3649k7540j2454j2658d2418A5016k305R8227k5799B4678p168L45682p4896
18345B88296H4393b97940r6218c759F2865a44277H6791h2843M1186j21375I0304
$$ plain form
18333 -105040 -146833 86899 -100206 318419 214933 -101484 -30607 -581208 -111160 -83937
18323 -83937 24558 117536 -144505 -404025 -92146 130218 -343291 -4679 -210790 -188529 -111308
18312 -111308 -392829 9587 -273011 47860 -131072 -403783 -475420 -94718 95935 -79732 -144848
18301 -144848 -211517 -206439 -36920 92786 -118290 -176898 51671 -111706 430982 148967 209545
18290 209545 -190626 -38761 85886 -296615 -249620 -46250 -202679 -192106 115182 -128338
18279 -29667 -232089 -162308 230215 -259656 -134967 -210489 -195231 -90218 138587 -327983
18268 45197 -260951 -57079 -116814 -61418 115867 -70025 -308932 -89172 255830 61527 -3764
18256 -76068 411851 -275671 -48832 -76905 -153563 -119014 -3795 -88336 182944 79912 -136994
$$ packed form
18333a05040m1793H6899a00206C18419j03486a01484c0607n50601a11160K7223
18323h3937B4558R2978a44505k59520i2146A30218c43291d679k06111K2261P7221
18312a11308k81521I587b73011D7860a31072k72711p1637i4718I5935g9732o5116
18301a44848o6669N078c6920I2786a18290n8608E1671a11706D30982A48967O0578
18290B09545a90626c8761H5886b96615M6995d6250j56429J0573A15182a28338
18279b9667k02422O9781B30215b59656J24689p5522J5258i0218A38587c27983
18268D5197b60951e7079n9735N5396A15867g0025k38907h9172B55830F1527c764
18256g6068D11851b75671d8832k8073p6658L4549c795q4541A82944G9912a36994
$$ plain form
18244 252700 201621 -297460 -48232 -75709 133029 215408 -386618 -117774 241308 -99323
18233 -272469 279456 -133633 220193 142602 -336750 -385400 13617 -182846 -53417 -81072
18223 -81072 -241868 4342 97926 96210 185 127697 -9543 -160708 -53525 -182930 82123 196870
18211 196870 -61179 -240430 -297331 -388335 98110 61586 -134534 -9154 172573 -8841 -69937
18200 -69937 1011 -10311 -741 222508 -313516 -433699 125036 71879 -124314 218106 -100412
18188 53288 169500 31112 -65143 -64147 -75858 263132 -31391 71749 162464 60920 -72624 235588
18175 336785 -159664 -207086 301193 -310262 99392 78915 -242715 -203914 -59498 91191 140112
18164 140112 -161839 -29563 -437059 75249 -2766 -30208 -81041 -59904 -157978 -15183 56626
$$ packed form
18244B52700n1079b97460d8232k7477A33029Q2379c86618a17774B41308i9323
18233b72469B79456a33633B20193p7591c36750m8650A3617a82846e3417k7655
18223h1072j60796D342R3584j716A85J27512i543j51165e3525j29405H2123J14747
18211A96870f1179j79251n6901r1004I8110l6524a34534i154A72573h841o1096
18200f9937A011a0311g41B22508c13516j20183A25036n3157a24314B18106a00412
18188E3288J16212C1112f5143R96j1711B63132c1391G1749R0715F0920g2624B35588
18175C36785a59664m7422C01193c10262I9392k0477b42715L8801e9498I1191M8921
18164A40112a61839b9563m07496G5249b766k7442n0833K1137r8074a5183E6626
$$ plain form
18152 -25857 149173 -104985 105838 -303991 26873 122382 88568 124087 -172442 -91390 -62577
18141 -62577 111464 220839 151011 8059 238771 -262872 173134 25180 -91624 209797 33118
18129 -19054 -254656 -175969 -23253 170242 -52976 -381293 181528 -206103 -205236 76124 -107448
18117 -1257 -43010 -296450 48341 -15001 -213553 93864 111136 -93523 208355 -157551 193146
18105 340018 5591 61531 -13357 12645 -157983 37509 43361 -21024 -83448 136285 37435
18093 -67188 -48855 -249787 44827 476473 -185125 321708 200995 -81609 -325079 -7313 -259028
18082 -259028 -155144 103139 4345 -61406 -248900 -47364 20971 -79731 -289196 242268 -147399
18070 -251619 95490 -136160 -125796 -350017 -224590 -156650 -153716 -187069 21177 -26444 195888
$$ packed form
18152b5857A49173a04985A05838c03991B6873R5509l3814L5519a72442Q1052K8813
18141f2577A11464J09375o9828H059K30712b62872A73134B5180i1624B09797C3118
18129a9054k35602P8687b3253A70242e2976l28317A81528b06103Q67G6124a07448
18117a257m1753k53440D8341a5001j98552I3864J7272i3523B08355a57551A93146
18105C40018E591N5940a3357A2645a57983C7509N852b1024o2424A36285C7435
18093f7188J8333k00932D4827M31646a85125C21708j20713h1609k43470g313k51715
18082b59028J03884A03139D345f1406j87494d7364B0971g9731k09465B42268a47399
18070b51619I5490a36160J0364k24221J25427O7940K934l3353B1177b6444A95888
$$ plain form
18058 36248 -234778 254853 89096 -315121 -56464 -400295 -182778 46445 -25015 -240352
18048 -240352 182606 2052 -201306 103254 -59829 -95851 -117294 210318 288797 136662 -156497
18036 -633 283317 -41171 -154456 -9067 -71188 -208309 8957 34444 -12759 113713 143898 -184157
18023 -206916 34578 -106 -232066 58278 92990 121973 129054 -245831 401667 50163 -85875
18011 56175 83391 -36626 -329300 -388557 -24789 32560 -581612 -132169 48032 151154 56486
17999 25783 -1188 -24405 162990 185454 -11224 -129744 -8941 -76517 -186209 150729 -122485
17987 301175 -199322 27388 -201178 89557 42623 235834 7792 -166859 98444 -187354 18568
17975 -203316 -149124 21886 194975 -97734 177577 -122830 -267331 26966 45069 65293 427808
$$ packed form
18058C6248b34778B54853H9096c15121e6464l43831a82778D6445b5015k15337
18048b40352A82606B052b01306A03254e9829l6022k1443B10318P8479A36662a56497
18036f33B83317d1171j13285i067o2121j37121H957K5487a2759A13713L0185a84157
18023b06916C4578a06k31960E8278L4712K8983P081b45831D01667E0163h5875
18011E6175K7216c6626k92674n9257b4789C2560e81612a32169D8032J03122E6486
17999B5783a188k3217A62990K2464a1224j18520h941o7576j09692A50729a22485
17987C01175a99322B7388b01178H9557D2623J93211G792a66859I8444a87354A8568
17975b03316N4192B1886J73089i7734A77577a22830j44501B6966J8103K0224L62515
$$ plain form
17964 427808 115821 -241035 -11878 99651 -146177 -42262 -227056 -182828 -178619 -75427 -270638
17953 -270638 -104432 6793 -404142 -394409 -257542 45567 30290 -21532 -222956 -360812 240487
17941 30611 36707 -316881 -197321 -377854 -9653 306089 74214 -272679 451638 188855 55186
17929 34946 319894 223941 29629 -297804 98638 272001 -9672 -140909 269627 293193 -131245
17917 -55888 144657 170431 -232479 -137597 135922 -25612 -82788 56411 224587 11374 -275524
17905 -47050 -54511 80353 -36041 237258 191342 85075 -202661 120975 155964 137241 88863
17894 88863 58847 -177534 -24106 -263239 -8180 127722 -258022 -24846 -106855 -72313 31882
17882 -197145 -1632 -96422 -142933 -300653 -108969 -65815 15054 -157885 66733 162865 28049
$$ packed form
17964D27808A15821b41035a1878I9651a46177d2262j84794M4228M209g5427j95211
17953b70638a04432F793d04142R733J36867D5567j5277b1532k01424j37856B40487
17941C0611O096c16881J19560j80533i653C06089G4214b72679D51638A88855E5186
17929C4946K84948r5953B9629b97804I8638J73363i672j31237B69627K3566a31245
17917e5888A44657K5774b32479R4882A35922b5612n7176E6411J68176A1374b75524
17905d7050p461H0353c6041B37258m5916H5075b02661A20975L4989j8723m8378
17894H8863l0016a77534b4106k39133h180A27722b58022b4846q2009L4542C1882
17882a97145a632r4790m6511j57720a08969M3154A5054a57885F6733R6132B8049
$$ plain form
17870 181331 -242568 143990 24552 153032 78307 -228246 124607 10826 43929 218397
17860 218397 112000 -74286 -177888 -174055 -77910 155151 154123 241134 -28949 -176098 52941
17848 336508 272202 127081 17278 -134211 -169245 -193460 5999 140980 32350 163863 15180
17836 -125928 -81108 -34439 -149190 -326064 -245922 217955 -149411 260475 100149 156701
17826 156701 -97427 -45706 9354 -101540 -51765 -377090 -73200 -149363 333307 -282653 53341
17814 43536 489519 -168211 38377 163328 -70931 95137 18279 -137453 130237 -62322 -20125
17802 171099 -346365 41672 -14316 128393 232484 -116178 -37710 -26154 340088 20141
17791 -122887 30698 140786 99087 70250 -344566 150074 57657 -210608 -26527 84921 -94129
$$ packed form
17870A81331b42568A43990B4552J28480p4725b28246A24607A0826L3103J74468
17860B18397j06397g4286j03602L833g7910A55151j028Q7011b8949j47149E2941
17848C36508o4306A27081A7278a34211l5034k4215E999J34981C2350J31513A5180
17836a25928M4820c4439j14751j76874Q0142B17955a49411B60475A00149N6552
17826A56701i7427d5706I354a01540M9775l25325g3200p6163C33307b82653E3341
17814D3536M45983a68211C8377J24951g0931I5137A8279a37453A30237f2322b0125
17802A71099c46365D1672a4316A28393J04091a16178c7710J1556C40088B0141
17791a22887C0698J10088m1699k8837c44566A50074E7657b10608b6527H4921i4129
$$ plain form
17779 -212972 -254264 -325213 -203753 3725 121939 -131188 -45715 47751 134373 -89560 129751
17767 148844 195234 79810 424498 -274227 64768 147871 138760 -33804 68111 283642 134262
17755 -149359 12328 -139735 -125700 53508 111518 24081 316252 -25779 151891 -106315 -171742
17744 -171742 17114 290370 -517340 -142177 -201345 -105182 119723 218729 125310 345495
17734 345495 -100300 13450 -369256 456662 179380 -219051 -326443 15778 123310 60247
17723 -402205 121127 190961 -8207 143366 -238148 -112277 228362 -244446 -52122 50077
17712 -316721 300420 -298766 75055 120179 230487 35862 140243 -249541 154758 300394
17702 300394 -100746 86684 -139617 -44018 14240 -393542 -135212 -16355 143148 -62603
$$ packed form
17779b12972m1292p0949J21460C725J18214a31188d5715D7751Q6622h9560A29751
17767A48844M6390G9810L44688b74227F4768Q3103r111c3804F8111K15531A34262
17755a49359A2328a39735J4035E3508N8010B4081K92171b5779A51891a06315o5427
17744a71742A7114K73256e17340a42177n9168R6163A19723R9006r3419K20185
17734C45495a00300A3450c69256D56662A79380b19051j07392A5778J07532F0247
17723d02205A21127O9834h207A43366b38148a12277B28362b44446e2122E0077
17712c16721C00420b98766G5055M5124J10308C5862J04381b49541A54758J45636
17702C00394a00746H6684a39617d4018A4240c93542a35212a6355A43148f2603
$$ plain form
17691 62681 -83275 -14673 126909 -84488 -162387 176567 -154618 -173222 101076 -76762 -91196
17680 -91196 2686 169156 37119 -120823 117736 57759 -140392 93924 56486 20566 137163
17669 137163 -165286 -67289 191841 135841 381441 -14231 53437 -55918 18543 -307394 24381
17657 160338 -45291 331691 -257944 -80855 149557 -29767 -49684 346578 116966 546023
17647 546023 159915 56250 87226 93056 -210283 49766 47609 -10614 -87675 -211053 -197411
17636 -197411 333097 402404 145317 227132 -142258 -80632 140546 217038 123897 106523 171763
17625 171763 -49557 150215 282450 -33855 73637 135820 -36308 55394 166144 -337810 -149832
17613 239801 -3522 180897 1382 85501 -86950 78535 56053 354274 -175846 88984 -248357
$$ packed form
17691F2681h3275a4673A26909h4488p7899A76567a54618j8604A01076g6762j4434
17680i1196B686J66470C7119a20823A17736E7759a40392I3924l7438B0566J16597
17669A37163a65286f7289A91841n6000K45600a4231E3437e5918A8543c07394B4381
17657A60338d5291C31691b57944h0855A49557b9767j9917C46578A16966M29057
17647E46023A59915E6250L0976N830b10283D9766k157a0614p7061j23378J3642
17636a97411C33097O9307A45317Q1815a42258O1626A40546P6492r3141j7374O5240
17625A71763d9557A50215J32235c3855G3637O2183c6308E5394J10750c37810a49832
17613B39801c522A80897A382Q4119h6950G8535k2482K98221a75846H8984b48357
$$ plain form
17601 -62991 4776 -16259 62220 144429 241892 132186 396512 -133532 -57538 -3503 200270
17589 304749 189789 -189780 80706 -82386 -231627 242746 111565 388985 -20676 19900
17578 55041 -191387 10559 221330 31417 -143083 -234121 16064 4398 -251993 360404 -30442
17566 -93169 117850 298454 -71851 -230579 -31394 37033 5698 294708 297679 55426 -31972
17554 222907 -103266 99011 10560 47640 -111642 -56495 -76453 -87458 66081 -131698 40931
17542 -14974 -265111 -41093 -107609 337738 361763 -84827 -41968 118209 -60920 -135297 4339
17530 -15289 1130 -98750 96896 301081 -189469 -85336 -32355 478501 102034 -182263 -84050
17518 -219202 118225 55189 199261 -285017 32511 116807 364687 182909 -15911 260338
$$ packed form
17601f2991D776a6259F2220Q2209R7463j09706K64326a33532e7538c503B00270
17589C04749j14960a89780H0706h2386j49241B42746A11565K77420b0676A9900
17578E5041a91387A0559K10771C1417a43083r1038A6064D398b51993C60404c0442
17566i3169A17850J80604g1851j58728c1394C7033E698K89010K971E5426c1972
17554B22907a03266I9011A0560L7080a11642N5147j9958j1005F6081a31698D0931
17542a4974k50137d1093o6516C37738K4025h4827d1968A18209f0920p4377D339
17530a5289A130i8750I6896K04185a89469h5336c2355D78501A02034a82263h4050
17518b19202A18225E5189J44072b85017C2511Q4296K47880j81778a5911B60338
$$ plain form
17507 550530 -59351 154635 -119655 69595 58454 210959 442926 63627 -36380 65028 338594
17496 338594 -67194 -57841 78426 379864 275985 -98209 151010 -208887 -85415 -161803 30341
17484 -314841 304585 -18190 -44176 10655 -3713 128210 201939 127215 -41342 -45810 374236
17472 93684 128681 66729 78244 -201521 176980 207450 177253 -174453 244855 156195 33371
17460 192600 195361 111676 19811 271747 471568 165808 298386 122 -201261 123079 65961
17449 65961 175886 -12431 31046 -8462 -38243 -139517 91893 183973 112593 -110305 236365
17437 530567 391608 367921 262720 200681 233069 256300 370429 431903 534730 134356
17426 330604 -50868 209562 484700 372044 66920 94083 599858 205989 215836 100712
$$ packed form
17507E50530e9351A54635a19655F9595j1141J52505K31967F3627c6380F5028K73566
17496C38594f7194R353G8426L01438j03879i8209A51010b08887h5415p6388C0341
17484c14841C04585a8190k5986A0655c713A28210P3729p4724d1342m468C74236
17472I3684L4997o1952J1515b01521A76980L0470l0197a74453B44855q8660C3371
17460A92600K761q3685A9811K51936J99821A65808J32578A22b01261A23079n7118
17449F5961J09925a2431C1046h462k9781j01274I1893R2080p1380a10305B36365
17437E30567j38959k3687j05201o2039L2388K3231J14129O1474J02827A34356
17426C30604e0868B09562K75138j12656F6920K7163N05775B05989R847A00712
$$ plain form
17415 289078 349475 7305 608487 -45298 228895 198286 450762 282490 400512 295619
17405 295619 600797 68367 255751 -33230 66049 481042 -20601 308594 162630 153087 448934
17394 448934 -12976 333350 135709 -5124 15564 332482 238109 -13850 232138 207186 51104
17382 380969 138053 189542 101286 374067 184856 69559 430077 246679 192861 242608
17372 242608 63423 125831 408052 337190 66569 151754 -42114 290937 101909 104122 167919
17361 167919 425680 27157 30337 202603 73335 -8440 -241834 82666 323971 80262 130585
17350 130585 -70027 353896 -213057 116000 215837 76035 92119 104860 75694 64606 203529
17339 203529 -119356 189659 -89507 140505 102794 263075 683493 35138 591390 -49951
$$ packed form
17415B89078O0397G305O01182d5298B28895l0609K52476j68272J18022j04893
17405B95619L05178F8367J87384c3230F6049M14993b0601C08594j45964r543K95847
17394D48934a2976C33350A35709e124A5564L16918r4373a3850B32138k4952E1104
17382C80969A38053N1489q8256K72781A84856F9559L60518j83398n3818M9747
17372B42608F3423O2408K82221p0862F6569Q5185d2114B90937A01909K213O3797
17361A67919K57761B7157L180J72266G3335h440k33394H2666K41305H0262N0323
17350A30585g0027C53896b13057A16000R9837G6035J6084J2741k9166j1088J38923
17339B03529a19356A89659h9507A40505l7711J60281M20418C5138N56252d9951
$$ plain form
17328 226599 117933 325907 54085 90311 -50491 273282 -13193 363020 12206 258892
17318 258892 174211 -12876 -184226 -75553 237915 271358 116016 224457 473849 14220
17307 311225 -35729 424846 -24122 233613 -52972 299556 297885 136699 208487 22064 107944
17296 107944 -83208 228953 31124 125939 181523 -605 154712 268445 135414 291947 -266211
17284 13424 485635 117808 149316 330762 355520 -101408 220439 488720 70974 385076
17274 385076 70892 230534 92426 17755 403436 107627 -7739 179116 130010 273524 10260
17262 184589 -103989 -108066 326476 14686 4209 211379 -274696 372288 -289716 246270
17251 387018 384022 101018 227760 248194 353487 137616 228284 355272 394166 -138101
$$ packed form
17328B26599j08666K07974E4085L6226e0491B73282a3193C63020A2206K46686
17318B58892q4681a2876j71350g5553B37915L3443A16016J08441K49392A4220
17307C11225c5729D24846b4122B33613e2972B99556j671A36699P1788B2064Q5880
17296A07944h3208B28953C1124R4815N5584f05A54712J13733j33031J56533b66211
17284A3424M72211A17808L1508J81446K4758a01408B20439K68281G0974L14102
17274C85076G0892J59642I2426A7755L85681A07627g739A79116m9106J43514A0260
17262A84589a03989m077C26476A4686D209K07170b74696C72288b89716B46270
17251C87018k996A01018J26742K0434J05293A37616R0668J26988L8894a38101
$$ plain form
17240 -58887 60999 82775 -69103 443621 -152117 216554 180085 112984 261325 35732 426902
17229 426902 246589 670662 465094 42889 156127 301311 362023 154753 175445 498952
17219 498952 111869 309 450244 171523 326605 346142 264280 192676 406286 197705 389757
17208 389757 242196 207814 235448 148763 369542 221925 227088 394969 -122796 -13738 259392
17196 271696 265103 484345 180051 237173 135827 260959 338195 -35279 163983 238899 338021
17185 338021 464558 104448 81003 283552 572895 -318087 352126 83743 306909 228559
17175 228559 176823 389093 128458 195231 435783 90849 202420 283568 355236 408609 294192
17164 294192 551125 119142 237561 343535 354361 519948 97638 223765 335622 106489
$$ packed form
17240e8887F0999K1776f9103D43621a52117B16554l6469o7101J48341C5732L91170
17229D26902j80313M24073k05568D2889J13238J45184O0712A54753K0692L23507
17219D98952A11869C09M49935A71523J55082J9537q1862p1604K13610A97705J92052
17208C89757j47561l4382K7634q6685K20779j47617N163J67881a22796a3738B59392
17196B71696o593K19242A80051N7122j01346J25132P7236c5279A63983P4916R9122
17185C38021J26537A04448k3445K02549K89343c18087C52126H3743K23166p8350
17175B28559n1736K12270A28458O6773K40552I0849J11571Q1148P1668N3373j14417
17164B94192K56933A19142J18419J05974J0826J65587I7638J26127J11857A06489
$$ plain form
17153 482670 58444 247376 283834 376789 381765 474207 413706 237088 165818 461138 96397
17141 305633 205885 145790 572859 61189 298970 78432 535867 69669 211379 260896 370571
17130 370571 524329 297302 370175 262627 316316 477586 193571 540198 304164 582690
17120 582690 208876 307245 246271 328836 278517 325403 488874 534628 235331 109036 368701
17109 368701 558114 247194 185085 169509 568608 592112 508168 243746 273759 235675 431299
17098 431299 459255 428735 440568 539352 288403 464993 344005 395128 407479 366172 509511
17087 509511 656048 205491 76783 485935 516973 893389 550411 490283 396671 379781
17077 379781 590596 471064 290263 213627 621084 254124 590553 719185 566374 514754
$$ packed form
17153D82670E8444J88932L6458R2955M976R2442o0501j76618p1270K95320I6397
17141C05633r9748o0095M27069F1189K37781G8432M57435F9669J41710M9517J09675
17130C70571J53758k27027P2873j07548N3689J61270A93571L46627k36034K78526
17120E82690B08876R8369o0974Q2565n0319M6886J63471M5754B35331A09036K59665
17109C68701J89413B47194o2109j5576L99099K3504q3944B43746L0013l8084J95624
17098D31299K7956l0520J1833R8784k50949J76590j20988N1123J2351m1307J43339
17087E09511J46537B05491G6783M09152L1038L76416l42978o0128r3612j6890
17077C79781K10815j19532j80801p6636M07457B54124L36429J28632j52811n1620
$$ plain form
17067 514754 471433 542914 676595 480978 253509 -57210 605079 177159 1098194 201272
17056 674935 681639 600665 277835 455557 655460 354394 449123 575173 39216 314033
17046 314033 848218 694347 171824 648402 574379 414592 370372 324196 791634 789583
17036 789583 691696 696756 649204 429289 612489 576036 475317 459542 840357 570403 790692
17025 790692 836116 560680 451342 696692 628176 424326 683582 828294 778312 752696
17015 752696 458389 666992 587845 678932 958915 797282 657760 712431 660803 844100
17005 844100 575646 779508 640532 686180 666657 717530 587935 855479 713041 564236
16995 564236 588958 371305 437128 698640 905181 811002 665807 676540 940781 495030
$$ packed form
17067E14754m3321P1481J33681j95617k27469e7210F05079A77159R21035B01272
17056F74935O704q0974B77835J77722J99903l01066R4729J26050C9216K74817
17046C14033N34185j53871A71824M76578p4023j59787m4220m6176M67438k051
17036G89583r7887N060m7552k19915J83200l6453j00719j5775L80815k69954K20289
17025G90692M5424k75436j09338K45350o8516k03850K59256J44712m9982k5616
17015G52696k94307K08603p9147R1087K79983j61633j39522N4671n1628J83297
17005H44100k68454K03862j38976M5648j9523N0873j29595K67544j42438j48805
16995E64236K4722k17653O5823K61512K06541r4179j45195J0733K64241m45751
$$ plain form
16985 495030 864416 922788 425824 413750 787267 780219 662455 843969 923561 970080 647721
16974 647721 833315 775817 987863 992812 908303 742498 875666 895916 1212639 556012
16963 1165379 1342750 883474 945802 1045777 1016511 972553 858449 748033 1225349 1059403
16953 1059403 1074343 1449897 1146707 1377337 1124074 1151079 1122765 910717 1147310 1261868
16943 1261868 1236869 1208599 838894 1264951 1120891 1188347 1321053 1097903 992606 1035212
16933 1035212 1260861 1121273 1157881 1006086 1280002 1224449 1325445 1302885 1161268 1036602
16923 1036602 1572329 1169848 1688055 1350561 1384304 1221378 1187663 1365613 1400342 1476188
16913 1476188 1627730 1920700 1709298 1457251 1557483 1442103 1645120 1556752 1672193 1875668
$$ packed form
16985D95030L69386N8372D25824j2074L73517p048j17764J81514P9592M6519l22359
16974F47721J85594n7498K12046M949q4509j65805J33168K0250L16723E56012
16963A165379J77371m59276O2328R9975k9266m3958j14104j10416M77316j65946
16953A059403J4940L75554l03190K30630k53263K7005k8314k12048K36593J14558
16943A261868k4999k8270l69705M26057j44060O7456J32706k23150j05297M2606
16933A035212K25649j39588L6608j51795K73916n5553J00996k2560j41617j24666
16923A036602N35727m02481N18207l37494L3743j62926l3715J77950L4729P5846
16913A476188J51542K92970k11402k52047J00232j15380K03017q8368J15441K03475
$$ plain form
16903 1875668 1498774 1468448 1741150 1722511 1890552 1810892 1753287 2012605 1620562 1672047
16893 1672047 1708992 1892022 1619862 2356261 1850767 1813464 1947059 1957810 2063919 1964877
16883 1964877 2291626 1899947 2258833 1961588 2471030 1995651 2149432 1701518 2322141
16874 2322141 2310715 2440311 2139816 2355733 2290057 2481644 2686230 2572637 2306024 2179149
16864 2179149 2345837 2457937 2780155 2629499 2446906 2875782 2525090 2745778 2759016 2838194
16854 2838194 2767594 2950455 2970671 3128198 2883563 3213955 3168016 3249634 3104992 3707417
16844 3707417 3380920 3691785 3321551 3351212 3813044 3474349 3677516 3927241 3796931 3752411
16834 3752411 3810103 4020657 3936612 4135595 4001230 4181696 4164781 4335352 4422264 4302762
$$ packed form
16903A875668l76894l0326K72702j8639J68041p9660n7605K59318l92043N1485
16893A672047L6945J83030k72160P36399n05494l7303J33595J0751J06109r9042
16883A964877L26749l91679L58886k97245N09442m75379J53781m47914O20623
16874B322141j1426J29596l00495K15917o5676J91587K04586j13593k66613j26875
16864B179149J66688J12100L22218j50656j82593M28876l50692K20688J3238P9178
16854B838194p0600J82861K0216J57527k44635L30392m5939Q1618j44642O02425
16844C707417l26497L10865l70234K9661M61832l38695K03167K49725j30310m4520
16834C752411N7692K10554q4045J98983j34365J80466j6915J70571Q6912j19502
$$ plain form
16824 4302762 4520907 4610067 4842358 5048803 4721497 5155265 5053257 4992161 4961116 5555712
16814 5555712 5429098 5760482 5649040 5769429 6075727 5715602 6320291 6439103 6149449
16805 6149449 6243264 6665161 6799694 6835790 7119190 7305752 7207090 7380782 7483758 7723641
16795 7723641 8014380 8118213 8022751 8434581 8137062 8637389 9161904 9140614 9412905 9263298
16785 9263298 10027253 9998316 10866983 10863422 10968713 11266555 11427153 11683054 12273561 12641535
16775 12641535 12910436 13526228 13663435 14039966 14649829 14706164 15393898 15934949 16396071
16766 16396071 16502953 17296688 17484871 18519952 18887698 19901458 20712923 21431516 22005309
16757 22005309 22811203 23318906 24220488 24830966 26148421 27170615 28097050 29169430 30508000
$$ packed form
16824D302762K18145Q9160K32291K06445l27306M33768j02008o1096l1045N94596
16814E555712j26614L31384j11442J20389L06298l60125O04689J18812k89654
16805F149449R3815M21897J34533L6096K83400J86562r8662J73692J02976K39883
16795G723641K90739J03833r5462M11830k97519N00327N24515k1290K72291j49607
16785I263298P63955k8937Q68667l561J05291K97842J60598K55901N90507L67974
16775A2641535K68901O15792J37207L76531O09863N6335O87734N41051M61122
16766A6396071J06882P93735J88183J035081L67746J013760Q11465P18593N73793
16757B2005309Q05894N07703R01582O10478J317455J022194R26435J072380J338570
$$ plain form
16748 30508000 31519494 32822506 34406972 35735057 37268932 38974140 40827589 42792298
16740 42792298 44612397 46728845 49037959 51415604 54074535 56769815 59532856 62588350
16732 62588350 65793781 69393030 72908591 77004318 81011901 85880793 90175740 95257510
16724 95257510 100148962 105176175 110854693 116915204 122467460 128834192 135036259 141061459
16716 141061459 146789115 152794527 158437923 163227389 168193592 172211577 175622872 178448958
16708 178448958 180360731 181485956 181233618 180574641 178366500 175585880 171907175 167720469
16700 167720469 162743721 157622449 151610008 145677952 139772815 133537203 126923848 121173235
16692 121173235 114813447 109621974 103637512 98529685 93198433 88528885 83735405 79429504
$$ packed form
16748C0508000J011494J303012J584466J328085J533875J705208J853449J964709
16740D2792298J820099K116448K309114K377645K658931K695280K763041L055494
16732F2588350L205431L599249L515561M095727M007583M868892M294947N081770
16724I5257510M891452N027213N678518O060511N552256O366732O202067O025200
16716A41061459N727656O005412N643396M789466M966203M017985L411295K826086
16708A78448958J911773J125225k52338o58977k208141k780620l678705m186706
16700A67720469m976748n121272o012441n932056n905137o235612o613355n750613
16692A21173235o359788n191473n984462n107827n331252m669548m793480m305901
$$ plain form
16684 79429504 75020171 71227501 67373464 64256841 60585873 57851716 54231922 52034615
16676 52034615 49290941 47023356 44673100 42552015 40660208 38686627 36868392 35268457
16668 35268457 33621067 32307965 30708333 29454675 28720764 27177622 25817158 25352847
16660 25352847 24336127 23735990 22572834 21928118 20819894 20472802 19366348 18818458 18343852
16651 18343852 17325298 16794839 16658933 15757863 15574860 15107582 14360768 13749127 13560271
16642 13560271 13333741 12860188 12760746 11997295 11911493 11592667 11327298 10940965 10441646 10266584
16632 10266584 9971497 10005641 9350517 9103302 9122682 8783948 8711847 8294093 8014851 8114989
16622 8114989 8097645 7771390 7277536 7217612 7320330 6691332 6794240 6452666 6568234 6417141
$$ packed form
16684G9429504m409333l792670l854037l116623l670968k734157l619794k197307
16676E2034615k743674k267585k350256k121085j891807j973581j818235j599935
16668C5268457j647390j313102j599632j253658p33911j543142j360464m64311
16660B5352847j016720o00137j163156o44716j108224l47092j106454n47890m74606
16651A8343852j018554n30459j35906r01070j83003m67278p46814o11641j88856
16642A3560271k26530m73553r9442p63451q5802l18826k65369l86333m99319j75062
16632A0266584k95087L4144o55124k47215J9380l38734p2101m17754k79242J00138
16622H114989j7344l26255m93854n9924J02718o28998J02908l41574J15568j51093
$$ plain form
16612 6417141 6225604 6007814 6148568 6032924 5769451 5403595 5482554 5433779 5603536 5075495
16602 5075495 4914132 5014445 4859738 4794942 4755117 4432932 4254672 4420065 4090618 3983371
16592 3983371 4107589 4113502 3806562 4181876 3686161 3641628 3757071 3605658 3566328 3663820
16582 3663820 3629440 3342985 3215204 3685131 3084340 3449737 3692813 3048649 3230477 3044708
16572 3044708 3414768 2964437 2835134 2900881 2825351 2511509 2436288 2431837 2620288 2613817 2485728
16561 2485728 2435756 2554927 2348992 2466940 2337692 2375650 2289090 2792268 2241011 1995481
16551 1995481 2299671 1940421 2273393 2212618 1937574 2110244 2060135 1986336 2188021 1972554
16541 1972554 1986521 2019991 1621137 2182684 1895190 1523960 1631008 1924189 1824705 1946535
$$ packed form
16612F417141j91537k17790J40754j15644k63473l65856P8959m8775J69757n28041
16602E075495j61363J00313j54707o4796l9825l22185j78260J65393l29447j07247
16592C983371J24218N913l06940L75314m95715m4533J15443j51413l9330R7492
16582C663820l4380k86455j27781M69927o00791L65397K43076o44164J81828j85769
16572C044708L70060m50331j29303O5747p5530l13842p5221m451J88451o471j28089
16561B485728m9972J19171k05935J17948j29248L7958q6560N03178n51257k45530
16551A995481L04190l59250L32972o0775k75044J72670n0109p3799K01685k15467
16541A972554J3967L3470l98854N61547k87494l71230J07048K93181r9484J21830
$$ plain form
16531 1946535 1431652 1574047 1541773 1588991 1840351 1664850 1473291 1743368 1302169 1524101
16521 1524101 1786646 1337995 1641959 1139276 1642059 1425202 1289367 1529875 1082372
16512 1082372 1183950 1454752 1101644 1400727 1388208 1405444 1199049 1104388 1015422 1214029
16502 1214029 1426588 1445722 1320509 1383238 1122110 1594341 1309320 1020328 1172390 996895
16492 996895 1161581 794970 960590 676327 1240537 955641 1233336 1272383 1081716 1067987
16482 1067987 1334671 1008203 1186246 736657 1169085 1050984 1047768 779829 1006631 785557
16472 785557 768327 916459 817780 1057835 1205298 1149839 777852 896355 637246 1101991
16462 1101991 728227 721674 938210 1095970 936650 676543 879625 550074 676069 741612
$$ packed form
16531A946535n14883J42395l2274M7218K51360j75501j91559K70077m41199K21932
16521A524101K62545m48651L03964n02683N02783k16857j35835K40508m47503
16512A082372J01578K70802l53108K99083j2519J7236k06395r4661q8966J98607
16502A214029K12559J9134j25213O2729k61128M72231k85021k88992J52062j75495
16492I96895J64686l66611J65620k84263N64210k84896K77695L9047j90667j3729
16482A067987K66684l26468J78043m49589M32428j18101l216k67939K26802k21074
16472G85557j7230J48132r8679K40055J47463n5459l71987J18503k59109M64745
16462A101991l73764o553K16536J57760j59320k60107K03082l29551J25995O5543
$$ plain form
16452 741612 722700 815378 1103816 1084124 717387 628930 397023 1005960 901425 731280
16442 731280 576860 780134 548668 989828 553757 704492 501974 567322 615870 315659
16432 315659 434319 489001 499637 750168 739147 632917 538013 791922 486234 863473
16422 863473 576267 313207 679949 738593 551647 672324 391089 541641 386083 849713
16412 849713 638529 414101 419137 796458 320887 398499 357289 615047 762667 708483
16402 708483 653269 613717 512826 612398 183091 541466 863505 643904 592077 219618
16391 539276 473562 177786 396002 493492 684229 453418 427445 630949 486421 451124
16381 451124 501449 293494 235512 359635 501338 574757 355073 191592 398627 273167
$$ packed form
16452G41612j8912R2678K88438j9692l66737q8457k31907O08937j04535j70145
16442G31280j54420K03274k31466M41160m36071J50735k02518O5348M8548l00211
16432C15659J18660N4682J0636K50531j1021j06230r4904K53909l05688L77239
16422H63473k87206k63060L66742N8644j86946J20677k81235J50552j55558M63630
16412H49713k11184k24428N036L77321C20887P7612m1210K57758J47620n4184
16402G08483n5214l9552j00891R9572A83091L58375L22039k19601n1827B19618
16391E39276o5714A77786K18216R7490J90737k30811k5973K03504j44528l5297
16381D51124N0325k07955n7982J24123J41703P3419k19684j63481K07035j25460
$$ plain form
16371 273167 617517 417522 557799 467937 445901 542724 874902 265924 433100 460914
16361 460914 639577 12820 201979 218173 343275 697977 219444 282007 520292 544001
16351 544001 544408 32551 117041 423653 481785 95911 83611 552208 337236 287346 401060
16340 401060 619569 336562 251024 316846 164075 -20001 29594 247746 467267 451415
16330 451415 264788 281381 349935 165656 174991 405270 213793 556475 225843 566614
16320 566614 440921 122975 73813 85149 78356 428688 387864 239747 261877 109248 458238
16309 458238 214709 523215 179292 52087 164022 176985 223923 149706 472533 462135
16299 462135 -12216 97589 482171 313829 299895 25293 67548 -140775 206324 83406 75181
$$ packed form
16371B73167L44350j99995J40277q9862k2036R6823L32178B65924J67176K7814
16361D60914J78663A2820J89159J6194J25102L54702B19444O2563K38285K3709
16351E44001M07C2551Q4490L06612N8132I5911j2300M68597k14972m9890J13714
16340D01060K18509k83007q5538O5822j52771b0001B9594K18152K19521j5852
16330D51415j86627J6593O8554A65656R335K30279j91477L42682B25843L40771
16320E66614j25693A22975m9162J1336o793L50332m0824j48117K2130A09248L48990
16309D58238B14709L08506A79292E2087J11935J2963M6938p4217L22827j0398
16299D62135a2216I7589L84582j68342j3934B5293M2255a40775B06324H3406q225
$$ plain form
16288 75181 27536 335177 191988 170107 152291 104951 103490 192761 320884 160945 153006
16277 153006 295543 234509 61901 174193 155436 218513 169009 -156686 288064 408368
16267 408368 197825 193890 56192 83081 587448 -16229 338395 256903 28068 350130 135447
16255 60181 223037 287791 15616 151530 274745 320704 -117170 -146277 45822 29883 6499
16243 133505 177863 101223 200112 379658 85117 255065 204564 383748 75893 153906 63095
16231 174923 177619 205375 -135733 344093 27 -65371 25627 256580 202183 -183629 19038
16219 100402 185286 123712 -20204 -38497 82588 -108285 -81789 -50874 75244 60101 -97273
16207 44100 -8539 83038 -122813 209859 34119 99795 -35803 166773 203464 17377 229914
$$ packed form
16288G5181B7536L07641j43189k1881j7816m7340j461Q9271J28123j59939p939
16277A53006J42537o1034F1901J12292j8757O3077m9504a56686B88064J20304
16267D08368A97825l935E6192K6889N04367a6229C38395q1492B8068L22062A35447
16255F0181J62856O4754A5616J35914J23215M5959a17170k9107D5822j5939F499
16243A33505M4358p6640R8889J79546H5117J69948n0501J79184G5893P8013F3095
16231A74923K696K7756a35733C44093B7f5371B5627K30953n4397a83629A9038
16219A00402Q4884o1574b0204j8293H2588a08285K6496L0915G5244j5143i7273
16207D4100h539H3038a22813B09859C4119O5676c5803A66773L6691A7377K12537
$$ plain form
16196 229914 17808 131784 230126 -9485 -241785 16831 385220 455534 122219 109398 105507
16185 105507 -6568 252528 -94538 320563 180574 -56358 152773 112623 15995 255168 6827
16173 -32885 146109 -84048 -153946 97504 -134029 -181264 246414 356655 -70510 245846 165980
16162 165980 222874 -87331 43469 -58568 -65501 -55246 -19789 50028 -198068 156069 -238608
16150 223149 -190655 -144776 -32752 288359 136655 118544 471633 -104209 -88698 -114048
16140 -114048 390729 184136 141830 64564 257124 164558 -209356 149386 117738 309024
16130 309024 119713 -215858 -200249 55820 166086 -188628 186362 290565 68518 600 111390
16119 111390 -543020 92216 -216857 285684 85961 231837 -35211 -150921 -507065 147171
$$ packed form
16196B29914A7808J13976R8342i485k32300A6831L68389P0314A22219j2821l891
16185A05507f568B52528i4538C20563j39989e6358A52773m0150A5995K39173F827
16173c2885A46109h4048o9898I7504a34029m7235B46414J10241g0510B45846p9866
16162A65980N6894h7331D3469e8568o933J0255a9789E0028a98068A56069b38608
16150B23149a90655M5879c2752B88359A36655j8111L53089a04209J5511k5350
16140a14048C90729A84136m2306F4564J92560r2566b09356A49386l1648J91286
16130C09024A19713b15858J5609E5820J10266a88628A86362J04203F8518F00J10790
16119A11390e43020I2216b16857B85684H5961J45876c5211j15710l56144A47171
$$ plain form
16108 79740 -139753 -58289 -58229 -378036 151944 54514 121087 496603 -68447 373650 190985
16097 190985 -23580 231993 12871 -103787 146474 113803 102285 -141754 488713 306745
16087 306745 83524 -246097 -120540 -95524 -86905 -88226 -155882 22699 -166657 193490 -95262
16075 -155128 -34738 26534 275786 -239943 -157092 302369 -98582 8830 30653 -197739 83498
16063 -156543 -110801 221501 -224303 -59808 -40987 -180019 -279100 236178 105187 -217121
16052 -106632 36250 -92094 297897 48698 -129879 -243846 -137350 112501 -2191 -15214 -39630
16041 -39630 210780 -163580 -65976 -260352 162097 -65294 18776 5818 40252 -30803 373253
16029 61050 -366159 -65278 -30184 22624 75618 47113 38909 389477 106679 73371 -100314
$$ packed form
16108G9740a39753e8289O0l19807A51944E4514O6573L75516f8447C73650j82665
16097A90985b3580B31993A2871a03787A46474l2671j1518a41754D88713j81968
16087C06745H3524b46097a20540K5016Q619j321o7656B2699a66657A93490i5262
16075a55128c4738B6534K49252b39943Q2851C02369i8582H830K1823a97739H3498
16063a56543M5742B21501b24303e9808J8821j39032r9081B36178A05187b17121
16052a06632C6250i2094B97897D8698a29879j13967J06496A12501b191j3023k4416
16041c9630B10780a63580f5976j94376A62097f5294A8776E818L4434c0803C73253
16029F1050c66159f5278c0184B2624N2994k8505q204L50568A06679l3308a00314
$$ plain form
16017 -61690 -177818 1258 -74856 171457 145556 69053 170864 -74634 -171744 -95650 -103600
16006 -103600 78274 33635 -97222 178504 -39630 -92208 -116639 -123342 -124291 -22376 92102 -251042
15993 52161 137699 364515 -89857 -216008 108169 225820 -247 85002 217568 355529 -34951
15981 -56329 -132988 102139 -72299 -25681 154899 -13685 115288 105337 -280067 -27756 83808
15969 72180 82877 137320 249566 271925 295189 -4423 400815 35370 134560 -175317 -125351
15958 -125351 180800 -136438 -93383 3126 -90652 -178239 9755 -13759 -126189 -376067 -171151
15946 -72974 179949 -160295 215208 13873 -122081 -34243 294243 255923 -94896 -127044 -192362
15935 -192362 -49515 248867 -435008 -21696 14369 -143947 -40683 53376 -25085 -77705 -285726
$$ packed form
16017f1690j16128A258g4856A71457k5901F9053J01811g4634r7110P6094p950
16006a03600G8274C3635i7222A78504c9630n2578k4431o703r49b2376I2102b51042
15993E2161Q5538K26816h9857j26151A08169J17651b47H5002J32566J37961c4951
15981e6329p6659A02139g2299b5681A54899a3685A15288r951b80067b7756H3808
15969G2180J0697N4443J12246K2359K3264d423D00815C5370R9190a75317M9966
15958a25351A80800a36438M3055C126i0652q7587I755a3759j12430k49878a71151
15946g2974A79949a60295B15208A3873a22081c4243B94243l8320i4896l2148o5318
15935a92362d9515B48867d35008b1696A4369a43947d0683E3376b5085n2620k08021
$$ plain form
15924 -285726 -43065 -160779 72300 -48447 -109818 -49993 -162235 72582 -183671 -145307 -197717
15913 -197717 -353802 -153645 239278 231068 -63233 10880 -153076 -545605 179038 110039
15903 110039 95216 -4193 -171886 97549 20204 32212 47924 -74446 43935 -247807 50762
15891 -208782 131806 -59397 168765 60949 -54827 -416305 -137265 -98770 -68620 134541
15880 -162014 53823 -2569 59386 -101245 -283466 329347 167865 99093 -5012 -167699 -27530
15868 -143396 74983 -58931 -491850 -109190 137891 -34207 -112407 -4817 -96745 -133572 72360
15856 155322 -173855 -214132 -30005 -147127 9367 -455244 -67664 66331 -119798 358083 -144881
15844 -34980 261153 -1749 -151182 -433953 11242 254099 140321 -50310 -125514 198622 -146686
$$ packed form
15924b85726d3065j17714G2300d8447o1371d9993j12242G2582a83671L8364n2410
15913a97717j56085a53645B39278q210f3233A0880a53076l92529A79038o8999
15903A10039j4823d193j67693I7549B0204J2008J5712g4446D3935b47807E0762
15891b08782A31806e9397A68765F0949e4827l61478a37265L8495L0150A34541
15880a62014E3823b569E9386a01245j82221C29347j61482o8772e012j62687b7530
15868a43396G4983e8931m32919a09190A37891c4207p8200d817r1928l6827G2360
15856A55322a73855m0277c0005j17122I367d55244f7664F6331a19798C58083a44881
15844c4980B61153a749j49433k82771A1242K42857j13778e0310p5204A98622a46686
$$ plain form
15832 57261 -285437 136836 -12951 41859 310121 33781 -9660 -102087 283716 -116189 382438
15820 -58130 118000 258674 -192842 -158460 -183694 -321308 451794 13216 29913 50537 -103967
15808 -238591 -209381 -275350 -316609 -163784 -298355 -165029 103924 112196 11579 -94061 53548
15796 31687 -46000 -188422 126887 87234 -246123 112508 253863 -266324 18834 -13862
15785 119675 85597 30508 3603 -4131 -48191 28579 -121301 54060 -194412 35028 236648
15774 236648 -209482 59905 126815 -192686 -90850 -20364 54144 75966 -179310 20196 90683
15763 90683 152941 -60538 67540 -217379 -185431 74988 239960 318221 134243 20442 -226091
15751 45027 -176056 -197883 -9883 -64152 -52066 -163860 180114 112054 -293299 128533 144630
$$ packed form
15832E7261b85437A36836a2951D1859K68262C3781i660r2427B83716a16189C82438
15820e8130A18000J40674a92842L4382k5234j37614D51794A3216J6697K0624a03967
15808b38591K9210o5969m1259J52825j34571J33326A03924Q272A1579i4061E3548
15796C1687d6000j42422A26887l9653b46123A12508J41355b66324A8834a3862
15785A19675l4078C0508C603d131m4060B8579a21301E4060a94412C5028K01620
15774B36648b09482E9905O6910a92686i0850b0364E4144K1822a79310B0196P0487
15763I0683O2258f0538F7540b17379L1948G4988J64972P8261A34243B0442b26091
15751D5027a76056k1827i883n4269J2086j11794A80114o8060b93299A28533J6097
$$ plain form
15740 144630 -23928 -28757 -43051 -34330 62375 85367 -24791 23599 30267 134993 62518 478659
15728 478659 -30582 154123 -88483 121932 -242754 -66604 -68209 -8730 -125506 -100408 -297482
15717 -297482 -168246 95738 -224304 -113113 9884 -154172 -87833 -73332 -299583 46810 -82659
15705 -182121 316942 -87828 30512 98405 -70993 -106574 -369462 328471 -99274 39790 -93254
15693 69883 66704 -107660 206863 -69283 -174280 6720 -106676 -369963 235578 -169677 25886
15681 -145328 38196 -211562 -64155 -318518 -224946 85596 -46232 154745 330385 -178857
15670 105059 -119307 -54339 134833 -215074 -74151 -39541 197052 -177254 92802 -18425
15659 215927 218388 -9833 48622 -203460 64059 -43415 -25017 234388 -51374 197733 -171022
$$ packed form
15740A44630b3928m829j4294Q721F2375K2992b4791B3599O668J04726F2518M16141
15728D78659c0582A54123h8483A21932b42754f6604j605h730j16776K5098j97074
15717b97482J29236I5738b24304J11191I884a54172O6339J4501k26251D6810h2659
15705a82121C16942h7828C0512O7893g0993l5581k62888C28471i9274C9790i3254
15693F9883l179a07660B06863f9283j04997F720a06676k63287B35578a69677B5886
15681a45328C8196b11562f4155k54363R3572H5596d6232A54745J75640a78857
15670A05059a19307e4339A34833b15074g4151L4610A97052a77254I2802a8425
15659B15927K461i833D8622b03460F4059d3415J8398B34388e1374A97733a71022
$$ plain form
15647 49134 88734 -167349 16329 5554 39109 -259450 -269293 -348232 24577 -146694 -121446
15636 -121446 -62060 -392719 -80591 -78460 -48369 103628 -311247 -40422 184925 -364266 -104548
15624 -183644 -132730 -162699 -242107 -120764 32443 -135795 -331790 -178631 -82961 103847
15613 93074 -292968 408664 132597 -222596 -186221 -193353 44940 401828 223549 170789 62429
15601 -407450 164159 -41847 86899 253005 -56801 131326 -27809 338604 128815 303755
15591 303755 48916 383131 -341929 -68175 122240 26592 91816 141067 -194164 41383 -38610
15579 283497 57496 -241269 164748 -353261 44765 -103264 372823 126428 114214 -40250
15568 218916 -25829 136133 51418 247594 43929 -270407 137352 172262 -280753 -150408
$$ packed form
15647D9134L9600a67349A6329E554L3555b59450r843p8939B4577a46694K5248
15636a21446N9386l30659h0591K131L0091A03628c11247d0422A84925c64266a04548
15624a83644N0914k9969p9408a20764C2443a35795j95995J53159h2961A03847
15613I3074b92968D08664A32597b22596L6375p132D4940L56888j78279n2760F2429
15601d07450A64159d1847H6899J66106e6801A31326b7809C38604A28815J74940
15591C03755D8916L34215c41929f8175A22240B6592O5224M9251a94164D1383c8610
15579B83497E7496b41269A64748c53261D4765a03264C72823A26428j2214d0250
15568B18916b5829A36133E1418J96176D3929b70407A37352L4910b80753J30345
$$ plain form
15558 -150408 -189338 8309 -31932 -10076 147603 -127042 -92705 96062 145082 44813 5039
15546 111414 23656 335502 171593 25066 231701 -59883 -341280 -271413 130555 -199149
15535 -237879 -34841 -249131 -243183 86737 -20134 -99952 40748 -205734 -495110 -74036 254741
15523 -34093 -52761 46987 -4646 -64320 93316 -177964 317535 6711 -505075 -65028 -172101
15512 -172101 -165837 -130418 -30229 331930 -85639 353017 -218169 -188407 257091 387700 358688
15501 358688 -34742 45057 21283 125268 163508 -47241 -365088 -45119 86550 152147 -51233
15489 51979 38429 -268376 -191932 -196358 23245 -37136 -205559 -62452 61048 -140174 -93847
15478 -93847 -197318 -41482 -315555 -158850 6730 -163400 -7322 69001 -6492 59383 137443
$$ packed form
15558a50408l8930H309c1932a0076A47603a27042L4337I6062M9020D4813E039
15546A11414B3656L11846j63909B5066K06635e9883k81397O9867A30555a99149
15535b37879c4841k14290N948H6737b0134p9818D0748b05734k89376g4036B54741
15523c4093j8668D6987d646n9674I3316a77964C17535F711e05075f5028j07073
15512a72101O264L5419c0229C31930h5639C53017b18169K9762B57091J30609k9012
15501C58688c4742D5057B1283J03985L8240d7241l17847d5119H6550O5597e1233
15489E1979j3550b68376P6444m426B3245c7136j68423f2452F1048a40174M6327
15478i3847j03471d1482k74073J56705F730a63400g322F9001f492E9383P8060
$$ plain form
15467 137443 262883 -229274 31201 92025 202881 20508 -171415 -80452 136743 87383
15457 87383 88871 -207469 180190 -19976 110465 289342 -14133 89880 -56712 188391 323650
15446 323650 272171 -136051 -225841 -7210 93453 68613 227263 59615 -186471 173911 -248197
15434 110502 10869 62199 307937 -109388 37722 147843 143663 166088 -266700 85960 -96068
15422 132803 -87062 85635 -38557 8115 137226 141282 -153737 241072 29589 9487 -322615
15410 111577 -5820 268554 -37540 -110932 284913 202460 68110 -83933 -149899 -447731 101471
15398 -310944 -77293 -333640 -97061 -170340 179153 -360229 -168768 -235218 43024 140055 56952
15386 -136248 219873 -125259 24392 -92610 -75107 338874 17419 62059 -456309 -148019
$$ packed form
15467A37443J25440b29274C1201O0824J10856B0508a71415h0452A36743m9360
15457H7383J488b07469A80190a9976A10465J78877a4133H9880e6712A88391J35259
15446C23650n1479a36051q9790g210I3453k4840J58650E9615a86471A73911b48197
15434A10502A0869N1330K45738a09388C7722J10121m180K2425b66700H5960i6068
15422A32803h7062H5635c8557H115J29111M056a53737B41072B9589I487c22615
15410A11577e820B68554c7540p3392B84913q2453F8110h3933o5966k97832A01471
15398c10944g7293k56347i7061p3279A79153c60229a68768o6450D3024R7031E6952
15386a36248B19873a25259B4392i2610J7503C38874A7419M4640d56309a48019
$$ plain form
15375 80960 -189134 -173880 -195651 -60801 142079 -272948 -96637 -45372 -237509 11537 -105161
15363 13263 133659 24683 246315 -355801 8654 403778 166640 -288148 -169495 84764
15352 12550 -132764 -20538 9491 160066 324831 -94557 419031 -67507 -104268 55082 23216
15340 -12046 398625 -288695 -19470 -112711 -142673 98856 -67214 104781 251328 57645 278896
15329 278896 -162062 96628 209224 -2422 -143538 -43554 -89360 -35421 -56201 21503 24573
15318 24573 263755 -141414 -395597 94746 -17126 -22744 -138425 -95735 -111937 -76274 104313
15306 144176 239885 -334132 -214808 266093 -208338 -20579 -126560 225769 362146 55711
15295 104258 201822 45594 355670 -23866 -199177 33331 45125 -31096 349851 -9326 -32398
$$ packed form
15375H0960a89134J5254k1771f0801A42079b72948i6637d5372j92137A1537a05161
15363A3263J20396B4683K21632c55801H654L95124A66640b88148J18653H4764
15352A2550a32764b0538I491J50575J64765i4557D19031f7507l6761E5082B3216
15340a2046C98625b88695a9470r3241k9962I8856f7214A04781J46547E7645K21251
15329B78896a62062I6628J12596b422j41116d3554m5806c5421k0780B1503L070
15318B4573K39182a41414k54183I4746a7126n618j15681M2690j6202L5663A04313
15306A44176R5709c34132J19324B66093b08338b0579j05981B25769J36377E5711
15295A04258R7564D5594L10076b3866j75311C3331J1794c1096C49851i326k3072
$$ plain form
15284 -32398 158130 179796 -292694 407355 32612 81331 303951 270192 309638 -9665 55679
15272 73901 -1988 67251 51742 -234618 -344 -65992 43363 -43125 75795 -280773 136454 -64653
15259 -39155 34960 333750 -181350 26253 -90443 202872 191733 -118844 102353 -93715 200530
15247 163652 238426 389119 -283463 31715 21315 212397 207019 286548 154005 135629 369617
15236 369617 302763 479782 821889 1130636 1753059 1499068 1152849 1299531 914442 325583
15225 67594 145579 8409 190852 32848 366607 -127233 120474 1157 125769 77142 -157473
15213 -273050 99252 2627 154366 -10632 -266379 300580 145340 135801 124195 223722 -148235
15201 310030 -14466 174017 333591 161370 91725 96442 262715 -76629 -260078 -258354 -33992
$$ packed form
15284c2398A58130K1666b92694D07355C2612M8719K22620l3759L9446i665E5679
15272G3901a988F7251j5509b34618c44o5648D3363d3125G5795b80773A36454f4653
15259c9155C4960K98790a81350B6253i0443B02872j1139a18844A02353i3715B00530
15247A63652P4774J50693b83463C1715j0400J91082n378P9529j32543j8376K33988
15236C69617o6854J77019L42107L08747O22423k53991l46219J46682l85089C25583
15225F7594P7985H409J82443C2848L33759a27233A20474A157J24612m8627a57473
15213b73050I9252B627J51739a0632k55747C00580A45340r539j1606R9527a48235
15201C10030a4466A74017J59574A61370o9645M717J66273g6629j83449J724c3992
$$ plain form
15189 246464 268779 76121 73037 53918 -30806 150296 156213 45832 -88717 27905 102018 96435
15177 96435 72447 240122 90969 36536 234952 226279 133391 -115039 -3513 -158987 -76224
15165 66944 345461 112080 368239 153328 231784 -62209 173034 -341777 415767 -36437
15154 -18578 203680 -160286 -64096 251451 277173 89060 433710 -122044 -36939 620831
15143 97252 -185915 283397 244760 -20797 333527 275521 93075 321894 3774 -63144 135418
15131 -93161 155674 -18630 198671 -407152 253986 -67445 -107358 255204 615987 257588
15120 2493 275733 156150 182726 94184 79436 185612 -108952 -132177 368053 137527 82519
15109 82519 53375 76022 112948 37535 33898 456095 110148 66227 -23247 230769 -116693
$$ packed form
15189B46464K2315G6121l084j9119c0806A50296N917D5832h8717B7905P4113n583
15177I6435k3988J67675I0969C6536J98416q673r2888a15039c513j55474g6224
15165F6944K78517A12080K56159A53328P8456f2209A73034c41777D15767c6437
15154a8578B03680a60286f4096B51451K5722H9060L44650a22044c6939F20831
15143I7252a85915B83397l8637b0797C33527n8006I3075K28819C774f3144A35418
15131i3161A55674a8630A98671d07152B53986f7445l9913B55204L60783B57588
15120B493K73240j19583K6576q8542j4748J06176a08952k3225C68053A37527n5008
15109H2519k9144K2647L6926C7535l637M22197A10148m3921b3247B30769a16693
$$ plain form
15097 99960 -11684 160464 108795 196763 56927 -88669 137554 99018 237851 215693 183926
15086 183926 -71060 127380 1261 339712 335378 336555 -97518 188192 68239 288365 36667
15074 132184 239170 35180 225330 223048 476064 263218 80380 -71706 984 -77073 -205320
15063 -205320 250877 -52632 -18728 71904 564693 342558 275019 143475 316730 64525
15052 -200845 23381 -68851 142077 18903 86868 -205199 -62801 262311 56248 144540 242920
15041 242920 280199 26679 243595 -80737 120760 107904 250408 91222 525989 20467 191659
15030 191659 225301 150450 36063 162139 29157 159244 158998 294761 -5002 138714 3383
15018 449251 254931 369819 122137 461178 269977 -3229 4032 40134 173122 455010
$$ packed form
15097I9960a1684A60464n1669Q7968E6927h8669A37554l8536J38833k2158l1767
15086A83926g1060A27380A261L38451m334J177i7518A88192F8239K20126C6667
15074A32184J06986C5180J90150k282K53016k12846H0380g1706I84g7073j28247
15063b05320B50877e2632a8728G1904M92789k22135o7539j31544J73255F4525
15052b00845B3381f8851A42077A8903O7965b05199f2801B62311E6248Q8292R8380
15041B42920L7279B6679K16916h0737A20760j2856J42504I1222M34767B0467J71192
15030A91659L3642p4851C6063J26076B9157J30087k46J35763e002A38714C383
15018D49251j94320J14888A22137L39041j91201c229D032L6102J32988K81888
$$ plain form
15008 455010 599528 369067 333111 164592 116888 440851 206257 -170221 94979 87061
14998 87061 71 363086 501589 4254 226284 183417 239289 462915 -45761 287296 373884
14987 373884 206816 274353 153563 266244 197413 240012 164880 147137 391622 147008
14976 31704 168064 186651 55608 383570 -3828 129974 371704 -252941 521397 262594
14966 262594 132022 326538 105721 124138 477441 202520 232208 249832 269179 9308 171044
14955 171044 198887 244413 12938 192493 289087 207388 272467 391723 102992 436771 168004
14943 248096 235576 526075 207113 142547 342307 234593 345732 231938 145536 273277
14933 273277 499978 349733 205019 165239 427226 352466 35290 426963 286553 308047
$$ packed form
15008D55010J44518k30461l5956A64592m7704L23963B06257a70221I4979p918
14998H7061G1L63015J38503D254K22030m2867N5872K23626d5761B87296Q6588
14987C73884j67068O7537j20790J12681o8831M2599p5132j7743K44485A47008
14976C1704J36360J8587E5608L27962c828A29974K41730b52941E21397k58803
14966B62594j30572J94516A05721J8417L53303B02520K9688J7624J9347I308J61736
14955A71044K7843M5526A2938J79555R6594q1699O5079J19256A02992L33779A68004
14943B48096j2520K90499B07113o4566J99760j07714J11139j13794q6402J27741
14933B73277K26701j50245j44714l9780K61987p4760C5290L91673j40410K1494
$$ plain form
14923 308047 154323 171596 405715 149811 276479 317893 217898 94013 95178 -98503 102641
14911 472175 100300 245524 301494 285057 352762 307311 431571 497526 413808 410598 580945
14900 580945 315944 -57035 629397 403178 423903 105116 190446 198299 505964 280199
14890 280199 410907 684032 280593 633803 173609 492175 322245 566817 46837 319917
14880 319917 138387 523187 236315 485589 284236 322957 273014 337121 468466 311573
14870 311573 347628 24505 125226 439183 487951 471815 623057 573278 634531 428568 392998
14859 392998 372944 477819 555928 295083 398525 231214 477080 164619 -51745 105310
14848 376366 205958 680577 321749 697568 467077 413621 14041 351168 448023 458290
$$ packed form
14923C08047j53724J7273K34119A49811J26668M1414r9995I4013J165i8503A02641
14911D72175A00300J45224N5970j6437O7705m5451J24260O5955q3718l210J70347
14900E80945k65001e7035F29397k26219K0725A05116Q5330P853L07665k25765
14890B80199J30708K73125B80593L53210A73609L18566j69930K44572D6837K73080
14880C19917A38387L84800B36315K49274k01353L8721m9943O4107J31345j56893
14870C11573L6055B4505J00721L13957M8768j6136J51242m9779O1253k05963l5570
14859C92998k0054J04875P8109k60845J03442j67311K45866A64619e1745A05310
14848C76366j70408M74619C21749L75819k30491n3456A4041L37127R6855J0267
$$ plain form
14838 458290 201563 528770 450949 513290 417711 315821 477240 312884 322655 577126
14828 577126 294788 578403 407985 610658 506861 521430 562963 94873 646916 303777
14817 633258 316522 608954 428901 210155 512499 441174 580238 301501 426296 560979
14807 560979 314714 177824 528142 403726 385875 327744 346712 224384 181782 573177
14797 573177 563335 894074 347669 239398 234868 503921 591297 553215 513757 425362 684421
14786 684421 480882 523406 725759 624456 753948 485557 634790 496108 592708 580818
14776 580818 377888 849994 460426 474011 579812 650700 250517 436276 532001 824473
14766 824473 508451 502264 501529 621568 702118 222323 833536 743646 868578 463535 578275
$$ packed form
14838D58290B01563L27207p7821O2341r5579j01890J61419j64356R771K54471
14828E77126k82338K83615j70418K02673j03797J4569M1533I4873N52043C03777
14817F33258C16522K92432j80053B10155L02344p1325J39064k78737J24795J34683
14807E60979k46265j36890L50318j24416j7851n8131J8968j22328m2602L91395
14797E73177r842L30739C47669j08271m530K69053Q7376l8082l9458q8395K59059
14786F84421k03539M2524K02353j01303J29492k68391J49233j38682R6600j1890
14776E80818k02930M72106l89568J3585J05801P0888B50517J85759R5725K92472
14766H24473l16022o187p35J20039Q0550B22323O11213q9890J24932m05043J14740
$$ plain form
14755 578275 785907 895924 731851 510870 512725 614507 680399 373846 740475 958528
14745 958528 600247 401790 750794 485057 258675 960175 575447 755902 881362 372321
14734 719964 865511 591973 711384 741621 939642 515754 732066 999021 436091 844148
14724 844148 636782 594423 831887 1002796 847455 691743 730786 861166 802634 537820
14714 537820 566164 852580 653638 876383 872449 1034639 884187 812451 1096053 963460
14704 963460 869154 726588 811941 715838 1062805 730269 969586 686068 1096926 634640
14694 634640 890717 984866 730725 541055 735343 897610 633239 627464 1066262 753758
14684 753758 832529 956463 797874 777427 883133 944977 1067146 912980 636603 1134489
$$ packed form
14755E78275K07632J10017j64073k20981J855J01782O5892l06553L66629K18053
14745I58528l58281j98457L49004k65737k26382P01500l84728J80455J25460C72321
14734G19964J45547k73538J19411L0237J98021m23888K16312K66955D36091M08057
14724H44148k07366m2359K37464J70909j55341j55712L9043J30380n8532k64814
14714E37820K8344K86416j98942K22745l934J62190j50452p1736K83602j32593
14704I63460r4306j42566Q5353r6103L46967l32536K39317k83518M10858m62286
14694F34640K56077R4149k54141j89670J94288J62267k64371n775M38798l12504
14684G53758P8771J23934j58589k0447J05706O1844J22169j54166k76377M97886
$$ plain form
14674 1134489 1046891 988445 939340 617258 1243439 1026227 948998 965168 1337190 1086637
14664 1086637 1119394 776805 1106465 1315935 1124774 1115093 1003941 1098973 956943 773217
14654 773217 1436625 1001618 1104857 965949 1033696 1346368 1118357 770609 1270948 1027391
14644 1027391 940527 1289105 1488700 1444254 1009990 1214608 1165596 1089079 1172324 1095929
14634 1095929 805208 1092182 1202334 1148545 1250768 1584243 1396554 1182905 1513427 1271422
14624 1271422 1457941 1215983 1499076 1195453 1480451 1509118 1267638 1565409 1584114 1459434
14614 1459434 1270288 1267780 1301130 1774812 1347740 1447246 1643116 1405432 1542171 1196238
14604 1196238 1308998 1335974 1477099 1333551 1674900 1626187 1619580 1786520 1638013 1603388
$$ packed form
14674A134489q7598n8446m9105l22082O26181k17212p7229J6170L72022k50553
14664A086637L2757l42589L29660K09470j91161r681j11152R5032j42030j83726
14654G73217O63408m35007J03239j38908O7747L12672k28011l47748N00339k43557
14644A027391q6864L48578J99595m4446m34264K04618m9012p6517Q3245p6395
14634A095929k90721K86974J10152n3789J02223L33475j87689k13649L30522k42005
14624A271422J86519k41958K83093l03623K84998K8667k41480K97771J8705j24680
14614A459434j89146k508L3350M73682m27072R9506J95870k37684J36739l45933
14604A196238J12760K6976J41125j43548L41349m8713o607J66940j48507l4625
$$ plain form
14594 1603388 1744521 1847232 1405070 1659279 1727277 1646278 1330854 1694660 1890121 1736610
14584 1736610 1888774 1479747 2001357 1600134 1709031 1869730 1895057 1756267 1806976 1822390
14574 1822390 1676123 2149674 1896739 2181042 1930532 1774706 1954671 2243636 2016479
14565 2016479 1965623 2174794 2192523 1842379 2228426 2201108 2229672 2438305 2265999 2318485
14555 2318485 2700195 2261989 2420924 2429276 2571876 2793664 2627619 2404844 2773935 2529685
14545 2529685 2804914 3048960 3675300 3458749 4060919 4170365 4292030 4780053 5656150
14536 5656150 6736066 8408910 10490317 14898941 21570277 31071352 29749857 18870898
14528 18870898 12773006 8534314 5957611 4266913 3279003 3226242 2839088 2803851 2672284
$$ packed form
14594A603388J41133J02711m42162K54209O7998q0999l15424L63806J95461j53511
14584A736610J52164m09027N21610m01223J08897J60699K5327j38790N0709J5414
14574A822390j46267M73551k52935K84303k50510j55826J79965K88965k27157
14565B016479n0856K09171J7729l50144L86047k7318K8564K08633j72306N2486
14555B318485L81710m38206J58935Q352J42600K21788j66045k22775L69091k44250
14545B529685K75229K44046O26340k16551O02170J09446J21665M88023Q76097
14536E656150J079916J672844K081407M408624O671336R501075j321495j0878959
14528A8870898o097892m238692k576703j690698r87910n2761l87154l5237j31567
$$ plain form
14519 2672284 2318885 2575838 2496750 2624422 2304062 2344253 2424636 2395424 2406522 2397359 2247228
14508 2247228 2314523 2459750 2866311 2841864 2649402 2718720 2657639 2701880 2672073 2348448
14498 2348448 2803450 3168886 2892789 2714517 3089290 3030406 3142513 2982913 3095819 3408500
14488 3408500 3073060 3107727 3231941 3303192 3217462 3252867 3463803 3498189 3405599 3345112 3715451
14477 3715451 3712816 3717432 3578293 3769400 3432916 3874877 3636478 3810313 4228028 3853513
14467 3853513 4233124 3980932 4040061 3741761 3962443 4158715 4222951 4597931 4335745 4449048
14457 4449048 3984698 4746525 4404275 4606352 4876392 4480525 4579773 4346873 5148544 4821959
14447 4821959 4768799 5054088 4938071 4809605 5326777 5405900 5232556 5269764 5400139 5527625
$$ packed form
14519B672284l53399K56953p9088J27672l20360M0191Q0383k9212J1098r163j50131
14508B247228O7295J45227M06561k4447j92462O9318o1081M4241k9807l23625
14498B348448M55002L65436k76097j78272L74773n8884J12107j59600J12906L12681
14488C408500l35440L4667J24214P1251q5730L5405K10936L4386r2590o0487L70339
14477C715451k635M616j39139J91107l36484M41961k38399J73835M17715l74515
14467C853513L79611k52192N9129k98300K20682J96272O4236L74980k62186J13303
14457D449048m64350P61827l42250K02077K70040l95867R9248k32900Q01671l26585
14447D821959n3160K85289j16017j28466N17172P9123j73344L7208J30375J27486
$$ plain form
14437 5527625 5905325 5457593 5805701 5634071 5704928 5743453 5736652 6054277 6013353 5871552
14427 5871552 6149857 6472895 6350827 6597067 6493732 6952432 6819306 6832725 7174890 7158398
14417 7158398 7142221 7510146 7056743 7625019 7264629 7733679 7468743 8027571 7697665 8084807
14407 8084807 8223123 8237320 8438743 8364894 8743478 8683331 8969270 8887988 9083680 9718021
14397 9718021 9350970 9632389 10019362 9851449 10200848 9968796 10466080 10233991 10551931
14388 10551931 10380819 10740147 11187767 11028219 11688196 11672420 11767953 12003219 12309448 12516584
14378 12516584 12750410 12916433 12829813 13224036 13838433 13585369 13827731 14117310 14847479
14369 14847479 14917703 14699197 15466051 15766753 15900357 16283977 16296881 16676398 17229361 17082673
$$ packed form
14437E527625L77700m47732L48108j71630P0857L8525o801L17625m0924j41801
14427E871552K78305L23038j22068K46240j03335M58700j33126J3419L42165j6492
14417G158398j6177L67925m53403N68276l60390M69050k64936N58828l29906L87142
14407H084807J38316J4197K01423p3849L78584o0147K85939q1282J95692O34341
14397I718021l67051K81419L86973j67913L49399k32052M97284k32089L17940
14388A0551931j71112L59328M47620j59548O59977j5776R5533K35266L06229K07136
14378A2516584K33826J66023q6620L94223O14397k53064K42362K89579P30169
14369A4847479P0224k18506P66854L00702J33604L83620J2904L79517N52963j46688
$$ plain form
14359 17082673 17783541 17738936 18409902 18529337 19222089 19568017 19832760 20430357 20803841
14350 20803841 21452258 21607866 22209835 22672683 23253905 23678370 24020450 24933500 25166655
14341 25166655 25907376 26232858 27058445 27656959 28280854 28957550 30138100 30419663 31340726
14332 31340726 32274038 32996266 33573896 34249660 35638206 36515595 37463258 38604514 39732925
14323 39732925 40727117 42394563 43854165 44454378 46008294 47097309 48770509 50530207
14315 50530207 52003880 53640805 55099032 57150804 59228936 60747833 63149860 65405012
14307 65405012 67393247 69960912 72658260 75100723 77924715 80795506 84109826 87447847
14299 87447847 90515955 94474283 97795564 101796492 106250655 110446041 115215230 120442183
$$ packed form
14359A7082673P00868m4605O70966J19435O92752L45928K64743N97597L73484
14350B0803841O48417J55608O01969M62848N81222M24465L42080R13050K33155
14341B5166655P40721L25482Q25587N98514O23895O76696J180550K81563R21063
14332C1340726R33312P22228N77630O75764J388546Q77389R47663J141256J128411
14323C9732925R94192J667446J459602O00213J553916J089015J673200J759698
14315E0530207J473673J636925J458227K051772K078132J518897K402027K255152
14307F5405012J988235K567665K697348K442463K823992K870791L314320L338021
14299H7447847L068108L958328L321281M000928M454163M195386M769189N226953
$$ plain form
14291 120442183 125726569 131303534 136989150 143472894 150087445 157374957 164611593 172578134
14283 172578134 181137479 189868642 199291039 209285983 219290292 230556670 242361377
14276 242361377 254499351 266890511 280167714 293657454 308255948 322896613 337739845
14269 337739845 352152780 365707640 378554982 390788863 402305159 412800908 422427370
14262 422427370 431430354 439239563 446226382 452392723 456014101 458036640 458358954 459695308
14254 459695308 456620144 450236553 443892334 434366580 424724415 415815385 403435219 390626212
14246 390626212 376993208 362919397 348542146 334395097 320821067 307412202 293774395
14239 293774395 280998308 268933380 256995710 244753049 233097535 222539591 212032358
$$ packed form
14291A20442183N284386N576965N685616O483744O614551P287512P236636P966541
14283A72578134Q559345Q731163R422397R994944J0004309J1266378J1804707
14276B42361377J2137974J2391160J3277203J3489740J4598494J4640665J4843232
14269C37739845J4412935J3554860J2847342J2233881J1516296J0495749R626462
14262D22427370R002984P809209O986819O166341L621378K022539L22314J336354
14254D59695308l075164o383591o344219r525754r642165q909030j2380166j2809007
14246C90626212j3633004j4073811j4377251j4147049j3574030j3408865j3637807
14239B93774395j2776087j2064928j1937670j2242661j1655514j0557944j0507233
$$ plain form
14232 212032358 201960130 192208143 182936497 173980158 165161375 157095633 149403431 142188567
14224 142188567 135878936 129783357 123769254 118659668 113537842 108548782 104029580 100023814
14216 100023814 95988257 92137461 88641221 85100847 81953285 78840381 76092059 72933532
14208 72933532 70559171 67743293 65660321 63588526 61438017 59340434 57485909 55576655
14200 55576655 53909824 52536371 50671930 49073456 47802187 46252223 44817866 43687905
14192 43687905 42685992 41373285 40394988 39020916 38024956 37192465 36139221 35357081 34366358
14183 34366358 33526581 32973683 31780671 31034903 30497212 29557223 28940902 27935624 27176522
14174 27176522 26632050 25928624 25558531 25080761 24537777 23464213 23073556 22896179 22218553
$$ packed form
14232B12032358j0072228r751987r271646q956339q818783q065742p692202p214864
14224A42188567o309631o095579o014103n109586n121826m989060m519202m005766
14216A00023814m035557l850796l496240l540374l147562l112904k748322l158527
14208G2933532k374361k815878k082972k071795k150509k097583j854525j909254
14200E5576655j666831j373453j864441j598474j271269j549964j434357j129961
14192D3687905j001913j312707r78297j374072r95960q32491j053244p82140r90723
14183C4366358q39777n52898j193012p45768n37691r39989o16321j005278p59102
14174B7176522n44472p03426l70093m77770n42984j073564l90657j77377o77626
$$ plain form
14165 22218553 22019467 21229128 20664265 20722219 20041069 19871680 19282998 18954258 18622174
14156 18622174 17930555 17492462 17380718 17191509 16585440 16420925 16218244 16029829 15415031
14147 15415031 15394856 15216413 14849047 14461789 14312864 13947854 13842559 13620635 13454445
14138 13454445 13008712 12746544 12925243 12354057 12345045 12307764 11697068 11817404 11715716 11365517
14128 11365517 11481463 11150162 11044170 10598727 10512023 10395498 10091017 9984280 9831658
14119 9831658 9716627 9714104 9361408 9223111 9535991 9539006 9339338 8858410 8899450 8731965
14109 8731965 8714077 8483169 8265705 7758419 8249059 8091531 7931507 7854679 7856158 7302238
14099 7302238 7546248 7545457 7293204 7335165 6792039 7347086 6990792 6649285 6693373 6855349
$$ packed form
14165B2218553j99086p90339n64863N7954o81150j69389n88682l28740l32084
14156A8622174o91619m38093j11744j89209o06069j64515k02681j88415o14798
14147A5415031k0175j78443l67366l87258j48925l65010j05295k21924j66190
14138A3454445m45733k62168J78699n71186r012l7281o10696J20336j01688l50199
14128A1365517J15946l31301j05992m45443q6704j16525l04481j06737j52622
14119I831658j15031k523l52696j38297L12880L015j99668m80928M1040j67485
14109H731965j7888k30908k17464n07286M90640j57528j60024p6828J479n53920
14099G302238K44010p91k52253M1961n43126N55047l56294l41507M4088J61976
$$ plain form
14089 6855349 6781055 6760483 6762432 6246555 6457796 6320906 6306772 6345494 6151935 5962563
14079 5962563 5958933 5816034 5842850 5811495 5743617 5610599 5699251 5275356 5278107 5358605 5111288
14068 5111288 5508040 4956242 5092031 5024788 4927363 4985509 4826558 4826493 4900043 4873663 4956757
14057 4956757 4832430 4345381 4719789 4415544 4470492 4298989 4308491 4327994 4312044 4090390
14047 4090390 4356523 3788295 3975560 4304870 3973156 4246847 3989271 3935285 3940228 4062161
14037 4062161 3986305 3669557 4090500 3859547 3636673 3704520 3602797 3601097 3536619 3278322
14027 3278322 3209651 3669327 3190703 3232147 3369696 3374359 3484471 3322886 3091454 2927260
14017 2927260 3130631 2952938 3215402 2896444 3066501 3291407 3055592 2752871 2891341
$$ packed form
14089F855349p4294k0572J949n15877K11241j36890j4134L8722j93559j89372
14079E962563l630j42899K6816l1355o7878j33018Q8652m23895K751Q0498k47317
14068E111288L96752n51798J35789o7243r7425N8146j58951o5P3550k6380Q3094
14057D956757j24327m87049L74408l04245N4948j71503R502J9503j5950k21654
14047D090390K66133n68228J87265L29310l31714K73691k57576n3986M943J21933
14037D062161p5856l16748M20943k30953k22874O7847j01723j700o4478k58297
14027C278322o8671M59676m78624M1444J37549M663J10112j61585k31432j64194
14017B927260K03371j77693K62464l18958J70057K24906k35815l02721J38470
$$ plain form
14008 2891341 2917735 2660901 2993005 2923860 2977109 3111846 2594044 2805747 2468190 2508590
13998 2508590 2497349 2945354 2172363 2651286 2363206 2685487 2342273 2370321 2402024 2100850
13988 2100850 2472384 2692854 2751307 2303968 2517430 2522653 2768323 2895306 2827773 2928578
13978 2928578 3159531 3566983 4679318 5234828 7162139 10348288 16806347 26558762 30841318
13969 30841318 21438640 14338897 10114034 7625826 6325732 4979138 4137033 4417411
13961 4417411 3465421 3594800 3116765 3255618 3006514 2995833 2928949 2749803 2960943 2762936
13951 2762936 2459513 2730354 2230013 2573255 2702478 2308107 2192146 2448028 2259693
13942 2259693 2222774 2372009 2143574 1839454 1988807 1937188 1977258 2300723 2227615 1901490
$$ packed form
14008B891341K6394k56834L32104o9145N3249J34737n17802K11703l37557M0400
13998B508590j1241M48005p72991M78923k88080L22281l43214K8048L1703l01174
13988B100850L71534K20470N8453m47339K13462N223K45670J26983o7533J00805
13978B928578K30953M07452J112335N55510J927311L186149O458059R752415M282556
13969C0841318r402678p099743m224863k488208j300094j346594q42105K80378
13961D417411r51990J29379m78035J38853k49104j0681o6884j79146K11140j98007
13951B762936l03423K70841n00341L43242J29223l94371j15961K55882j88335
13942B259693l6919J49235k28435l04120J49353n1619M0070L23465p3108l26125
$$ plain form
13932 1901490 1973635 1619944 1806779 2091780 1979656 1521019 1871217 1930854 1889288 1824707
13922 1824707 1825291 1717334 1808431 1663853 1947425 1704437 1536828 1668847 1383681 1742940
13912 1742940 1440808 2029861 1708024 1533933 1762890 1551821 1872594 1497677 1652492
13903 1652492 1454476 1347272 1537370 1241938 1369679 1547769 1757822 1539319 1419967
13894 1419967 1618768 1538729 1379691 1463186 1356589 1326515 1710369 1665561 1540780 1432815
13884 1432815 1555978 1221965 1371016 1219229 982465 1529003 1525665 1233016 1104961 1335147
13874 1335147 1329331 1119851 1054266 1311620 1195398 1399796 1368343 1069001 1040659 1691255
13864 1691255 1084408 1401032 1411211 1045149 1479052 1271662 1144368 1140058 1367600 1181965
$$ packed form
13932A901490P2145l53691J86835K85001j12124m58637L50198N9637m1566o4581
13922A824707N84j07957R1097j44578K83572k42988j67609J32019k85166L59259
13912A742940l02132N89053l21837j74091K28957k11069L20773l74917J54815
13903A652492j98016j07204J90098k95432J27741J78090K10053k18503j19352
13894A419967J98801q0039j59038Q3495j06597l0074L83854m4808j24781j07965
13884A432815J23163l34013J49051j51787k36764N46538l338k92649j28055K30186
13874A335147n816k09480o5585K57354j16222K04398l1453k99342k8342O50596
13864A691255o06847L16624J0179l66062M33903k07390j27294m310K27542j85635
$$ plain form
13854 1181965 1122165 1454786 1063087 1381649 1366963 993214 886016 1266015 1236734 1138429
13844 1138429 987968 1279430 1133011 1304947 1032796 1200145 1153698 1302622 1168779 1051053
13834 1051053 937660 817485 1088433 963539 762715 1068745 953048 1114740 1216614
13825 1216614 939893 989318 859615 773832 1116087 1162082 1248115 937209 887548 763143
13815 763143 929452 900266 1258633 874206 857691 1046847 893789 960433 654728 1029747
13805 1029747 913385 926426 991521 740439 1116882 827713 863087 781044 732373 1052855
13795 1052855 810019 1160566 1072239 870857 627634 687493 826315 1104688 722139 642951
13785 642951 982977 895015 612869 696035 1081148 827185 699570 552986 666926 826699
$$ packed form
13854A181965n9800L32621l91699L18562j4686l73749j07198L79999k9281r8305
13844A138429j50461K91462j46419J71936k72151J67349m6447J48924j33843j17726
13834A051053j13393j20175K70948j24894k00824L06030j15697J61692J01874
13825A216614k76721M9425j29703q5783L42255M5995Q6033l10906m9661j24405
13815G63143J66309k9186L58367l84427j6515J89156j53058O6644l05705L75019
13805A029747j16362J3041O5095k51082L76443k89169L5374q2043m8671L20482
13795A052855k42836L50547q8327k01382k43223N9859J38822K78373l82549p9188
13785F42951L40026q7962k82146Q3166L85113k53963j27615j46584J13940J59773
$$ plain form
13775 826699 981266 882854 876556 488713 688115 797991 752784 872672 933164 1021357 889732
13764 889732 943157 694001 647737 1038075 972683 607371 468937 1032424 777636 489545
13754 489545 806303 538774 800785 579256 957781 580213 693813 523270 874136 812339
13744 812339 608081 781978 871641 882640 917960 620684 629591 689473 843798 470420 833069
13733 833069 438981 481743 557050 675474 692666 357372 672313 565878 532943 874586
13723 874586 748897 762810 696174 693938 455240 921859 538358 700954 609598 624943 616601
13712 616601 522405 306309 691818 550047 573923 662898 765087 686532 947352 382972
13701 644378 487962 757047 537136 546281 669085 310934 618430 619612 275847 97305
$$ packed form
13775H26699J54567r8412o298l87843J99402J09876m5207J19888O0492Q8193j31625
13764H89732N3425k49156m6264L90338o5392l65312j38434N63487k54788k88091
13754D89545L16758k67529K62011k21529L78525l77568J13600j70543L50866o1797
13744H12339k04258J73897Q9663J0999L5320k97276Q907N9882J54325l73378L62649
13733H33069l94088M2762P5307J18424J7192l35294L14941j06435l2935L41643
13723H74586j25689J3913o6636k236k38698M66619l83501J62596r1356J5345q342
13712F16601r4196k16096L85509j41771K3876Q8975J02189p8555K60820C82972
13701F44378j56416K69085k19911R145J22804C10934L07496J182B75847I7305
$$ plain form
13690 998166 490201 721315 763142 586971 368185 211826 763010 530251 582783 179042
13679 770814 503199 372827 627436 725730 586801 496293 277492 899616 611398 571520
13669 571520 654182 699088 380920 566173 283370 770548 581779 748375 555258 422959
13659 422959 331197 464689 636543 344434 646589 400807 689485 425282 381197 614423
13649 614423 400957 643430 277190 372932 550289 386474 452389 386636 540378 198071
13638 664377 680206 598726 344137 564237 375472 288013 497923 652516 514616 482085
13628 482085 211787 347515 430910 195903 415613 359672 650494 542054 397800 591176
13618 591176 205148 114458 614152 425578 239719 324695 524632 570282 419899 383434
$$ packed form
13690I98166D90201K31114M1827j76171k18786j56359N51184k32759N2532A79042
13679G70814k67615j30372K54609R8294j38929r0508k18801O22124k88218l9878
13669E71520Q2662M4906l18168J85253k82803M87178j88769J66596j93117j32299
13659D22959r1762J33492J71854k92109L02155k45782K88678k64203m4085K33226
13649F14423k13466K42473B77190R5742J77357j63815O5915o5753J53742A98071
13638F64377J5829q1480k54589K20100j88765q7459K09910J54593j37900l2531
13628D82085B11787J35728Q3395A95903K19710n5941K90822j08440j44254J93376
13618E91176B05148r0690M99694j88574j85859Q4976J99937M5650j50383l6465
$$ plain form
13608 383434 276709 476835 258872 349836 489033 337753 432304 345190 47354 364898
13598 364898 410437 236832 245075 697021 527158 453850 278068 444033 172258 300496
13588 300496 217499 654486 385643 154511 366004 348057 363096 758246 570081 682269
13578 682269 264414 49579 374796 383496 393552 232762 316461 468048 394909 418508 16578
13566 556444 589232 638913 127937 217346 355893 303529 415615 423751 108609 306605 230336
13555 230336 355317 271247 147309 294051 311800 110722 93239 155768 608818 360726
13545 360726 267685 542408 47980 378080 224446 549548 221819 234486 157512 153778 345420
13534 345420 242489 298830 365724 200409 198578 185500 362863 221645 377361 302963 -7734
$$ packed form
13608C83434j06725K00126k17963R0964J39197j51280R4551q7114D7354L17544
13598C64898M5539j73605Q243M51946j69863p3308j75782J65965A72258J28238
13588C00496q2997M36987k68843A54511K11493j7947J5039L95150j88165J12188
13578F82269B64414D9579L25217Q700J0056j60790Q3699J51587p3139K3599A6578
13566E56444L2788M9681A27937Q9409J38547n2364J12086Q136A08609J97996p6269
13555B30336J24981q4070j23938J46742J7749A10722j7483O2529M53050k48092
13545C60726r3041K74723D7980L30100j53634L25102B21819J2667p6974l734J91642
13534C45420j02931N6341O6894j65315j831j3078J77363j41218J55716p4398g734
$$ plain form
13522 329873 259125 755620 69759 350668 118939 320394 520698 250472 305478 275075
13512 275075 -83533 135912 471602 435117 163543 488558 355518 -6962 604830 335288
13502 335288 284382 200846 74927 682930 -142209 503848 391729 465658 472781 284068 309569
13491 309569 305422 209407 480085 564640 102845 455613 281681 201872 387905 394385 -23112
13479 240204 124182 -183145 136220 251969 533663 408978 509865 -54026 236058 328327
13469 328327 373941 310420 280769 -156736 172849 44091 101247 421109 33041 526662 160814
13457 541528 399561 226473 201109 11174 -125906 120107 450713 228249 9664 225571
13447 225571 316471 348060 456898 -62609 202944 209405 422198 153595 180782 6179 529884
$$ packed form
13522C29873p0748M96495F9759K80909A18939K01455K00304B50472N5006l0403
13512B75075h3533A35912L35690l6485A63543L25015j33040f962F04830k69542
13502C35288n0906q3536G4927O08003a42209E03848j12119P3929P123j88713K5501
13491C09569m147r6015K70678Q4555A02845L52768j73932p9809J86033O480b3112
13479B40204j16022a83145A36220J15749K81694j24685J00887e4026B36058R2269
13469C28327M5614o3521k9651a56736A72849D4091N7156L19862C3041M93621A60814
13457E41528j41967j73088k5364A1174a25906A20107L30606k22464I664K15907
13447B25571R0900L1589J08838f2609B02944O461K12793A53595K7187F179N23705
$$ plain form
13436 529884 513393 408382 442418 138939 363947 513433 -182251 330964 215762 440851
13426 440851 510381 -30400 153955 112909 201695 399047 557714 220225 -186504 214650
13415 78998 290242 86443 112937 92285 117197 354871 221351 117708 281782 359948 -118810
13403 103963 118721 248586 -10514 59511 205011 277914 119206 126174 195678 484832 -32534
13391 185509 450189 5626 407904 384229 108443 308880 114643 45110 378178 96126
13380 382060 99013 7384 -144882 150493 277769 253404 150147 131844 -298717 88322 100735
13369 100735 258453 57605 168151 361205 310911 -92335 -29474 481310 -32964 213701
13358 420663 -107964 187229 377894 75141 264381 186076 10106 78987 212505 346345
$$ packed form
13436E29884j6491j05011L4036A38939K25008J49486a82251C30964j15202K25089
13426D40851O9530c0400A53955m1046Q8786J97352J58667B20225a86504B14650
13415G8998K11244H6443K6494k0652K4912K37674j33520j03643J64074P8166a18810
13403A03963J4758J29865a0514E9511J45500P2903A19206O968O9504K89154c2534
13391A85509K64680E626M02278k3675A08443K00437A14643D5110L33068I6126
13380C82060I9013G384a44882A50493J27276k4365j03257j8303b98717H8322J2413
13369A00735J57718E7605J10546J93054n0294i2335b9474D81310c2964B13701
13358D20663a07964A87229J90665G5141J89240p8305A0106O8881J33518J33840
$$ plain form
13348 346345 45149 146354 245772 -66530 -94356 242625 89664 -2153 -27826 382804 74033
13336 351629 411061 237454 448062 426383 496925 387156 53138 -4383 785292 527575 100211
13324 376997 105563 567662 260159 80156 21653 267562 379160 30749 90091 211844
13314 211844 263577 116191 420743 641046 224328 -141477 -193216 123333 -110027 527135
13303 179894 140105 -140076 235892 198960 137780 169391 97733 305930 -189990 60905 -95514
13291 295869 615169 193922 650031 308577 216944 348862 161259 -18531 201420 -46280
13280 -92881 -5862 354835 144320 250145 198606 -82390 196432 237414 445242 183413 -191281
13268 162615 57866 162520 9746 284409 144254 365508 67367 74068 294852 149662 83141
$$ packed form
13348C46345D5149J01205R9418f6530k7826B42625H9664b153k5673C82804G4033
13336C51629N9432j73607K10608k1679P0542j09769E3138d383G85292k57717A00211
13324C76997A05563M62099B60159H0156B1653K45909J11598C0749N9342J21753
13314B11844N1733A16191L04552K20303B24328a41477n1739A23333a10027E27135
13303A79894l9789a40076B35892l6932o1180L1611p1658K08197a89990F0905i5514
13291B95869L19300A93922M56109C08577r1633J31918A61259a8531B01420d6280
13280i2881e862C54835A44320J05825n1539h2390A96432M0982K07828A83413a91281
13268A62615E7866J04654I746K74663j40155K21254F7367O701K20784j45190o6521
$$ plain form
13257 83141 244977 304446 350988 243352 201200 412974 220339 207011 119772 5297 6954
13246 6954 46498 231457 121339 -23092 341453 125440 252592 -290100 122760 194918
13236 194918 181029 -219285 65900 -232085 272750 -46745 -43582 40537 51373 -40245 227453
13224 266999 97358 79203 177382 -46494 258730 -54500 98823 221573 72645 -65946 288001
13212 515323 34446 -94810 -1807 120419 190599 -11508 281797 221572 -145455 -32452 131374
13200 219120 549799 -84680 91890 268842 215455 106890 -112243 -97728 -388451 257713
13189 228981 4900 118633 -51562 226309 285380 105094 552413 55121 118799 245644 140963
13178 140963 -395272 30494 120060 28484 85305 -88791 121140 184179 -23781 -87622 140851
$$ packed form
13257H3141J61836N9469M6542j07636m2152K11774j92635j3328q7239E297J657
13246F954L9544J84959j10118b3092C41453A25440J27152b90100A22760P2158
13236A94918j3889b19285F5900b32085B72750d6745L163D0537J0836d0245B27453
13224B66999I7358j8155R8179d6494B58730e4500I8823J22750G2645f5946B88001
13212E15323C4446i4810a807A20419P0180a1508B81797o0225a45455c2452A31374
13200B19120L30679h4680I1890J76952n3387A06890a12243J4515k90723B57713
13189B28981D900J13733e1562B26309N9071A05094M47319E5121O3678J26845j04681
13178A40963c95272C0494Q9566B8484N6821h8791A21140O3039b3781o3841A40851
$$ plain form
13166 -38571 239707 198805 146929 349379 61161 -192294 152375 9779 105738 237978 -93184
13154 -70009 64441 194107 34746 -194460 87640 289235 44609 -269898 -193779 72200 90478
13143 90478 142482 -128037 336983 286794 266416 113993 77889 244172 8018 141118 -214755
13131 -235010 -132506 112844 -1946 -160383 -31400 -1624 273185 193604 140478 -176603 251547
13119 213497 -311103 73392 144399 191136 80850 -71610 158346 18861 164173 177019 311434
13108 311434 206241 135594 84287 -174776 128320 257344 25704 347100 157064 262904
13098 262904 167394 183224 230163 -11554 -163506 -93694 -127340 -132472 165931 -44435 378404
13086 182854 -138146 220358 19752 -44252 24726 -152209 -138098 12194 189901 242224 -19444
$$ packed form
13166c8571B39707m0902n1876K02450F1161a92294A52375I779R5959J32240i3184
13154g0009F4441J29666C4746a94460H7640K01595D4609b69898P6119G2200J8278
13143I0478N2004a28037C36983n0189k0378A13993l6104J66283H018J33100b14755
13131b35010J02504A12844a946j58437c1400a624B73185p9581n3126a76603B51547
13119B13497c11103G3392P1007M6737H0850g1610A58346A8861J45312J2846J34415
13108C11434j05193p0647n1307a74776A28320J29024B5704L21396A57064J05840
13098B62904r5510J5830M6939a1554j51952O9812l3646n132A65931d4435C78404
13086A82854a38146B20358A9752d4252B4726a52209J4111A2194J77707N2323a9444
$$ plain form
13074 -363052 285608 -160052 152620 47951 355508 18063 198177 -29815 -28467 -307970
13064 -307970 -70350 206760 199560 40998 5671 -6370 243125 -78344 286575 -51728 410999
13052 198394 -49863 105444 104825 301629 234384 -83461 288696 188973 151080 98348 11446
13040 146730 -99172 -137772 -132114 9019 -101290 320458 32550 218181 357306 161545 -96110
13028 37120 173870 -56442 -44737 154772 137886 91260 -109016 372170 214191 175851 218908
13017 218908 -6602 299640 -21909 40367 -216664 112741 289566 262207 196062 70581 233634
13006 233634 -57723 128388 561658 145277 186731 295928 -80328 -62803 47835 202136
12996 202136 -132330 -36922 180041 -133989 223117 419876 264169 70739 425366 -233936
$$ packed form
13074c63052B85608a60052A52620D7951L07557A8063J80114b9815J348k79503
13064c07970g0350B06760p200D0998E671f370B43125g8344B86575e1728D10999
13052A98394d9863A05444o19J96804o7245h3461B88696r9723l7893n2732A1446
13040A46730i9172l8600N658I019a01290C20458C2550J85631J39125A61545i6110
13028C7120J36750e6442J1705A54772j6886m6626a09016C72170j57979l8340M3057
13017B18908f602B99640b1909D0367b16664A12741J76825k7359o6145G0581J63053
13006B33634e7723A28388M33270A45277M1454J09197h0328J7525D7835J54301
12996B02136a32330c6922A80041a33989B23117J96759j55707G0739L54627b33936
$$ plain form
12985 276088 140495 194397 148841 -77881 408054 -43275 -16380 61878 -82334 81676 194050
12974 194050 436455 160844 -79779 112614 -2516 -273447 42679 -45820 308792 14846 -78971
12962 -71424 -31616 164933 207690 287945 98833 -194138 150110 -206303 133232 127276 174744
12951 174744 37748 -72461 -79951 -15634 -161934 27323 100268 149110 -174090 325105 -135174
12939 91763 101939 201902 -202264 176344 44402 -189884 -146609 -118436 -126973 148135 7566
12927 115756 211476 112985 180796 313947 -114948 38271 -127883 61143 200309 274859 -26208
12915 -185414 117155 178647 -144599 29033 338921 -20404 71990 15772 -105266 -33353 -11289
12903 204839 -153976 353646 168892 -122748 -324017 111944 -30598 -141447 -104771 10850
$$ packed form
12985B76088j35593N3902m5556g7881D08054d3275a6380F1878h2334H1676J12374
12974A94050K42405A60844g9779A12614b516k70931D2679d5820C08792A4846g8971
12962g1424c1616A64933M2757Q0255I8833a94138A50110b06303A33232n956M7468
12951A74744C7748g2461p490a5634j46300B7323P2945M8842a74090C25105a35174
12939I1763J0176R9963b02264A76344D4402a89884M3275K8173q537A48135G566
12927A15756R5720r8491O7811J33151a14948C8271a27883F1143J39166P4550b6208
12915a85414A17155O1492a44599B9033L09888b0404G1990A5772a05266c3353a1289
12903B04839a53976C53646A68892a22748k01269A11944c0598j10849L6676A0850
$$ plain form
12892 -48067 258120 228908 9987 216179 -102650 284376 262329 -49729 -8376 -333954 410356
12880 18141 327919 217321 115002 316699 113879 -304027 21295 219508 106992 104351
12870 104351 -142133 148205 124028 14823 -54424 187546 202904 -166657 136942 91532
12860 91532 -161911 199640 -130963 -67139 -7048 295701 -72522 265088 -166318 290755
12849 121272 178520 45412 47935 183695 -12308 154702 -157343 27831 -123909 -275830 -186919
12838 -186919 323634 -202643 308272 65328 196216 126694 73382 -46041 107270 75159
12828 75159 217213 -266437 82128 26099 -290578 100994 -31533 119311 53432 -257502
12817 -1156 -192832 -234641 -17229 -161928 -194379 15675 74127 3984 72801 -18070 217625
$$ packed form
12892d8067B58120k9212I987K06192a02650B84376k2047d9729h376l25578D10356
12880A8141L09778j10598j02319K01697A13879c04027B1295J98213A06992k641
12870A04351a42133A48205k4177A4823e4424A87546J5358a66657A36942m5410
12860I1532a61911A99640a30963O3824g048B95701g2522B65088a66318B90755
12849A21272N7248D5412K523J35760a2308A54702a57343B7831a23909j51921Q8911
12838a86919C23634b02643C08272F5328J30888o9522n3312d6041A07270l2111
12828G5159J42054b66437H2128B6099b90578A00994c1533A19311E3432b57502
12817a156j91676m1809a7229j44699l2451A5675N8452C984O8817a8070B17625
$$ plain form
12805 -41982 42008 34509 124183 -18097 -462382 22407 -17134 152051 111718 232290 103143
12793 109235 -186343 -110772 226673 -80921 199273 32340 24540 -108088 100392 33997 -20053
12781 86164 185321 280108 13177 -135518 214893 154432 233282 -275249 -46604 171358 125452
12770 125452 12187 -40524 55253 124287 -76851 -167779 163679 -202299 -119641 256137 -110608
12758 153484 -287886 163720 59126 119021 -245966 9915 -5853 5591 3321 259549 -7319 -83418
12746 -83418 -4494 -59623 210925 -299247 -170220 -62910 159230 -45967 -32066 -190354 -7455
12734 75279 166590 194489 104813 -151034 12847 -30845 -140601 79463 177437 39808 300069
12723 300069 335663 112235 -44782 -31712 -199572 287312 -194302 18069 270102 -31875
$$ packed form
12805d1982D2008p499Q9674a8097m44285B2407a7134A52051m0333J20572A03143
12793A09235a86343P5571B26673h0921A99273C2340p800a08088A00392C3997b0053
12781H6164R9157R4787A3177a35518B14893o0461P8850b75249d6604A71358m5906
12770A25452A2187d0524E5253O9034g6851r0928A63679b02299Q2658B56137a10608
12758A53484b87886A63720E9126N9895b45966I915e853E591k270K56228g319p6099
12746h3418d494n5129B10925b99247J29027f2910A59230d5967J3901j58288g455
12734G5279R1311K7899q9676a51034A2847c0845j09756G9463R7974C9808K60261
12723C00069L5594A12235d4782J3070j67860B87312a94302A8069K52033c1875
$$ plain form
12712 -321361 -42727 -7224 164509 -184216 -16074 186161 -66447 -128350 -11554 14748 34480
12701 34480 -109473 -39900 337271 39810 3234 17638 -105967 370631 -64914 148477 -82183
12689 138878 519003 201926 52647 -251336 209952 -6544 269926 199112 -78000 21054 -65514
12677 102461 29701 -53748 186520 232204 -170057 106050 -117530 -286132 -129585 122114
12666 -2973 -9980 -193846 440 136200 51105 -50813 202936 -88622 83447 119466 195507 113941
12654 113941 106245 112590 177923 102440 225304 215807 -32954 -110880 21152 25864 143839 -197101
12641 181333 244515 429930 -170387 363976 4795 251237 85840 -47210 232359 3195 52065
12630 52065 366778 271680 -246 179194 104830 149726 257792 -154450 233906 165041 119261
$$ packed form
12712c21361d2727g224A64509a84216a6074A86161f6447o1903a1554A4748J9732
12701C4480a09473c9900C37271C9810C234J4404a05967C70631f4914A48477h2183
12689A38878L80125B01926E2647b51336B09952f544B69926p0814g8000B1054f5514
12677A02461B9701e3748A86520M5684a70057A06050a17530j68602a29585A22114
12666b973p007j83866D40J35760E1105e0813B02936h8622H3447L6019P6041q1566
12654A13941p696O345O5333p5483J22864r497c2954p7926B1152M712J17975a97101
12641A81333O3182J85415a70387C63976D795K46442H5840d7210B32359C195M8870
12630E2065L14713r5098b46A79194p4364M4896J08066a54450B33906o8865m5780
$$ plain form
12619 119261 285683 119074 -18281 -237833 558198 164100 343032 316726 143490 -4772
12608 263315 162121 86747 230304 152113 197107 549584 255154 231959 -27374 -112991 -175783
12597 -175783 127073 452225 132318 -168514 -6527 80014 37393 41673 6452 224981 246937
12586 246937 445999 301151 190248 228759 122636 6516 68001 191689 -170187 -178281 74280
12574 -206121 198289 -55038 -137642 -4652 27608 44907 -15840 -252297 -45296 19139 -229156
12562 212374 -44804 27914 33028 292057 -241900 257147 79688 -195710 166211 -213468
12551 -266312 179289 19323 124919 -208970 18204 -100163 213474 179088 -338354 105982
12540 217558 -27235 358015 -79500 233135 -192804 264573 304003 4430 -84962 58867 -14120
$$ packed form
12619A19261J66422A19074a8281k19552E58198A64100J78932k6306A43490d772
12608B63315j01194p5374J43557p8191M4994L52477B55154k3195b7374q5617o2792
12597a75783A27073L25152A32318a68514f527H0014C7393M280F452K18529K1956
12586B46937J99062j44848j10903L8511j06123F516O1485J23688a70187q094G4280
12574b06121A98289e5038q2604d652B7608J7299a5840k36457d5296A9139b29156
12562B12374d4804B7914N114K59029b41900B57147G9688a95710A66211b13468
12551b66312A79289A9323J05596b08970A8204a00163B13474l4386c38354A05982
12540B17558b7235C58015g9500B33135a92804B64573L9430D430h4962E8867a4120
$$ plain form
12528 -194007 176567 121401 -44597 -95703 -23805 89157 240524 -92682 17530 -104317 388628
12516 22218 246234 286979 -110476 398667 -58633 -17067 66612 276848 -222707 -55563 228517
12504 -144426 -389508 133935 99391 75009 -44132 -40521 -69720 -26186 -161978 -240156 187491
12492 -85969 34548 315907 126800 44456 -85570 -188635 23789 -103260 183592 253890 170246
12481 170246 144812 114704 126062 12762 -52096 -150993 -41171 24878 -156547 214388 164318
12470 164318 -21534 -132671 256365 -126546 187144 236771 -40660 -291262 -12649 -160869
12460 -160869 -75173 -85175 224156 50818 -188867 -144980 185804 164162 -29970 32490 163511
12449 163511 176960 -407577 132914 113159 68681 25228 163396 -61117 -184856 -176888 417378
$$ packed form
12528a94007A76567n5166d4597n1106b3805H9157J51367i2682A7530a04317C88628
12516B2218K24016M0745a10476C98667e8633a7067F6612K10236b22707e5563B28517
12504a44426k45082A33935l4544k4382d4132L611k9199b6186j35792p8178A87491
12492h5969C4548K81359A26800D4456h5570j03065B3789a03260A83592P0298q3644
12481A70246k5434l0108J1358A2762e2096r8897d1171B4878a56547B14388n0070
12470A64318b1534j11137B56365a26546A87144M9627d0660k50602a2649j48220
12460a60869g5173j0002B24156E0818a88867M3887A85804k1642b9970C2490J31021
12449A63511J3449d07577A32914j9755m4478B5228J38168f1117j23739P968D17378
$$ plain form
12437 -99056 321881 311394 189476 230963 111963 102227 43594 114728 -44813 -108587 1062
12425 -135302 22887 -90351 -82610 -37248 -147007 -123476 255338 210243 160226 -253725 -133896
12414 -133896 -107998 -261070 123872 -396153 -7939 -255713 87329 254998 -114935 95716
12403 -136890 183672 89152 34344 283720 -105680 -10824 -111720 -92852 -217345 141669
12392 71815 -16350 -129906 -101823 -43991 -270354 -33013 79608 66672 -68079 260425 444568
12381 444568 -124243 -9210 4049 130924 -300384 115088 -13915 -105471 178290 3422 7118
12370 7118 293521 -130084 -89549 300397 98777 86598 258382 42316 355397 -49683 15783
12358 211256 -15260 -40615 -24452 -262398 124618 -185099 -21560 -61932 42832 224889 -111740
$$ packed form
12437i9056C21881j0487j21918M1487A11963r736D3594P1134d4813o3774A062
12425a35302B2887i0351P741c7248j09759K3531B55338m5095n0017b53725J19829
12414a33896K5898j53072A23872c96153g939k47774H7329J67669a14935I5716
12403a36890A83672H9152C4344K49376a05680a0824j00896J8868j24493A41669
12392G1815a6350j13556K8083d3991k26363c3013G9608j2936f8079B60425J84143
12381D44568a24243i210D049J26875c00384A15088a3915r1556A78290C422L696
12370G118K86403a30084M0535C00397I8777j2179J71784D2316L13081d9683A5783
12358B11256a5260k5355J6163k37946A24618a85099b1560m0372D2832J82057a11740
$$ plain form
12346 -60245 -59346 65216 76902 -69382 -113969 -125007 324822 270961 -194615 -139062 -252377
12335 -252377 -250148 101812 -239131 147617 -95301 44505 -258434 -349465 191112 -588 -74096
12324 -74096 -124204 185917 89242 -155762 -138098 -229261 -328042 -218410 -363428 37825 83425
12313 83425 126224 341886 276950 18863 -66608 -22915 338706 98019 190443 149218 -104023
12301 -76176 -90571 -35150 -41471 -108024 -31165 -213740 219547 9559 -31603 153924 -258564
12289 -199297 336862 219399 105544 -178008 -64323 108075 14367 14595 -283973 33603 -150449
12277 -172970 -323195 226880 -18188 22261 -93415 -197459 100256 -137513 63669 462401
12267 462401 -95839 284778 -59889 -147355 -156266 -105080 27430 -159607 -216536 -95223 80341
$$ packed form
12346f0245Q99F5216J1686f9382m4587j1038C24822n3861a94615N5553j13315
12335b52377K229A01812b39131A47617i5301D4505b58434r1031A91112e88p3508
12324g4096n0108A85917H9242a55762J7664r1163r8781J09632j45018C7825M5600
12313H3425M2799K15662o4936A8863f6608b2915C38706I8019R2424m1225a04023
12301g6176j4395c5150o321o6553c1165j82575B19547I559c1603A53924b58564
12289a99297C36862j17463A05544a78008f4323A08075A4367K28b83973C3603a50449
12277a72970j50225B26880a8188B2261i3415j04044A00256a37513F3669L98732
12267D62401i5839B84778e9889q7466q911N1186B7430a59607n6929i5223H0341
$$ plain form
12255 21995 53968 217820 186139 110235 -73771 41554 58834 -38849 141309 443531 2270
12243 33194 -138711 16147 35261 176558 63290 334348 303597 243871 76700 -172245 -129186
12232 -129186 260124 302003 22287 359173 208217 283423 81107 234274 223105 66224 73915
12221 73915 327293 -267296 123546 220649 169645 162633 -5257 74385 -182777 6033 73645
12210 73645 247830 186264 495187 20821 262253 279604 329118 324245 156243 267175 407816
12199 407816 198043 381561 149627 -35481 355413 -103853 -147077 57122 87809 201416
12189 201416 204016 253849 62846 113983 451041 149530 414265 189332 156871 124037 580096
12178 580096 398267 188641 293647 102028 201636 252925 313879 -176796 69214 284145
$$ packed form
12255B1995L1973J63852l1681p5904g3771D1554J7280c8849A41309L02222B270
12243C3194a38711A6147J9114J41297F3290K71058l0751n9726G6700a72245M3059
12232a29186B60124M1879B2287L36886j50956P5206H1107J53167j1169F6224P691
12221G3915K53378b67296A23546R7103n1004p012e257G4385a82777F033O7612
12210G3645J74185o1566L08923B0821K41432J7351M9514m873A56243J10932J40641
12199D07816A98043J83518A49627c5481C55413a03853m3224E7122L0687J13607
12189B01416K600M9833F2846N1137L37058A49530K64735A89332l2461l2834M56059
12178E80096j81829A88641J05006A02028R9608N1289O0954a76796F9214K14931
$$ plain form
12168 284145 63881 297997 175388 294392 265098 -111341 242097 -152198 -109762 152204
12157 105394 287574 -5318 -139054 -273014 -32985 -202429 195438 218994 251509 -413274
12146 289243 170642 219788 275591 106262 -155241 26187 317172 -112469 7819 -42825 197746
12134 93257 233791 -100831 -138471 124538 64673 111983 52506 111510 338824 70855 -328817
12122 174882 -258860 303468 196591 12410 -208570 -122688 -118242 -43564 151028 182159 301829
12111 301829 43287 -383072 -297356 -113727 150762 82666 23153 342425 -282308 72313
12100 -487552 -113023 1041 200227 325910 101039 28798 205250 -102525 -95414 340377
12089 75425 -170162 102361 199612 95214 7666 316048 424559 225414 74461 -135276 -178537
$$ packed form
12168B84145F3881K34116j22609J19004k9294a11341B42097a52198M2436A52204
12157A05394J82180e318j33736j33960c2985j69444A95438K3556L2515d13274
12146B89243j18601M9146N5803A06262a55241B6187K90985a12469G819d2825A97746
12134I3257J40534a00831l7640A24538n9865M7310E2506N9004K27314G0855c28817
12122A74882b58860C03468j06877A2410b08570Q5882M446d3564A51028L1131J19670
12111C01829D3287c83072Q5716a13727A50762o8096B3153L19272b82308G2313
12100d87552a13023A041J99186J25683A01039B8798J76452a02525P111C40377
12089G5425a70162A02361R7251I5214G666L08382J08511j99145G4461a35276m3261
$$ plain form
12078 -178537 265072 156885 126482 226204 72740 -150547 23665 8899 -68269 -203884 -113910
12067 -113910 17735 -8821 -89697 -31626 -240192 244858 319191 -31345 415376 647723 878928
12056 878928 659864 212982 249360 97742 93880 82438 -11549 110134 -81998 193240 246776
12045 246776 127935 -265043 38773 -108272 211724 -52467 24160 88164 19836 19643 40375
12034 40375 -79410 1689 116688 -89243 210258 -134521 81766 -191015 -78647 -154483 -183312
12023 -183312 105313 -80609 -153248 142860 -271508 -250480 -133422 -142792 -80266 -111222 298504
12011 320286 17897 175182 -72645 -315290 -72739 -311120 310043 -45041 51740 -2723 -96948
12000 -96948 127872 -18933 48847 -114934 141979 9370 66384 164919 -176942 232666 37691
$$ packed form
12078a78537B65072j08187l0403R9722G2740a50547B3665H899f8269j35615Q9974
12067a13910A7735h821q0876c1626k08566B44858P4333c1345D15376K32347K31205
12056H78928k19064B12982L6378I7742l862j1442a1549A10134h1998A93240N3536
12045B46776j18841b65043C8773a08272B11724e2467B4160O4004A9836j93K0732
12034D0375g9410A689J14999h9243B10258a34521H1766a91015g8647p5836k8829
12023a83312A05313h0609p2639A42860b71508K1028J17058r370O2526l0956B98504
12011C20286A7897J57285g2645k42645g2739k38381C10043d5041E1740b723r4225
12000i6948A27872a8933D8847a14934A41979I370N7014R8535a76942B32666C7691
$$ plain form
11988 -93848 36177 94713 -239561 76819 131520 56901 40481 -333126 223170 -20949 -166178
11977 -166178 -17406 -400808 343295 -149420 -221719 149715 -235447 188133 181141 -148029
11966 -200545 -263635 25932 -46188 -466236 300931 -321240 -223278 -98061 -67867 375106 120026
11954 186005 133220 -184063 -60611 28984 -86106 -212689 -77313 82698 57125 -218383 -330456
11943 -330456 -395014 -172613 -144907 51100 12777 115886 -154161 52969 49197 108348 -277627
11931 -267111 -97417 228806 -238143 92168 -152430 179265 143155 61865 -261384 270797
11920 -64360 177714 -327596 -89732 -412267 245660 75868 180043 -19773 24938 -162753
11909 393542 114354 -182312 -44332 -55828 141732 121073 169307 115768 552 -87303 27361
$$ packed form
11988i3848C6177N8536b39561G6819N4701E6901j6420c33126B23170b0949j45229
11977a66178a7406l83402C43295a49420p2299A49715b35447A88133o992a48029
11966b00545o3090B5932d6188m20048C00931c21240R7962i8061L0194C75106A20026
11954A86005n2785a84063f0611B8984h6106j26583g7313H2698k5573b18383j12073
11943c30456o4558a72613K7706E1100A2777J03109a54161E2969l772N9151b77627
11931b67111i7417B28806b38143I2168a52430A79265l6110F1865b61384B70797
11920f4360A77714c27596h9732l22535B45660G5868J04175a9773B4938a62753
11909C93542A14354a82312d4332j1496A41732k0659M8234n3539E52h7303B7361
$$ plain form
11897 -130205 84131 -197918 258796 31588 41021 -162857 308699 6520 26576 -272133 326185
11885 -272879 400909 16762 -53833 14082 -195052 -38873 -266631 -25810 7919 -15741 -321290
11874 -321290 -2408 81737 278127 -348943 164840 -282099 273790 116993 -104514 -73694
11864 -73694 30412 -102615 -72876 -263153 -136948 -131663 105131 5771 57682 -44572 -24743
11853 -24743 3518 -167057 86538 65077 -16049 -317962 -10534 -142425 -198465 3478 -60939
11841 -35813 135138 -241835 -245843 67976 -294923 45076 -101093 -153733 -161181 -26836 -95593
11830 -95593 -321658 -159850 -30120 102481 -42622 -293740 -4695 149696 118863 -55261 122448
11818 -9587 -287027 145397 -69264 39746 -167007 137539 261799 -343346 -4450 -27255 65633
$$ packed form
11897a30205H4131a97918B58796C1588R433a62857C08699F520K0056b72133C26185
11885b72879D00909A6762e3833A4082a95052c8873k27758b5810G919a5741l05549
11874c21290b408H1737J96390c48943A64840b82099B73790A16993a04514L0820
11864g3694C0412a02615K9739j90277J26205N285A05131E771N1911d4572J9829
11853b4743C518a67057H6538k1461a6049l01913a0534j31891n6040C478f0939
11841c5813A35138b41835m008F7976b94923D5076a01093n2640p448b6836o8757
11830i5593k26065a59850c0120A02481d2622k51118d695A49696l0833e5261A22448
11818i587k77440A45397f9264C9746a67007A37539J24260c43346d450k2805F5633
$$ plain form
11806 -131346 7106 -212800 -90094 4058 18548 -177263 -294366 12987 -172382 -177505 -95035
11795 -95035 105253 76906 160488 34172 44318 209410 -293104 68429 -146208 -24776 -44141
11784 -44141 -78396 -52485 -264434 283779 189288 -120229 -261766 96498 -78599 -221008 105238
11772 22958 145681 -20940 -72716 -9541 213719 197350 -17219 23147 -122693 23659 -13811
11760 -293185 161065 -37154 176069 155913 -127882 -182160 172160 -196847 170566 -156915
11749 40835 6900 23553 97265 235805 -107473 -3024 -211164 -12753 -288240 64633 39582
11738 39582 32682 -286279 212729 8230 -67590 -104070 -122734 78756 191483 -212769 -179035
11727 -179035 107038 -30996 198732 -31115 -103712 194894 65826 108111 186721 235875 -163946
$$ packed form
11806a31346G106b12800i0094D058J4490a77263j17103A2987a72382n123Q2470
11795i5035A05253k8347Q3582C4172J0146J65092b93104F8429a46208b4776j9365
11784d4141l4255K5911k11949B83779r4491a20229j41537I6498g8599j42409A05238
11772B2958J22723b0940n1776i541B13719j6369a7219B3147a22693B3659a3811
11760b93185A61065c7154A76069k0156a27882n4278A72160a96847A70566a56915
11749D0835F900J6653P3712J38540a07473c024k08140a2753k75487F4633k5051
11738C9582o900b86279B12729H230f7590l6480j8664G8756J12727b12769L3734
11727a79035A07038c0996A98732c1115p2597A94894F5826M2285P8610M9154a63946
$$ plain form
11715 253262 42973 -14811 -81665 108212 -271403 144383 -3892 -235033 -92545 -137076 -63159
11703 158785 -163760 -198890 -56657 14828 250607 -22717 63393 134142 159090 216048 153496
11692 153496 22689 35373 -65726 175395 -13971 -123115 -279526 188059 -4374 -6376 -314380
11681 -314380 -225940 231283 216851 49137 223831 -228331 62692 -157520 299573 -444185
11670 101304 -222416 -58332 46226 -82626 -93121 94084 -57477 190626 -168777 43635 -235047
11658 60065 -334369 58715 -140831 -23873 -23248 -183516 138348 232367 -176789 -92360 34995
11646 -179111 -219573 -178141 250138 36457 374874 42088 -141570 -100348 186373 161934 -216343
11634 113554 -23514 118377 208264 -245730 -110435 204768 -48015 -187365 -262087 240552
$$ packed form
11715B53262D2973a4811o6854A08212b71403A44383c892k31141i2545m4531f3159
11703A58785a63760l5130e6657A4828K35779b2717F3393P0749K4948N6958o2552
11692A53496B2689J2684f5726A75395a3971j09144j56411A88059d374k002l08004
11681c14380Q8440B31283j4432D9137J74694b28331F2692a57520B99573d44185
11670A01304b22416e8332D6226h2626j0495I4084e7477A90626a68777D3635b35047
11658F0065c34369E8715a40831b3873O25j60268A38348R4019a76789Q4429C4995
11646a79111m0462M1432B50138C6457L38417D2088a41570M1222A86373k4439b16343
11634A13554b3514A18377Q9887b45730a10435B04768d8015j39350p4722B40552
$$ plain form
11623 -29188 -146609 161377 1824 -43478 -278648 -192273 89183 -310700 312064 -29504 41199
11611 136172 61098 -4824 243848 -33504 272534 -268314 266216 251488 -100284 136703
11600 -193375 44570 -56865 112048 -124124 15904 -37109 -38512 -8815 157970 -79991 110273
11588 -175256 -102931 85136 -177941 -204519 -151992 101527 -67569 175646 -47154 -535859 41560
11576 -186931 185894 109827 119062 62149 -522000 175268 225379 186568 403111 58098 47835
11565 47835 133552 136018 81343 -46632 120483 -23217 -109775 124461 251092 297727 293848
11554 293848 -119090 -141619 -51218 -45015 164747 68934 -288820 393758 210597 -29943 197809
11542 80390 304741 190806 -63321 220871 35272 251516 -188037 60492 309209 -199551
$$ packed form
11623b9188j17421A61377A824d3478k35170Q6375H9183c10700C12064b9504D1199
11611A36172F1098d824B43848c3504B72534b68314B66216j4728a00284A36703
11600a93375D4570e6865A12048a24124A5904c7109j403h815A57970g9991A10273
11588a75256P2325H5136a77941k6578N2527A01527f7569A75646d7154m88705D1560
11576a86931A85894p6067R235n6913e22000A75268N0111l8811K16543E8098j0263
11565D7835Q5717K466n4675d6632A20483b3217q6558A24461J26631M6635l879
11554B93848a19090k2529e1218O203A64747F8934b88820C93758j83161b9943A97809
11542H0390K24351j13935f3321B20871C5272K16244a88037F0492K48717a99551
$$ plain form
11531 40504 -18142 -216886 138284 50535 -110186 187052 -86073 78875 -353528 100951
11520 -393226 127686 393198 238740 159711 -165592 50744 -190 170055 241581 21041 -28256
11508 -303331 150646 304416 65584 282286 184937 78810 92455 -171847 141220 122737
11498 122737 231517 295089 147935 270702 108405 -96033 269850 253954 -160089 100481
11487 129906 -62622 159125 21764 231413 235827 57648 10221 83131 165561 236382 331297
11476 331297 249985 221064 -94485 150639 44350 125143 83607 243575 286468 62973 302412
11465 302412 246008 -163971 -60475 22806 148505 205370 25041 56738 -26032 161098 58997
11453 85499 280861 -43031 299982 318613 -406071 287089 87259 148065 145094 138892 268186
$$ packed form
11531D0504a8142j98744A38284E0535a10186A87052h6073G8875c53528A00951
11520c93226A27686K65512j54458p9029a65592E0744a90A70055P1526B1041b8256
11508c03331A50646J53770F5584K16702r7349G8810J3645a71847A41220j8483
11498A22737J08780O3572j47154J22767A08405i6033B69850j5896a60089A00481
11487A29906f2622A59125B1764K09649M414E7648A0221P2910Q2430P0821R4915
11476C31297q1312k8921i4485A50639D4350Q0793m1536J59968M2893F2973K39439
11465C02412n6404a63971f0475B2806J25699N6865B5041L1697b6032A61098E8997
11453H5499J95362d3031B99982J8631d06071B87089H7259O0806k971o202J29294
$$ plain form
11442 268186 129326 137080 -79256 416179 42380 84923 84605 39276 7287 54591 181615 241953
11430 241953 241702 45389 -30435 79955 213793 -89464 186784 -24561 274305 -44784 138464
11418 128859 -61934 151393 198977 -242867 30762 198703 -114554 230695 121225 54394
11407 264556 -215222 -10142 80720 -98223 67408 80990 -109350 -219533 -4929 -358523 -49738
11395 -131965 -353106 -203834 330945 -10384 -280847 89629 -89495 58325 80142 -32506 138948
11383 5049 124237 188482 230058 155099 -130346 -264312 134327 183277 73223 -20007 -190799
11372 -190799 -1025 71354 -133282 -219383 125454 110067 -159648 29653 -202907 -41493 -120437
11361 -120437 -349682 107546 386303 151896 69619 -110489 -13800 161492 198088 -30035
$$ packed form
11442B68186A29326P754g9256D16179D2380M2543l18C9276G287M7304J27024O0338
11430B41953k51D5389c0435G9955J33838h9464A86784b4561B74305d4784A38464
11418A28859f1934A51393M7584b42867C0762J67941a14554B30695j09470E4394
11407B64556b15222a0142H0720i8223F7408J3582a09350j10183d929l53594d9738
11395a31965k21141J49272C30945a0384k70463H9629h9495E8325K1817c2506A38948
11383E049J19188O4245M1576p4959a30346j33966A34327M8950G3223b0007j70792
11372a90799a025G1354a33282q6101A25454j5387a59648B9653b02907d1493p8944
11361a20437k29245A07546K78757A51896F9619a10489a3800A61492L6596c0035
$$ plain form
11350 -176844 311589 79845 -182852 238372 105666 -97280 58114 3653 92018 -128161 -257108
11339 -257108 204106 -52672 92001 -94956 -198698 127740 -180996 -223984 -172992 -4663 92618
11327 -378462 -165613 191267 65348 -13069 -152316 -54742 186564 -338727 58711 -49491
11316 271502 -51943 -290100 5984 177078 -213310 24672 -143928 29194 -137617 -216809 -213093
11305 -213093 280223 -215923 258227 364593 -61460 99724 249916 -49853 390198 -147692
11294 -297883 111707 -159993 125992 5253 -87188 -225446 -272516 -223920 19465 -280173 11187
11282 -276549 -214501 -253152 -252679 -237475 158012 55570 234561 -192171 -2633 151948 334890
11271 334890 2778 -285132 -29379 -136798 -188042 -60200 91773 -62943 112296 -178931 14288
$$ packed form
11350a76844C11589G9845a82852B38372A05666i7280E8114C653Q8365a28161j28947
11339b57108B04106e2672I2001i4956j03742A27740a80996m2988N0992d663I2618
11327c78462a65613A91267F5348a3069j39247e4742A86564c38727E8711d9491
11316B71502e1943k38157E984J71094b13310B4672a43928B9194a37617p9192L716
11305b13093B80223b15923B58227J06366f1460I9724J50192d9853C90198a47692
11294b97883A11707a59993A25992E253h7188j38258m7070M8596A9465b80173A1187
11282b76549O2048l8651M73J5204A58012E5570J78991a92171b633A51948J82942
11271C34890B778b85132b9379j07419n1244f0200I1773f2943A12296a78931A4288
$$ plain form
11259 8879 78418 107050 -130633 -95680 -252810 114034 -167363 -219122 -66910 25830 -148351
11247 -52945 56377 65155 1940 205670 95636 -22471 121230 -278181 -137613 -308723 -127633
11235 -8757 -25703 148274 -67595 -173575 220104 108456 85284 -14942 -168865 -50444 109413
11223 -12972 99668 -270535 -140670 86768 58996 13227 -158984 151684 -168603 -68993 3698
11211 416258 -176466 -78419 -257722 207218 -146127 178488 -244979 112956 117215 -330324
11200 14066 150961 -42699 -210756 -160850 -162251 28084 -147162 46805 -62574 -300392 13349
11188 -49505 106924 11061 227474 208432 99744 97386 -243642 -10871 -188810 -35565 -111609
11177 -111609 -86557 59232 -222746 -200762 -40987 -181064 -41558 19856 -313469 -145336 75501
$$ packed form
11259H879O9539K8632a30633L4953j57130A14034a67363n1759f6910B5830a48351
11247e2945E6377Q778A940K03730I5636b2471A21230b78181a37613j71110a27633
11235h757j6946A48274f7595j05980B20104A08456k3172a4942j53923e0444A09413
11223a2972I9668b70535J29865H6768k7772A3227a58984A51684a68603f8993C698
11211D16258a76466g8419j79303B07218a46127A78488b44979A12956M259c30324
11200A4066J36895d2699j68057M9906j401B8084a47162D6805f2574k37818A3349
11188d9505A06924A1061K16413j9042I9744k358b43642a0871j77939c5565p6044
11177a11609K5052E9232b22746K1984d0987j40077d1558A9856c13469a45336G5501
$$ plain form
11165 74682 -322718 -147704 -364472 -333096 49679 -362363 265488 -3216 150927 150915 56195
11153 81430 239261 -83857 35211 130937 13272 305159 -219249 -275420 -88378 -274956 23154
11141 34164 95639 147716 13690 -184425 -226201 79503 -277206 96283 300695 188580 -109509
11129 -93012 -83850 -190478 -11807 -275063 -108781 -75691 51459 147689 -140129 31781 225455
11118 225455 224719 -130277 -146734 95642 30062 81446 -203666 -99689 409416 -184362 144878
11106 -166473 117663 -61164 372357 151048 226175 -83757 53681 114016 -77849 105702 55736
11095 55736 41496 -65751 319755 271361 202030 64866 -51656 386478 249605 206467 361659
11084 361659 57695 276009 361738 415996 215584 239320 43142 265427 135541 302193
$$ packed form
11165G4682c22718a47704k16768L1376D9679c62363B65488c216A50927j2E6195
11153H1430J57831h3857C5211R5726A3272K91887b19249n6171h8378j86578B3154
11141C4164O1475N2077A3690a84425m1776G9503b77206I6283K04412j12115a09509
11129i3012R162j06628a1807k63256a08781L3090E1459R6230a40129C1781J93674
11118B25455p36a30277j6457I5642C0062N1384b03666i9689D09416a84362A44878
11106a66473A17663f1164C72357A51048P5127h3757E3681O0335g7849A05702m9966
11095E5736j4240f5751C19755m8394o9331F4866e1656C86478j36873m3138J55192
11084C61659E7695K18314Q5729N4258k00412K3736D3142K22285j29886J66652
$$ plain form
11074 302193 79665 -48701 242358 366931 334889 67590 506929 162284 356005 493819
11064 493819 210309 263625 29131 91515 447466 267649 306866 222234 -98261 262707 528616
11053 528616 664495 455695 197495 246608 272855 440692 606289 519034 530377 580748
11043 580748 506158 519399 583498 496106 677216 619623 404163 746423 856242 1051459
11033 1051459 796214 838956 1156016 622525 907951 963453 766985 1209406 624080 1032625
11023 1032625 799911 1103791 971361 884015 637540 739582 927822 1065383 683063 742541
11013 742541 1096221 541093 983511 853477 679501 617832 857246 997883 739023 693073
11003 693073 1008085 585827 882002 987146 850711 552174 525461 570419 702932 514726
$$ packed form
11074C02193G9665d8701B42358J24573l2042F7590M39339A62284J93721J37814
11064D93819B10309N3316B9131O2384L55951j79817L9217q4632i8261B62707K65909
11053E28616J35879k08800A97495M9113K6247J67837J65597q7255J1343N0371
11043E80748p4590J3241O4099q7392J81110n7593k15460L42260J09819J95217
11033A051459k55245M2742L17060n33491K85426N5502j96468M42421n85326M08545
11023A032625k32714L03880j32430q7346k46475J02042J88240J37561l82320N9478
11013G42541L53680E41093M42418j30034j73976o1669K39414J40637k58860m5950
11003F93073L15012m22258K96175J05144j36435k98537k6713M4958J32513j88206
$$ plain form
10993 514726 706523 700082 873215 298455 513218 950189 828475 740658 840092 498839
10983 498839 856769 595631 770278 833972 764788 700119 768087 945846 974307 988958 790002
10972 790002 782511 1067772 1417111 851406 1083387 1057192 1335050 1548989 1410684 1712452
10962 1712452 1845365 1958711 1867019 2388811 2567048 3013690 2889840 2899735 3112272 2853445
10952 2853445 2929525 2389360 2444364 2176235 2078942 1923379 1492212 1402143 1286039 1236931
10942 1236931 1801218 1675724 1363350 1138369 1120218 959805 1068291 1041359 904604 522844
10932 522844 601529 733428 168424 372296 477351 756191 379166 374625 63884 310721
10922 310721 315642 -40455 88743 54994 -49546 40244 164207 325099 -174131 278299 8151
$$ packed form
10993E14726J91797o441J73133B98455K14763M36971j21714q7817R9434l41253
10983D98839L57930k61138J74647O3694o9184o4669O7968J77759K8461J4651j98956
10972G90002p491K85261L49339n65705K31981k6195K77858K13939j38305L01768
10962A712452J32913J13346r1692N21792J78237M46642j23850R895K12537k58827
10952B853445P6080n40165N5004k68129r7293j55563m31167r0069j16104m9108
10942A236931N64287j25494l12374k24981j8151j60413J08486k6932j36755l81760
10932E22844P8685J31899A68424K03872J05055K78840l77025m541F3884K46837
10922C10721M921d0455H8743l3749d9546D0244J23963J60892a74131B78299H151
$$ plain form
10910 463950 -41 126191 197630 30439 283759 -56102 76350 162139 101492 251587 -131451
10898 -133076 -80293 393943 -80339 -73305 -88784 251010 -102176 28303 -228118 178661 -97693
10886 -2949 -22506 -174777 -34485 -1486 -105756 9310 -55603 39101 29243 -67540 -201587 -87294
10873 276335 -42400 -103774 -82726 150671 225843 52030 119650 -41632 80591 -86340 -29509
10861 -71256 26213 165369 -74192 -226723 300240 -81550 -247687 -128843 45431 8020 50907
10850 50907 221687 -50990 29281 245355 10664 60929 129738 -53282 -61470 -76821 -67883 29415
10837 205641 -91381 105038 -306225 -126340 -392219 96287 -257956 299909 -243292 -79267
10826 209662 -180560 77833 264717 -27244 -337409 -276574 -147469 -71257 -338984 94301
$$ packed form
10910D63950d1A26191P1439C0439K53320e6102G6350Q5789o0647J50095a31451
10898a33076N2783C93943h0339P034j5479B51010a02176B8303b28118A78661i7693
10886b949j9557j52271c4485a486j04270I310e5603C9101r858f7540j34047h7294
10873B76335d2400o1374K1048A50671P5172E2030O7620d1632H0591h6340b9509
10861g1256B6213J39156g4192j52531C00240h1550j66137J18844D5431H020M2887
10850E0907J70780e0990B9281K16074A0664N0265O8809e3282q188j5351Q938B9415
10837B05641i1381A05038c06225a26340k65879I6287b57956B99909b43292g9267
10826B09662a80560G7833J86884b7244l10165O0835J29105g1257k67727I4301
$$ plain form
10815 5148 96816 29899 7373 -27037 483776 -325545 -152873 -130889 -61237 63518 238106
10804 238106 106051 262209 -485432 -122801 -27138 -235166 76553 -159274 -304676 29241
10793 -220584 120522 80778 -187101 -265450 18344 -134553 -32452 -49929 91819 137829 -29861
10781 -113476 -248298 70579 -4740 295755 -40366 -271164 -9201 18976 -303046 -186004 -140650
10770 -140650 172756 -441259 78351 -6524 -146731 289034 -438632 -151795 199844 -278519
10759 48639 50115 56089 -147252 -243458 104188 -67898 100436 33467 16615 -78250 160441
10747 -215474 -166136 -191796 -199689 194514 -95520 -218722 3627 -58834 -280110 -277893 -171990
10736 -171990 -98872 104782 89080 215725 -12750 124617 56934 -248908 -208940 -160507 232282
$$ packed form
10815E148R1668B9899G373b7037D83776c25545a52873K1984f1237F3518J74588
10804B38106A06051J56158d85432a22801b7138k08028G6553a59274j45402B9241
10793b20584A20522l9744a87101p8349A8344a34553c2452j7477I1819M6010b9861
10781a13476j34822G0579d740B95755d0366k30798i201A8976c03046J17042M5354
10770a40650A72756d41259G8351f524j40207B89034d38632a51795A99844b78519
10759D8639J476N974a47252r6206A04188f7898A00436C3467A6615g8250A60441
10747b15474M9338k5660p893A94514i5520j23202C627e8834k21276K217J05903
10736a71990P3118A04782j5702J26645a2750A24617E6934b48908L9968M8433B32282
$$ plain form
10724 -89478 207481 -232971 -65318 -30003 79155 -73032 81337 -178156 205231 -248745 -197887
10713 -197887 224936 -23499 1311 -19404 -42951 106651 -2626 -58810 -347419 -128291 -6709
10701 -500485 241106 61359 72208 -244274 96996 -231372 179827 -148114 -364228 -24320
10690 -69747 218609 66648 -72608 -217324 356713 74289 -38785 -76318 87290 79528 -81116
10678 314009 438083 -97228 26219 -79114 -284507 -84619 -202786 -292201 7396 -63105 -56379
10667 -56379 -241931 -93720 -80667 -93764 -74214 -67584 -369087 -178548 84678 -123027 93895
10655 351389 -44190 52263 314200 -102074 -82930 -92344 -171537 128766 118883 -229968 199558
10643 101595 -21387 -19825 194905 -99491 -260607 -13270 90857 -113032 -258186 -363466 141858
$$ packed form
10724h9478B07481b32971f5318c0003G9155g3032H1337a78156B05231b48745N0858
10713a97887B24936b3499A311a9404k3547A06651b626n6184k88609a28291f709
10701e00485B41106F1359J0849b44274I6996b31372A79827a48114k16114b4320
10690f9747B18609F6648g2608j44716C56713G4289c8785l7533H7290p762h1116
10678C14009J24074i7228B6219g9114k05393h4619j18167q9415G396f3105O726
10667e6379j85552i3720J3053j3097J9550O630l01503a78548H4678a23027I3895
10655C51389d4190E2263K61937a02074J9144r414p9193A28766r883b29968A99558
10643A01595b1387J562A94905i9491j61116a3270I0857a13032j45154j05280A41858
$$ plain form
10631 66736 -10504 -293467 -17662 -165056 -257665 292673 206469 69904 182143 -88273 -355483
10620 -355483 -44828 -15550 -115742 -77544 159530 -82669 -194675 191442 -234493 -148699
10610 -148699 -124307 -202575 28064 114589 -121451 -144159 -128418 44732 71766 -43284 97797
10598 93582 -19297 123628 -35297 -266163 -181885 -390830 -271380 -42134 49924 -6695 -131250
10587 -131250 -105430 -77114 -23061 -406182 -93633 56003 -87655 -166621 283156 12142 -96973
10575 48689 -134926 116191 -69202 -175180 101904 88924 291724 -2349 57564 -116476 185989
10563 150051 137226 50171 282159 7037 -93603 -160524 -357861 -182011 -100199 27128 -292327
10551 -151999 -92854 -53945 -156528 -210487 -307772 14877 -32467 60624 -144120 42006 -309999
$$ packed form
10631F6736a0504k82963a7662j47394r2609B92673q6204F9904J12239h8273k67210
10620c55483d4828a5550j00192L8198A59530h2669j12006A91442b34493Q5794
10610a48699K4392p8268B8064Q6525a21451k2708J5741D4732K7034d3284I7797
10598I3582a9297A23628c5297k30866Q4278k08945J19450d2134D9924f695j24555
10587a31250K5820K8316b3061l83121i3633E6003h7655p8966B83156A2142i6973
10575D8689a34926A16191f9202j05978A01904j2980K02800b349E7564a16476A85989
10563A50051j2825E0171K31988G037i3603o6921j97337J75850Q1812B7128b92327
10551a51999N9145L8909j02583n3959r7285A4877c2467F0624a44120D2006c09999
$$ plain form
10539 -106669 -82750 355510 -313653 181509 -480986 -271492 -319709 157051 -171497 430171
10528 -305846 -242270 -31286 26298 -290080 297523 -13592 63807 -66660 60084 -309371 -69467
10516 -229888 -135987 -76629 -213620 -104082 -194648 -312279 -157417 -36482 79721 45245 -210942
10504 252672 -96142 -120276 -42947 -211480 54397 74618 -25371 23339 -204370 -209200 -74716
10492 -390997 121006 -236574 56037 -94544 -216259 -221353 16928 451358 -678032 -225536
10481 -104323 -61740 253365 133292 -237000 -260743 9314 -37465 -137450 -61870 -166625 159138
10469 58328 -302178 183926 317899 78197 74623 226087 236527 214469 -9128 77565 -104099
10457 -75611 -67251 93907 59876 -71080 309588 113881 13355 96249 -162907 263053 -55689
$$ packed form
10539a06669K3919C55510c13653A81509d80986K09494m8217A57051a71497D30171
10528c05846O3576c1286B6298b90080B97523a3592F3807f6660F0084c09371f9467
10516b29888R3901N9358j36991a04082r0566j17631J54862c6482G9721l4476b10942
10504B52672i6142k4134d2947j68533E4397K0221b5371B3339b04370m830g4716
10492c90997A21006b36574E6037i4544j21715n094A6928M34430f78032b25536
10481a04323M2583B53365j20073b37000k3743I314c7465r9985f1870j04755A59138
10469E8328c02178A83926J33973G8197l574J51464J0440k2058i128G7565a04099
10457g5611Q360I3907l4031g1080C09588A13881A3355Q2894a62907B63053e5689
$$ plain form
10445 211767 -261274 19532 190670 30832 -10726 34899 -128451 -132455 -19689 -36585 -193694
10434 -193694 -66833 -357075 32263 -219152 54432 -93443 107176 99610 -104210 -247490 -190223
10423 -190223 5140 -42025 -85079 177643 137653 69729 -203467 -59687 -49113 -151045 -24524
10411 -27114 116012 -252750 -134239 38979 37276 -209201 119848 132613 -256353 -169464 -148173
10400 -148173 39521 -315729 -49613 -97281 -42352 100588 -157101 -176781 -114469 38239 -188330
10388 -55261 2036 -77384 133755 -147759 -348190 -57918 395227 103626 10168 76188 380345
10377 380345 -36743 51256 325697 -27469 177150 375803 118752 -149308 45973 187056
10367 187056 271869 104966 -12292 254579 250687 246672 36358 398659 561149 -111657 593268
$$ packed form
10445B11767b61274A9532J71138C0832a0726C4899a28451m004a9689j6896j57109
10434a93694f6833k90242C2263b19152E4432i3443A07176p566a04210j43280N7267
10423a90223E140d2025m3054A77643l9990o7924b03467e9687J0574j01932b4524
10411b7114A16012b52750J18511C8979j703b09201A19848J2765b56353Q6889K1291
10400a48173C9521c15729d9613m7668d2352A00588a57101j9680O2312C8239a88330
10388e5261B036g7384A33755a47759k00431e7918C95227A03626A0168O6020L04157
10377C80345c6743E1256K74441b7469A77150J98653A18752a49308D5973J41083
10367A87056Q4813A04966a2292B54579l892m015C6358L62301J62490a11657E93268
$$ plain form
10355 500270 264980 252605 185018 316372 208529 548818 588322 492346 452289 486037 93441
10343 205288 285080 407708 -24184 460314 324113 428378 265174 155008 924785 653971
10333 653971 553633 257071 319778 395821 237187 446576 -37748 395525 188290 118336
10323 118336 493929 40529 240992 18939 169348 127651 -28322 4080 87113 182159 104546
10312 104546 224989 388892 -84524 243993 252631 43718 102533 148389 -194344 -114133 -5861
10300 319673 38617 108778 -36093 84468 -209828 178925 349724 47246 -59087 191580 110633
10289 110633 -148520 105290 14539 -145790 -363769 148182 -206591 -187138 107067 147778
10279 147778 -121065 150481 -386958 139962 16833 -290015 138009 119506 -313199 -29185
$$ packed form
10355E00270k35290j2375o7587J31354j07843L40289L9504r5976m0057L3748I3441
10343B05288P9792J22628b4184D60314j36201J04265j63204j10166P69777k70814
10333F53971j00338B57071O2707P6043j58634K09389c7748C95525A88290o9954
10323A18336L75593D0529K00463A8939J50409m1697b8322D080Q3033R5046p7613
10312A04546J20443J63903h4524B43993Q638D3718N8815M5856a94344Q0211e861
10300C19673C8617P0161c6093H4468b09828A78925J70799D7246e9087A91580q0947
10289A10633a48520A05290A4539a45790k17979A48182b06591J9453A07067M0711
10279A47778a21065A50481c86958A39962A6833b90015A38009j8503c13199b9185
$$ plain form
10268 -126773 -119399 -183761 174936 -130806 63586 -393211 70206 106721 -2136 -219986 -23793
10256 -254061 51500 -112314 68546 -77523 -120078 -93828 266296 94362 -162666 -215288 185686
10244 323189 -29414 83618 347022 483765 101597 192555 198750 -126446 433615 307542
10234 307542 69878 -10545 -114944 -496141 139159 225658 -16871 -99016 -105148 -113396 -147799
10223 -147799 -92267 -140954 69552 -53384 335077 10112 -135639 157112 246481 -270227 -206938
10212 -206938 74164 92439 -402594 -113523 -140513 -4499 -192586 -218671 88481 -89821 -291247
10201 -291247 -188210 -257263 -45534 145439 43303 -222771 -44671 -54446 66661 142922 -249926
10189 -304022 -81044 -168639 75424 -108513 -22176 -111861 -96033 67697 13311 -77704 -334744
$$ packed form
10268a26773P374o4362A74936a30806F3586c93211G0206L6515b136k17850b3793
10256b54061E1500a12314F8546g7523m2555K6250B66296I4362a62666n2622A85686
10244C23189b9414H3618K63404J36743A01597R0958O195a26446D33615j26073
10234C07542F9878a0545j04399l81197A39159Q6499a6871q2145o132q248l4403
10223a47799N5532m8687F9552e3384C35077A0112a35639A57112Q9369b70227O3289
10212b06938G4164J8275d02594a13523k6990d499j88087k6085H8481h9821k01426
10201b91247J03037o9053d5534A45439D3303b22771d4671r775F6661P6261b49926
10189c04022h1044q7595G5424a08513b2176q9685J5828F7697A3311g7704k57040
$$ plain form
10178 -334744 178912 -121640 -92997 287571 -272512 170536 360374 16579 -86281 -18839
10167 -8057 -160580 126612 -104283 34632 167673 18263 -88271 34603 -200573 -100141 -160084
10156 -160084 -300732 -145805 -222917 222186 -71222 53860 -149488 -32646 -152721 128941
10145 -179190 181927 181102 -79045 -33879 -8598 -538371 155890 -153335 199997 -101444 -106901
10134 -106901 137319 -215604 -156656 -101088 -280262 164713 -138834 -48783 57558 -86386
10123 -187618 -241589 263441 -266211 57415 201478 -5916 -206150 -140950 -59708 -110447 41116
10111 -127698 38335 45488 7599 -218836 74989 -298060 -76542 -115338 -225906 257855 22321
10099 -116021 -300813 122039 293991 74843 -89654 -81427 -27249 133665 110058 -226484 -207744
$$ packed form
10178c34744A78912a21640K8643B87571b72512A70536J89838A6579h6281a8839
10167h057j52523A26612a04283C4632J33041A8263h8271C4603b00573a00141n9943
10156a60084j40648a45805p7112B22186g1222E3860a49488c2646j20075A28941
10145a79190A81927q25g9045c3879h598n29773A55890a53335A99997a01444n457
10134a06901A37319b15604N8948N5568j79174A64713a38834d8783E7558h6386
10123a87618n3971B63441b66211E7415J44063e916k00234O5200e9708n0739D1116
10111a27698C8335P153G599b18836G4989b98060g6542l8796j10568B57855B2321
10099a16021j84792A22039J71952G4843h9654Q227b7249A33665k3607b26484J8740
$$ plain form
10088 -207744 198776 -175463 -41516 156325 43059 -57124 322679 62600 -25330 -152611
10078 -152611 24645 206559 20264 124298 -172149 29728 -107770 -165995 -42685 -37796 -154435
10067 -154435 -185702 -192985 32535 25175 -172712 -118479 75793 19252 267193 -164686 -145762
10056 -145762 -907 -3622 -181278 -150132 223101 3723 -189755 -36357 -412305 -165974 -87369
10045 -87369 -269042 -11530 -276667 -332977 72135 181115 251878 -242782 -96819 -49659 149451
10033 185685 239842 -139148 -295309 -11925 49862 -178182 -141949 -65077 112125 174373 -48524
10021 180778 -681 -13446 -80315 19143 -169579 -135206 -121762 -4695 -118407 160166 74758
10009 -378709 -237111 -308828 19541 338706 -152304 57405 41197 123584 -334445 -81761 150042
$$ packed form
10088b07744A98776a75463d1516A56325D3059e7124C22679F2600b5330j27281
10078a52611B4645J81914B0264J04034a72149B9728a07770n8225d2685M889j16639
10067a54435l1267p283C2535p360a72712N4233G5793A9252K47941a64686J8924
10056a45762i07k715j77656L1146B23101C723a89755c6357l75948a65974P8605
10045h7369j81673a1530k65137n6310G2135J08980P0763b42782i6819M7160A49451
10033A85685N4157a39148j56161a1925D9862a78182L6233f5077A12125O2248d8524
10021A80778f81j2765o6869A9143a69579L4373J3444d695j13712A60166G4758
10009c78709J41598p1717A9541L19165a52304E7405j6208Q2387c34445h1761A50042
$$ plain form
9997 53689 -156999 -266081 -368474 -84453 -34314 94633 248640 -179408 -47184 -180378 -24025
9985 -99552 14024 -128882 -236949 56347 -178534 -53922 -235072 154710 88296 -357862 -135135
9973 -206604 -100628 30149 265045 -17659 -83537 41222 -382226 -59777 -83839 -189592 -8195
9961 152136 -79700 -99996 -305146 -110549 114896 -65149 106187 103084 -378104 -441622 -174595
9949 57412 -83956 193130 91432 -34351 -261416 -30076 -201771 -188686 9225 -69803 26812
9937 85619 -132068 -238150 -52036 273199 -204008 149712 -33039 -356876 158613 -73259
9926 78377 47618 -8718 -122594 -33421 -33808 87271 468082 -149356 -135168 23628 104860 76194
9914 76194 223197 -31383 -126527 48012 -80411 -95396 -189209 -203352 168891 -381582 -125563
$$ packed form
9997E3689a56999j09082j02393h4453c4314I4633J54007a79408d7184j33194b4025
9985i9552A4024a28882j08067E6347a78534e3922j81150A54710o6414c57862a35135
9973b06604a00628C0149K34896a7659o5878D1222c82226e9777k4062j05753h195
9961A52136g9700k0296k05150a10549A14896f5149A06187l103c78104o3518a74595
9949E7412h3956A93130I1432c4351k27065c0076j71695J3085I225f9803B6812
9937H5619a32068j06082e2036B73199b04008A49712c3039l23837A58613g3259
9926G8377l0759h718j13876c3421l87H7271L80811a49356J4188B3628Q1232k8666
9914G6194J47003c1383r5144D8012h0411j4985r3813j4143A68891c81582a25563
$$ plain form
9902 -48072 -139942 -40404 -195256 -86963 -359250 2791 244608 -17764 32718 -72784 -45871
9891 -45871 -103477 -119862 190481 -231500 96054 -1504 128394 -51181 -49362 71569 178897
9880 178897 -92770 247337 -128346 -30326 172546 96426 140285 -106356 -345955 418837
9869 227625 152963 -190212 -30839 -147602 -119106 -182516 57054 114197 -15671 29985 24228
9858 24228 -155824 -109921 186731 28718 -134894 -94597 -104014 -233786 272404 -179414 39201
9846 79902 -121469 -222703 -75509 -344807 132969 -272141 -10101 -23254 62870 -104700 147273
9834 -149499 269780 -35003 32657 -502934 -166552 -293802 -257332 -161993 -22809 50513 -185311
9822 -57785 88917 45332 -162893 -295818 -105958 94824 170908 175076 34122 -163035 -38455
$$ packed form
9902d8072r1870d0404j54852h6963k72287B791K41817a7764C2718g2784K6913
9891d5871n7606j6385A90481b31500I6054a504A28394e1181J819G1569J07328
9880A78897i2770B47337a28346c0326A72546p6120M3859a06356k39599D18837
9869B27625p4662a90212c0839j16763K8496o3410E7054N7143a5671B9985n757
9858B4228a55824M5903A86731B8718a34894M0297r417j29772B72404a79414C9201
9846G9902a21469j01234g5509k69298A32969b72141a0101j3153F2870a04700A47273
9834a49499B69780c5003C2657e02934a66552j27250L6470R5339b2809E0513a85311
9822e7785H8917m3585a62893j32925a05958I4824P6084M168C4122a63035c8455
$$ plain form
9810 -76098 83394 -100905 -127347 -171971 -47469 554 150340 -115919 -74076 -5658 103661 26338
9797 187743 -82906 117177 -111629 78539 68565 -238691 54267 -174301 -189889 -102628 291019
9785 -97091 -98644 -99769 -122261 92284 187167 -98398 217804 -101628 -190873 12254 -106795 -212344
9773 -212344 239273 205108 -164043 8339 -277865 -87797 -27897 96449 -11409 -55903 96839
9761 -376941 -178751 14971 278856 265225 -120176 -102418 49759 -100642 -137687 -280227 -307360
9750 -307360 124935 -143084 -247464 -348630 -337297 -540951 -227732 -204305 288391 -241094
9739 -296934 61655 -467894 79621 -190021 -141732 -202751 -129463 -149991 2753 -178972 -51917
9727 -372262 -179761 -416845 -478916 53079 -319920 86482 84678 -170160 -42774 142963 119832
$$ packed form
9810g6098H3394a00905k6442m4624d7469E54J49786a15919M1843e658A03661B6338
9797A87743h2906A17177a11629G8539r974b38691E4267a74301j5588Q7261B91019
9785i7091j553j125k2492I2284R4883i8398B17804a01628q9245A2254a06795j05549
9773b12344B39273l4165a64043H339b77865h7797b7897I6449a1409m4494I6839
9761c76941a78751A4971K63885j3631a20176J7758D9759a00642l7045j42540k7133
9750c07360A24935a43084j04380j01166J1333k03654b27732K3427B88391b41094
9739b96934F1655d67894G9621a90021M8289o1019P3288k0528B753a78972e1917
9727c72262a79761k37084o2071E3079c19920H6482j804a70160d2774A42963k3131
$$ plain form
9716 119832 -230956 -92938 -190272 130127 156722 -94422 -17097 -348562 -153756 37897 185166
9705 185166 -214301 -59517 -320399 65887 -423264 -217039 235578 -75587 135389 -57003
9694 -57125 51771 -24632 -240680 -239142 338559 -113768 77162 -156188 242316 -266331 168756
9682 -206159 427338 -201210 -168498 -204800 46708 -205589 -91788 -38280 -47505 -79721 392991
9670 183415 -58911 -184245 158862 -87108 130028 -362910 82936 45808 -273073 -196024 -434346
9659 -434346 -335456 -1801 1140 -75999 -79505 -136803 630 -233130 -234327 -278380 -78112 29274 24491
9646 24491 61727 -166364 -222676 -167927 -42602 -33562 -64027 -19389 255444 -250541 197623
9634 -7958 74224 226729 -81638 -109454 -113636 31438 -155610 -265203 231355 -177473 7299
$$ packed form
9716A19832b30956i2938r7334A30127K6595i4422a7097l31465a53756C7897J47269
9705A85166b14301e9517k60882F5887d23264K06225B35578g5587A35389e7003
9694e7125E1771b4632k16048J538C38559a13768G7162a56188B42316b66331A68756
9682b06159D27338b01210L2712l6302D6708b05589i1788c8280r225l2216C92991
9670A83415e8911j25334A58862h7108A30028c62910H2936l7128b73073P7049k38322
9659d34346R8890a801A140g5999l506n7298F30b33130j197m4053g8112B9274m783
9646B4491L7236a66364n6312N4749d2602R040l0465a9389B55444b50541A97623
9634g958G4224J52505h1638k7816m182C1438a55610j09593B31355a77473G299
$$ plain form
9622 -383244 -239503 178997 99496 141822 61470 99553 99481 -27379 -31630 -260641 -173618 44285
9609 222891 -47722 155410 -51314 -303260 -153322 141148 203347 -183992 307950 -333202
9598 79072 -91347 -69971 -427209 -5423 123309 -85336 -247058 -82556 -16185 -225788 9203
9586 -59710 -96546 -73393 23620 -489289 -70527 -138992 -277472 -197735 -228707 72685 113242
9575 113242 -101620 -1133 -84272 -344621 159894 -239829 273143 -145225 34861 140710
9565 140710 -171540 -96965 21490 92645 157260 -29717 -170166 78613 -7737 253578 192267
9554 192267 -238670 -186911 74431 -214092 -2385 -246056 -23976 19950 -238786 -250729 -279485
9543 -279485 -166089 108033 99505 -92786 -99877 23012 -142353 -11592 -53992 192724 58727
$$ packed form
9622c83244J43741A78997p9501M2326F1470L8083p2b7379m251k29011Q7023D4285
9609B22891d7722A55410e1314k51946J49938A41148O2199a83992C07950c33202
9598G9072i1347K1376l57238e423A23309h5336j61722h2556a6185k09603I203
9586e9710l6836K3153B3620d89289g0527o8465j38480P9737l0972G2685M0557
9575A13242a01620a133q3139k60349A59894b39829B73143a45225C4861J05849
9565A40710a71540P4575B1490P1155O4615b9717j40449G8613g737B53578o1311
9554A92267b38670N1759G4431b14092b385k43671b3976A9950b38786j1943k8756
9543b79485J13396A08033q528i2786p091B3012a42353a1592m2400A92724E8727
$$ plain form
9531 320694 57295 -158775 -182637 200423 43750 -292136 217964 -168742 8381 -104536 96921
9519 -76837 -33078 213036 -343620 -247428 -256705 -291720 93988 -173400 -108530 -83740 -97800
9508 -97800 254097 -329264 87132 -47200 -123715 179303 -152389 -345947 -93932 -303250 -315553
9497 -315553 -43361 -285977 92616 -399605 -171984 80496 -59253 -44127 39164 234843 -51973
9485 -60074 95224 -347223 385657 -292760 -156608 217541 -34307 -180622 -66172 -180056
9475 -180056 -131265 -86550 -86249 35441 109844 -44747 -378686 -234677 -112988 -394907 280197
9463 17078 -160408 267436 -50526 -206599 192776 -135333 258210 145672 -95601 19958
9452 14687 79497 -245702 252539 248799 319651 -67297 44827 135832 -420369 -167803 -371456
$$ packed form
9531C20694E7295a58775k3862B00423D3750b92136B17964a68742H381a04536I6921
9519g6837c3078B13036c43620R6192r277l5015I3988a73400O4870K4790j4060
9508i7800B54097c29264H7132d7200p6515A79303a52389j93558i3932k09318j2303
9497c15553d3361k42616I2616c99605a71984H0496e9253J5126C9164J95679e1973
9485f0074I5224c47223C85657b92760J36152B17541c4307j46315f6172j13884
9475a80056M8791M4715L01C5441P4403d4747l33939J44009a12988k81919B80197
9463A7078a60408B67436e0526j56073A92776a35333B58210j12538i5601A9958
9452A4687O4810b45702B52539l740P0852f7297D4827R1005d20369a67803k03653
$$ plain form
9441 -371456 -308269 -39635 456 116425 -299995 -96837 -185494 -118497 -19250 203133 -213330
9429 92146 10445 109558 -268403 246817 -192504 -177449 -29886 -166084 275874 74737 165102
9418 165102 178988 -218474 -190191 -211786 116455 -18700 82914 -56872 -159795 -45145 60539
9406 120418 -245952 -7015 176960 59491 -1976 -206021 -15474 -72794 -44807 -128304 -121362 260645
9393 -134769 14625 79494 11345 64330 90132 115211 -138417 -215398 200603 -103994 179333
9381 -43765 -3038 -8016 -6935 192874 108981 65807 -297852 -186514 -264986 -353154 -4281 185978
9368 158228 -20166 145990 -307420 -69421 -43677 -238006 -176402 156310 -376145 -133576
9357 170469 -40932 -52645 50125 -268957 172709 258090 -174901 -139930 -217725 -247557 120090
$$ packed form
9441c71456O3187c9635D56J15969b99995i6837q8657O6997a9250B03133b13330
9429I2146A0445R9113b68403B46817a92504J5055b9886j36198B75874G4737R0365
9418A65102J3886b18474K8283k1595A16455a8700H2914e6872j02923d5145F0539
9406A20418b45952g015A76960E9491a976k04045a5474n7320K7987q3497O942B60645
9393a34769A4625O4869A1345N2985K5802K5079a38417p6981B00603a03994A79333
9381d3765c038m978J081A92874q3893m3174b97852J11338p8472q8168d281A85978
9368A58228b0166A45990c07420f9421K5744j94329O1604A56310c76145a33576
9357A70469d0932j1713E0125b68957A72709Q5381a74901L4971p7795k9832A20090
$$ plain form
9345 -211182 -181977 -97355 -44871 -251917 -429968 -128770 20521 -56375 77949 -128339 -162389
9334 -162389 -231030 -61396 -47135 35431 -104743 -309077 -290952 -342618 -191759 89332 -393597
9322 -159689 107189 377029 2731 -240605 -117351 63435 76060 119344 -107381 -48604 161861
9310 -92016 -171575 -56758 213425 151692 114871 22793 2067 -108110 66598 159277 -91372 -279555
9298 -279555 8689 -123487 -2285 -137040 481742 -246997 88888 -132572 -270186 -203945 94551
9286 -331073 -205890 -173996 -118310 -88718 -239095 -177077 6111 99344 -74531 -11389 -73386
9275 -73386 116476 -78376 -202646 -228118 18652 -230118 -148964 -316891 -35769 -89879 -288346
9264 -288346 -81296 -28373 115796 -44444 73034 -259537 -141794 82868 104265 -114479 198197
$$ packed form
9345b11182K9205Q4622d4871k07046j78051a28770B0521e6375G7949a28339l4050
9334a62389o8641f1396J4261C5431a04743k04334J8125n1666J50859H9332c93597
9322a59689A07189K69840B731b40605a17351F3435J2625M3284a07381d8604A61861
9310i2016p9559e6758B13425o1733l6821B2793B067a08110F6598R2679i1372j88183
9298b79555H689a23487b285j34755D81742b46997H8888a32572j37614O6241I4551
9286c31073J25183L1894N5686K9592j50377O2018F111R3233g4531a1389o1997
9275g3386A16476g8376j24270k5472A8652b30118Q1154j67927c5769n4110j98467
9264b88346h1296b8373A15796d4444G3034b59537J17743H2868K1397a14479A98197
$$ plain form
9252 -86482 3115 -41934 -2173 67486 62649 179676 -210084 -268189 -99311 161563 130532 69902
9240 69902 -143819 -153774 -58465 56774 50031 -88785 -178799 162083 -62495 -256679 175848
9228 54188 49819 -98457 -73762 81803 -177918 -184727 -33516 -126486 272601 -117515 -140033 -122768
9216 -122768 -237335 93246 -174015 294599 9642 -127549 -343631 210138 -173671 90447
9205 -355368 -73409 -81860 -16553 -47919 -7909 98369 -360566 10783 -66496 -73451 -29580 -79387
9193 -79387 -137523 -72927 95862 323981 335078 -52639 -44908 -85036 -307434 -27362 144727
9181 -271513 85469 -325390 75875 -122892 -137651 -237579 -1363 -106851 150587 -22153 -34612
9170 -34612 -179710 -405626 29788 -349500 191299 -105907 -82822 -134393 -113007 41236 -59923
$$ packed form
9252h6482C115d1934b173F7486m837J17027b10084n8105i9311A61563l1031o0630
9240F9902a43819r955e8465E6774o743h8785r0014A62083f2495j94184A75848
9228E4188m369i8457K4695H1803a77918o809c3516r2970B72601a17515k2518J7265
9216a22768j14567I3246a74015B94599I642a27549k16082B10138a73671I0447
9205c55368g3409q451a6553l1366g909I8369c60566A0783f6496o955b9580m9807
9193g9387n8136O4596I5862K28119J1097e2639P731m0128k22398b7362A44727
9181b71513H5469c25390G5875a22892j4759r9928a363j05488A50587b2153j2459
9170c4612j45098k25916B9788c49500A91299a05907K3085n1571K1386D1236e9923
$$ plain form
9158 -32635 21075 -124991 81865 96695 107705 22137 -16444 -30220 -176431 -282154 69300
9146 -183015 -247187 62799 23572 287568 108149 -132806 190103 178893 -25209 -16066 59211
9134 -67764 28533 313636 37283 -56606 8993 66244 -298668 174401 -502475 52037 -162128
9122 109982 -69174 43649 -196378 26141 -135551 -84275 131388 -193854 190011 281493 -55052
9110 -114120 -7047 76 89143 -34934 -141746 -121451 -85085 117826 -26651 -129513 -228522 -102297
9097 -282264 5636 94662 -173760 50285 -156570 65306 233778 41391 -66092 29758 69015
9086 69015 54362 -169692 -80586 -54810 67633 -6110 -495720 -75326 53564 -217859 -206466
9075 -206466 263370 46183 -185479 -29336 -138972 -275171 36194 118239 83686 70104 -210676
$$ packed form
9158c2635B1075a24991H1865J4830J1010B2137a6444j3776j46211j05723F9300
9146a83015o4172F2799B3572K63996A08149a32806A90103j1210b5209R143E9211
9134f7764B8533K85103C7283e6606H993N7251b98668A74401e02475E2037a62128
9122A09982f9174D3649a96378B6141a35551N1276A31388a93854A90011R1482e5052
9110a14120g047G6Q9067c4934j06812K0295L6366A17826b6651j02862r9009a02297
9097b82264E636Q9026a73760E0285a56570F5306J68472D1391f6092B9758L9257
9086F9015j4653a69692h0586K5776F7633f110m89610g5326E3564b17859J1393
9075b06466B63370D6183a85479b9336j09636j36199C6194Q2045l4553j3582b10676
$$ plain form
9063 198540 17022 -152245 131047 -178349 220274 284027 -282803 -213138 58797 -95643 -145036
9052 -145036 30535 45876 -619286 -85723 -39593 71564 -80458 -258691 -207127 -87324 -238889
9041 -238889 -176284 -249839 -451519 -166849 161996 121638 -77177 -130934 -252753 70680 -471045
9029 133165 -97910 207671 -11038 -19683 -139679 -47853 -211349 -285892 -128252 -120695 19140
9017 -212320 -69439 -501716 66086 95750 157904 -303849 473114 -242189 -199780 -227158 98457
9005 -55553 -130105 -201411 -19353 -20590 -141616 -192366 -177181 137639 222677 -118563 94686
8993 169848 25089 195256 -64871 -129378 13308 70752 -70139 -80067 -97759 -183063 -134582 -58788
8980 -15751 124828 123205 146392 -192257 -144525 70790 195278 134013 -99109 45376 -202497
$$ packed form
9063A98540A7022a52245A31047a78349B20274O3753b82803O9665E8797i5643m9393
9052a45036C0535J5341f19286h5723c9593G1564h0458j78233N1564h7324j51565
9041b38889O2605p3555k01680a66849A61996m0358g7177n3757j21819G0680d71045
9029A33165i7910B07671a1038q645j19996d7853j63496p4543a28252P557A9140
9017b12320f9439m32277F6086K9664O2154c03849D73114b42189M2409k7378I8457
9005e5553p4552p1306a9353j237j21026n0750J5185A37639Q5038a18563I4686
8993A69848B5089J70167f4871o4507A3308N7444g0139r928j7692q5304M8481e8788
8980a5751A24828j623K3187a92257M7732G0790J24488o1265i9109D5376b02497
$$ plain form
8968 427071 46024 203357 90394 132568 -82665 -196402 -326614 -176886 400524 -30544 -8903
8956 -168793 -3125 -85509 91185 -248774 332395 -174482 -272646 -183066 9662 -213605 -133915
8945 -133915 -213725 -238021 -190469 5221 170658 266893 -292534 -27299 141882 -137670 -64789
8933 -1355 -186156 -155449 56983 -99148 -235405 48075 6081 -72200 58292 -179128 -96657 25150
8920 55438 -4369 -69220 307147 162606 190778 -42053 -81738 339936 59563 357933 593777
8909 593777 914925 1547715 2596218 4469334 9064337 4445930 2391010 1255783 680140
8900 680140 582104 255384 606160 317654 39401 134482 -27811 262974 332954 -47098 262609
8888 57479 -175959 -176479 62537 129032 158633 -128786 46864 -161130 -62342 -26105 286077
$$ packed form
8968D27071D6024J57333I0394M2174h2665j13737j30212J49728D00524c0544h903
8956a68793c125q2384I1185b48774C32395a74482r8164Q9580I662b13605P9690
8945a33915p9810k4296M7552E221J65437R6235b92534b7299A41882a37670f4789
8933a355j84801L0707E6983i9148j36257D8075F081g2200E8292a79128Q2471B5150
8920E5438d369o4851C07147j44541K8172d2053l9685C39936E9563K98370K35844
8909E93777L21148O32790J048503J873116M595003D445930k054920j135227n75643
8900F80140r8036B55384L50776k88506C9401R5081b7811B62974O9980d7098B62609
8888E7479a75959n20F2537O6495K9601a28786D6864a61130f2342b6105B86077
$$ plain form
8876 274744 -346747 133133 -336884 -141853 66316 -229890 85211 -112047 -331592 -48887
8865 23000 96727 192397 45633 -70517 -594930 265417 74729 -110597 -35330 6529 -30981
8853 -202417 -153065 -94085 -169324 -60449 176015 -249112 -383323 238372 -332093 -353736 69511
8841 -156218 1949 35115 -47956 126501 137773 -274553 -180042 95505 1766 -125657 -278711
$$ packed form
8876B74744c46747A33133c36884a41853F6316b29890H5211a12047k19545d8887
8865B3000P3727R5670D5633g0517n24413B65417G4729a10597c5330F529c0981
8853b02417M9352N8980p5239f0449A76015b49112j34211B38372c32093k1643F9511
8841a56218A949L3166d7956A26501J1272b74553R4511I5505A766a25657j53054
$$ [...]
##END NTUPLES=NMR SPECTRUM
##END=
