
##TITLE=UV1165_M6-1005-1000_6307368_x0ENxthYTd
##JCAMPDX= 6.0         $$ Bruker NMR JCAMP-DX V2.0
##DATA TYPE= NMR SPECTRUM
##DATA CLASS= NTUPLES
##ORIGIN= BRUKER
##OWNER= Administrator
$$ 1.72 TOPSPIN		Version 2.1
$$ 2012-06-07 03:46:55.359 -0500  Administrator@TOPSPIN
$$ Compression mode = diff/dup
##.OBSERVE FREQUENCY= 400.13188235
##.OBSERVE NUCLEUS= ^1H
##.ACQUISITION MODE= SIMULTANEOUS (DQD)
##.ACQUISITION SCHEME= undefined
##.AVERAGES= 64
##.DIGITISER RES= 22
##SPECTROMETER/DATA SYSTEM= spect
##.PULSE SEQUENCE= noesygpps1d.comp
##.SOLVENT NAME= COFFEE_meoh
##.SHIFT REFERENCE= INTERNAL, COFFEE_meoh, 1, 14.96707
##AUDIT TRAIL= $$ (NUMBER, WHEN, WHO, WHERE, PROCESS, VERSION, WHAT)
$$ ##TITLE= Audit trail, TOPSPIN		Version 2.1
$$ ##JCAMPDX= 5.01
$$ ##ORIGIN= Bruker BioSpin GmbH
$$ ##OWNER= Administrator
$$ $$ C:\Bruker\TOPSPIN/data/COFFEE/nmr/UV1165_M6-1005-1000_6307368_x0ENxthYTd/12/pdata/1/auditp.txt
$$ ##AUDIT TRAIL=  $$ (NUMBER, WHEN, WHO, WHERE, PROCESS, VERSION, WHAT)
(   1,<2012-06-07 03:46:50.156 -0500>,<Administrator>,<TOPSPIN>,<go>,<TOPSPIN 2.1>,
      <created by zg
	started at 2012-06-07 03:35:19.953 -0500,
	POWCHK enabled, PULCHK disabled,
       configuration hash MD5:
       D5 CA 7A 23 FE 6B EE E2 50 67 74 61 24 F7 5E 3B
       data hash MD5: 64K
       21 11 8E B7 3E 23 FA 80 7C C1 79 10 52 50 E0 78>)
(   2,<2012-06-07 03:46:52.953 -0500>,<Administrator>,<TOPSPIN>,<proc1d>,<TOPSPIN 2.1>,
      <Start of raw data processing
       efp LB = 0.3 FT_mod = 6 PKNL = 1 PHC0 = 0 PHC1 = 0 SI = 128K 
       data hash MD5: 128K
       80 7D 01 17 31 6B 2D 48 35 4D 41 3C F2 57 0A 13>)
(   3,<2012-06-07 03:46:54.156 -0500>,<Administrator>,<TOPSPIN>,<proc1d>,<TOPSPIN 2.1>,
      <pk PHC0 = 31.57471 PHC1 = 0 
       data hash MD5: 128K
       AC FD DB 71 6F AA F8 4A B3 DA E1 31 7D 20 FE FF>)
(   4,<2012-06-07 03:46:55.000 -0500>,<Administrator>,<TOPSPIN>,<proc1d>,<TOPSPIN 2.1>,
      <abs ABSG = 1 
       data hash MD5: 128K
       89 6C E0 08 78 AE 2C 53 67 42 93 D4 1E CC 98 30>)
(   5,<2012-06-07 03:46:55.062 -0500>,<Administrator>,<TOPSPIN>,<proc1d>,<TOPSPIN 2.1>,
      <abs ABSG = 2 
       data hash MD5: 128K
       CD 28 BE 45 59 E6 CA DA 34 D7 E8 C4 73 C7 03 55>)
(   6,<2012-06-07 03:46:55.125 -0500>,<Administrator>,<TOPSPIN>,<proc1d>,<TOPSPIN 2.1>,
      <abs ABSG = 3 
       data hash MD5: 128K
       BB ED 44 60 76 98 76 35 EB 3F 86 10 41 E8 0C E7>)
(   7,<2012-06-07 03:46:55.203 -0500>,<Administrator>,<TOPSPIN>,<proc1d>,<TOPSPIN 2.1>,
      <abs ABSG = 4 
       data hash MD5: 128K
       69 52 71 AE 5C E7 6F FC 41 64 09 E0 5B 40 A4 07>)
(   8,<2012-06-07 03:46:55.265 -0500>,<Administrator>,<TOPSPIN>,<proc1d>,<TOPSPIN 2.1>,
      <abs ABSG = 5 
       data hash MD5: 128K
       6F E2 AA 9A D9 3F A1 A7 0B 48 FE 62 A9 B0 C6 BF>)
$$ ##END=
$$ 
$$ $$ hash MD5
$$ $$ FD CF 93 F8 74 58 9E 6F 45 EB F6 78 7B 82 6B AF
##$RELAX= 
##$RELAX= 
##$RELAX= 
##$RELAX= 
##$RELAX= 
##$RELAX= 
##$RELAX= 
##$RELAX= 
$$ Bruker specific parameters
$$ [...]
##$TP07= 0
##$TPNAME0= <>
##$TPNAME1= <>
##$TPNAME2= <>
##$TPNAME3= <>
##$TPNAME4= <>
##$TPNAME5= <>
##$TPNAME6= <>
##$TPNAME7= <>
##$TPOAL= (0..7)
0.5 0.5 0.5 0.5 0.5 0.5 0.5 0.5
##$TPOFFS= (0..7)
0 0 0 0 0 0 0 0
##$TUNHIN= 0
##$TUNHOUT= 0
##$TUNXOUT= 0
##$USERA1= <user>
##$USERA2= <user>
##$USERA3= <user>
##$USERA4= <user>
##$USERA5= <user>
##$V9= 5
##$VALIST= <valist>
##$VCLIST= <CCCCCCCCCCCCCCC>
##$VD= 0
##$VDLIST= <DDDDDDDDDDDDDDD>
##$VPLIST= <PPPPPPPPPPPPPPP>
##$VTLIST= <TTTTTTTTTTTTTTT>
##$WBST= 2048
##$WBSW= 25
##$XGAIN= (0..3)
0 0 0 0
##$XL= 0
##$YL= 0
##$YMAX_a= 10655479
##$YMIN_a= -9483713
##$ZGOPTNS= <>
##$ZL1= 120
##$ZL2= 120
##$ZL3= 120
##$ZL4= 120
##$ABSF1= 14.96707
##$ABSF2= -5.585461
##$ABSG= 5
##$ABSL= 3
##$ALPHA= 0
##$AQORDER= 0
##$ASSFAC= 0
##$ASSFACI= 0
##$ASSFACX= 0
##$ASSWID= 0
##$AUNMP= <proc_prof1d_extract.lims>
##$AXLEFT= 0
##$AXNAME= <>
##$AXNUC= <1H>
##$AXRIGHT= 0
##$AXTYPE= 0
##$AXUNIT= <>
##$AZFE= 0.1
##$AZFW= 0.1
##$BCFW= 0
##$BC_mod= 0
##$BYTORDP= 0
##$COROFFS= 0
##$CY= 15
##$DATMOD= 1
##$DC= 0
##$DFILT= <>
##$DTYPP= 0
##$F1P= 0
##$F2P= 0
##$FCOR= 0.5
##$FTSIZE= 131072
##$FT_mod= 6
##$GAMMA= 0
##$GB= 0
##$INTBC= 1
##$INTSCL= 1
##$ISEN= 128
##$LB= 0.3
##$LEV0= 0
##$LPBIN= 0
##$MAXI= 10000
##$MC2= 0
##$MEAN= 0
##$ME_mod= 0
##$MI= 0
##$NCOEF= 0
##$NC_proc= -1
##$NLEV= 6
##$NOISF1= 0
##$NOISF2= 0
##$NSP= 0
##$NTH_PI= 0
##$NZP= 0
##$OFFSET= 14.96707
##$PC= 1
##$PHC0= 31.57471
##$PHC1= 0
##$PH_mod= 1
##$PKNL= yes
##$PPARMOD= 0
##$PPDIAG= 0
##$PPIPTYP= 0
##$PPMPNUM= 2147483647
##$PPRESOL= 1
##$PSCAL= 4
##$PSIGN= 0
##$PYNMP= <proc.py>
##$REVERSE= no
##$SF= 400.130005418947
##$SI= 131072
##$SIGF1= 0
##$SIGF2= 0
##$SINO= 400
##$SIOLD= 131072
##$SPECTYP= <>
##$SREGLST= <1H.CDCl3>
##$SSB= 0
##$STSI= 131072
##$STSR= 0
##$SW_p= 8223.68421052632
##$SYMM= 0
##$S_DEV= 0
##$TDeff= 65536
##$TDoff= 0
##$TI= <>
##$TILT= no
##$TM1= 0
##$TM2= 0
##$TOPLEV= 0
##$USERP1= <user>
##$USERP2= <user>
##$USERP3= <user>
##$USERP4= <user>
##$USERP5= <user>
##$WDW= 1
##$XDIM= 131072
##$YMAX_p= 111812719
##$YMIN_p= -362960441
##$CURPLOT= <Network HP LaserJet P1505>
##$CURPRIN= <$Network HP LaserJet P1505>
##$DFORMAT= <normdp>
##$LAYOUT= <+/1D_H.xwp>
##$LFORMAT= <normlp>
##$PFORMAT= <normpl>
##$SURQMSG= 1
$$ End of Bruker specific parameters
$$ ---------------------------------
##NTUPLES= NMR SPECTRUM
##VAR_NAME=  FREQUENCY,     SPECTRUM/REAL,   SPECTRUM/IMAG
##SYMBOL=    X,             R,               I
##VAR_TYPE=  INDEPENDENT,   DEPENDENT,       DEPENDENT
##VAR_FORM=  AFFN,          ASDF,            ASDF
##VAR_DIM=   131072,        131072,          131072
##UNITS=     HZ,            ARBITRARY UNITS, ARBITRARY UNITS
##FACTOR=    0.0627417313425165, 1,          1
##FIRST=     8223.62146879498, 656,          -21243
##LAST=      0,             336,             -21527
##MIN=       0,             -362960441,      0
##MAX=       8223.62146879498, 111812719,    0
$$ Real data points
##PAGE= N=1
##DATA TABLE= (X++(R..R)), XYDATA
$$ [...]
63033B78043J320P04K81K62L20K56K79N37Q12Q77P84O11K81j82n23n14j93L18
$$ 278043 279363 280067 280348 280610 280930 281186 281465 282002 282814 283691 284475 285086 285367 285185 284662 284148 283955 284273
63015B84273R40J484J709J649J665J944K288K497K739L261L996M662N098N307
$$ 284273 285213 286697 288406 290055 291720 293664 295952 298449 301188 304449 308445 313107 318205 323512
63001C23512N336N350N652O404P413Q357R111R750J0353J0949J1568J2176J2670
$$ 323512 328848 334198 339850 346254 353667 362024 371135 380885 391238 402187 413755 425931 438601
62988D38601J3003J3227J3337J3235J2919J2541J2219J1924J1608J1255J0804
$$ 438601 451604 464831 478168 491403 504322 516863 529082 541006 552614 563869 574673
62977E74673J0260R895R983J0275J0122R232P971O707N331L675J944L15j509l843
$$ 574673 584933 594828 604811 615086 625208 634440 642411 649118 654449 658124 660068 660383 658874 655031
62963F55031o349q313r507j0303j1040j1674j1996j1881j1304j0405r455q508
$$ 655031 648682 640369 630862 620559 609519 597845 585849 573968 562664 552259 542804 534296
62951E34296p286n671m079k939k039q52O44K040L239M511N828O767P265P767Q531
$$ 534296 527010 521339 517260 514321 512282 511430 512074 514114 517353 521864 527692 534459 541724 549491 558022
62936E58022R223R545R686R904J0022R773R256Q709Q105P326O496N732M780L307
$$ 558022 567245 576790 586476 596380 606402 616175 625431 634140 642245 649571 656067 661799 666579 669886
62922F69886J463k55j694l256n390q045j0751j3077j4899j6300j7273j7669j7456
$$ 669886 671349 671094 669400 666144 660754 652709 641958 628881 613982 597682 580409 562740 545284
62909E45284j6927j6481j6214j5955j5607j5193j4597j3633j2481j1659j1384
$$ 545284 528357 511876 495662 479707 464100 448907 434310 420677 408196 396537 385153
62898C85153j1249j0793j0093r485q996q445p895p591p522p395p080o686o250
$$ 385153 373904 363111 353018 343533 334537 326092 318197 310606 303084 295689 288609 281923 275673
62885B75673n688n088m723m617m455m019l524l308l418l636l776l704l259k425
$$ 275673 269985 264897 260174 255557 251102 247083 243559 240251 236833 233197 229421 225717 222458 220033
62871B20033j527j022j032j252j350j290j169r87p31n58o63r86j258j361j417
$$ 220033 218506 217484 216452 215200 213850 212560 211391 210404 209673 209115 208452 207466 206208 204847 203430
62856B03430j474j385j095q46q22q45o64m49o29j245j771j678r80j49L59M29L19
$$ 203430 201956 200571 199476 198630 197808 196963 196299 195850 195221 193976 192205 190527 189547 189398 189757 190186 190505
62839A90505M04P79J114J095R16J022J415J555J117M56J17J71K96K93K02Q8l5
$$ 190505 190909 191688 192802 193897 194813 195835 197250 198805 199922 200378 200495 200666 200962 201255 201457 201545 201510
62822B01510j11j28k12m34o15n90n07o54j004j263j273j179j136j167j281j501
$$ 201510 201399 201271 201059 200625 200010 199420 198913 198259 197255 195992 194719 193540 192404 191237 189956 188455
62806A88455j700j644j280q25n13l98m64o91r17q49m17K7K3m80j101j418j307
$$ 188455 186755 185111 183831 183006 182493 182095 181631 180940 180023 179174 178757 178784 178807 178327 177226 175808 174501
62789A74501r11m68k11k80n72p51n36k1M01M65L16K69L46K80k4k43k7M93P89N45
$$ 174501 173590 173122 172911 172631 172059 171308 170772 170751 171152 171617 171933 172202 172548 172828 172804 172561 172534 173027 173816 174361
62769A74361L8k05nL14M16L82N58J003J386J470J464J635J784J532J021R05J454
$$ 174361 174399 174194 174189 174503 174919 175301 175859 176862 178248 179718 181182 182817 184601 186133 187154 188059 189513
62752A89513K147K365K179K080K205K266K156K136K386K710K858K831K764K707
$$ 189513 191660 194025 196204 198284 200489 202755 204911 207047 209433 212143 215001 217832 220596 223303
62738B23303K662K707K958L442M100M821N461N920O207O369O444O584P100Q178
$$ 223303 225965 228672 231630 235072 239172 243993 249454 255374 261581 267950 274394 280978 288078 296256
62724B96256R585J0880J1970J3133J4466J5632J6274J6473J6532J6549J6425J6162
$$ 296256 305841 316721 328691 341824 356290 371922 388196 404669 421201 437750 454175 470337
62712D70337J5833J5325J4357J2771J0654Q168N474K832M86j639l937o610r316
$$ 470337 486170 501495 515852 528623 539277 547445 552919 555751 556237 554598 550661 544051 534735
62699E34735j1491j2961j4060j5108j6021j6514j6504j6182j5723j5172j4553
$$ 534735 523244 510283 496223 481115 465094 448580 432076 415894 400171 384999 370446
62688C70446j3946j3354j2655j1797j0912j0111r299q333p345o651o346o131n629
$$ 370446 356500 343146 330491 318694 307782 297671 288372 280039 272694 266043 259697 253566 247937
62675B47937m771l795k985k481k252k126j896j502j027n42J3P13J452K009K289
$$ 247937 243166 239371 236386 233905 231653 229527 227631 226129 225102 224560 224573 225286 226738 228747 231036
62660B31036K400K526K778L172L709M319M876N249N502N898O654P668Q580R179
$$ 231036 233436 235962 238740 241912 245621 249940 254816 260065 265567 271465 278119 285787 294367 303546
62646C03546R633J0242J1055J1883J2656J3556J4702J5900J6893J7661J8328J8843
$$ 303546 313179 323421 334476 346359 359015 372571 387273 403173 420066 437727 456055 474898
62634D74898J9036J8936J8768J8568J7997J6687J4634J2106R321O367L322K41
$$ 474898 493934 512870 531638 550206 568203 584890 599524 611630 620951 627318 630640 630881
62622F30881k955o337r699j2632j4900j6606j7950j8974j9664k0088k0277k0115
$$ 630881 627926 621589 611890 599258 584358 567752 549802 530828 511164 491076 470799 450684
62610D50684j9513j8626j7702j6808j5846j4838j3936j3173j2370j1387j0277
$$ 450684 431171 412545 394843 378035 362189 347351 333415 320242 307872 296485 286208
62599B86208r146q065p146o555o239n861n204m519m241m393m536m319l832l320
$$ 286208 277062 268997 261851 255296 249057 243196 237992 233473 229232 224839 220303 215984 212152 208832
62585B08832k843k373k042j978k000j788j357j070j087j092p97m52n10q96j054
$$ 208832 205989 203616 201574 199596 197596 195808 194451 193381 192294 191202 190405 189953 189443 188547 187493
62570A87493p39l80m25p18p71m81k30l29o72r25q41l59L53R25J062Q77P70R57
$$ 187493 186754 186374 185949 185231 184460 183979 183749 183420 182748 181823 180982 180623 180976 181901 182963 183840 184610 185567
62552A85567J286J530J665J775J866J933K027K162K274K359K623L274M247N215
$$ 185567 186853 188383 190048 191823 193689 195622 197649 199811 202085 204444 207067 210341 214588 219803
62538B19803N871O138O179O213O375O664P052P519P967Q160P894P185O173M962
$$ 219803 225674 231812 237991 244204 250579 257243 264295 271814 279781 287941 295835 303020 309193 314155
62524C14155L675K560J735R33j89j531k674l531m467n626o612p051p123p203p299
$$ 314155 317830 320390 322125 323058 322869 321338 318664 315133 310666 305040 298428 291377 284254 277051 269752
62509B69752p206o940o630o230n697n318n341n431m956l846k738k190k159k311
$$ 269752 262546 255606 248976 242746 237049 231731 226390 220959 216003 212157 209419 207229 205070 202759
62495B02759k468k525k302j739j097p40p63r31r23n90j09J39l8l73l60J82R27
$$ 202759 200291 197766 195464 193725 192628 191888 191125 190194 189271 188681 188572 188711 188673 188300 187940 188122 189049
62478A89049J455J637J610J557J588J704J801J824J890K162K585K954L215L532
$$ 189049 190504 192141 193751 195308 196896 198600 200401 202225 204115 206277 208862 211816 215031 218563
62464B18563M055M805N745O748P490P714P628P812Q551R592J0624J1638J2638
$$ 218563 222618 227423 233168 239916 247406 255120 262748 270560 279111 288703 299327 310965 323603
62451C23603J3327J3461J3290J3264J3349J3027J2017J0667R523Q735P954O787
$$ 323603 336930 350391 363681 376945 390294 403321 415338 426005 435528 444263 452217 459004
62439D59004N183L505K249J620J382J162R06R37J553K645L782M646N316O089P089
$$ 459004 464187 467692 469941 471561 472943 474105 475011 475948 477501 480146 483928 488574 493890 499979 507068
62424E07068Q107Q856R304R588R628R018P443N120K638L58j886m364o951r245
$$ 507068 515175 524031 533335 542923 552551 561569 569012 574132 576770 577128 575242 570878 563927 554682
62410E54682j1178j3129j5355j7433j8678j8974j8880j8828j8584j7754j6458
$$ 554682 543504 530375 515020 497587 478909 459935 441055 422227 403643 385889 369431
62399C69431j5174j4079j2940j1642j0361r232q163p109o237n634n088m360l494
$$ 369431 354257 340178 327238 315596 305235 296003 287840 280731 274494 268860 263772 259412 255918
62386B55918k759k311k062j804j381q42m28k92k75j10J60K00j27n59q10r37j150
$$ 255918 253159 250848 248786 246982 245601 244759 244331 244039 243764 243654 243814 244014 243887 243328 242518 241581 240431
62369B40431j468j710j759j663j604j795k275k755k878k660k472k503k536k389
$$ 240431 238963 237253 235494 233831 232227 230432 228157 225402 222524 219864 217392 214889 212353 209964
62355B09964k236k264k251j876j222p02n37n99o92p26o71n70n31n48m33j06K03
$$ 209964 207728 205464 203213 201337 200115 199413 198876 198277 197585 196859 196188 195618 195087 194539 194106 194000 194203
62338A94203L34N45J133J858K173K017J953K395L129L674L801L610L366L391L809
$$ 194203 194537 195082 196215 198073 200246 202263 204216 206611 209740 213414 217215 220825 224191 227582 231391
62323B31391M323M527M508M759N380N846N833N787O228O869P005O603O395O869
$$ 231391 235714 240241 244749 249508 254888 260734 266567 272354 278582 285451 292456 299059 305454 312323
62309C12323P761Q631R488J0545J1712J2692J3417J4115J5052J6294J7728J9081
$$ 312323 320084 328715 338203 348748 360460 373152 386569 400684 415736 432030 449758 468839
62297D68839K0081K0686K1061K1296K1187K0446J8923J6605J3589J0224P086M492
$$ 468839 488920 509606 530667 551963 573150 593596 612519 629124 642713 652937 660023 664515
62285F64515K171l14k925n253p174q987j0821j2367j3371j4066j4802j5514j5886
$$ 664515 666686 666372 663447 658194 651020 642033 631212 618845 605474 591408 576606 561092 545206
62272E45206j5812j5442j4847j4012j3074j2267j1606j0946j0315r932r845r852
$$ 545206 529394 513952 499105 485093 472019 459752 448146 437200 426885 416953 407108 397256
62260C97256r793r657r392q893q293p909p756p403o605n792n524n665n467m586
$$ 397256 387463 377806 368414 359521 351228 343319 335563 328160 321555 315763 310239 304574 299107 294521
62246B94521l551l116l330l587l379k768k061j383o98j65o7m05p34n72J05R27
$$ 294521 290970 287854 284524 280937 277558 274790 272729 271346 270648 270483 270416 270011 269277 268705 268810 269737
62230B69737J542J850J938J982K189K582K882K788K401K151K316K790L340L848
$$ 269737 271279 273129 275067 277049 279238 281820 284702 287490 289891 292042 294358 297148 300488 304336
62216C04336M267M562M852N362O131O873P315P502P721Q187Q933R891J0970J2143
$$ 304336 308603 313165 318017 323379 329510 336383 343698 351200 358921 367108 376041 385932 396902 409045
62202D09045J3462J4919J6293J7350J8203J9222K0501K1667K2294K2265K1603
$$ 409045 422507 437426 453719 471069 489272 508494 528995 550662 572956 595221 616824
62191F16824K0222J8127J5613J2984J0265P337M266J265j576m264o782r141j1459
$$ 616824 637046 655173 670786 683770 694035 701372 705638 706903 705327 701063 694281 685140 673681
62178F73681j3711j5611j6921j7785j8467j8891j8752j8011j7020j6150j5519
$$ 673681 659970 644359 627438 609653 591186 572295 553543 535532 518512 502362 486843
62167D86843j5051j4520j3649j2379j1088j0260r920r632r011q074p123o443o089
$$ 486843 471792 457272 443623 431244 420156 409896 399976 390344 381333 373259 366136 359693 353604
62154C53604n815n275m451l756l478l337k873k127j545j267r61l95K64P89J199
$$ 353604 347789 342514 338063 334307 330829 327492 324619 322492 320947 319680 318719 318324 318588 319377 320576
62139C20576J578J960K428L080L711L955L818L770M155M771N249N493N574N492
$$ 320576 322154 324114 326542 329622 333333 337288 341106 344876 349031 353802 359051 364544 370118 375610
62125C75610N320N271N402N469N357N356N693O022N828N178M692M771N245N826
$$ 375610 380930 386201 391603 397072 402429 407785 413478 419500 425328 430506 435198 439969 445214 451040
62111D51040O510P426Q531R663J0711J1630J2426J3169J3885J4327J4039J2777
$$ 451040 457550 464976 473507 483170 493881 505511 517937 531106 544991 559318 573357 586134
62099E86134J0838Q783O858M850K581L25j448k752m156o124q412j0383j1754j2753
$$ 586134 596972 605755 612613 617463 620044 620369 618921 616169 612013 605889 597477 587094 575340 562587
62085E62587j3579j4095j4143j3880j3513j2943j1933j0587r334q465p845p202
$$ 562587 549008 534913 520770 506890 493377 480434 468501 457914 448580 440115 432270 425068
62073D25068o491n857n335m822m306l960l880l846l545k982k436j986j373m48
$$ 425068 418577 412720 407385 402563 398257 394297 390417 386571 383026 380044 377608 375622 374249 373801
62059C73801M89J093J491K062K818L414L706L819L695L048J943R68N34L69Ln02
$$ 373801 374290 375383 376874 378936 381754 385168 388874 392693 396388 399436 401379 402347 402881 403250 403253 402751
62043D02751o95m43j18j52o44j376j995k216k048j759j508j169o52j98k1J31P00
$$ 402751 402056 401613 401495 401343 400699 399323 397328 395112 393064 391305 389797 388628 387976 387778 387757 387888 388588
62026C88588J652K505L026L488M202N067N815O403O975P594Q180Q670R068R390
$$ 388588 390240 392745 395771 399259 403461 408528 414343 420746 427721 435315 443495 452165 461233 470623
62012D70623R711J0109J0550J0810J0684J0233R757R563R680R830R625Q834P547
$$ 470623 480334 490443 500993 511803 522487 532720 542477 552040 561720 571550 581175 590009 597556
61999E97556O066M582K983J012j365l751n590o705p462q346r447j0575j1699j3008
$$ 597556 603622 608204 611187 612199 610834 607083 601493 594788 587326 578980 569533 558958 547259 534251
61985E34251j4439j5548j6014j6008j5846j5508j4763j3654j2489j1503j0768
$$ 534251 519812 504264 488250 472242 456396 440888 426125 412471 399982 388479 377711
61974C77711j0339j0156r838q972p645o422n673n245m795m242l745l453l419l573
$$ 377711 367372 357216 347378 338406 330761 324339 318666 313421 308626 304384 300639 297186 293767 290194
61960B90194l699l571l183k731k377k178k211k492k779k746k397k023j686j106
$$ 290194 286495 282924 279741 277010 274633 272455 270244 267752 264973 262227 259830 257807 256121 255015
61946B55015j87P08J245J499J629J523J106P16P08Q81P01L4p38j254j501j627
$$ 255015 254828 255536 256781 258280 259909 261432 262538 263254 263962 264843 265544 265578 264840 263586 262085 260458
61930B60458j808k229k891l436l520l306l264l475l596l460l327l351l325l061
$$ 260458 258650 256421 253530 250094 246574 243268 240004 236529 232933 229473 226146 222795 219470 216409
61916B16409k708k409k061j593j155p86k66M47R72J041R42J057J272J283J198
$$ 216409 213701 211292 209231 207638 206483 205697 205431 205878 206850 207891 208833 209890 211162 212445 213643
61901B13643J310J533J596J648K078K758L125L066L106L583M184M565M875N387
$$ 213643 214953 216486 218082 219730 221808 224566 227691 230757 233863 237446 241630 246195 251070 256457
61887B56457O044O714P492Q407R179R639J0095J0852J1636J1973J1893J1848J1999
$$ 256457 262501 269215 276707 285114 294293 303932 314027 324879 336515 348488 360381 372229 384228
61874C84228J2054J1804J1376J0912J0387R784R085Q099O564M620K852J714J080
$$ 384228 396282 408086 419462 430374 440761 450545 459630 467729 474293 478913 481765 483479 484559
61861D84559M86l34j275k021k324k143j637r64r5J089K542L987N167O007O582
$$ 484559 485045 484711 483436 481415 479091 476948 475311 474347 474252 475341 477883 481870 487037 493044 499626
61846D99626O934O949O411N233L691K242J034k05j697l246m557n654o672p455
$$ 499626 506560 513509 519920 525153 528844 531086 532120 531915 530218 526972 522415 516761 510089 502634
61832E02634p785p834p973q182q114p716p348p197p080o896o829o921o855o488
$$ 502634 494849 487015 479042 470860 462746 455030 447682 440485 433405 426509 419680 412759 405904 399416
61818C99416o115n952n720n138m481m206m203l880k935j671n51K75R47J646K464
$$ 399416 393301 387349 381629 376491 372010 367804 363601 359721 356786 355115 354564 354839 355786 357432 359896
61803C59896L399M415N514O704P890Q899R754J0660J1743J2907J4063J5257J6447
$$ 359896 363295 367710 373224 379928 387818 396717 406471 417131 428874 441781 455844 471101 487548
61790D87548J7417J8056J8519J8859J8776J7970J6599J5030J3332J1309Q936O425
$$ 487548 504965 523021 541540 560399 579175 597145 613744 628774 642106 653415 662351 668776
61778F68776L908J393r41k712l733m208m429m413l931k834j326J23J194J963K607
$$ 668776 672684 674077 673136 670424 666691 662483 658054 653641 649710 646876 645550 645673 646867 648830 651437
61763F51437K923K453J158m51k018l777n971q276j0269j2098j4095j5905j6761
$$ 651437 654360 656813 657971 657520 655502 651725 645754 637478 627209 615111 601016 585111 568350
61750E68350j6631j6342j6438j6541j6144j5467j5040j4875j4511j3772j2918
$$ 568350 551719 535377 518939 502398 486254 470787 455747 440872 426361 412589 399671
61739C99671j2126j1248j0174r139q455q093p687o999o204n656n412n180m750
$$ 399671 387545 376297 366123 356984 348529 340436 332749 325750 319546 313890 308478 303298 298548
61726B98548m257l893l576l155k720k496k447k367k212k075j863j396q27n17n05
$$ 298548 294291 290398 286822 283667 280947 278451 276004 273637 271425 269350 267487 266091 265264 264747 264242
61711B64242m69k84j98k70j66L16Q82J220J448J758J988J907J699J708J880J891
$$ 264242 263773 263489 263291 263021 262855 263171 264053 265273 266721 268479 270467 272374 274073 275781 277661 279552
61695B79552J630J222O67j20r31j407j533j648j911k154k305k575l051l396l248
$$ 279552 281182 282404 283071 282951 282020 280613 279080 277432 275521 273367 271062 268487 265436 262040 258792
61680B58792k642j938j428j211j273j504j652j505j110p09m67l18r0K39M98N50
$$ 258792 256150 254212 252784 251573 250300 248796 247144 245639 244529 243820 243353 243035 242945 243184 243682 244232
61664B44232N00N77P93R04Q02P15Q57J023Q39L39m7j10r7k45m34n03o43j142j859
$$ 244232 244732 245309 246102 247006 247808 248523 249380 250403 251242 251581 251534 251424 251327 251082 250648 250145 249502 248360 246501
61645B46501k328k350k226k334k653k860k758k494k336k344k295k028j739j810
$$ 246501 244173 241823 239597 237263 234610 231750 228992 226498 224162 221818 219523 217495 215756 213946
61631B13946k245k520k169j426r67j113j503j687j671j687j695j453j007p59r19
$$ 213946 211701 209181 207012 205586 204619 203506 202003 200316 198645 196958 195263 193810 192803 192044 191125
61616A91125j195j157q01m67l59k97m6L94Q11J025R51N92J13j78o6L02N79O42
$$ 191125 189930 188773 187972 187505 187146 186849 186803 187197 188008 189033 189984 190576 190689 190511 190445 190747 191326 191968
61598A91968P13R61J222J245J082J021J170J365J483J617J855K066K068J905J785
$$ 191968 192681 193642 194864 196109 197191 198212 199382 200747 202230 203847 205702 207768 209836 211741 213526
61583B13526J818J889J794J451R87O37M82L17r4o57j032j100j132j367j707j955
$$ 213526 215344 217233 219027 220478 221465 222102 222584 222901 222807 222150 221118 220018 218886 217519 215812 213857
61567B13857k108k171j956j400q93q64j161j255j026q16p82o97n37o61j186j637
$$ 213857 211749 209578 207622 206222 205329 204465 203304 202049 201023 200207 199425 198728 198191 197530 196344 194707
61551A94707j628j486j734k303k675k679k596k609k588k429k238k101j987j942
$$ 194707 193079 191593 189859 187556 184881 182202 179606 176997 174409 171980 169742 167641 165654 163712
61537A63712k067k276k315k086j766j528j393j332j325j268r95n60k59l08n91
$$ 163712 161645 159369 157054 154968 153202 151674 150281 148949 147624 146356 145361 144801 144542 144234 143643
61522A43643q12q09o37m32k59j18n0j63l95l85J59Q89R98J75q61j192p62k53o5
$$ 143643 142831 142022 141385 140953 140694 140576 140526 140363 139968 139583 139742 140631 141629 141804 140943 139751 138989 138736 138671
61503A38671L9L41P05Q69P94O28N58P68J223J498J191N23J15J38J72J0N2N60J040
$$ 138671 138710 139051 139756 140625 141419 142047 142605 143373 144596 146094 147285 147808 147923 148061 148233 148243 148295 148855 149895
61484A49895Q58J48l62k45L22R70J416J475J189R43J077J436J596J461J293J150
$$ 149895 150753 150901 150539 150294 150616 151586 153002 154477 155666 156609 157686 159122 160718 162179 163472 164622
61468A64622P74Q9n75r44j153j388j478j116m09R4ln06q73p71l51K0J77K56M17
$$ 164622 165396 165485 164910 163966 162813 161425 159947 158831 158422 158516 158513 158007 157134 156363 156012 156032 156209 156465 156882
61449A56882N96O23M78L23K86L43M01M15M03L83L61L55L91M74N90P31R28J203
$$ 156882 157478 158101 158579 158902 159188 159531 159932 160347 160750 161133 161494 161849 162240 162714 163304 164035 164963 166166
61431A66166J442J386Q66O4n63o81l63N4K84K47O3o6J1K58M61M75L88M16O17P95
$$ 166166 167608 168994 169860 169924 169361 168680 168317 168371 168655 168902 168965 168899 168910 169168 169629 170104 170492 170908 171525 172320
61411A72320O79K52j55j95Q6K55N1k53l01k16m04q17q81l17L80N81L12J10K36
$$ 172320 172999 173251 173096 172901 172987 173242 173293 173040 172739 172523 172119 171302 170421 170104 170484 171065 171377 171487 171723
61392A71723M80O03O29O30N75M81M85O82R96J336J704K080K329K328K135J924
$$ 171723 172203 172806 173435 174065 174640 175121 175606 176288 177284 178620 180324 182404 184733 187061 189196 191120
61376A91120J798J728J666J630J680J812J901J791J438J011P92R23J217J301J042
$$ 191120 192918 194646 196312 197942 199622 201434 203335 205126 206564 207575 208367 209290 210507 211808 212850
61361B12850P40P74J080J204R11M63J39j93p42j245j258r30r00j403j905j926
$$ 212850 213590 214364 215444 216648 217559 218022 218161 217968 217226 215981 214723 213793 212893 211490 209585 207659
61345B07659j674j616j716j570j105o75n55o71p90p70n54j91J19K13J37L3p5k09
$$ 207659 205985 204369 202653 201083 199978 199303 198748 198077 197287 196517 195963 195772 195891 196104 196241 196274 196199 195990
61327A95990k54o4K69M91N03M49M85O68R79J355J633J698J655J686J760J706J555
$$ 195990 195736 195672 195941 196432 196935 197384 197869 198537 199516 200871 202504 204202 205857 207543 209303 211009 212564
61310B12564J566J847K130K069J644J140Q24P32P77R22J233J735K260K547K501
$$ 212564 214130 215977 218107 220176 221820 222960 223784 224516 225293 226215 227448 229183 231443 233990 236491
61295B36491K361K544L213M089M611M483L988L716L868L994L644L025K715K784
$$ 236491 238852 241396 244609 248698 253309 257792 261780 265496 269364 273358 277002 280027 282742 285526
61281B85526K751K402K134K207K209J696R30M40J62l59j071j409j221j037j255
$$ 285526 288277 290679 292813 295020 297229 298925 299855 300295 300457 300098 299027 297618 296397 295360 294105
61266B94105j574j556j279j095j060j013r92j130j271j045m10K09M19L25L44O60
$$ 294105 292531 290975 289696 288601 287541 286528 285536 284406 283135 282090 281680 281889 282308 282633 282977 283637
61250B83637J081J359J512J735K114K575K982L206L058K436J526O95R0m52j063
$$ 283637 284718 286077 287589 289324 291438 294013 296995 300201 303259 305695 307221 307916 308006 307554 306491
61235C06491j644k077k409k634k587k302k194k545k983k875k137j285p44m60j75
$$ 306491 304847 302770 300361 297727 295140 292838 290644 288099 285116 282241 280104 278819 278075 277615 277440
61220B77440K71R46J748K348K417K077J792J800J965K181K579L179L684L829L676
$$ 277440 277711 278657 280405 282753 285170 287247 289039 290839 292804 294985 297564 300743 304427 308256 311932
61205C11932L491L441L610M016M531M963N319N768O255O448O155N539M764L754
$$ 311932 315423 318864 322474 326490 331021 335984 341303 347071 353326 359774 365929 371468 376232 379986
61191C79986K515J382O27M2p49j693k455k950l421l957m331m406m365m403m423
$$ 379986 382501 383883 384510 384552 383803 382110 379655 376705 373284 369327 364996 360590 356225 351822 347399
61176C47399m198l695l120k667k404k270k126j787j212n82j41Q7K97N63O65L64
$$ 347399 343201 339506 336386 333719 331315 329045 326919 325132 323920 323338 323197 323284 323581 324144 324809 325173
61160C25173k00o00n74k40J64N41Q61R99Q48M89J01k25m28l95q6L43P15J053J432
$$ 325173 324973 324373 323799 323559 323723 324264 325125 326124 326972 327461 327562 327337 326909 326514 326428 326771 327486 328539 329971
61141C29971J740J824J809K048K648L380L976M388M686M894N006M963M626L937
$$ 329971 331711 333535 335344 337392 340040 343420 347396 351784 356470 361364 366370 371333 375959 379896
61127C79896L061K230J479P66K71K19M19L62j14o07p75q51j252j930k397k312
$$ 379896 382957 385187 386666 387432 387703 387922 388341 388703 388589 387982 387207 386356 385104 383174 380777 378465
61111C78465j836j451j557k242l225m082m558m659m492m157l801l639l721l840
$$ 378465 376629 375178 373621 371379 368154 364072 359514 354855 350363 346206 342405 338766 335045 331205
61097C31205l757l496l291l245l133k600j592n49k0m6r4K02M66N3j014j981k276
$$ 331205 327448 323952 320661 317416 314283 311683 310091 309542 309522 309476 309382 309584 310050 310103 309089 307108 304832
61080C04832k093j973k117k338k423k296j987j592j238r51o23j81L57R95J791
$$ 304832 302739 300766 298649 296311 293888 291592 289605 288013 286775 285824 285201 285020 285377 286372 288163
61065B88163K711L582M282M810N151N269N287N515O148P009P707P928P620P023
$$ 288163 290874 294456 298738 303548 308699 313968 319255 324770 330918 337927 345634 353562 361182 368205
61051C68205O515O325O304O163N809N367M888M324L705L080K322J257M4r62j680
$$ 368205 374720 381045 387349 393512 399321 404688 409576 413900 417605 420685 423007 424264 424308 423346 421666
61036D21666k413l340m272m976n479n901o215o330o225n909n446n019m761m553
$$ 421666 419253 415913 411641 406665 401186 395285 389070 382740 376515 370606 365160 360141 355380 350827
61022C50827m222l868l682l507k991k188j517j131q08n02m37n06j84O79J544J955
$$ 350827 346605 342737 339055 335548 332557 330369 328852 327721 326913 326411 325974 325468 325284 325963 327507 329462
61006C29462K122K440K894L335L918M746N515N896O033O236O522O798P214P887
$$ 329462 331584 334024 336918 340253 344171 348917 354432 360328 366361 372597 379119 385917 393131 401018
60992D01018Q660R424J0405J1708J2957J3840J4644J5741J6890J7619J8049J8741
$$ 401018 409678 419102 429507 441215 454172 468012 482656 498397 515287 532906 550955 569696
60980E69696J9860K1088K2256K3507K4875K6229K7610K9192L0896L2420L3695
$$ 569696 589556 610644 632900 656407 681282 707511 735121 764313 795209 827629 861324
60969H61324L5014L6667L8685M0910M3141M5334M7769N0756N4115N7307O0227
$$ 861324 896338 933005 971690 1012600 1055741 1101075 1148844 1199600 1253715 1311022 1371249
60958A371249O3431O7374P1984P7275Q3665R1249R9420J07894J17449J28962J42444
$$ 1371249 1434680 1502054 1574038 1651313 1734978 1826227 1925647 2033541 2150990 2279952 2422396
60947B422396J57768J75660J96937K21610K49844K83077L22871L69436M22606
$$ 2422396 2580164 2755824 2952761 3174371 3424215 3707292 4030163 4399599 4822205
60938D822205M82909N49430O18228O86644P57172Q28569Q78845Q65439P55832
$$ 4822205 5305114 5854544 6472772 7159416 7916588 8745157 9624002 10489441 11245273
60929A1245273N63015L45141J65078N1378j867q439K1792O6619P9158J0071j51859
$$ 11245273 11808288 12153429 12318507 12369885 12368018 12359579 12381371 12447990 12527148 12537219 12385360
60918A2385360l65654n67591p13350p93887q21268q09974p71278p15477o51591
$$ 12385360 12019706 11452115 10738765 9944878 9123610 8313636 7542358 6826881 6175290
60909F175290n85210n19402m57238m01629l53450l11773k75733k45040k19022
$$ 6175290 5590080 5070678 4613440 4211811 3858361 3546588 3270855 3025815 2806793
60900B806793j96579j77033j60075j45049j31165j18359j07096r7403q8778q0934
$$ 2806793 2610214 2433181 2273106 2128057 1996892 1878533 1771437 1674034 1585256 1504322
60890A504322p3894o7515o1619n6531n2738n0045m7702m5395m3445m2000m0652
$$ 1504322 1430428 1362913 1301294 1244763 1192025 1141980 1094278 1048883 1005438 963438 922786
60879I22786l8987l7029l5010l3088l1401k9980k8588k6920k5011k3169k1572
$$ 922786 883799 846770 811760 778672 747271 717291 688703 661783 636772 613603 592031
60868E92031k0231j9197j8398j7475j6164j4740j3665j2917j2133j1260j0525
$$ 592031 571800 552603 534205 516730 500566 485826 472161 459244 447111 435851 425326
60857D25326r860q968p971p359p183o859o015m996m315m018l846l672l485l256
$$ 425326 415466 406498 398527 391168 383985 377126 371111 366115 361800 357782 353936 350264 346779 343523
60843C43523l029k936k987k993k891k833k918l037l127l273l512l715l790l781
$$ 343523 340494 337558 334571 331578 328687 325854 322936 319899 316772 313499 309987 306272 302482 298701
60829B98701l672l379l010k891l161l587l868l930l820l585l399l526l971m315
$$ 298701 295029 291650 288640 285749 282588 279001 275133 271203 267383 263798 260399 256873 252902 248587
60815B48587m142l482k737k302k332k704l065l079k771k475k341k093j440n51
$$ 248587 244445 240963 238226 235924 233592 230888 227823 224744 221973 219498 217157 215064 213624 213073
60801B13073J27L58K41o4m51p22o28j63L24M69K52k8r6O6L04M77N18L82P5k76
$$ 213073 213200 213558 213799 213735 213284 212562 211934 211771 212095 212564 212816 212788 212692 212758 213062 213539 214057 214439 214514 214238
60781B14238n12o25p67j046j338j427j218q02l67j19j34k59k39rK03J95Mk17m39
$$ 214238 213726 213101 212334 211288 209950 208523 207305 206503 206136 206017 205883 205624 205385 205376 205579 205774 205778 205561 205122
60762B05122o66p84p09n57n02n16m79m76p04j114j381j295j054j028j328j710
$$ 205122 204456 203672 202963 202406 201904 201388 200909 200433 199729 198615 197234 195939 194885 193857 192529 190819
60746A90819j846j720j638j807j976j721j129q38j238j912k164j883j541j473
$$ 190819 188973 187253 185615 183808 181832 180111 178982 178144 176906 174994 172830 170947 169406 167933
60732A67933j569j600j503j259q45m17k83n35q91r65o84l08j61l11n13m58j37
$$ 167933 166364 164764 163261 162002 161157 160740 160457 159922 159031 158066 157382 157074 156913 156602 156089 155631 155494
60715A55494J87L77O00R36J120R47O68O65Q56Q50O14N55R01J370J572J440J153
$$ 155494 155681 156058 156658 157594 158714 159661 160329 160994 161850 162700 163314 163869 164770 166140 167712 169152 170305
60698A70305R32R32J121J214R07K98k07l43j90N7K55K72P1j67k78m28q75j475
$$ 170305 171237 172169 173290 174504 175411 175709 175502 175159 174969 175026 175281 175553 175624 175457 175179 174751 173876 172401
60680A72401j806j803j819k025k138j957j674j526j447j325j221j142r52p05o97
$$ 172401 170595 168792 166973 164948 162810 160853 159179 157653 156206 154881 153660 152518 151566 150861 150164
60665A50164r62j061p19l18l60p51r97r08o81m32p1L79P15Q39Q33P68O11M23M02
$$ 150164 149202 148141 147422 147104 146744 145993 144996 144088 143407 142975 142904 143283 143998 144837 145670 146438 147049 147472 147874
60646A47874O71J120J470J488J171P72N26M11K99K94O65J343J827J755J286P95
$$ 147874 148545 149665 151135 152623 153794 154566 155092 155503 155802 156096 156761 158104 159931 161686 162972 163767
60630A63767M34K26K80O14R77J113J107J182J350J497J585J554J214N73M1j9K09
$$ 163767 164201 164427 164707 165321 166298 167411 168518 169700 171050 172547 174132 175686 176900 177473 177514 177495 177704
60613A77704L10K65L07L28p0q93j621j875j812j745j714j636j547j499j407j166
$$ 177704 178014 178279 178586 178914 178844 177951 176330 174455 172643 170898 169184 167548 166001 164502 163095 161929
60597A61929q13m69k39j85k82l52k13P1K55K31J53K14M54P57Q76N02m20j443j915
$$ 161929 161116 160647 160408 160223 159941 159589 159376 159447 159702 159933 160086 160300 160754 161511 162387 162889 162469 161026 159111
60578A59111j629r79m72k48j96k23l09m34n51n82m14k5M07O53P07P33P80P65P00
$$ 159111 157482 156503 156031 155783 155587 155364 155055 154621 154070 153488 153074 153049 153456 154109 154816 155549 156329 157094 157794
60559A57794O89O33L46m9j28K48P01R22J096J444J663J281M48j14K5M98O81M37
$$ 157794 158483 159116 159462 159413 159285 159533 160234 161156 162252 163696 165359 166640 167088 166974 166999 167497 168178 168615
60541A68615J45J59M22O23O09N58P08R95J127J023J012J403K016K327K052J364
$$ 168615 168760 168919 169341 169964 170573 171131 171839 172834 173961 174984 175996 177399 179415 181742 183794 185158
60525A85158O50K13K19O18J060J150R30R12J465K319K952L255L535L887M008L770
$$ 185158 185808 186021 186240 186858 187918 189068 189998 190910 192375 194694 197646 200901 204436 208323 212331 216101
60509B16101L575L908M670N355N715N914O073O067N818N465N035M299L106J723
$$ 216101 219676 223584 228254 233609 239324 245238 251311 257378 263196 268661 273696 277995 281101 282824
60495B82824N06m73j313j885j907j337m19N75J438J974K173K351K872L716M622
$$ 282824 283330 282857 281544 279659 277752 276415 275996 276571 278009 279983 282156 284507 287379 291095 295717
60480B95717N551O667P890Q933R834J1023J2624J4095J4809J4704J4071J2977
$$ 295717 301268 307935 315825 324758 334592 345615 358239 372334 387143 401847 415918 428895
60468D28895J1270Q944O222L330M78k039l954n236o006o363o395o231n886n214
$$ 428895 440165 449109 455331 458661 459139 457100 453146 447910 441904 435541 429146 422915 417029 411815
60454D11815m242l328k721k121j066L79J671K523L156L834M598N564P093R328
$$ 411815 407573 404245 401524 399403 398337 398716 400387 402910 406066 409900 414498 420062 427155 436483
60440D36483J1888J4223J6134J7749J9186K0473K1674K2768K3436K3179K1784
$$ 436483 448371 462594 478728 496477 515663 536136 557810 580578 604014 627193 648977
60429F48977J9530J6972J4538J2356J0349Q435O658N165M084L369K741J723j71
$$ 648977 668507 685479 700017 712373 722722 731157 737815 742980 747064 750433 753174 754897 754726
60416G54726l125o926j1199j5685k0172k4257k7398k9269k9908k9592k8621k7271
$$ 754726 751601 744675 733476 717791 697619 673362 645964 616695 586787 557195 528574 501303
60404E01303k5701k3912k1916j9934j8205j6654j5014j3338j1998j1086j0209
$$ 501303 475602 451690 429774 409840 391635 374981 359967 346629 334631 323545 313336
60393C13336r110q096p541p243o720n950n338n046m765m215l506k910k581k515
$$ 313336 304226 296130 288589 281346 274626 268676 263338 258292 253527 249312 245806 242896 240315 237800
60379B37800k533k299j646r13o49q94j197j323j534j967k216j922j404j241j438
$$ 237800 235267 232968 231322 230409 229760 228866 227669 226346 224812 222845 220629 218707 217303 216062 214624
60364B14624j489j165p89o84p79q49q39p80o59n01m29m81n28m64l52k77j77O1
$$ 214624 213135 211970 211181 210497 209718 208869 208030 207250 206591 206090 205661 205180 204652 204188 203836 203559 203382 203443
60346B03443L95O64P68P20N84M07K48J88K93M94N81L89J07J62P33J426J742J705
$$ 203443 203838 204502 205270 205990 206574 206981 207229 207417 207710 208204 208785 209174 209281 209443 210176 211602 213344 215049
60328B15049J751J978J965J443P87N55P72J044J126J103J069J019R98J044J010
$$ 215049 216800 218778 220743 222186 222973 223528 224300 225344 226470 227573 228642 229661 230659 231703 232713
60313B32713P32M04M09P56J034J011R32J030J091Q57N53O43J155J676J932K039
$$ 232713 233445 233849 234258 235014 236048 237059 237991 239021 240112 240969 241522 242165 243320 244996 246928 248967
60297B48967K145K194K173K301K777L485M141M582M777M646M136L412K824K554
$$ 248967 251112 253306 255479 257780 260557 264042 268183 272765 277542 282188 286324 289736 292560 295114
60283B95114K389J885Q03o29j902k666l006l235l533l800l859l624l133k514j960
$$ 295114 297503 299388 300191 299562 297660 294994 291988 288753 285220 281420 277561 273937 270804 268290 266330
60268B66330j603j424j357j454j727j937j774j335j101j265j359q39J82J097J591
$$ 266330 264727 263303 261946 260492 258765 256828 255054 253719 252618 251353 249994 249155 249337 250434 252025
60253B52025J910K374K972L538M047M599N316O289P458Q469Q911Q747Q321P843
$$ 252025 253935 256309 259281 262819 266866 271465 276781 283070 290528 298997 307908 316655 324976 332819
60239C32819P058N614L554J215j177l587n873p695q799r238r249q985q425p526
$$ 332819 339877 345491 349045 350260 349083 345496 339623 331928 323129 313891 304642 295657 287232 279706
60225B79706o439n495m930m612m214l634l124k939l033l182l238l122k762k207
$$ 279706 273267 267772 262842 258230 254016 250382 247258 244319 241286 238104 234866 231744 228982 226775
60211B26775j695j400j197r38p80r86j442j693j510j140q81o79l20J64N10N48
$$ 226775 225080 223680 222483 221545 220765 219779 218337 216644 215134 213994 213113 212434 212114 212278 212788 213336
60195B13336L83K65L88P30J049J070P81M61L49L61K37j15m91o07l35K29Q05J067
$$ 213336 213719 213984 214372 215102 216151 217221 218002 218463 218812 219173 219410 219295 218804 218197 217862 218091 218896 219963
60177B19963R21O74P87J353J900J843J188N51M57P86J075J207J465J897K058J593
$$ 219963 220884 221558 222345 223698 225598 227441 228629 229180 229637 230423 231498 232705 234170 236067 238125 239718
60161B39718Q58N34P91J218J500J727J945J912J590J474J998K816L172K879K444
$$ 239718 240576 241110 241901 243119 244619 246346 248291 250203 251793 253267 255265 258081 261253 264132 266576
60146B66576K229K019J582J185J195J461J555J378J189J104R64O85L85J11k12
$$ 266576 268805 270824 272406 273591 274786 276247 277802 279180 280369 281473 282437 283122 283507 283618 283406
60131B83406n01m83j39J49N6l01o23q07q61p13m31l83p76j189j039m08J01K53
$$ 283406 282905 282422 282283 282432 282488 282187 281564 280757 279896 279183 278752 278369 277593 276404 275365 274957 275058 275311
60113B75311M74J015J489J440J030P22N99M08O1k65n04p52j031j230j292j231
$$ 275311 275785 276800 278289 279729 280759 281481 282080 282488 282549 282284 281780 281028 279997 278767 277475 276244
60097B76244j023o89l96k64j49J27M63O07N98P31J103J500J746J908K066K136
$$ 276244 275221 274532 274136 273872 273723 273850 274313 274920 275518 276249 277352 278852 280598 282506 284572 286708
60081B86708K026J767J441J120R17R23J043J107J128J260J484J602J547J483J496
$$ 286708 288734 290501 291942 293062 293979 294902 295945 297052 298180 299440 300924 302526 304073 305556 307052
60066C07052J462J347J308J430J550J551J558J679J751J623J464J516J658J546
$$ 307052 308514 309861 311169 312599 314149 315700 317258 318937 320688 322311 323775 325291 326949 328495
60052C28495J150Q83J058J485J707J556J310J338J647J877J714J244P93N07K97
$$ 328495 329645 330528 331586 333071 334778 336334 337644 338982 340629 342506 344220 345464 346257 346764 347061
60037C47061R1p8k50n59r46j126j024r80j299j759j894j633j336j253j243j150
$$ 347061 347152 347074 346824 346265 345319 344193 343169 342189 340890 339131 337237 335604 334268 333015 331772 330622
60021C30622j152j540k280k984l305l296l301l595m091m469m496m221l877l667
$$ 330622 329470 327930 325650 322666 319361 316065 312764 309169 305078 300609 296113 291892 288015 284348
60007B84348l677l836l930l727l208k631k281k183k102j807j341j008j088j536
$$ 284348 280671 276835 272905 269178 265970 263339 261058 258875 256773 254966 253625 252617 251529 249993
59993B49993j950j974j643j280j033p65l48J08M17N27M99L98L22L23K91O1k65
$$ 249993 248043 246069 244426 243146 242113 241348 241000 241108 241525 242052 242551 242949 243271 243594 243885 243946 243681
59976B43681l61j70o9l69q35r82o65j50K13J77l56j131j535j239o96o36j148j660
$$ 243681 243320 243150 243081 242712 241877 240895 240230 240080 240293 240470 240114 238983 237448 236209 235513 234877 233729 232069
59958B32069j825j894k040j917j251m59k04n11p61n66k24k20n67q37o91j85L77
$$ 232069 230244 228350 226310 224393 223142 222683 222479 221968 221207 220641 220417 220197 219630 218793 218102 217917 218294
59941B18294P37Q04O62M56K78L8l84q77j049o24J51O72O00J94n6O9M07O82O84
$$ 218294 219031 219835 220497 220953 221231 221269 220885 220008 218959 218335 218486 219158 219758 219952 219896 219965 220372 221054 221738
59922B21738L56r1k69JM33N78L39j4k44l58m01l18r4J82M05N28M63J55k13l14
$$ 221738 222094 222003 221734 221735 222168 222746 223085 223071 222827 222469 222068 221750 221656 221838 222243 222771 223234 223389 223176 222862
59902B22862p5K04K36J13P8J30N3j90l46j92J46L25J68j54l43l06k07j98k03p5
$$ 222862 222787 222991 223227 223340 223418 223548 223601 223411 223065 222873 223019 223344 223512 223358 223015 222709 222502 222304 222101 222026
59882B22026J49K67J89M1l9o0j11j95k11l4L78R22J387J623J719J900K241K577
$$ 222026 222175 222442 222631 222672 222633 222573 222462 222267 222056 222022 222400 223322 224709 226332 228051 229951 232192 234769
59864B34769K764K888L115L434L631L558L307L137L187L340L320L003K561K254
$$ 234769 237533 240421 243536 246970 250601 254159 257466 260603 263790 267130 270450 273453 276014 278268
59850B78268K122J961J555Q63K1p10j031q46m23k08l65o83r12j012j034r36p14
$$ 278268 280390 282351 283906 284769 284790 284080 283049 282203 281780 281572 281207 280524 279612 278600 277566 276630 275916
59833B75916n20m69m03q8M67R78J251J328J316J225J038Q48Q06R68J216J336J221
$$ 275916 275396 274927 274524 274436 274903 275881 277132 278460 279776 281001 282039 282887 283693 284661 285877 287213 288434
59816B88434J015R99J236J487J485J267J082J011Q80N57J40j98l88m44l90k98
$$ 288434 289449 290448 291684 293171 294656 295923 297005 298016 298896 299453 299593 299395 299007 298563 298173 297875
59800B97875k88l54l31j29P8P5j04k32k12j23%K19N62R60J410J957K480K689K440
$$ 297875 297587 297233 296902 296773 296851 296926 296822 296590 296378 296255 296255 296474 297036 297996 299406 301363 303843 306532 308972
59781C08972J929J423R67M44j61o77r41q89n52j17R3j90r66j940k717k994k792
$$ 308972 310901 312324 313291 313735 313574 312897 311956 311067 310515 310398 310491 310301 309335 307395 304678 301684 298892
59764B98892k453k316k316k114j696j485j654j699j122k38J59j20m77m27j69j39
$$ 298892 296439 294123 291807 289693 287997 286512 284858 283159 282037 281799 281958 281838 281361 280934 280765 280626
59748B80626m32q76j357j748j868j677j407j299j384j586j790j779j446j128j327
$$ 280626 280194 279318 277961 276213 274345 272668 271261 269962 268578 266992 265202 263423 261977 260849 259522
59733B59522j946k260j860j220r49r68q52o44o97r67j048q44o83p49q45q09p42
$$ 259522 257576 255316 253456 252236 251287 250319 249467 248823 248126 247159 246111 245267 244584 243835 242990 242181 241439
59716B41439p30o95o03m73k14L19J006J500J651J595J491J362J283J378J529J465
$$ 241439 240709 240014 239411 238938 238724 239043 240049 241549 243200 244795 246286 247648 248931 250309 251838 253303
59700B53303J146Q90R70J336J779K178K441K480K281J918J467J041Q52R86J150
$$ 253303 254449 255339 256309 257645 259424 261602 264043 266523 268804 270722 272189 273230 274082 275068 276218
59685B76218R72M96J00r0l05o37q22p03n20n59p36q07p33o39o05o61q38j047j049
$$ 276218 277190 277686 277786 277696 277391 276754 275932 275229 274709 274150 273414 272607 271874 271235 270630 269969 269131 268084 267035
59666B67035p10k38J4j27n27q45p29j53M46O10M28M03P17R80Q91P01P80J092J386
$$ 267035 266325 266087 266101 265974 265447 264602 263873 263720 264166 264776 265204 265607 266324 267304 268195 268896 269676 270768 272154
59647B72154J671K052K382K446K388K537K856K998K880K822L022L249L237L076
$$ 272154 273825 275877 278259 280705 283093 285630 288486 291484 294364 297186 300208 303457 306694 309770
59633C09770L012L016K814K240J395M67m16j128j522j555j409j337j416j494j421
$$ 309770 312782 315798 318612 320852 322247 322714 322298 321170 319648 318093 316684 315347 313931 312437 311016
59618C11016j256j175j308j642k071k376k313j857j328j124j291j460j231n49
$$ 311016 309760 308585 307277 305635 303564 301188 298875 297018 295690 294566 293275 291815 290584 290035
59604B90035K65P84Q13N92O07J092J773K163K089J791J610J674J808J657J043
$$ 290035 290300 291084 291897 292489 293096 294188 295961 298124 300213 302004 303614 305288 307096 308753 309796
59589C09796K66j01J4m0q35k043k879l174l414l811l958l571l036k868l071l329
$$ 309796 310062 309961 309975 309935 309100 307057 304178 301004 297590 293779 289821 286250 283214 280346 277275 273946
59573B73946l493l514l224k543j791j466j721k245k616k647k473k373k448k486
$$ 273946 270453 266939 263715 261172 259381 257915 256194 253949 251333 248686 246213 243840 241392 238906
59559B38906k294k055k089k289k229j805j421j378j470j420j287j199j035o56
$$ 238906 236612 234557 232468 230179 227950 226145 224724 223346 221876 220456 219169 217970 216935 216279
59545B16279k10O8J59J31k0j77q5K67N39N32M90N68M63o0o26p23m58l12l74l40
$$ 216279 216069 216137 216296 216427 216407 216230 216145 216412 216951 217483 217973 218541 219004 218944 218318 217595 217137 216825 216451 216111
59525B16111j70j44l29m88n59p59j108j294j154r14q11p66o31m60m15n17o36o23
$$ 216111 215941 215797 215468 214980 214421 213662 212554 211260 210106 209192 208381 207615 206984 206524 206109 205592 204956 204333
59507B04333m34j85r3k35l97l20k0K60L85M04L95M28O04R28J164J089Q40P99J143
$$ 204333 203899 203714 203621 203386 202989 202669 202649 202909 203294 203698 204093 204521 205125 206053 207217 208306 209146 209945 211088
59488B11088J661K069K283K388K475K634K958L474M096M668N075N406N866O349
$$ 211088 212749 214818 217101 219489 221964 224598 227556 231030 235126 239794 244869 250275 256141 262490
59474B62490O180M686K110l27j587j661j195o22p8K49K16M0M2J58J05m1M0K52
$$ 262490 268670 273356 275466 275139 273552 271891 270696 270074 269996 270245 270461 270501 270543 270701 270806 270765 270805 271057
59456B71057J9r17k060k684k611k256k140k468l063l543l618l290k794k387k204
$$ 271057 271076 270159 268099 265415 262804 260548 258408 255940 252877 249334 245716 242426 239632 237245 235041
59441B35041k232k289k171j863j537j253q97n17l77n27n91k81J66L53K99K96M05
$$ 235041 232809 230520 228349 226486 224949 223696 222799 222282 221905 221378 220787 220506 220672 221025 221324 221620 222025
59424B22025N07O78J101J678K093K209K107J859J555J399J419J291P65J34j50
$$ 222025 222532 223210 224311 225989 228082 230291 232398 234257 235812 237211 238630 239921 240686 240820 240670
59409B40670j15j04j53m2K08L87N88R99J383J331R97R63J306J527J436J471J886
$$ 240670 240555 240451 240298 240256 240464 240851 241439 242438 243821 245152 246149 247112 248418 249945 251381 252852 254738
59392B54738K313K446K520K769K868K411J567Q27L63j7m28p93j027j124j147j233
$$ 254738 257051 259497 262017 264786 267654 270065 271632 272459 272822 272805 272377 271584 270557 269433 268286 267053
59376B67053j422j493j177o25l04l49l68m5M56Q52J163J505J800J945K113K568
$$ 267053 265631 264138 262961 262336 262032 261683 261315 261270 261726 262578 263741 265246 267046 268991 271104 273672
59360B73672L325M176M934N528N942O235O542O995P649Q339Q490P331M694J468
$$ 273672 276997 281173 286107 291635 297577 303812 310354 317349 324998 333337 341827 349158 353852 355320
59346C55320j136k663l401l530k909j634j17J424K871L564K618K04k245l592m126
$$ 355320 354184 351521 348120 344590 341681 340047 339930 341354 344225 347789 350407 350611 348366 344774 340648
59331C40648m645n169n186m711m208l765l021j937r28k97P0L62O15P91Q27O61
$$ 340648 336003 330834 325648 320937 316729 312964 309943 308006 307078 306781 306851 307213 307828 308619 309446 310107
59315C10107M16M61R65J561J745J485J140R55Q95R07R96J116J214J337J480J494
$$ 310107 310523 310984 311949 313510 315255 316740 317880 318835 319730 320637 321633 322749 323963 325300 326780 328274
59299C28274J319J137J148J309J547J949K530L010L159L148L301L601L818L960
$$ 328274 329593 330730 331878 333187 334734 336683 339213 342223 345382 348530 351831 355432 359250 363210
59285C63210M281M840N352N463N051M302L587L147K791K123J158L85J14K7l32
$$ 363210 367491 372331 377683 383146 388197 392499 396086 399233 402024 404147 405305 405690 405804 405831 405499
59270D05499r95j736k480l218l779m070m262m464m453m119l847m052m539m804
$$ 405499 404504 402768 400288 397070 393291 389221 384959 380495 376042 371923 368076 364024 359485 354681
59256C54681m746m651m640m604m554m543m399l960l489l382l532l465l037k528
$$ 354681 349935 345284 340644 336040 331486 326943 322544 318584 315095 311713 308181 304716 301679 299151
59242B99151k049j400n15L91J221K092K962L576L873M070M204L964L066J558l31
$$ 299151 297102 295702 295187 295578 296799 298891 301853 305429 309302 313372 317576 321540 324606 326164 325833
59227C25833k283l851m656m774m625m400l926l127k283j621j027l67K09N28P60
$$ 325833 323550 319699 315043 310269 305644 301244 297318 294191 291908 290287 289260 288893 289102 289630 290390
59212B90390J247K037K798L202L257L261L415L563L314K511J431M90j47n35p32
$$ 290390 291637 293674 296472 299674 302931 306192 309607 313170 316484 318995 320426 320916 320769 320234 319502
59197C19502q25r61j196j331j183q88p01o88p92j065j487j731j489q79k68K34
$$ 319502 318677 317716 316520 315189 314006 313118 312417 311729 310937 309872 308385 306654 305165 304286 304018 304252
59181C04252O74R02P15L25J77L12L92L53N21R85J348J325J093Q96O48K10k85o33
$$ 304252 304926 305828 306543 306868 307045 307357 307749 308102 308623 309608 310956 312281 313374 314270 314918 315128 314843 314210
59163C14210q15q98q88q70j035j409j763j943k032k094k047j901j861j974j980
$$ 314210 313395 312497 311609 310739 309704 308295 306532 304589 302557 300463 298416 296515 294654 292680 290700
59148B90700j684j263j041j109j344j557j506j020k83K50L64L37N17Q73J198J422
$$ 290700 289016 287753 286712 285603 284259 282702 281196 280176 279893 280143 280507 280844 281361 282234 283432 284854
59132B84854J520J400J087Q92J060J479J916K328K645K598K070J489J360J550
$$ 284854 286374 287774 288861 289753 290813 292292 294208 296536 299181 301779 303849 305338 306698 308248
59118C08248J485R99N36M14L90J23l26o97q93r00n71J04O87O62Q0m42m69k39k73
$$ 308248 309733 310732 311268 311682 312072 312195 311869 311172 310279 309379 308808 308912 309599 310261 310341 309899 309430 309191 308918
59099C08918p53j464k141k661k905k776k391k095k124k368k547k600k733l079
$$ 308918 308165 306701 304560 301899 298994 296218 293827 291732 289608 287240 284693 282093 279360 276281
59085B76281l435l459l096k700k608k692k540k049j603j535j685j675j416j063
$$ 276281 272846 269387 266291 263591 260983 258291 255751 253702 252099 250564 248879 247204 245788 244725
59071B44725o46j43K23K06P3L75J158J849K104K280K798L527M155M689N186N393
$$ 244725 244079 243936 244159 244365 244438 244813 245971 247820 249924 252204 255002 258529 262684 267373 272559 277952
59055B77952N115M745M816N252N535N464N283N111M812M378L994L653L172K587
$$ 277952 283067 287812 292628 297880 303415 308879 314162 319273 324085 328463 332457 336110 339282 341869
59041C41869K178J991J761J328P77J40o38j376j708j580j366j325j353j314j326
$$ 341869 344047 346038 347799 349127 349904 350044 349406 348030 346322 344742 343376 342051 340698 339384 338058
59026C38058j532j873k289k796l305l616l726l843l993l945l674l539l748l999
$$ 338058 336526 334653 332364 329568 326263 322647 318921 315078 311085 307140 303466 299927 296179 292180
59012B92180l919l572l248k996k703k457k448k554k378j769j070p59r88j509j983
$$ 292180 288261 284689 281441 278445 275742 273285 270837 268283 265905 264136 263066 262307 261319 259810 257827
58997B57827k261k367k281j851j064k32K44L10K70L13L16J24j42k53j55L5K32
$$ 257827 255566 253199 250918 249067 248003 247771 248015 248325 248595 248908 249224 249348 249206 248953 248798 248833 249065
58980B49065M68P58J043J232J333J467J723J969J960J717J590J817K198K412K533
$$ 249065 249533 250291 251334 252566 253899 255366 257089 259058 261018 262735 264325 266142 268340 270752 273285
58965B73285K912L615M337M871N316N756N975N694M927M000L261K769K245J413
$$ 273285 276197 279812 284149 289020 294336 300092 306067 311761 316688 320688 323949 326718 328963 330376
58951C30376M56r4k5J60o6m96n22q4K31O4k68l11j7L98P35P58K94m83j087j293
$$ 330376 330832 330738 330713 330873 330807 330311 329789 329705 329936 330000 329732 329421 329404 329802 330537 331295 331589 331106 330019 328726
58931C28726j360j594j995k451k911l160k871k113j540j621j994j930j272n13
$$ 328726 327366 325772 323777 321326 318415 315255 312384 310271 308731 307110 305116 303186 301914 301401
58917C01401r0M9J39K87N54J064J821K553K910K821K569K459K507K499K348K149
$$ 301401 301311 301360 301499 301786 302340 303404 305225 307778 310688 313509 316078 318537 321044 323543 325891 328040
58901C28040J961J683J276Q80N48O6p31j651k385k869l189l267l051k821k955
$$ 328040 330001 331684 332960 333840 334388 334454 333723 332072 329687 326818 323629 320362 317311 314490 311535
58886C11535l433l925m231m301l979l173k191j490j128q99q17r99j171r57o04
$$ 311535 308102 304177 299946 295645 291666 288493 286302 284812 283684 282785 281968 280969 279798 278841 278237
58871B78237p31j316j645j399j054r52p88l57j42n86j317j661j501j141p24k74
$$ 278237 277506 276190 274545 273146 272092 271140 270352 269995 269853 269267 267950 266289 264788 263647 262923 262649
58855B62649K5R0K17O06R43R12Q30J239K058K705K931L021L236L469L524L350
$$ 262649 262674 262764 262981 263587 264530 265442 266272 267511 269569 272274 275205 278226 281462 284931 288455 291805
58839B91805L033K790K917L458M055M359M493M789N222N462N387N207N114N094
$$ 291805 294838 297628 300545 304003 308058 312417 316910 321699 326921 332383 337770 342977 348091 353185
58825C53185N084N069M963M632M024L208K315J554J128J011Q94N20q4q01j614
$$ 353185 358269 363338 368301 372933 376957 380165 382480 384034 385162 386173 387067 387587 387503 386702 385088
58810C85088k435k988l069k848k655k655k822l078l297l354l369l682m348m927
$$ 385088 382653 379665 376596 373748 371093 368438 365616 362538 359241 355887 352518 348836 344488 339561
58796C39561m976m590m193m004l971m059m244m372m280m029l802l664l584l613
$$ 339561 334585 329995 325802 321798 317827 313768 309524 305152 300872 296843 293041 289377 285793 282180
58782B82180l774l903l750l274k661k140j839j745j736j753j855k026j978j508
$$ 282180 278406 274503 270753 267479 264818 262678 260839 259094 257358 255605 253750 251724 249746 248238
58768B48238r33p96j068j166q13l98k42j16K41O01P04P48R44R93N69K0n3L22N62
$$ 248238 247305 246509 245441 244275 243462 243064 242822 242706 242947 243548 244252 245000 245944 246937 247506 247526 247473 247795 248357
58749B48357M24K06J06o1m37q53j170j471j771j834j505j071j001j377j758j694
$$ 248357 248781 248987 249093 249032 248595 247742 246572 245101 243330 241496 239991 238920 237919 236542 234784 233090
58733B33090j276j011j098j124o66M1M30M21M60P82J160J409J641J919K138K344
$$ 233090 231814 230803 229705 228581 227915 227956 228386 228807 229267 230049 231209 232618 234259 236178 238316 240660
58717B40660K701L031K896K275J616J085M11l73q02q29j027j602j983j855j788
$$ 240660 243361 246392 249288 251563 253179 254264 254675 254302 253500 252671 251644 250042 248059 246204 244416
58702B44416k200k520k157j567j472j629j327o80l81m92m72k24j33j72P7N16N71
$$ 244416 242216 239696 237539 235972 234500 232871 231544 230864 230483 229991 229519 229295 229162 228990 229067 229583 230154
58685B30154K05P0M79J014J346J717K395L131L503L425L151L057L410M092M590
$$ 230154 230359 230429 230908 231922 233268 234985 237380 240511 244014 247439 250590 253647 257057 261149 265739
58670B65739M560M234L932L517K759J986J665J612J269O75M20P05J125J423J764
$$ 265739 270299 274533 278465 281982 284741 286727 288392 290004 291273 291948 292368 293073 294198 295621 297385
58655B97385K144K190J744J153P36M08p8q22j795k815l539l811l947m355m990
$$ 297385 299529 301719 303463 304616 305352 305760 305682 304860 303065 300250 296711 292900 288953 284598 279608
58640B79608n577o131o783p316p413p171o841o294n329m325l830l663l180k352
$$ 279608 274031 267900 261117 253801 246388 239217 232376 226082 220753 216428 212598 208935 205755 203403
58626B03403j808j832k093k361k676k772k179j073l00k47l89k01J39K63K24K62
$$ 203403 201595 199763 197670 195309 192633 189861 187682 186609 186309 186062 185673 185472 185611 185874 186098 186360
58610A86360M30P38J245J855K340K684K988L097K802K388K317K400J905O68o39
$$ 186360 186790 187528 188773 190628 192968 195652 198640 201737 204539 206927 209244 211644 213549 214217 213578
58595B13578j426j778j901j755j439j361j652j970k084k144k205k004j487j028
$$ 213578 212152 210374 208473 206718 205279 203918 202266 200296 198212 196068 193863 191859 190372 189344
58581A89344q28o48l24q9j11k08k44l27m33l12J3J86J08P6J85J57l0N5N69J051
$$ 189344 188516 187868 187544 187455 187344 187136 186892 186565 186132 185820 185833 186019 186127 186203 186388 186545 186515 186570 187139 188190
58561A88190J071P78M75K24N8J29L38L21M4r6N8J64Q7J77N93Q89P40N05O52R69
$$ 188190 189261 190039 190514 190738 190796 190925 191263 191584 191628 191532 191590 191754 191841 192018 192611 193500 194240 194745 195397 196366
58541A96366R15M15q6j64K68R51J419J360R91P93R12J175J595K289K964L144L022
$$ 196366 197281 197696 197610 197446 197714 198665 200084 201444 202435 203228 204140 205315 206910 209199 212163 215307 218329
58524B18329L295M016M383L961L378L329L650L793L631L320K860K359K230K652
$$ 218329 221624 225640 230023 233984 237362 240691 244341 248134 251765 255085 257945 260304 262534 265186
58510B65186L274L781M357N181N961O386O660P132P705Q063Q130P995P669P180
$$ 265186 268460 272241 276598 281779 287740 294126 300786 307918 315623 323686 331816 339811 347480 354660
58496C54660O641N975M958L596K170P78o55j870k407k425k643l324l946m200m494
$$ 354660 361301 367276 372234 375830 378000 378778 378123 376253 373846 371421 368778 365454 361508 357308 352814
58481C52814n138n739n932o036o472p067p438p559p468o996o193n527n168m697
$$ 352814 347676 341937 336005 329969 323497 316430 308992 301433 293965 286969 280776 275249 270081 265384
58467B65384l873l118k767k452j831j271j191j294j094p40o65q52j075j394j841
$$ 265384 261511 258393 255626 253174 251343 250072 248881 247587 246493 245753 245088 244236 243161 241767 239926
58452B39926j992j503p91n25p41r52r29p98o81o66q52j069q68j94L60L59J16J29
$$ 239926 237934 236431 235640 235115 234374 233422 232493 231695 231014 230348 229496 228427 227559 227365 227725 228084 228200 228329
58434B28329L44M79O09R03J203J335J529K042K693L197L585L924M045L901L834
$$ 228329 228673 229152 229761 230664 231867 233202 234731 236773 239466 242663 246248 250172 254217 258118 261952
58419B61952M083M463M774N021M966M128K643J414R82Q35L32m28j149j940k740
$$ 261952 266035 270498 275272 280293 285259 289387 292030 293444 294426 295261 295593 295165 294016 292076 289336
58404B89336k965k421j876j910j901j097J0L94Q6J4N27J140J532J863K126J996
$$ 289336 286371 283950 282074 280164 278263 277166 277176 277570 277656 277670 278197 279337 280869 282732 284858 286854
58388B86854J403O48m3o57j157j532j855k009j692j031o90r48j207q79k44J62
$$ 286854 288257 288905 288862 288205 287048 285516 283661 281652 279960 278929 278239 277291 276084 275205 274961 275123
58372B75123M28R17J526J956K272K634K834K742K726L102L557L659L449L066K343
$$ 275123 275551 276468 277994 279950 282222 284856 287690 290432 293158 296260 299817 303476 306925 309991 312334
58357C12334J334N44J51l82j298j936j837j618j928k321k078j488j259j300j102
$$ 312334 313668 314212 314363 313981 312683 310747 308910 307292 305364 303043 300965 299477 298218 296918 295816
58342B95816p62o49m86J66R41J169R83R87J216J294J233J229J055N25J09K38M78
$$ 295816 295054 294405 293919 294085 295026 296195 297178 298165 299381 300675 301908 303137 304192 304717 304826 305064 305542
58325C05542K83qJ68M84L12q9l0M09O95R03J417J966K039J899K155K657K831K795
$$ 305542 305825 305817 305985 306469 306781 306692 306662 307071 307766 308669 310086 312052 314091 315990 318145 320802 323633 326428
58307C26428L093L628L873L853L988M218M194M049M100M163L914L586L493L385
$$ 326428 329521 333149 337022 340875 344863 349081 353275 357324 361424 365587 369501 373087 376580 379965
58293C79965K995K710K861L020K838K811L318L740L544L320L694M113L913L698
$$ 379965 382960 385670 388531 391551 394389 397200 400518 404258 407802 411122 414816 418929 422842 426540
58279D26540M257N053N205N115N569O078N760N151N366O091O136N472M979M682
$$ 426540 430797 435850 441055 446170 451739 457817 463577 468728 474094 480185 486321 491793 496772 501454
58265E01454L986L247L290L759L681L311L671M549M806M413M445N146N681N746
$$ 501454 505440 508687 511977 515736 519417 522728 526399 530948 535754 540167 544612 549758 555439 561185
58251E61185N883O268O618P057P826Q456Q532Q706R548J0231R880R342R823J0657
$$ 561185 567068 573336 579954 587011 594837 603293 611825 620531 630079 640310 650190 659532 669355 680012
58237F80012J0416R445R146R518R542R425J0123J1202J1480J1313J1939J3030
$$ 680012 690428 699873 709019 718537 728079 737504 747627 758829 770309 781622 793561 806591
58225H06591J3278J2931J3338J4429J5104J5618J7072J8953J9834K0068K1153
$$ 806591 819869 832800 846138 860567 875671 891289 908361 927314 947148 967216 988369
58214I88369K2813K3543K3649K4789K6823K8073K8523K9739L1721L2978L3581
$$ 988369 1011182 1034725 1058374 1083163 1109986 1138059 1166582 1196321 1228042 1261020 1294601
58203A294601L5064L7289L8624L9169M0598M2794M3986M4253M5508M7918M9828
$$ 1294601 1329665 1366954 1405578 1444747 1485345 1528139 1572125 1616378 1661886 1709804 1759632
58192A759632N1309N4269N8808O3088O6995P2258P8719Q4334Q9137R5361J03329
$$ 1759632 1810941 1865210 1924018 1987106 2054101 2126359 2205078 2289412 2378549 2473910 2577239
58181B577239J11133J18616J27468J37158J45125J51406J58662J67344J75449
$$ 2577239 2688372 2806988 2934456 3071614 3216739 3368145 3526807 3694151 3869600
58172C869600J83321J93657K06279K18153K29226K42773K59234K75391K90588
$$ 3869600 4052921 4246578 4452857 4671010 4900236 5143009 5402243 5677634 5968222
58163E968222L07817L27624L47061L65958L87813M13180M38841M64995M96202
$$ 5968222 6276039 6603663 6950724 7316682 7704495 8117675 8556516 9021511 9517713
58154I517713N33500N72931O13670O59778P11949P66014Q22139Q86857R63621
$$ 9517713 10051213 10624144 11237814 11897592 12609541 13375555 14197694 15084551 16048172
58145A6048172J050800J151521J274674J422548J588725J772318J982859K227959
$$ 16048172 17098972 18250493 19525167 20947715 22536440 24308758 26291617 28519576
58137B8519576K510332K841030L237825L702270M214488M757721N330482N933575
$$ 28519576 31029908 33870938 37108763 40811033 45025521 49783242 55113724 61047299
58129F1047299O574946P280062Q011964Q510526Q272508O845874M240209J029331
$$ 61047299 67622245 74902307 82914271 91424797 99697305 106543179 110783388 111812719
58121A11812719j994963m286865n721197o437214o618754o413897n965201n432886
$$ 111812719 109817756 105530891 99809694 93372480 86753726 80339829 74374628 68941742
58113F8941742m964840m643609m458761m334154m193997m009256l787314l537111
$$ 68941742 63976902 59333293 54874532 50540378 46346381 42337125 38549811 35012700
58105C5012700l260925k969196k680536k405411k144024j900389j684651j499886
$$ 35012700 31751775 28782579 26102043 23696632 21552608 19652219 17967568 16467682
58097A6467682j338746j195499j071024r64247q69029p82454p07390o44141n87464
$$ 16467682 15128936 13933437 12862413 11898166 11029137 10246683 9539293 8895152 8307688
58088H307688n34307m87112m47029m10675l76024l45146l18852k94410k70735
$$ 8307688 7773381 7286269 6839240 6428565 6052541 5707395 5388543 5094133 4823398
58079D823398k50174k33301k17215k00864j86831j76111j66135j55689j46899
$$ 4823398 4573224 4339923 4122708 3921844 3735013 3558902 3392767 3237078 3090179
58070C090179j40469j33815j25760j18555j13332j07969j01345r5494r1599q7836
$$ 3090179 2949710 2815895 2690135 2571580 2458248 2350279 2248934 2153440 2061841 1974005
58060A974005q3154p9247p6905p4142o9897o6007o3571o0832n6710n3015n1089
$$ 1974005 1890851 1811604 1734699 1660557 1590660 1524653 1461082 1400250 1343540 1290525 1239436
58049A239436m9377m6408m3327m1431l9856l7675l5804l4971l4131l2578l1305
$$ 1239436 1190059 1143651 1100324 1058893 1019037 981362 945558 910587 876456 843878 812573
58038H12573l0829k9967k8207k6887k6614k5931k3976k2135k1506k1078j9915
$$ 812573 781744 751777 723570 696683 670069 644138 620162 598027 576521 555443 535528
58027E35528j8936j8884j8704j7513j6257j5875j5704j5086j4710j4944j4729
$$ 535528 516592 497708 479004 461491 445234 429359 413655 398569 383859 368915 354186
58016C54186j3515j2457j2330j2109j0947r794r596r628q990q193p841p330o196
$$ 354186 340671 328214 315884 303775 292828 283034 273438 263810 254820 246627 238786 231456 225260
58003B25260n244n077m962m326l916m283m616m265l918m109m102l403k872l157
$$ 225260 220016 214939 209977 205651 201735 197452 192836 188571 184653 180544 176442 173039 170167 167010
57989A67010l448l014k532k694k931k700k623l113l307k601j934k244k895k937
$$ 167010 163562 160548 158016 155322 152391 149691 147068 143955 140648 138047 136113 133869 130974 128037
57975A28037k672k781l018k968k990l312l295k642k185k491k858k716k661l078
$$ 128037 125365 122584 119566 116598 113608 110296 107001 104359 102174 99683 96825 94109 91448 88370
57961H8370l139k307j515j557j713j245r18j552k299j982j067p76j067j066p15
$$ 88370 85231 82924 81409 79852 78139 76894 75976 74424 72125 70143 69076 68300 67233 66167 65452
57946F5452n17l34J92O36M32n2j93j80l59k63N10J235J060L71J1j41o43j213j214
$$ 65452 64935 64601 64793 65429 65861 65809 65616 65436 65077 64814 65324 66559 67619 67990 68001 67860 67217 66004 64790
57927F4790q52p71r17q86q86j304j829j957j836j763j461p74l61p11j175r86n28
$$ 64790 63938 63167 62250 61364 60478 59174 57345 55388 53552 51789 50328 49554 49193 48482 47307 46321 45793
57910D5793n69q60o52n9K42J64J4k79p71q78k01N46M37k50o07n79p69j203j360
$$ 45793 45224 44364 43712 43653 43895 44059 44073 43794 43023 42145 41944 42490 42927 42677 42070 41491 40722 39519 38159
57891C8159j142q48m82M2L28K9l88k71K26N42O94R81J204J077R47J289J856K180
$$ 38159 37017 36169 35687 35729 36057 36086 35698 35427 35653 36195 36889 37870 39074 40151 41098 42387 44243 46423
57873D6423K427K911L227K813J963J355J027O47L63M20M08j60q99j136j052j228
$$ 46423 48850 51761 54988 57801 59764 61119 62146 62793 63156 63576 63984 63824 62925 61789 60737 59509
57857E9509j537j420r86p93q44p32n02m46l59R3N37M07l9j96k12o03j100r83m13
$$ 59509 57972 56552 55566 54773 53929 53197 52695 52249 51890 51983 52520 52927 52888 52692 52480 51877 50777 49794 49381
57838D9381k66p39j144j117j009j069j124j181j489j942k089j771j197m99K16
$$ 49381 49115 48376 47232 46115 45106 44037 42913 41732 40243 38301 36212 34441 33244 32745 32961
57823C2961N54L02p4j2K71K31p6k54l90p67j092r00m35k48k01J70N76L40l64p02
$$ 32961 33515 33817 33743 33731 34002 34233 34157 33903 33513 32746 31654 30754 30319 30071 29870 30040 30616 30956 30592 29890
57803B9890m76k41j66J53P25J054J099J321J721J708J147N96L71J64k13m83n09
$$ 29890 29414 29173 29007 29160 29885 30939 32038 33359 35080 36788 37935 38531 38902 39066 38853 38370 37861
57786C7861n32o10n26l45m22p88j109j360j778k188k066j458j055j240j670j951
$$ 37861 37329 36719 36193 35848 35426 34638 33529 32169 30391 28203 26137 24679 23624 22384 20714 18763
57770A8763k068k015j654j090o81n27m20l34m20n75n22l32k90l25j44J42J82N7
$$ 18763 16695 14680 13026 11936 11255 10728 10308 9974 9554 8979 8457 8125 7835 7510 7366 7508 7690 7747
57752G747J27L23K47q5l37n62j043j504j369q05o09r46I3e57j38o2k40l30l58
$$ 7747 7874 8197 8444 8359 8022 7460 6417 4913 3544 2739 2130 1184 93 -557 -695 -757 -997 -1327 -1685
57733a685l49j07L46O17e83D9R06J074R12P01P37R09J024J118J220J212J133J196
$$ -1685 -2034 -2141 -1795 -1178 -583 49 955 2029 2941 3642 4379 5288 6312 7430 8650 9862 10995 12191
57715A2191J373J332R83O65O34P41O96L76k06q63j235j132q78q70r98r40q61j159
$$ 12191 13564 14896 15879 16544 17178 17919 18615 18991 18785 17922 16687 15555 14677 13807 12809 11869 11008 9849
57697I849j699j916j715j516A499F1a220j302j448j337r09n21k66J12N45O05K40
$$ 9849 8150 6234 4519 3003 1499 61 -1220 -2522 -3970 -5307 -6216 -6737 -7003 -6891 -6346 -5741 -5501
57680e501r0j56j76j87P7N22O17K63L5L20P59Q90P78O65N73a57B18K57q4i8n94
$$ -5501 -5591 -5747 -5923 -6110 -6033 -5511 -4894 -4631 -4596 -4276 -3517 -2627 -1849 -1184 -611 -157 218 475 391 -98 -692
57659f92m53n12q78j109r95q36q84r85j057j245j483j427j092r25j046j092r09
$$ -692 -1145 -1657 -2535 -3644 -4639 -5475 -6359 -7344 -8401 -9646 -11129 -12556 -13648 -14573 -15619 -16711 -17620
57642a7620p98q32o84l57l24o04n22J62O52K56n45q22m53k1J70K76L97M61M76
$$ -17620 -18418 -19250 -19934 -20291 -20615 -21219 -21741 -21579 -20927 -20671 -21216 -22038 -22491 -22512 -22342 -22066 -21669 -21208 -20732
57623b0732M77M29M08O57J205J743K109K557L316c571A691O476P908R261J0350
$$ -20732 -20255 -19826 -19418 -18761 -17556 -15813 -13704 -11147 -7831 -3571 1691 8167 16075 25336 35686
57608C5686J1367J2409J3141J3200J2475J0724P511K955j912o001r043j1224j2479
$$ 35686 47053 59462 72603 85803 98278 109002 116513 119468 117556 111555 102512 91288 78809
57595G8809j2665j2097j1335j0535r507q240p005A398c914m769m178l405k601
$$ 78809 66144 54047 42712 32177 22670 14430 7425 1398 -3914 -8683 -12861 -16266 -18867
57582a8867k083j840j472q15k59k50p58j430j962k134j831j238p56n28l68k75
$$ -18867 -20950 -22790 -24262 -25077 -25336 -25586 -26344 -27774 -29736 -31870 -33701 -34939 -35695 -36223 -36591 -36866
57566c6866n59j304k113k590k673k363j665r53q16j241j494j158p20p39r96r92
$$ -36866 -37425 -38729 -40842 -43432 -46105 -48468 -50133 -51086 -51902 -53143 -54637 -55795 -56515 -57254 -58250 -59242
57550e9242p85p37q45q64p99p97p62n52l36l35m45m91n45o85o98m68k83m09o34
$$ -59242 -60027 -60764 -61609 -62473 -63272 -64069 -64831 -65383 -65719 -66054 -66499 -66990 -67535 -68220 -68918 -69386 -69669 -70078 -70712
57531g0712o65o59r04j258j375j253j142j056q57o08m79l81j81k5j46m18n00l32
$$ -70712 -71377 -72036 -72940 -74198 -75573 -76826 -77968 -79024 -79881 -80489 -80968 -81349 -81530 -81555 -81701 -82119 -82619 -82951
57513h2951j32o5j70m84r14j168j073q64q43r44q96o57l70j03J26J57j72p64j301
$$ -82951 -83083 -83148 -83318 -83802 -84716 -85884 -86957 -87821 -88664 -89608 -90504 -91161 -91531 -91634 -91508 -91351 -91523 -92287 -93588
57494i3588j503j269p41l08k46l56k47J9Rk89l50KK44l9n22p37p66q83r59p80
$$ -93588 -95091 -96360 -97101 -97409 -97655 -98011 -98258 -98239 -98230 -98519 -98869 -98867 -98623 -98662 -99184 -99921 -100687 -101570 -102529 -103309
57474a03309m93l10j15J74K14j96o02n11j95k46o10p30m53j39L7K22M44N43N61
$$ -103309 -103802 -104112 -104227 -104053 -103839 -104035 -104637 -105148 -105343 -105589 -106199 -106929 -107382 -107521 -107484 -107262 -106818 -106275 -105714
57455a05714P13R44R99R39J127J707K374K731K606K092J511J244J372J583J590
$$ -105714 -105001 -104057 -103058 -102119 -100992 -99285 -96911 -94180 -91574 -89482 -87971 -86727 -85355 -83772 -82182
57440h2182J440J249R35N11K66L15L36M8l41n73q28j280j594j388r56q41r53p16
$$ -82182 -80742 -79493 -78558 -78047 -77781 -77466 -77130 -77082 -77423 -77996 -78824 -80104 -81698 -83086 -84042 -84883 -85836 -86552
57422h6552l0N83P17M42j8m70o77n40l36l35l14P7O66R65R48J006J223J252R40
$$ -86552 -86582 -85999 -85282 -84840 -84858 -85328 -86005 -86545 -86881 -87216 -87530 -87453 -86787 -85822 -84874 -83868 -82645 -81393 -80453
57403h0453N55K83J1k88m18l11j98k66m75p47j021j131r10m83k01k16l71m69m26
$$ -80453 -79898 -79615 -79604 -79892 -80310 -80621 -80819 -81085 -81560 -82307 -83328 -84459 -85369 -85852 -86053 -86269 -86640 -87109 -87535
57384h7535k03J53M52N28M14K22L5K9M02R54J099O10P7J29N85Q47Q05P77P58M43
$$ -87535 -87738 -87585 -87133 -86605 -86191 -85969 -85934 -85905 -85503 -84549 -83450 -82840 -82763 -82634 -82049 -81202 -80397 -79620 -78862 -78419
57364g8419j11m70m74l80l10j08J70J80j82n32m75k1N52R77J165J260J491J793
$$ -78419 -78530 -79000 -79474 -79854 -80164 -80272 -80102 -79922 -80104 -80636 -81111 -81132 -80580 -79603 -78438 -77178 -75687 -73894
57346g3894J763J256P31O89R94J179J177J240J400J481J511J583J507J086O62
$$ -73894 -72131 -70875 -70144 -69455 -68461 -67282 -66105 -64865 -63465 -61984 -60473 -58890 -57383 -56297 -55635
57331e5635P16J096J241J085J080J356J506J297R91Q58Q80J032J339J552J332
$$ -55635 -54919 -53823 -52582 -51497 -50417 -49061 -47555 -46258 -45267 -44409 -43529 -42497 -41158 -39606 -38274
57316c8274Q28O34R66J370J376J063Q31R24J288J606J466P97Q0j62K3K49M27O84
$$ -38274 -37446 -36812 -35846 -34476 -33100 -32037 -31206 -30282 -28994 -27388 -25922 -25125 -25045 -25207 -25184 -24935 -24508 -23824
57298b3824Q91Q12O13O25P39O54N53Q19J156Q77Q0l10J10P23R49J022J289J475
$$ -23824 -22933 -22121 -21508 -20883 -20144 -19490 -18937 -18118 -16962 -16085 -16005 -16315 -16205 -15482 -14533 -13511 -12222 -10747
57280a0747J211P25M88N52O73P68Q80R64J023J178i14D53J171J102J286J443J360
$$ -10747 -9536 -8811 -8323 -7771 -7098 -6330 -5450 -4486 -3463 -2285 -914 453 1624 2726 4012 5455 6815
57263F815J177J021P86N18N34R00J176J025O43L56J57J9J85P72J400J643J569
$$ 6815 7992 9013 9799 10317 10851 11751 12927 13952 14595 14951 15108 15127 15312 16084 17484 19127 20696
57246B0696J557J712J886K041K274K583K907L258L624L851L818L601L289K855
$$ 20696 22253 23965 25851 27892 30166 32749 35656 38914 42538 46389 50207 53808 57097 59952
57232E9952K315J907J894K274K780L116L179L156L374L909M414M574M547M651
$$ 59952 62267 64174 66068 68342 71122 74238 77417 80573 83947 87856 92270 96844 101391 106042
57218A06042M741M307L282K228J673J553J508J332J021O22K08j77n91j063j465
$$ 106042 110783 115090 118372 120600 122273 123826 125334 126666 127687 128309 128517 128340 127749 126686 125221
57203A25221j754k188k953l658l704l138k671k777l190l407l274k970k706k629
$$ 125221 123467 121279 118326 114668 110964 107826 105155 102378 99188 95781 92507 89537 86831 84202
57189H4202k757k954l169l589m322n067n465n558n563n373m799m098l678l424
$$ 84202 81445 78491 75322 71733 67411 62344 56879 51321 45758 40385 35586 31488 27810 24386
57175B4386k919k222j803j755j819k080k912m164e16n956o774p804q655r257j0082
$$ 24386 21467 19245 17442 15687 13868 11788 8876 4712 -516 -6472 -13246 -21050 -29705 -38962 -49044
57160d9044j1250j2247j2819j3390j4174j4616j4213j3271j2384j1638j0780r726
$$ -49044 -60294 -72541 -85360 -98750 -112924 -127540 -141753 -155024 -167408 -179046 -189826 -199552
57148a99552q548p347o393n952n743n141m090l211k787k295j349m25j63n03r80
$$ -199552 -208100 -215447 -221840 -227792 -233535 -238676 -242766 -245977 -248764 -251059 -252408 -252833 -252996 -253499 -254479
57133b54479j414j898k475l221m363n941p723r603j1754j4209j6774j9453k2467
$$ -254479 -255893 -257791 -260266 -263487 -267850 -273791 -281514 -291117 -302871 -317080 -333854 -353307 -375774
57120c75774k5742k8874l1757l4605l7261l9168m0238m1013m1745m2062m1774
$$ -375774 -401516 -430390 -462147 -496752 -534013 -573181 -613419 -654432 -696177 -738239 -780013
57109g80013m1269m0785m0102l9330l9234m0335m2394m5142m8701n2912n7034
$$ -780013 -821282 -862067 -902169 -941499 -980733 -1021068 -1063462 -1108604 -1157305 -1210217 -1267251
57098a267251o0628o4060o7666p1109p4068p6762p9321q1345q2649q3774q5177
$$ -1267251 -1327879 -1391939 -1459605 -1530714 -1604782 -1681544 -1760865 -1842210 -1924859 -2008633 -2093810
57087b093810q6595q7681q8652q9856r1401r3639r7267j02441j08526j15117j22489
$$ -2093810 -2180405 -2268086 -2356738 -2446594 -2537995 -2631634 -2728901 -2831342 -2939868 -3054985 -3177474
57076c177474j30646j38883j46921j55604j65809j77460j90220k04298k19956
$$ -3177474 -3308120 -3447003 -3593924 -3749528 -3915337 -4092797 -4283017 -4487315 -4707271
57067d707271k37026k55566k76177k99074l23667l49667l77734m08512m41976
$$ -4707271 -4944297 -5199863 -5476040 -5775114 -6098781 -6448448 -6826182 -7234694 -7676670
57058g676670m78291n18285n62458o10535o62689p20203p84418q56153r36853
$$ -7676670 -8154961 -8673246 -9235704 -9846239 -10508928 -11229131 -12013549 -12869702 -13806555
57049a3806555j029093j135281j256960j395891j554532j735199j940996k179031
$$ -13806555 -14835648 -15970929 -17227889 -18623780 -20178312 -21913511 -23854507 -26033538
57041b6033538k461845k805366l227103l746439m383998n159273o090556p197299
$$ -26033538 -28495383 -31300749 -34527852 -38274291 -42658289 -47817562 -53908118 -61105417
57033f1105417q498872j0007913j1724032j3629301j5680291j7799036j9875645
$$ -61105417 -69604289 -79612202 -91336234 -104965535 -120645826 -138444862 -158320507
57026a58320507k1784371k3395022k4566438k5132958k4902184k3670899k1266874
$$ -158320507 -180104878 -203499900 -228066338 -253199296 -278101480 -301772379 -323039253
57019c23039253j7629241j2905152p484007j902788L338282P923201J1742881
$$ -323039253 -340668494 -353573646 -361057653 -362960441 -359622159 -351698958 -339956077
57012c39956077J4820647J7225623J9022044K0251633K0937985K1107414K0810187
$$ -339956077 -325135430 -307909807 -288887763 -268636130 -247698145 -226590731 -205780544
57005b05780544K0122725J9132932J7927160J6585797J5179066J3760483J2366204
$$ -205780544 -185657819 -166524887 -148597727 -132011930 -116832864 -103072381 -90706177
56998i0706177J1021965R748693Q562491P474429O492746N622833M864009M208660
$$ -90706177 -79684212 -69935519 -61373028 -53898599 -47405853 -41783020 -36919011 -32710351
56990c2710351L645790L164088K751995K398187K093843J833186J611179J422194
$$ -32710351 -29064561 -25900473 -23148478 -20750291 -18656448 -16823262 -15212083 -13789889
56982a3789889J261116J123966J006808R05596Q17489P40903O73956O14231N60209
$$ -13789889 -12528773 -11404807 -10397999 -9492403 -8674914 -7934011 -7260055 -6645824 -6085615
56973f085615N11409M66946M25403L86334L50413L17893K88242K61327K37423
$$ -6085615 -5574206 -5107260 -4681857 -4295523 -3945110 -3627217 -3338975 -3077648 -2840225
56964b840225K15963J95772J76469J58047J39506J20353J03835R5855R8958J08879
$$ -2840225 -2624262 -2428490 -2252021 -2093974 -1954468 -1834115 -1730280 -1634425 -1535467 -1426588
56954a426588J18300J22766J22078J17762J11252J03768R6168Q8635Q1204P4257
$$ -1426588 -1308288 -1185522 -1063444 -945682 -834430 -730662 -634494 -545859 -464655 -390398
56944c90398O7985O1899N5525M9125M3222L7821L2645a4544H249J7988J3203Q734
$$ -390398 -322413 -260514 -204989 -155864 -112642 -74821 -42176 -14544 8249 26237 39440 48174
56932D8174M696Q87k640n432p361q892j0351G525d917j3422j4669j5785j6410
$$ 48174 52870 53757 51117 45685 38324 29432 19081 7525 -4917 -18339 -33008 -48793 -65203
56919f5203j6627j6463j5641j4230j2844j1749j0409q440o352m799l595k137l90
$$ -65203 -81830 -98293 -113934 -128164 -141008 -152757 -163166 -171606 -177958 -182757 -186352 -188489 -188879
56906a88879J195K422L433M273M863N284N706O145O581P086P596P768P377O654
$$ -188879 -187684 -185262 -181829 -177556 -172693 -167409 -161703 -155558 -148977 -141891 -134295 -126527 -119150 -112496
56892a12496O004N550N173M755M224L595L082K999L371L890M283M510M569M446
$$ -112496 -106492 -100942 -95769 -91014 -86790 -83195 -80113 -77114 -73743 -69853 -65570 -61060 -56491 -52045
56878e2045M324M421M625M662M694N177O046O619d936A346O301O249N596M535
$$ -52045 -47721 -43300 -38675 -34013 -29319 -24142 -18096 -11477 -4936 1346 7647 13896 19492 24027
56864B4027L760L514L404L083K681K466K391K166J668J150R96J256J607J774J798
$$ 24027 27787 31301 34705 37788 40469 42935 45326 47492 49160 50310 51306 52562 54169 55943 57741
56849E7741J758J501R59N23N93R79J171J131J243J531J583J311J188J498J919
$$ 57741 59499 61000 61959 62482 63075 64054 65225 66356 67599 69130 70713 72024 73212 74710 76629
56834G6629K122K297K740L349L882M371N013N813O606P187P285O723N758M957
$$ 76629 78751 81048 83788 87137 91019 95390 100403 106216 112822 120009 127294 134017 139775 144732
56820A44732M572M272L719L057K641K564K707K996L343L564L550L485L684M286
$$ 144732 149304 153576 157295 160352 162993 165557 168264 171260 174603 178167 181717 185202 188886 193172
56806A93172N183O041O510O529O478O755P238P426P074O330N313L926K201M38
$$ 193172 198355 204396 210906 217435 223913 230668 237906 245332 252406 258736 264049 267975 270176 270614
56792B70614j097k300l021l115k695k070j316l42O75J360J724K223L127M258N429
$$ 270614 269517 267217 264196 261081 258386 256316 255000 254658 255333 256693 258417 260640 263767 268025 273454
56777B73454O669P895Q844R535J0273J0921J0637Q693N299J348k330n272p302
$$ 273454 280123 288018 296862 306397 316670 327591 338228 346921 352220 353568 351238 345966 338664
56764C38664q515r094r039q264p036n891n025m135l018j864p96M17J887L280M317
$$ 338664 330149 321055 312016 303752 296716 290825 285800 281665 278647 276783 275987 276404 278291 281571 285888
56749B85888N206O267P368Q019P810O529M174J063k240n266p725r265r615r046
$$ 285888 291094 297361 304729 312748 320558 327087 331261 332324 330084 324818 317093 307828 298213 289167
56735B89167q273p669p054o286n531m776l663k174q61o4N79J420K183K519K669
$$ 289167 280894 273225 266171 259885 254354 249578 245915 243741 242880 242816 243395 244815 246998 249517 252186
56720B52186K969L088K397Q43j045k771m033m623m687m871n652o650p076o680
$$ 252186 255155 258243 260640 261483 260438 257667 253634 249011 244324 239453 233801 227151 220075 213395
56706B13395n841m931m072l397l005k722k283j732j287r89p66p17r27j146j049
$$ 213395 207554 202623 198551 195154 192149 189427 187144 185412 184125 183136 182370 181653 180726 179580 178531
56691A78531o85l61j86j03j77m38o04l74L5J36j57m76n53m69l75l17l51m91n72
$$ 178531 177846 177485 177299 177196 177019 176581 175977 175603 175638 175774 175617 175141 174588 174119 173744 173427 173076 172585 172013
56672A72013m63l47m84p65q32n59j70J40L23L32J57pO0L05M69M62L99L32K36J51
$$ 172013 171550 171203 170719 169954 169122 168563 168393 168533 168856 169188 169345 169338 169398 169703 170172 170634 171033 171365 171601 171752
56652A71752J75K73L33L44L23J64k01n57o23m23k72m32q85j379j550j209o19l28
$$ 171752 171927 172200 172533 172877 173200 173364 173163 172606 171983 171560 171288 170856 169971 168592 167042 165833 165214 164886
56634A64886n08p22n49j47O5N0N5J44J90K28L49M08J93j57k55KL69O45Q33R68
$$ 164886 164378 163656 163107 162960 163025 163075 163130 163274 163464 163692 164041 164449 164642 164485 164230 164232 164601 165246 166079 167047
56614A67047J025R74P44K29m40q33p03l47j89k38k33j55j51j13K03P04J068J230
$$ 167047 168072 169046 169790 170019 169579 168746 168043 167696 167507 167269 167036 166881 166730 166617 166820 167524 168592 169822
56596A69822J430J755K059K298K629L125L671M128M329M095L474K861K547K318
$$ 169822 171252 173007 175066 177364 179993 183118 186789 190917 195246 199341 202815 205676 208223 210541
56582B10541J848J271R42P62L09m81j185j481j401j055n79l39o87j420j961k115
$$ 210541 212389 213660 214602 215364 215673 215192 214007 212526 211125 210070 209491 209152 208465 207045 205084 202969
56566B02969k180k317k312k124k083k296k358j944j355j104j231j342j155p43
$$ 202969 200789 198472 196160 194036 191953 189657 187299 185355 184000 182896 181665 180323 179168 178425
56552A78425l53j81k45l62l25j46j3N%K4j2j23k48l97o44q84q32l34M58J252J768
$$ 178425 178072 177891 177646 177284 176959 176813 176800 176805 176805 176829 176817 176694 176446 176049 175405 174521 173689 173355 173813 175065 176833
56531A76833J778J244N03P3J65N05O83N37J82j36k13n4J23Q3j73m38m97k66J73
$$ 176833 178611 179855 180358 180431 180596 181101 181784 182321 182503 182367 182154 182100 182223 182306 182133 181695 181198 180932 181105
56512A81105N48N98M05L30N16O79O23N97Q57J166J183J062J226J668J949J863
$$ 181105 181653 182251 182656 182986 183502 184181 184804 185401 186258 187424 188607 189669 190895 192563 194512 196375
56496A96375J622J433J288J190J205J261J195J004P58M36R2oK29M08K15K0K92
$$ 196375 197997 199430 200718 201908 203113 204374 205569 206573 207331 207767 207859 207853 208082 208490 208705 208725 209017
56479B09017O64L21p03j462j473j317j589j971j861j375j104j222j383j305j091
$$ 209017 209681 210002 209299 207837 206364 205047 203458 201487 199626 198251 197147 195925 194542 193237 192146
56464A92146r88j112j371j527j435j224j125j108r71p44o71p17n52j09J78k5m82
$$ 192146 191158 190046 188675 187148 185713 184489 183364 182256 181285 180541 179870 179153 178601 178492 178670 178645 178163
56447A78163p17o00l29p7Q3P3j23l17k64R0N27P21M94j8m96p06o51l77O1M07K89
$$ 178163 177446 176846 176517 176440 176523 176596 176473 176156 175892 175982 176509 177230 177724 177706 177210 176504 175853 175476 175537 175944 176233
56426A76233k73p09n73j04K12K99L09J55k48n87n72n19q05j062o87%Q0m90p45
$$ 176233 175960 175251 174678 174574 174786 175085 175394 175549 175301 174714 174142 173623 172818 171756 171069 171069 171149 170659 169914
56407A69914k22L77M01J91L29O75P96P40P93R19R13P64M92k6o47q85n60j53r3
$$ 169914 169692 170069 170470 170661 170990 171665 172461 173201 173994 174913 175826 176590 177082 177056 176409 175524 174964 174811 174718
56388A74718j28J14M70O01O19P91R37O92J98p8j7P3j6k07l92n12m23j9N06P77
$$ 174718 174590 174704 175174 175775 176394 177185 178122 178814 179012 178934 178917 178990 178974 178767 178375 177863 177440 177421 177927 178704
56368A78704N95J25k75l28j27r3m39p29m19K62N29K39J81Q42J604J603R18K88
$$ 178704 179299 179424 179149 178821 178694 178601 178162 177433 177014 177276 177805 178044 178225 179067 180671 182274 183192 183480
56350A83480O3K6oPj5k37n71p16n09o5L71N10J95l02m28NN07N35J78p2L6L42N57
$$ 183480 183543 183569 183563 183570 183555 183318 182747 182031 181522 181457 181828 182338 182533 182231 181803 181808 182315 182850 183028 182956 182992 183334 183891
56327A83891M88J55j03K3L31K76j85m18n2M18L51j62o02q09r39r60p35m17k89
$$ 183891 184379 184534 184431 184454 184785 185061 184876 184458 184406 184824 185175 185013 184411 183602 182663 181703 180968 180551 180262
56308A80262l16k70r3J90O63J224J388Q47N2k81n8K52L48L50L42K69K30M42Q57
$$ 180262 179946 179676 179583 179773 180436 181660 183048 183895 183947 183666 183608 183860 184208 184558 184900 185169 185399 185841 186698
56289A86698J157J158R47O49L01lj18j0K34M85N63L28q0k83q5K80M97N40N43N38
$$ 186698 187855 189013 189960 190609 190910 190907 190789 190779 191013 191498 192061 192389 192309 192026 191941 192221 192718 193258 193801 194339
56269A94339N35O37Q75J103J213J208J038O43K62K89O89R49Q47P69J015J264J109
$$ 194339 194874 195511 196386 197489 198702 199910 200948 201591 201853 202142 202831 203780 204627 205396 206411 207675 208784
56252B08784P00M59N16P55J069J250J026N59M69R88J545J604J450J607J967K060
$$ 208784 209484 209943 210459 211214 212283 213533 214559 215118 215587 216575 218120 219724 221174 222781 224748 226808
56236B26808J861J697J651J635J776K176K501K403K173K351K860L109K879K565
$$ 226808 228669 230366 232017 233652 235428 237604 240105 242508 244681 247032 249892 253001 255880 258445
56222B58445K545K732K863K828K723K745L043L532L959M228M396M398M158M011
$$ 258445 260990 263722 266585 269413 272136 274881 277924 281456 285415 289643 294039 298437 302595 306606
56208C06606M475N468O318O720P027P416P569P564Q133R520J0890J1583J2177
$$ 306606 311081 316549 322867 329587 336614 344030 351599 359163 367296 376816 387706 399289 411466
56195D11466J3472J5198J6608J7753J9152K0671K1797K2654K3836K5413K6917
$$ 411466 424938 440136 456744 474497 493649 514320 536117 558771 582607 608020 634937
56184F34937K8075K8810K8880K8251K7452K6739K5368K2550J8737J4969J1382
$$ 634937 663012 691822 720702 748953 776405 803144 828512 851062 869799 884768 896150
56173H96150P410L092r94m858q990j3158j6447j8556k0048k1323k2255k2918k3656
$$ 896150 903560 906652 905658 900800 891810 878652 862205 843649 823601 802278 780023 757105 733449
56160G33449k4337k4430k3924k3378k2992k2401k1453k0357j9112j7536j5898
$$ 733449 709112 684682 660758 637380 614388 591987 570534 550177 531065 513529 497631
56149D97631j4734j4047j3410j2770j2321j1747j0533q973p930p559p221o630
$$ 497631 482897 468850 455440 442670 430349 418602 408069 399096 391166 383607 376386 369756
56137C69756o123n706m924l813l044k866k766k378j979j834j788j656j411r08
$$ 369756 363633 357927 353003 349190 346146 343280 340514 338136 336157 334323 332535 330879 329468 328560
56123C28560j28M22K18l88n92l10o6R7O00J267J438J132J072J462J771J805J963
$$ 328560 328432 328854 329072 328684 328092 327782 327716 327813 328413 329680 331118 332250 333322 334784 336555 338360 340323
56106C40323K301K404K341K668L363L739L653L708M113M405M465M740N235N452
$$ 340323 342624 345028 347369 350037 353400 357139 360792 364500 368613 373018 377483 382223 387458 392910
56092C92910N483O036P096P778P852Q214R427J0928J2180J3504J5222J7012J8701
$$ 392910 398393 404429 411525 419303 427155 435369 444796 455724 467904 481408 496630 513642 532343
56079E32343K0715K3250K5841K8183L0452L2426L3206L2345L0313K7581K4185
$$ 532343 553058 576308 602149 630332 660784 693210 726416 758761 789074 816655 840840
56068H40840K0549J7618J5663J3908J1766R480P220M634J755p04k462m049n672
$$ 840840 861389 879007 894670 908578 920344 929824 937044 941678 943433 942729 940267 936218 930546
56055I30546o861p743r497j2850j7064k1034k4387k6920k8067k7639k6295k4637
$$ 930546 923685 915942 906445 893595 876531 855497 831110 804190 776123 748484 722189 697552
56043F97552k2669k0514j8700j7268j5532j3214j0903r034p412o049n343n016
$$ 697552 674883 654369 635669 618401 602869 589655 578752 569718 562306 556257 550914 545898
56031E45898m152k685j618j351j073l24K82M81J038K240L121L064K853L284L968
$$ 545898 541746 539061 537443 536092 535019 534695 534977 535458 536496 538736 541857 544921 547774 551058 555026
56016E55026M340M671N225N541N434N540O137O574O540O704P367P815P710P776
$$ 555026 559366 564037 569262 574803 580237 585777 591914 598488 605028 611732 619099 626914 634624 642400
56002F42400Q386Q853Q863R116R799R917R094Q429Q660R026Q891Q882R406R711
$$ 642400 650786 659639 668502 677618 687417 697334 706428 714857 723517 732543 741434 750316 759722 769433
55988G69433R445R557J0491J1168J0960J0953J2004J3227J3743J4236J5407J6535
$$ 769433 778878 788435 798926 810094 821054 832007 844011 857238 870981 885217 900624 917159
55976I17159J6985J7514J8693J9699K0049K0789K2518K4025K4380K4614K5734
$$ 917159 934144 951658 970351 990050 1010099 1030888 1053406 1077431 1101811 1126425 1152159
55965A152159K6963K7557K8436L0281L1933L2510L3178L5013L7057L8411M0143
$$ 1152159 1179122 1206679 1235115 1265396 1297329 1329839 1363017 1398030 1435087 1473498 1513641
55954A513641M3174M6312M8507N1031N5112N9601O3242O7163P2581P8208Q2551
$$ 1513641 1556815 1603127 1651634 1702665 1757777 1817378 1880620 1947783 2020364 2098572 2181123
55943B181123Q6851R2902R9946J06352J12573J19679J26871J33135J39488J47022
$$ 2181123 2267974 2360876 2460822 2567174 2679747 2799426 2926297 3059432 3198920 3345942
55933C345942J54689J61553J68995J78133J87544J96254K06237K19022K32738
$$ 3345942 3500631 3662184 3831179 4009312 4196856 4393110 4599347 4818369 5051107
55924E051107K45597K59294K75562K92692L09178L27378L49604L74032L98687
$$ 5051107 5296704 5555998 5831560 6124252 6433430 6760808 7110412 7484444 7883131
55915G883131M25766M57540M91968N27213N66322O12148O62089P13712P71019
$$ 7883131 8308897 8766437 9258405 9785618 10351940 10964088 11626177 12339889 13110908
55906A3110908Q39137R17943J007805J115898J248865J404588J579579J778630
$$ 13110908 13950045 14867988 15875793 16991691 18240556 19645144 21224723 23003353
55898B3003353K008898K272556K576285K939718L381306L902752M497212N157061
$$ 23003353 25012251 27284807 29861092 32800810 36182116 40084868 44582080 49739141
55890D9739141N856241O544394P180156P727854Q048343P806124O607528M340219
$$ 49739141 55595382 62139776 69319932 77047786 85096129 92902253 99509781 103850000
55882A03850000J375230j619997m085401n802788o823234p283738p317545p051364
$$ 103850000 105225230 103605233 99519832 93717044 86893810 79610072 72292527 65241163
55874F5241163o597698o035797n420248m802002m224719l709249l258346k872173
$$ 65241163 58643465 52607668 47187420 42385418 38160699 34451450 31193104 28320931
55866B8320931k548457k275385k038127j829887j648473j487407j339492j204701
$$ 28320931 25772474 23497089 21458962 19629075 17980602 16493195 15153703 13949002
55858A3949002j086003r80851q84137p95823p18551o50848n89270n34229m87444
$$ 13949002 12862999 11882148 10998011 10202188 9483637 8832789 8243519 7709290 7221846
55849G221846m46409m07304l70829l39664l12654k86916k63274k44259k28666
$$ 7221846 6775437 6368133 5997304 5657640 5344986 5058070 4794796 4550537 4321871
55840D321871k13215j97876j84867j73934j63169j52977j44970j38126j30129
$$ 4321871 4108656 3910780 3725913 3551979 3388810 3235833 3090863 2952737 2822608
55831B822608j21301j13489j06430r8719r1085q5126q0074p4231o8301o3918o0199
$$ 2822608 2701307 2587818 2481388 2382669 2291584 2206458 2126384 2052153 1983852 1919934 1859735
55820A859735n5204m9599m5516m2808l9881l7230l6822l8677m1098m3618m6680
$$ 1859735 1804531 1754932 1709416 1666608 1626727 1589497 1552675 1513998 1472900 1429282 1382602
55809A382602m9244m9724m8748m8174m7955m6670m4422m2500m0779l8243l5512
$$ 1382602 1333358 1283634 1234886 1186712 1138757 1092087 1047665 1005165 964386 926143 890631
55798H90631l4071l3491l2070k9846k8386k7832k6784k4955k3448k2545k1465
$$ 890631 856560 823069 790999 761153 732767 704935 678151 653196 629748 607203 585738
55787E85738k0274j9813j9809j9136j7871j7069j6707j5820j4437j3473j2857
$$ 585738 565464 545651 525842 506706 488835 471766 455059 439239 424802 411329 398472
55776C98472j1756j0399r780r707r074p881p154o986o587o021o069o485o254n476
$$ 398472 386716 376317 366537 356830 347756 339875 332721 325735 319148 313127 307058 300573 294319 288843
55762B88843n160n301m996m293m116m405m204l562l471l837l480k230j264j093
$$ 288843 283683 278382 273386 269093 264977 260572 256368 252806 249335 245498 242018 239788 238524 237431
55748B37431r32l96j28l52l52J80O33O69P00Q92Q81O52N82N34K0p42j132j358
$$ 237431 236499 236103 235975 235623 235271 235451 236084 236753 237453 238345 239226 239878 240460 240994 241014 240272 239140 237782
55730B37782k090l021l243k909l077l809m015l338k677k565k474k107j983k328
$$ 237782 235692 232671 229428 226519 223442 219633 215618 212280 209603 207038 204564 202457 200474 198146
55716A98146k552k310j970j704j108j15P27J118J272J119K74j017j890k045k037
$$ 198146 195594 193284 191314 189610 188502 188387 189114 190232 191504 192623 192897 191880 189990 187945 185908
55701A85908k243k433k471k521k511k212j869j924k193k208k191k663l296l275
$$ 185908 183665 181232 178761 176240 173729 171517 169648 167724 165531 163323 161132 158469 155173 151898
55687A51898k724k497k713k673k251k037k078j757j090q36j165j428j412j598
$$ 151898 149174 146677 143964 141291 139040 137003 134925 133168 132078 131242 130077 128649 127237 125639
55673A25639j966j835j165p84r96j156r37q58j142j285j057r00r18n74J80O17
$$ 125639 123673 121838 120673 119889 118893 117737 116800 115942 114800 113515 112458 111558 110640 110066 110246 110863
55657A10863M59L16N13N37J38q7K89Q59J198J441J560J115J46n75o97p56j094
$$ 110863 111322 111638 112151 112688 112826 112739 113028 113887 115085 116526 118086 119201 119347 118772 118075 117319 116225
55640A16225j279j077j024j461j914k011k078k313k228j516o86k49pK77L62J88
$$ 116225 114946 113869 112845 111384 109470 107459 105381 103068 100840 99324 98638 98389 98382 98659 99021 99209
55624I9209K74Q36J244R85M70K92L91M87O94J045J077N18j76m95n87p88r84r66
$$ 99209 99483 100319 101563 102548 103018 103310 103701 104188 104882 105927 107004 107522 107346 106851 106264 105476 104492 103526
55606A03526q42p25m36J3K42J66K18N71P92O46N45P58Q83N94K13P8k6k62k68J39
$$ 103526 102684 101959 101523 101536 101778 101944 102162 102733 103525 104171 104716 105474 106357 106951 107164 107242 107216 106954 106686 106825
55586A06825M68L29O4K2j39p28j288j266r77j097j603j933j875j634j302q69n50
$$ 106825 107293 107622 107686 107708 107569 106841 105553 104287 103310 102213 100610 98677 96802 95168 93866 92997 92447
55569I2447n70p95r83j092j139r77o47n00o99r78j114j223j304j068n61l37o43
$$ 92447 91877 91082 90099 89007 87868 86891 86244 85744 85045 84067 82953 81730 80426 79358 78797 78460 77817
55552G7817j007j015r18r97r71n93j90p8O3N60J007Q53K81j22k46l47m13k85j07
$$ 77817 76810 75795 74877 73880 72909 72316 72126 72048 72111 72671 73678 74531 74812 74690 74444 74097 73684 73399 73292
55533G3292j71m51p55j028j153q46j85K34Q8j23J17N18M93J41PK37N84R36J260
$$ 73292 73121 72670 71915 70887 69734 68888 68703 68937 69025 68902 69019 69537 70030 70171 70178 70415 70999 71935 73195
55514G3195J258P47J48J3K56M06L89M84O89P25N82N11N18L81R4j11j24o7o0j67
$$ 73195 74453 75200 75348 75361 75617 76023 76412 76896 77585 78310 78892 79403 79921 80302 80396 80285 80161 80094 80034 79867
55494G9867m15o71p32o52p14q93p94l42l9k07m93n05m04m10k62K41O66N51J76
$$ 79867 79452 78781 78049 77397 76683 75790 74996 74654 74615 74408 73915 73410 73006 72596 72334 72575 73241 73792 73968
55475G3968O6J52P2o6M1J59j61p03q64o17m78n77n07j66Jk71o83q83q95q83q54
$$ 73968 74034 74186 74258 74192 74233 74392 74231 73528 72664 72047 71569 70992 70485 70319 70320 70049 69366 68483 67588 66705 65851
55454F5851q05q36j030j356j697j848j595j001m14k9L42Q43J247J322J179R39
$$ 65851 65046 64210 63180 61824 60127 58279 56684 55683 55269 55240 55582 56425 57672 58994 60173 61112
55438F1112M08m55j137j098m95R0L87M70L52O1j35n1O8n3k13j39m2k29m55k48
$$ 61112 61520 61065 59928 58830 58335 58425 58812 59282 59634 59695 59560 59509 59577 59524 59311 59172 59130 58901 58446 58198
55418E8198K64N37M51L18K52Q2j01j3K56L04R8J0J60K41N8k19l93m41l52j41l
$$ 58198 58462 58999 59450 59768 60020 60102 60001 59988 60244 60548 60646 60656 60816 61057 61115 60896 60503 60062 59710 59569 59566
55397E9566r9k39j39R9J44l5j85k41l15l37j68N2O3m8OJ95K22N4r1j48k06j58
$$ 59566 59467 59228 59089 59188 59332 59297 59112 58871 58556 58219 58051 58103 58166 58118 58124 58319 58541 58595 58504 58356 58150 57992
55375E7992J33M59M92K97J79J29m1j36J95P59R37N59Q6j58k93m21l74j21R4J82
$$ 57992 58125 58584 59076 59373 59552 59681 59640 59504 59699 60458 61395 61954 62040 61882 61589 61168 60794 60673 60767 60949
55355F0949L18N38N88L73J05l7q7o5M9J17o5m26p19q65r12p54l33Mm7j50K33Q93
$$ 60949 61267 61805 62393 62766 62871 62834 62747 62682 62731 62848 62783 62357 61638 60773 59861 59107 58774 58778 58731 58581 58814 59707
55333E9707J051N46P1R5K52Q3k63m19l56j89R0L67L15j25n32n72l98k57r5J37
$$ 59707 60758 61304 61375 61470 61722 61805 61542 61123 60767 60578 60668 61035 61350 61225 60693 60121 59723 59466 59371 59508
55313E9508J56k42p52q96o39l10j04L3J39J51K7j28j45R7M66N97K55l29o63n55
$$ 59508 59664 59422 58670 57774 57135 56825 56721 56754 56893 57044 57071 56943 56798 56895 57361 57958 58213 57884 57221 56666
55293E6666k33OO0k8j01P2M98P91O09J60r9j04r1j6L38P38O31Kn10n09k75j37
$$ 56666 56433 56439 56499 56471 56370 56442 56940 57731 58340 58500 58401 58297 58206 58190 58528 59266 59897 59899 59389 58880 58605 58468
55271E8468K3L20M99L66J17p3l48p51r22o29k23j55l09k69K4K51K37Q7o1j11M1
$$ 58468 58491 58811 59310 59676 59793 59720 59372 58621 57699 57070 56847 56692 56383 56114 56138 56389 56626 56713 56652 56541 56582
55250E6582L81P06Q22P80P13O19M07R6k42n32o71n82l50j25J09M41O63M45r2l89
$$ 56582 56963 57669 58491 59271 59984 60603 61010 61106 60864 60332 59661 59079 58729 58604 58713 59154 59817 60262 60170 59781
55230E9781k08M3j2j71p9J46J29j62m11m24k64n9R3J30J25K70N71P75P40O33N79
$$ 59781 59573 59616 59604 59433 59354 59500 59629 59467 59056 58632 58368 58309 58402 58532 58657 58927 59498 60273 61013 61646 62225
55209F2225M09J4l21k84l6N5j7M6L02M71L93J79o0l61o70p90o60m65l82l18r1
$$ 62225 62634 62648 62327 62043 62007 62062 62045 62091 62393 62864 63257 63436 63376 63015 62345 61555 60895 60430 60048 59730 59639
55188E9639K52M54L52O1j62j92o5J46L65M32J93k38n01m33k96l45m02j58K38L28
$$ 59639 59891 60345 60697 60758 60596 60404 60339 60485 60850 61282 61475 61237 60736 60303 60007 59662 59260 59102 59340 59668
55168E9668Rk91k57n3L1k6j04j56j72j15j7N9J91M77P10N22o4n32n14k00K3P1
$$ 59668 59677 59386 59129 59076 59107 59081 58977 58821 58649 58534 58517 58576 58767 59244 59954 60476 60412 59880 59366 59166 59189 59260
55146E9260R9K06L98O29P42N89L19K69M69N66L92K39L07L10l6m55m84j86n2k58
$$ 59260 59359 59565 59963 60592 61334 61923 62242 62511 62980 63546 63938 64177 64484 64794 64758 64303 63819 63633 63581 63323
55126F3323m86m72l49l40m14m44m56n58o52m56R0O10O34J90k03k12o7q5j26R8
$$ 63323 62837 62365 62016 61676 61262 60818 60362 59804 59152 58696 58786 59396 60030 60220 60017 59805 59738 59653 59527 59625
55106E9625L91L00q0j48L06P61P38L89J06m2j58k03j50j44k09j00K74N91O05N20
$$ 59625 60016 60316 60236 60088 60394 61155 61893 62282 62388 62346 62188 61985 61835 61691 61482 61382 61656 62247 62852 63372
55086F3372N69M95j2o48p72k63L21M19qo32j064j044o01q7J84K75M44O98P57M67
$$ 63372 63941 64436 64424 63776 63004 62741 63062 63481 63473 62841 61777 60733 60132 60045 60229 60504 60948 61646 62403 62870
55066F2870L1k27j97l2P0J04K62O27R32Q40M31J04j0j76m87o20l72o8j06l81m99
$$ 62870 62901 62674 62477 62445 62515 62619 62881 63508 64440 65280 65711 65815 65805 65629 65142 64522 64150 64082 63976 63595 63096
55045F3096l70j92m9J07K07J24j7J1K02L65M14L77K04j37m33m27j76L7J04J30
$$ 63096 62726 62534 62485 62592 62799 62923 62906 62917 63119 63484 63898 64275 64479 64342 63909 63482 63306 63343 63447 63577
55025F3577J50R8R0L47Q24J143J036O28J91j79n10p77q69p44n05l45l74m86m20
$$ 63577 63727 63825 63915 64262 65086 66229 67265 67893 68084 67905 67395 66618 65749 65005 64500 64155 63781 63295 62875
55006F2875n0M39P30O85M54K53J50O0o5q7J49N55P88O15J97j40k89k99j76Rj0
$$ 62875 62825 63264 63994 64679 65133 65386 65536 65596 65531 65444 65593 66148 66936 67551 67748 67608 67319 67020 66844 66853 66843
54985F6843l36n64k69K37K01m47r05o28q2K0l33o50p24o67m87j37J62J31j26k34
$$ 66843 66507 65943 65674 65911 66112 65665 64760 64132 64050 64070 63737 63087 62363 61696 61209 61072 61234 61365 61239 61005
54965F1005n6K01L19K52R8O5L27P55R76Q56O48N03K15k75n44k70J99L17J39J23
$$ 61005 60949 61150 61469 61721 61819 61884 62211 62966 63942 64798 65446 65949 66164 65889 65345 65075 65274 65591 65730 65853
54945F5853L60N22M58L14J44r9k78j80P6J67R1J26K92L42K80L82O52O68K02l88
$$ 65853 66213 66735 67193 67507 67651 67552 67274 67094 67170 67337 67428 67554 67846 68188 68468 68850 69502 70170 70372 69984
54925F9984n80k91J44L58K18j45m33m46k62p4P0K00K37R6o2J9L24N45N02K82M4
$$ 69984 69404 69113 69257 69615 69833 69688 69255 68809 68547 68473 68543 68743 68980 69076 69014 69033 69357 69902 70404 70686 70730
54904G0730j69l47m34l62j25J88L51J78j73l32j81OP8K65O73Q72M86j31l20m1
$$ 70730 70561 70214 69780 69418 69293 69481 69832 70010 69837 69505 69324 69330 69408 69673 70346 71218 71704 71573 71253 71212
54884G1212J61O7J7K40M80M32J73q0k36k44k6L17N14M81M28N39P22Q17Q34Q96
$$ 71212 71373 71440 71457 71697 72177 72609 72782 72702 72466 72222 72196 72513 73027 73508 73936 74475 75197 76014 76848 77744
54864G7744J050J264J501J768K079K366K411K067J574J398J575J578J019K10l65
$$ 77744 78794 80058 81559 83327 85406 87772 90183 92250 93824 95222 96797 98375 99394 99604 99239
54849I9239p28j198j697j932j964k076k160j842j240r13j038j162r76p09o41o53
$$ 99239 98511 97313 95616 93684 91720 89644 87484 85642 84402 83489 82451 81289 80313 79604 78963 78310
54833G8310n68n05n62n29j57M43R39J142J116J078J206J418J383R92O65Q80J470
$$ 78310 77742 77237 76675 76146 75989 76432 77371 78513 79629 80707 81913 83331 84714 85706 86371 87251 88721
54816H8721J846J852J866K032J970J472R07O07L49k53j103j782k108k197k203
$$ 88721 90567 92419 94285 96317 98287 99759 100666 101273 101622 101369 100266 98484 96376 94179 91976
54801I1976k171k082j862j486j180j236j582j756j481j002o90n63m38k75j62q2
$$ 91976 89805 87723 85861 84375 83195 81959 80377 78621 77140 76138 75448 74885 74447 74172 74010 73928
54785G3928M0J91L12L82L82K81J10n5k31m71p18q66r97j246j469j331q03k64n1
$$ 73928 73968 74159 74471 74853 75235 75516 75626 75571 75340 74869 74151 73285 72288 71042 69573 68242 67439 67175 67124
54766F7124j37l47n80p22o46m19k50j47J00M85O75M84J77J14L46O67Q31O31N5
$$ 67124 66987 66640 66060 65338 64692 64273 64023 63876 63976 64461 65136 65620 65797 65911 66257 66924 67755 68386 68441
54747F8441n29o34k47J20J18pJ27M84P52Q05P64P34O99O00L86R1r3J0K83M21L05
$$ 68441 67912 67278 67031 67151 67269 67262 67389 67873 68625 69430 70194 70928 71627 72227 72613 72704 72611 72621 72904 73325 73630
54726G3630P9j43l31l37jM90P38O91O86Q71J014J011J083J303J351J055P37P69
$$ 73630 73709 73566 73235 72898 72897 73387 74125 74816 75502 76373 77387 78398 79481 80784 82135 83190 83927 84696
54708H4696J069J369J643J990K316K433K264J775R71R7m68o53p49q91q82o99p00
$$ 84696 85765 87134 88777 90767 93083 95516 97780 99555 100526 100623 100155 99502 98753 97862 96980 96281 95581
54691I5581j077j526j745j808j809j572j142r74j239j391r58k88L5J01L27N76
$$ 95581 94504 92978 91233 89425 87616 86044 84902 83928 82689 81298 80340 80052 80087 80188 80515 81091
54675H1091M24M4J9L43L97nk59J16Q20J319J519J669J882K065K107J935J586J244
$$ 81091 81515 81559 81578 81921 82318 82313 82054 82170 82990 84309 85828 87497 89379 91444 93551 95486 97072 98316
54657I8316J082J001P09J10n96j157j469j528j429j364j474j656j698j590j500
$$ 98316 99398 100399 101108 101218 100622 99465 97996 96468 95039 93675 92201 90545 88847 87257 85757
54642H5757j477j383j111p35m39l86n80p87p10l57o5p3k49l88n36p60q39n26K1
$$ 85757 84280 82897 81786 81051 80612 80226 79646 78859 78149 77792 77727 77654 77405 77017 76481 75721 74882 74356 74377
54623G4377L95M45L16J12j54l51k95k9J91K23J47L7r7k67m77p28r31r38p78o50
$$ 74377 74772 75217 75533 75645 75491 75140 74845 74816 75007 75230 75377 75414 75317 75050 74573 73845 72914 71976 71198 70548
54603G0548n73l21R6K46j01n11m43l8J67N9j7O1R1M4J45L83M75L62K92L21K01
$$ 70548 69975 69654 69750 69996 69895 69384 68941 68903 69070 69129 69112 69173 69264 69308 69453 69836 70311 70673 70965 71286 71487
54582G1487j24l62l33k28j95r2J86M32M31K96K48K96K85J41j00l39m23k41J13
$$ 71487 71363 71001 70668 70440 70245 70153 70339 70771 71202 71498 71746 72042 72327 72468 72368 72029 71606 71365 71478
54563G1478M18O11P77Q52O44J93j49j47O9K56L64M56N02M31K07j82o80j051r88
$$ 71478 71896 72507 73284 74136 74780 74973 74824 74677 74746 75002 75366 75822 76324 76755 76962 76780 76100 75049 74061
54544G4061m99M3L16L69M12M67L86J27j52k52j23R6J83L2k42m06l13J0L65M76
$$ 74061 73562 73605 73921 74290 74702 75169 75555 75682 75530 75278 75155 75251 75434 75466 75224 74818 74505 74515 74880 75356
54524G5356K38p0l9L27N36K89q0j02J66L60M63P32J024Q42J22n18n63j95R1J32
$$ 75356 75594 75524 75485 75812 76348 76637 76557 76455 76621 76981 77444 78176 79200 80042 80164 79646 79083 78888 78979 79111
54504G9111J21K00L22L73K33j28m81m70m2L98M50K06P5K36M79N42M35L67M65O09
$$ 79111 79232 79432 79754 80127 80360 80232 79751 79281 79239 79637 80087 80293 80368 80604 81083 81625 82060 82427 82892 83501
54484H3501N97M31L14L53L74J77j46l29k81j32K1J93L42L33J09k47n75p00n39
$$ 83501 84098 84529 84843 85196 85570 85747 85601 85272 84991 84859 84880 85073 85415 85748 85857 85610 85035 84335 83796
54465H3796k46j47l14l93q7L77N49L85K02J49R9K8N8J12J3j15N6M39N18J21k98
$$ 83796 83550 83403 83089 82696 82609 82986 83535 83920 84122 84271 84370 84398 84456 84568 84581 84466 84522 84961 85479 85600 85302
54444H5302l40j91k19m09n20n42n60m60q2M23P28O89M42J59m8j06k5J02K83N90
$$ 85302 84962 84771 84552 84143 83623 83081 82521 82061 81979 82402 83130 83819 84261 84420 84372 84266 84241 84343 84626 85216
54424H5216R20R55N85J39M1L65Q79J343J604J543J194P81M95L17J68O0j4j49l16
$$ 85216 86136 87091 87676 87815 87856 88221 89100 90443 92047 93590 94784 95565 96060 96377 96545 96605 96591 96442 96126
54405I6126l00m8J32m6l76m23r9K57L91L91M41N36N16K94n4l19l60k72l16n93
$$ 96126 95826 95778 95910 95864 95488 95065 94966 95223 95614 96005 96446 96982 97498 97792 97738 97419 97059 96787 96471 95878
54385I5878q73q74o04l13j62j21j28j71k61m00n98p81p82n25j93m1n7NK19L07
$$ 95878 95005 94131 93527 93214 93052 92931 92803 92632 92371 91971 91373 90592 89810 89285 89092 89051 88994 88999 89218 89525
54365H9525Kn27p89n51r5J44N7j14k05k68l11j20M04R34R90N26k9k48j15J18K27
$$ 89525 89527 89000 88211 87660 87565 87709 87766 87652 87447 87179 86868 86748 87152 88086 89076 89602 89573 89325 89210 89328 89555
54344H9555J75Q7J47L81N65M56J03k03k71j49O5L27N51O08N06L92L74M18M91N51
$$ 89555 89730 89817 89964 90345 90910 91366 91469 91266 90995 90846 90911 91238 91789 92397 92903 93295 93669 94087 94578 95129
54324I5129M77J70k03l08r2J22O9j33k20j75k20m52o88o23j80L67O28N39M41N71
$$ 95129 95606 95776 95573 95265 95173 95295 95364 95231 95011 94836 94616 94164 93476 92853 92673 93040 93668 94207 94648 95219
54304I5219O86M24r7l75k34k0k7j07K5L66P40J028J154J019O50K43q2m13q07j139
$$ 95219 95905 96329 96232 95857 95623 95603 95576 95469 95494 95860 96600 97628 98782 99801 100451 100694 100612 100199 99392 98253
54284I8253j268j195r30m96p7L6j76m28n50p13r89j127r29o48n79o04m18j06l4
$$ 98253 96985 95790 94860 94364 94287 94323 94147 93719 93169 92456 91467 90340 89411 88763 88184 87580 87162 87056 87022
54265H7022k74m89m03j03J78L40M17M59N00N22M22R3m18q94j098r60o30l27q4
$$ 87022 86748 86259 85856 85753 85931 86271 86688 87147 87647 88169 88591 88684 88266 87372 86274 85314 84684 84357 84273
54246H4273K84P99J101Q37K08k30l05l68o27p98o42m05l76m05k12M4k1l81o32
$$ 84273 84557 85356 86457 87294 87502 87272 86967 86599 85972 85174 84532 84127 83751 83346 83134 83178 83157 82776 82144
54227H2144n75l58q0L37Q34J084Q89M25Mk31l40l82l56k57j33q0j25j90k02k56
$$ 82144 81569 81211 81131 81468 82302 83386 84275 84700 84704 84473 84133 83751 83395 83138 83005 82925 82800 82610 82408 82152
54207H2152m74o95n34J39R39J311J062M32j78m36k28K42O23P35O29L18k48q66
$$ 82152 81678 80983 80449 80588 81527 82838 83900 84332 84154 83718 83490 83732 84355 85090 85719 86037 85789 84923
54189H4923j080p29k02J03K75N30O91M99J64J34L55L25j13n04m84k75k92n31o32
$$ 84923 83843 83114 82912 83015 83290 83820 84511 85010 85174 85308 85663 85988 85875 85371 84887 84612 84320 83789 83157
54170H3157l78Q4M51N10K44j75n02n98n20m19l69l28k10k7J04J03M7N0M7j02l50
$$ 83157 82779 82863 83314 83824 84068 83893 83391 82793 82273 81854 81485 81157 80947 80920 81024 81127 81174 81224 81271 81169 80819
54149H0819m60l41j97k09k99k78j25O3K82N50P78Q09N92K23j20k99l52m74p29
$$ 80819 80359 80018 79821 79612 79313 79035 78910 78973 79255 79805 80583 81392 81984 82207 82087 81788 81436 80962 80233
54130H0233q31m74J55N56N69N08N56N06K56J02K47M53M58L59K86Q0l20n23k07
$$ 80233 79402 78928 79083 79639 80208 80716 81272 81778 82034 82136 82383 82836 83294 83653 83939 84019 83699 83176 82969
54111H2969K85M04J50q2j85l13m06k80j24l20p64r24n80m2L64N55M82J66q4P3
$$ 82969 83254 83658 83808 83726 83541 83228 82822 82542 82418 82098 81334 80410 79830 79788 80152 80707 81189 81355 81271 81344
54091H1344M21L85j03m61k99O6J52l1j55n7K00M97O53M90O9k58k35M2L45N44N83
$$ 81344 81765 82150 82047 81586 81287 81353 81505 81474 81319 81262 81462 81959 82612 83102 83171 82913 82678 82720 83065 83609 84192
54070H4192L96M9k32l00k00m5J20K32K23J39J17J94K77L08L26L37L10K64J99N3
$$ 84192 84588 84637 84405 84105 83905 83860 83980 84212 84435 84574 84691 84885 85162 85470 85796 86133 86443 86707 86906 86959
54050H6959j35j75j8O2j16k60pM27N16J99q1p8M6K05M80P02N14J9k34n8P6j22
$$ 86959 86824 86649 86631 86693 86577 86317 86310 86737 87253 87452 87371 87293 87339 87544 88024 88726 89240 89259 89025 88967 89043 88921
54028H8921k73l2L08L42L25P33J462J945J986J928K062K290K338K026J298L22
$$ 88921 88648 88616 88924 89266 89591 90324 91786 93731 95717 97645 99707 101997 104335 106361 107659 107981
54012A07981n28r42r71q29n93k66j7o2l55o28p34p30p01o23m19l4M91R18R75O79
$$ 107981 107453 106511 105540 104711 104118 103852 103835 103773 103418 102790 102056 101326 100625 100002 99583 99549 100040 100958 101933 102612
53992A02612L87L51M45M61M56N44N88M14K17L68Q57J297J507J724K093K319K066
$$ 102612 102999 103350 103795 104256 104712 105256 105844 106258 106475 106843 107700 108997 110504 112228 114321 116640 118706
53975A18706J537J296J577K043K320K468K730L011K952K517K129K068K102J906
$$ 118706 120243 121539 123116 125159 127479 129947 132677 135688 138640 141157 143286 145354 147456 149362
53961A49362J609J494J439J098N53K35K04k1p01j432j700j529j311j248j282j376
$$ 149362 150971 152465 153904 155002 155555 155790 155994 155973 155272 153840 152140 150611 149300 148052 146770 145394
53945A45394j551j761j940k110k260k281k170k098k120k014j636j228j092j126
$$ 145394 143843 142082 140142 138032 135772 133491 131321 129223 127103 125089 123453 122225 121133 120007
53931A20007j012p51o83r64j290j261q30k88O2J39N1r8l07n89q73j044j086j051
$$ 120007 118995 118244 117561 116597 115307 114046 113216 112928 112990 113129 113180 113082 112775 112186 111313 110269 109183 108132
53913A08132q92n20nL99N43N17M65L89K12p8l89n37l29K41Q88J309J500J626J644
$$ 108132 107240 106720 106715 107114 107657 108174 108639 109028 109240 109162 108773 108236 107907 108148 109036 110345 111845 113471 115115
53894A15115J356Q48M92M40M71M16M56Q10J381J911K245K363K332K402K801L352
$$ 115115 116471 117319 117811 118251 118722 119138 119594 120404 121785 123696 125941 128304 130636 133038 135839 139191
53878A39191L585L395L244L488L909M163M310M484M363L464J898L67n61q64q28
$$ 139191 142776 146171 149415 152903 156812 160975 165285 169769 174132 177596 179494 179861 179300 178436 177608
53863A77608p03n95m46o9N89J269J625J585J337J132J178J591K206K603K562K391
$$ 177608 176905 176310 175864 175795 176384 177653 179278 180863 182200 183332 184510 186101 188307 190910 193472 195863
53847A95863K531K947L163K838K063J169M46K7j44k52m34o86r69j272j548j758
$$ 195863 198394 201341 204504 207342 209405 210574 211020 211047 210903 210651 210217 209531 208562 207290 205742 203984
53831B03984k026k470k867k847k542k600l248l828l658k963k473k403k411k328
$$ 203984 201958 199488 196621 193774 191232 188632 185384 181556 177898 174935 172462 170059 167648 165320
53817A65320k340k479k538k468k427k366k094j712j577j730j852j798j801j988
$$ 165320 162980 160501 157963 155495 153068 150702 148608 146896 145319 143589 141737 139939 138138 136150
53803A36150k128k031j841j757j708j543j301j119j016q98o86l84r5J9j04l67
$$ 136150 134022 131991 130150 128393 126685 125142 123841 122722 121706 120808 120122 119738 119643 119662 119558 119191
53787A19191o53r15j020p22q7L05k7p81j212j042o54l98k10L7K78M48N52M51j9
$$ 119191 118538 117623 116603 115881 115794 116099 116072 115291 114079 113037 112383 111985 111775 111812 112090 112538 113090 113541 113522
53768A13522o31q45m81L5K76K99L44M36M72M54M21L65L78O26J046J295J180Q75
$$ 113522 112891 112046 111565 111600 111876 112175 112519 112955 113427 113881 114302 114667 115045 115671 116717 118012 119192 120067
53750A20067N91L53K46N35J257J989K309K265K160K058J860J639J594J699J753
$$ 120067 120658 121011 121257 121792 123049 125038 127347 129612 131772 133830 135690 137329 138923 140622 142375
53735A42375J716J769K014K298K414K273J921J446R58N96N01O75Q56O49l5p89
$$ 142375 144091 145860 147874 150172 152586 154859 156780 158226 159184 159780 160281 160956 161812 162461 162426 161637
53719A61637j148j125j078j121j045q11p20j034j635k265k720k782k312j576j142
$$ 161637 160489 159364 158286 157165 156120 155309 154589 153555 151920 149655 146935 144153 141841 140265 139123
53704A39123j229j464j471j357j370j405j265j063j037j136j196j290j532j714
$$ 139123 137894 136430 134959 133602 132232 130827 129562 128499 127462 126326 125130 123840 122308 120594
53690A20594j571j263j186j304j172o22l8J41q4m07n77n15k84n4N7J08K17L09
$$ 120594 119023 117760 116574 115270 114098 113476 113438 113579 113495 113088 112511 111996 111712 111658 111715 111823 112040 112349
53672A12349K15k7j82j23J4O9K7k6K8K87O67Q51N97J13j43k1K31L87M89O10O74
$$ 112349 112564 112537 112355 112232 112246 112315 112342 112316 112344 112631 113298 114149 114746 114859 114716 114695 114926 115313 115802 116412 117086
53651A17086O95Q69J255J592J609J392J201J087R19P08O69R05J245J400J226Q39
$$ 117086 117781 118650 119905 121497 123106 124498 125699 126786 127705 128413 129082 129987 131232 132632 133858 134697
53635A34697N28N28P97J065J124J034R72R36Q00N24K42Q8P0J11J14N2oQ9L43N09
$$ 134697 135225 135753 136550 137615 138739 139773 140745 141681 142481 143005 143247 143335 143405 143516 143630 143682 143676 143765 144108 144617
53615A44617L27j17m29l59n5J76K04P9j51m30o22o00m24k51j23J8J26R8k0k2J56
$$ 144617 144944 144827 144398 144039 143984 144160 144364 144443 144292 143862 143240 142640 142216 141965 141842 141860 141986 142084 142064 142042 142198
53594A42198L41L63K53O7k57p09j014q86l85J13L28K63R2QJ83O34J090J193R08
$$ 142198 142539 142902 143155 143222 142965 142256 141242 140356 139971 140084 140412 140675 140767 140775 140958 141592 142682 143875 144783
53575A44783N80N00N68N32L77L52N71Q48R31Q26P85R73J240J299J092Q62Q46J035
$$ 144783 145363 145863 146431 146963 147340 147692 148263 149111 150042 150868 151653 152626 153866 155165 156257 157119 157965 159000
53557A59000J297J576J833J926J741J435J331J529J807J916J826J660J539J548
$$ 159000 160297 161873 163706 165632 167373 168808 170139 171668 173475 175391 177217 178877 180416 181964
53543A81964J672J707J383P61K98L60P75J024Q73N95N70Q22J036R75P16M54K41
$$ 181964 183636 185343 186726 187487 187785 188145 188920 189944 190817 191412 191982 192804 193840 194815 195531 195985 196226
53526A96226k9l73o44p36p14o65n41l00q6p4k00k55k25k97n19o80n93l17k5J87
$$ 196226 196197 195824 195180 194444 193730 193065 192524 192224 192138 192064 191864 191609 191384 191087 190568 189888 189295 188978 188953 189140
53506A89140K79K06J4j45j99k12k06r4Q3Q4j73l51m0O82J309J490J320J083R34
$$ 189140 189419 189625 189639 189494 189295 189083 188877 188783 188866 188950 188777 188426 188386 189068 190377 191867 193187 194270 195204
53487A95204R07J026J280J573J802J931J969J956K020K276K615K753K584K398
$$ 195204 196111 197137 198417 199990 201792 203723 205692 207648 209668 211944 214559 217312 219896 222294
53473B22294K561L094L683M113M405M601M654M637M826N353N942O210O144O062
$$ 222294 224855 227949 231632 235745 240150 244751 249405 254042 258868 264221 270163 276373 282517 288579
53459B88579O161O407O800P422Q099Q408Q241Q096Q515R390J0132J0409J0425
$$ 288579 294740 301147 307947 315369 323468 331876 340117 348213 356728 366118 376250 386659 397084
53446C97084J0517J0765J1024J1136J1027J0802J0680J0776J0913J0859J0660
$$ 397084 407601 418366 429390 440526 451553 462355 473035 483811 494724 505583 516243
53435E16243J0573J0661J0713J0558J0213R762R242Q737Q373Q182Q080Q015P920
$$ 516243 526816 537477 548190 558748 568961 578723 587965 596702 605075 613257 621337 629352 637272
53422F37272P642P119O619O529O836P086O904O300N451M441L427K715K407K143
$$ 637272 644914 652033 658652 665181 672017 679103 686007 692307 697758 702199 705626 708341 710748 712891
53408G12891J455K69j057k154k927l503m067m721n438o153o819p336p543p417
$$ 712891 714346 714615 713558 711404 708477 704974 700907 696186 690748 684595 677776 670440 662897 655480
53394F55480p308p620q311q941r222r248r156q938q710q767r095r173q581p581
$$ 655480 648172 640552 632241 623300 614078 604830 595674 586736 578026 569259 560164 550991 542410 534829
53380E34829o758o293n926n424m773l999l129k335j761j295o67J88J159K153L085
$$ 534829 528071 521778 515852 510428 505655 501656 498527 496192 494431 493136 492469 492657 493816 495969 499054
53365D99054L731L958M068M549N487O478P209P795Q465R173R728J0164J0730J1583
$$ 499054 502785 506743 510811 515360 520847 527325 534534 542329 550794 559967 569695 579859 590589 602172
53351F02172J2590J3463J4057J4508J5047J5713J6337J6823J7292J7881J8572
$$ 602172 614762 628225 642282 656790 671837 687550 703887 720710 738002 755883 774455
53340G74455J9315K0174K1124K1915K2397K2815K3499K4341K4920K5065K4996
$$ 774455 793770 813944 835068 856983 879380 902195 925694 950035 974955 1000020 1025016
53329A025016K4889K4665K4285K3891K3530K2997K2126K1043J9940J8824J7662
$$ 1025016 1049905 1074570 1098855 1122746 1146276 1169273 1191399 1212442 1232382 1251206 1268868
53318A268868J6552J5559J4541J3307J1872J0333Q632O699M679K808R93j138l784
$$ 1268868 1285420 1300979 1315520 1328827 1340699 1351032 1359664 1366363 1371042 1373850 1374843 1373705 1369921
53305A369921o729r663j2503j5236j7686j9640k1140k2383k3414k4172k4814k5618
$$ 1369921 1363192 1353529 1341026 1325790 1308104 1288464 1267324 1244941 1221527 1197355 1172541 1146923
53293A146923k6510k6950k6615k5851k5218k4774k4228k3607k3254k3198k3059
$$ 1146923 1120413 1093463 1066848 1040997 1015779 991005 966777 943170 919916 896718 873659
53282H73659k2674k2318k2066k1480k0275j8883j7871j7147j6197j4974j3911
$$ 873659 850985 828667 806601 785121 764846 745963 728092 710945 694748 679774 665863
53271F65863j3140j2294j1143r959r053q341p613o894o307n787n205m600m093
$$ 665863 652723 640429 629286 619327 610274 601933 594320 587426 581119 575332 570127 565527 561434
53258E61434l689l278k810k297j743j182o70k01L25R45J593K256L031L877M482
$$ 561434 557745 554467 551657 549360 547617 546435 545765 545564 545889 546834 548427 550683 553714 557591 562073
53243E62073M566M308M277M870N938O979P652Q008Q270Q554Q888R357J0032J0738
$$ 562073 566639 570947 575224 580094 586032 593011 600663 608671 616941 625495 634383 643740 653772 664510
53229F64510J1113J1049J0859J0846J0855J0509R790R064Q544Q049P343O470N567
$$ 664510 675623 686672 697531 708377 719232 729741 739531 748595 757139 765188 772531 779001 784568
53216G84568M601L510K388J375L97p44k095l515m872o114p182q043q864r947j1363
$$ 784568 789169 792679 795067 796442 796839 796095 794000 790485 785613 779499 772317 764274 755410 745463 734100
53201G34100j2743j3592j3815j3818j4009j4397j4741j4975j5239j5527j5564
$$ 734100 721357 707765 693950 680132 666123 651726 636985 622010 606771 591244 575680
53190E75680j5172j4607j4289j4323j4410j4265j3903j3527j3276j3155j3084
$$ 575680 560508 545901 531612 517289 502879 488614 474711 461184 447908 434753 421669
53179D21669j2942j2656j2268j1895j1580j1212j0639r851q999q259p671p136
$$ 421669 408727 396071 383803 371908 360328 349116 338477 328626 319627 311368 303697 296561
53167B96561o608o154n780n375m921m649m711m830m599m162m100m546m871m571
$$ 296561 289953 283799 278019 272644 267723 263074 258363 253533 248934 244772 240672 236126 231255 226684
53153B26684l989l731l751l621l396l507l832l678k851k085k095k675l103l083
$$ 226684 222695 218964 215213 211592 208196 204689 200857 197179 194328 192243 190148 187473 184370 181287
53139A81287k826k593k518k669k907k872k457k114k250k565k399j692j088j050
$$ 181287 178461 175868 173350 170681 167774 164902 162445 160331 158081 155516 153117 151425 150337 149287
53125A49287j356j603j748j929k067j995j742j448j123p65n16m81n20m61m18n69
$$ 149287 147931 146328 144580 142651 140584 138589 136847 135399 134276 133511 132995 132514 131994 131533 131115 130546
53109A30546p46o43m14o01j329k003k079j724j403j093m73L40Q05P12M16K27M3
$$ 130546 129800 129157 128743 128142 126813 124810 122731 121007 119604 118511 118038 118378 119183 119895 120311 120538 120581
53092A20581k17l35k19k29o39j096j054n61j76j57j89N5M69P33P26N65L92K79
$$ 120581 120364 120029 119810 119581 118942 117846 116792 116231 116055 115898 115709 115764 116233 116966 117692 118257 118649 118928
53074A18928K11J47J24K71N88Q33P65M50J57Pr8k28l18k96j47J24M33O06N72M98
$$ 118928 119139 119286 119410 119681 120269 121102 121867 122317 122474 122481 122383 122155 121837 121541 121394 121518 121951 122557 123129 123627
53054A23627N43N48L01p0k23j33j00k47l37k00k9n7k48m26n06m50k36L0J06p2
$$ 123627 124170 124718 125019 124949 124726 124593 124493 124246 123909 123709 123680 123623 123375 122949 122443 121993 121757 121787 121893 121821
53034A21821l18m74n93p51r08j049j230j323j045l96J38J16k95n73m93k83j87
$$ 121821 121503 121029 120436 119685 118777 117728 116498 115175 114130 113734 113872 113988 113693 113120 112627 112344 112157
53017A12157k14k63k62j33J69N36P44O66L73J8l08n64p55q69q59o64l37o6k6j85
$$ 112157 111943 111680 111418 111285 111454 111990 112734 113400 113773 113791 113483 112919 112164 111295 110436 109772 109435 109369 109343 109158
52997A09158l71m83n76p05p80o38k87L5J11L5R5L82O58O81N13L47J60j60n26o73
$$ 109158 108787 108304 107728 107023 106243 105605 105318 105353 105464 105499 105594 105976 106634 107315 107828 108175 108335 108175 107649 106976
52977A06976n16k34j5R2Q5l5j53j46m1L2O4J38K03J53O4P9R0q8k92j20L82O39
$$ 106976 106460 106226 106211 106303 106388 106353 106200 106054 106013 106045 106109 106247 106450 106603 106667 106746 106836 106748 106456 106336 106718 107357
52955A07357L28j21j29K12L49Q6j94j11K09L37N4l76m74j05L20L14o1k92j20J93
$$ 107357 107685 107564 107435 107647 107996 108082 107888 107777 107986 108323 108377 108001 107527 107422 107742 108056 107995 107703 107583 107776
52935A07776L45L76M01L06Ok59j94J41M73O39O49N23L39K50K69K08Lj17J0J71
$$ 107776 108121 108497 108898 109204 109210 108951 108757 108898 109371 110010 110659 111182 111521 111771 112040 112248 112251 112134 112144 112315
52915A12315J09m4JJ98K47Q6m8j8R3K04L51N04N32L63M5k94m71l42k9P4k68p76
$$ 112315 112424 112380 112381 112579 112826 112912 112864 112846 112939 113143 113494 113998 114530 114893 114938 114644 114173 113831 113802 113876 113608 112832
52893A12832r97q27n12k57r6l3n6n7%o1l38n71m52j02Q2k1j89k70l30l92l84l44
$$ 112832 111835 111008 110496 110239 110143 110110 110054 109997 109997 109936 109598 109027 108575 108473 108555 108534 108345 108075 107745 107353 106969 106625
52871A06625l53k98qL79N12L58K22K36J62j64n46p28p10n88l72j27kJ2J34M47
$$ 106625 106272 105974 105966 106345 106857 107215 107437 107673 107835 107671 107125 106397 105687 105099 104727 104600 104598 104610 104744 105191
52851A05191O75N46J45k12l16j59J33K97J11k95n16m06k56k90k69R0N58O26K37
$$ 105191 105866 106412 106557 106345 106029 105870 106003 106300 106411 106116 105600 105194 104938 104648 104379 104469 105027 105653 105890
52832A05890j53k09l5J40K56K83J35j00r2L05P43P45L29m1p4N2O2j8JJ43K80L92
$$ 105890 105737 105528 105493 105633 105889 106172 106307 106207 106115 106420 107163 107908 108237 108196 108122 108174 108236 108218 108219 108362 108642 109034
52810A09034N51P36Q05P06N30L70K74L32N99R23J011P50L17n9l20n25p47j012
$$ 109034 109585 110321 111126 111832 112362 112732 113006 113338 113937 114860 115871 116621 116938 116879 116559 116034 115287 114275
52792A14275j223j140o88k67m16j055j483j228o20k83l96p41j073j175q12o1N22
$$ 114275 113052 111912 111224 110957 110541 109486 108003 106775 106155 105872 105476 104735 103662 102487 101675 101614 102136
52775A02136M98J29j1J73L38L13K47J69l6k93l91l90n00n93l25K02M56K51QN7
$$ 102136 102634 102763 102752 102925 103263 103576 103823 103992 103956 103663 103272 102882 102382 101789 101464 101666 102122 102373 102381 102438
52755A02438K01K01K16M75Q15R48Q70P42N93L72J08j97n78q67p66l33p0k71o01
$$ 102438 102639 102840 103056 103531 104346 105294 106164 106906 107499 107871 107979 107782 107204 106337 105571 105238 105168 104897 104296
52736A04296o49n15n25n96m49j67j10l01m24l45k75l06k47J5L47N80P07P08N36
$$ 104296 103647 103132 102607 102011 101562 101395 101285 100984 100560 100215 99940 99634 99387 99402 99749 100329 101036 101744 102280
52717A02280L14K89M64N06K05k30m63m67m01l09j54o4k22m95m73j8M78N28J87
$$ 102280 102594 102883 103347 103853 104058 103828 103365 102898 102497 102188 102034 101970 101748 101253 100780 100762 101240 101768 101955
52698A01955m9R6L57L57J14o0j6J39L38O16Q80Q53M48j3j37J03L84M63L88L37
$$ 101955 101906 102002 102359 102716 102830 102770 102754 102893 103231 103847 104727 105580 106028 106015 105878 105981 106365 106828 107216 107553
52678A07553L62L44J65j15k76j43K05M98N36L45P9r7o1J78M00L18p4m45n06l96
$$ 107553 107915 108259 108424 108309 108033 107890 108095 108593 109129 109474 109553 109456 109395 109573 109973 110291 110217 109772 109266 108870
52658A08870m60p50r13o47j20K12J39q6j28k7j24n11q16o57j59K00K17J46K76
$$ 108870 108410 107660 106747 106100 105980 106192 106331 106245 106117 106090 105966 105455 104639 103982 103823 104023 104240 104386 104662
52639A04662N20O25N23L63K42J39N8R0K62M16L78J77M4J15K26J32j50l49k91r7
$$ 104662 105182 105807 106330 106693 106935 107074 107132 107222 107484 107900 108278 108455 108499 108614 108840 108972 108822 108473 108182 108085
52619A08085N7J75K99L31J80n4k19l22m42n07m23k49r9P1K99M40L78L21M90O84
$$ 108085 108142 108317 108616 108947 109127 109073 108854 108532 108090 107583 107160 106911 106812 106883 107182 107622 108000 108321 108811 109495
52599A09495N39J38m7J25K99K43J61K72M56N60O59P83P20L68m7l04n02p28p58
$$ 109495 110034 110172 110125 110250 110549 110792 110953 111225 111681 112241 112900 113683 114403 114771 114724 114420 113918 113190 112432
52580A12432m19nK2l40o29m59R6O39P86M83J21J72O41J024R64O53M06J72k59p80
$$ 112432 112013 112008 112030 111690 111061 110602 110698 111337 112123 112606 112727 112899 113540 114564 115528 116181 116587 116759 116500 115720
52560A15720j075j045q40n59k44j8J7m5r4k22m92o92o08l85l14l53k29R3L63M69
$$ 115720 114645 113600 112760 112201 111957 111939 111956 111911 111817 111595 111103 110411 109803 109418 109104 108751 108522 108615 108978 109447
52540A09447N38O08N49L68K68L29M11L99L49L27K70J09j25l38m21k96n2Q0lj02
$$ 109447 109985 110593 111142 111510 111778 112107 112518 112917 113266 113593 113863 113972 113847 113509 113088 112792 112740 112820 112817 112715
52520A12715l0J27K15L39O15P75M69j35m95m18k56k69k87j25J09K82M74O80O51
$$ 112715 112685 112812 113027 113366 113981 114756 115225 115090 114595 114177 113921 113652 113365 113240 113349 113631 114105 114785 115436
52501A15436K70j84l80l33k26r9K3n9m36q12q36n72l57k66j00J71K68N0k37k78
$$ 115436 115706 115522 115142 114809 114583 114484 114507 114448 114012 113200 112364 111792 111435 111169 111069 111240 111508 111558 111321 111043
52481A11043n9K07L65L80K48Nk18k77j62J2J31J82J78J27M8K8J46L76N80O20M63
$$ 111043 110984 111191 111556 111936 112184 112189 111971 111694 111532 111544 111675 111857 112035 112162 112210 112238 112384 112760 113340 113960 114423
52460A14423K02k5j03K8L58P44R31P07J82j90k7N14Q88Q33O79Q31J167J252J002
$$ 114423 114625 114600 114497 114525 114883 115627 116558 117265 117447 117257 117230 117744 118632 119465 120144 120975 122142 123394 124396
52441A24396P04M51J7o23j085j125r96j011j049q65n72m44m26k59N9L11M73O69
$$ 124396 125100 125551 125568 124945 123860 122735 121739 120728 119679 118814 118242 117798 117372 117113 117172 117483 117956 118625
52423A18625P82N51P2k12j37np6j56O9N45R44J057R20O62L84J36q0k20j39K16
$$ 118625 119407 119958 120030 119818 119681 119676 119600 119444 119513 120058 121002 122059 122979 123641 124025 124161 124081 123861 123722 123938
52403A23938O30P86O31L62J09j47k96j28K58M17J12l27m81m07m59p00q20o23k94
$$ 123938 124568 125354 125985 126347 126456 126309 126013 125885 126143 126560 126672 126345 125864 125457 124998 124298 123478 122855 122561
52384A22561j28k08m03n88o99p10o46n85n82n72m10o8K49L13J93J96M20N60L33
$$ 122561 122433 122225 121822 121234 120535 119825 119179 118594 118012 117440 117030 116962 117211 117524 117717 117913 118333 118893 119226
52365A19226n8j70Q8L66M31M28N36O67O87O74P77R15Q86O82N24O20R43J289J426
$$ 119226 119168 118998 119086 119452 119883 120311 120847 121514 122201 122875 123652 124567 125453 126135 126659 127279 128222 129511 130937
52346A30937J290J053R87J181J510J809J994J925J430N43l35q04q91r80j286j538
$$ 130937 132227 133280 134267 135448 136958 138767 140761 142686 144116 144659 144324 143520 142629 141649 140363 138825
52330A38825j320o41nJ04k13l84n1N11P45M84N4j70j38k4K5J0M3K38N89R34J165
$$ 138825 137505 136864 136859 136963 136750 136366 136315 136826 137571 138055 138109 137939 137801 137777 137802 137812 137855 138093 138682 139616 140781
52309A40781J319J449J469J328J185J115Q39Q7p87j062n82K4J91J03K39N99P84
$$ 140781 142100 143549 145018 146346 147531 148646 149485 149572 148785 147723 147141 147165 147356 147459 147698 148297 149081
52292A49081O03K76Q2J43M71R41J287J305J129J044J141J262J265J156J012R41
$$ 149081 149684 149960 150042 150185 150656 151597 152884 154189 155318 156362 157503 158765 160030 161186 162198 163139
52276A63139J081J445J822J962J900J866J976K150K308K511K845L311L822M223
$$ 163139 164220 165665 167487 169449 171349 173215 175191 177341 179649 182160 185005 188316 192138 196361
52262A96361M360M196L878L595L434L433L672M119M461M373L959L733M014M555
$$ 196361 200721 204917 208795 212390 215824 219257 222929 227048 231509 235882 239841 243574 247588 252143
52248B52143M833M609M124L806L911M360M809M911M671M472M659N047N078M498
$$ 252143 256976 261585 265709 269515 273426 277786 282595 287506 292177 296649 301308 306355 311433 315931
52234C15931L716L278L182K950K362J758J499J438J191O78J50j97l30k82j41j09
$$ 315931 319647 322925 326107 329057 331419 333177 334676 336114 337305 337983 338133 337936 337606 337324 337183 337074
52218C37074k60l12K0N81R83J190J428J593J303O36K98P12J446J820J775J695
$$ 337074 336814 336502 336522 337103 338086 339276 340704 342297 343600 344236 344534 345246 346692 348512 350287 351982
52202C51982J738J770J792J943K180K334K447K750L291L837M147M175M007L784
$$ 351982 353720 355490 357282 359225 361405 363739 366186 368936 372227 376064 380211 384386 388393 392177
52188C92177L616L409K962K350J970K025K151J940J523J285J166P74R7l74l31
$$ 392177 395793 399202 402164 404514 406484 408509 410660 412600 414123 415408 416574 417348 417445 417071 416740
52173D16740k0J83J96J06p2l58p28j140j466j471j079o04m36n09m62k53j69k32
$$ 416740 416720 416903 417099 417205 417133 416775 416047 414907 413441 411970 410891 410287 409851 409342 408880 408627 408458 408226
52155D08226q2L59O47N29M01P29J364J852K096K268K322K075J644J360J246J023
$$ 408226 408144 408503 409150 409679 410080 410809 412173 414025 416121 418389 420711 422786 424430 425790 427036 428059
52139D28059O33L80M80Q12J183J551J868J976J802J465J063N83J26ML82R59J247
$$ 428059 428692 429072 429552 430364 431547 433098 434966 436942 438744 440209 441272 441855 441981 441985 442367 443326 444573
52122D44573J060N57j21r68j837k363k360k066j849j732j497j180j127j455j799
$$ 444573 445633 446190 446069 445101 443264 440901 438541 436475 434626 432894 431397 430217 429090 427635 425836
52107D25836j781j524j365j289r84m20Q6L88O80R91R40L26l51m34OK46p4m97l88
$$ 425836 424055 422531 421166 419877 418893 418473 418559 418947 419627 420618 421558 421884 421533 421099 421105 421351 421277 420780 420392
52088D20392K75R64J253J150Q70N82L59K69L78O46Q72Q45N61K87K53L67L54J77
$$ 420392 420667 421631 422884 424034 424904 425486 425845 426114 426492 427138 428010 428855 429416 429703 429956 430323 430677 430854
52070D30854J47M93J027J401J609K002K754L602M193M564N040N722O281O357N994
$$ 430854 431001 431494 432521 433922 435531 437533 440287 443889 448082 452646 457686 463408 469689 476046 482040
52055D82040N570N372N372N394N356N270N103M755M201L598L185L037K986K863
$$ 482040 487610 492982 498354 503748 509104 514374 519477 524232 528433 532031 535216 538253 541239 544102
52041E44102K777L000L520L876L628K918K278J968J705J142L26m59j111j753k431
$$ 544102 546879 549879 553399 557275 560903 563821 566099 568067 569772 570914 571240 570781 569670 567917 565486
52026E65486l016l383l494l328k921k472k219k188k188k112k010j886j626j236
$$ 565486 562470 559087 555593 552265 549344 546872 544653 542465 540277 538165 536155 534269 532643 531407
52012E31407r55r38r86p82l29O8K46L55O43J184J820K266K256J789J263J145J471
$$ 531407 530452 529514 528528 527746 527417 527485 527731 528086 528729 529913 531733 533999 536255 538044 539307 540452 541923
51995E41923J814J835J651J528J460J262R69Q24Q43O95Q7q28j594j912j876j800
$$ 541923 543737 545572 547223 548751 550211 551473 552442 553266 554109 554804 554891 554063 552469 550557 548681 546881
51979E46881j898k153k457k781l192l662l975l928l595l276l184l245l256l142
$$ 546881 544983 542830 540373 537592 534400 530738 526763 522835 519240 515964 512780 509535 506279 503137
51965E03137k991k897k852k808k813k986l332l627l636l421l287l372l473l400
$$ 503137 500146 497249 494397 491589 488776 485790 482458 478831 475195 471774 468487 465115 461642 458242
51951D58242l308l467l797l972l935m025m454m990n286n335n396n640o001o335
$$ 458242 454934 451467 447670 443698 439763 435738 431284 426294 421008 415673 410277 404637 398636 392301
51937C92301o522o514o346o108n827n452n018m720m716m946n241n493n649n661
$$ 392301 385779 379265 372919 366811 360984 355532 350514 345794 341078 336132 330891 325398 319749 314088
51923C14088n552n458n410n264m938m630m580m695m675m420m119l908l683l315
$$ 314088 308536 303078 297668 292404 287466 282836 278256 273561 268886 264466 260347 256439 252756 249441
51909B49441k822k222j454n13L85R59J128J073J081J319J698J938J838J486J088
$$ 249441 246619 244397 242943 242430 242815 243774 244902 245975 247056 248375 250073 252011 253849 255335 256423
51894B56423O69O1p31j372j556j370j157j059q75m01K66Q47J224J577K119K785
$$ 256423 257092 257153 256422 255050 253494 252124 250967 249908 249033 248632 248898 249745 250969 252546 254665 257450
51878B57450L253L313L174L262L750M349M619M364L696K824J914J128N88K54j06
$$ 257450 260703 264016 267190 270452 274202 278551 283170 287534 291230 294054 295968 297096 297684 297938 297832
51863B97832o70j325j778j887j756j538j195o13J63R20J418J473Q94m02k159l806
$$ 297832 297162 295837 294059 292172 290416 288878 287683 287070 287233 288153 289571 291044 291938 291536 289377 285571
51847B85571m881n383n568n586n402n049m706m423m002l283k455j943j940k245
$$ 285571 280690 275307 269739 264153 258751 253702 248996 244573 240571 237288 234833 232890 230950 228705
51833B28705k587k933l380l840m016l783l369l099l003k812k266j383m08L61P35
$$ 228705 226118 223185 219805 215965 211949 208166 204797 201698 198695 195883 193617 192234 191826 192187 192922
51818A92922P67P19Q56J218J645J963K108K100J996J854J602J055K05o16j069
$$ 192922 193689 194408 195264 196482 198127 200090 202198 204298 206294 208148 209750 210805 211010 210394 209325
51803B09325j241j489j853j953j583j037o84m83j82J99M06L33P8k86p29j117j275
$$ 209325 208084 206595 204742 202789 201206 200169 199485 199002 198820 199019 199425 199758 199836 199550 198821 197704 196429
51786A96429j280j424j836k300k490k289j797j201o72l36k57m02o61q44q18o12
$$ 196429 195149 193725 191889 189589 187099 184810 183013 181812 181140 180804 180547 180145 179484 178640 177822 177210
51770A77210l90k34r1N1K7k66o15o53l14N0O0k34m10j93K02L24Q2j30L6M11O25
$$ 177210 176820 176586 176495 176546 176573 176307 175692 175039 174725 174775 174835 174601 174191 173998 174200 174524 174606 174476 174512 174923 175548
51749A75548O60P42Q11N81J29n8J56L04O2k17r1K45L34K09J89K20k2m48n71k98
$$ 175548 176208 176950 177761 178342 178471 178413 178569 178873 178935 178718 178627 178872 179206 179415 179604 179824 179802 179354 178783 178485
51729A78485o4j43k76k03q7j79l91m59k98j8K38L37K14j2j38j39j12mL29Q06J125
$$ 178485 178421 178278 178002 177799 177712 177533 177142 176683 176385 176367 176605 176942 177156 177144 177006 176867 176755 176751 177080 177886 179011
51708A79011J183J201J378J673K011K386K668K595K104J412P03j6o53j000j052
$$ 179011 180194 181395 182773 184446 186457 188843 191511 194106 196210 197622 198325 198309 197656 196656 195604
51693A95604j126j393j652j689j597j536j454j295j184j156r55m09J99M76M61
$$ 195604 194478 193085 191433 189744 188147 186611 185157 183862 182678 181522 180567 180158 180357 180833 181294
51678A81294M82O43P38P00P47J075J584J970J992J664J215Q52N49J94q1N4O36
$$ 181294 181776 182419 183157 183857 184604 185679 187263 189233 191225 192889 194104 194956 195505 195699 195618 195672 196308
51661A96308J231J345Q90J47n52r56r74p78o27m82p9M95O67J06p45j213j187r78
$$ 196308 197539 198884 199774 199921 199369 198413 197439 196661 196034 195552 195473 195968 196635 196741 195996 194783 193596 192618
51643A92618p15l21L5P6j11j83j37l07p27r86q09m19j02J43L52L45J4m06o31p24
$$ 192618 191903 191582 191617 191693 191582 191399 191262 190955 190228 189242 188433 188014 187912 188055 188407 188752 188766 188360 187729 187005
51623A87005r21j232j450j459j259q18j47M82P04M80J88J85M25N92N62N62Q61
$$ 187005 186084 184852 183402 181943 180684 179866 179719 180201 180905 181385 181573 181758 182183 182775 183337 183899 184760
51606A84760J457K074K467K593K584K547K399J890Q32n77j761k187j858j224o65
$$ 184760 186217 188291 190758 193351 195935 198482 200881 202771 203603 203026 201265 199078 197220 195996 195331
51591A95331k16J81M29M27L13L34M80M58Kq19j660k180k304k243k233k283k234
$$ 195331 195115 195296 195725 196152 196465 196799 197279 197737 197739 196920 195260 193080 190776 188533 186300 184017 181783
51574A81783k012j707j410j121q61p10o59n68l26K2L62O30P72P53O31M78K50q4
$$ 181783 179771 178064 176654 175533 174672 173962 173303 172735 172409 172431 172793 173423 174195 174948 175579 176057 176307 176223
51556A76223l43k81K0J91N5k09m02n28o06n36l35j64k5K52N46M86N9j81J11O07
$$ 176223 175880 175599 175619 175810 175865 175656 175254 174726 174120 173584 173249 173085 173060 173312 173858 174344 174403 174222 174333 174940
51536A74940R10J162J646K157K382K511K832K987K390J195K07j75k57l35l74l80
$$ 174940 175850 177012 178658 180815 183197 185708 188540 191527 193917 195112 195319 195144 194887 194552 194178 193798
51520A93798m71m01K85J482K466K852L015L339L622L573L377L387L642M049M610
$$ 193798 193327 192926 193211 194693 197159 200011 203026 206365 209987 213560 216937 220324 223966 228015 232625
51505B32625N139N175M608M063M214M936N631O082O583P285P941Q253Q140P614
$$ 232625 237764 242939 247547 251610 255824 260760 266391 272473 279056 286341 294282 302535 310675 318289
51491C18289O674N371L826K191O70n83j671k899m346n691o654p364q042q601q835
$$ 318289 324963 330334 334160 336351 337021 336438 334767 331868 327522 321831 315177 307813 299771 291170 282335
51476B82335q784q606q232p540o719o098n646n016m077l097k368j912j613j398
$$ 282335 273551 264945 256713 249173 242454 236356 230710 225694 221617 218520 216152 214240 212627 211229
51462B11229j265j264j453j683j593j022l31j8q5j44p4j86o29j120j388j565j842
$$ 211229 209964 208700 207247 205564 203971 202949 202618 202600 202515 202371 202297 202111 201482 200362 198974 197409 195567
51445A95567k062j961j685j648j915k035j620r19n59p92j196j234r14o58o36o17
$$ 195567 193505 191544 189859 188211 186296 184261 182641 181722 181163 180371 179175 177941 177027 176369 175733 175116
51429A75116n34p02j201j477j018k32j2m88q36m69J63L27K5j90j03k8j97m35n29
$$ 175116 174582 173880 172679 171202 170184 169952 169940 169452 168616 168147 168310 168637 168662 168472 168369 168341 168144 167709 167180
51410A67180n14n18n45n60n62n41m56l31k50k11r5J40L64L98J76k08n66o81m73
$$ 167180 166666 166148 165603 165043 164481 163940 163484 163153 162903 162692 162597 162737 163101 163499 163675 163467 162901 162220 161747
51391A61747p5L05O16R30J223J401J471J523J512J350J267J687K579L241L073
$$ 161747 161672 161977 162593 163523 164746 166147 167618 169141 170653 172003 173270 174957 177536 180777 183850
51376A83850K347J782J597J400R67N36K87K9l79p32r08j150j591j840j529r76
$$ 183850 186197 187979 189576 190976 191943 192479 192766 192795 192416 191684 190776 189626 188035 186195 184666 183690
51360A83690q23j107j277j032o63m16p9N55J234J553J444J109O92K72K4M5J80
$$ 183690 182867 181760 180483 179451 178788 178372 178293 178848 180082 181635 183079 184188 184880 185152 185176 185221 185401
51343A85401K13K15M21Q16J081J031Q45Q07R51J110J196J336J625J915J959J842
$$ 185401 185614 185829 186250 187066 188147 189178 190023 190830 191781 192891 194087 195423 197048 198963 200922 202764
51327B02764K025K823L915M691N009N303N940O777P548Q304R175R969J0417J0647
$$ 202764 204789 207612 211527 216218 221227 226530 232470 239247 246795 255099 264274 274243 284660 295307
51313B95307J0995J1389J1341J0567R267P733N996M020J895l05k620m960p008
$$ 295307 306302 317691 329032 339599 348866 356599 362595 366615 368510 368205 365585 360625 353617
51300C53617q585r920j1243j2326j2687j2265j1518j0867j0265r421q273p099
$$ 353617 345032 335112 323869 311543 298856 286591 275073 264206 253941 244520 236247 229148
51288B29148o265n893n757n498n011m550m377m339m061l474k933k694k606k405
$$ 229148 222883 216990 211233 205735 200724 196174 191797 187458 183397 179923 176990 174296 171690 169285
51274A69285k111j873j661j340r75p29n23j47K84L00k90j031j271q63k27J90L07
$$ 169285 167174 165301 163640 162300 161325 160596 160073 159926 160210 160510 160220 159189 157918 157055 156828 157018 157325
51257A57325K88K73K86L33M63O66Q10P59N75N04O21O36K50l59o80n64m03n51q24
$$ 157325 157613 157886 158172 158505 158968 159634 160444 161203 161778 162282 162903 163539 163789 163430 162750 162186 161783 161232 160408
51238A60408q45o42n74p76j008j063r75q42o41l22L4L03L99K63o8l82l59J01P65
$$ 160408 159563 158921 158347 157571 156563 155500 154525 153683 153042 152720 152754 153057 153456 153719 153651 153269 152910 153011 153776
51219A53776J288J548J668J767J771J530J069O56N15N50M98L16K06K70L56L63
$$ 153776 155064 156612 158280 160047 161818 163348 164417 165073 165588 166138 166636 166952 167158 167428 167784 168147
51203A68147M41O88Q79P54L97P9j53m04n95n34l09k60n27q51r33p15l48m5j0k83
$$ 168147 168588 169276 170155 170909 171306 171385 171232 170828 170233 169699 169390 169130 168603 167752 166819 166104 165756 165711 165701 165418
51183A65418o26p92q54j050j323j381j151q40m98L4O15P15J32n73o61p8N79P87
$$ 165418 164792 164000 163146 162096 160773 159392 158241 157401 156903 156937 157552 158267 158399 157826 157165 157087 157666 158453
51165A58453N21R0j60n6K91O00P24P72Q39Q32O97O07P04Q51Q44P77R07J252J520
$$ 158453 158974 159064 158904 158848 159139 159739 160463 161235 162074 162906 163603 164210 164914 165765 166609 167386 168293 169545 171065
51146A71065J474J138O91K83mj36j05Q8L82N75M61P1l18m77l90j48J32K36j2m23
$$ 171065 172539 173677 174368 174651 174647 174511 174406 174494 174876 175451 175912 175983 175665 175188 174798 174650 174782 175018 175006 174583
51126A74583n37k19J02Pl48n27m61m03m49l95j29K19M97O51O24L67Pk50l58m28
$$ 174583 174046 173827 173929 173936 173588 173061 172600 172197 171748 171353 171224 171443 171940 172591 173215 173582 173589 173339 172981 172553
51106A72553m51k91O0L76M53L16J42O7J29K69L82M14M08L89L18K21K43M13M43
$$ 172553 172102 171811 171871 172247 172700 173016 173158 173225 173354 173623 174005 174419 174827 175216 175534 175755 175998 176411 176854
51087A76854K4o97j173j095p71p45j097j382j156n17N0K54K25K05J93J16Q3K17
$$ 176854 176878 176181 175008 173913 173142 172397 171300 169918 168762 168245 168295 168549 168774 168979 169172 169288 169371 169588
51069A69588L67L21K51N28J069J330J106Q57R90J269J264J020Q38P31N65M90P54
$$ 169588 169955 170276 170527 171055 172124 173454 174560 175417 176407 177676 178940 179960 180798 181529 182094 182584 183338
51052A83338J206J449J417J364J333J089N94J52j5K2J43L18M75M98M08L23K49
$$ 183338 184544 185993 187410 188774 190107 191196 191790 191942 191927 191949 192092 192410 192885 193383 193791 194114 194363
51035A94363J22K1L2l2l88q40r44o57l91l87m02j51K66N59N77L44J5j26J16N57
$$ 194363 194485 194506 194538 194506 194118 193278 192334 191677 191286 190899 190497 190346 190612 191171 191748 192092 192107 191981 192097 192654
51015A92654P89P09N57M83L66J70J05L02O26R69J417J990K494K786K906K839K522
$$ 192654 193443 194152 194709 195192 195558 195728 195833 196135 196761 197730 199147 201137 203631 206417 209323 212162 214684
50998B14684K184K300L003L815M210M127L741L121K432K125K483L192L687L755
$$ 214684 216868 219168 222171 225986 230196 234323 238064 241185 243617 245742 248225 251417 255104 258859
50984B58859L508L013K321J657J178O48k01j133j617j547j348j353j463j526j628
$$ 258859 262367 265380 267701 269358 270536 271184 270983 269850 268233 266686 265338 263985 262522 260996 259368
50969B59368j872k126k248k327k490k570k215j339l16L32M66M55P38J325J797
$$ 259368 257496 255370 253122 250795 248305 245735 243520 242181 241865 242197 242663 243118 243856 245181 246978
50954B46978J848J637J527J663J901K087K172K140K014J946K155K681L309L757
$$ 246978 248826 250463 251990 253653 255554 257641 259813 261953 263967 265913 268068 270749 274058 277815
50940B77815L912L847L675L417L039K601K321K358K565K600K287J765J219O82
$$ 277815 281727 285574 289249 292666 295705 298306 300627 302985 305550 308150 310437 312202 313421 314103
50926C14103J87n0K20R74J939K865L664M348M908N287N419N326N157N076N080
$$ 314103 314290 314240 314460 315434 317373 320238 323902 328250 333158 338445 343864 349190 354347 359423 364503
50911C64503N059N033N215N767O635P660Q750R817J0749J1495J2122J2675J3101
$$ 364503 369562 374595 379810 385577 392212 399872 408622 418439 429188 440683 452805 465480 478581
50898D78581J3402J3662J3877J3872J3538J3048J2630J2231J1601J0656R627Q814
$$ 478581 491983 505645 519522 533394 546932 559980 572610 584841 596442 607098 616725 625539
50886F25539Q264P733O991O145N571N488N670N789N796N757N404M324K657J153
$$ 625539 633803 641536 648527 654672 660243 665731 671401 677190 682986 688743 694147 698471 701128 702281
50872G02281L33r3p68j953l477n094o612p871q890r895j1004j2047j2893j3677
$$ 702281 702614 702521 701753 699800 696323 691229 684617 676746 667856 657961 646957 634910 622017 608340
50858F08340j4491j5129j5391j5359j5070j4304j3060j1900j1261j0782r860q675
$$ 608340 593849 578720 563329 547970 532900 518596 505536 493636 482375 471593 461733 453058
50846D53058p899p564p050o229n746n900o054n597m833m386m197l834l316l047
$$ 453058 445159 437595 430545 424316 418570 412670 406616 401019 396186 391800 387603 383769 380453 377406
50832C77406l022k811k292j799j472j014l15J45j03p71j025l97P47J656J940J825
$$ 377406 374384 371573 369281 367482 366010 364996 364681 364826 364723 363952 362927 362530 363277 364933 366873 368698
50816C68698J829K293L163M080M652M719M492M464N045O171P288P834P771P601
$$ 368698 370527 372820 375983 380063 384715 389434 393926 398390 403435 409606 416894 424728 432499 440100
50802D40100P877Q682R714J0707J1681J2718J3735J4621J5502J6610J7919J9152
$$ 440100 447977 456659 466373 477080 488761 501479 515214 529835 545337 561947 579866 599018
50790E99018K0226K1402K2868K4434K5848K7201K8665L0022L0831L1082L1252
$$ 599018 619244 640646 663514 687948 713796 740997 769662 799684 830515 861597 892849
50779H92849L1625L1841L1339K9988K8060K5784K3190K0351J7489J4768J2193
$$ 892849 924474 956315 987654 1017642 1045702 1071486 1094676 1115027 1132516 1147284 1159477
50768A159477R798P799O428N673N328N254N435N783O098O357O784P398P634O769
$$ 1159477 1169275 1177074 1183502 1189175 1194503 1199757 1205192 1210975 1217073 1223430 1230214 1237612 1245246 1252015
50754A252015M744K171n25l591p381j1646j5745j9339k2503k5325k7691k9486
$$ 1252015 1256759 1258930 1258405 1254814 1247433 1235787 1220042 1200703 1178200 1152875 1125184 1095698
50742A095698l0655l1113l0858l0081k8990k7544k5621k3337k0959j8553j6028
$$ 1095698 1065043 1033930 1003072 972991 944001 916457 890836 867499 846540 827987 811959
50731H11959j3431j0889q347n786l592k219j469o09O33J651J799J222N35M0l98
$$ 811959 798528 787639 779292 773506 769914 767695 766226 765617 766250 767901 769700 770922 771457 771497 771099
50716G71099r09j483k118k839l571m263n034o063p348q732j0046j1131j1906j2487
$$ 771099 770190 768707 766589 763750 760179 755916 750882 744819 737471 728739 718693 707562 695656 683169
50702F83169j3076j3621j3802j3515j3081j2739j2235j1227r874q631p616o566
$$ 683169 670093 656472 642670 629155 616074 603335 591100 579873 569999 561368 553752 547186
50690E47186n353m161l121k149j160j61R29K282L871N432O748P843Q834R819J0922
$$ 547186 541833 537672 534551 532402 531242 531081 532010 534292 538163 543595 550343 558186 567020 576839 587761
50675E87761J2215J3558J4717J5671J6606J7561J8308J8675J8756J8672J8398
$$ 587761 599976 613534 628251 643922 660528 678089 696397 715072 733828 752500 770898
50664G70898J7895J7218J6421J5490J4498J3592J2682J1388R519P344N220L152
$$ 770898 788793 806011 822432 837922 852420 866012 878694 890082 899601 906945 912165 915317
50652I15317J083o38j526j649j588j650j479o95M84J544K370L282M404N390N774
$$ 915317 916400 915762 914236 912587 910999 909349 907870 907175 907659 909203 911573 914855 919259 924649 930423
50637I30423N434M553L299J706k08k288m235n765o840p709q657r597j0093r788
$$ 930423 935857 940410 943709 945415 945207 942919 938684 932919 926079 918370 909713 900116 890023 880235
50623H80235q720p180n416l588j822j41J628L692O048Q512J0928J3200J5204J6932
$$ 880235 871515 864335 858919 855331 853509 853368 854996 858688 864736 873248 884176 897376 912580 929512
50609I29512J8623K0470K2164K3069K2942K2179K1234K0146J8819J7435J6252
$$ 929512 948135 968605 990769 1013838 1036780 1058959 1080193 1100339 1119158 1136593 1152845
50598A152845J5242J4267J3392J2654J1721J0254Q503P033N866M453K593Q81m6
$$ 1152845 1168087 1182354 1195746 1208400 1220121 1230375 1238878 1245911 1251777 1256230 1258823 1259704 1259658
50585A259658k56k35j42K29J018K183L624N164O478P381Q048Q661Q957Q476P249
$$ 1259658 1259402 1259167 1259025 1259254 1260272 1262455 1266079 1271243 1277721 1285102 1293150 1301811 1310768 1319244 1326493
50570A326493N839M681L635K337P29q69k069k776l398m653o976r993j2793j4690
$$ 1326493 1332332 1337013 1340648 1342985 1343714 1342845 1340776 1338000 1334602 1329949 1322973 1312980 1300187 1285497
50556A285497j5585j5639j4915j3485j1603r534p420n411l783k792k457k615l057
$$ 1285497 1269912 1254273 1239358 1225873 1214270 1204736 1197316 1191905 1188122 1185330 1182873 1180258 1177201
50543A177201l635m455n972q616j2162j5749j8720k1106k3158k4723k5550k5843
$$ 1177201 1173566 1169111 1163139 1154523 1142361 1126612 1107892 1086786 1063628 1038905 1013355 987512
50531I87512k6020k6034k5435k4141k2615k1183j9695j8019j6470j5401j4634
$$ 987512 961492 935458 910023 885882 863267 842084 822389 804370 787900 772499 757865
50520G57865j3654j2227j0579r019p621o277m858l341j832m69P32J898L105M303
$$ 757865 744211 731984 721405 712386 704765 698488 693630 690289 688457 687988 688720 690618 693723 698026
50506F98026N431O519P596Q585R402J0111J0903J1948J3262J4698J6063J7311
$$ 698026 703457 709976 717572 726157 735559 745670 756573 768521 781783 796481 812544 829855
50494H29855J8633K0233K2040K3787K5234K6207K6519K6104K5328K4768K4644
$$ 829855 848488 868721 890761 914548 939782 965989 992508 1018612 1043940 1068708 1093352
50483A093352K4667K4596K4622K5056K5892K6973K8283K9814L1283L2322L2928
$$ 1093352 1118019 1142615 1167237 1192293 1218185 1245158 1273441 1303255 1334538 1366860 1399788
50472A399788L3447L4123L4899L5640L6339L7101L8032L9191M0481M1622M2294
$$ 1399788 1433235 1467358 1502257 1537897 1574236 1611337 1649369 1688560 1729041 1770663 1812957
50461A812957M2358M1848M0847L9367L7270L4214K9887K4397J8265J1879N196
$$ 1812957 1855315 1897163 1938010 1977377 2014647 2048861 2078748 2103145 2121410 2133289 2138485
50450B138485j858q994j5842k2353k8553l4027l8164m0856m2489m3243m2819m1026
$$ 2138485 2136627 2127633 2111791 2089438 2060885 2026858 1988694 1947838 1905349 1862106 1819287 1778261
50438A778261l8164l4564l0195k4973j9311j3947r333n409j979R02K834L281J846
$$ 1778261 1740097 1705533 1675338 1650365 1631054 1617107 1607774 1602365 1600386 1601288 1604122 1607403 1609249
$$ [...]
##END NTUPLES=NMR SPECTRUM
##END=
