
##TITLE=UV1200_M3_1292-1211_7185061_YWN2Qwflvr
##JCAMPDX= 6.0         $$ Bruker NMR JCAMP-DX V2.0
##DATA TYPE= NMR SPECTRUM
##DATA CLASS= NTUPLES
##ORIGIN= BRUKER
##OWNER= Administrator
$$ 1.72 TOPSPIN		Version 2.1
$$ 2012-12-05 22:05:11.649 -0500  Administrator@X
$$ Compression mode = diff/dup
##.OBSERVE FREQUENCY= 400.02188249412
##.OBSERVE NUCLEUS= ^1H
##.ACQUISITION MODE= SIMULTANEOUS (DQD)
##.ACQUISITION SCHEME= undefined
##.AVERAGES= 8
##.DIGITISER RES= 22
##SPECTROMETER/DATA SYSTEM= spect
##.PULSE SEQUENCE= zg30
##.SOLVENT NAME= COFFEE_meoh
##.SHIFT REFERENCE= INTERNAL, COFFEE_meoh, 1, 14.98509
##AUDIT TRAIL= $$ (NUMBER, WHEN, WHO, WHERE, PROCESS, VERSION, WHAT)
$$ ##TITLE= Audit trail, TOPSPIN		Version 2.1
$$ ##JCAMPDX= 5.01
$$ ##ORIGIN= Bruker BioSpin GmbH
$$ ##OWNER= Administrator
$$ $$ E:\/data/COFFEE/nmr/UV1200_M3_1292-1211_7185061_YWN2Qwflvr/10/pdata/1/auditp.txt
$$ ##AUDIT TRAIL=  $$ (NUMBER, WHEN, WHO, WHERE, PROCESS, VERSION, WHAT)
(   1,<2012-12-05 22:05:01.424 -0500>,<Administrator>,<X>,<go>,<TOPSPIN 2.1>,
      <created by zg
	started at 2012-12-05 22:03:56.707 -0500,
	POWCHK enabled, PULCHK disabled,
       configuration hash MD5:
       86 BA 57 50 F2 9D 5C 9B 26 00 A9 28 5F 66 2E 89
       data hash MD5: 64K
       DE 5A 96 6F B5 CC 4E D2 D7 EF 29 9B FA 98 67 69>)
(   2,<2012-12-05 22:05:05.579 -0500>,<Administrator>,<X>,<proc1d>,<TOPSPIN 2.1>,
      <Start of raw data processing
       efp LB = 0 FT_mod = 6 PKNL = 1 PHC0 = 0 PHC1 = 0 SI = 32K 
       data hash MD5: 32K
       4C 87 98 3E 8E EC 03 03 74 EB 5F F5 29 E8 A0 4F>)
(   3,<2012-12-05 22:05:06.179 -0500>,<Administrator>,<X>,<proc1d>,<TOPSPIN 2.1>,
      <pk PHC0 = 95.26794 PHC1 = 0 
       data hash MD5: 32K
       15 2B 3B F1 97 A0 13 E8 3C 78 C5 76 53 0F A0 9B>)
(   4,<2012-12-05 22:05:06.458 -0500>,<Administrator>,<X>,<proc1d>,<TOPSPIN 2.1>,
      <abs ABSG = 1 
       data hash MD5: 32K
       DA 4F 26 B8 36 81 A5 22 F9 E4 30 C3 92 F7 F5 A5>)
(   5,<2012-12-05 22:05:06.658 -0500>,<Administrator>,<X>,<proc1d>,<TOPSPIN 2.1>,
      <abs ABSG = 2 
       data hash MD5: 32K
       80 F7 87 41 37 D6 75 C6 F1 BA 52 A2 6A 4C 9D 1F>)
(   6,<2012-12-05 22:05:06.858 -0500>,<Administrator>,<X>,<proc1d>,<TOPSPIN 2.1>,
      <abs ABSG = 3 
       data hash MD5: 32K
       40 A3 48 DA 23 DC F5 F2 2E A6 35 48 15 8D 36 E1>)
(   7,<2012-12-05 22:05:07.038 -0500>,<Administrator>,<X>,<proc1d>,<TOPSPIN 2.1>,
      <abs ABSG = 4 
       data hash MD5: 32K
       99 78 25 DB B5 14 91 8C 0F 7E 7A B7 1F 2F 78 64>)
(   8,<2012-12-05 22:05:07.226 -0500>,<Administrator>,<X>,<proc1d>,<TOPSPIN 2.1>,
      <abs ABSG = 5 
       data hash MD5: 32K
       12 B8 5B 2F 04 64 13 DB 38 BD 48 DC D6 A7 DE D0>)
$$ ##END=
$$ 
$$ $$ hash MD5
$$ $$ 97 3D 7E 08 1D E0 76 76 9B DB 46 22 BE C6 02 AA
##$RELAX= 
##$RELAX= 
##$RELAX= 
##$RELAX= 
##$RELAX= 
##$RELAX= 
##$RELAX= 
$$ Bruker specific parameters
$$ --------------------------
##$DU= <E:\>
##$EXPNO= 10
$$ [...]
##$TP= (0..7)
150 150 150 150 150 150 150 150
##$TP07= 0
##$TPNAME0= <>
##$TPNAME1= <>
##$TPNAME2= <>
##$TPNAME3= <>
##$TPNAME4= <>
##$TPNAME5= <>
##$TPNAME6= <>
##$TPNAME7= <>
##$TPOAL= (0..7)
0.5 0.5 0.5 0.5 0.5 0.5 0.5 0.5
##$TPOFFS= (0..7)
0 0 0 0 0 0 0 0
##$TUNHIN= 0
##$TUNHOUT= 0
##$TUNXOUT= 0
##$USERA1= <user>
##$USERA2= <user>
##$USERA3= <user>
##$USERA4= <user>
##$USERA5= <user>
##$V9= 5
##$VALIST= <valist>
##$VCLIST= <CCCCCCCCCCCCCCC>
##$VD= 0
##$VDLIST= <DDDDDDDDDDDDDDD>
##$VPLIST= <PPPPPPPPPPPPPPP>
##$VTLIST= <TTTTTTTTTTTTTTT>
##$WBST= 1024
##$WBSW= 4
##$XGAIN= (0..3)
0 0 0 0
##$XL= 0
##$YL= 0
##$YMAX_a= 639011
##$YMIN_a= -543803
##$ZGOPTNS= <>
##$ZL1= 120
##$ZL2= 120
##$ZL3= 120
##$ZL4= 120
##$ABSF1= 14.98509
##$ABSF2= -5.573092
##$ABSG= 5
##$ABSL= 3
##$ALPHA= 0
##$AQORDER= 0
##$ASSFAC= 0
##$ASSFACI= 0
##$ASSFACX= 0
##$ASSWID= 0
##$AUNMP= <proc_prof1d_extract_pilot.lims>
##$AXLEFT= 0
##$AXNAME= <>
##$AXNUC= <1H>
##$AXRIGHT= 0
##$AXTYPE= 0
##$AXUNIT= <>
##$AZFE= 0.1
##$AZFW= 0.1
##$BCFW= 0
##$BC_mod= 0
##$BYTORDP= 0
##$COROFFS= 0
##$CY= 15
##$DATMOD= 1
##$DC= 0
##$DFILT= <>
##$DTYPP= 0
##$F1P= 0
##$F2P= 0
##$FCOR= 0.5
##$FTSIZE= 32768
##$FT_mod= 6
##$GAMMA= 0
##$GB= 0
##$INTBC= 1
##$INTSCL= 1
##$ISEN= 128
##$LB= 0
##$LEV0= 0
##$LPBIN= 0
##$MAXI= 10000
##$MC2= 0
##$MEAN= 0
##$ME_mod= 0
##$MI= 0
##$NCOEF= 0
##$NC_proc= -8
##$NLEV= 6
##$NOISF1= 0
##$NOISF2= 0
##$NSP= 0
##$NTH_PI= 0
##$NZP= 0
##$OFFSET= 14.98509
##$PC= 1
##$PHC0= 95.26794
##$PHC1= 0
##$PH_mod= 1
##$PKNL= yes
##$PPARMOD= 0
##$PPDIAG= 0
##$PPIPTYP= 0
##$PPMPNUM= 2147483647
##$PPRESOL= 1
##$PSCAL= 4
##$PSIGN= 0
##$PYNMP= <proc.py>
##$REVERSE= no
##$SF= 400.02
##$SI= 32768
##$SIGF1= 0
##$SIGF2= 0
##$SINO= 400
##$SIOLD= 32768
##$SPECTYP= <>
##$SREGLST= <1H.CDCl3>
##$SSB= 0
##$STSI= 32768
##$STSR= 0
##$SW_p= 8223.68421052631
##$SYMM= 0
##$S_DEV= 0
##$TDeff= 65536
##$TDoff= 0
##$TI= <>
##$TILT= no
##$TM1= 0
##$TM2= 0
##$TOPLEV= 0
##$USERP1= <user>
##$USERP2= <user>
##$USERP3= <user>
##$USERP4= <user>
##$USERP5= <user>
##$WDW= 1
##$XDIM= 32768
##$YMAX_p= 482538668
##$YMIN_p= -775989
##$CURPLOT= <Network HP LaserJet P1505>
##$CURPRIN= <$Network HP LaserJet P1505>
##$DFORMAT= <normdp>
##$LAYOUT= <+/1D_H.xwp>
##$LFORMAT= <normlp>
##$PFORMAT= <normpl>
##$SURQMSG= 1
$$ End of Bruker specific parameters
$$ ---------------------------------
##NTUPLES= NMR SPECTRUM
##VAR_NAME=  FREQUENCY,     SPECTRUM/REAL,   SPECTRUM/IMAG
##SYMBOL=    X,             R,               I
##VAR_TYPE=  INDEPENDENT,   DEPENDENT,       DEPENDENT
##VAR_FORM=  AFFN,          ASDF,            ASDF
##VAR_DIM=   32768,         32768,           32768
##UNITS=     HZ,            ARBITRARY UNITS, ARBITRARY UNITS
##FACTOR=    0.250966925370066, 1,           1
##FIRST=     8223.43324360094, -92916,       -29007
##LAST=      0,             8712,            2207
##MIN=       0,             -775989,         0
##MAX=       8223.43324360094, 482538668,    0
$$ Real data points
##PAGE= N=1
##DATA TABLE= (X++(R..R)), XYDATA
$$ [...]
19551b37603E6608d29196A03381f1076l94576d6118K2137j45686f8794j10662
19541a79456G0006j6182a63451g3317m9698M0905j55811h2985B63384F1711a85247
19529b88327A36910b9517c799A88105i8938A65543p7274A534L1066b2094B34318
19517H9949a89053K8444B43343g9810C6322K97765j34014J58620G0996A1575b24421
19505I9272b11216C16e7678B8532J7976f1802k8332A56298e1435J4016D2434a32206
19492c19786c3002q1403h766j26303c6696F5516M2154J70057j03214H3215a2557
19480a30551j30419f6184B2230b54832K4726E8916a45967N5474B50410d5961k07507
19469b53468Q1156O6332k01129N8691c016q6129H774K84453a43576o8275F6718
$$ y = [-237603, 56608, -429196, 103381, -61076, -455652, -46118, -23981, -169667, -68794, -179456, 70006, 53824, -163451, -73317, -123015, -82110, -237921, -82985, 263384, 61711, -185247, -288327, 136910, -29517, -3799, 188105, -98938, 165543, 88269, 1534, 32600, -22094, 234318, 89949, -189053, -160609, 243343, -79810, 36322, 334087, 200073, 358693, 70996, 11575, -224421, 99272, -211216, 316, -57678, 28532, 46508, -61802, -90134, 156298, -51435, -37419, 42434, -132206, -319786, -33002, -114405, -8766, -135069, -36696, 65516, 107670, 277727, 174513, 83215, -12557, -130551, -260970, -66184, 22230, -254832, -230106, 58916, -145967, -90493, 250410, -45961, -253468, -172312, -105980, -307109, -248418, -3016, -89145, 8774, 293227, -143576, -211851, 66718]
19457A20025B1807c38124O8735A27576f6690K642k069j81883j37600a41438D1584
19445a73316P1650J6298j1989r7349C7436a70545b7886G7859c29372A54860J50940
19434C05800f9743j13302L7759A70818J78225I8222c51233a22031k16346a05586
19423b80266D4036b13221M6145H4132a41685e4642r2974L143A62663c72917a31693
19411b3286r3879N6160l9658e556n1015l19084i126F452b5552j10870n9207k07089
19399d02718a17201A52464J60367a54448A97326k1925c15062b2705l16119a51759
19388a59018d3701I0556d27073G6687o917J2238C0512h5956j48943l024a01979
19376b93029b8876j15113g31j7586n3817j4809A04592B25h1967A8990g8032C3774
$$ y = [120025, 21807, -338124, -269389, 127576, -66690, -64048, -66117, -248000, -385600, -141438, 41584, -173316, -101666, -85368, -97357, -194706, 37436, -170545, -27886, 77859, -329372, 154860, 305800, -69743, -183045, -145286, 170818, 349043, 98222, -351233, -122031, -338377, -105586, -280266, 44036, -213221, -167076, 84132, -141685, -54642, -147616, -144473, 162663, -372917, -131693, -23286, -117165, -61005, -100663, -5556, -56571, -375655, -9126, 6452, -25552, -136422, -195629, -402718, -117201, 152464, 312831, -154448, 197326, 175401, -315062, -22705, -338824, -151759, -159018, -43701, 90556, -427073, 76687, 69770, 82008, 30512, -85956, -234899, -237923, -101979, -293029, -28876, -143989, -731, -18317, -72134, -86943, 104592, 225, -81967, 18990, -78032, 33774]
19363D21299c41329j01463a80492C85757a95821k41211J13644K8293f1012D0108
19352a68783A28796h2024C06179b46744j04871A48755b48663L4305A03505A0298
19341a60692A10628a07768l19897G220b15919d6307p9102C0780a36982B6109L5427
19330F1536b38971C06499b26116A73148E3010e7659H5446a91014K1646j63434
19320c32802E9557b31353J05872A92477b07356a863A02581a73101c0660j46254
19310a76914I4333h7505q8448k64242c0608p0744D4467R1207c27217n3426J536
19299c79107a53307M223G7649a22363K1787j37638J04913b7176f030j18132A18753
19287A71158g3946q4664l90501A17624f5942D5655f5327l5096j86350J26558A59378
$$ y = [421299, -341329, -442792, -180492, 385757, -195821, -437032, -323388, -295095, -61012, 40108, -168783, 128796, -82024, 306179, -246744, -351615, 148755, -248663, -214358, 103505, 10298, -160692, 110628, -107768, -427665, 7220, -215919, -46307, -125409, 30780, -136982, 26109, 61536, -238971, 306499, -226116, 173148, 53010, -57659, 85446, -191014, -169368, -332802, 59557, -231353, -125481, 192477, -207356, -1863, 102581, -173101, -30660, -176914, 94333, -87505, -175953, -440195, -30608, -101352, 44467, 135674, -327217, -380643, -379107, -153307, -149084, 77649, -122363, -100576, -238214, -133301, -27176, -6030, -124162, 118753, 171158, -73946, -158610, -549111, 117624, -65942, 45655, -65327, -100423, -286773, -160215, 159378]
19275i7820K6766C0215l955K87788b7003j85694f8689B2261a89599N3007H8878
19263b1601F767J27299k3580K9497a65090P2733m2243j1120j93458a7968C7344
19251A82039F7460K39762a42061l24855g3859P348g895k09227c7364B3784q991
19240A4793a82669d255A22477R1456a46091b7944j9490k14367f1582j9032m0971
19229a21585F6909k4804O5837b17653f5139D5373h4000j86240A20139K9540F82
19217A42039A4358b74379A06192a74427e4209B02276h3237L1476C8470K2682Q9144
19206A50296a69988A12212D7634A6872b43533I3645M6482b27146Q9947B6284d0062
19194A78950i4896n06416K68552A04124b20370C32236a40530B91015c15653i7705
$$ y = [-97820, -71054, 30215, 26260, 314048, -27003, -212697, -68689, 22261, -189599, -136592, 88878, -21601, 6767, 134066, 110486, 139983, -165090, -92357, -134600, -145720, -339178, -17968, 37344, 182039, 67460, 307222, -142061, -466916, -73859, -66511, -7895, -217122, -37364, 23784, 14793, -182669, -4255, 122477, 213933, -146091, -27944, -47434, -261801, -61582, -80614, -121585, 66909, 42105, 107942, -217653, -65139, 45373, -84000, -270240, 120139, 149679, 682, 142039, 14358, -274379, 106192, -174427, -54209, 202276, -83237, -51761, 38470, 61152, 150296, -169988, 112212, 47634, 16872, -243533, 93645, 140127, -227146, -137199, 26284, -40062, 178950, -94896, -601312, -332760, 104124, -220370, 332236, -140530, 291015, -315653, -97705]
19183b34717J1183A75777a59073L6813j44333K7615o3671L0064G561h6484h262
19171a63236b3158I6676e6761j82339K1553N9701A11119b14643C6089a55605b5910
19159h872n0519D30945B7777b30511f2254p9522m10097d0451m20295J57098a34849
19147B2738f9361k8331B8362K30083i9945A86724p1424b43160B9585J45133G572
19135b50264F1721b4756A1285K25475j02902f3191A56358L8356F4430L9693i1717
19123b76913C5950g0208k46402B59704A325c39787B04699J6913a76492k5154B67146
19111a92861m830B2205b38113A1102J13372L2336i1527o8138e4163I3970C9694
19099A32780a18110B64317b75111C8878e5887k4324k6199M7835B15616a33985
$$ y = [-234717, -223534, 175777, -159073, -122260, -266593, -238978, -302649, -272585, 7561, -86484, -8262, -163236, -23158, 96676, -56761, -239100, -217547, -157846, 111119, -214643, 36089, -155605, -25910, -8872, -59391, 430945, 27777, -230511, -62254, -141776, -551873, -40451, -460746, -303648, -134849, 22738, -69361, -97692, 28362, 258445, -99945, 186724, 115300, -243160, 29585, 174718, 7572, -250264, 61721, -24756, 11285, 236760, 133858, -63191, 156358, 194714, 64430, 104123, -91717, -276913, 35950, -70208, -316610, 259704, 1325, -339787, 204699, 221612, -176492, -201646, 267146, -192861, -197691, 22205, -238113, 11102, 124474, 156810, -91527, -159665, -54163, 93970, 39694, 132780, -118110, 264317, -275111, 38878, -55887, -80211, -106410, -58575, 215616, -133985]
19088g5936c3132k05517a16044j04402r0234b1050o8097A88537b31943B23371
19077B3255Q809a26563e774k4394D6949N4488e5341E8010b43581l0854F0049b35721
19064b01568C86173a41949O620F4749b59083E7102b71867A65169a8791o0841j01527
19053a81159e1971A21629f19108a71557A97958a6548A33555f6106j43727R8311
19043a11522C868J76128b71525h5j48226A69941c01132A54545D596b65277e9358
19031f2748B7415i948F3801R9510k7180F4309J41907a09315F1412O5757J09015
19020B36184J12167f6386r059E5697e4911H909h1685k47062J32897A20619K3216
19009A43835a95151A38748a45045j5196m6015F3497A0991J67770a33549j73589
$$ y = [-75936, -33132, -238649, -116044, -220446, -310680, -21050, -89147, 188537, -231943, 223371, 23255, 32064, -126563, -5774, -30168, 46949, 101437, -55341, 58010, -243581, -274435, 60049, -235721, -201568, 386173, -141949, -135329, 64749, -259083, 57102, -271867, 165169, -18791, -79632, -181159, -51971, 121629, -619108, -171557, 197958, -16548, 133555, -66106, -209833, -111522, 3868, 179996, -271525, -85, -148311, 169941, -301132, 154545, 4596, -265277, -59358, -62748, 27415, -9948, 63801, 163311, 136131, 64309, 206216, -109315, 61412, 127169, 236184, 348351, -66386, -75445, 55697, -54911, 8909, -81685, -328747, -195850, 120619, 143835, -195151, 138748, -145045, -160241, -206256, 63497, 10991, 178761, -133549, -307138]
18999c07138j5426J56992r4502k0197A42908M0606M5927h4588j92748f8247I564
18987e3870r8820C11163a25186d8232A05770g9118c1035B43115l0398c66018P1074
18976b94944B18224j02390J68784E6833g1467m04084g6357B07144c5852l5793
18966g1645k2263A8190c8604q6533n4669A76320b39440g4895r06m7622f760A96856
18953B89511a6249H3939a21844L1417j06157A14587m339j5888a01187l5273C5101
18941C66137a78546c4484C35159G1202J4115a18567o8749A77663i747B60510a03693
18929G7816j2793a61854C24679e1307k39385f737k2003j74634A14233c50931P9337
18918b71594C41019g2944k21316Q2902J04798K3336A52100B8043K36434b66648
$$ y = [-307138, -322564, -165572, -260074, -280271, 142908, 183514, 229441, -84588, -277336, -68247, 9564, -53870, -152690, 311163, -125186, -48232, 105770, -79118, -31035, 243115, 212717, -366018, -294944, 218224, 115834, 284618, 56833, -71467, -475551, -76357, 207144, -35852, -71645, -93908, 18190, -38604, -125137, -179806, 176320, -239440, -74895, -75801, -123423, -6760, 196856, 289511, -16249, 83939, -121844, -90427, -196584, 114587, 110248, 94360, -101187, -136460, 35101, 366137, -178546, -34484, 335159, 71202, 85317, -118567, -187316, 177663, -9747, 260510, -103693, 77816, 65023, -161854, 324679, -51307, -290692, -6737, -28740, -203374, 114233, -350931, -271594, 341019, -72944, -294260, -211358, -106560, -83224, 152100, 28043, 264477, -266648]
18907a19745B90282r6166o8095b20086j0916J01991b8089A45012D1339J00091
18897A41430b69367b5372B81408n1468C5120K98811a00930K6220B32876B5079
18886B71907c30362A41876I395a35287l9829G556J87715a80430h3067A11600a22911
18874A65852C9038a43330N697k2656B32335a94522j49617d2397A9502a83691K5820
18863a57871A4318a23062A45621B0490O637c53086J11226C5392M9805J48858f4849
18851A80912H0584o925R1798J0535K33266B3554L248c56801J48751f9657l176
18840g2833j46267G6332e53087K69761a3169B13957n9154c5498B46789b26416
18829B44266F7785c45263A4273b59978a10896j61792e6924A33866a45765A44265
$$ y = [-119745, 290282, 194116, 126021, -220086, -231002, -129011, -28089, 145012, 41339, 141430, -269367, -25372, 281408, 229940, 35120, 333931, -100930, -74710, 232876, 25079, 271907, -330362, 141876, 9395, -135287, -175116, 7556, 195271, -180430, -83067, 111600, -122911, 165852, 39038, -143330, -137633, -160289, 232335, -194522, -344139, -42397, 19502, -183691, -157871, 14318, -123062, 145621, 20490, 27127, -353086, -241860, 35392, 85197, 234055, -64849, 180912, 80584, 73659, 165457, 175992, 409258, 23554, 26802, -356801, -208050, -69657, -72833, -219100, 76332, -553087, -283326, -13169, 213957, 154803, -35498, 246789, -226416, 244266, 67785, -345263, 14273, -259978, -110896, -272688, -56924, 133866, -145765, 144265]
18818a8154D4509P2779a84822A40028L2273a04511A55865c23023A9784a39181
18807A51727E5771a23520m053B4589a46666j18102Q7594l0343H0306O189b33987
18795C70855a72706a3261j71524o5301E5097j2528c5219j3434A70064R8252d85209
18783b79474a19317j08118K9042B5281h549B32485d3835p8100f948j56781D0851
18771D6805P5875C6166J33142a54823k42460J16615p5416b1359g937E3295J98657
18760B51952b0156l89487H3033b0770I5498a65579C6529a68327A70015G3390b041
18748c17899a14799c3873B19139o1298e8193j35449A57536c05767I7849D4417
18737a96745q4747F8862b54037j9799A89502q8257c2965o5439B40926p1257n5692
$$ y = [-18154, 44509, 117288, -184822, 140028, 172301, -104511, 155865, -323023, 19784, -139181, 151727, 55771, -123520, -127573, 24589, -146666, -264768, -177174, -207517, 80306, 86495, -233987, 370855, -172706, -13261, -184785, -250086, 55097, 42569, -35219, -48653, 170064, 268316, -485209, -279474, -119317, -227435, -198393, 25281, -8549, 232485, -43835, -121935, -6948, -163729, 40851, 46805, 122680, 36166, 169308, -154823, -397283, -280668, -356084, -21359, -7937, 53295, 251952, -20156, -409643, 83033, -20770, 95498, -165579, 36529, -168327, 170015, 73390, -2041, -317899, -114799, -33873, 219139, 157841, -58193, -193642, 157536, -305767, 97849, 44417, -196745, -281492, 68862, -254037, -273836, 189502, 101245, -32965, -98404, 240926, 169669, 113977]
18726A13977q142K07548a09862N3705o7566D3107J46397r1016K5400b65410e1385
18714A96232A6854a08013j85033d0421G1280g1962I7243R3690Q622p7640b31082
18702e6447q0833j10292A0389a45638o7863j8172c33B24332r9003e6261j44989
18691b01250G4973e2912G1455a03981b7954B29292h8504C3657J67924d1007j31262
18680a72269m0819p754q5364C8127a04465B0079g6827o8107d3378j58205A25470
18668A5608b6948k3289q8889n7466A51808g2658j56854B08840b32A8869O3012
18657H1881K58517f5216A11285a59270n6040A83623b45168j17354e5086k69091
18647c24177a40548C5478h3644a4486A36389d08408A38911a52720O7699l40804
$$ y = [113977, 105835, 313383, -109862, -56157, -123723, 43107, 189504, 98488, 123888, -265410, -51385, 196232, 16854, -108013, -293046, -40421, 71280, -71962, 97243, 190933, 199555, 121915, -231082, -56447, -137280, -247572, 10389, -145638, -213501, -231673, -333, 224332, 125329, -56261, -201250, 74973, -52912, 71455, -103981, -27954, 229292, -88504, 33657, 201581, -41007, -172269, -213088, -220842, -306206, 38127, -104465, 20079, -76827, -144934, -43378, -201583, 125470, 15608, -26948, -50237, -139126, -196592, 151808, -72658, -229512, 208840, -232, 18869, 81881, 340398, -65216, 111285, -159270, -215310, 183623, -245168, -362522, -55086, -324177, -140548, 35478, -83644, -14486, 136389, -408408, 138911, -152720, -85021, -425825]
18637d25825C9603b05699r6061a08312k6644L5315D552h3814j06210N8205B40205
18625b32815j43989J20949A61557G1614i035D0706N7046f4557j9048K113k39564
18614c21056h1234C8613b01301K9212A65273a30783k13324B20767A09809n0047
18604E9762d09605B88738j09976o3173B506b33289O9678D2951F379L579K84224
18593B94182a13389j00872b0093k95749f2602B57376E3341K719K5525a90082j53838
18582c43920a27587B49063f6377C4643f8956j3285j68420A49145e67969E2660
18571B63821K04110b4326q6510M8951r6770C28235a87445B13249A331b71239m9520
18560c20759d416l1299j13021j34105P1305R2701j23156A75676a48706B88731
$$ y = [-425825, 39603, -205699, -301760, -108312, -134956, -99641, 4552, -83814, -190024, -131819, 240205, -232815, -376804, -255855, 161557, 71614, -9035, 40706, 97752, -64557, -83605, -81492, -321056, -81234, 38613, -201301, -172089, 165273, -130783, -344107, 220767, 109809, 59762, -409605, 288738, 178762, 115589, 2506, -233289, -163611, 42951, 6379, 9958, 294182, -113389, -214261, -20093, -315842, -62602, 257376, 53341, 56060, 81585, -190082, -343920, -127587, 249063, -66377, 34643, -68956, -82241, -250661, 149145, -567969, 52660, 263821, 467931, -24326, -110836, -61885, -158655, 328235, -187445, 213249, 1331, -271239, -320759, -4416, -35715, -148736, -282841, -211536, -118835, -241991, 175676, -148706, 288731]
18549C27065I4752e0173k11400B4429q526J23895E803a20844A57338e4042A42238
18537A34915J15902b48377i1733H9650b251r025C41910a10528j20052F165R9209
18526A05374c80161E0234b02991g5010D9743f3521k34109L7260j10708F3142i7341
18514A18033C285a34469K6476r7883L8090c6941A0554O3636J6901b60488d1604
18502a2786B195a48336b6909k96571I5765O2516a59775f3753o3423d5198A5194
18490I835J9578J28493r754Q9030a74684E2944k5192a95717o916M5810j17469
18479b74292J18491A37370a51145A75414q2831b71954a22376A32033a60487B8842
18468a73544J7112O4148a3648n2500A16944c64883J43728C8599K77925a07117
$$ y = [327065, 94752, -50173, -261573, 24429, 15903, 139798, 5803, -120844, 157338, -54042, 142238, 134915, 250817, -248377, -91733, 89650, -2251, -11276, 341910, -110528, -230580, 6165, 105374, -380161, 50234, -202991, -75010, 49743, -63521, -297630, -260370, -371078, 63142, -97341, 118033, 3285, -134469, -107993, -205876, -167786, -36941, 10554, 74190, 91091, -260488, -41604, -12786, 2195, -148336, -26909, -323480, 95765, 158281, -159775, -63753, -127176, -45198, 15194, 9835, 29413, 157906, 148152, 237182, -174684, 52944, 27752, -195717, -202633, -156823, -274292, -155801, 137370, -151145, 175414, 92583, -271954, -122376, 132033, -160487, 28842, -173544, -156432, -92284, -13648, -66148, 116944, -364883, -221155, 38599, 316524, -107117]
18457B4112P3344c48946B00716b20513O7834l74177h6397A36882o7099b96200
18446a17306D4283K69495c95781B50240F6905e5451o5268A00808i3470q5340j13973
18435b92783B8007K73039N7620r4925C022K49199h6281C43428j24477a57646k33658
18424c91304A45344b41806g8400A80437C1492d4026H1024a38110k360f8164B43251
18412H3012L28143d04393H7345h8691j22763I8659f4020D0075J14325a28782m7181
18401a75963Q6530I6824a08122A1898P1071K9984l427m8536c3863o0009j09587
18390b03459p9282P2293C51482b09924A60616a95971c8864B2469J67355a98652
18379c14466c6382k17776i23r1763b0108B7846g7620A2006N3750c3872A2232c16276
$$ y = [24112, 97456, -348946, 200716, -220513, -152679, -526856, -86397, 136882, 69783, -296200, -117306, 44283, 313778, -395781, 250240, 66905, -55451, -120719, 100808, -93470, -178810, -292783, 28007, 301046, 358666, 263741, 3022, 252221, -86281, 343428, 218951, -157646, -391304, 145344, -241806, -78400, 180437, 31492, -44026, 81024, -138110, -140470, -68164, 243251, 83012, 411155, -404393, 87345, -88691, -211454, 98659, -64020, 40075, 154400, -128782, -175963, -89433, 96824, -108122, 11898, 82969, 112953, 109526, 60990, -33863, -93872, -203459, -282741, -210448, 351482, -209924, 160616, -195971, -38864, 22469, 189824, -198652, -314466, -36382, -254158, -923, -92686, -20108, 27846, -77620, 12006, 65756, -33872, 12232, -316276]
18366A44616G1058L4524J00573g0463A20250a42906a048l01207I4100b60270c3690
18354b0698n988j8005A08159c57230l381a1917j19029Q168A2715d84554a62783
18342f3946B11190j662d63951e6635H3894a10869L8569l5515j26009d2599D8886
18330f15387c8717I9895L3759j2127b69872a27217N0488o7710l3868j9647A50002
18318a30501F4261g0633A65943b12386J1313M6104C5144c67394B22111F1523f5818
18306E7827i039C8043K136h702r2995A49371h8022J724A45464i1879p0834A80311
18293g1862C4811g0162k8031j51347g3788j51394g2881B4894a50305C36617b94587
18281a32797l6824M0213c6149A83211L5705d2099n1636j51009B71085a28843C12477
$$ y = [144616, 71058, 105582, 206155, -70463, 120250, -142906, -1048, -302255, 94100, -260270, -33690, -20698, -26686, -44691, 108159, -357230, -360611, -11917, -130946, -122778, 12715, -484554, -162783, -63946, 211190, 209528, -463951, -56635, 83894, -110869, -72300, -107815, -233824, -42599, 48886, -615387, -38717, 99895, 133654, 121527, -269872, -127217, -76729, -144439, -178307, -197954, 150002, -130501, 64261, -70633, 165943, -212386, -201073, -154969, 35144, -367394, 222111, 61523, -65818, 57827, -9039, 38043, 40179, -8702, -101697, 149371, -88022, -86298, 145464, -91879, -162713, 180311, -71862, 34811, -70162, -98193, -249540, -73788, -225182, -72881, 24894, -150305, 336617, -294587, -132797, -169621, -129408, -36149, 183211, 218916, -42099, -93735, -244744, 271085, -128843, 312477]
18269B98824A45493j4795b83552J27691B3533b24740O6820I6578a41523o1805
18259b03328o8856h0946j2739H1770c2873j56525f8776j14720j19603J27143f2861
18247b49021F916b3370j60959K8866a1208B5370A1935N2716Q9164B9618i3068
18235B10128b50300A1690J27113b20870C50880b992H8595B7167J06611b51241
18224d7283l23287b8801I5645j3732a27114c9686A68852b86128E7476b8845k94500
18213c23345a2915k44267F6586J4117N9028a90427A27256a23049B2922J65339
18203A88261a89756K2725D55989a4407j07358g317I648g6006I1251a25959A70148
18191F5112j9641f2116A52727i2861M0191k07751B95791e03365d1810J656k4199
$$ y = [298824, 145493, 130698, -283552, -155861, 23533, -224740, -157920, 96578, -141523, -203328, -272184, -80946, -93685, 81770, -32873, -189398, -68776, -183496, -303099, -175956, -62861, -249021, 6916, -23370, -184329, -155463, -11208, 25370, 11935, 64651, 153815, 29618, -93068, 210128, -250300, 11690, 138803, -220870, 350880, -2992, 88595, 27167, 133778, -251241, -47283, -370570, -28801, 95645, 81913, -127114, -39686, 168852, -286128, 57476, -28845, -323345, -12915, -257182, 66586, 80703, 139731, -190427, 127256, -123049, 22922, 188261, -189756, -167031, 455989, -14407, -121765, -7317, 9648, -76006, 91251, -125959, 170148, 65112, 45471, -62116, 152727, -92861, -52670, -260421, 295791, -503365, -41810, -40154, -64353]
18180f4353j00238q7746o3634R2451C4124a12194L7144a5192I5081d9590E4042
18168a75137m9568j68819O6990a4362A25324A7346P4972L07747A1874a92353N5760
18157a36593b888D9934f1416p7523m0411f7128j85915j07140A58901B7049b7177
18145b02363P4414p797N715m6330j4907h1791B67795i3270A62306a90148g7334
18133a24734B6133b15466J02524A4077i6011a3381p2648A25405b83149A20120
18122a36129A32033N2331D1248R4556J08489D3876g2353p656B07564r0387l7183
18111G9994a08377I2777c90365e5749B7903J82735a40649C1253K53023l075A01510
18099A04941o865g2974k14985R311F2188J50637G1381b1984j56812k3477q593
$$ y = [-64353, -164591, -252337, -315971, -223520, 34124, -112194, -75050, -15192, 95081, -49590, 54042, -175137, -224705, -393524, -326534, -14362, 125324, 17346, 92318, 400065, 11874, -192353, -136593, -2888, 49934, -61416, -138939, -179350, -67128, -253043, -360183, 158901, 27049, -27177, -202363, -127949, -135746, -130031, -176361, -191268, -81791, 267795, -93270, 162306, -190148, -77334, -124734, 26133, -215466, -112942, 14077, -96011, -13381, -86029, 125405, -283149, 120120, -136129, 132033, 184364, 41248, 135804, 244293, 43876, -72353, -80009, 207564, 117177, 79994, -108377, 92777, -390365, -55749, 27903, 210638, -140649, 31253, 284276, 281201, 101510, 104941, 98076, -72974, -287959, -278648, 62188, 212825, 71381, -21984, -178796, -202273, -210866]
18088b10866Q6237j52069J33246L5201B39480I7105d6428A09438e2970q3325k4632
18077a60927B0192a62960E5664g9167r2448g0144j75098D75153j51781a82052
18066b29402B93364A40983b5481F5875k4161c06255a32546A81097n4164a71071
18055B88020a03245d9745D863c0024j96185e6028j36771C27760E5318e7083G1523
18043d0126m2628A82172N4626h9637m0287n8898B9074K03617F4769a79349A60207
18031a74141c7942P62a8234A18884a53608l0153j59435f748C22147a75573A12388
18019A55909n8897m7426K0933m861N4761m3345c2446j77374D8924Q9891a28787
18007a83933M9811h349m9169k08687c5394j38735M7632b7082I0846H345K9285
$$ y = [-210866, -124629, -276698, -143452, -108251, 239480, 97105, -46428, 109438, -52970, -136295, -160927, 20192, -162960, 55664, -79167, -171615, -70144, -245242, 475153, 323372, -182052, -229402, 293364, 140983, -25481, 65875, 41714, -306255, -132546, 181097, 126933, -171071, 288020, -103245, -49745, 4863, -30024, -226209, -56028, -192799, 327760, 55318, -57083, 71523, -40126, -82754, 182172, 236798, -89637, -129924, -188822, 29074, 232691, 64769, -179349, 160207, -174141, -37942, -37180, -18234, 118884, -153608, -183761, -343196, -6748, 322147, -175573, 112388, 155909, 97012, 49586, 70519, 65658, 120419, 77074, -32446, -209820, 48924, 138815, -128787, -183933, -134122, -8349, -57518, -266205, -35394, -174129, -126497, -27082, 90846, 8345, 37630]
17996C7630a47048N2801k53724a6998A10587G403a0968r0874n5864d6868E1720
17984b78126L5702J14712m4218M8504j19358d7771o8985j37096N9949L0729b9245
17972b47932A46752E1606j7073N7618J12349d313j2505A14186K15833e2269j2766
17961f5035D51842e25308b17757C02523a21060A94342c13906I6263c7555E2426
17950C2452J981a20621A54216J16572a035C875Q6743a3419E8388J6600l5664b44084
17937B07464C7713a20766A04620b05635Q0944a2186o7016G5704j2491L4499C7185
17925H2339J15687o937b71951A46256a83025D9877b61838A01282b04412b793o7998
17914g0791C82208E8903b9444B87913A32749a49689A20226a45987A12610b43895
$$ y = [37630, -147048, -94247, -347971, -16998, 110587, 7403, -10968, -101842, -157706, -46868, 51720, -278126, -242424, -127712, -171930, -123426, -242784, -47771, -116756, -253852, -193903, -163174, -29245, -247932, 146752, 51606, 34533, 92151, 204500, -4313, -16818, 114186, 330019, -52269, -65035, 451842, -525308, -217757, 302523, -121060, 194342, -313906, 96263, -37555, 52426, 32452, 34433, -120621, 154216, 270788, -1035, 3875, 90618, -13419, 58388, 74988, 39324, -244084, 207464, 37713, -120766, 104620, -205635, -124691, -12186, -79202, 75704, 63213, 97712, 37185, 82339, 198026, 191089, -271951, 146256, -183025, 49877, -261838, 101282, -204412, -2793, -70791, 382208, 58903, -29444, 287913, 132749, -149689, 120226, -145987, 112610, -243895]
17903A38753d19387a1395q7327k646A969b5185e892k22860b3199p695D41690c51344
17890f1573p5067j75085J40925K9355j17036H7344J07401a21924o9181A96957
17879C29240A47115c311k41379B2211J0934a8428B10715a5953r3851A57404f9396
17867B68861c5551A09199Q1110b18860B05221J2538L6182a95682C17545b82788
17856b79928B91405j07604j2050a4154r1123B32382A03280a55492f1157I7214
17845a48876I1563a31239C7495B202K8458J3002j0997e7755A26770D847J07847
17834A12694a47860H4432c11368m140B2961L9555a4912l76986F4102e3750m539
17823e8289A46185l4937b44512J21169A70382B9726f9504m785k09319N7932A30346
$$ y = [138753, -419387, -11395, -98722, -101368, 1969, -25185, -5892, -228752, -23199, -30894, 441690, -351344, -61573, -136640, -311725, -170800, -141445, -258481, 87344, 194745, -121924, -191105, 196957, 329240, 147115, -3311, -244690, 22211, 33145, -18428, 210715, -15953, -109804, 157404, -69396, 268861, -35551, 109199, 190309, -218860, 205221, 217759, 253941, -195682, 317545, -282788, -279928, 291405, 183801, 171751, -14154, -105277, 232382, 103280, -155492, -61157, 97214, -148876, 91563, -131239, 37495, 2202, 30660, 43662, 32665, -57755, 126770, 4847, 112694, -147860, 84432, -311368, -315508, 22961, 62516, -14912, -391898, 64102, -53750, -58289, 146185, 111248, -244512, -123343, 170382, 29726, -69504, -74289, -283608, -225676, 130346]
17811A17011n4335K32908e2473l34783C60797b6930j77729B36367b8957A1478
17800A5674O9075b7674O750o7482j08416A51910J10200A725a25307j50335B37422
17788c73696A35204a24763a6889C82877A89312q5959a49516H7707a14272k42990
17778c57262I0473a27202f086j66943k3615d9370p0944c9248H8666d03227c5513
17766H3555J8652m1185J69280m0506G8018N6811d690B79582A00999M9914n9364
17755I1549Q0590c0751k52230a9611j64586B20921J96703a6465A47385a11349
17744B76262A02771b68487P9361I4582J99159n8341c11995I7759a43595E0059
17733B0745K63158a70937c2200j71098B02557a36472j6284B68169a71749A16474
$$ y = [117011, 62676, 295584, -52473, -387256, 360797, -26930, -204659, 236367, -28957, 11478, 15674, 84749, -27674, -20924, -88406, -196822, 151910, 262110, 1725, -125307, -275642, 237422, -373696, 135204, -124763, -16889, 382877, 189312, 103353, -149516, 87707, -114272, -357262, 90473, -127202, -6086, -173029, -196644, -49370, -120314, -39248, 88666, -403227, -35513, 83555, 102207, 61022, 230302, 189796, 78018, 134829, -4690, 279582, 100999, 150913, 91549, 172139, -30751, -282981, -19611, -184197, 220921, 417624, -16465, 147385, -111349, 276262, 102771, -268487, -189126, 94582, 293741, 235400, -311995, 97759, -143595, 50059, 20745, 283903, -170937, -32200, -203298, 202557, -136472, -152756, 268169, -171749, 116474]
17722a14786N2880A18055K4185K74920j79868j12889b51219j02785m6618J05508
17712b95114i5843B50219F2155g4003A95894f5982K8503k44447H5394b6923k71438
17701b98361l4063I8546C3747c18756J00689A43937k7470a45439N0126A70762
17690B0882c1035k75044A00425C0559d1075I1954d2895K654A3923a37093d2577
17678D1057d74761A96454K9802p9741a86589j65961a37247A37274F4694O9776
17668A34470d7790A49165I09c58086g9826A15443o404f4525r3363M9069H5527
17656C4393J73j5723L14333b20386b8299j43420H7013P9480a07201B5266D458
17644A64446L81929a32738A07354C4136b38940n4187A68177c08644a16814J6742
$$ y = [-114786, -61906, 118055, 142240, 417160, 237292, 124403, -251219, -354004, -400622, -295114, -95843, 250219, 62155, -74003, 195894, -65982, -37479, -281926, 85394, -26923, -298361, -332424, 98546, 33747, -318756, -218067, 143937, 116467, -145439, -95313, 170762, 20882, -31035, -306079, 100425, 30559, -41075, 91954, -42895, -40241, 13923, -137093, -42577, 41057, -474761, 196454, 226256, 146515, -186589, -352550, -137247, 137274, 64694, 134470, -47790, 149165, 909, -358086, -79826, 115443, 109039, -64525, -157888, -108819, 85527, 34393, 34566, 18843, 333176, -220386, -28299, -171719, 87013, 166493, -107201, 25266, 4458, 164446, 546375, -132738, 107354, 34136, -238940, -293127, 168177, -308644, -116814, -100072]
17634a00072H9554A7254d4270k58223A26778i9842C74760C280M6078g9805l8337
17623a18142G5349M14749a01271B81656q5371b0918B87821a50826A82559J21462
17613C04021a18917B50007f5962D1379M6467a04287C0946a32804N4511C28923
17602B08304A8713c22882A49865c86795a00663A20199B0922a93851j70788A84359
17591B07925O1104D361K57181b90525F1740d327I4437J69072L0535D6583b0275
17579I6011K5962C3915J66989A2903g4768b36D4175M21732d8480l10957A14302
17567C27406G9787d7124k23585a18037A06494M0717K6222a76843g7520K2264j65710
17556b20966A32977M9170a98961I1199a59644B16024J7573e7434C6134K24184
$$ y = [-100072, 89554, 17254, -44270, -302493, 126778, -99842, 374760, 3280, 49358, -79805, -118142, 75349, 490098, -101271, 281656, 196285, -20918, 287821, -150826, 182559, 304021, -118917, 250007, -65962, 41379, 87846, -104287, 30946, -132804, -78293, 328923, 208304, 18713, -322882, 149865, -386795, -100663, 120199, 20922, -193851, -364639, 184359, 207925, 269029, 4361, 261542, -290525, 61740, -4327, 94437, 263509, 294044, 46583, -20275, 96011, 121973, 33915, 200904, 12903, -74768, -236, 44175, 465907, -48480, -359437, 114302, 327406, 79787, -47124, -270709, -118037, 106494, 147211, 173433, -176843, -77520, -55256, -220966, 132977, 182147, -198961, 91199, -159644, 216024, 233597, -57434, 36134, 260318]
17546B60318r0898J4327N7518A11347Q9040c60835c5082A68565G1835b7083G6724
17534a24038a4381j23670a4091n5200n4331A08481C7613K7641L7655c8018l9406
17523g7424C12997E8071O9853a55071A62010L824O3343j13049J2104P0389a43142
17511H5062Q3360D9035a17575B59984r2156p4524J84704F9959b09058O9604B00185
17499G2439K700M8220h7325K3075A38940A6019a09934B33618J96274C8734A2614
17487C69624a17619e1280A08079B7226A2442L07878j494o3523a01178L4269J2342
17476e4567j60924Q8309B37699C1523b2977C42140a8078D55819h4285A92886K07253
17465D00139j80283J0941a1221G0285K55205A2922K29911j0349j02857b79204
$$ y = [260318, 169420, 183747, 241265, 111347, 200387, -360835, -35082, 168565, 71835, -27083, 76724, -124038, -14381, -138051, -14091, -69291, -123622, 108481, 37613, 65254, 102909, -38018, -77424, 312997, 58071, 127924, -155071, 162010, 165834, 229177, 116128, 128232, 198621, -143142, 85062, 168422, 49035, -117575, 259984, 167828, 93304, 278008, 69959, -209058, -139454, 200185, 72439, 75139, 123359, -87325, -64250, 138940, 16019, -109934, 233618, 429892, 38734, 12614, 369624, -117619, -51280, 108079, 27226, 12442, 320320, 318826, 255303, -101178, -66909, -54567, -215491, -127182, 237699, 31523, -22977, 342140, -18078, 455819, -84285, 192886, 400139, 219856, 230797, -11221, 70285, 325490, 12922, 242833, 232484, 129627, -279204]
17454A43210R5191J32778i6626B29029D2156K57810N9790q6742C4233K2363K43546
17443C00142a8351B7533Q1264c8350E7895K99643h3786D2991K15200n0098J54757
17432C62850H049K57869I1791L24360A32325Q8500a3951C10489o6208J88976j63276
17421B69981A5215P0928K60223p4605a4932D85887k04807A29984J23257g652j79541
17410a87193P8584D3206K11182A00671C9945K0702J13799C8386L2011a7490B62398
17398C00581a49083A67376b42178E6868d2403A46287a04844D5131b2054A13708
17387A31185n2437K00510b92198a24267g943C90104d5599A50081J94934E6733
17376e9011D07929C5196L2265L83447B15268b2484C58475A29935K54944K1328
$$ y = [143210, 238401, 371179, -96626, 229029, 42156, 299966, 359756, 273014, 34233, 56596, 300142, -18351, 27533, 108797, -38350, 57895, 357538, -83786, 42991, 258191, 208093, 362850, 8049, 265918, 91791, 416151, 132325, 220825, -13951, 310489, 244281, 433257, 269981, 15215, 86143, 346366, 271761, -14932, 485887, 281080, 129984, 253241, -7652, -187193, -108609, 43206, 254388, 100671, 39945, 60647, 174446, 38386, 70397, -17490, 262398, 300581, -149083, 167376, -242178, 56868, -42403, 146287, -104844, 45131, -22054, 113708, 131185, 78748, 279258, -292198, -124267, -7943, 390104, -45599, 150081, 345015, 56733, -59011, 407929, 35196, 67461, 450908, 215268, -22484, 358475, 129935, 384879, 406207]
17366D06207j84893J03940p7732J02769b49310O055D7409i3175A38802J00359
17356B39161O7336J3133A21229i24B1398L86447D6770K62980g9709F4052L26964
17345C91016C399J64221J48355F9794b7975j6589n975B78146E6790L42972j97214
17334B02548a4420B25202K10885j9185H6906a03949D72989i5627B09933a33312
17323a3732C77335H2164j9598J22216m8013a44878d4889A17668K0653J36170A26440
17311B3979K91334p1163C4759O6542b80518A09929K59536A63853k4665J8715N591
17300A63494C8727M8185Q1540D0774a0977E937a39428H4856a93852A27293j9136
17289A08157C4363K26300I2989K5859R978f5679E4662b44282B8762J34018m4891
$$ y = [406207, 221314, 325254, 247522, 350291, -249310, -243255, 47409, -93175, 138802, 239161, 306497, 319630, 121229, -924, 21398, 407845, 46770, 309750, -79709, 64052, 391016, 3399, 167620, 315975, 69794, -27975, -44564, -50539, 278146, 56790, 399762, 202548, -14420, 225202, 436087, 416902, 86906, -103949, 472989, -95627, 209933, -133312, -13732, 377335, 82164, 62566, 184782, 136769, -144878, -44889, 117668, 138321, 274491, 126440, 23979, 315313, 244150, 34759, 101301, -280518, 109929, 369465, 163853, 139188, 157903, 163494, 38727, 86912, 168452, 40774, -10977, 5937, -139428, 84856, -193852, 127293, 108157, 34363, 260663, 92989, 118848, 128826, -65679, 54662, -244282, 28762, 162780, 117889]
17278A17889K32657j24506H8447a27884B67565i7630A52765R7155r2327c5195
17267b0578A79386F2136k7001H211K698K43743P1934J0703f3320A72203H5278
17255C19708g0312E1166Q9236B3354J20851J59493A27309d7116q91B05981M00031
17244F06012A46114m7083J75917H2956C9934J81637K44284A65587k8383k0023
17234A17181M5470J52164b55976C28339J9727j49403h026B85500j12624J1530
17224A84406n254j4685b17262B53515f8374k1683I6888N1140M8688P175r183M0168
17212B34876J16161A25724J41899m5814J27425j33620I0369l6568J9099J61942
17202B34842F7664J48059F2360J03581G1375J58574o560I4375K25442j30276Q9106
$$ y = [117889, 350546, 226040, 88447, -127884, 267565, -97630, 152765, 249920, 157593, -35195, -20578, 179386, 62136, 35135, 8211, 10909, 254652, 326586, 337289, -63320, 172203, 85278, 319708, -70312, 51166, 140402, 23354, 144205, 303698, 127309, -47116, -48007, 205981, 606012, 146114, 99031, 274948, 82956, 39934, 221571, 465855, 165587, 137204, 117181, 162651, 314815, -255976, 328339, 348066, 198663, -8026, 285500, 172876, 184406, 179152, 164467, -217262, 253515, -68374, -90057, 96888, 148028, 196716, 203891, 194708, 234876, 351037, 125724, 267623, 221809, 349234, 215614, 90369, 53801, 72900, 234842, 67664, 215723, 62360, 165941, 71375, 229949, 223389, 94375, 319817, 189541, 278647]
17191B78647M6802M5055D9167a36504H1931J82832l6120l4809C276O00111A17506
17179A64071Q7366q9076b308A28428K15911h4589A58037J38114c25159D59633
17168A86357L2514j0426q4508L31455A83562i4194E33296A24784L06058G1562
17157H2013J07897J68861R8888C4149M46203e8622C73957j70586n9432O2365j00308
17146A05996K10852j46007a34074F18026j67751A70527E7048N6859O4420c8197
17135E02587k40466A13979A7112J37773J15853F3246a7142E60382B49494H1456
17124D27341q3397a6146E17695p5258F3285O4143O2794Q3718K0421p1488H6507
17112A11918a32067A57045K17024R1050o4252j18696J36099J85466j82880k02307
$$ y = [278647, 325449, 370504, 49167, -136504, 81931, 264763, 228643, 193834, 3276, 603387, 117506, 164071, 251437, 162361, -2308, 128428, 344339, -84589, 158037, 296151, -325159, 459633, 186357, 218871, 208445, 123937, 455392, 183562, -94194, 533296, 124784, 430842, 71562, 82013, 189910, 358771, 457659, 34149, 480352, -58622, 373957, 203371, 143939, 206304, 105996, 316848, 170841, -134074, 618026, 450275, 170527, 57048, 113907, 178327, -38197, 502587, 262121, 113979, 17112, 154885, 270738, 63246, -17142, 560382, 249494, 81456, 427341, 343944, -16146, 517695, 442437, 63285, 127428, 190222, 273940, 294361, 222873, 86507, 111918, -132067, 157045, 374069, 465119, 400867, 282171, 418270, 603736, 420856, 218549]
17102B18549n9093K61990k03881J50302A42440L47415j2895P6986j34479K65910
17092F85377e8491C62735j25992J26235P4976F6792L27890J43299k0623j23652
17082C93706O2635o2506L67359B41615J4132K2447l9171Q1747K11597I9074J17406
17071B16480J34476K6743J36647k32441J18804J23237j31604H7620K76523J70950
17061E35093O252m6603F9130K22374k3501K33236A31578Q06580m63685K0058q1249
17050D13282J13446J70670j24178Q1311K4796k48846k13351N6031Q6194K7500
17040C86855r6209J98451M0651o6076K01087N5840l42007N8873K5578J95520C09797
17028G13340k8203m6210j18307J84493B99872p1439N18706k36476J18660P3800
$$ y = [218549, 159456, 421446, 217565, 367867, 142440, 489855, 476960, 553946, 419467, 685377, -58491, 362735, 236743, 362978, 437954, 66792, 394682, 537981, 517358, 393706, 456341, 393835, 761194, 241615, 255747, 278194, 239023, 320770, 532367, 99074, 216480, 350956, 377699, 514346, 281905, 400709, 523946, 392342, 87620, 364143, 535093, 541345, 494742, 69130, 291504, 268003, 501239, 131578, 938158, 474473, 494531, 413282, 526728, 697398, 573220, 654531, 679327, 430481, 217130, 273161, 359355, 386855, 290646, 489097, 529748, 463672, 664759, 720599, 378592, 437465, 463043, 658563, 309797, 713340, 685137, 638927, 520620, 705113, 299872, 228433, 747139, 510663, 629323, 703123]
17018G03123l49429J03080j34606L79885o6948o3173j49582J39186J25960k41286
17008D46210J78474k21178J85657r7654K34105q3245q3064l6469k3945p7603K91228
16997G12516m1852N2119r3621j461j8270k63110J14961P4891J06881m0935j55905
16986D46214R6737L01950k83380j2058L4568R5231O7543P7460j36043Q7623K8181
16975H04026M4492K25772m56490K95874j48411K4057p4532O8841r9998J16941
16965H00572l04017L05565r3869p4646m7771K36928K61253l70529J32614k6202
16955H19898J74018k95924K84973j51368P5211J88830r2488l3832l01942j58501
16945E08875M75874J93266j31952j71255p2218q4696O42209l99314J80122Q2765
$$ y = [703123, 353694, 456774, 322168, 702053, 635105, 571932, 422350, 561536, 687496, 446210, 624684, 403506, 589163, 491509, 725614, 642369, 559305, 522836, 498891, 421288, 712516, 670664, 722783, 629162, 627701, 609431, 346321, 461282, 536173, 643054, 602119, 446214, 542951, 844901, 561521, 549463, 584031, 679262, 746805, 824265, 688222, 775845, 804026, 848518, 1074290, 617800, 913674, 765263, 789320, 714788, 783629, 683631, 800572, 496555, 802120, 708251, 633605, 585834, 822762, 1084015, 713486, 846100, 819898, 993916, 697992, 982965, 831597, 906808, 1095638, 1003150, 969318, 667376, 508875, 984749, 1178015, 1046063, 874808, 802590, 717894, 1360103, 960789, 1140911, 1223676]
16935A223676l24833M21969o5968j51571k85704J26828m2615R2766J6111M3058
16925A053717l51944J49496K74084K6564J85672m4881r363j44422J42752J24460
16915A406135l7627j40213l56322N00568k73312q5850J19353K65723q8428k16394
16905A093633J79348o1117N012K00235J61521l87328m752k9431K94142K734M15616
16894A869613k9267k59894q7003M25713l65582J58251j56054K1897J951J0622
16884A590247J16421L2591L52480l54288Q5688J88572k25149J47591j06097p5738
16874A752318L23140k61658K77560J94883k90173N0530K38677P769N2033n0838
16864B294241N6649j29037J96416m00593M89310l54135K23198R972K59232k44606
$$ y = [1223676, 898843, 1320812, 1254844, 1103273, 817569, 944397, 901782, 994548, 1010659, 1053717, 701773, 851269, 1125353, 1151917, 1337589, 1292708, 1283345, 1138923, 1281675, 1406135, 1368508, 1228295, 871973, 1372541, 1099229, 1013379, 1132732, 1398455, 1310027, 1093633, 1272981, 1211864, 1216876, 1417111, 1578632, 1191304, 1186552, 1157121, 1451263, 1453997, 1869613, 1840346, 1580452, 1493449, 1919162, 1553580, 1711831, 1555777, 1577674, 1579625, 1590247, 1706668, 1739259, 2091739, 1737451, 1823139, 2011711, 1786562, 1934153, 1828056, 1752318, 2075458, 1813800, 2091360, 2286243, 1996070, 2046600, 2285277, 2293046, 2345079, 2294241, 2350890, 2221853, 2418269, 2017676, 2506986, 2152851, 2376049, 2386021, 2645253, 2400647]
16854B400647K74165j40411O9502M44136m22822N45718n89414N9931M57655P3524
16844C172631J73677l33130J30037l87715L38515K58586l15943l627J86926J21431
16834C341388K46098Q7427j8023M6845k04282K69762K45969j23905r6897K13304
16824D007686o1779L33076K83193J51469m16190L29544K33342l01276L7287K65834
16814D862186K66470l8777q3654L25822L6062K25773J24553N6442M1156J12798
16804E928831k5371L80186M46347P6136j9513n4152K85768K41398N3489K3438
16794G336557L22275J68200K92006L09033l6322r0751P25831L08994L09538j2458
16784I632903N08510L01877M34644L03045j39911O89885L93347L89029L22334
$$ y = [2400647, 2674812, 2534401, 2603903, 3048039, 2625217, 3170935, 2581521, 2641452, 3099107, 3172631, 3346308, 3013178, 3143215, 2755500, 3094015, 3352601, 3036658, 3033031, 3219957, 3341388, 3587486, 3674913, 3656890, 3703735, 3499453, 3769215, 4015184, 3891279, 3794382, 4007686, 3945907, 4278983, 4562176, 4713645, 4297455, 4626999, 4860341, 4559065, 4596352, 4862186, 5128656, 5089879, 5006225, 5332047, 5368109, 5593882, 5718435, 5774877, 5816033, 5928831, 5903460, 6283646, 6729993, 6806129, 6786616, 6732464, 7018232, 7259630, 7313119, 7336557, 7658832, 7827032, 8119038, 8428071, 8391749, 8300998, 9026829, 9335823, 9645361, 9632903, 10141413, 10443290, 10877934, 11180979, 11041068, 11730953, 12124300, 12513329, 12835663]
16775A2835663J99255O68740N90840N2767R09207J89641P86100L17827N93173
16766A7143213P55360M15112O28115Q99134R71826N28125J212657P12910J275331
16757B4541783P24812R91833J207380J503059J067092J491821J615893J638923
16749C4782596J670118J588673K098255K085387K729524J918513K930980K769576
16741E2573622L161175L339948L302633L774302M350253M588988M955683N386590
16733H5433194N597661O074341P002351O653262P735748P896125Q292100Q871113
16725A43555895Q593285R472005Q550520R011217P906268P571960O125523N214989
16717B06001662L501668K272304K92207j272791l144292m609641n699869o987563
$$ y = [12835663, 13034918, 13703658, 14294498, 14347265, 15256472, 15446113, 16232213, 16550040, 17143213, 17898573, 18313685, 18941800, 19840934, 20812760, 21340885, 22553542, 23266452, 24541783, 25266595, 26258428, 27465808, 28968867, 30035959, 31527780, 33143673, 34782596, 36452714, 38041387, 40139642, 42225029, 44954553, 46873066, 49804046, 52573622, 55734797, 59074745, 62377378, 66151680, 70501933, 75090921, 80046604, 85433194, 91030855, 97105196, 104107547, 110760809, 118496557, 126392682, 134684782, 143555895, 152149180, 161621185, 170171705, 179182922, 187089190, 194661150, 200786673, 206001662, 209503330, 211775634, 212067841, 210795050, 207650758, 203041117, 197341248, 190353685]
16709A90353685q005404q062065r043127q567400r450504q887844q553698q110946
16701A21672697p820624p285493o817052o706271n979336n269246n266268n018913
16693G1509494l840643m135068l765923m044630k842614k866881k709027k837475
16685D4467233k275653k184262k388111j637585j685662j619579j692121j381576
16677B9602684j401463j433229r03883r42508j045347j238970p42419j201451
16669B0693414q80518n35360q02070q21390m80117q01154m24879m01336p33252
16660A4813338m87134l47598n72380m29318l33836l19079q51871k67547j55103
16651A1049472k25140l01915n63428n45116L25704p62395m2330l12462m9740l66552
$$ y = [190353685, 182348281, 174286216, 165243089, 156675689, 147225185, 138337341, 129783643, 121672697, 113852073, 106566580, 99749528, 93043257, 87063921, 81794675, 76528407, 71509494, 67668851, 63533783, 59767860, 55723230, 52880616, 50013735, 47304708, 44467233, 42191580, 40007318, 37619207, 35981622, 34295960, 32676381, 30984260, 29602684, 28201221, 26767992, 25864109, 24921601, 23876254, 22637284, 21894865, 20693414, 19812896, 19277536, 18475466, 17654076, 17173959, 16372805, 15947926, 15546590, 14813338, 14326204, 13978606, 13406226, 12976908, 12643072, 12323993, 11472122, 11204575, 11049472, 10824332, 10522417, 9958989, 9413873, 9739577, 8977182, 8934852, 8622390, 8572650, 8206098]
16641H206098n56747j72267L05168k80788m61086j75755R3214m55240r1672m1487
16631F369438k28861o0459m1149n61051O0157q4287p8930n04578M01610j09090
16621E162800j30051m13771r7766k7549j08202J39673l64527J05013m98220K04557
16611C971957J25080l42709J75460n2576o16324J39605N312M4116l2952M5805
16601C462774j51415j15724K08833l24139j82947j8261K08274J21027o12116L19855
16591B916161o0369l48457K13093l01127O9636L6579K09176l66619L3142j15584
16581B285631r3075J5290Q1521k36092k1198K58795l90042K19262q7846j84463
16571A847783J74761j03745j56842j09723L18126j87348M5490m384J48683j00885
$$ y = [8206098, 7649351, 7477084, 7782252, 7501464, 7040378, 6864623, 6957837, 6502597, 6410925, 6369438, 6140577, 6080118, 6038969, 5477918, 5538075, 5453788, 5374858, 4870280, 5271890, 5162800, 5032749, 4618978, 4521212, 4493663, 4385461, 4525134, 4160607, 4265620, 3767400, 3971957, 4097037, 3754328, 3929788, 3877212, 3260888, 3400493, 3405805, 3449921, 3416969, 3462774, 3311359, 3195635, 3404468, 3080329, 2897382, 2879121, 3087395, 3208422, 2596306, 2916161, 2855792, 2507335, 2720428, 2419301, 2488937, 2525516, 2734692, 2368073, 2401215, 2285631, 2192556, 2207846, 2289367, 2053275, 2032077, 2290872, 1900830, 2120092, 2032246, 1847783, 2022544, 1918799, 1761957, 1652234, 1970360, 1783012, 1828502, 1824118, 1972801, 1871916]
16561A871916o8294p5960j86397q4379o6408N07060p41277K78529J10999j60665
16551A385124K04793M9932j83071k03534K2688j48733M56762m15731K83297k3616
16541A427911l60019J53024j54395M52569l91218r5817P1160J43639Q6816O6180
16531A399850k48955J06564j51428r2273r4954L5399K16138m18387M93252j25690
16521A119516l59664K68461q1638P8094Q6122j79851L37457m56063K63105k4453
16511A051086k95891J06590P3799l98446M46967J882m6420l31187K1378J09384
16501G39142K23829j10204Q7382l966m52460L66466j69106K67659J16319l81425
16491F83636J67410j14609m6865j16770J24311r249j25558L56571k35701J7129
$$ y = [1871916, 1803622, 1727662, 1541265, 1456886, 1390478, 1897538, 1156261, 1434790, 1545789, 1385124, 1589917, 1639849, 1456778, 1253244, 1275932, 1127199, 1583961, 1168230, 1451527, 1427911, 1067892, 1220916, 1066521, 1519090, 1127872, 1032055, 1103215, 1246854, 1333670, 1399850, 1150895, 1257459, 1106031, 1013758, 918804, 954203, 1170341, 751954, 1245206, 1119516, 759852, 1028313, 946675, 1024769, 1110891, 931040, 1268497, 812434, 1075539, 1051086, 755195, 861785, 935584, 537138, 984105, 985987, 939567, 608380, 629758, 739142, 962971, 852767, 940149, 936183, 483723, 850189, 681083, 948742, 1065061, 683636, 851046, 736437, 689572, 572802, 697113, 687864, 562306, 918877, 683176, 700305]
16481G00305N141M3091k67797J17891K49352o294C85349L48366n5966n7436K56079
16470H76392k86248J8214K39422B57511J82640q9258J68567L36389j69381j77554
16460E08914p2969j19605L87984j19951j40477N3544J82760B98578p8170k0505
16450A99903L56929n1049r423L17729l43111A88474M91666A77558M549N44758
16440G26865k80225J36926o0346J13973B47506J63619K9845J38235k37841L22366
16430F63730B75270K60192j19177r0138N10330l48105G7550M57231B55135K52462
16420E07597J96588B66212J47421K80481H2497K35274J21139j97767n1671J10438
16410B99910I6499k4101O85787B55024j12937J16080J62897M248l6187j4042A25980
$$ y = [700305, 705446, 748537, 480740, 598631, 847983, 841689, 385349, 733715, 677749, 620313, 876392, 590144, 608358, 847780, 257511, 440151, 350893, 519460, 855849, 686468, 508914, 435945, 316340, 704324, 584373, 443896, 497440, 680200, 298578, 220408, 199903, 556832, 505783, 496360, 814089, 470978, 188474, 680140, 177558, 182107, 726865, 446640, 583566, 523220, 637193, 247506, 411125, 440970, 579205, 341364, 663730, 275270, 535462, 416285, 326147, 836477, 488372, 77550, 534781, 255135, 507597, 704185, 266212, 413633, 694114, 82497, 317771, 438910, 241143, 189472, 299910, 96499, 72398, 758185, 255024, 142087, 258167, 421064, 425312, 389125, 375083, 125980]
16398G8552K52368Q3888j11231M3618K953A4811K02290R4471L5953A17450O3997
16387A81447J36649J06656k06384J57184N3435Q4883J32823B26571K95858M441
16377E26870k18209r8059L91757j35681j15452j52982P9270k2812K18835A3424
16366F8736J70158R944E3113o01M31718a2154A44940R3381K72601a26086F76334
16354B09151G245L87685J21969j02750j58145n9517J20906A6989J95234j5323
16344A96900Q7887j36851M39476k82571J34589a10399A40238J52102j25972c8726
16333A62552J23422J4280b736l0881B31249A9029J7904J7790J90480j18960L62770
16322D89013j07179I5540K79358O2421A58606K07229A25715K6886K98171B00289
$$ y = [78552, 330920, 414808, 303577, 347195, 350148, 14811, 217101, 311572, 347525, 117450, 181447, 318096, 424752, 218368, 375552, 428987, 513870, 646693, 226571, 522429, 526870, 308661, 210602, 602359, 466678, 351226, 198244, 277514, 254702, 473537, 13424, 68736, 238894, 248838, 53113, 52512, 484230, -12154, 144940, 238321, 510922, -126086, 676334, 209151, 7245, 394930, 516899, 414149, 256004, 196487, 317393, 16989, 212223, 196900, 284787, 147936, 587412, 304841, 439430, -110399, 140238, 292340, 166368, -38726, 162552, 285974, 300254, -2736, -33617, 231249, 19029, 36933, 54723, 245203, 126243, 489013, 381834, 95540, 374898, 437319, 158606, 365835, 125715, 152601, 450772, 200289]
16311D04808A2339c47772B32958j6521D9793R0998k0264L8785P9754B8766J45174
16300A73940K5362C9174M2758J26911b58124a7901A58010C8203a4510k18292C3662
16288A96224a63026D4922d5065E3246J43611l2181J8958K20970K0051A0167J59429
16277A69596l9747a45651D21145b00445A75798a59162H7613K84703B8994a36830
16266B06594D8113E621L85167j84207g3189F9216L15523F094c6426J4803A68946
16254C86535j57514a31453A53036f8304j7542J3989I4609C9955a08071M7753A90038
16242E7520K764L50476D0072M6075K36792l7936A00739Q4097F8935O531R6933
16231A72399A0474J23198d7372m5514A3863b00586L2142k07238A34563K26742
$$ y = [404808, 12339, -347772, 232958, 216437, 49793, 140791, 120527, 159312, 239066, 28766, 173940, 199302, 39174, 81932, 208843, -258124, -17901, 158010, 38203, -14510, -232802, 33662, 196224, -163026, 44922, -45065, 53246, 196857, 164676, 183634, 404604, 424655, 10167, 169596, 129849, -145651, 421145, -200445, 175798, -159162, 87613, 372316, 28994, -136830, 206594, 48113, 5621, 390788, 206581, -73189, 69216, 384739, 6094, -36426, -21623, 168946, 386535, 229021, -131453, 153036, -68304, -85846, -71857, 94609, 39955, -108071, -60318, 190038, 57520, 60284, 410760, 40072, 86147, 322939, 285003, 100739, 184836, 68935, 75466, 172399, 10474, 133672, -47372, -92886, 13863, -200586, -168444, -375682, 134563, 361305]
16221C61305i5673m3162C14160E5299L1270b59C02275K9917B6764E788P5097J11061
16209A91946D0381b37855J12881B14518A04035Q5744R4303B0525J78628C5645
16198a10591K5228F5981B7900J78813k4675H6664j3848j1159a04589p8738A42484
16186a04706B55802J0344A9206R2585J83331J54130f5847A94649J69635E1513
16175I6325J5578h6450o040A80687d2029H5992a37935E9962a66214d7604p4340
16164a21944A47127C4979e788A6627g9536r300B48749a18834A15505b7030j61998
16153a89028e6108A22013Q1457d06393B09481a7726H5178d6629A05057j7765A4578
16141b5898k430k44242d7768C45656b878k33538C76104D2110k0851D322J91586
$$ y = [361305, -95673, -138835, 314160, 55299, 86569, -259, 302275, 332192, 26764, 5788, 80885, 191946, 40381, -237855, -124974, 214518, 104035, 189779, 284082, 20525, 199153, 35645, -110591, -85363, 65981, 27900, 206713, 182038, 86664, 72816, 61657, -104589, -183327, 142484, -104706, 255802, 266146, 19206, 111791, 295122, 449252, -65847, 194649, 364284, 51513, 96325, 111903, -86450, -92490, 180687, -42029, 85992, -137935, 59962, -166214, -47604, -121944, 147127, 34979, -5788, 16627, -79536, -88836, 248749, -118834, 115505, -27030, -189028, -56108, 122013, 203470, -406393, 209481, -17726, 85178, -46629, 105057, 87292, 14578, -25898, -28328, -272570, -47768, 345656, -2878, -236416, 376104, 42110, 21259, 4322, 195908]
16130A95908J10223j00812a50284c0008j0452q3476C3145a20960A60636e12755
16119d42279G9867F660K08047b17480I1594M959b70994B12179b69474b4063k4305
16108d8368B64205g0774l3912A91218G509J14449J00925H2196a56044A41287M6266
16097A87553q7526B6379a8430A9324B551d2864B8450g7502A82916e8820k85445
16086c44265a43770H3177R9482h3130A92292r3879c4078k26511f1411H3076M64285
16075E47361h1206j74590R0194A10939b191l6628j11947c707l16137H2151d9144
16063A86589i0244h217k14680C25706a85701b9481o9486e215H4847d104G224b33344
16050A71601a57075L7926r248I7926e08534b19994h0952j79898A26780M1561c01422
$$ y = [195908, 306131, 205319, -150284, -30008, -40460, -123936, 33145, -120960, 160636, -512755, -442279, 79867, 6660, 214707, -217480, 91594, 96553, -270994, 212179, -269474, -24063, -48368, 264205, -70774, -104686, 191218, 7509, 121958, 222883, 82196, -156044, 141287, 187553, 100027, 26379, -18430, 19324, 2551, -42864, 28450, -77502, 182916, -58820, -344265, -143770, 83177, 182659, -83130, 192292, 98413, -34078, -260589, -61411, 83076, 547361, -81206, -255796, -165602, 110939, -2191, -38819, -150766, -3707, -319844, 82151, -49144, 186589, -90244, -8217, -222897, 325706, -185701, -29481, -98967, -5215, 84847, -4104, 7224, -233344, 171601, -157075, -119149, -128397, 97926, -508534, -219994, -80952, -260850, 126780, 168341, -301422]
16038C52440a00612B73594j09558m4108J21894a45241A06364B1361P7727f3355
16027G4378k6783b4429B61650b76099A60351a10737A91163b46701A82559b10882
16016a26393L9866j99008f2875A00126b36112c1097j50262N9904B15568a0408
16005A86921q2565b23946E4929J14815P2089g4165L1334p5990m3134l583M2423
15994a23115n3351A41468a23072J7327j936B26136E4834c2088A20189d9303A30752
15982c9224D47564H974J28547R9855q9104a66140h593B58071c8283n0599k02584
15971b91466d0217D3427a11206l8714j41212J28027J8995O8058C772b780j5564
15960a8344l3484k3656E069b64991j0790A88439c69222A92216c8082j49679d1888
$$ y = [352440, -100612, 273594, 164036, 119928, 241822, -145241, 106364, 21361, 99088, -63355, 74378, 47595, -24429, 261650, -276099, 160351, -110737, 191163, -246701, 182559, -210882, -126393, -86527, -285535, -62875, 100126, -236112, -31097, -181359, -121455, 215568, -10408, 186921, 104356, -223946, 54929, 169744, 241833, -74165, -42831, -118821, -161955, -165538, -123115, -176466, 141468, -123072, -105745, -107681, 226136, 54834, -32088, 120189, -49303, 130752, -39224, 447564, 8974, 137521, 237376, 148272, -166140, -8593, 258071, -38283, -88882, -291466, -40217, 43427, -111206, -149920, -291132, -163105, -144110, -76052, 3772, -2780, -18344, -51828, -75484, 5069, -264991, -275781, 188439, -369222, 192216, -38082, -187761, -41888]
15948e1146j344r1707m25806a57362j61604f8275J7473j46989A5268M085a36428
15936A6500b08783A4419a45662k2030A01524c06108k23084a89235A4674a21103
15925H2669c02809B01683g350A34512c0578k5084A17477i3897F2875a0944k53916
15914b64860B02712L6093a86698B3696H544h5512A09347c3057k27026A57957J7444
15903A75401A6391d7375A62277l3667b1105m6046a2702m008B5975b54661p2391
15892c27052A53337f6504k9521m4269L472j61041P8349L2981i0711C8140P8260
15881A16400E1914b26720e5552B3326L365c5494A63871c00791m614D4364i060
15869b34994m512E8711M5220O3239b95377J01969B82669F5400g0630l7088J4257
$$ y = [-51146, -52490, -144197, -570003, -157362, -318966, -68275, -50802, -197791, 15268, 19353, -136428, 16500, -208783, 14419, -145662, -167692, 101524, -306108, -529192, -189235, 14674, -121103, 82669, -302809, 201683, -7350, 134512, -30578, -55662, 117477, -93897, 62875, -10944, -264860, 202712, 238805, -186698, 23696, 8544, -85512, 109347, -33057, -260083, 157957, 175401, 16391, -47375, 162277, 128610, -21105, -67151, -12702, -16710, 25975, -254661, -327052, 153337, -66504, -96025, -140294, -136822, -297863, -219514, -186533, -90711, 38140, 116400, 51914, -226720, -55552, 23326, 26691, -35494, 163871, -300791, -305405, 44364, -9060, -234994, -239506, 58711, 103931, 167170, -295377, -193408, 282669, 65400, -70630, -107718, -93461]
15858i3461p4194f2720B7921J0947j1465b26310d4510k92891a20257l6988c3587
15846A37570a45680A66822a85136b7113k65122J45472k68531a58307q3215j21144
15836c62666N9334c8543B03520g2721c2113J3027j87517I1952C8614a42974E8099
15824G4535b9745C44282g9224j47555C7745b28317A47767m6255a72983b8608p9253
15813a07861a9514B0232h9199G9373f88698b49469A22790J0307i1522j03270j50633
15802c45425A76179D9885J22884G7131j6578f7707E5636b77399R2056G1877d1608
15790f8467D8950b15970f8365r6866F8113f0131m6695k20620a27868j64646C5938
15778b10007i7200A62804a84726l42355a52441G8018a99547A24896j2888m2146
$$ y = [-93461, -167655, -62720, 27921, 38868, 27403, -226310, -44510, -337401, -120257, -157245, -33587, 137570, -145680, 166822, -185136, -27113, -292235, -146763, -415294, -158307, -241522, -362666, -303332, -38543, 203520, -72721, -32113, -19086, -206603, 91952, 38614, -142974, 58099, 74535, -29745, 344282, -79224, -226779, 37745, -228317, 147767, 101512, -172983, -28608, -107861, -19514, 20232, -89199, 79373, -688698, -249469, 122790, 133097, -91522, -194792, -345425, 176179, 49885, 172769, 77131, 60553, -67707, 55636, -277399, -185343, 71877, -41608, -68467, 48950, -215970, -68365, -165231, 68113, -60131, -106826, -327446, -127868, -292514, 35938, -210007, -97200, 162804, -184726, -527081, -152441, 78018, -199547, 124896, 112008, 69862]
15768F9862M229K0033a36463D60669A24412m0449k7654a45157A6320Q5227f2432
15756B73993B0815K81964D9851J37979b1958n1282l82155H758b23758A08692J48923
15745B57615A14151B0913b57975b0572c806p9532E3147a77699k9749j08659d0955
15733C91558A14241b63877r4667J65381j13144A17331c0051E3057a1592B52378
15722a23352I7787D6429J19287c98k02715H3690J93491G7373P4940d59761a30177
15710b75317A78784k141o5194J42926O6463E64b11977A37922g9280k25253J32133
15699a72400B4991i0114B66192A27852c9084j61214A72731E8245J48554P5700
15689B82499h8865A91715g8893j53110h223B8242g7893n5230F5843b78115h17
$$ y = [69862, 74091, 94124, -136463, 460669, 124412, 83963, 56309, -145157, 16320, 101547, -62432, 273993, 20815, 302779, 49851, 187830, -21958, -73240, -455395, 8758, -223758, 108692, 257615, 114151, 20913, -257975, -20572, -3806, -83338, 53147, -177699, -207448, -316107, -40955, 391558, 114241, -263877, -358544, -193163, -306307, 117331, -30051, 53057, -11592, 252378, -123352, 97787, 46429, 165716, -398, -203113, 83690, 277181, 77373, 152313, -459761, -130177, -275317, 178784, 176643, 111449, 254375, 320838, 564, -211977, 137922, -79280, -304533, -172400, 24991, -90114, 266192, 127852, -39084, -200298, 172731, 58245, 206799, 282499, -88865, 191715, -78893, -232003, -8223, 28242, -77893, -133123, 65843, -278115, -817]
15677a50824O2375M1690C9515J97207r7470F0349J72898a1243G1195K1478l6279
15666E6394L9325g9398B35816G9374C7126b5872j11949j4857A94486c19676a58270
15654A58880c47332f9131A21487D2422a86524a5122j390H5094h0676j81683B47315
15642B1902f30155b94164a15138f061n35913b55615a8083k39651A13303J09734
15632B23037a1312k9480C5985j0678c02215E6426a8507p6654b186G738h6707I0514
15619C0687b65097E9213a31874B50889j13512K63124e2996C7140a91150J8511
15609a72639N3675e6159j45399m64762a50807E3169a01135j17317j590p2992B83571
15597a35889j14976j61062J91713A34649f658k33041A07412P0902b52772D4935
$$ y = [-150824, -88449, -46759, 39515, 236722, 139252, 60349, 233247, -11243, 71195, 92673, 56394, 95719, -79398, 235816, 79374, 37126, -25872, -137821, -152678, 194486, -319676, -158270, 158880, -347332, -69131, 121487, 42422, -186524, -15122, -16512, 85094, -80676, -262359, 247315, 21902, -630155, -294164, -115138, -6061, -541974, -255615, -18083, -257734, 113303, 223037, -11312, -40792, 35985, 25307, -302215, 56426, -18507, -95161, -2186, 7738, -86707, 90514, 30687, -265097, 59213, -131874, 250889, 137377, 400501, -52996, 37140, -191150, -172639, -118964, -56159, -201558, -666320, -150807, 53169, -101135, -218452, -220042, -293034, 283571, -135889, -250865, -411927, -220214, 134649, -6658, -239699, 107412, 178314, -252772, 44935]
15586A44623H76b9664C9442g9883L2072B1942d9322A60028D4854K2194b09962
15574b61460A11551g3326E2174a61629l822A6058a34833l4514A750e43071a33086
15562C6146L0862c34519c9851o9442j63568D8138J79838J6849D0584i3708B4218
15550a20991a237A39799h2412j45305B81879a34266A75086j6735k5104g7500a1284
15538D0340Q1088a69738G3983K7752d732j71069B5269i8244A43417b9370k6620
15527e5990p008j49847H2835a90706A46281k0158E0925c38709J9026E2412d1663
15515A39335b10910B24382B9688R7762a8399G715P8788B9177Q9807a81970A38211
15503C18486a83119h5211B2965a85821d9534l8303G1020J48562j08156a09608
$$ y = [144623, 876, -29664, 39442, -79883, -47811, 21942, -49322, 160028, 44854, 67048, -209962, -261460, 111551, -73326, 52174, -161629, -165451, 16058, -134833, -169347, 1750, -543071, -133086, 36146, 67008, -334519, -39851, -109293, -272861, 48138, 227976, 244825, 40584, -93708, 24218, -120991, -1237, 139799, -82412, -227717, 281879, -134266, 175086, 158351, 133247, -77500, -11284, 40340, 121428, -169738, 73983, 101735, -4732, -175801, 25269, -98244, 143417, -29370, -55990, -62998, -212845, 82835, -190706, 146281, 126123, 50925, -338709, -319683, 52412, -41663, 139335, -210910, 224382, 29688, 127450, -18399, 7715, 86503, 29177, 118984, -181970, 138211, 318486, -183119, -85211, 22965, -185821, -49534, -87837, 71020, 219582, 111426, -109608]
15492D6977K7587N4077J56519a82933A91795J1648P02b09393A15132C0312a36470
15480a02603A40921o0265J64675a69234B68700a36704F343J5340b18022C5606
15469A13850n5227c39058a13929q8979a3983B44834r2006d453A8675h5932p6209
15458a62141C70034G8535b77855a08134C22338H4809A2164J94837A9349L5148
15448E4497J61586a92779A86478e6386j45672d9540l23973A68956P579Q4557b4759
15436b8852a1354C2999i7585j50208g388l9949a0538j35120c6742n6449q1886
15425a75077A61525c5628C35623a13512A25581H145a32993D01245c927r8972A61180
15413a20766j09843A21851B3451d54534a5741m3813o1734B05853a58095e3653
$$ y = [46977, 74564, 128641, 285160, -182933, 191795, 203443, 204145, -209393, 115132, 30312, -136470, -102603, 140921, 80656, 245331, -169234, 268700, -136704, 6343, 21683, -218022, 35606, 113850, 58623, -339058, -113929, -202908, -13983, 244834, 152828, -4453, 18675, -85932, -162141, 370034, 78535, -277855, -108134, 322338, 84809, 12164, 207001, 19349, 54497, 216083, -192779, 186478, -56386, -202058, -49540, -373513, 168956, 176535, 261092, -24759, -28852, -11354, 32999, -97585, -247793, -7388, -47337, -10538, -145658, -36742, -93191, -175077, 161525, -35628, 335623, -113512, 125581, 8145, -132993, 401245, -3927, -102899, 161180, -120766, -230609, 121851, 23451, -454534, -15741, -59554, -121288, 205853, -158095, -53653]
15402D3434Q3992H076e1346B8169M3313L34897a87135a2896k16021A29473D7408
15390c13451a7173E6c09395g8509A67052n3411c7175A55518b09768B1369d2621
15378a38969D0861A0840f2211j03988k03290B8676g2970A42661i6396I9215e6509
15366B46125E8082R9879f8537j92272n671J7082A98151c01460d8200B41922n5483
15355A86439b92849A01698P0043f2569C44814a07682J3610r3346n907B76487I5880
15343G145a66282e2715k20674I6795a17136C36878A10818b06197C30291b97539
15332A00206l6015e8338l2578C76184a41996C73145f2366j60231A03133h5936
15321h5750a3009h46C4115a42645k95403E1294L1732K51490a39762A20935k0823
$$ y = [43434, 127426, 8076, -51346, 28169, 71482, 406379, -187135, -12896, -228917, 129473, 47408, -313451, -17173, 56, -309395, -78509, 167052, 113641, -37175, 155518, -209768, 21369, -42621, -138969, 40861, 10840, -62211, -166199, -369489, 28676, -72970, 142661, -96396, 99215, -56509, 246125, 58082, 157961, -68537, -260809, -266480, -249398, 198151, -301460, -48200, 241922, 186439, -292849, 101698, 171741, -62569, 344814, -107682, -94072, -187418, -193325, 276487, 95880, 7145, -166282, -52715, -273389, 96795, -117136, 336878, 110818, -206197, 330291, -297539, 100206, 64191, -58338, -90916, 376184, -141996, 373145, -62366, -222597, 103133, -85936, -85750, -13009, -846, 34115, -142645, -438048, 51294, 83026, 334516, -139762, 120935, 100112]
15310A00112l9132K01818G6440P9938a95660G1485J22982f2416B9761J02673L4828
15299A67262F5365J81638g7457k00604J26644B23289O7970a17438e3196g908A57980
15287a56701M8744N1722A74137a8151l17791B12647H1314c2246I2385l225i7176
15275F7036a86124L640C54190a76301a7725G6409J96105a00082j1826d5324C8407
15263B4882L058a00146j1713A00436i3119J4143j0165c0795m5637C46918a97596
15251A12846J12736L06194N93523J08236M9262j04508p1888E33714k26114r1271
15241B16329M7727b0806D79755k10379p2096J27066A900P5466J10100R4440n7399
15230B24507J63349A36231a09243G5206g85F05935E7165k5577K9420P5894b36753
$$ y = [100112, 60980, 262798, 76440, 156378, -195660, 71485, 194467, -62416, 29761, 132434, 167262, 65365, 247003, -77457, -278061, -151417, 223289, 291259, -117438, -53196, -7908, 157980, -156701, -107957, -56235, 174137, -18151, -335942, 212647, 81314, -32246, 92385, 89160, -97176, 67036, -186124, -182484, 354190, -176301, -17725, 76409, 272514, -100082, -111908, -45324, 38407, 24882, 27940, -100146, -111859, 100436, -93119, -78976, -89141, -30795, -76432, 346918, -197596, 112846, 225582, 531776, 1125299, 1233535, 1282797, 1178289, 1106401, 533714, 307600, 216329, 264056, -20806, 479755, 269376, 197280, 324346, 1900, 77366, 187466, 281906, 224507, 387856, 136231, -109243, 75206, -785, 605935, 57165, 31588, 61008, 136902, -236753]
15218c36088a35043e647l78645a7751F6683a16827A6594J04532K055m6444J07969
15207A84706b02168Q4533A3261K26000r4212b96383B68675j13165i5296D38205
15196A47883A5659b92739A81581H5673a28683A15178a61439A30966a06398A49067
15185i0689K2179B56307a4577D09070a18779A20853g1762j6758k91729C9856b5818
15173D3737K74331a18574A37259a93896G0674r953B0732J38289j6997P8045E1614
15161b01788B17204a67875B37318K2574F0117A1745J22888B4522L46108d2087
15150g1061j38022e1589m0576B77472E7503b40026B61120c6552A86747K461k5313
15139A63895G2177J59395c13338A91712K7875g7711B43447J18316H7429K46767
$$ y = [-336088, -135043, -5647, -384292, -17751, 66683, -116827, 16594, 121126, 123181, 76737, 184706, -202168, -117635, 13261, 239261, 145049, -296383, 268675, 155510, -95296, 438205, 147883, 15659, -292739, 181581, 85673, -128683, 115178, -161439, 130966, -106398, 149067, -90689, -68510, 256307, -14577, 409070, -118779, 120853, -71762, -88520, -380249, 39856, -25818, 43737, 318068, -118574, 137259, -193896, 70674, 60721, 20732, 159021, 142024, 220069, 51614, -201788, 217204, -167875, 237318, 259892, 60117, 11745, 134633, 24522, 370630, -42087, -71061, -209083, -51589, -92165, 277472, 57503, -240026, 261120, -36552, 186747, 189208, 163895, 72177, 231572, -313338, 191712, 219587, -77711, 243447, 361763, 87429, 334196]
15129C34196N5292A127N6915c3288E7137R8559F2812M6583P7930b30824D9425
15117A65292C4469K88298P6210q6475f607j26438n6861j45453I4928a0098G4245
15105D26432j84683C3601O8080K3310n8826N0690a6511C77877g6355B66671f8723
15093C9654J26842R9668m1004F4277J19465a14952A92477M0028K28278c7961q5880
15082a23841B91069k4803D6116A1576b34659G3825K11332D4593J94579p6507P7200
15071B39865c8874j69257g4398A03271i6208C47260a56719e3328A09591J61230
15061B70821C3965K90539j0620k7373H7615J84792M7464P5250d71C17388o1001
15050B56387I9955K56458j57027h8223C1864d4387C52420L0775j25832r7073L3831
$$ y = [334196, 389488, 1127, 58042, -33288, 57137, 155696, 62812, 109395, 187325, -230824, 49425, 165292, 34469, 322767, 398977, 312502, -6607, -133045, -189906, -335359, 94928, -10098, 74245, 426432, 241749, 33601, 101681, 124991, 66165, 116855, -16511, 377877, -76355, 266671, -68723, 39654, 166496, 266164, 225160, 64277, 183742, -114952, 192477, 232505, 460783, -37961, -123841, 291069, 266266, 46116, 11576, -234659, 73825, 285157, 44593, 239172, 162665, 239865, -38874, -208131, -74398, 103271, -96208, 347260, -156719, -53328, 109591, 270821, 33965, 324504, 313884, 286511, 87615, 272407, 319871, 395121, -471, 317388, 256387, 99955, 356413, 199386, -88223, 31864, -44387, 352420, 383195, 257363, 160290, 194121]
15039A94121D2163K67299A34253J47027j36928R7986q5601N0701D5490g7262K8589
15028d8673A90967J23153c2598B92994a39504B02883M574J2870E9447j9345L22918
15017C63020A43922K38324m7165b70946E7861K36915D4615K57208A24700C9848
15006D45502A79855N527J97919j52863j14092M4602d5584C22440b8444A38377
14995B87054A42071m4004P3847E8043L55425A34951n1878J07855I2622J70244
14985B62866J3955M39014a625k57021i6673C208J51425Q4694g3920F5880a97536
14973B71781a3787E15213F0814k6480b1988E15020k36839N0636A06819J1066J4703
14962A32588L49106J2287B2618Q2020N06952f8783B68716H7850L12106a22091
$$ y = [194121, 42163, 309462, 134253, 281280, 144352, 242338, 156737, 207438, 45490, -77262, -48673, 190967, 314120, -32598, 292994, -139504, 202883, 207457, 220327, 59447, 40102, 363020, 143922, 382246, 335081, -270946, 57861, 294776, 44615, 301823, 124700, 39848, 445502, 179855, 185382, 383301, 230438, 116346, 160948, -45584, 322440, -28444, 138377, 287054, 142071, 98067, 171914, 58043, 413468, 134951, 83073, 190928, 92622, 262866, 276821, 715835, -1625, -258646, -96673, 3208, 154633, 239327, -73920, 65880, -197536, 271781, -13787, 515213, 60814, 34334, -21988, 515020, 278181, 328817, 106819, 117885, 132588, 481694, 493981, 22618, 104638, 611590, -68783, 268716, 87850, 399956, -122091]
14951A79966J52973o513o893A46403a8549K306A75650p3854J27123K3321H2233
14939C61981A51108K21731O4892A82798L3977J04315l5469N3893I1521M23682
14929E15203k21454q1711J0372j5588k3874a07758B97944l2021a10723A67288
14918E29961j5406K7919k44171L754J12502l1812A27785R9245j01632m2654K48031
14907C30775k8905R8216j00879j36528K5683L4458A2875J76176J12267A39696
14896B13950J00497j09167m1763L29307j67790A4329L50833R9373J65614r6884
14886E33265A97046E5301J90528J83760A70096j9567J38169K53404B33404r6059
14876A37345J63963P8570J91702l9954P2943j60979k21740a02561D32904j84459
$$ y = [179966, 332939, 326426, 319533, 146403, -18549, -16243, 175650, 101796, 228919, 252240, 82233, 361981, 151108, 372839, 437731, 182798, 216775, 321090, 285621, 339514, 91521, 515203, 293749, 212038, 222410, 206822, 182948, -107758, 297944, 265923, -110723, 167288, 529961, 514555, 542474, 298303, 302057, 414559, 382747, 127785, 227030, 125398, 82744, 330775, 301870, 400086, 299207, 162679, 188362, 222820, 12875, 189051, 301318, 139696, 213950, 314447, 205280, 163517, 492824, 325034, 14329, 365162, 464535, 630149, 533265, 197046, 55301, 245829, 429589, 170096, 150529, 288698, 542102, 233404, 137345, 301308, 379878, 571580, 531626, 604569, 443590, 221850, -102561, 432904, 248445]
14866B48445K04390B11134M1344J06018F5988N48683c4336D16273A98628M55408
14856F54036n0026D2376M95405k10134J82839A84733M22279A17089J30712L82853
14846F30654j91343J39795B07550J47338J3519K20026A86167J32192J4409K84351
14836F17119A95458k6546J56722L1498J02908j67462m7197K78437A86903J77144
14826C64047M656j50881L69617j82466j2058J67341j63748Q8822k28380J05190
14816C62140J53546k7137J28844j26633J65512k93723O3120k2532A67706R444
14806A77150L27246K15722j52211k46926L85374j0708j7094j58742K197j31287
14796C90721M47393C83811j45800K65196M3165j5329j56442Q7842N577N7981R7727
$$ y = [248445, 452835, 211134, 252478, 358496, 65988, 614671, -34336, 416273, 198628, 654036, 604010, 42376, 537781, 327647, 510486, 184733, 607012, 117089, 247801, 630654, 439311, 579106, 207550, 354888, 368407, 588433, 186167, 318359, 332768, 617119, 195458, 168912, 325634, 357132, 460040, 292578, 245381, 523818, 186903, 364047, 368703, 217822, 587439, 404973, 392915, 560256, 396508, 485330, 256950, 362140, 515686, 488549, 617393, 490760, 656272, 362549, 425669, 403137, 167706, 177150, 504396, 720118, 567907, 320981, 706355, 695647, 678553, 519811, 522008, 390721, 838114, 383811, 238011, 503207, 546372, 531043, 374601, 462443, 468020, 526001, 623728]
14785F23728j65677J17129J23764j53610K40739n4418O9138B18679N31899B47298
14774D53100K50650R0890J24604l72761K94228l06277J1919j7852j21549j47714
14764B59238J88166K75036j77401p8363L43316C73714K28145o4007O2180B06823
14753G39417j34695j93358L70814p1149k65126M63354m10018j68260M51502k59224
14743E23257P3163L4866p7512k2386l3220J76551k05807J2155L6108N0479J00428
14732F68082K41953l64416k6474L4717N8270n0911K99632k16857R3407q5230J30299
14721G82472l08877L21600o4876m8186J87749k30144k67473L38499j24517m7740
14711E38507J15534J15924J80153k61561k47271M2934K34428J33069l5359J58872
$$ y = [623728, 458051, 575180, 698944, 545334, 786073, 731655, 800793, 218679, 750578, 247298, 453100, 703750, 794640, 919244, 546483, 840711, 534434, 546353, 528501, 406952, 259238, 447404, 722440, 545039, 466676, 809992, 373714, 601859, 537852, 600032, 206823, 739417, 604722, 411364, 782178, 711029, 445903, 909257, 499239, 330979, 782481, 523257, 596420, 631286, 553774, 531388, 498168, 674719, 468912, 481067, 517175, 567654, 668082, 910035, 545619, 519145, 553862, 612132, 561221, 860853, 643996, 737403, 652173, 782472, 473595, 795195, 730319, 682133, 869882, 639738, 372265, 710764, 586247, 538507, 654041, 769965, 950118, 688557, 441286, 484220, 718648, 851717, 816358, 975230]
14701I75230o5049q4627j47347j5553m8460k0650N2324L9299K80701j31139j4332
14690H20397J19226k55900J17916M10620l52130R4963k3531L0654j72383L08203
14680A098035k24875k65756N18362Q1308k86442j43034K61097r8505k63663L71005
14670A047532j79156J24213k36558M99880l12021m70289L80975K4650j45347L94824
14660A128703j88307Q4413j08639m4579Q0898j35445M91134m5584K0679k05195
14650A078078J1352k96869l5501M02620P5544k38872Q1502k38600L34222j93698
14640I79778P6976k32786L46698j63961R9016k15142L05036j46462L82986n95809
14630H36330L19982L605J65031J84551k27556L34927k62441J39645l01133J40114
$$ y = [975230, 910181, 825554, 678207, 662654, 614194, 593544, 645868, 685167, 965868, 834729, 820397, 939623, 683723, 801639, 1212259, 860129, 955092, 931561, 962215, 789832, 1098035, 873160, 607404, 1125766, 1207074, 920632, 777598, 1038695, 940190, 676527, 1047532, 868376, 992589, 756031, 1255911, 943890, 473601, 854576, 879226, 733879, 1128703, 940396, 1024809, 916170, 871591, 952489, 817044, 1308178, 1262594, 1283273, 1078078, 1089430, 792561, 757060, 1159680, 1235224, 996352, 1077854, 839254, 1173476, 979778, 1056754, 823968, 1170666, 1006705, 1105721, 890579, 1195615, 1049153, 1432139, 836330, 1156312, 1159917, 1324948, 1509499, 1281943, 1616870, 1354429, 1494074, 1192941, 1333055]
14620A333055m3058l25270K37648k58690L99332Q7498J36715k79725n9457r41
14610A227107K81661p0182k52997K63992L4731l24361J71082K79093j11315J0467
14600A509278j64145K15438k10255L32751n0676l58993J34091M52147o8697l12713
14590A478226P3849L08723J12158n81112O66654k39024J8253l91464L29345L52386
14580B127994j91791l54951K46734K49152j71919n3988k02307L44494j87808M42606
14570B248216j669n63659N46059l50317n3290N16715l11897L34584K7255n974
14560B386023j65808L12805Q142J56335J02776L37110j96534N82300K82768O03069
14550D408986N33484J750137L838396Q568323J2461248J0712323j1048778A2703246
$$ y = [1333055, 1289997, 964727, 1202375, 943685, 1343017, 1430515, 1567230, 1287505, 1228048, 1227107, 1508768, 1438586, 1185589, 1449581, 1484312, 1159951, 1331033, 1610126, 1498811, 1509278, 1345133, 1560571, 1350316, 1683067, 1632391, 1273398, 1407489, 1859636, 1790939, 1478226, 1552075, 1860798, 1972956, 1391844, 2058498, 1819474, 1837727, 1446263, 1775608, 2127994, 1936203, 1581252, 1827986, 2077138, 1905219, 1851231, 1648924, 1993418, 1805610, 2248216, 2246547, 1682888, 2228947, 1878630, 1825340, 2342055, 2030158, 2364742, 2391997, 2386023, 2220215, 2533020, 2541162, 2697497, 2800273, 3137383, 2940849, 3523149, 3805917, 4408986, 4942470, 6692607, 10531003, 19099326, 31560574, 42272897, 31224119, 12703246]
14541E755267k354065q23891n37351L55463m49501j28429J30649K88915l34185
14532A902872K73195P365q2707Q4570k9847J33733N1365r5010K9944j82255L41637
14521B434862r6551k99463L91246j98195J31933P4709L1449R0641N5877k23516
14511B392992J05798q4670M34915k81990l3882J93485l492J01549M14855l34469
14501B905091k56897N99597n06635o4485L66588k19442O18398j56146m9338m2391
14491C194340k8558m0189j5401M31430k28075p4286L02569k21981M9927K95095
14481C664871L6442j96733K78436N4164J09856q3671k7705l10550L33750L13825
14471D172685j08853K65703k94648R3132K44563j70010j4701j28433J43901K57860
$$ y = [5755267, 3401202, 2577311, 2039960, 2395423, 1945922, 1817493, 1948142, 2237057, 1902872, 2176067, 2183432, 2100725, 2185295, 2155448, 2289181, 2340546, 2245536, 2275480, 2093225, 2434862, 2338311, 2038848, 2430094, 2231899, 2363832, 2438541, 2469990, 2560631, 2616508, 2392992, 2498790, 2414120, 2849035, 2567045, 2533163, 2726648, 2723156, 2824705, 3239560, 2905091, 2648194, 3247791, 2741156, 2676671, 3043259, 2823817, 3442215, 3286069, 3236731, 3194340, 3165782, 3125593, 3110192, 3541622, 3313547, 3239261, 3541830, 3319849, 3369776, 3664871, 3701313, 3504580, 3783016, 3837180, 3947036, 3863365, 3835660, 3525110, 3858860, 4172685, 4063832, 4329535, 4034887, 4128019, 4372582, 4202572, 4187871, 4059438, 4203339, 4461199]
14461D461199K34248j18131K6735P3119N5619J17438J69452n01219K71435K00816
14451D990711p0291J84413j11371j6724K49714L27907K0248j67732K77527k1386
14441E663016K30070l4061J9472K44473m83316N05845J15087O149J00657L0696
14431F398088L28833m3603q9378J79292m1689J94849K37851r1382N2971l03285
14421F822547N94171K26310J98053j5614J18056j0771N9980K62976k05804Q1562
14411H131466O42614j71311J99590Q7338O2138J77060n7912j05763Q44912m2170
14401I767962J75495J92490K26688O8439j73349L86873K53559L19405j3910R4404
14391A1298056N35000j61083J42868M39680J48356J0118K38892N38068r5920M37132
$$ y = [4461199, 4695447, 4577316, 4604051, 4677170, 4732789, 4850227, 5019679, 4518460, 4789895, 4990711, 4920420, 5104833, 4993462, 4976738, 5226452, 5554359, 5574607, 5406875, 5684402, 5663016, 5893086, 5859025, 5878497, 6122970, 5639654, 6145499, 6260586, 6266735, 6367392, 6398088, 6726921, 6683318, 6593940, 6773232, 6731543, 6926392, 7164243, 7072861, 7125832, 6822547, 7416718, 7643028, 7841081, 7825467, 7943523, 7932752, 7992732, 8255708, 8049904, 8131466, 8774080, 8602769, 8802359, 8889697, 8951835, 9128895, 9070983, 8965220, 9810132, 9767962, 9943457, 10135947, 10362635, 10431074, 10257725, 10644598, 10898157, 11217562, 11203652, 11298056, 11833056, 11671973, 11814841, 12254521, 12402877, 12412995, 12651887, 13189955, 13094035, 13531167]
14381A3531167N85411M7061K33276K48170K15236M79357L74143J00367O74730
14372A6488918k0693M53005M64687k38457M72086L06030M78064O21087L52586
14363A9377313L95756K85216P03924L23333J31941R67546J65598O06235L85701
14354B3342563O33075N9272P69742P08219Q81124O87759N32593O24633O65940
14345B8904920J196272N32848R03176Q07954Q62262P98860J268877O82714J244912
14336C7202795P90539J323861J105415J557527O51176J555086J346043J671379
14328D7203821J518970J417270J687243K108451J343518K121903J984290K250954
14320F1636420J750352K571969K680610K240073K930881K758498L354710K889332
$$ y = [13531167, 14116578, 14163639, 14396915, 14645085, 14860321, 15339678, 15713821, 15814188, 16488918, 16468225, 16921230, 17385917, 17147460, 17619546, 17925576, 18403640, 19024727, 19377313, 19773069, 20058285, 20762209, 21085542, 21217483, 22185029, 22350627, 22956862, 23342563, 23975638, 24034910, 24804652, 25512871, 26393995, 27081754, 27614347, 28238980, 28904920, 30101192, 30634040, 31537216, 32345170, 33207432, 34006292, 35275169, 35957883, 37202795, 37993334, 39317195, 40422610, 41980137, 42631313, 44186399, 45532442, 47203821, 48722791, 50140061, 51827304, 53935755, 55279273, 57401176, 59385466, 61636420, 63386772, 65958741, 68639351, 70879424, 73810305, 76568803, 79923513, 82812845]
14312H2812845L439882L582864M020726L582439M805387L889616M818169N272052
14304A16223980N157889O075605O036457O839784O643003P332506P809219Q590509
14296A70708952Q635994R335101J0213080J0740571J1332185J1639769J2952046
14289B45557698J3087214J3952066J4814460J5374405J5452180J6235358J6491690
14282C50965071J6902811J6853622J6314167J5861863J5326215J3728109J2579980
14275D58531838J0416988Q103928N485914m66753m407123m199043j564775q45524
14267D71055450m695167q371396j1313724j2759142j3858244j5752681j6367604
14260C87937492j6714795j6716097j7152860j6361895j5846180j4619063j4904174
$$ y = [82812845, 86252727, 89835591, 93856317, 97438756, 102244143, 106133759, 110951928, 116223980, 121381869, 127457474, 133493931, 140333715, 146976718, 154309224, 162118443, 170708952, 179344946, 188680047, 198893127, 209633698, 220965883, 232605652, 245557698, 258644912, 272596978, 287411438, 302785843, 318238023, 334473381, 350965071, 367867882, 384721504, 401035671, 416897534, 432223749, 445951858, 458531838, 468948826, 477052754, 482538668, 482071915, 477664792, 473465749, 471900974, 471055450, 466360283, 457988887, 446675163, 433916021, 420057777, 404305096, 387937492, 371222697, 354506600, 337353740, 320991845, 305145665, 290526602, 275622428]
14253B75622428j4170099j3222402j3075161j2187580j1531808j0547943j0401073
14246A90486362r552485q830327q259120p322684q068711o924742o900392n856412
14238A28771489n768240n492092n131584n027526m478586m058336m341164l270895
14230I1203066l541083l829620l469028k999774l020013k744278k471307k968429
14222F6159534k142699k137842j797782k022061k135107k170396j267370j819430
14214E0666847j569911r95751j591970j694932j581047j178723j167792o81961
14206D0204760n56169j515669j476119p49449r19785q46390p88403q65156r80948
14197C1506672j054475p56833p54183j93838o89302j163450q37040k88651o37462
$$ y = [275622428, 261452329, 248229927, 235154766, 222967186, 211435378, 200887435, 190486362, 180933877, 172103550, 163844430, 156521746, 148453035, 141528293, 134627901, 128771489, 123003249, 117511157, 112379573, 107352047, 102873461, 98815125, 94473961, 91203066, 87661983, 83832363, 80363335, 77363561, 74343548, 71599270, 69127963, 66159534, 64016835, 61878993, 60081211, 58059150, 55924043, 53753647, 52486277, 50666847, 49096936, 48101185, 46509215, 44814283, 43233236, 42054513, 40886721, 40204760, 39648591, 38132922, 36656803, 35907354, 34987569, 34141179, 33352776, 32487620, 31506672, 30452197, 29695364, 28941181, 28747343, 28058041, 26894591, 26057551, 25768900, 25131438]
14188B5131438q33235l66910r17865l75407m23501m18272n09319m23769m59433
14179B0403727k14216o71346q12442J22592l84689l54664n66568k41807n38356
14170A6742231m66393o8425m37493o4439j61730n72265p1342l27733j58302m48367
14160A3965742j78298J41773n27582m77941k56327J77858l41255J79576n31581
14151A2151965l72899j03571j49154j26015p4742k66534m13999j87466k27589
14142A0229996J25552n23769Q5631j54916k58718j6815k82494J69831o96668K38451
14132H916081n0788j02986n13462K16428j88579L97656o33917K13687o62678M15434
14122H006876j45221L223m83051k14506L03381m36110M81823m81473O4681k93733
$$ y = [25131438, 24298203, 23931293, 23013428, 22638021, 22214520, 21796248, 21286929, 20863160, 20403727, 20189511, 19518165, 18705723, 18828315, 18443626, 18088962, 17522394, 17280587, 16742231, 16275838, 16207413, 15769920, 15705481, 15543751, 14971486, 14900144, 14572411, 14414109, 13965742, 13787444, 13929217, 13401635, 12923694, 12667367, 12845225, 12503970, 12683546, 12151965, 11779066, 11675495, 11526341, 11400326, 11325584, 11059050, 10645051, 10457585, 10229996, 10355548, 9831779, 9917410, 9762494, 9503776, 9486961, 9204467, 9374298, 8677630, 8916081, 8865293, 8762307, 8248845, 8465273, 8276694, 8674350, 8040433, 8254120, 7591442, 8006876, 7861655, 7864878, 7381827, 7167321, 7470702, 7034592, 7516415, 7034942, 7099623, 6805890]
14112F805890l72315K25197j18542r8655J7410k93292L2891q2572j33197k68686
14102E714129K33282J96339j42637l74480J03718k20351L7406R6797l47925L6821
14092E333099O6498j354l36200n585K42381r5142l70316K50237l85856q1923O4172
14081D680011J32717J54291l50293k03320L33107m34325j52592K08369L04104
14072D672069k86704o9488n4339N201k3243m11452K04990n2935J65805j93968
14062C955936L3305k00636J48235j78779K6481L97866m62647N7654L7782j51982
14052C663215k74969k1646m0323J86487l7862R4362l83995K25048k47444M1210
14042C204083j33256J49211L6971N4171m85578K43168j84605K48056K5494j73091
$$ y = [6805890, 6433575, 6658772, 6540230, 6441575, 6458985, 6165693, 6198584, 6116012, 5982815, 5714129, 5947411, 6143750, 6001113, 5626633, 5730351, 5510000, 5547406, 5644203, 5296278, 5333099, 5399597, 5398243, 5062043, 5056458, 5298839, 5203697, 4833381, 5083618, 4697762, 4615839, 4680011, 4812728, 4967019, 4616726, 4413406, 4746513, 4312188, 4159596, 4367965, 4672069, 4385365, 4315877, 4261538, 4266739, 4243496, 3832044, 4037034, 3984099, 4149904, 3955936, 3989241, 3788605, 3936840, 3758061, 3784542, 4182408, 3719761, 3777415, 3815197, 3663215, 3388246, 3366600, 3326277, 3512764, 3474902, 3569264, 3185269, 3410317, 3162873, 3204083, 3070827, 3220038, 3257009, 3311180, 2825602, 3068770, 2884165, 3132221, 3157715, 2984624]
14032B984624K17364m5154m3271j68730K6200J8977j35027k13085J96146L76232
14022C214276q21431J99337N4623n944N6755q9349j0491O24k34815J45738j28456
14011B380867K41980l17932J67596k72315J11786k70155J63324J02094J17683
14002B424928k30993P6094j45036J65172l13233k17475O3960J24518L54598j67073
13992B135460K6996r4186K94346J025624K993386O642305J2330851J3334600m815058
13983C3874324j6873820p426417k933220j367677j163588p38507j70131Q3002
13975C283966j56961l52675O0620m86450K32435L48110m62469O0669L6192j64194
13965B399243l31746q3300J23849k85100M88537j66044P6479l68080o8554L75835
$$ y = [2984624, 3201988, 3156834, 3113563, 2944833, 2971033, 2990010, 2854983, 2641898, 2838044, 3214276, 2392845, 2592182, 2646805, 2640861, 2697616, 2608267, 2597776, 2598400, 2363585, 2509323, 2380867, 2622847, 2304915, 2472511, 2200196, 2311982, 2041827, 2205151, 2307245, 2424928, 2193935, 2270029, 2124993, 2290165, 1976932, 1759457, 1823417, 1947935, 2302533, 2135460, 2162456, 2068270, 2362616, 3388240, 6381626, 13023931, 25354782, 38689382, 33874324, 17000504, 9574087, 6640867, 5273190, 4109602, 3371095, 3200964, 3283966, 3127005, 2774330, 2834950, 2348500, 2580935, 2929045, 2466576, 2527245, 2563437, 2399243, 2067497, 1984197, 2108046, 1822946, 2311483, 2145439, 2221918, 1853838, 1785284, 2161119]
13955B161119k85477J42285K4840N5494j45860j12631J47958N6919j86141n4613
13945A803893P1956j07392o4403J88815j11247J8916R0717L5513k05800q2923
13935A638045K78657o04248L17119q5835K79723m47735L73105l82495k44489M95782
13925A617629O0326J02078k06917l27414J54247M5023J47026k07926Q8573Q1284
13915A553929j31272J34531J1745k1881k31505o5965L02468k78927m0839N15405
13905A747689l83433L3220j10129q8935L21430j80288J74579j82776K14930k83506
13895A262781Q1448J11211m6723q7682k58435R6112Q9749j9664J3873J11176q1239
13884A272607j15955k8963L07844j71020j73870K47797l07433K34752k37807L07566
$$ y = [2161119, 1875642, 2017927, 2042767, 2098261, 1952401, 1839770, 1987728, 2044647, 1858506, 1803893, 1875849, 1768457, 1704054, 1892869, 1781622, 1800538, 1891255, 1926768, 1720968, 1638045, 1916702, 1312454, 1629573, 1543738, 1823461, 1375726, 1748831, 1366336, 1121847, 1617629, 1677955, 1780033, 1573116, 1245702, 1399949, 1444972, 1591998, 1384072, 1472645, 1553929, 1422657, 1557188, 1568933, 1547052, 1315547, 1249582, 1552050, 1273123, 1232284, 1747689, 1364256, 1397476, 1287347, 1198412, 1519842, 1339554, 1514133, 1331357, 1546287, 1262781, 1344229, 1455440, 1408717, 1321035, 1062600, 1158712, 1248461, 1228797, 1242670, 1353846, 1272607, 1156652, 1127689, 1435533, 1264513, 1090643, 1338440, 1031007, 1265759, 1027952, 1335518]
13874A335518k72811O5929J10957K44724n27151J98935L2344J62041l65140K99277
13864A284623l92938P8522J57355J69398j81102n0024j48230J40784J87687j75745
13854A070330k89926M43295k56655J42461Q3929j46290j20212j55687J73382K36738
13844A181365k39948p2196K72550q0770j18169J9993K87919j49871K41393m54159
13834H88107l1161J09778k47864r7107L65664j0806J55643k88241K85305n09800
13824F19518J33864q236j49493K8130P2953K26124j29459L33881k24138j32112
13814G71032M89086m96171o7669N2022Q8680j63753m8272J58156P3907M1571k67989
13803F30600J26433M3580K59700m32636r811J60563J57032j98615r987P1380l8572
$$ y = [1335518, 1062707, 1128636, 1239593, 1484317, 957166, 1156101, 1188445, 1350486, 985346, 1284623, 891685, 970207, 1127562, 1296960, 1115858, 1065834, 917604, 1058388, 1246075, 1070330, 780404, 1223699, 967044, 1109505, 1193434, 1047144, 926932, 771245, 944627, 1181365, 941417, 869221, 1141771, 1061001, 942832, 962825, 1250744, 1100873, 1342266, 888107, 856946, 966724, 718860, 621753, 987417, 976611, 1132254, 844013, 1129318, 619518, 753382, 745146, 595653, 623783, 696736, 922860, 793401, 1127282, 903144, 771032, 1260118, 763947, 696278, 748300, 836980, 673227, 624955, 783111, 857018, 898589, 630600, 757033, 800613, 1060313, 627677, 617866, 778429, 935461, 736846, 726859, 798239, 759667]
13792G59667j3103j3540K0830J4299k4331J48345k11536L25114l47278p2079N04808
13781A091196l91778M11851k11649N1419D45199K24608R5114j15253J91227C39623
13770I41841l78220L42365j17506R094j08455A82100M02548k42169L40413j07762
13760E75130K31727M7651B89408L10615J75417l50006L5583j44103J09835m6827
13750C79922L92214k59636L07482j99039n7841k44638K94897r41k30779J97981
13740E79622J44595k65948L07273k62142k06880J5284L37287R0162j2169l36270
13730C90814P4813K52709C08880K56269J24133J51521J851C35318P7208p8486
13720C34040L15416p4038J49474j45379k41508A11261K60392K86621Q4824k04846
$$ y = [759667, 746564, 733024, 753854, 768153, 743822, 892167, 680631, 1005745, 658467, 586388, 1091196, 699418, 1111269, 899620, 951039, 445199, 669807, 764921, 649668, 840895, 339623, 941841, 563621, 905986, 788480, 797574, 689119, 182100, 584648, 342479, 682892, 575130, 806857, 854508, 289408, 600023, 775440, 425434, 461017, 316914, 426749, 379922, 772136, 512500, 819982, 620943, 563102, 318464, 613361, 612420, 381641, 579622, 724217, 458269, 765542, 503400, 296520, 311804, 649091, 739253, 727084, 390814, 465627, 718336, 308880, 565149, 689282, 840803, 842654, 335318, 412526, 334040, 649456, 575418, 724892, 579513, 338005, 111261, 371653, 658274, 743098, 538252]
13710E38252o5896j23935h2092E40444L71622k19238k20814r3340L39999j5562
13700G03111n7835k23190L5459j60186J04128J21005l059J30455A90339L23498
13690E13837J97879j24740m3744p6227K43157j22213j4631j94735J43813J40454
13680F62850k90983J44452J52212L496j76624M9560k7754k19651Q0555K8439J53785
13669E60337j28005m0480J21320O4091J91309k09613B38274L41951j98400K10468
13659E92293k69263A45098J89074J53201L48340C49744J48847A88083J40668N9755
13649C88506j17863K72306r7332l3067m3884J18555J87119l26717J8380j08472
13639B57531Q3795J38748M8721j56948K7613K73899l17623r2356K40976m4566
$$ y = [538252, 472356, 348421, -82092, 540444, 912066, 692828, 472014, 378674, 718673, 703111, 645276, 422086, 457545, 297359, 401487, 522492, 519433, 649888, 190339, 513837, 711716, 586976, 543232, 467005, 710162, 587949, 573318, 378583, 522396, 662850, 371867, 516319, 668531, 672027, 495403, 544963, 517209, 297558, 378113, 406552, 560337, 432332, 391852, 513172, 577263, 768572, 558959, 238274, 580225, 381825, 592293, 323030, 145098, 334172, 487373, 835713, 349744, 498591, 188083, 328751, 388506, 270643, 542949, 445617, 412550, 368666, 487221, 674340, 347623, 366003, 257531, 341326, 480074, 528795, 371847, 399460, 673359, 355736, 263380, 504356, 459790]
13629D59790m6185O9505j65505K94469N4745o8627Q3428o7821j22728K5242Q0073
13618E96386r1094J097n3477N7903j71145H9652M07248J84226j86186j85059L72204
13607F82085j52647j58910A50211L41760j28018A53843l2272M4391K11146n1291
13597C25817l4856K57908M230J21683k91834q4817K40051J90576j75018A81564
13586H3740J64445j8587j03540K33100A78040P5032o3542L746K50675n3816j53704
13575B36431r2041J09797P1171L1726L28486k86045j46585m7496J84729E3242
13564D19343G572L78860R3822p0971p189j10170l1331J03780m7122K2874l3318
13553C06807K02843B25177p9883k4016K74484j86195R370P4101A41422J67231
$$ y = [459790, 413605, 483110, 317605, 612074, 666819, 598192, 681620, 613799, 491071, 516313, 596386, 505292, 506389, 452912, 510815, 339670, 89652, 496900, 681126, 494940, 309881, 682085, 529438, 370528, 150211, 491971, 363953, 153843, 121571, 165962, 377108, 325817, 290961, 548869, 553099, 674782, 382948, 298131, 538182, 728758, 553740, 181564, 83740, 248185, 229598, 126058, 359158, 178040, 253072, 189530, 193276, 443951, 390135, 236431, 144390, 254187, 325358, 357084, 685570, 399525, 252940, 205444, 390173, 53242, 419343, 7572, 386432, 480254, 409283, 402094, 291924, 260593, 364373, 317251, 340125, 306807, 509650, 225177, 145294, 121278, 395762, 209567, 218937, 293038, 141422, 308653]
13543C08653p1251e567C41853J23166j85343L71031A93156J99084A94337J60891
13533C55228j71990K98905j63935j55351J87085m7250n5526A0808N28967J2625
13523E52400k14706R659j53665J04765L4943A63008J04373M6497r1338J82776
13513D05316J0198A21185M1071K52735F6918K77893L22951g6260C40012A02818
13502C55837j47569L1724a77779O0029E85742m3689B17778k5320L1063r5548j6466
13491A11507l1175N8897J59410P7419f4757C71086j71400K53964A76271M43048
13481F19319k87128M1692C1517J45337Q6083O1278j33918L27058m1792l0859B02159
13469B03430J95686P1302h5899j18660D45014j1797A79218k0520L60572A68235
$$ y = [308653, 237402, -5567, 341853, 465019, 279676, 650707, 193156, 392240, 194337, 355228, 183238, 482143, 318208, 162857, 349942, 302692, 247166, 10808, 539775, 552400, 337694, 347353, 193688, 298453, 333396, 163008, 267381, 313878, 222540, 405316, 415514, 121185, 162256, 414991, 66918, 344811, 667762, -76260, 340012, 102818, 355837, 208268, 239992, -177779, -117750, 585742, 542053, 217778, 192458, 223521, 127973, 111507, 80332, 139229, 298639, 376058, -64757, 371086, 199686, 453650, 176271, 619319, 332191, 373883, 31517, 176854, 262937, 324215, 190297, 517355, 475563, 444704, 202159, 203430, 399116, 470418, -85899, -204559, 445014, 433217, 179218, 158698, 519270, 168235]
13458B16178O0806B7697Q0035J98438e7106C34375J55968A20416J73370d2114
13447D00275O9890A26452O1823f8586C87295m1379h9992H4104k0444K68987j28329
13436B04318N8492J5867j15321n3324J65576J44990j97976r3696L35992q3644
13426C81274m0569n6550A18335K93698j45815l7841C4662J87740E3101A98K00769
13415B00967n300K15991j87525j3551n8619n5631L3673K88721q1033F9405J94658
13404B64063G974J54456L6355K37751A37836K20786A15997d3589D24218A56203
13393A82254J74452A52649J94014H7747K55414d3209A55503n8764L28094f9351
13382B33731n1661K39396A87205L50051j4786d1334D455L48605p3675A34096B1189
$$ y = [216178, 276984, 27697, 107732, 306170, -57106, 334375, 490343, 120416, 293786, -42114, 400275, 470165, 126452, 188275, -68586, 387295, 345916, -89992, 84104, 63660, 332647, 204318, 262810, 278677, 163356, 110032, 275608, 420598, 222622, 128926, 464918, 381274, 340705, 284155, 118335, 412033, 266218, 228377, 34662, 222402, 53101, 198, 200967, 195667, 411658, 224133, 210582, 151963, 96332, 130005, 418726, 337693, 69405, 264063, 7974, 162430, 198785, 436536, 137836, 358622, 115997, -43589, 424218, 156203, 182254, 356706, 152649, 346663, 87747, 343161, -43209, 155503, 96739, 424833, -69351, 233731, 182070, 421466, 187205, 537256, 522470, -41334, 4455, 353060, 279385, 134096, 21189]
13370B65073K13728j36697J4417A73963M5019k707J03366j26109J20408a0889
13359B01939R5361P860q3794F6021K02598L905E0O60907C1868J96774L0813B4795
13346B33766a88808A73181b13618D64327j97020M4456A7617K1497M17233j22255
13336C34092M9580F9199Q9498K89179j78199A34201Q8814K39279r9162K9154a05271
13324A54219N29106A28345J01890J6115Q668N8499c64288C52915N373H6221J36688
13313B22909l2752j1263J61170D4595K5923J30005M44387b3087C70763j50471
13303B20292o5689Q3227L2643A22393J86202j00247r4613L59777j56610J3210
13293C30112k2741J03229j12547I9331Q5975p9281M3398J19630A17001d1661H2006
$$ y = [265073, 478801, 342104, 356521, 173963, 218982, 216275, 319641, 193532, 313940, -10889, 201939, 297300, 305160, 221366, 66021, 268619, 272524, 50, 660957, 31868, 228642, 259455, 24795, 233766, -188808, 173181, -213618, 464327, 267307, 311763, 17617, 39114, 456347, 334092, 383672, 69199, 158697, 447876, 269677, 134201, 223015, 462294, 363132, 392286, -105271, 154219, 683325, 128345, 230235, 246350, 255018, 313517, -364288, 352915, 358288, 86221, 222909, 190157, 178894, 340064, 44595, 70518, 200523, 644910, -23087, 370763, 220292, 154603, 237830, 270473, 122393, 308595, 208348, 113735, 473512, 316902, 330112, 307371, 410600, 298053, 99331, 185306, 106025, 149423, 269053, 117001, -41661, 82006]
13281C16405j22754K08346A90203O8344J03865F1656L80618a84830A75358E6148
13270B59946D2323c3233A84102e0306B29454g3576B01244I7157R7721m2487j3356
13259A39035b44466I5470J22761K13999D4998c3190A96426l652D5211e2867A4199
13247C24487a4713D2267M73373a25806D53768a32247E72132A2777J14902O3713
13237A91392J45512D9774K26788j30188B3120K71404A9527L47709J51503A70112
13226a03511L3205E4352J3350a86488A78101d77D50250D1267J63203p0659J04535
13215B38346p3199h7185A8714J30410k9663L63813G25a34607B6255c6170A62215
13203B34697b18797A54558P9225a68060A91766J84386f4762A23697L40228B31194
$$ y = [316405, 193651, 401997, 190203, 258547, 362412, 61656, 442274, -184830, 175358, 56148, 259946, 42323, -33233, 184102, -50306, 229454, -73576, 201244, 97157, 194878, 152391, 139035, -244466, 95470, 218231, 432230, 44998, -33190, 196426, 192774, 45211, -52867, 14199, 324487, -14713, 42267, 515640, -125806, 453768, -132247, 572132, 12777, 127679, 191392, 336904, 49774, 276562, 146374, 23120, 294524, 19527, 367236, 518739, 170112, -103511, -70306, 54352, 67702, -186488, 178101, -477, 450250, 41267, 204470, 133811, 238346, 165147, -87185, 18714, 149124, 119461, 483274, 725, -134607, 26255, -36170, 162215, 234697, -218797, 154558, 233783, -168060, 191766, 376152, -64762, 123697, 463925, 231194]
13192b7908B16602L3826p5316H4500R620b4650A72444f1638G3429N9720c4953
13180D8225f0215J2442B6123J11351J4835a22348A12584J25778J82180C1952e8308
13168A55640Q8730j14105J08357o6126J887K61277j39027A38343f4260o7578D3115
13156B96288d1362A34122a4721D5891J07857b1524E5858A1533a04946F4751J84044
13145B48795g175F4450a21956B87782b48941P1646C89401A71516b30813B37077
13134b2680F1047B8109J96745a05053A65829i8180c7214A5502b9064e001A0367
13122a04003A60112L0785G0124j0459A401K00694h4275a0454p8510b4785B5552
13110e020D84136A07557J33186E5816b87577A0273J999Q3004k2399B6132D152
$$ y = [-27908, 216602, 250428, 175112, 84500, 94120, -24650, 172444, -61638, 73429, 133149, -34953, 48225, -60215, -47773, 26123, 137474, 152309, -122348, 112584, 238362, 420542, 31952, -58308, 155640, 244370, 130265, 238622, 172496, 174383, 435660, 296633, 138343, -64260, -131838, 43115, 296288, -41362, 134122, -14721, 45891, 153748, -21524, 55858, 11533, -104946, 64751, 248795, -7175, 64450, -121956, 287782, -248941, -177295, 389401, 171516, -230813, 237077, -22680, 61047, 28109, 224854, -105053, 165829, -98180, -37214, 15502, -29064, -5001, 10367, -104003, 160112, 190897, 70124, 59665, 1401, 202095, -84275, -10454, -88964, -24785, 25552, -5020, 484136, 107557, 240743, 55816, -287577, 10273, 12272, 95276, 72877, 26132, 4152]
13098e8773B4252J16832N8207r6390K9457c71527E81909B843L12375E7308d7543
13086A34880K10499o7650L5271j32405j9331e2035G8679a1445l43255a12043n7329
13075a69372B41267H8762J39564a06466B23113C3282e4522F2121N4652J46682
13065B63455m7695J16412A52595K40510H4348J72220k602b76188J26405E199h168
13053a45143C06064H808Q8788L08033c4371A14643b32500d0557g378B17306K20359
13042D37665j61132f2876j65288B34672i8529B64047q5000N8446B2759a26041
13031I6998a54447k9680f6773D84865G472h2259D52579a06323C12252j21556Q061
13020A98757j9395K19604a02855k76835B87715k8059J70987j5886a0963B8282
$$ y = [-58773, 24252, 141084, 199291, 102901, 132358, -371527, 581909, 2843, 315218, 57308, -47543, 134880, 345379, 277729, 313000, 180595, 161264, -52035, 78679, -11445, -354700, -112043, -169372, 241267, 88762, 228326, -106466, 223113, 33282, -54522, 62121, 116773, 263455, 215760, 332172, 152595, 393105, 84348, 256568, 253966, -276188, -149783, 5199, -8168, -145143, 306064, 8808, 97596, 405629, -34371, 114643, -232500, -40557, -7378, 217306, 437665, 276533, -62876, -228164, 234672, -98529, 264047, 179047, 237493, 22759, -126041, 96998, -154447, -184127, -66773, 484865, 7472, -82259, 452579, -106323, 312252, 190696, 198757, 179362, 398966, -102855, -379690, 287715, 259656, 430643, 414757, -10963, 28282]
13009f6307D19630e1480B33557F8139a73018N9408H9678c6177A64066M2439C6671
12997c7490A9352b24168C07426g9363G1865J80612e8363k85942B64625a09090
12986A4932K38603A7853J05020J45727b05522R635f6594H4115i1636j35747A60285
12974c06515d2930b665A01724b7809k24220B47915a00470j10864A86899L3168
12964B20067a76963B44176J39170A32505a58998a762E6478K13489e3981j20330
12954a74311B94932m1460M7541a11097A17589b23840k05121a1343A5949L50277
12944C66226A34683h0563E05855c5760o7544A16425b17280c1168A92045p8057
12934A13988L9165i1569A8638i5863J7104A53036l1257a10636k0694B85213A13281
$$ y = [-66307, 419630, -51480, 233557, 68139, -173018, -113610, 89678, -36177, 164066, 206505, 36671, -37490, 19352, -224168, 307426, -79363, 71865, 252477, -58363, -344305, 264625, -109090, 14932, 253535, 17853, 122873, 268600, -205522, -195887, -66594, 84115, -91636, -227383, 160285, -306515, -42930, -2665, 101724, -27809, -252029, 247915, -100470, -211334, 186899, 220067, -176963, 244176, 383346, 132505, -158998, -1762, 56478, 269967, -53981, -174311, 294932, 253472, 301013, -111097, 117589, -223840, -428961, -11343, 15949, 366226, 134683, -80563, 505855, -35760, -103304, 116425, -217280, -31168, 192045, 113988, 153153, -91569, 18638, -95863, -78759, 153036, 121779, -110636, -131330, 285213, 113281]
12922B6255M81115f8673R583B85451A15191a29936F8486R9318b29053B17024R5893
12911C12917a0356k056B21223a85025k34f6835D2176b9063o0219C34778j13052
12900B21726F2272J55532b0976F1899K30696i0314B57882a75389B29044J22973
12890C52017A17525l6957M23525A11733B3219J38646a56262C25640J6064B2397
12879a39575O0324a6470C73133n5710j20213o5386j4520b84209a18732G7841f383
12867a53532G0399b26043A34584a96868G6827J44366J02353A21625a05886B4933
12856B26932b4323F6819A9753i0703B0269f1850j6757A26857a83443b0417A12044
12844a1185q7718j15663d5855o4375A56009A7139K91167b36014J07515A39315
$$ y = [26255, 507370, -68673, -59090, 285451, 115191, -129936, 68486, 167804, -229053, 217024, 312917, -10356, -12412, 221223, -185025, -185259, -66835, 42176, -29063, -89282, 334778, 221726, 62272, 217804, -20976, 61899, 292595, -90314, 257882, -175389, 229044, 352017, 117525, 80568, 504093, 111733, 23219, 161865, -156262, 325640, 341704, 22397, -139575, -79251, -16470, 373133, 317423, 197210, 131824, 117304, -284209, -118732, 77841, -6383, -153532, 70399, -226043, 134584, -196868, 76827, 221193, 323546, 121625, -105886, 24933, 226932, -24323, 66819, 19753, -90703, 20269, -61850, -78607, 126857, -183443, -20417, 112044, -11185, -98903, -214566, -45855, -110230, 156009, 17139, 308306, -236014, -128499, 139315]
12833d3520C49063A10430K9916g4217n0729b1287l45471e4799A43270a12613H8200
12821C1926a84000C81285I5171i6206l63702B04818a08267B48264a83678c9664
12810A12033D4099f3994a002n9436B82733a55324A94559a53771q2193B42448c1982
12798A58133k3199a67982B39609C807Q5100a66856A74511b15809a03516B09400
12787g9780i528m5705G4071L44390c68277f474k29339A99349b68347J33136A60939
12775c40j39851G3665i1145D7506M2791a05321A83823q8019c7775q7008J0282
12764a14501g274B75969A8207J48986n7994P1833c5511f942B29672a23019r2311
12753b15330k44684A69K4040a00747j12962Q6857m6102A65706f5171m4272F5910
$$ y = [-43520, 349063, 110430, 140346, -74217, -124946, -21287, -366758, -54799, 143270, -112613, 88200, 31926, -184000, 381285, 95171, -96206, -459908, 204818, -108267, 248264, -183678, -39664, 112033, 44099, -63994, -1002, -60438, 282733, -155324, 194559, -153771, -235964, 242448, -31982, 158133, 134934, -167982, 239609, 3807, 88907, -166856, 174511, -215809, -103516, 209400, -79780, -9528, -55233, 74071, 418461, -368277, -6474, -235813, 199349, -268347, -135211, 160939, -340, -140191, 73665, -91145, 47506, 90297, -105321, 183823, 95804, -37775, -124783, -114501, -7274, 275969, 18207, 167193, 109199, 181032, -35511, -6942, 229672, -123019, -215330, -460014, 169, 24209, -100747, -213709, -126852, -172954, 165706, -65171, -109443, 65910]
12741G7096o50J5400Q0143a28996A65727L56164j37138j53780A00794K019B6536
12729I2101P2767C0309a93316D5165c3304p8618B9747b52047B26826F4345j5491
12718D8854J63106c80426a42632C18945b1981J185B779a82409O8098K4743D8948
12706a62674A93925g6883A53192k8463J73695L2220C4926h4093J3275B9500K20295
12695B49795l7312c7130A4924f5782A10931D8151b5333j34380f0724o1529B12858
12683a56248A31751B1970j283P9493K62765j26880m0117r5857B8109N970b62888
12671B12053d1304C9242g6013f752E39905a08295j23000B44957j06300D8407J01287
12660A49694a21429I7666K84637I6580J49102m6377n0123J28599j03395a16678
$$ y = [77096, 76446, 91846, 171989, -128996, 165727, 521891, 384753, 230973, 100794, 102813, 26536, 92101, 164868, 30309, -193316, 45165, -33304, -111922, 29747, -252047, 226826, 64345, 48854, 211960, -380426, -142632, 318945, -21981, -20796, 2779, -182409, -114311, -89568, 48948, -162674, 193925, -76883, 153192, 124729, 298424, 330644, 34926, -84093, -70818, 29500, 249795, 212483, -37130, 14924, -65782, 110931, 48151, -25333, -159713, -60724, -122253, 212858, -156248, 131751, 21970, 20687, 100180, 362945, 236065, 195948, 100091, 28109, 34079, -262888, 212053, -41304, 39242, -76013, -6752, 539905, -108295, -231295, 244957, 138657, 48407, 149694, -121429, 97666, 382303, 96580, 245682, 199305, 149182, 277781, 174386, -116678]
12649C54146A05100E2254q736b23875A80420b88698C44509j04569m6792F9840
12638e7381A9698J71817q8253J72951g337r5846C23141j20869R8560G8821J0759
12627H9580K73412A60438K18173b33509E1954e7447A48015J90002H047K97655
12617C05702J5741b92327I3771L9111i9881j83414C22530j35744D4137P1737f7638
12605g5878B5844K744b4671F6667K34634J59413I5959M8827L8826J06268a69097
12593b6577k7019H1573K19931a97909P5117A84843D7240b58313O1203c6100A5901
12581d7418B30715D6764b6400B54107b28179H6972O2476a81411m2523a6487j08829
12570a25316l1378o3053c5432j80192P8139L1357B29887F2650j5881M4309a09145
$$ y = [354146, 105100, 52254, 43518, -223875, 180420, -288698, 344509, 239940, 193148, 69840, -57381, 19698, 191515, 103262, 276213, -7337, -103183, 323141, 202272, 300832, 78821, 89580, 362992, 160438, 378611, -233509, 51954, -57447, 148015, 338017, 8047, 305702, 321443, -292327, 93771, 132882, -99881, -283295, 322530, 186786, 44137, 115874, -67638, -75878, 25844, 28588, -24671, 66667, 301301, 460714, 95959, 144786, 183612, 289880, -169097, -26577, -53596, 81573, 301504, -197909, -122792, 184843, 47240, -258313, -197110, -36100, 15901, -47418, 230715, 46764, -26400, 254107, -228179, 86972, 149448, -181411, -223934, -16487, -125316, -156694, -219747, -35432, -215624, -137485, -106128, 229887, 62650, 46769, 91078, -109145]
12558e7358l378A6079K14276k30P136e4181A43180E7819i7125C37584j33398D196
12545C12078B8687B552a30954A83694B0451J24759d2141l66099i0628A53709D4920
12533c19723B37034I499i7190A73551C0944R3579K14793a98655A40450N835m9058
12522I7227a12081B59761H3023J57125A4668b38528P1253b7800k6667D9481L1367
12511H0848a29763g720I2073i3264j23087A9093J56168A2658L49681j02426f1924
12499e0031j31617B20602O5248a43640a1987G4450a70008C9095K64327a79348
12488B33807b24161a8085C5047b52599A7719K25897h0150k90305A00731J2342
12478A13073e892l92536G5759i9231A23560R5130h725r3333q7929o3522D7175
$$ y = [-57358, -60736, 16079, 230355, 230125, 237261, -54181, 143180, 57819, -97125, 337584, 204186, 4196, 312078, 28687, 2552, -130954, 183694, 20451, 145210, -42141, -408240, -90628, 153709, 44920, -319723, 237034, 9499, -97190, 173551, 30944, 124523, 339316, -198655, 140450, 146285, 97227, -112081, 259761, 83023, 240148, 14668, -238528, -167275, -27800, -54467, 49481, 80848, -129763, -7720, 92073, -93264, -216351, 19093, 175261, 12658, 362339, 259913, -61924, -50031, -181648, 220602, 285850, -143640, -11987, 74450, -170008, 39095, 303422, -179348, 233807, -224161, -18085, 35047, -252599, 17719, 243616, -80150, -370455, 100731, 113073, -5892, -398428, 75759, -99231, 123560, 218690, -8725, -102058, -189987, -253509, 47175]
12466G7158H738b22824A71043N6775l3518B0801J86894i8163H8460A3455K4130
12455C7585g7226A38159a66262n1263E583c3598j9363J635j50830E2039J84433
12444B36472L9671b4998k7316C06723A09554i9036k5036e8022B22731a03396r4735
12433a98131A03862K5256c20969g9243b1967j48876a2121B87224I0284h7573E1654
12421B4463a35278d665E4342K77319a67962P988E992d3561q6856A38816a51834
12409i8851A48748a12353l28157J94887D67437j38146d9929B59041a66422P9115
12399h7307r3335b4620B12951a85866A4595e117o2654b452C7978J38456i8544
12387B08823I0247J392h5797o1668k80866e9623H0389a47871J5098c8044m56192
$$ y = [77158, 8738, -222824, 171043, 227818, 194300, 20801, 207695, -98163, 88460, 13455, 37585, -77226, 138159, -166262, -217525, 5583, -33598, -52961, -51326, -202156, 52039, 236472, 276143, -24998, -52314, 306723, 109554, -99036, -124072, -58022, 222731, -103396, -198131, 103862, 129118, -320969, -79243, -21967, -170843, -12121, 287224, 90284, -87573, 51654, 24463, -135278, -4665, 54342, 331661, -167962, -159974, 5992, -43561, -130417, 138816, -151834, -98851, 148748, -112353, -440510, -245623, 467437, 329291, -49929, 259041, -166422, -87307, -180642, -24620, 212951, -185866, 14595, -5117, -67771, -2452, 37978, 176434, -98544, 208823, 90247, 91639, -85797, -147465, -428331, -59623, 80389, -147871, -132773, -38044, -494236]
12376d94236f498E2488b03757g906j43769m2741B31022a417B55076c1737a186
12364c0828k28960F677Q4588a15144l2350j29663b202k85475A16314b41497m4472
12353b85969f7527j32907a8715A13412a44289B40335a09768i873B07823a94900
12342C00111f3673k37129J32531A94982J22311c92189C45271g2365K6070A20293
12331a19418A06520A584i2643n5528F1093f425A78447i6771m8326k6934g9356
12319B83724M2229j43086a93463D5539b9532I7024d678A02170C47M28275F3990
12307a44781L6668M3939I2827L1619e4807B8594P0813D7327d099k52760c8254
12295A23693a4843F9541J82516o9440m3758a53301c2940r063m8081j66741B9974
$$ y = [-494236, -6498, 52488, -203757, -7906, -151675, -194416, 231022, -1417, 255076, -31737, -1186, -30828, -259788, 6677, 91265, -115144, -147494, -277157, -2202, -287677, 116314, -241497, -285969, -67527, -200434, -18715, 113412, -144289, 240335, -109768, -9873, 207823, -194900, 300111, -63673, -300802, -168271, 194982, 317293, -392189, 345271, -72365, -46295, 120293, -119418, 106520, 1584, -92643, -148171, 61093, -6425, 178447, -96771, -145097, -172031, -79356, 283724, 325953, 182867, -193463, 45539, -29532, 97024, -4678, 102170, 347, 428622, 63990, -144781, -108113, -64174, 92827, 124446, -54807, 28594, 99407, 47327, -4099, -256859, -38254, 123693, -14843, 69541, 252057, 182617, 138859, -153301, -32940, -42003, -90084, -256825, 29974]
12283G215a79799A92194b47714A5702L38331b48921A44786K0095b9443G9738K09719
12272B89457A23502K03611h6405D14462h744H0427f7844B18412a27288A11051
12261C49246F1747h636j53956B2153R6738a1970A22871K62891A27075n1193e7072
12249A3864m727P8373A6659K94957A55577n6058C4559J96964j07485B6475f0874
12237g4970r6495A12999f4827j2490K3388B98241k1389A1764J62430J28050j06749
12226A95495m5641J5956K35257j67427K2256q0338Q286F8476J31591M1528b0707
12214B05922A9680K02613A04701A0128N43043k58695I8430Q6619L25226A41563
12203a16429N0438o3519E47599A28676e8038m8933E7866P4341L20233J12361A46485
$$ y = [7215, -179799, 192194, -247714, 15702, 354033, -248921, 144786, 164881, -29443, 79738, 289457, 123502, 327113, -86405, 414462, -8744, 80427, -67844, 218412, -127288, 111051, 349246, 61747, -8636, -162592, 22153, 118891, -11970, 122871, 385762, 127075, 75882, -57072, 13864, 9137, 87510, 16659, 311616, 155577, 99519, 34559, 231523, 124038, 26475, -60874, -74970, -171465, 112999, -64827, -77317, -53929, 298241, 276852, 11764, 174194, 302244, 195495, 149854, 165810, 401067, 233640, 255896, 175558, 183844, 68476, 200067, 241595, -20707, 205922, 19680, 222293, 104701, 10128, 553171, 294476, 98430, 185049, 510275, 141563, -116429, -65991, -129510, 547599, 128676, -58038, -106971, 57866, 132207, 452440, 564801, 146485]
12191A34522L78192B13484E7927J2367R7412k4682c1383k9127P439o415B6363
12179C44160j40209a67676H0617K6413K2954c2856j07485C88501E5279A8584K21358
12168B39942J08370i0664A64143n0264K30453a46013c9664m5982k8202D6058a33273
12156A50127d4768L410I0466P4662n0187M1647j879p656b73460D87669G8795O8099
12144A46894B6174N1926J61305I9194a48482j57402C42848a04398k1630G3967
12133c3441g782k80660O8758C00097A24880n3234e335n2264j44199O3471B40036
12121a14894N6106L770q1057B16182K4905E5985d61470P4257N6322a31367B12293
12109I3396b22219b1178B10371b72256B77485e2067A66351b45828A45875L529
$$ y = [134522, 512714, 213484, 57927, 70294, 167706, 143024, -31383, -60510, -53071, -59486, 26363, 344160, 203951, -167676, 80617, 107030, 129984, -32856, -140341, 388501, 55279, 18584, 239942, 348312, -90664, 164143, 113879, 344332, -146013, -39664, -85646, -113848, 46058, -133273, 150127, -44768, -41358, 90466, 165128, 114941, 156588, 154709, 147053, -273460, 487669, 78795, 146894, 26174, 78100, 239405, 99194, -148482, -305884, 342848, -104398, -126028, 73967, -33441, -7782, -288442, -219684, 300097, 124880, 71646, -5335, -57599, -201798, -138327, 240036, -114894, -58788, -55018, -136075, 216182, 241087, 55985, -461470, -387213, -330891, -131367, 212293, 93396, -222219, -21178, 210371, -272256, 277485, -52067, 166351, -245828, 145875, 149404]
12099A49404J10262b504A174K3866i9790B28739I5859a31785I0666h6865B8377
12087E3574J82128b94810B287K39956b41271h3849C11712b32812i0326I9587K75923
12076C75510a39694O5434B37788P1286K34303O92911k85882D35825b04317A95266
12065c7339E6605L14468h0576n7412r7103a15275F6636B1125O3821a13509A48329
12053c9668A7275Q4646a5445j10078a3061A92262a74562C08623D5558O1020E1074
12041b16931Q9829A46057a91999N4776O3325j06710G9970a7430I5079a7562k82409
12030b99971E2192a89983N9954N7785L5410H6880l6623a7819k960m00230C8545
12018I8480J92105I7715d2207A32388b77700B30147a97182A48925b37095A63302
$$ y = [149404, 259666, -2504, 1174, 25040, -99790, 228739, 95859, -131785, 90666, -86865, 28377, 53574, 235702, -294810, 2287, 242243, -241271, -83849, 311712, -232812, -90326, 99587, 375510, -139694, -74260, 237788, 309074, 543377, 1236288, 950406, 435825, -204317, 195266, -37339, 56605, 371073, -80576, -137988, -235091, -115275, 66636, 21125, 84946, -113509, 148329, -39668, 17275, 101921, -15445, -125523, -13061, 192262, -174562, 308623, 45558, 106578, 51074, -216931, -127102, 146057, -191999, -137223, -73898, -180608, 79970, -17430, 95079, -17562, -299971, 52192, -189983, -130029, -72244, -36834, 86880, 50257, -17819, -20779, -421009, 38545, 98480, 290585, 97715, -42207, 132388, -277700, 230147, -197182, 148925, -237095, 163302]
12007c1375k57431A3794d4196A97330a92896j91024e3069o7073B0750J42415f9931
11995C49280c47380c1374A99203a66763j2754h4174r6751A94740q998b47705A20115
11983c22446G008f8945m0201c4902n7933m094A30511o397c3787E7675a95013N6543
11971a38470F5322A5342J41165a71540P9917A29346C0946P9899i9335j03218E2756
11959e0580G8664b62245C58350j71350I2616a2944r1077k17819h4876A68554a06289
11947a39976F5833K27696A02070e13443B30905a2832E8498K73206h6356p0495
11937a56851L6836B18501I0779l2500a44912H8477K3127f0518n7703E01756D1849
11925b68258j9663A0572J44885f1360j5214n0209j62423b1504k5294C8947J67891
$$ y = [-31375, -288806, 13794, -44196, 197330, -192896, -383920, -53069, -120142, 20750, 163165, -69931, 349280, -347380, -31374, 199203, -166763, -179517, -84174, -180925, 194740, 185742, -247705, 120115, -322446, 7008, -68945, -109146, -34902, -92835, -96929, 130511, 124114, -33787, 57675, -195013, -138470, 65322, 15342, 156507, -171540, -91623, 129346, 30946, 110845, -99335, -202553, 52756, -50580, 78664, -262245, 358350, 187000, 92616, -12944, -104021, -321840, -84876, 168554, -106289, -139976, 65833, 293529, 102070, -513443, 230905, -12832, 58498, 331704, -86356, -156851, -120015, 218501, 90779, 58279, -144912, 88477, 111604, -60518, -118221, 501756, 41849, -268258, -287921, 10572, 155457, -61360, -76574, -126783, -289206, -21504, -46798, 38947, 206838]
11914B06838a95679l2722A45033a36030o043J3223j6641B48467a96734G4235P2003
11903A46238B284L0010b14540B41593m1890b90922B73191b16930Q0025F8906l1404
11892C7502Q6069b71340a5206q8334A89417E9451a3389j23499J9571D15749a03283
11880A15236i8043d3554o7355c9670G4345Q0935j064a29597p0913C05409i1698
11868b72451B3241b20573N3919C8197J50591a65058q1811f1865A98591a3469p7923
11857i1392a80E0466J5851h5647A27788c14930d5736B54169c35102a59686r6313
11846b55999h1939A16105l0982J18149b7094B5940a78558A93733f9444j66726
11836b36170A4267J86177h8295M3324I1504b69791A81087J172N0477G6538Q5299
$$ y = [206838, -195679, -228401, 145033, -136030, -142073, -128850, -145491, 248467, -196734, 74235, 146238, 2284, 32294, -214540, 241593, 199703, -290922, 273191, -216930, -136905, 68906, 37502, 123571, -271340, -15206, -103540, 189417, 59451, -13389, -136888, -117317, 415749, -103283, 115236, -98043, -43554, -110909, -39670, 74345, 155280, 154216, -129597, -200510, 305409, -91698, -272451, 23241, -220573, -166654, 38197, 188788, -165058, -246869, -61865, 198591, -13469, -91392, -180, 50466, 66317, -85647, 127788, -314930, -45736, 254169, -335102, -159686, -255999, -81939, 116105, 85123, 203272, -27094, 25940, -178558, 193733, -69444, -236170, 14267, 200444, -88295, -44971, 91504, -269791, 181087, 182259, 232736, 76538, 161837]
11825A61837c25147f1297j6481A36938E7146B5216e28576F4329N4336a16714A37798
11813A93293b85181J26584f8530j89218F334d2891B09141a579D43764A2430f0960
11801C0985N0456j7076b4721q750C14079f7361H9491c2085A5208J58477A7181
11789h2788b6237j27585P3172J8882m3571j62884c4111B45376f878E0890J01402
11778A52292M690d1258G7194A9378M2932b3398A857d8879A2818c98886B04655
11766A51628a91660b1293j40132e5752k09586G0823a24295A63439J1963h0981
11755e31k38770c2961p2762a1521k51713r5138d8077k9597j12743A35527d0619
11743A00999C2565g3190D8772M5539D5684L6513b24118k20178A7053a30216j94826
$$ y = [161837, -325147, -61297, -77778, 136938, 57146, 25216, -528576, 64329, 118665, -116714, 137798, 193293, -285181, -158597, -68530, -257748, 6334, -42891, 209141, -1579, 443764, 12430, -60960, 30985, 81441, 64365, -24721, -33471, 314079, -67361, 89491, -32085, 15208, 173685, 17181, -82788, -26237, -153822, -80650, -61768, -105339, -268223, -34111, 245376, -6878, 50890, 152292, 156982, -41258, 77194, 19378, 62310, -23398, 1857, -48879, 12818, -398886, 204655, 151628, -191660, -21293, -161425, -55752, -265338, 70823, -124295, 163439, 175402, -80981, -531, -239301, -32961, -105723, -11521, -263234, -358372, -48077, -77674, -190417, 135527, -40619, 100999, 32565, -73190, 48772, 94311, 45684, 82197, -224118, -444296, 17053, -130216, -325042]
11732c25042a59784F3187e9364r3596b0084M516C3360A2590L46711g6212j96446
11721b72658A14283a68640M7985E4465O8646e4239A0795J8739h0897H4925J24657
11710B09582p9877b3360q2860B09796f2528A39926B4298a66163r8236a6432A82428
11698D59528c7410A23652N7601a09622c1226B61083K5598f4970k8376L3874K8944
11687c0528A23040M0268A0586L22170r8151K6613J0801p8118d777j11618G510
11675b09019a2446B20630b31294B61182A6454d9289j9608B86886D3994a01387
11664A21571J6408I788R4704C9646K1290J77844b59589q9375I6021a2916B86709
11652F5261J11590a88832A72381c30731B07376n6532a66918b4280r2477B67848
$$ y = [-325042, -159784, 63187, -59364, -152960, -20084, -15568, 33360, 12590, 359301, -76212, -272658, 114283, -168640, -120655, 54465, 123111, -54239, 10795, 29534, -80897, 84925, 209582, 129705, -23360, -106220, 209796, -62528, 139926, 24298, -166163, -264399, -16432, 182428, 459528, -37410, 123652, 181253, -109622, -31226, 261083, 286681, -64970, -93346, -59472, -30528, 123040, 163308, 10586, 332756, 234605, 261218, 272019, 193901, -4777, -116395, 7510, -209019, -12446, 220630, -231294, 261182, 16454, -49289, -68897, 286886, 43994, -101387, 121571, 137979, 9788, 104492, 39646, 60936, 238780, -259589, -348964, 96021, -12916, 286709, 65261, 176851, -188832, 172381, -330731, 207376, 150844, -166918, -24280, -116757, 267848]
11641c12582g6100E9197a41291a0645l22475R4828Q0944H6386C7286L33198j36208
11630B34276e6580E0428a05290j41270h3917B42837j18615a09108D5560J32627
11620A78187J06714j19425K36930a03269G7409l5796a03516k06755o541e7561
11609d30623D7478G767f3832G3189e6989j57864B50940J78900j24069b59163B52160
11597b41214B78213L0727r0729f2416A97247o6748J7396c30130A25149e5828A5131
11585A1676d1453B4604b011A77038K45725a85427g2870A23139f431B4839c9888
11573B53340O4442I6733J07246B269M43569c0925k4968l3995q2684b2412A73230
11561B2202f3832j40970A40675j386b1357I4485L049f7455G5917O2454D1383J4179
$$ y = [-312582, -76100, 59197, -141291, -10645, -333120, -238292, -157348, 86386, 37286, 370484, 234276, -56580, 50428, -105290, -246560, -83917, 242837, 124222, -109108, 45560, 178187, 284901, 165476, 402406, -103269, 77409, 41613, -103516, -310271, -316812, -57561, -430623, 47478, 7767, -63832, 73189, -56989, -214853, 250940, 429840, 305771, -259163, 252160, -241214, 278213, 308940, 218211, -62416, 197247, 130499, 147895, -330130, 125149, -55828, 15131, 11676, -41453, 24604, -2011, 177038, 422763, -185427, -72870, 123139, -6431, 24839, -39888, 253340, 317782, 96733, 203979, 2269, 445838, -30925, -55893, -89888, -172572, -22412, 173230, 22202, -63832, -204802, 140675, 139289, -21357, 94485, 97534, -67455, 75917, 138371, 41383, 55562]
11549E5562a48576o7489C52888a70662G9831K02683f2421a2822A00252j2794c8638
11537a7011K562r0490I7169K54264b4682B39923J6554f0821B53140E0686Q7568
11526A38254A1933i2216A51160D5976L2022C7566b79779f2003b7634r525A50587
11514a04740n8469G2708K43879m8070b4666m7998A28879l6038a89642b6222C55866
11502C34248j05706a95092B00943k5293K07935j40537b66018A16256C1259K02254
11492B33513g6764k21512L1952A45217J43470a8709B14152j02228E0765M80898
11482E31663a5746B60481b97906A10928J38419H165L83705g1932D01886e8449
11471A30615K550J52461A298L0286K87362D5567K19491J38075q6312J40348B508
$$ y = [55562, -148576, -216065, 352888, -170662, 79831, 282514, -62421, -12822, 100252, 87458, -38638, -17011, -14449, -104939, 97169, 351433, -24682, 239923, 256477, -60821, 253140, 50686, 138254, 11933, -92216, 151160, 45976, 77998, 37566, -279779, -62003, -27634, -37159, 150587, -104740, -163209, 72708, 316587, 268517, -24666, -72664, 128879, 92841, -189642, -26222, 355866, 334248, 228542, -195092, 200943, 175650, 383585, 243048, -266018, 116256, 31259, 233513, -76764, -298276, -266324, 145217, 288687, -18709, 214152, 111924, 50765, 531663, -15746, 260481, -297906, 110928, 249347, 8165, 391870, -71932, 401886, -58449, 130615, 133165, 285626, 1298, 31584, 318946, 45567, 265058, 403133, 316821, 457169, 2508]
11459I0222Q4523b05116A37667M1820m9689P4517C7441L23526A49044m9284J81325
11448B81085o2966A2582N3983C0621K00211a43569N5623k02373H7796J64559a03007
11436B78065A22923E5006J252J55598H5346d3683I8912a10307j29077l8072d8904
11424B0887K0798a1427C69K30908e5312H4229b977j92924A21177g0846E5175c226
11411g7044A5154J60082a92475A66545B4162d8998I0999h8627A22186M1526b40564
11399B43793d0196i375A23636a81462d8762l0583B650R4671a57673n9283o0194
11388b77150A51499l7340K5083j3313J04956g5937B28294a40067B37769c01973
11377a02122B49918r5785F6556d15348i8577I6671P3037a10256l4652O9450j51153
$$ y = [90222, 174745, -205116, 137667, 179487, 129798, 204315, 37441, 360967, 149044, 99760, 281085, 218119, 12582, 66565, 30621, 230832, -143569, -87946, -290319, 87796, 252355, -103007, 278065, 122923, 55006, 56258, 211856, 85346, -43683, 98912, -110307, -239384, -277456, -48904, 20887, 41685, -11427, 369, 231277, -55312, 84229, -2977, -195901, 121177, -70846, 55175, -3226, -77044, 15154, 175236, -192475, 166545, 24162, -48998, 90999, -88627, 122186, 163712, -240564, 243793, -40196, -9375, 123636, -181462, -48762, -79345, 2650, 97321, -157673, -216956, -277150, 151499, 114159, 139242, 125929, 230885, -75937, 228294, -140067, 237769, -301973, -102122, 249918, 154133, 66556, -415348, -98577, 96671, 169708, -110256, -144908, -75458, -226611]
11366b26611D1563K3832J9646a79308b3586k00341A43519k326J94517A58299D7249
11354a55811B31892f2440a4409B1176c5004k69345J24336A66721d09669G1248
11343B06637e9202D09021a16450K9445j1919K2017L0020H9636j6552a76736k07550
11332c84286B69018a17441A48124l6750a8828j48897m5005c6341I2080e5898j05615
11321a61513j03835A30827b4569k8179A91441c58766a00279j02089l0144E0020
11310B71008D4023f8985C00768j18580m0633K928b919C12182a34154n0181c7275
11298B60412j10718F8323L3936O4541I968e8131H0003h7944G3905K03614d3427
11286e3003k7463D6855a33083F9290k2831f9817A96986a97762A31270K6267g0975
$$ y = [-226611, 41563, 65395, 85041, -179308, -23586, -223927, 143519, 141193, 335710, 158299, 47249, -155811, 231892, -62440, -14409, 21176, -35004, -304349, -180013, 166721, -409669, 71248, 206637, -59202, 409021, -116450, -87005, -98924, -76907, -46887, 89636, 73084, -176736, -384286, 269018, -117441, 148124, 111374, -18828, -167725, -212730, -36341, 92080, -55898, -161513, -265348, 130827, -24569, -52748, 191441, -358766, -100279, -202368, -232512, 50020, 271008, 44023, -68985, 300768, 182188, 141555, 144483, -2919, 312182, -134154, -184335, -37275, 260412, 149694, 68323, 102259, 166800, 9968, -58131, 80003, -87944, 73905, 277519, -43427, -53003, -80466, 46855, -133083, 69290, 46459, -69817, 196986, -197762, 131270, 157537, -70975]
11274i4776c9094j37039I297a22824j139N9989j32730C48525c43521J38520g6199
11262B6057J48452H607c69765J60367P2245o9605C83992h2505j60801K3337r7615
11251c17584D8794e4761j46119O6021B60335r3834j4502D935a07411c4773D9160
11239B4945b97843D5071m958H556f07561b96664a9552j84614A2903d3850b472
11227i4101L3358p6416I0012D2436d856j9725A49162d0609k42341j34086E8549
11215b09130B06839a94570P3333k42008a03601A18404e8584l768A549O1419c4975
11203c01667A0289J93723i6873A8807N9455g8250b4584M07A2911n628P1427K8107
11191A06817O3627A8612o073J32533F1277e2933B54547G2939a94682P4999C68952
$$ y = [-94776, -39094, -176133, 9297, -122824, -123963, -63974, -196704, 348525, -343521, -205001, -76199, 26057, 174509, 8607, -369765, -209398, -137153, -206758, 383992, -82505, -243306, -219969, -317584, 48794, -54761, -200880, -134859, 260335, 166501, 151999, 4935, -107411, -34773, 49160, 24945, -297843, 45071, 40113, 8556, -607561, -296664, -19552, -204166, 12903, -43850, -2472, -94101, -60743, -137159, 90012, 42436, -4856, -24581, 149162, -40609, -282950, -417036, 58549, -209130, 206839, -194570, -121237, -363245, -103601, 118404, -58584, -62352, 1549, 62968, -34975, -301667, 10289, 204012, -96873, 18807, 78262, -78250, -24584, -24177, 12911, 7283, 78710, 106817, 170444, 18612, 12539, 145072, 61277, -52933, 254547, 72939, -194682, -119683, 368952]
11179b94220j4416h0980K0463l13739A03184i2788l3376A8304K43423b11211A81774
11167B0824K56478b06639e9808B02836B5302a47987O8245K8125j19703A64432
11156b63373C43260G9239a49288H0025A1148K02728p8026i7743E8619K4727a27081
11144a31344B18622A00405k4714a92728C024e5956B21727a66267g090A62118l0725
11133A31393C4426J34917b3013A05559D9229K21195j05030b69390I5042C7478
11122i0948E5362J91590a00903c3239C20132A36055K47283a47371A5489l621f5772
11110g699k04238a4438E42209a38486H8023J33497i493B34511J58180r8543b74901
11098C19666a591B68956E6417E003K92731a47332A01183b2242C53048A22729d8357
$$ y = [-294220, -308636, -80980, -60517, -374256, 103184, -92788, -126164, 18304, 261727, -211211, 181774, 20824, 277302, -206639, -59808, 202836, 25302, -147987, -79742, -51617, -171320, 164432, -263373, 343260, 79239, -149288, 80025, 11148, 213876, 135850, -97743, 58619, 83346, -127081, -131344, 218622, 100405, 75691, -192728, 3024, -55956, 221727, -166267, -7090, 162118, 131393, 34426, 169343, -23013, 105559, 49229, 270424, 165394, -269390, 95042, 37478, -90948, 55362, 246952, -100903, -33239, 320132, 136055, 383338, -147371, 15489, 11868, -65772, -7699, -211937, -14438, 542209, -138486, 88023, 221520, -9493, 234511, 392691, 294148, -274901, 319666, -1591, 268956, 56417, 5003, 297734, -147332, 101183, -22242, 353048, 122729, -48357]
11086b6745H724J15142r526L75380B09107J51212K3536K16040A49688J45076Q3735
11075C78499j67504l3795a15905A81115p875R3073l6623p3141K54547I9512e0814
11063F47924n0123B01223L33049o6784J4556Q2725K3191k09828K90919m2782l12994
11052C13275L52235P279C04910M17975j39302P4336J08187L35730n31065j0307
11042E60464l3582K59999o1076M5526R932p9571k34450K62671k70917O9549B25139
11030H61533D04801L84395j33868J15478o0885J82671l09020M90414B67180M10291
11020F77471J51306k42883B81288O4466L95784k16410p108J72915j26891j24718
11010D39326L15540C74878L93347B92630K2747M26590l42558N2108J8898J02296
$$ y = [-26745, 8724, 123866, 114340, 489720, 209107, 360319, 383855, 599895, 149688, 294764, 378499, 210995, 177200, -115905, 181115, 173240, 266313, 229690, 156549, 411096, 99512, -50814, 647924, 597801, 201223, 534272, 467488, 482044, 564769, 587960, 378132, 669051, 626269, 313275, 665510, 672789, 304910, 722885, 583583, 657919, 766106, 1101836, 570771, 560464, 526882, 786881, 725805, 771331, 781263, 701692, 467242, 729913, 458996, 528545, 225139, 861533, 404801, 789196, 655328, 770806, 709921, 892592, 583572, 1073986, 267180, 677471, 828777, 585894, 281288, 345754, 741538, 525128, 518020, 690935, 564044, 439326, 754866, 374878, 768225, 292630, 315377, 741967, 399409, 451517, 470415, 572711]
11000E72711J03582p0979o7875m7849k7861j14270N32529l49975L56905q5608
10990H01310j89454K08326k04194K6355J59252J38478L07852l41301J44233L2346
10980A083203K76291k51645L3764Q97368r6077M28062k55046J12202L00036o8944
10970B459214J94041m85141l9781j53189o09784M58009j86505j98475l70665L96009
10960A463733Q3712L007J34776o7393o2298j74065j17680k73044l57481J06106
10950G39373k32704K17092k04588A48864L68827j47267j31605d2836C55547j35463
10940B20084J18161j33984D9682P8973J35008b38645B98438D9055J80268b01170
10929a11673h694j24235A67815h448j33228O5877c3298C85062a4481j86731C66701
$$ y = [572711, 676293, 605314, 537439, 489590, 461729, 347459, 879988, 530013, 886918, 801310, 611856, 820182, 615988, 642343, 801595, 940073, 1247925, 906624, 1050857, 1083203, 1359494, 1107849, 1141613, 2038981, 1942904, 2370966, 2115920, 2228122, 2528158, 2459214, 2653255, 2168114, 2128333, 1975144, 1365360, 1823369, 1636864, 1438389, 1067724, 1463733, 1547445, 1550452, 1685228, 1617835, 1555537, 1381472, 1263792, 990748, 633267, 739373, 506669, 723761, 519173, 148864, 517691, 370424, 238819, -42836, 355547, 220084, 338245, 204261, 49682, 128655, 263663, -238645, 298438, 49055, 229323, -201170, -111673, -8694, -132929, 167815, -8448, -141676, -75799, -33298, 385062, -14481, -201212, 366701]
10917C96052e1277r5923o482F4542B4151L28001D078J39546L3013j2862a53954
10905a37919A09374c7684k10923C10078e9326j98722F9891a7708I515L80448I5107
10893h2249n0277K063m8475N3954I6147D3425L40934c9726o903A31183c47711
10881A1845i9674q6553d9230q401b1725f455H72e4989l25615i1655k35426d0185
10868I6522J40988a525H8410K55219h025n2727A32459d7456I2155l5019b13159
10856b34568J12658j0354j22476B54238g2720k01426a1506k53150a21188G6236
10845A700a99985D28632a06571L684j06923B77839c4350A74226a73479a9667k64262
10834b83929r255A89032b79072I0301a96539l8465L269R5511A61964c02062A24839
$$ y = [396052, -51277, -147200, -153682, 64542, 24151, 352152, 4078, 143624, 176637, 163775, -153954, -137919, 109374, -37684, -248607, 310078, -59326, -258048, 69891, -17708, 9515, 389963, 95107, -82249, -132526, -130463, -178938, -124984, 96147, 43425, 384359, -39726, -46629, 131183, -347711, 11845, -99674, -186227, -49230, -57631, -21725, -6455, 872, -54989, -380604, -91655, -327081, -40185, 96522, 237510, -1525, 88410, 343629, -8025, -60752, 132459, -47456, 92155, 57136, -213159, -234568, -121910, -132264, -254740, 254238, -72720, -274146, -11506, -264656, -121188, 76236, 1700, -199985, 428632, -106571, -102887, -209810, 277839, -34350, 174226, -173479, -19667, -283929, -293184, 189032, -279072, 90301, -196539, -235004, -231735, -136224, 161964, -302062, 124839]
10822d82210B49062c51660h2815A35526b40707a14929A7488c63695C6532h9689
10811a04570A38198b4111k98316D2137o068A0158f1953j12987c1301D8794a534
10799b6787B8033a52316B12271G7947b7694A07795a74299c4099k2487a1130B3401
10787G562a10354o0372g9257b3816o1158A20227h5211c7185B44622a1894q9474
10776a01368F4284e5894k71690g5485B5697a31187p353C5638a22638j29945a9928
10764c3231j05085B94114G7484h6107l5049a7077B42383m4263a92808A13467a2683
10752b00919A48427i78j48503O9055a4829N490j39961B75184i8581j69535j3884
10741b82000p9730a05459d203j67717E464b4601D9716d09079a65095p1095B4981
$$ y = [-482210, 249062, -351660, -82815, 135526, -240707, -114929, 17488, -363695, 36532, -89689, -104570, 138198, -24111, -322427, 42137, 36069, 10158, -61953, -174940, -31301, 48794, -1534, -26787, 28033, -152316, 212271, 77947, -27694, 107795, -174299, -34099, -56586, -11130, 23401, 7562, -110354, -170726, -79257, -23816, -84974, 120227, -85211, -37185, 244622, -11894, -101368, 64284, -55894, -327584, -75485, 25697, -131187, -138540, 35638, -122638, -252583, -19928, -33231, -138316, 294114, 77484, -86107, -121156, -17077, 242383, 198120, -192808, 113467, -12683, -200919, 148427, -978, -149481, -80426, -14829, -9339, -149300, 275184, -98581, -268116, -282000, -361730, -105459, -4203, -171920, 5464, -24601, 49716, -409079, -165095, -236190, 24981]
10729A04062d24270f9874E1766J09941b1470B03579h9832C7230c14035e6696l4221
10718i0917j06729f2028o4333k63396a11283q0094P3066M2650k20006g7399m7189
10707a24588M860H1320b5931k97228a37673c224B53242a05868I1192b77694A3739
10695E6491i7752F1422b81424a12952A49642a5932A89944j4942c73552F345b1624
10683b65100g9104M455B08966b19459A90340q2732a69532n4603A55684a84131
10672c6422A23872C4842a99084i1724B33163F9969I457O9492f1675q180j02637
10661a72492n0614C46949f4924I6175k3280N6014l0017a9039A98606l9864b33306
10649A03635J48381a50938d8745n3123K822J9692p8300A86792d6640n3237j31082
$$ y = [104062, -424270, -69874, 51766, 161707, -21470, 203579, -89832, 37230, -314035, -56696, -90917, -197646, -62028, -126361, -389757, -111283, -191377, -118311, -75661, -295667, -77399, -124588, -119728, 81320, -25931, -323159, -137673, -3224, 253242, -105868, 91192, -277694, 13739, 56491, -97752, 61422, -281424, -112952, 149642, -15932, 189944, 175002, -373552, 6345, -21624, -265100, -79104, -74649, 208966, -219459, 190340, 107608, -169532, -224135, 155684, -184131, -36422, 123872, 34842, -199084, -91724, 233163, 69969, 9457, 78949, -61675, -69855, -172492, -223106, 346949, -64924, 96175, 72895, 128909, 98892, -19039, 198606, 158742, -233306, 103635, 252016, -150938, -48745, -101868, -99046, -79354, -157654, 186792, -46640, -99877, -230959]
10638b30959O4821j4659A87944f8167J4379k50857e7864A56242J45667c896I8741
10626D3050O4557b70926B68224F5898N6503e5193B89739A23018J0029C3064g3259
10614b50521r2646a34516A02559a24110A89470K5049a37447j7557E1726b4984
10603c8862p2469j61101A95080p9320g9211H4040b07378l2941a15789H7112P0962
10592A58074P4240a00891D3147d0149l32929J03382A2985a05538I1645b07979
10581a17033H2277L97526C3767a53702a2893j23004E1753b89667c8247j31987
10571a70234J9385q6683f0744r0607j1615E7915J31902g4231B15680r4351b17622
10559B06831R8051b6407j25090l3813g6862l5468j5377j87794A1061R5295K10842
$$ y = [-230959, -166138, -180797, 187944, -68167, -53788, -304645, -57864, 156242, 301909, -3896, 98741, 43050, 107607, -270926, 268224, 65898, 122401, -55193, 289739, 123018, 133047, 33064, -73259, -250521, -343167, -134516, 102559, -124110, 189470, 214519, -137447, -155004, 51726, -24984, -38862, -111331, -272432, 195080, 115760, -79211, 84040, -207378, -240319, -115789, 87112, 158074, 232314, -100891, 43147, -40149, -373078, -269696, 12985, -105538, 91645, -207979, -117033, 82277, 479803, 33767, -153702, -12893, -135897, 51753, -289667, -38247, -170234, -150849, -237532, -60744, -151351, -162966, 57915, 189817, -74231, 215680, 121329, -217622, 206831, 304882, -26407, -151497, -185310, -76862, -112330, -127707, -315501, 11061, 106356, 317198]
10548C17198a06032A57248g5984m7075k3523r6761P8884g8687B60360A12386a42126
10536G1092b23113R0054A66093g7864J9312D771J63250g442A89621a20767b3009
10524H2604d4896j73756r5812A9984c72416h5701C2858J40773M8696a72179k22179
10513c94358B34739b08941m886L9767K6900m2139k8493a7916o1761C22300d6283
10501b9463m7809A68391G659J33272i9372I7006g75989a98307A45210h1096A85616
10489a34653j25245i5252j33398A88220n9775P1657O6119N02774l38660j89470
10479B40865L55646B41828Q4308E8402J75234K358i4876I8650a09996j45200C9593
10467f4018k0047B18625c13946G648c5544k52123j32828a39776j4663A68788q0332
$$ y = [317198, -106032, 157248, -75984, -123059, -146582, -243343, -164459, -78687, 260360, 112386, -142126, 71092, -223113, -133059, 166093, -77864, -58552, 4771, 168021, -7442, 189621, -120767, -23009, 82604, -44896, -218652, -314464, 19984, -372416, -85701, 32858, 173631, 222327, -172179, -394358, 234739, -208941, -213827, -174060, -147160, -189299, -217792, -17916, -79677, 322300, -46283, -29463, -77272, 168391, 7659, 140931, -99372, 97006, -775989, -198307, 145210, -81096, 185616, -134653, -259898, -95252, -228650, 188220, 128445, 200102, 266221, 768995, 430335, 240865, 596511, 241828, 326136, 58402, 233636, 235994, -94876, 98650, -109996, -255196, 39593, -64018, -84065, 218625, -313946, 7648, -35544, -287667, -420495, -139776, -154439, 168788, 88456]
10456H8456h2390j09049D5926c21230a04823e1805F4681M11375a41238L9363J6708
10445h5167A85556K1514F0478g1225I4073g0489A52066b4807l89159K04315d6243
10433A83270d8899A0122M4580J23096b94348a37541O0182J5044n3650E8891J8329
10422G7220L11866j20412A10953b9494j68794j12282G8913d2781n9745j59526
10412b62052B012Q6371h9661A99273C5268c9092j80961B04798J90287I591h5521
10400a30765A11680a27158j21932d8438g132l01317B79632F2561A5231J20313
10390A35544g9499G9254e5075C64886I555M38974A25341c8065A7574K00146C9026
10378F3821K10070a9155j59686G1398B542L73821J94940j63604a03562E60707
$$ y = [88456, -82390, -191439, 45926, -321230, -104823, -51805, 64681, 476056, -141238, -101875, -85167, 185556, 207070, 60478, -71225, 94073, -70489, 152066, -24807, -413966, -209651, -46243, 183270, -48899, 10122, 54702, 177798, -294348, -137541, -77359, -62315, -115965, 58891, 77220, 389086, 268674, 110953, -29494, -198288, -310570, 78913, -42781, -102526, -262052, 2012, 88383, -89661, 199273, 35268, -39092, -220053, 204798, 395085, 9591, -85521, -130765, 111680, -127158, -249090, -48438, -7132, -308449, 279632, 62561, 15231, 135544, -79499, 79254, -55075, 364886, 9555, 448529, 125341, -38065, 17574, 217720, 39026, 63821, 273891, -19155, -178841, 71398, 2542, 376363, 571303, 407699, -103562, 560707]
10367C35678K8189K82732A65393J99892I8334L00199A62937k2336L5482P0914
10357B46997J35680P5357G1653J93631R3181J5K2218J38004B05942P9132A04925
10345a0375E56107k54927r667F2699J48135B6412K60632A30308J57448G1506K74566
10334C46072n9369J6861A32660a07136A43694l2797d1464B54468I4518R7417N3649
10323B45584m511q6859K5758q1799L8963C6832b2317A40339m1096J31071g4300
10311H7510b74186D1814h4218A04813b54199d0057D2554d21834f9656b94A08751
10299a24811H8432a34612d0786E9827Q7044l7671C3259J37856q1273a18880m7310
10288a66190N1996H7553a58363A84210a97123a6330H7088H019P5009C6438a91017
$$ y = [335678, 363867, 646599, 165393, 365285, 98334, 398533, 162937, 140601, 176083, 246997, 382677, 458034, 71653, 265284, 358465, 358480, 380698, 518702, 205942, 285074, 104925, -10375, 556107, 301180, 291513, 62699, 210834, 26412, 287044, 130308, 287756, 71506, 346072, 286703, 303564, 132660, -107136, 143694, 110897, -41464, 254468, 94518, 191935, 245584, 241073, 154214, 179972, 98173, 137136, 36832, -22317, 140339, 99243, 230314, -74300, 87510, -274186, 41814, -84218, 104813, -254199, -40057, 42554, -421834, -69656, -294, 108751, -124811, 88432, -134612, -40786, 59827, 146871, 109200, 33259, 171115, 89842, -118880, -166190, -114194, 87553, -158363, 184210, -197123, -16330, 87088, 8019, 83028, 36438, -191017]
10276B15083a10261q9279p2871D2606h4550A43312a48467l652c3468d023A24584
10264B02336g1327r4921C8239b06303B69059J28611L563M0062j32638F6199J05085
10253A71284b15546A35931a44775L642A20568l6524c00752b5659l32950J36290
10243b22319C3170j5985L7945Q8276L4913q7950D2415b51137A66250g8936F2413
10231a06234A08971d2141c731A15658L8107J55080H781d97189I6400k1159K46467
10220C21708I4464b66276a885j45042j31944a35407p8796A23376J97894e5297
10209b48503f5674C38566a13105j1395A28098h7607k99581L7654J36554R3937
10199a19043n7021B4710a11418G96i2654k1438a7083r5508A67944p9293o59j5444
$$ y = [215083, -110261, -199540, -272411, 42606, -84550, 143312, -148467, -152119, -33468, -4023, 124584, 202336, -71327, -166248, 38239, -206303, 269059, 397670, 401233, 441295, 308657, 66199, 171284, -215546, 135931, -144775, -141133, 120568, 84044, -300752, -25659, -358609, -222319, 33170, 17185, 55130, 143406, 178319, 90369, 42415, -251137, 166250, -78936, 62413, -106234, 108971, -42141, -3731, 115658, 153765, 308845, 8781, -497189, 96400, 75241, 321708, 94464, -266276, -1885, -146927, -278871, -135407, -214203, 123376, 321270, -55297, -248503, -65674, 338566, -113105, -124500, 128098, -87607, -387188, -349534, -212980, -119043, -176064, 24710, -111418, 796, -92654, -114092, -17083, -112591, 167944, 88651, 87992, 72548]
10187G2548f6380E3170n280J53761m9592e1850E4166d3903a9229A61473h4053
10175C01949c91140H977d03962H2896b46580O1366A6563b26280f3013A65724O0478
10164B26202a05189q5285e6657A30451a97440m2666d4278A26124b11774j2828
10154b24602m8563A73126d201o4331j30890e1364B40075d8216B27484b18666g384
10142a30902e8189n3258j09849c377A54731b7397j00787B40340a59883j2978B11402
10130b3780F7152i505B46701g5980n3950A42787a36306H8923b54633c6433k84052
10119c20485B5599K29454g4623A71098G5386b78250I1370b48288f2836A47063
10108i6911J3737p3652A99228a22017j0957o7083K3183D5476b13349p9242A01443
$$ y = [72548, -66380, 53170, 47890, 201651, 152059, -51850, 54166, -43903, -19229, 161473, -84053, 301949, -391140, 8977, -403962, 82896, -246580, -185214, 16563, -226280, -63013, 165724, 226202, -105189, -190474, -56657, 130451, -197440, -240106, -44278, 126124, -211774, -224602, -273165, 173126, -4201, -68532, -199422, -51364, 240075, -48216, 227484, -218666, -7384, -130902, -58189, -111447, -221296, -3377, 154731, -27397, -128184, 240340, -159883, -172861, 211402, -23780, 67152, -9505, 246701, -75980, -129930, 142787, -136306, 88923, -254633, -36433, -320485, 25599, 255053, -74623, 171098, 75386, -278250, 91370, -248288, -62836, 147063, -96911, -83174, -156826, 199228, -122017, -132974, -200057, -176874, 45476, -213349, -292591, 101443]
10096b68511A27418d1667b647E7989J0464e1161l03953a59448A03237b50219A10211
10084E5545a44047D7823m717a17924j21579a06833a0547j23589B0479b5134k97376
10073c22510A26914a35150B5350J91672d647j63384B35339a30956A43918b62215
10062B99033E2543K75183b65227e9970C2196h6840D8422a97595b6239r047j9730
10051e5016A69256C1946b62961n7866R5270C13672A42649a95751q8901d6558j02962
10040a49520A52722b54939i8433A01209f8391n1286k04557A75386b58960g3802
10029c62798a53392C0724b75117A48978a32871k1765B5527J92879c09710J02509
10019b07201A10091i4238J3852B49818R472c224A00734B9497d85289a36029F8056
$$ y = [-268511, 127418, -41667, -2647, 57989, 68453, -51161, -355114, -159448, 103237, -250219, 110211, 55545, -144047, 47823, 43106, -117924, -239503, -106833, -10547, -134136, 20479, -25134, -322510, 126914, -135150, 25350, 217022, -4647, -168031, 235339, -130956, 143918, -262215, 299033, 52543, 327726, -265227, -59970, 32196, -86840, 48422, -197595, -26239, -35286, -55016, 169256, 31946, -262961, -320827, -225557, 313672, 142649, -195751, -284652, -46558, -149520, 152722, -254939, -98433, 101209, -68391, -119677, -324234, 175386, -258960, -73802, -362798, -153392, 30724, -275117, 148978, -132871, -154636, 25527, 218406, -309710, -207201, 110091, -94238, -80386, 249818, 259290, -3224, 100734, 29497, -485289, -136029, 68056]
10007a10369A08863i8658d8245J7364j06703d2717G9811e002A6168J01922N068
9996A23158D8049f5539F8498h527B05235b3962A12317a60429m9750P7444E4142
9984a52687k43400J69446J3965a02608K4521j79472r7542a0924A0879c72081e9774
9972a21447b9366A1241J01855d2314A65418a57152g6896b7059B9848e612I6859
9960e2594r997A68206b61085e0650F2416f1723l8906d8447j68568I8254h3155
9948a16979A94725m6200C1753f9599D4386Q9535h5038r2741m05480d1478a2343
9936A05781M52Q3169d0359A64877m1111j6758a07046L6894E8923c9784j2655I5554
9923F7790P2208a27265c6694C1653e8261C8816J9975a95246J6286A64012b66670
$$ y = [-110369, 108863, -98658, -48245, -30881, -137584, -42717, 79811, -5002, 16168, 118090, 123158, 48049, -65539, 68498, -8527, 205235, -23962, 112317, -160429, -210179, -132735, 54142, -152687, -396087, -226641, -212676, -102608, -78087, -257559, -355101, -10924, 10879, -372081, -59774, -121447, -29366, 11241, 113096, -42314, 165418, -157152, -76896, -27059, 29848, -5612, 96859, -52594, -62591, 168206, -261085, -50650, 62416, -61723, -100629, -48447, -217015, 98254, -83155, -116979, 194725, 148525, 31753, -69599, 44386, 133921, -85038, -177779, -583259, -41478, -12343, 105781, 106233, 189402, -40359, 164877, 123766, 107008, -107046, -70152, 58923, -39784, -52439, 95554, 67790, 139998, -127265, -36694, 31653, -58261, 38816, 58791, -195246, -178960, 164012, -266670]
9911c0125E4163h7407r0793A68742k2274d4367a1259B2530a79086A34689C373
9899c21938d9671A80955c78184P2253a02112A91024a31099k57767O8508b0175
9888h833j00427H6537c77086A82566a56677B42080a1357q2383A17846a98282i5876
9876b62752o2085c0522n9652L7559n9864Q470A51227J1548e2632j70817j42472
9865c65921a25389j64820c7925j93867B802a46563I341b30717l9485B1435a58141
9853C00725I5656k9636b05112D2599K0408a87205B00180i8410D3704L0995J78809
9842B53508b60101J5497q9729e2482A79095K34415A32917a03152d6612j57169
9832b03781K8582Q3536l150B87854a04332R747q4100b3590j45602H8276d29375
$$ y = [-30125, 54163, -87407, -178200, 168742, 146468, -44367, -11259, 22530, -179086, 134689, 3373, -321938, -49671, 180955, -378184, -305931, -102112, 191024, -131099, -388866, -320358, -20175, -8833, -109260, 86537, -377086, 182566, -156677, 242080, -11357, -93740, 117846, -198282, -95876, -262752, -324837, -30522, -90174, -52615, -112479, -104009, 151227, 162775, -52632, -223449, -365921, -125389, -290209, -37925, -231792, 2802, -146563, 9341, -230717, -270202, 21435, -158141, 300725, 95656, 66020, -205112, 42599, 63007, -187205, 200180, -98410, 43704, 74699, 253508, -260101, -244604, -334333, -52482, 179095, 413510, 132917, -103152, -46612, -203781, -175199, -91663, -94813, 287854, -104332, -94585, -178685, -23590, -169192, 88276, -429375]
9820A44305o7449M825Q9013b08076h8793A18780a2714j57349c9678A85862q2976
9809A02886a88312j62587a44935p3120A38509l8753A6217b36575n855i1442B25716
9797B35833f3564M375k1284B12677r3002K21321a04262j16380P5383D0385c5356
9785A67105g9243l36966B87930a34284K37q1788D42343B6091a43197B67191a84135
9773E0526L0607c15397A1422d31604J26084A2211a09537I065a68657b4659J0608
9762a4051j45347j61110L9450J39532m2193O2411b2154B71813A4472b9123I1226
9750b3754j27748C6230i9826l08031l013B81585a94522i5094o5319B27964i8139
9738a04661C20279c27652B26172a99074k36321a38623J1629H6278a99397n2135
$$ y = [144305, 76856, 81681, 170694, -208076, -88793, 118780, -12714, -170063, -39678, 185862, 102886, -188312, -350899, -144935, -218055, 138509, 99756, 16217, -236575, -242430, -91442, 225716, 235833, -63564, -59189, -80473, 212677, 119675, 340996, -104262, -220642, -145259, 40385, -35356, 167105, -79243, -416209, 287930, -134284, -134047, -215835, 442343, 26091, -143197, 267191, -184135, 50526, 81133, -315397, 11422, -431604, -305520, 12211, -109537, 9065, -168657, -24659, -14051, -159398, -320508, -281058, -141526, -183719, -121308, -22154, 271813, 14472, -29123, 91226, -23754, -151502, 36230, -99826, -407857, -410870, 281585, -194522, -95094, -160413, 227964, -98139, -104661, 320279, -327652, 226172, -199074, -435395, -138623, -126994, 86278, -199397, -251532]
9728b51532G6926c67356r2112J51638F7362f8312B85415a31445j8455o3772A50232
9716f2867j6532J9458l05706C4056L3493K31431b09718C4455a18386J7636a5014
9704F6325f8578K7380B79462d47317a13866E526j887L7327b13077k47423G1833
9692a37466O8669j97350A9610a97168B02779a36309G7745b60312d2929A83828
9681a52301A50281h1916H8757l8947L3863a69899A8883O3136N0672j7277a98800
9669B59511b74445h7881m8828a6396m0750k04219j39462h0218c9419j20810A05712
9657A8953b06564b844D08308A30532a46703M3011B15849p1532B5538f7965A91999
9645b8119l17850q1478a26765p2570r6846J18411P8691r665C50868a35464D4935
$$ y = [-251532, 76926, -367356, -459468, -307830, 67362, -68312, 285415, -131445, -149900, -213672, 150232, -62867, -79399, -59941, -365647, 34056, 67549, 298980, -209718, 34455, -118386, -100750, -15014, 66325, -68578, -41198, 279462, -447317, -113866, 5526, 3639, 40966, -213077, -460500, 71833, -137466, -68797, -266147, 19610, -197168, 202779, -136309, 77745, -260312, -42929, 183828, -152301, 150281, -81916, 88757, 49810, 83673, -169899, 18883, 82019, 132691, 115414, -198800, 259511, -274445, -87881, -136709, -16396, -57146, -261365, -400827, -80218, -39419, -160229, 105712, 18953, -206564, -2844, 408308, 130532, -146703, -103692, 215849, 144317, 25538, -67965, 191999, -28119, -345969, -427447, -126765, -199335, -296181, -177770, -99079, -108744, 350868, -135464, 44935]
9633a11151B8346a25105k25412A15374a42204e8229b2122j84372i1590k43931
9623c35521Q7705e5340A76467e1147A93158e0279A2418a15409N3794b1868O276
9612a5592j41800j18407J19239A97123c690A50294a29009B6654j3150c68662A54708
9600h9454j26761l252I2192a81201b0335o2818L4527A72270h9564C1361K89572
9589C20933b26775I729d4018q2464a8645j42320r9719A4379J2076b03509A5411
9577i2138j33005A023a22715d750k20241A34258c57897c3269D7853b04792e308
9565a24534j39114N5701n1634j3535P5354j9705J2481e9107l43299b4261n2462
9554g6723H737d10895J84415A2257a93042k35777j3935a68366B1301b68370J25425
$$ y = [-111151, 28346, -125105, -350517, 115374, -142204, -58229, -22122, -206494, -91590, -335521, -247816, -55340, 176467, -51147, 193158, -50279, 12418, -115409, -61615, -21868, -15592, -157392, -275799, -156560, 197123, -3690, 150294, -129009, 26654, 13504, -368662, 154708, -89454, -216215, -219467, 92192, -181201, -20335, -83153, -48626, 172270, -89564, 31361, 320933, -226775, 9729, -44018, -126482, -18645, -160965, -260684, 14379, 26455, -203509, 15411, -92138, -225143, 1023, -122715, -4750, -224991, 134258, -357897, -33269, 47853, -204792, -5308, -124534, -263648, -207947, -259581, -273116, -197762, -217467, -204986, -59107, -402406, -24261, -76723, 8737, -410895, -226480, 12257, -193042, -428819, -442754, -168366, 21301, -268370, -142945]
9543a42945j57481o86A98623c9701I5355K11847j33976n7482a83334M7608B16678
9531b16630p6136h1449F008b16946F4330a82447A95300g4410k18899R6424i1999
9519i7711E1796c70899G7647g9481K5978j85490J12398k92869i7718g841j27449
9508a35290F4601b78089a16688k54780a70609N8477l10515B69214p7337G9593
9497E1646J21115a34747M8945B33173A01620A0159b89440i6659k62561J72249
9487a86971G1635f6318n7991o2354f3032n9772e8547B73697a29071b3780k97493
9476c21273B4963Q873a05817A36924R7706a18802L105A97756a65541K4403A52352
9464F9800K4536b22541N190A30196a03913b5686k69490a37703J2894A55548O3391
$$ y = [-142945, -300426, -301112, 198623, -39701, 95355, 307202, 173226, 115744, -183334, -135726, 216678, -216630, -292766, -81449, 6008, -216946, 64330, -182447, 195300, -74410, -293309, -196885, -91999, -97711, 51796, -370899, 77647, -79481, -53503, -238993, -126595, -419464, -97718, -7841, -135290, 64601, -278089, -116688, -371468, -170609, -112132, -422647, 269214, 191877, 79593, 51646, 172761, -134747, -85802, 233173, 101620, 10159, -289440, -96659, -359220, -186971, 71635, -66318, -124309, -186663, -63032, -122804, -58547, 273697, -129071, -23780, -321273, 24963, 33836, -105817, 136924, 234630, -118802, -115697, 197756, -165541, -141138, 152352, 69800, 94336, -222541, -217351, 130196, -103913, -25686, -295176, -137703, -124809, 155548, 218939]
9453B18939c19827i811j64854B67515c2278F1109a34796A95133a79027j44920
9443c23947a8903F5693d6758k45699D6452c21751f2891B31130F0024K67910a91863
9431a8884n14499a59405M6814o1621A62909n6644e6550n3836B01427a51136l32690
9420d83826B6184b31893p7815a37755A60386p8890A5862Q6089a8341j17548D4472
9408d04910J47709D4406c27897O2699F3783h3904N608B89699F0039k3343b95966
9396D4708G077K9199a10253c149G2792h3878B06462a83881h4615A04125b4250
9384E2363c37003B51799a06049b2286A7863b42872e8561k34087f8287H6767h5626
9372a58728j0743J701A01719a36503C34029b36060P8489A79169a42522C9408K28326
$$ y = [218939, -319827, -9811, -174665, 267515, -32278, 61109, -134796, 195133, -179027, -323947, -18903, 65693, -46758, -292457, 46452, -321751, -62891, 231130, 60024, 327934, -191863, -18884, -533383, -159405, -112591, -174212, 162909, 106265, -56550, -110386, 201427, -151136, -483826, 26184, -231893, -309708, -137755, 160386, 81496, 15862, 101951, -18341, -135889, 44472, -404910, -257201, 44406, -327897, -265198, 63783, -83904, -78296, 289699, 60039, 36696, -295966, 44708, 7077, 36276, -110253, -3149, 72792, -83878, 206462, -183881, -84615, 104125, -24250, 52363, -337003, 251799, -106049, -22286, 17863, -242872, -58561, -292648, -68287, 86767, -85626, -158728, -169471, -167770, 101719, -136503, 334029, -236060, -157571, 179169, -142522, 39408, 267734]
9361B67734c85449H8234a3453B90400b4523m8243A03479d6962E2721d8591a2137
9349C00845e4705k4004l15092B33370a39652f70C25435e4312k41621J42615H528
9337c13518A2120h2159A38768C2432a11906p9959e3808j1822n764j03208f9768
9325a15506M3148o5906r1604f7583m3393k1602l0471k41749A14784f9745K1991
9314d7754A7186J85314a5403j29407A899a62899I5850k4426d24970C7425l154
9303C4271b45020l23221a41333A17055a8008P004o2129K1567C24636A7664K26943
9292B44607B9103a25400A5499K14038b7168o1829A68936d14459E4148a87474a0561
9280h1506j65502A54712a68836L1514j42388f8177A00815e6286l33981a16261
$$ y = [267734, -385449, 88234, -13453, 290400, -24523, -72766, 103479, -46962, 52721, -48591, -12137, 300845, -54705, -78709, -393801, 233370, -139652, -670, 325435, -54312, -295933, -153318, 8528, -313518, 12120, -82159, 138768, 32432, -111906, -191865, -53808, -65630, -71394, -174602, -69768, -115506, -72358, -138264, -229868, -67583, -110976, -132578, -163049, -404798, 114784, -69745, -47754, 17186, 202500, -15403, -144810, 1899, -162899, 95850, 71424, -424970, 37425, 34271, -245020, -568241, -141333, 117055, -18008, -11004, -73133, -51566, 324636, 17664, 244607, 29103, -125400, 15499, 229537, -27168, -88997, 168936, -414459, 54148, -187474, -10561, -81506, -247008, 154712, -168836, -137322, -279710, -68177, 100815, -56286, -390267, -116261]
9269G8471i1056A126b44998d3580l16593a37160m3021g3162C00490a40313B9287
9257B7148b76768Q0231K1485l3944b3197l43957a41546B71014f3578O107j29910
9246a87381P4716l6769E0728i4140l0110q3385f8235F8016d0396A09095a28462
9234a27952B51761c91460J47393k775c3950j18677J2204b2339k45822N7100A77576
9222C7659J4437J87482b18619e857B1875d06771a11082H7938c4478k10460B4931
9210A13670b21637B90347I1347b43585j955C8490O8291H473b20389K3642j5247
9199b11994j4148J01855A8221f2176A82877C1758c22946A33432j3157e360j5523
9188b0883k13606A6624J7948c730j08386b3986m2254A44024b04429B81771e8784
$$ y = [78471, -91056, 1126, -244998, -43580, -360173, -137160, -180181, -73162, 300490, -140313, 29287, 27148, -276768, -196537, -175052, -208996, -23197, -367154, -141546, 271014, -63578, -57471, -187381, -112665, -149434, 50728, -94140, -124250, -207635, -68235, 68016, -40396, 109095, -128462, -127952, 251761, -391460, -244067, -246842, -33950, -152627, -140423, -22339, -268161, -211061, 177576, 37659, 52096, 239578, -218619, -5857, 21875, -406771, -111082, 87938, -34478, -244938, 24931, 113670, -221637, 290347, 91347, -243585, -245540, 38490, 106781, 8473, -220389, -196747, -211994, -226142, -124287, 18221, -62176, 182877, 31758, -322946, 133432, 120275, -5360, -20883, -234489, 16624, 34572, -3730, -112116, -23986, -66240, 144024, -204429, 281771, -58784]
9176c81227M4534f7661l0105k11168C254h7411C5161b779B0116h1130c9858j05069
9164a44927m0422A48412J47985D23J38615b48192A21070e9133F1192J3162E594
9152A03320a0260l46532c121k84833D1344c09768d6528A6236b52691A35110J36264
9141B71374o5070a3170k41495M8804D4916e08762B4013J01331g7899C56039A55210
9129D7805J074g2109c1537A46769d63757a05871d3111E7949N2320c89625d721
9117a16085d4384j71758A20722J0972c09830J35815J1618n850d8344C3237b9549
9105b83055a34978o9995A35979m4764c09867e9952J7979f688B29457b34215J7764
9094b16451D09266b08991F4653g0499G7567L0435b84754j40860a84773k17390
$$ y = [-381227, -336693, -67661, -97766, -308934, 3254, -87411, 35161, -2779, 20116, -81130, -39858, -144927, -185349, 148412, 296397, 423, 139038, -248192, 121070, -59133, 61192, 74354, 5594, 103320, -10260, -356792, -3121, -287954, 41344, -309768, -46528, 16236, -252691, 135110, 271374, 206304, -13170, -254665, -205861, 44916, -508762, 24013, 125344, -77899, 356039, 155210, 47805, 48879, -72109, -31537, 146769, -463757, -105871, -43111, 57949, 110269, -389625, -4721, -116085, -44384, -216142, 120722, 131694, -309830, -174015, -162397, -168247, -48344, 33237, -29549, -283055, -134978, -204973, 135979, 91215, -309867, -59952, -41973, -6688, 229457, -234215, -216451, 409266, -208991, 64653, -70499, 77567, 108002, -284754, -425614, -184773, -402163]
9084d02163J43523g6788L6053A58350J5562p7723B9643b70038l3137J35538F027
9072A8070L5672c1627j11274A43513d21867a11317j52851O8896l66766J84285
9062c77753a15685l13254J98610e0709j02804b996B64061p7983a68216a1479E3324
9050I3406d62452J77330j1621d3967k18589M523c8466A14344Q2241F7501C1348
9038B524J10535B6127K5001J03751j0258A4416b32565g4645j2461k5545p2520
9027a85171A64565h1382j88397g8324j97420J26687K0639A35996f0380A38639
9016A31614b45915l05072F5638d665j52569E4749K80610a41759k47293A5217E604
9004A93372D5911a89786h8732A72391f8072j84523A53519g2885M860j30838i0458
$$ y = [-402163, -258640, -76788, -40735, 158350, 173912, 96189, 29643, -270038, -303175, -167637, 6027, 18070, 53742, -31627, -142901, 143513, -421867, -111317, -264168, -195272, -562038, -377753, -115685, -428939, -230329, -50709, -153513, -2996, 264061, 186078, -168216, -11479, 53324, 93406, -462452, -285122, -296743, -43967, -262556, -258033, -38466, 114344, 196585, 67501, 31348, 2524, 113059, 26127, 51128, 154879, 144621, 14416, -232565, -74645, -87106, -112651, -185171, 164565, -81382, -269779, -78324, -275744, -149057, -128418, 135996, -60380, 138639, 131614, -245915, -550987, 65638, -4665, -157234, 54749, 335359, -141759, -389052, 15217, 5604, 193372, 45911, -189786, -88732, 172391, -68072, -252595, 153519, -72885, -68025, -198863, -90458]
8992a97159Q9631G4510B5506J98848d5647F6080k2852c88900B15715B014c9586
8980A19514b98894B03324b0032j22508E3286d9977a9724l31752a53422j08039
8970b61461a1902B46693e09984A42156b18395h3286q921k67720h8815I3455J49787
8959B43242b10270D8665J29585a03712F1207K82757D8703O8002c6779j0544A62268
8947B238g7664B9592c08680A06112A5006b47001D8531J7557f7451l2530C2874
8935a21049e3015E58644f965D39344a3786n3231a1123H1770B2388L50184P4472
8924D47044O71776K146990M579173J203493B290902E77959B56657j21523J27107
8915B62241a28335C54006A58251a24289d949A8327J47741a46045B70181r0380
$$ y = [-197159, -107528, 74510, 25506, 224354, -45647, 66080, 43228, -388900, 215715, 2014, -39586, 119514, -298894, 203324, -20032, -142540, 53286, -49977, -19724, -351476, -153422, -261461, -11902, 246693, -509984, 142156, -218395, -83286, -92207, -359927, -88815, 93455, 243242, -210270, 48665, 178250, -103712, 61207, 343964, 48703, 116705, -36779, -47323, 162268, 2238, -77664, 29592, -308680, 106112, 15006, -247001, 48531, 66088, -67451, -99981, 32874, -121049, -53015, 558644, -6965, 439344, -13786, -67017, -11123, 81770, 22388, 372572, 447044, 1118820, 3265810, 7844983, 9048476, 2290902, 577959, 256657, 135134, 262241, -128335, 354006, 158251, -124289, -4949, 18327, 166068, -146045, 270181, 179801]
8905A79801J34c16914K2112d6560F6095a86882j52607C7254i4215G9397b01653
8893a88027p2019C06931D2161J09283b12135j303B29545a50639f0159j36573A08991
8881e50307b34975a07976A05578e6674A45910a69357j2451J65L7871A26760b45300
8869c8036n7141k04446B41860j20194B2222a8875j63192j85864e8305A78680l1007
8858A47673h6107B24779j03117a76943e320B66831N600D8872j5010a26059n6396
8847a82455P5270B52079h5226A28539b7554E008b60684P3387L5550j24931B1529
$$ y = [179801, 179935, -316914, -294802, -46560, 66095, -186882, -339489, 37254, -94215, 79397, -201653, -188027, -260046, 306931, 42161, 151444, -212135, -213438, 229545, -150639, -60159, -196732, 108991, -550307, -234975, -107976, 105578, -56674, 145910, -169357, -181808, -181643, -143772, 126760, -245300, -38036, -95177, -299623, 241860, 121666, 22222, -18875, -182067, -367931, -58305, 178680, 147673, -86107, 224779, 121662, -176943, -5320, 266831, 272431, 48872, 33862, -126059, -182455, -107185, 252079, -85226, 128539, -27554, 5008, -260684, -187297, -151747, -276678, 21529]
$$ [...]
##END NTUPLES=NMR SPECTRUM
##END=
