
##TITLE=UV1200_M3_1292-1211_7185061_YWN2Qwflvr
##JCAMPDX= 6.0         $$ Bruker NMR JCAMP-DX V2.0
##DATA TYPE= NMR SPECTRUM
##DATA CLASS= NTUPLES
##ORIGIN= BRUKER
##OWNER= Administrator
$$ 1.72 TOPSPIN		Version 2.1
$$ 2012-12-05 22:18:11.669 -0500  Administrator@X
$$ Compression mode = diff/dup
##.OBSERVE FREQUENCY= 400.02188249412
##.OBSERVE NUCLEUS= ^1H
##.ACQUISITION MODE= SIMULTANEOUS (DQD)
##.ACQUISITION SCHEME= undefined
##.AVERAGES= 64
##.DIGITISER RES= 22
##SPECTROMETER/DATA SYSTEM= spect
##.PULSE SEQUENCE= noesygpps1d.comp
##.SOLVENT NAME= COFFEE_meoh
##.SHIFT REFERENCE= INTERNAL, COFFEE_meoh, 1, 14.96089
##AUDIT TRAIL= $$ (NUMBER, WHEN, WHO, WHERE, PROCESS, VERSION, WHAT)
$$ ##TITLE= Audit trail, TOPSPIN		Version 2.1
$$ ##JCAMPDX= 5.01
$$ ##ORIGIN= Bruker BioSpin GmbH
$$ ##OWNER= Administrator
$$ $$ E:\/data/COFFEE/nmr/UV1200_M3_1292-1211_7185061_YWN2Qwflvr/12/pdata/1/auditp.txt
$$ ##AUDIT TRAIL=  $$ (NUMBER, WHEN, WHO, WHERE, PROCESS, VERSION, WHAT)
(   1,<2012-12-05 22:18:07.852 -0500>,<Administrator>,<X>,<go>,<TOPSPIN 2.1>,
      <created by zg
	started at 2012-12-05 22:06:33.656 -0500,
	POWCHK enabled, PULCHK disabled,
       configuration hash MD5:
       86 BA 57 50 F2 9D 5C 9B 26 00 A9 28 5F 66 2E 89
       data hash MD5: 64K
       77 B2 88 8A D3 95 3A 0A 38 31 F8 EE 9C F1 40 6B>)
(   2,<2012-12-05 22:18:09.840 -0500>,<Administrator>,<X>,<proc1d>,<TOPSPIN 2.1>,
      <Start of raw data processing
       efp LB = 0.3 FT_mod = 6 PKNL = 1 PHC0 = 0 PHC1 = 0 SI = 128K 
       data hash MD5: 128K
       DE 85 8E 4D F8 70 B8 F5 68 FF B6 51 A8 33 11 ED>)
(   3,<2012-12-05 22:18:10.546 -0500>,<Administrator>,<X>,<proc1d>,<TOPSPIN 2.1>,
      <pk PHC0 = -83.62244 PHC1 = 0 
       data hash MD5: 128K
       15 1A C6 6E D5 E3 36 B4 30 58 1D 7F 38 A7 4A 97>)
(   4,<2012-12-05 22:18:11.003 -0500>,<Administrator>,<X>,<proc1d>,<TOPSPIN 2.1>,
      <abs ABSG = 1 
       data hash MD5: 128K
       AF B8 0D FD C1 CC 73 59 3D 0F 89 95 E6 2E 62 50>)
(   5,<2012-12-05 22:18:11.103 -0500>,<Administrator>,<X>,<proc1d>,<TOPSPIN 2.1>,
      <abs ABSG = 2 
       data hash MD5: 128K
       A7 C9 CE 0D FB 35 43 10 16 80 A7 3D 0A E0 96 0C>)
(   6,<2012-12-05 22:18:11.212 -0500>,<Administrator>,<X>,<proc1d>,<TOPSPIN 2.1>,
      <abs ABSG = 3 
       data hash MD5: 128K
       A0 20 CB 86 C4 77 1C AD EC 03 37 92 0C 52 D4 5C>)
(   7,<2012-12-05 22:18:11.321 -0500>,<Administrator>,<X>,<proc1d>,<TOPSPIN 2.1>,
      <abs ABSG = 4 
       data hash MD5: 128K
       58 EC A3 40 F1 18 9E 93 59 CD CF AA 7F E1 23 AB>)
(   8,<2012-12-05 22:18:11.441 -0500>,<Administrator>,<X>,<proc1d>,<TOPSPIN 2.1>,
      <abs ABSG = 5 
       data hash MD5: 128K
       0E 83 27 56 E0 7A 7D 10 8E 10 1A 29 13 C8 F5 4C>)
$$ ##END=
$$ 
$$ $$ hash MD5
$$ $$ 38 63 E3 77 97 71 11 56 05 AD 5C 8B 37 E6 71 FB
##$RELAX= 
##$RELAX= 
##$RELAX= 
##$RELAX= 
##$RELAX= 
##$RELAX= 
##$RELAX= 
##$RELAX= 
$$ Bruker specific parameters
$$ --------------------------
##$DU= <E:\>
##$EXPNO= 12
$$ [...]
##$TP07= 0
##$TPNAME0= <>
##$TPNAME1= <>
##$TPNAME2= <>
##$TPNAME3= <>
##$TPNAME4= <>
##$TPNAME5= <>
##$TPNAME6= <>
##$TPNAME7= <>
##$TPOAL= (0..7)
0.5 0.5 0.5 0.5 0.5 0.5 0.5 0.5
##$TPOFFS= (0..7)
0 0 0 0 0 0 0 0
##$TUNHIN= 0
##$TUNHOUT= 0
##$TUNXOUT= 0
##$USERA1= <user>
##$USERA2= <user>
##$USERA3= <user>
##$USERA4= <user>
##$USERA5= <user>
##$V9= 5
##$VALIST= <valist>
##$VCLIST= <CCCCCCCCCCCCCCC>
##$VD= 0
##$VDLIST= <DDDDDDDDDDDDDDD>
##$VPLIST= <PPPPPPPPPPPPPPP>
##$VTLIST= <TTTTTTTTTTTTTTT>
##$WBST= 1024
##$WBSW= 4
##$XGAIN= (0..3)
0 0 0 0
##$XL= 0
##$YL= 0
##$YMAX_a= 5905872
##$YMIN_a= -11166405
##$ZGOPTNS= <>
##$ZL1= 120
##$ZL2= 120
##$ZL3= 120
##$ZL4= 120
##$ABSF1= 14.96089
##$ABSF2= -5.597292
##$ABSG= 5
##$ABSL= 3
##$ALPHA= 0
##$AQORDER= 0
##$ASSFAC= 0
##$ASSFACI= 0
##$ASSFACX= 0
##$ASSWID= 0
##$AUNMP= <proc_prof1d_extract.lims>
##$AXLEFT= 0
##$AXNAME= <>
##$AXNUC= <1H>
##$AXRIGHT= 0
##$AXTYPE= 0
##$AXUNIT= <>
##$AZFE= 0.1
##$AZFW= 0.1
##$BCFW= 0
##$BC_mod= 0
##$BYTORDP= 0
##$COROFFS= 0
##$CY= 15
##$DATMOD= 1
##$DC= 0
##$DFILT= <>
##$DTYPP= 0
##$F1P= 0
##$F2P= 0
##$FCOR= 0.5
##$FTSIZE= 131072
##$FT_mod= 6
##$GAMMA= 0
##$GB= 0
##$INTBC= 1
##$INTSCL= 1
##$ISEN= 128
##$LB= 0.3
##$LEV0= 0
##$LPBIN= 0
##$MAXI= 10000
##$MC2= 0
##$MEAN= 0
##$ME_mod= 0
##$MI= 0
##$NCOEF= 0
##$NC_proc= -2
##$NLEV= 6
##$NOISF1= 0
##$NOISF2= 0
##$NSP= 0
##$NTH_PI= 0
##$NZP= 0
##$OFFSET= 14.96089
##$PC= 1
##$PHC0= -83.62244
##$PHC1= 0
##$PH_mod= 1
##$PKNL= yes
##$PPARMOD= 0
##$PPDIAG= 0
##$PPIPTYP= 0
##$PPMPNUM= 2147483647
##$PPRESOL= 1
##$PSCAL= 4
##$PSIGN= 0
##$PYNMP= <proc.py>
##$REVERSE= no
##$SF= 400.020009680849
##$SI= 131072
##$SIGF1= 0
##$SIGF2= 0
##$SINO= 400
##$SIOLD= 131072
##$SPECTYP= <>
##$SREGLST= <1H.CDCl3>
##$SSB= 0
##$STSI= 131072
##$STSR= 0
##$SW_p= 8223.68421052631
##$SYMM= 0
##$S_DEV= 0
##$TDeff= 65536
##$TDoff= 0
##$TI= <>
##$TILT= no
##$TM1= 0
##$TM2= 0
##$TOPLEV= 0
##$USERP1= <user>
##$USERP2= <user>
##$USERP3= <user>
##$USERP4= <user>
##$USERP5= <user>
##$WDW= 1
##$XDIM= 131072
##$YMAX_p= 406102170
##$YMIN_p= -15172
##$CURPLOT= <Network HP LaserJet P1505>
##$CURPRIN= <$Network HP LaserJet P1505>
##$DFORMAT= <normdp>
##$LAYOUT= <+/1D_H.xwp>
##$LFORMAT= <normlp>
##$PFORMAT= <normpl>
##$SURQMSG= 1
$$ End of Bruker specific parameters
$$ ---------------------------------
##NTUPLES= NMR SPECTRUM
##VAR_NAME=  FREQUENCY,     SPECTRUM/REAL,   SPECTRUM/IMAG
##SYMBOL=    X,             R,               I
##VAR_TYPE=  INDEPENDENT,   DEPENDENT,       DEPENDENT
##VAR_FORM=  AFFN,          ASDF,            ASDF
##VAR_DIM=   131072,        131072,          131072
##UNITS=     HZ,            ARBITRARY UNITS, ARBITRARY UNITS
##FACTOR=    0.0627417313425164, 1,          1
##FIRST=     8223.62146879497, 3545,         -54714
##LAST=      0,             5353,            -54079
##MIN=       0,             -15172,          0
##MAX=       8223.62146879497, 406102170,    0
$$ Real data points
##PAGE= N=1
##DATA TABLE= (X++(R..R)), XYDATA
$$ [...]
63985B69115J722K103K373K812L586M242M323M266M838N848O368O227O252O925
$$ 269115 270837 272940 275313 278125 281711 285953 290276 294542 299380 305228 311596 317823 324075 331000
63971C31000P781Q488R396J0594J1377J1407J1521J2492J3665J3815J2976J2422
$$ 331000 338781 347269 356665 367259 378636 390043 401564 414056 427721 441536 454512 466934
63959D66934J3000J4441J6319J8755K1855K5214K8455L1857L6060M1359M7658
$$ 466934 479934 494375 510694 529449 551304 576518 604973 636830 672890 714249 761907
63948G61907N4974O3575P3612Q4896R7231J10701J25351J40552J55088J68093
$$ 761907 816881 880456 954068 1038964 1136195 1246896 1372247 1512799 1667887 1835980
63938A835980J79599J89865J98414K04264K06892K06284K02103J93518J80116
$$ 1835980 2015579 2205444 2403858 2608122 2815014 3021298 3223401 3416919 3597035
63929C597035J62292J40422J14436Q4862N3576K2591p596l7632o7514r6151j22598
$$ 3597035 3759327 3899749 4014185 4099047 4152623 4175214 4167618 4129986 4062472 3966321 3843723
63918C843723j46629j67722j84400j95331k00549k01175j98246j92409j84283
$$ 3843723 3697094 3529372 3344972 3149641 2949092 2747917 2549671 2357262 2172979
63909B172979j74436j63095j50409j36955j23516j10450r7778q5812p5022o5331
$$ 2172979 1998543 1835448 1685039 1548084 1424568 1314118 1216340 1130528 1055506 990175
63899I90175n6224m7851m1232l6797l3302k9023k3793j9066j6003j4341j3271
$$ 990175 933951 886100 844868 808071 774769 745746 721953 702887 686884 672543 659272
63888F59272j2601j2552j2941j3225j3057j2359j1047r188p293n896m913l736
$$ 659272 646671 634119 621178 607953 594896 582537 571490 562302 555009 549113 544200 540464
63876E40464k017P8K288M535O744Q746J0556J2391J4265J5845J6867J7472J8001
$$ 540464 538447 538525 540813 545348 552092 560838 571394 583785 598050 613895 630762 648234 666235
63863F66235J8618J9214J9518J9235J8196J6549J4645J2697J0612Q190N386K396
$$ 666235 684853 704067 723585 742820 761016 777565 792210 804907 815519 823709 829095 831491
63851H31491m61k963n241p616j0107j2270j3818j5099j6593j8170j9343k0146
$$ 831491 831030 828067 822826 815210 805103 792833 779015 763916 747323 729153 709810 689664
63839F89664k1068k2147k2841k2907k2745k2624k2230k1365k0531k0273k0340
$$ 689664 668596 646449 623608 600701 577956 555332 533102 511737 491206 470933 450593
63828D50593k0033j9089j7790j6397j4949j3504j2180j1036j0115r482r035q512
$$ 450593 430560 411471 393681 377284 362335 348831 336651 325615 315500 306018 296983 288471
63816B88471p887p400p018o315n206m323m218m539m551m134l707l386k913k263
$$ 288471 280584 273184 266166 259851 254645 250322 246104 241565 237014 232880 229173 225787 222874 220611
63802B20611j738j440j199j006j010j125j041p11m04l47n83j071j603j875j981
$$ 220611 218873 217433 216234 215228 214218 213093 212052 211341 210937 210590 210007 208936 207333 205458 203477
63787B03477k491l468l850k695p47K68j70q92q71m45l51n23n12l11j67j02j79
$$ 203477 200986 197518 193668 190973 190226 190494 190324 189432 188561 188116 187765 187242 186730 186419 186252 186150 185971
63770A85971o88j549k061j788j204q99p27l14J16J84K42R30K078K752K360J149
$$ 185971 185283 183734 181673 179885 178681 177782 177055 176741 176857 177041 177283 178213 180291 183043 185403 186552
63754A86552k82j313j381m28P70J305J131Q19N56J06l35j89N45J223J586K110
$$ 186552 186270 184957 183576 183148 183918 185223 186354 187173 187729 187835 187500 187311 187856 189079 190665 192775
63738A92775K961L488L225K675K504K506K052J195O30P39J236J687J889J848J801
$$ 192775 195736 199224 202449 205124 207628 210134 212186 213381 214011 214750 215986 217673 219562 221410 223211
63723B23211K162L052L959M240L892L479L396L604L935M230M186L569K635J905
$$ 223211 225373 228425 232384 236624 240516 243995 247391 250995 254930 259160 263346 266915 269550 271455
63709B71455J407N83q61k437l491l996m298m412m018l128k283j899j745j307n15
$$ 271455 272862 273445 272584 270147 266656 262660 258362 253950 249932 246804 244521 242622 240877 239570 239055
63694B39055J90M63M88O45R78J195J170J162J430J901K314K569K759K984L318
$$ 239055 239245 239708 240196 240841 241819 243014 244184 245346 246776 248677 250991 253560 256319 259303 262621
63679B62621L733L900L268J782L23p5N66J228J222Q79O98N18M6k90K20J462K505
$$ 262621 266354 270254 273522 275304 275627 275552 276118 277346 278568 279447 280145 280663 280709 280419 280639 282101 284606
63662B84606K710K265J550N66p46k164l396m348m898m745l875k880k491k808l338
$$ 284606 287316 289581 291131 291697 290951 288787 285391 281043 276145 271400 267525 264645 262154 259346 256008
63647B56008l654l714l606l293k724j994j253n48J42P61J161J269J243J346J612
$$ 256008 252354 248640 245034 241741 239017 237023 235770 235222 235364 236125 237286 238555 239798 241144 242756
63632B42756J843K058K633L703M635M719M294M457N481O311O168N822O429P706
$$ 242756 244599 246657 249290 252993 257628 262347 266641 271098 276579 282890 289058 294880 301309 309015
63618C09015Q368Q235Q593J0231J2213J3268J3551J4243J5923J8141K0330K2334
$$ 309015 317383 325618 334211 344442 356655 369923 383474 397717 413640 431781 452111 474445
63606D74445K4091K5520K6873K8611L0723L2466L2991L1958K9449K5573K0414
$$ 474445 498536 524056 550929 579540 610263 642729 675720 707678 737127 762700 783114
63595G83114J4242P721J842k518n230o971q372r239r079q365q534j0464j3511
$$ 783114 797356 805077 806919 804401 799171 792200 783828 774589 765510 757145 748611 738147 724636
63582G24636j6505j9204k2050k4820k6488k6574k5827k5087k4126k2195j9343
$$ 724636 708131 688927 666877 642057 615569 588995 563168 538081 513955 491760 472417
63571D72417j6483j4204j2192r931p368m746k236p5J357K004K451L429N130P231
$$ 472417 455934 441730 429538 419607 412239 407493 405257 405182 406539 408543 410994 414423 419553 426784
63557D26784R295J0825J1299J0804J0374J1075J2716J4192J5147J6525J9154K2588
$$ 426784 436079 446904 458203 469007 479381 490456 503172 517364 532511 549036 568190 590778
63545E90778K5926K9111L2641L6350L9331M0940M1033L9190L4571K6959J7422
$$ 590778 616704 645815 678456 714806 754137 795077 836110 875300 909871 936830 954252
63534I54252P637j094q007j2678j5087j5599j4529j2050q869o612o770r358j3084
$$ 954252 961889 960795 952788 940110 925023 909424 894895 882845 873976 867364 860594 851236 838152
63521H38152j6892k0806k5150k9527l3035l5191l6142l6044l4719l2169k9055
$$ 838152 821260 800454 775304 745777 712742 677551 641409 605365 570646 538477 509422
63510E09422k6284k4149k2173j9840j7218j4758j2726j1135r982r199q424p246
$$ 509422 483138 458989 436816 416976 399758 385000 372274 361139 351157 341958 333534 326288
63498C26288n768m540l861l532l392l571l900l649k408r26l38o94r72n29J74M94
$$ 326288 320520 315980 312119 308587 305195 301624 297724 294075 291667 290741 290403 289709 288737 288208 288382 288876
63482B88876N07O12P85Q64J133J998L209L971L876L283K768K554K549K528K156
$$ 288876 289383 289995 290780 291644 292777 294775 297984 301955 305831 309114 311882 314436 316985 319513 321669
63467C21669J173k48j538k287k625k874l118l285l491l936m383m080k542l72J051
$$ 321669 322842 322594 321056 318769 316144 313270 310152 306867 303376 299440 295057 290977 288435 288063 289114
63452B89114Q86k93j152r95k20N73J387K522L900N109N980O713P546Q567R807
$$ 289114 290000 289707 288555 287560 287340 287913 289300 291822 295722 300831 306811 313524 321070 329637 339444
63437C39444J1192J2507J3736J5306J7644K0599K3685K6676K9420L1176L0832
$$ 339444 350636 363143 376879 392185 409829 430428 454113 480789 510209 541385 572217
63426E72217K8058K3617J8371J2575O553J461j280j102J546N898J1231J6845K2178
$$ 572217 600275 623892 642263 654838 661391 662852 661572 660470 662016 667914 679145 695990 718168
63413G18168K6991L1166L4487L6826L8205L8341L6452L2116K5992J9184J2106
$$ 718168 745159 776325 810812 847638 885843 924184 960636 992752 1018744 1037928 1050034
63402A050034M709k386p853j1032j2512j3189j3400j3397j3970j5928j9263k3395
$$ 1050034 1054743 1052357 1044504 1033472 1020960 1007771 994371 980974 967004 951076 931813 908418
63390I08418k7864l2283l5851l7639l7519l6288l4748l3013l0846k8290k5664
$$ 908418 880554 848271 812420 774781 737262 700974 666226 633213 602367 574077 548413
63379E48413k3088k0328j7201j3944j1098r038p612o238m329j742J104L566N304
$$ 548413 525325 504997 487796 473852 462754 453716 446104 439866 435537 433795 434899 438465 443769
63366D43769O508P569Q634R643J0755J2387J4729J7438K0066K2554K5083K7664
$$ 443769 450277 457846 466480 476123 486878 499265 513994 531432 551498 574052 599135 626799
63354F26799L0202L2765L5415L7821L9432L9982L9481L7680L4105K8718K2225
$$ 626799 657001 689766 725181 763002 802434 842416 881897 919577 953682 982400 1004625
63343A004625J5476Q856K447l459q259j1351j2561j2467j2304j3193j5266j7739
$$ 1004625 1020101 1028957 1031404 1027945 1019686 1008335 995774 983307 971003 957810 942544 924805
63331I24805j9948k2060k4655k7905l1320l4088l5514l5352l3860l1430k8139
$$ 924805 904857 882797 858142 830237 798917 764829 729315 693963 660103 628673 600534
63320F00534k3940j9254j4929j1417q390n451k970j926l111o546j1304j5751j8401
$$ 600534 576594 557340 542411 530994 522604 517153 514183 512257 509146 502600 491296 475545 457144
63307D57144j8993j8595j8291j7998j6798j4138j0507p133n225n114n845n949
$$ 457144 438151 419556 401265 383267 366469 352331 341824 334691 329466 324352 318507 312558
63295C12558m945l765l375l506l236k402j720j721k217k750k947k594j893j563
$$ 312558 307613 303848 300473 296967 293731 291329 289609 287888 285671 282921 279974 277380 275487 273924
63281B73924k067k842k967k435k037j964j491k82Q51J010L56l22o80q30o31K70
$$ 273924 271857 269015 266048 263613 261576 259612 258121 257839 258690 259700 260056 259734 259054 258224 257593 257863
63265B57863J710K890L118K457J525Q79O70Q10J316K280L494M355M451M016L566
$$ 257863 259573 262463 265581 268038 269563 270442 271112 271922 273238 275518 279012 283367 287818 291834 295400
63250B95400L193K726K411K843M141N680O844P585Q094Q475Q971R993J1497J2742
$$ 295400 298593 301319 303730 306573 310714 316394 323238 330823 338917 347392 356363 366356 377853 390595
63236C90595J3207J3363J4148J5833J7891J9754K1276K2433K3126K3315K3163
$$ 390595 403802 417165 431313 447146 465037 484791 506067 528500 551626 574941 598104
63225E98104K2868K2524K2112K1613K1099K0749K0636K0563K0303J9979J9915
$$ 598104 620972 643496 665608 687221 708320 729069 749705 770268 790571 810550 830465
63214H30465K0010J9754J8892J7652J6004J3213Q604K540l808r467j4169j8162
$$ 830465 850475 870229 889121 906773 922777 935990 944594 947134 943326 933859 919690 901528
63202I01528k1895k5637k8957l0811l0645k9159k7461k5718k3293j9996j6457
$$ 901528 879633 853996 825039 794228 763583 734424 706963 681245 657952 637956 621499
63191F21499j3158r884o423l071j77K341M615O428P713R070J1165J3793J5975
$$ 621499 608341 598457 592034 588963 588786 591127 595742 602170 609883 618953 630118 643911 659886
63178F59886J7036J7202J7134J7205J7387J7542J7612J7577J7342J6753J5732
$$ 659886 676922 694124 711258 728463 745850 763392 781004 798581 815923 832676 848408
63167H48408J4321J2572J0399P626M206L00l835q019j2159j6194k0067k3623k6575
$$ 848408 862729 875301 885700 893326 897532 897832 893997 885978 873819 857625 837558 813935 787360
63154G87360k8658k9879l0484l0612l0071k8585k6264k3766k1822k0554j9297
$$ 787360 758702 728823 698339 667727 637656 609071 582807 559041 537219 516665 497368
63143D97368j7274j4514j1894j0197r322q599p726o984o611o298n527m156k518
$$ 497368 480094 465580 453686 443489 434167 425568 417842 410858 404247 397949 392422 388266 385748
63130C85748j076r3M68Q41J233J538J406O92j22j78R44K631L748L802L450L615
$$ 385748 384672 384579 385047 385888 387121 388659 390065 390757 390635 390457 391401 394032 397780 401582 405032 408647
63114D08647M272M601M245L837L981M366M320L810L257K709J968J310J312J880
$$ 408647 412919 417520 421765 425602 429583 433949 438269 442079 445336 448045 450013 451323 452635 454515
63100D54515K278K228K149K178J802R16L89Q09J426J198M31L26J117J725J346
$$ 454515 456793 459021 461170 463348 465150 466066 466455 467264 468690 469888 470319 470645 471762 473487 474833
63085D74833M50r1j33o1%K45P72J508K358L130L470L203K673K574L407N101P055
$$ 474833 475283 475192 475059 474998 474998 475243 476015 477523 479881 483011 486481 489684 492357 494931 498338 503439 510494
63068E10494Q477R002R016R284J0193J1560J3078J4590J5938J7043J8327K0489
$$ 510494 518971 527973 536989 546273 556466 568026 581104 595694 611632 628675 647002 667491
63056F67491K3567K6636K8941L0881L3381L6600L9869M2759M5422M7982N0184
$$ 667491 691058 717694 746635 777516 810897 847497 887366 930125 975547 1023529 1073713
63045A073713N1837N3064N3872N3996N3373N2342N1244N0180M9367M9181M9526
$$ 1073713 1125550 1178614 1232486 1286482 1339855 1392197 1443441 1493621 1542988 1592169 1641695
63034A641695M9672M9151M8341M7685M6676M4250L9970L4177K7074J8370P964
$$ 1641695 1691367 1740518 1788859 1836544 1883220 1927470 1967440 2001617 2028691 2047061 2055025
63023B055025l581j5472k7162l8230m8200n6751o3805o9079p1887p1703o8879
$$ 2055025 2051444 2035972 2008810 1970580 1922380 1865629 1801824 1732745 1660858 1589155 1520276
63012A520276o4462n9383n3954m8065m1578l4480k6855j8931j1186m211J720O984
$$ 1520276 1455814 1396431 1342477 1294412 1252834 1218354 1191499 1172568 1161382 1157171 1158891 1165875
63000A165875J2236J7542K2109K5128K6740K7784K8788K9650L0233L0665L0901
$$ 1165875 1178111 1195653 1217762 1242890 1269630 1297414 1326202 1355852 1386085 1416750 1447651
62989A447651L0538K9478K8303K7573K6964K5508K2511J7936J2154N680j018p855
$$ 1447651 1478189 1507667 1535970 1563543 1590507 1616015 1638526 1656462 1668616 1674296 1673278 1665423
62977A665423j5231k3380l1721l9207m5292n0179n4179n7303n9481o0660o0474
$$ 1665423 1650192 1626812 1595091 1555884 1510592 1460413 1406234 1348931 1289450 1228790 1168316
62966A168316n8320n4175m9042m4187m0026l6142l2258k8743k6010k3878k1860
$$ 1168316 1109996 1055821 1006779 962592 922566 886424 854166 825423 799413 775535 753675
62955G53675j9932j8472j7453j6159j4165j2208j1544j2346j3372j3391j2521
$$ 753675 733743 715271 697818 681659 667494 655286 643742 631396 618024 604633 592112
62944E92112j1805j1820j2184j2217j1679j0812j0025r543r144q320o922n536
$$ 592112 580307 568487 556303 544086 532407 521595 511570 502027 492883 484563 477641 472105
62932D72105m917n140n586n739n621n407m997m146k864j540o60m35n79o10m24
$$ 472105 467188 462048 456462 450723 445102 439695 434698 430552 427688 426148 425488 425053 424474 423864 423440
62917D23440l45m88l91L15J168J353P07k57j164j977k461k285j765j743k425l070
$$ 423440 423095 422607 422216 422531 423699 425052 425759 425502 424338 422361 419900 417615 415850 414107 411682 408612
62901D08612l150l057l176l079k321j459j305j604j443p92n59j036j309n93O77
$$ 408612 405462 402405 399229 396150 393829 392370 391065 389461 388018 387226 386667 385631 384322 383729 384406
62886C84406J564J839J840J629J007J70l30l12j94l48o59q41q47p37m30Q5M87
$$ 384406 385970 387809 389649 391278 392285 392455 392125 391813 391619 391271 390612 389771 388924 388187 387757 387842 388329
62869C88329M30Q9J1L58O58N30J88n0m17j307k317k410j251J34M25n18j580j671
$$ 388329 388759 388848 388859 389217 389875 390405 390593 390543 390126 388819 386502 384092 382841 382975 383400 382882 381302 379631
62851C79631p72K55O45M28K67O72J456K062K207J954J368N31k00m86o50j339k413
$$ 379631 378859 379114 379759 380187 380454 381126 382582 384644 386851 388805 390173 390704 390504 390018 389368 388029 385616
62834C85616k850k172j177p92q02n92m57j049j870j623j45J199J401J061J153
$$ 385616 382766 380594 379417 378625 377823 377231 376774 375725 373855 372232 372087 373286 374687 375748 376901
62819C76901J528J455J029J035J687K368K603K608K763L077L434L918M683N648
$$ 376901 378429 379884 380913 381948 383635 386003 388606 391214 393977 397054 400488 404406 409089 414737
62805D14737O475O803O519N973N834O541P870R161R937J0191J0203J0359J1063
$$ 414737 421212 428015 434534 440507 446341 452882 460752 469913 479850 490041 500244 510603 521666
62792E21666J2507J4423J6256J7675J8853K0214K2104K4719K8123L2148L6420
$$ 521666 534173 548596 564852 582527 601380 621594 643698 668417 696540 728688 765108
62781G65108M0713M5269N0595N6800O3307O9370P4748P9657Q4030Q7219Q8580
$$ 765108 805821 851090 901685 958485 1021792 1091162 1165910 1245567 1329597 1416816 1505396
62770A505396Q8050Q5783Q1465P4572O5258N4326M2152K8256J2425m234k0065
$$ 1505396 1593446 1679229 1760694 1835266 1900524 1954850 1997002 2025258 2037683 2033449 2013384
62759B013384l4375m7464n9303o9026p6021q0732q3848q5231q4358q1607p8221
$$ 2013384 1979009 1931545 1872242 1803216 1727195 1646463 1562615 1477384 1393026 1311419 1233198
62748A233198p4894p1056o5999o0223n5082n1181m7757m3798l9317l5134l1699
$$ 1233198 1158304 1087248 1021249 961026 905944 854763 807006 763208 723891 688757 657058
62737F57058k8623k5450k2325j9632j7319j5027j2769j0987r831q790p374n815
$$ 657058 628435 602985 580660 561028 543709 528682 515913 504926 495095 486305 478931 473116
62725D73116m716m118l435k314j060o8P52J626K313K461K361K860M392O489Q407
$$ 473116 468400 464282 460847 458533 457473 457405 458157 459783 462096 464557 466918 469778 474170 480659 489066
62710D89066R847J0946J2034J3603J6075J9162K1891K3764K5645K8878L3582L8578
$$ 489066 498913 509859 521893 535496 551571 570733 592624 616388 642033 670911 704493 743071
62698G43071M2925M6894N1099N5398N9170O2304O5264O8177P0339P0756O8953
$$ 743071 785996 832890 883989 939387 998557 1060861 1126125 1194302 1264641 1335397 1404350
62687A404350O5177N9857N2982M4149L3301K1198Q818l608j6504k9698m1892n1724
$$ 1404350 1469527 1529384 1582366 1626515 1659816 1681014 1689832 1686224 1669720 1640022 1598130 1546406
62675A546406n9064o4736o9201p2046p2705p1219o8182o4302o0156n6062n2049
$$ 1546406 1487342 1422606 1353405 1281359 1208654 1137435 1069253 1004951 944795 888733 836684
62664H36684m8028m4011m0097l6344l2833k9712k6939k4159k1171j8372j6309
$$ 836684 788656 744645 704548 668204 635371 605659 578720 554561 533390 515018 498709
62653D98709j4886j3466j1738j0004q561p389o591o524p136p625p260o247n401
$$ 498709 483823 470357 458619 448615 440054 432665 426074 419550 412414 404789 397529 391282 385881
62640C85881n107n013m588l611k269j149r72j846k803k595j082N44J087N70o2
$$ 385881 380774 375761 371173 367562 365293 364144 363172 361326 358523 355928 354846 355390 356477 357047 356985
62625C56985j45J08J53j15k81J5O18J021J006Q87J069J533J928K070K087K167
$$ 356985 356840 356948 357101 356986 356705 356720 357338 358359 359365 360252 361321 362854 364782 366852 368939 371106
62609C71106K410K966L977N302O555P560Q584R895J1298J2418J3369J4867J7452
$$ 371106 373516 376482 380459 385761 392316 399876 408460 418355 429653 442071 455440 470307 487759
62596D87759K0778K3896K6318K8598L1677L5628L9364M1738M2682M2983M3066
$$ 487759 508537 532433 558751 587349 619026 654654 694018 735756 778438 821421 864487
62585H64487M2397M0118L5908L0089K3234J5911Q517J100o548j4376k1798k8161
$$ 864487 906884 947002 982910 1012999 1036233 1052144 1060661 1061761 1055213 1040837 1019039 990878
62573I90878l3270l7177l9705m0660m0408l9708l8830l7338l4963l2244k9888
$$ 990878 957608 920431 880726 840066 799658 759950 721120 683782 648819 616575 586687
62562E86687k7838k5491k2658j9808j7341j5133j2957j0968r418q229p137o159
$$ 586687 558849 533358 510700 490892 473551 458418 445461 434493 425075 416846 409709 403550
62550D03550n542n318n239n105m879m416l448k001n80L45Q23J150J299J021M48
$$ 403550 398008 392690 387451 382346 377467 373051 369603 367602 367022 367367 368190 369340 370639 371660 372108
62535C72108J29L61Q30J159J423J821K112J871J248R99J666L040M626O236P925
$$ 372108 372237 372598 373428 374587 376010 377831 379943 381814 383062 384061 385727 388767 393393 399629 407554
62520D07554R636J1226J2803J4622J6748J9076K1699K4816K8232L1256L3482L5336
$$ 407554 417190 428416 441219 455841 472589 491665 513364 538180 566412 597668 631150 666486
62508F66486L7513L9888M1425M1221L9321L6385L2806K8502K3320J7310J0604
$$ 666486 703999 743887 785312 826533 865854 902239 935045 963547 986867 1004177 1014781
62497A014781L462l535r667j4706j9072k3018k5903k6775k5680k3839k2242k0457
$$ 1014781 1018243 1014708 1005041 990335 971263 948245 922342 895567 869887 846048 823806 803349
62485H03349j7363j2765p750l368M20M303Q550J2874J7065K1124K4837K7687K9435
$$ 803349 785986 773221 765471 762103 762523 766826 775376 788250 805315 826439 851276 878963 908398
62472I08398L0372L0760L0311K8555K5493K1486J6647J0819M164k608q891j4785
$$ 908398 938770 969530 999841 1028396 1053889 1075375 1092022 1102841 1107005 1104397 1095506 1080721
62460A080721k0879k7487l4210m0068m4018m5577m5200m3898m2317m0268l7359
$$ 1080721 1059842 1032355 998145 958077 914059 868482 823282 779384 737067 696799 659440
62449F59440l3802l0265k7011k3693k0101j6660j3844j1497r094o517m097k019
$$ 659440 625638 595373 568362 544669 524568 507908 494064 482567 473473 466956 462859 460840
62437D60840j65J348K025J717J153J269K204L267L760L435K239K68j935l530m233
$$ 460840 460675 462023 464048 465765 466918 468187 470391 473658 477418 480853 483092 483360 481425 477895 473662
62422D73662m711n705p066q106q611q986r418r522r012q177p411o660n697m707
$$ 473662 468951 463246 456180 448074 439463 430477 421059 411537 402525 394348 386937 380277 374580 369873
62408C69873m130m020l910l413k701k271k395k860l188l040k420j552o58O0L57
$$ 369873 365743 361723 357813 354400 351699 349428 347033 344173 340985 337945 335525 333973 333315 333375 333732
62393C33732R8m37o31j07Q87J702J871J408P64N44J045J898K367K143J687J652
$$ 333732 333830 333393 332762 332655 333542 335244 337115 338523 339287 339831 340876 342774 345141 347284 348971 350623
62377C50623K160K872L568M335N260O271P242Q135R002R893J0696J1104J1005
$$ 350623 352783 355655 359223 363558 368818 375089 382331 390466 399468 409361 420057 431161 442166
62364D42166J0951J1831J3888J6452J8915K1475K4557K8029L1614L5593M0256
$$ 442166 453117 464948 478836 495288 514203 535678 560235 588264 619878 655471 695727
62353F95727M4956M8696N1544N4414N7309N8857N7997N5115N0912M5016L6651
$$ 695727 740683 789379 840923 895337 952646 1011503 1069500 1124615 1175527 1220543 1257194
62342A257194K6203J5240N115l776j1521j8174k3881k8951l3662l8067m1981m5043
$$ 1257194 1283397 1298637 1303752 1299976 1288455 1270281 1246400 1217449 1183787 1145720 1103739 1058696
62330A058696m6873m7253m6072m3183l8741l3640k9060k5352k1968j8646j5960
$$ 1058696 1011823 964570 918498 875315 836574 802934 773874 748522 726554 707908 691948
62319F91948j4280j3052j1817j1167j1769j3026j3844j4315j5399j7038j7972
$$ 691948 677668 664616 652799 641632 629863 616837 602993 588678 573279 556241 538269
62308E38269j7571j6604j5771j4621j2569j0098q112o746n621m757m443m481m293
$$ 538269 520698 504094 488323 473702 461133 451035 442923 436177 430556 425799 421356 416875 412582
62295D12582l707l051k569k197j810j289m59O16J444J621J422J474J919K299K280
$$ 412582 408875 405824 403255 401058 399248 397959 397500 398116 399560 401181 402603 404077 405996 408295 410575
62280D10575K034J876J917K128K477K776K716K247J772J825K646M126N982P818
$$ 410575 412609 414485 416402 418530 421007 423783 426499 428746 430518 432343 434989 439115 445097 452915
62266D52915R181R817R931J0068J0741J2250J4715J8066K1861K5452K8623L1962
$$ 452915 462096 471913 481844 491912 502653 514903 529618 547684 569545 594997 623620 655582
62254F55582L6204M1205M6035N0167N4042N8067O1535O3036O1727N7703N1451
$$ 655582 691786 732991 779026 829193 883235 941302 1002837 1065873 1127600 1185303 1236754
62243A236754M3544L4769K5758J6441O517l442j2138j9085k5273l1877l8876m5417
$$ 1236754 1280298 1315067 1340825 1357266 1363783 1360341 1348203 1329118 1303845 1271968 1233092 1187675
62231A187675n0915n5137n7593n7756n5767n2388m8227m3450l8184l2706k7264
$$ 1187675 1136760 1081623 1024030 966274 910507 858119 809892 766442 728258 695552 668288
62220F68288k2148j7832j4621j2135r643p021m909l814l436l194l007l186l758
$$ 668288 646140 628308 613687 601552 591909 584888 579979 576165 572729 569535 566528 563342 559584
62207E59584m339m753n348o498p844q495q048p147o702o773o628n835m728l744
$$ 559584 555245 550492 545144 538646 530802 522307 514259 507112 500410 493637 487009 481174 476446 472702
62193D72702k859j934j077k98P44K123L284L817M298N615P608R152R601R475R571
$$ 472702 469843 467909 466832 466534 467278 469401 472685 476502 480800 486415 494023 503175 512776 522251 531822
62178E31822J0002J0368J0377R975R188Q148P105O242N645N529O246P971J0584
$$ 531822 541824 552192 562569 572544 581732 589880 596985 603227 608872 614401 620647 628618 639202
62165F39202J3905J7790K2020K6403L0993L5788M0177M3161M4316M4098M2922
$$ 639202 653107 670897 692917 719320 750313 786101 826278 869439 913755 957853 1000775
62154A000775M0395L5850K9322K1564J3305N018k769r457j4824j9178k2989k6555
$$ 1000775 1041170 1077020 1106342 1127906 1141211 1146229 1143460 1134003 1119179 1100001 1077012 1050457
62142A050457l0000l3286l6071l7812l8119l6983l4652l1411k7531k3283j8924
$$ 1050457 1020457 987171 951100 913288 875169 838186 803534 772123 744592 721309 702385
62131G02385j4713j0967p919n446l085n58J760L110L233K815K897L869N237O284
$$ 702385 687672 676705 668786 663340 660255 659697 661457 664567 667800 670615 673512 677381 682618 688902
62117F88902O764O835O581N851M468K498L32j457k434k634k493k462k806l785
$$ 688902 695666 702501 709082 714933 719401 721899 722231 720774 718340 715706 713213 710751 707945 704160
62103G04160n624q075j0281j1470j1602j1043r806p616m688j824M28K282M169
$$ 704160 698536 690461 680180 668710 657108 646065 636259 628643 623955 622131 622559 624841 629010
62090F29010N975P146P397P050O696O671O826O791O436O100O249P082Q427R871
$$ 629010 634985 642131 649528 656578 663274 669945 676771 683562 689998 696098 702347 709429 717856 727727
62076G27727J0865J1033J0723J0987J2506J4667J6278J6997J7508J8278J9014
$$ 727727 738592 749625 760348 771335 783841 798508 814786 831783 849291 867569 886583
62065H86583J9483K0069K1049K2026K2670K3420K4821K6537K7763K8266K8216
$$ 886583 906066 926135 947184 969210 991880 1015300 1040121 1066658 1094421 1122687 1150903
62054A150903K7298K4768K0476J5100R282L201k946q737j4030j9077k3916k8225
$$ 1150903 1178201 1202969 1223445 1238545 1247827 1251028 1248082 1239345 1225315 1206238 1182322 1154097
62042A154097l2014l5815l9687m2704m4039m4121m3937m3549m2160l9538l6437
$$ 1154097 1122083 1086268 1046581 1003877 959838 915717 871780 828231 786071 746533 710096
62031G10096l3457l0386k7053k4036k1824j9917j7532j4881j2824j1456r996q242
$$ 710096 676639 646253 619200 595164 573340 553423 535891 521010 508186 496730 486734 478492
62019D78492p024o770o534n312l708l200m050m956m888m175l474k636j311K3N60
$$ 478492 471468 464698 458164 452852 449144 445944 441894 436938 432050 427875 424401 421765 420454 420477 421037
62004D21037L97M77J312K477L428M102M562M673M557M788N665O532O441N254L565
$$ 421037 421434 421911 423223 425700 429128 433230 437792 442465 447022 451810 457475 464007 470448 475702 479267
61989D79267J718m08k525l701l497k817k968m140n481o493p525q792r716r703
$$ 479267 480985 480577 478052 474351 470854 468037 465069 460929 455448 448955 441430 432638 422922 413219
61975D13219q983q195p526o812o172n890n777n266m158k869j850j236j068j446
$$ 413219 404236 396041 388515 381703 375531 369641 363864 358598 354440 351571 349721 348485 347417 345971
61961C45971k261l057l320k791j553m5J125J701K009K457K872K894K715K869L243
$$ 345971 343710 340653 337333 334542 332989 332944 334069 335770 337779 340236 343108 346002 348717 351586 354829
61946C54829L167K618K636M011O184P905Q665Q934R377J0317J1688J3026J3683
$$ 354829 357996 360614 363250 367261 373445 381350 390015 398949 408326 418643 430331 443357 457040
61933D57040J3502J3150J3388J4120J4521J4030J2881J1705J0908J0314R272P266
$$ 457040 470542 483692 497080 511200 525721 539751 552632 564337 575245 585559 594831 602097
61921F02097M580K105K80j383l429n544p028p772q069p780o497m536k834j649
$$ 602097 606677 608782 609062 607679 604250 598706 591678 583906 575837 568057 561560 557024 554190 552541
61907E52541j09K509N616Q019R383J0386J1551J2546J2775J2205J1228R967Q095
$$ 552541 552432 554941 560557 568576 577959 588345 599896 612442 625217 637422 648650 658617 666712
61894F66712N383K095j298m551p557j0083j1920j3154j3862j3756j2627j1125
$$ 666712 672095 674190 672892 668341 660784 650701 638781 625627 611765 598009 585382 574257
61882E74257j0299j0231r800q254o359n487o075p521r025r883r468p828o041n228
$$ 574257 563958 553727 543927 535673 529314 523827 517752 510231 501206 491323 481855 474027 467986 462758
61868D62758n206m859l651k080p39K65R41J291J648K424L398L948M087M561N818
$$ 462758 457552 452693 449042 446962 446223 446488 447429 448720 450368 452792 456190 460138 464225 468786 474604
61853D74604P609R723J2193J4587J6089J6758J7824K0056K2602K4169K4589K4448
$$ 474604 482213 491936 504129 518716 534805 551563 569387 589443 612045 636214 660803 685251
61841F85251K3827K2481K0774J9294J7621J4611J0068N215J179k220n746r423
$$ 685251 709078 731559 752333 771627 789248 803859 813927 819142 820321 818101 812355 802932
61829H02932j2464j4164j4366j3203j0856p654m077n30K883O255R559J2451J4377
$$ 802932 790468 776304 761938 748735 737879 730225 726148 725618 728501 734756 744315 756766 771143
61816G71143J4859J3640J0662O119N96n060j0199j4621j8373k1440k3785k5461
$$ 771143 786002 799642 810304 816423 817019 811959 801760 787139 768766 747326 723541 698080
61804F98080k6539k6966k6698k5832k4387k2136j8972j5510j2956j2069j2265
$$ 698080 671541 644575 617877 592045 567658 545522 526550 511040 498084 486015 473750
61793D73750j2063j0567q353o684n977n489m506l336k707k712k857k917l008k964
$$ 473750 461687 451120 442767 436083 430106 424617 420111 416775 414068 411356 408499 405582 402574 399610
61779C99610k385j426q12q40j032j025j104j448j545r76k24K1o5J33M64R1j130
$$ 399610 397225 395799 394987 394147 393115 392090 390986 389538 387993 387017 386793 386814 386749 386882 387346 387437 386307
61762C86307k228k279j429m28L53J043J636J737J061J2n24n8Q83J304Q73K43J23
$$ 386307 384079 381800 380371 379943 380296 381339 382975 384712 385773 385785 385261 385203 386086 387390 388263 388506 388629
61745C88629M45O97O35L30k15j008j802k251k279j963j308m43J61J48k41n60q01
$$ 388629 389074 389771 390406 390736 390521 389513 387711 385460 383181 381218 379910 379467 379628 379776 379535 378975 378174
61728C78174j124j199n06P74J871K499L044L556L413K412J434J360J800J670Q16
$$ 378174 377050 375851 375345 376119 377990 380489 383533 387089 390502 392914 394348 395708 397508 399178 399994
61713C99994K31O49J628K264K320K187K101J866J335O88P5o42j553k386k807k975
$$ 399994 400225 400874 402502 404766 407086 409273 411374 413240 414575 415263 415338 414696 413143 410757 407950 404975
61697D04975l327l910m286m163l746l320k950k683k622k632k419k106k216k777
$$ 404975 401648 397738 393452 389289 385543 382223 379273 376590 373968 371336 368917 366811 364595 361818
61683C61818l074k747k450k728k946k282j258j092j832k337k164k029k235k014
$$ 361818 358744 355997 353547 350819 347873 345591 344333 343241 341409 339072 336908 334879 332644 330630
61669C30630j063m10q53j536j203j63K66k16o58n50n08r81j337q23K94J076J098
$$ 330630 329567 329157 328304 326768 325565 325402 325668 325452 324794 324244 323736 322755 321418 320595 320889 321965 323063
61652C23063P63O16P68J048J369J766K156K286K038J708J726K122K494K576K523
$$ 323063 323826 324442 325210 326258 327627 329393 331549 333835 335873 337581 339307 341429 343923 346499 349022
61637C49022K490K306J851J460J558K035K322K001J054l02j750k866l397l533
$$ 349022 351512 353818 355669 357129 358687 360722 363044 365045 366099 365797 364047 361181 357784 354251
61623C54251l616l583l081k176j551j802k654l161k614j199K12Q88P89L56j01
$$ 354251 350635 347052 343971 341795 340244 338442 335788 332627 330013 328814 329026 329914 330703 331059 330958
61608C30958o14j242j837k299k767l389m052m523m690m575m286m081m111m012
$$ 330958 330344 329102 327265 324966 322199 318810 314758 310235 305545 300970 296684 292603 288492 284480
61594B84480l189j783q58j131k033k583k732l041l396l130k366k074k530k766
$$ 284480 281291 279508 278650 277519 275486 272903 270171 267130 263734 260604 258238 256164 253634 250868
61580B50868k091j224j181j760j998j617j039l88N47J398J316J99r14j024k57
$$ 250868 248777 247553 246372 244612 242614 240997 239958 239570 240117 241515 242831 243030 242116 241092 240835
61565B40835N63Q30M21n06j522k041j855j383j076p82l3J099J894J766R30J62
$$ 240835 241398 242228 242649 242143 240621 238580 236725 235342 234266 233484 233451 234550 236444 238210 239140 239302
61549B39302Q2P12J593K216K330J979J353P40M48N76Q23P88M96L85O19P47L21
$$ 239302 239384 240096 241689 243905 246235 248214 249567 250307 250755 251331 252154 252942 253438 253823 254442 255189 255510
61532B55510l72n86q9N65P71N92N65R51J410J382P02j38m64j52J75j51j072j898
$$ 255510 255138 254552 254463 255028 255799 256391 256956 257907 259317 260699 261401 261263 260799 260647 260822 260671 259599 257701
61514B57701k063j621r80m93k91k84k85k19k12l17k88L5K73j07r03j204n11O26
$$ 257701 255638 254017 253037 252544 252253 251969 251684 251465 251253 250936 250648 250683 250956 250849 249946 248742 248231 248857
61496B48857J306J240P78L31Q7pk44r19j843k364k095j301l68N78J285J230M53
$$ 248857 250163 251403 252181 252512 252599 252592 252348 251429 249586 247222 245127 243826 243458 244036 245321 246551 247004
61479B47004j8O85K043K812K587J925J178K62n19n14J87O87N86N33J032J582J507
$$ 247004 246986 247671 249714 252526 255113 257038 258216 258478 257959 257445 257632 258319 258905 259438 260470 262052 263559
61462B63559R67N29K90K1k29k57j16J3Q0ll63o97l94N15J102P81K51M77J281J710
$$ 263559 264526 265055 265345 265366 265137 264880 264764 264777 264857 264854 264491 263794 263400 263915 265017 265798 266049 266526 267807 269517
61442B69517J467J088R03P35N19M94O94Q88J090J488J913K035K067K596L554M092
$$ 269517 270984 272072 272975 273710 274229 274723 275417 276305 277395 278883 280796 282831 284898 287494 291048 295140
61426B95140L708K919K521K651K803K484J507P7j213j665r89M49J903K627K328
$$ 295140 298848 301767 304288 306939 309742 312226 313733 313810 312597 310932 309943 310392 312295 314922 317250
61411C17250J576J434K206K753J823j99j716j973j744j843k034j892j695j736
$$ 317250 318826 320260 322466 325219 327042 326843 325127 323154 321410 319567 317533 315641 313946 312210
61397C12210j616j032p03j465k859l535k941j822j058p65o30m49j11M17R51J213
$$ 312210 310594 309562 308859 307394 304535 301000 298059 296237 295179 294414 293784 293335 293224 293641 294592 295805
61381B95805J222J193R98K03j147k232k227j222l4P16J109J508J921K043J812
$$ 295805 297027 298220 299218 299421 298274 296042 293815 292593 292559 293275 294384 295892 297813 299856 301668
61366C01668J617J726J827J473Q76P30J186J595J445J090J071J240J172J137J919
$$ 301668 303285 305011 306838 308311 309187 309917 311103 312698 314143 315233 316304 317544 318716 319853 321772
61351C21772L592N167N696N324M976N273O017O593O603O131N526N006M478L746
$$ 321772 325364 330531 336227 341551 346527 351800 357817 364410 371013 377144 382670 387676 392154 395900
61337C95900K813J878J178Q78J124J974L279M590N293M915L532J837O28J12j29
$$ 395900 398713 400591 401769 402647 403771 405745 409024 413614 418907 423822 427354 429191 429819 429931 429802
61322D29802n80j324k112k561k347j578r11q49r05r7J624L174L827M096M639N175
$$ 429802 429222 427898 425786 423225 420878 419300 418389 417540 416635 416538 418162 421336 425163 429259 433898 439073
61306D39073N262N436O544Q334R741J0333J0519J0525J0186R588Q899P600N026
$$ 439073 444335 449771 456315 464649 474390 484723 495242 505767 515953 525541 534440 542040 547066
61293E47066J785o29j830k985m863o656p467p771q455r298r434q750p879p187
$$ 547066 548851 548222 546392 543407 538544 531888 524421 516650 508195 498897 489463 480713 472834 465647
61279D65647o638o285o124n737m858l894l266k658j672p30l40L6J251K883L649
$$ 465647 459009 452724 446600 440863 436005 432111 428845 426187 424515 423785 423445 423481 424732 427615 431264
61264D31264L366L168L607L853L284K689L117M357N399N851O100O433O677O541
$$ 431264 434630 437798 441405 445258 448542 451231 454348 458705 464104 469955 476055 482488 489165 495706
61250D95706N880M738L484K664K428K445K520K854L399L543K875J813R01l3j325
$$ 495706 501586 506324 509808 512472 514900 517345 519865 522719 526118 529661 532536 534349 535250 535217 533892
61235E33892k511k763k185j888k619l882m570m038k514q36J35K68L58J235K695
$$ 533892 531381 528618 526433 524545 521926 518044 513474 509436 506922 506086 506221 506489 506847 508082 510777
61220E10777L818M232M444M844N123N030M995N480O140O305N984N683N408M605
$$ 510777 514595 518827 523271 528115 533238 538268 543263 548743 554883 561188 567172 572855 578263 582868
61206E82868L192J979J666J928J945J576J430J829K321K413K353K785L825M996
$$ 582868 586060 588039 589705 591633 593578 595154 596584 598413 600734 603147 605500 608285 612110 617106
61192F17106O091P554R703J1890J2903J2184J0345Q389O703M973K952J018r6r1
$$ 617106 623197 630751 640454 652344 665247 677431 687776 696165 702868 707841 710793 711811 711715 711624
61178G11624N16Q71N82p8q34j877l371m713m927l920k852k867l734m266l926l423
$$ 711624 712140 713011 713593 713515 712681 710804 707433 702720 697793 693873 691021 688154 684420 680154 676228 672805
61162F72805l646m532n437o187p139q251q775q267p394p262q074q972r166q671
$$ 672805 669159 664627 659190 653003 645864 637613 628838 620571 613177 605915 597841 588869 579703 571032
61148E71032p800o558m929l374k474k245k312k651l597n098o438p020o962o696
$$ 571032 563232 556674 551745 548371 545897 543652 541340 538689 535092 529994 523556 516536 509574 502878
61134E02878o318n731n089m678m378l751k668j554p89k04P04K124L788N345O697
$$ 502878 496560 490829 485740 481062 476684 472933 470265 468711 467922 467718 468422 470546 474334 479679 486376
61119D86376P866Q816R545J0321J1568J3394J5385J7009J8127J8978J9757K0462
$$ 486376 494242 503058 512603 522924 534492 547886 563271 580280 598407 617385 637142 657604
61107F57604K1090K1687K2107K1992K1215K0196J9524J9247J8796J7605J5643
$$ 657604 678694 700381 722488 744480 765695 785891 805415 824662 843458 861063 876706
61096H76706J3173J0181O421K107j747m192n435o693q763j1193j3112j4442j5735
$$ 876706 889879 900060 906481 908588 906841 902649 897214 890521 881758 870565 857453 843011 827276
61083H27276j7090j7989j8193j8169j8357j8588j8486j8048j7429j6549j5269
$$ 827276 810186 792197 774004 755835 737478 718890 700404 682356 664927 648378 633109
61072F33109j3725j2183j0781r676r095q881q296o806m824l295k604k342j912
$$ 633109 619384 607201 596420 586744 577649 568768 560472 553666 548842 545547 542943 540601 538689
61059E38689r91M66K133L329L684L695M145M999N522N557N941P386R525J1491
$$ 538689 537698 538164 540297 543626 547310 551005 555150 560149 565671 571228 577169 584555 594080 605571
61045F05571J2922J4033J5009J5922J6953J8305J9898K1558K3414K5768K8555
$$ 605571 618493 632526 647535 663457 680410 698715 718613 740171 763585 789353 817908
61034H17908L1195L3145L4565L6317L9183M2963M6479M8681M9651N0247N0933
$$ 817908 849103 882248 916813 953130 992313 1035276 1081755 1130436 1180087 1230334 1281267
61023A281267N1569N2312N4071N7727O3373P0616P9076Q8255R7546J07054J18060
$$ 1281267 1332836 1385148 1439219 1496946 1560319 1630935 1710011 1798266 1895812 2002866 2120926
61012B120926J32202J50786J75590K09665K56211L16992L92966M85865N97362
$$ 2120926 2253128 2403914 2579504 2789169 3045380 3362372 3755338 4241203 4838565
61003D838565P27047Q73981J040655J230931J439171J641541J800684J877970
$$ 4838565 5565612 6439593 7480248 8711179 10150350 11791891 13592575 15470545
60995A5470545J838488J650755J300855Q24583L24146o7163k58193k49753j19465
$$ 15470545 17309033 18959788 20260643 21085226 21409372 21342209 21084016 20834263 20714798
60986B0714798L2504J20246P5373j48926n49486j048874j518094j841151j968951
$$ 20714798 20747302 20867548 20942921 20793995 20244509 19195635 17677541 15836390 13867439
60977A3867439j922796j759530j536836j298701j074111q78097p14258n80034
$$ 13867439 11944643 10185113 8648277 7349576 6275465 5397368 4683110 4103076
60969D103076m71523l84754l15398k59580k14925j79960j52924j31801j15080
$$ 4103076 3631553 3246799 2931401 2671821 2456896 2276936 2124012 1992211 1877131
60960A877131j01738r0634q0586p0928o1559n2454m3567l5058k7335k0786j5686
$$ 1877131 1775393 1684759 1604173 1533245 1471686 1419232 1375665 1340607 1313272 1292486 1276800
60949A276800j2157r950q354o674m756k865j129N89K348L983N246N852N440L877
$$ 1276800 1264643 1254693 1246339 1239665 1234909 1232044 1230915 1231504 1233852 1237835 1243081 1248933 1254373 1258250
60935A258250J543j061l998p714j2097j6291j9694k2686k5932k9274l1818l2967
$$ 1258250 1259793 1258732 1254734 1247020 1234923 1218632 1198938 1176252 1150320 1121046 1089228 1056261
60923A056261l2954l2428l1900l1523l1088l0173k8652k6994k5798k5058k4235
$$ 1056261 1023307 990879 958979 927456 896368 866195 837543 810549 784751 759693 735458
60912G35458k2948k1311j9569j7841j6246j4880j3581j2055j0356q862p734o771
$$ 735458 712510 691199 671630 653789 637543 622663 609082 597027 586671 577809 570075 563304
60900E63304n879n192m622l739k407j030L1Q14J272J093M55K42P86R83l44k555
$$ 563304 557425 552233 547611 543872 541465 540435 540466 541280 542552 543645 544100 544342 545128 546111 545767 543212
60884E43212l850l709l536m562o237p255p298o966o632o164n557n083m887m939
$$ 543212 539362 535653 532117 527555 521318 514063 506765 499799 493167 487003 481446 476363 471476 466537
60870D66537n193n426n107m039k900k566k995l359l305l291l559l515k681j659
$$ 466537 461344 455918 450811 446772 443872 441306 438311 434952 431647 428356 424797 421282 418601 416942
60856D16942j455k078k578k381j937j857k055k105j945j733j349p33n00j415l096
$$ 416942 415487 413409 410831 408450 406513 404656 402601 400496 398551 396818 395469 394736 394236 392821 389725
60841C89725l998l212j703j142j861k746k935k753k754k782k446j987j936k220
$$ 389725 385727 382515 380812 379670 377809 375063 372128 369375 366621 363839 361393 359406 357470 355250
60827C55250k217j624p76r5L11M57L58K85O87J586K320K284J775J654K159K486
$$ 355250 353033 351409 350633 350538 350849 351306 351664 351949 352636 354222 356542 358826 360601 362255 364414 366900
60811C66900J771K14j117j437q85j16L09R2p76j826k277j786q82l47l34m61n49
$$ 366900 368671 368885 367768 366331 365446 365330 365639 365731 364955 363129 360852 359066 358184 357837 357503 357042 356493
60794C56493p72j096j204j101j324k193l224l601l090k225j719j886k516l150
$$ 356493 355721 354625 353421 352320 350996 348803 345579 341978 338888 336663 334944 333058 330542 327392
60780C27392l530l765l957l812k958j627n73k14k72l82n66q58r83p32k67L17J233
$$ 327392 323862 320097 316140 312328 309370 307743 307170 306956 306684 306302 305736 304878 303895 303163 302896 303213 304446
60763C04446K410L138K922K282K024K102J991J781J954K184J558K06l90P01K494
$$ 304446 306856 309994 312916 315198 317222 319324 321315 323096 325050 327234 328792 328998 328608 329309 331803
60748C31803L324K906K319K410K997L517L713L527K921K017J050nj425l217m870
$$ 331803 335127 338033 340352 342762 345759 349276 352989 356516 359437 361454 362504 362499 361074 357857 352987
60733C52987n864o229o386o507o393n953n471n183m887m298l602l217l067k621
$$ 352987 347123 340894 334508 328001 321608 315655 310184 305001 300114 295816 292214 288997 285930 283309
60719B83309j830j364j642k125k130j816j695j650j249p72q66j196o74P62J731
$$ 283309 281479 280115 278473 276348 274218 272402 270707 269057 267808 267036 266170 264974 264300 265062 266793
60704B66793J365O08O81J186R30L2j93O42J340R00n7l26K78R95J397J764K385
$$ 266793 268158 268766 269447 270633 271563 271595 271402 272044 273384 274284 274227 273901 274179 275174 276571 278335 280720
60687B80720K997L121K652K025J874K476L436M004L801L181K778K875L321L879
$$ 280720 283717 286838 289490 291515 293389 295865 299301 303305 307106 310287 313065 315940 319261 323140
60673C23140M390M600M286L657L339L659M053L645K299P15o03j905l372m363m147
$$ 323140 327530 332130 336416 340073 343412 347071 351124 354769 357068 357783 357180 355275 351903 347540 343393
60658C43393l132k550k876l329l145k550k127j844j363p71l57J5O48J321J516
$$ 343393 340261 337711 334835 331506 328361 325811 323684 321840 320477 319706 319349 319364 320012 321333 322849
60643C22849J254J063J109R70L53n00j254j860k357k639k668k582k507k471k533
$$ 322849 324103 325166 326275 327245 327598 327098 325844 323984 321627 318988 316320 313738 311231 308760 306227
60628C06227k709k759k383j669r86m51Q5M95L79k17n86j75O70J134Q64K48p0K19
$$ 306227 303518 300759 298376 296707 295721 295270 295355 295850 296229 296012 295426 295251 295921 297055 297919 298167 298097 298316
60610B98316Q75J372J453J360J346J129L56n71p33J08J171J699J698J433Q54j
$$ 298316 299191 300563 302016 303376 304722 305851 306207 305636 304903 305011 306182 307881 309579 311012 311866 311865
60594C11865o37o99m50j51M60J496K257K048J288R23J025Q11p0j157j992k472
$$ 311865 311228 310529 310079 309928 310388 311884 314141 316189 317477 318400 319425 320236 320166 319009 317017 314545
60578C14545k296j077P33J903J824J231J174J873L000M406O054P648Q906R867
$$ 314545 312249 311172 311905 313808 315632 316863 318037 319910 322910 327316 333370 341018 349924 359791
60564C59791J0542J0619R936Q905P930O778M994K683L64j728l652n309o500p282
$$ 359791 370333 380952 390888 399793 407723 414501 419495 422178 422542 420814 417162 411853 405353 398071
60550C98071p717p374n722l065m75J287K344L230M341N965Q196J0541J2118J2614
$$ 398071 390354 382980 377258 374193 373718 375005 377349 380579 384920 390885 399081 409622 421740 434354
60536D34354J2686J3077J3674J3780J3024J1541R516O988M054R21k165m823o525
$$ 434354 447040 460117 473791 487571 500595 512136 521652 528640 532694 533615 531450 526627 520102
60523E20102p075o936o721o458n746m615l653l234l054k667k038j387p67j57L85
$$ 520102 513027 506091 499370 492912 487166 482551 478898 475664 472610 469943 467905 466518 465751 465594 465979
60508D65979R26J736K813L642L945M439O207R316J2665J5464J8260K1991K6484
$$ 465979 466905 468641 471454 475096 479041 483480 489687 499003 511668 527132 545392 567383 593867
60495E93867L0459L2994L4420L5621L6824L7380L6484L3830K9585K4058J7525
$$ 593867 624326 657320 691740 727361 764185 801565 838049 871879 901464 925522 943047
60484I43047J0250K438n795j4250k2391k9501l5153l9407m2342m3558m2529l9437
$$ 943047 953297 955735 949940 935690 913299 883798 848645 809238 766896 723338 680809 641372
60472F41372l5378l1558k8435k5681k2781j9619j6626j4420j3144j2216j0974
$$ 641372 605994 574436 546001 520320 497539 477920 461294 446874 433730 421514 410540
60461D10540r500q388p655o560m776l175k829l588m342m395l940l228k186r64
$$ 410540 401040 392652 384997 378437 373661 370486 367657 364069 359727 355332 351392 348164 345978 345014
60447C45014j86k62q64j386j596j557j369j169j125j119q50m27m14r69j394j028
$$ 345014 344828 344566 343702 342316 340720 339163 337794 336625 335500 334381 333531 333104 332690 331721 330327 329299
60431C29299j74L58L57J92J3l57p94q93o71o02p95p52k35K98M66O22J157J628
$$ 329299 329125 329483 329840 330032 330045 329688 328894 328001 327330 326728 325933 325181 324946 325244 325710 326332 327489 329117
60413C29117J246J07p39n14N42J688K403K418J586K13q20q20j19K77o6n34l73
$$ 329117 330363 330470 329731 329217 329759 331447 333850 336268 337854 338067 337247 336427 336308 336585 336519 335985 335612
60396C35612L42J008J422J947K720L277L119K389J677J396J576K145K999L808
$$ 335612 335954 336962 338384 340331 343051 346328 349447 351836 353513 354909 356485 358630 361629 365437
60382C65437M070L556K545J538Q63O26Q06J243J573J502J169J116J704K725L566
$$ 365437 369507 373063 375608 377146 378009 378635 379441 380684 382257 383759 384928 386044 387748 390473 394039
60367C94039L746L197K225J390J257J922K707K702J803R84J227K427L639M283
$$ 394039 397785 400982 403207 404597 405854 407776 410483 413185 414988 415972 417199 419626 423265 427548
60353D27548M650N238O094O975P861Q971J0393J1792J2439J1634R343O364L592
$$ 427548 432198 437436 443530 450505 458366 467337 477730 489522 501961 513595 522938 529302 532894
60340E32894J106j613m609p148q662r407r813r739q905p693o857o518o070n051
$$ 532894 534000 532387 527778 520630 511968 502561 492748 483009 474104 466411 459554 453036 446966 441915
60326D41915l661k413j676j544j878k423l069l799m274l821k238l02J083J913
$$ 441915 438254 435841 434165 432621 430743 428320 425251 421452 417178 413357 411119 410817 411900 413813
60312D13813K718L498L918M378N829Q348J0883J2762J4623J7256K0271K2508K3288
$$ 413813 416531 420029 423947 428325 434154 442502 453385 466147 480770 498026 518297 540805 564093
60299E64093K2564K0277J6257J0601L705l856j1189j7146k1082k3283k4288k4137
$$ 564093 586657 606934 623191 633792 637497 633641 622452 605306 584224 560941 536653 512516
60287E12516k2712k0402j7738j4744j1281p886n425m008k938j797q98n43n56o97
$$ 512516 489804 469402 451664 436920 425639 417753 412328 408320 405382 403585 402687 402144 401588 400891
60273D00891r49j146r03k59J54n3m79o82r42j734k765l239k989k691k798k866
$$ 400891 399942 398796 397893 397634 397788 397735 397256 396574 395632 393898 391133 387894 384905 382214 379416 376550
60257C76550k232j029l9K71J92J91K73J89J5J00M68O54L19k47n33m46k38J6M34
$$ 376550 374318 373289 373250 373521 373713 373904 374177 374366 374381 374481 374949 375603 375922 375675 375142 374696 374458 374474 374908
60238C74908Q56Q32K92j54J23R57J560J445R32O64Q54J132J133R51R32J144J363
$$ 374908 375764 376596 376888 376734 376857 377814 379374 380819 381751 382415 383269 384401 385534 386485 387417 388561 389924
60221C89924J476J562J511J031K98J62J155K515K885K012J148J504K857M019M348
$$ 389924 391400 392962 394473 395504 395802 395964 397119 399634 402519 404531 405679 407183 410040 414059 418407
60206D18407M248M347M730N089N271N410N616N710N333M377L306K970L834N308
$$ 418407 422655 427002 431732 436821 442092 447502 453118 458828 464161 468538 471844 474814 478648 483956
60192D83956O074N365L867K991L176L387K575J103J11j74n63j368j883j724j683
$$ 483956 490030 495395 499262 502253 505429 508816 511391 512494 512605 512431 511868 510500 508617 506893 505210
60177E05210k438l336l461l249l816n003n487m829m068l946l883l258k644k756
$$ 505210 502772 499436 495975 492726 488910 483907 478420 473591 469523 465577 461694 458436 455792 453036
60163D53036l112k733j701j004j090j480j707j829j948j906j599j138o15MO63
$$ 453036 449924 447191 445490 444486 443396 441916 440209 438380 436432 434526 432927 431789 431174 431178 431841
60148D31841J238J700K005J932J383P26M84P18J091J391J638J828J942K226K952
$$ 431841 433079 434779 436784 438716 440099 440825 441309 442027 443118 444509 446147 447975 449917 452143 455095
60133D55095L982M912N583O010N968N225M194L599L406K782J419K11J16Q58J433
$$ 455095 459077 463989 469572 475582 481550 486775 490969 494568 497974 500756 502175 502386 502502 503360 504793
60118E04793J505J575J893J985J415N03n7K6N47J240J990K592K661J964P70k46
$$ 504793 506298 507873 509766 511751 513166 513669 513612 513638 514185 515425 517415 520007 522668 524632 525402 525156
60102E25156n34o0P60J407J482Q42k77j313j812j854j905k215k580k761k804k788
$$ 525156 524622 524562 525322 526729 528211 529053 528776 527463 525651 523797 521892 519677 517097 514336 511532 508744
60086E08744k485j669o47m3MM3M97R90Q95K39l76p37j249k109k807k831k469k331
$$ 508744 506259 504590 503943 503900 503904 503947 504444 505434 506329 506568 506192 505455 504206 502097 499290 496459 493990 491659
60068D91659k454k468k497l140m462n660o046n825n593n528n468n367n217m833
$$ 491659 489205 486737 484240 481100 476638 470978 464932 459107 453514 447986 442518 437151 431934 427101
60054D27101m139l472l195l117k782k153j623j346r69j18J114K209K590K150J550
$$ 427101 422962 419490 416295 413178 410396 408243 406620 405274 404305 404187 405301 407510 410100 412250 413800
60039D13800J769L005M308M704M419M408M862M936M009K572J565J326J537J785
$$ 413800 415569 418574 422882 427586 432005 436413 441275 446211 450220 452792 454357 455683 457220 459005
60025D59005J783J304K76j068k387l489m344m958n311n317m898m237l842m116
$$ 459005 460788 462092 462368 461300 458913 455424 451080 446122 440811 435494 430596 426359 422517 418401
60011D18401m883n568n832n700n203m309l283k651k659k989l188l066k694k255
$$ 418401 413518 407950 402118 396418 391215 386906 383623 380972 378313 375324 372136 369070 366376 364121
59997C64121j982j953j931j673j329j155r42k25Q89J733K006K114K394K609K484
$$ 364121 362139 360186 358255 356582 355253 354098 353156 352931 353820 355553 357559 359673 362067 364676 367160
59982C67160K186J954J765J639J722J830J476O87J44J05q9q17j365j085o45j043
$$ 367160 369346 371300 373065 374704 376426 378256 379732 380419 380563 380668 380579 379762 378397 377312 376667 375624
59966C75624j900k000j260q21j169j414q75j98l02r98j381j054l70J90L38Kn36
$$ 375624 373724 371724 370464 369643 368474 367060 366185 365987 365685 364687 363306 362252 361882 362072 362410 362412 361876
59949C61876p36m08m8j96o46o53J65J402K290K393J925J466J302J082L56o28j078
$$ 361876 361140 360732 360684 360488 359842 359189 359354 360756 363046 365439 367364 368830 370132 371214 371570 370942 369864
59932C69864o77m7J13q5p5K35L99K56K83R58K039K766K705K241K195L014M393
$$ 369864 369187 369140 369253 369168 369093 369328 369727 369983 370266 371224 373263 376029 378734 380975 383170 386184 390577
59915C90577N632O228O163N823N693N902N889M823K584J55j269j426r25l52L1
$$ 390577 396209 402437 408600 414423 420116 426018 431907 436730 439314 439469 438200 436774 435849 435497 435528
59900D35528j7o08j227j090k32L49kp23r16n08oM48J046J643J894K017K682L948
$$ 435528 435511 434903 433676 432586 432354 432703 432701 431978 431062 430554 430548 430996 432042 433685 435579 437596 440278 444226
59882D44226M894M740L864L278L372L692L887M277N146N934N710M401L006K320
$$ 444226 449120 453860 457724 461002 464374 468066 471953 476230 481376 487310 493020 497421 500427 502747
59868E02747J965J055n38k138l245l923m269m198l844l580l321k487r25O13J422
$$ 502747 504712 505767 505229 503091 499846 495923 491654 487456 483612 480032 476711 474224 473299 473912 475334
59853D75334J748K286L184M097M954N952P002P682P719P068N635L467J082q59
$$ 475334 477082 479368 482552 486649 491603 497555 504557 512239 519958 527026 532661 536128 537210 536351
59839E36351k231l291l953l771k833k082k524m288o596q370q888q270p327o629
$$ 536351 534120 530829 526876 523105 520272 518190 515666 511378 504782 496412 487524 479254 471927 465298
59825D65298n847m439k771j818j701j438m55N42P39M40L51K96k85j008q68J20
$$ 465298 459451 455012 452241 450423 448722 447284 446829 447371 448110 448550 448901 449197 448912 447904 447036 447156
59809D47156P69M44p9J3K78j98j383k478l114l490l571l053k128j474j361j469
$$ 447156 447925 448369 448290 448303 448581 448383 447000 444522 441408 437918 434347 431294 429166 427692 426331 424862
59793D24862j758k628l874m303l137j230j30k41o48n98k87j64k91n73j008j421
$$ 424862 423104 420476 416602 412299 409162 407932 407802 407561 406913 406315 406028 405864 405573 405000 403992 402571
59777D02571j472j180r41q75o66k72j89o07r32n72K23Q89J419K082K690K912L019
$$ 402571 401099 399919 398978 398103 397437 397165 396976 396369 395437 394865 395088 395977 397396 399478 402168 405080 408099
59760D08099L504M104L995L018J942J393J246J195J283J519J668J722K098L004
$$ 408099 411603 415707 419702 422720 424662 426055 427301 428496 429779 431298 432966 434688 436786 439790
59746D39790M012M619M729M356L378K004J011R26J377J757K121K749L197K663
$$ 439790 443802 448421 453150 457506 460884 462888 463899 464825 466202 467959 470080 472829 476026 478689
59732D78689J300L12N27J484K138J936R17o04k002k466j760o59j06j16pL87M26
$$ 478689 479989 480301 480828 482312 484450 486386 487303 486699 484697 482231 480471 479812 479706 479590 479583 479970 480396
59715D80396k27r06q01k03j60r86j765j600q43n59j030j348o57P24J676J544P06
$$ 480396 480169 479263 478462 478259 478099 477113 475348 473748 472905 472346 471316 469968 469311 470035 471711 473255 473961
59698D73961p6m27m39k26K08P69J188J363J570K078K644K653J857P19j07m39n74
$$ 473961 473885 473458 473019 472793 473001 473770 474958 476321 477891 479969 482613 485266 487123 487842 487735 487296 486722
59681D86722p50r24r53q01n56l92n06r52j589k267k960l597l940l891l719l719
$$ 486722 485972 485048 484095 483294 482738 482346 481840 480888 479299 477032 474072 470475 466535 462644 458925 455206
59665D55206l782l660l441l371l277k765j971j502j494j320n78K35N25N59J048
$$ 455206 451424 447764 444323 440952 437675 434910 432939 431437 429943 428623 428045 428280 428805 429364 430412
59650D30412K031K831L002K761K458K216K178K551L140L235K329P62o43j435j789
$$ 430412 432443 435274 438276 441037 443495 445711 447889 450440 453580 456815 459144 459906 459263 457828 456039
59635D56039k054k385k819l347l778l764l187k344j572q56j27K53j82j130j572
$$ 456039 453985 451600 448781 445434 441656 437892 434705 432361 430789 429933 429806 430059 429877 428747 427175
59620D27175j024k03l4m18o57p24j246k310l130l171k802k535k241j554n68L47
$$ 427175 426151 425948 425914 425496 424839 424115 422869 420559 417429 414258 411456 408921 406680 405126 404558 404905
59604D04905J056J578J823J751J537J251P57J82Q6P69J727K216K025J332K78q34
$$ 404905 405961 407539 409362 411113 412650 413901 414658 414840 414926 415695 417422 419638 421663 422995 423273 422439
59588D22439j312p44L76J169J330J071N33j81o95p46o61q59j163j266j529k394
$$ 422439 421127 420383 420759 421928 423258 424329 424862 424681 423986 423240 422579 421720 420557 419291 417762 415368
59572D15368l347l423k712k233k292k056j012J96Q37J008J001N96l04j103j235
$$ 415368 412021 408598 405886 403653 401361 399305 398293 398489 399326 400334 401335 401931 401627 400524 399289
59557C99289r46o94k97N80J520J666Q65j56o04k58O32J631K297K511K587K967
$$ 399289 398343 397649 397352 397932 399452 401118 401983 401827 401223 400965 401597 403228 405525 408036 410623 413590
59541D13590L845N140O596P940R138J0527J2344J4230J5621J6409J6484J4800
$$ 413590 417435 422575 429171 437111 446249 456776 469120 483350 498971 515380 531864 546664
59529E46664J0072K776m579r740j2390j3075j1735q459m697k235j268o73N6M45
$$ 546664 556736 559512 554933 545193 532803 519728 507993 499534 494837 492602 491334 490661 490717 491162
59515D91162L93N44J053J169M74m06q49j176k006l292m495n357n984o470o810
$$ 491162 491555 492099 493152 494321 494795 494389 493540 492364 490358 487066 482571 477214 471230 464760 457950
59500D57950o967o836o297n400m371l352k413j753j554j713j950k169k356k256
$$ 457950 450983 444147 437850 432450 428079 424727 422314 420561 419007 417294 415344 413175 410819 408563
59486D08563j605o01K66Q49J328J719J868J932K281K891L350L484L520L628L805
$$ 408563 406958 406357 406623 407472 408800 410519 412387 414319 416600 419491 422841 426325 429845 433473 437278
59471D37278M161M722M994M435L334K584K441K291J723J059O54L95K05K98O51
$$ 437278 441439 446161 451155 455590 458924 461508 463949 466240 467963 469022 469676 470071 470276 470574 471225
59456D71225Q66Q28Q76J161J531K215L638N367O242O088O156P231Q382Q465P738
$$ 471225 472091 472919 473795 474956 476487 478702 482340 487707 493949 500037 506193 513424 521806 530271 538009
59441E38009O865N367K480j033l505m562n292o275o863o590o030n837n826n475
$$ 538009 544874 550241 552721 551688 548183 543621 538329 532054 525191 518601 512571 506734 500908 495433
59427D95433m650l529k394j750j916k309j722L43L133N621P525R158J0773J2417
$$ 495433 490783 487254 484860 483110 481194 478885 477163 477506 480639 486260 493785 502943 513716 526133
59413E26133J4179J6247J8791K1720K4399K5870K5632K3894K0649J5159P135j852
$$ 526133 540312 556559 575350 597070 621469 647339 672971 696865 717514 732673 739808 737956
59401G37956r221j3482j4712j3289r501m433J62L302M962M572P97o376j4563k0955
$$ 737956 728735 715253 700541 687252 677751 673318 673480 676782 681744 686316 687113 680737 666174 645219
59387F45219k4582k5806k4793k1720j7727j4167j1227q383n797m104l075j803
$$ 645219 620637 594831 570038 548318 530591 516424 505197 496814 491017 486913 483838 482035
59375D82035j60J060J529J825K339K757K840K813K756K462K174K562L595M300
$$ 482035 481875 482935 484464 486289 488628 491385 494225 497038 499794 502256 504430 506992 510587 514887
59361E14887M085L576L651M276M807M906M625M127L777M049M855N457N547N790
$$ 514887 518972 522548 526199 530475 535282 540188 544813 548940 552717 556766 561621 567078 572625 578415
59347E78415O742P782P976P551P545Q280R082R511R828J0152J0058R384Q674Q293
$$ 578415 585157 592939 600915 608466 616011 624291 633373 642884 652712 662864 672922 682306 690980 699273
59333F99273P761O466M585K725R74j031l355n596p459q930r919j0267j0206j0299
$$ 699273 707034 713500 718085 720810 721784 720753 717398 711802 704343 695413 685494 675227 665021 654722
59319F54722j0676j0773j0120r053q196p481o257m413k780k135k162j873p90O85
$$ 654722 644046 633273 623153 614100 605904 598423 592166 587753 584973 582838 580676 578803 578013 578698
59305E78698K086L492N190P088Q787J0009J0705J0801J0053Q073M420j083p736
$$ 578698 580784 584276 589466 596554 605341 615350 626055 636856 646909 654982 659402 658319 650583
59292F50583j3879j7880j9273j8765j7226j5168j3048j1369j0174q870p039n059
$$ 650583 636704 618824 599551 580786 563560 548392 535344 523975 513801 504931 497892 492833
59280D92833l529k466j526p71n45o40l21P31J999K892L426L956M604N322O193
$$ 492833 489304 486838 485312 484541 483996 483356 483035 483766 485765 488657 492083 496039 500643 505965 512158
59265E12158P286Q411R298R924J0332J0325R652Q378O742M800K520J88j718l097
$$ 512158 519444 527855 537153 547077 557409 567734 577386 585764 592506 597306 599826 600014 598296 595199
59251E95199m335n684o841p365p298p118p130p163o874o194n313m344l134j564
$$ 595199 590864 585180 578339 570974 563676 556558 549428 542265 535391 529197 523884 519540 516406 514842
59237E14842Q0J253J766K035K572L348L879L900L695L747M228M939N554N787N405
$$ 514842 514922 516175 517941 519976 522548 525896 529775 533675 537370 541117 545345 550284 555838 561625 567030
59222E67030M279K519N22j191k253k639k574k306k038k020k478l353m194m544
$$ 567030 571309 573828 574350 573159 570906 568267 565693 563387 561349 559329 556851 553498 549304 544760
59208E44760m349l909l454k959k355j741j313j118j055j057j199j495j648j286
$$ 544760 540411 536502 533048 530089 527734 525993 524680 523562 522507 521450 520251 518756 517108 515822
59194E15822n70k38p16j428j427o78j23m12j176j778k052j967j226J37J268J439
$$ 515822 515252 515014 514298 512870 511443 510765 510642 510230 509054 507276 505224 503257 502031 502168 503436 504875
59178E04875J099J225J876K280K180K137K432K646K561K646L236L939M316M559
$$ 504875 505974 507199 509075 511355 513535 515672 518104 520750 523311 525957 529193 533132 537448 542007
59164E42007N079N896O780P545P948P767P283P068P052O464N020L412K082M65
$$ 542007 547086 552982 559762 567307 575255 583022 590305 597373 604425 610889 615909 619321 621403 621868
59150F21868j802l740m196l690l865n321p056q037q222q001p580p159o963o813
$$ 621868 620066 616326 612130 608440 604575 599254 592198 584161 575939 567938 560358 553199 546236 539423
59136E39423o374n964o309p359q100p912p272o744o029m615k738j088k2M15J61
$$ 539423 533049 527085 520776 513417 505317 497405 490133 483389 477360 472745 470007 468919 468897 469312 469473
59121D69473n27q23j07J245K461L443M582N753O337O237O131O521P174P687Q042
$$ 469473 468946 468123 468016 469261 471722 475165 479747 485500 491837 498074 504205 510726 517900 525587 533629
59106E33629Q264Q084P296O179N166M391L859L789M312M963M964M072K833J873
$$ 533629 541893 549977 557273 563452 568618 573009 576868 580657 584969 589932 594896 598968 601801 603674
59092F03674J279Q10L98J60N7j32n58j138j635j785j414p27l58q73k124l385m196
$$ 603674 604953 605763 606161 606321 606378 606246 605688 604550 602915 601130 599716 598989 598631 597758 595634 592249 588053
59075E88053m812n649o625p323p631p744p632p018n971n122m929m949m313k954
$$ 588053 583241 577592 570967 563644 556013 548269 540637 533619 527648 522526 517597 512648 508335 505381
59061E05381j869j919k649k827k078j376j671k577l031k755k332j987j295k30
$$ 505381 503512 501593 498944 496117 494039 492663 490992 488415 485384 482629 480297 478310 477015 476785
59047D76785M57L89K16M67M71o16k193k713j636lR57R34K70n56r62o27j9Q8j59
$$ 476785 477242 477631 477847 478314 478785 478169 475976 473263 471627 471624 472581 473515 473785 473229 472267 471640 471621 471709 471550
59028D71550K16J525K841L379L534L999M641N080N663O896Q324R040R072R267
$$ 471550 471766 473291 476132 479511 483045 487044 491685 496765 502428 509324 517648 526688 535760 545027
59014E45027R841J0010R254Q125P340O728N582L667J531l0n83m11l51j037k071
$$ 545027 554868 564878 574132 582257 589597 596325 601907 605574 607105 607075 606492 606081 605730 604693 602622
58999F02622k315j193O47K208L263M194N048N446N411N492N819N640M414K860
$$ 602622 600307 599114 599761 601969 605232 609426 614474 619920 625331 630823 636642 642282 646696 649556
58985F49556K170K294J974O78m79l79L05K6j360k338j823l56J106K531M284O055
$$ 649556 651726 654020 655994 656672 656193 655814 656119 656145 654785 652447 650624 650268 651374 653905 658189 664244
58969F64244P205P763Q302Q990R500R709R844R968R927R854J0153J0794J1102
$$ 664244 671449 679212 687514 696504 706004 715713 725557 735525 745452 755306 765459 776253 787355
58956G87355J0475R051P448O034M605K717K20k510m897o673p984r046r951j0806
$$ 787355 797830 806881 814329 820363 824968 827685 827905 825395 820498 813825 805841 796795 786844 776038
58942G76038j1615j2039j1686j0852j0340j0286r859q590p306o990p275p031o083
$$ 776038 764423 752384 740698 729846 719506 709220 699361 690771 683465 676475 669200 662169 656086
58929F56086n297n086m941m415l683k992k369k080k413k916k699j730r19p65q75
$$ 656086 650789 645703 640762 636347 632664 629672 627303 625223 622810 619894 617195 615465 614546 613781 612906
58914F12906j077j739k528k146k48J519J537M46J35J176K634L911N289O784P944
$$ 612906 611829 610090 607562 605416 605168 606687 608224 608670 608805 609981 612615 616526 621815 628599 636543
58899F36543Q836J0029J1329J1786J1287J0948J1392J1791J1259J0274R812R837
$$ 636543 645379 655408 666737 678523 689810 700758 712150 723941 735200 745474 755286 765123
58887G65123R720R608J0340J2099J3995J5072J5143J4632J4025J3507J2768J1205
$$ 765123 774843 784451 794791 806890 820885 835957 851100 865732 879757 893264 906032 917237
58875I17237Q676N858L486J461q35l562o362r130j2031j4694j6107j5803j4595
$$ 917237 925913 931771 935257 936718 935883 932321 925959 916829 904798 890104 873997 858194 843599
58862H43599j3728j3603j3637j3052j1529r385p478o622o851p467q020q781r910
$$ 843599 829871 816268 802631 789579 778050 768665 761187 754565 747714 740247 732227 723446 713536
58849G13536j0713j0442r483q963r336j0015j0376j0301r716q412o668n273m624
$$ 713536 702823 692381 682898 673935 664599 654584 644208 633907 624191 615779 609111 603838 599214
58836E99214m378m276m550n126n273m711m274m661n202m906m153m092m569m149
$$ 599214 594836 590560 586010 580884 575611 570900 566626 561965 556763 551857 547704 543612 539043 534894
58822E34894k313l37N45O59J020J866K811L704M518M962M965M997N274N128M080
$$ 534894 532581 532244 532789 533448 534468 536334 539145 542849 547367 552329 557294 562291 567565 572693 576773
58807E76773K988L013L795L806K578J324J042J127N13p24j766k500l568n131o492
$$ 576773 579761 582774 586569 590375 592953 594277 595319 596446 596959 596235 594469 591969 588401 583270 576778
58792E76778p075p137p177p158o709n803m827m028l318k660k245k011j356J97
$$ 576778 569703 562566 555389 548231 541522 535719 530892 526864 523546 520886 518641 516630 515274 515471
58778E15471K198L597L920L672L480L289K747J868Q90k49j681l080l925m299m810
$$ 515471 517669 521266 525186 528858 532338 535627 538374 540242 541132 540883 539202 536122 532197 527898 523088
58763E23088n611o047n581m651m160m360m641m357l557k745k205j760j171n10
$$ 523088 517477 511430 505849 501198 497038 492678 488037 483680 480123 477378 475173 473413 472242 471732
58749D71732PM82J270K361L152L097K458K088K515L473M282M501M161L728L721
$$ 471732 471739 472221 473491 475852 479004 482101 484559 486647 489162 492635 496917 501418 505579 509307 513028
58734E13028M300N120N718N885N615M937M147L875M478N431N834N476M916M615
$$ 513028 517328 522448 528166 534051 539666 544603 548750 552625 557103 562534 568368 573844 578760 583375
58720E83375M434M105L634L186K970L277M114M804M653M088M373N879P447P925
$$ 583375 587809 591914 595548 598734 601704 604981 609095 613899 618552 622640 627013 632892 640339 648264
58706F48264P547P107O501N056K832O27j157k758m316n750p380r707j2409j4328
$$ 648264 655811 662918 669419 674475 677307 677934 676777 674019 669703 663953 656573 646866 634457 620129
58692F20129j4830j4531j4341j4377j4151j3348j2010j0376q865p870p220o286
$$ 620129 605299 590768 576427 562050 547899 534551 522541 512165 503300 495430 488210 481924
58680D81924m916l838l669l939l685k802k082k002k125j820j041j38P09J493K114
$$ 481924 477008 473170 469501 465562 461877 459075 456993 454991 452866 451046 450005 449867 450576 452069 454183
58665D54183K491K863L616M775N937O747P262P594P404O168L982J703P4j027k145
$$ 454183 456674 459537 463153 467928 473865 480612 487874 495468 502872 509040 513022 514725 514799 513772 511627
58650E11627l314m027m011l501k747j777q97q14j833l228l896l517k694k143k035
$$ 511627 508313 504286 500275 496774 494027 492250 491353 490539 488706 485478 481582 478065 475371 473228 471193
58635D71193k059j772r47J51R30J159J376K183L316L894L618L204L327L632L187
$$ 471193 469134 467362 466415 466566 467496 468655 470031 472214 475530 479424 483042 486246 489573 493205 496392
58620D96392J746P5r27j132j014q54l84P19K253L579M255M315L983L422K887K770
$$ 496392 498138 498213 497286 496154 495140 494286 493902 494621 496874 500453 504708 509023 513006 516428 519315 522085
58604E22085L138L474L193K308J285M00l86j008j293j358j556j889j940j536j098
$$ 522085 525223 528697 531890 534198 535483 535883 535497 534489 533196 531838 530282 528393 526453 524917 523819
58589E23819j024j110q76k20N74J333K131L054M005M842N519O169O995P941Q513
$$ 523819 522795 521685 520809 520589 521163 522496 524627 527681 531686 536528 542047 548216 555211 563152 571665
58574E71665Q218P294O568O459O484O073N447N250N629O216O902P968R434J0838
$$ 571665 579883 587177 593745 600204 606688 612761 618208 623458 629087 635303 642205 650173 659607 670445
58560F70445J1905J3074J4994J7606K0042K1442K1686K1320K0709J9530J7190
$$ 670445 682350 695424 710418 728024 748066 769508 791194 812514 833223 852753 869943
58549H69943J3678R704N971K596n77l480n844p456q145p862p037o574p022q068
$$ 869943 883621 893325 899296 901892 901315 897835 891991 884535 876390 868528 861491 854917 847895 839827
58535H39827r227j0736j3011j5488j6878j6717j5882j5333j4904j3833j1950r798
$$ 839827 830600 819864 806853 791365 774487 757770 741888 726555 711651 697818 685868 676070
58523F76070p902o329m960l764k786k056j527j130r06j024j474j873j814j406
$$ 676070 668168 661839 656879 653115 650329 648273 646746 645616 644710 643686 642212 640339 638525 637119
58509F37119j141j249j513j684j705j535j198r93j142j306r69l87l89j086j567
$$ 637119 635978 634729 633216 631532 629827 628292 627094 626101 624959 623653 622684 622297 621908 620822 619255
58494F19255j240o59n73q18q22n66k81K39J215K172K467K332K530L218L943M578
$$ 619255 618015 617356 616783 615965 615143 614577 614296 614535 615750 617922 620389 622721 625251 628469 632412 636990
58478F36990N377O186O546O644P292Q747J0315J1344J1867J2004J1468J0034P939
$$ 636990 642367 648553 655099 661743 669035 677782 688097 699441 711308 723312 734780 744814 752753
58465G52753N460K680j06k339l908n249o403o622n440l547j998r20K87J917L721
$$ 752753 758213 760893 760787 758448 754540 749291 742888 736266 730826 727279 725281 724361 724648 726565 730286
58450G30286N440O921P880Q203Q315Q627Q651P381M644J439j223l320n309p132
$$ 730286 735726 742647 750527 758730 767045 775672 784323 791704 796348 797787 796564 793244 787935 780803
58436G80803q184q109p261o247n264l966k030K66K180L241L720M203M937N794
$$ 780803 772619 764510 757249 751002 745738 741772 739742 740008 742188 745429 749149 753352 758289 764083
58422G64083O715P787Q862R452R222Q405P534O870O243N396M280K935J281p85
$$ 764083 770798 778585 787447 796899 806121 814526 822060 828930 835173 840569 844849 847784 849065 848280
58408H48280l058n052o409p162p436p171o391n544n121m964m391l079j449j35
$$ 848280 845222 840170 833761 826599 819163 811992 805601 800057 794936 789972 785581 782502 781053 780918
58394G80918O14Q94R64J223J956K929L635M085M776N748O301O079N664N555N233
$$ 780918 781532 782426 783390 784613 786569 789498 793133 797218 801994 807742 814043 820122 825786 831341 836574
58379H36574M092K730K253K580K570J834J268J576K311K818L286M226N494O433
$$ 836574 840666 843396 845649 848229 850799 852633 853901 855477 857788 860606 863892 868118 873612 880045
58365H80045O661O283N653N300N745O974Q362R333R837R987R828R720J0351J1764
$$ 880045 886706 892989 898642 903942 909687 916661 925023 934356 944193 954180 964008 973728 984079 995843
58351I95843J2793J2172J0025P688O228N688N562N388M810L777K851K899M154
$$ 995843 1008636 1020808 1030833 1038521 1044749 1050437 1055999 1061387 1066197 1069974 1072825 1075724 1079878
58338A079878N947P490Q643R736J0882J1786J2226J2477J3104J4347J5810J6901
$$ 1079878 1085825 1093315 1101958 1111694 1122576 1134362 1146588 1159065 1172169 1186516 1202326 1219227
58326A219227J7459J7690J7627J7028J5936J4732J3504J1840R712P964P370P552
$$ 1219227 1236686 1254376 1272003 1289031 1304967 1319699 1333203 1345043 1354755 1362719 1370089 1377641
58314A377641P511O945O391O288O706P795R579J1337J2149J2257J2912J4498J5831
$$ 1377641 1385152 1392097 1398488 1404776 1411482 1419277 1428856 1440193 1452342 1464599 1477511 1492009 1507840
58301A507840J5940J5633J6308J7854J8859J8742J8508J9152K0276K0832K0636
$$ 1507840 1523780 1539413 1555721 1573575 1592434 1611176 1629684 1648836 1669112 1689944 1710580
58290A710580K0422K0642K0933K0883K0810K1416K2849K4556K6074K7570K9308
$$ 1710580 1731002 1751644 1772577 1793460 1814270 1835686 1858535 1883091 1909165 1936735 1966043
58279A966043L1009L2087L2465L2670L3216L4171L5294L6279L6918L7391L8330
$$ 1966043 1997052 2029139 2061604 2094274 2127490 2161661 2196955 2233234 2270152 2307543 2345873
58268B345873M0207M2760M5382M7893N0443N2814N4611N6059N7798N9844O1683
$$ 2345873 2386080 2428840 2474222 2522115 2572558 2625372 2679983 2736042 2793840 2853684 2915367
58257B915367O3498O6284P0279P4315P7333P9670Q2126Q4603Q6609Q8353R0409
$$ 2915367 2978865 3045149 3115428 3189743 3267076 3346746 3428872 3513475 3600084 3688437 3778846
58246C778846R2674R4767R7044J00418J05327J11560J18741J26324J33612J40635
$$ 3778846 3871520 3966287 4063331 4163749 4269076 4380636 4499377 4625701 4759313 4899948
58236D899948J48481J57929J68178J77983J87520J98051K10145K23462K37958
$$ 4899948 5048429 5206358 5374536 5552519 5740039 5938090 6148235 6371697 6609655
58227F609655K54054K71720K90683L11429L34819L60809L88775M19055M52989
$$ 6609655 6863709 7135429 7426112 7737541 8072360 8433169 8821944 9240999 9693988
58218I693988M91335N33876N80597O32222O89705P54270Q27784R11974J007647
$$ 9693988 10185323 10719199 11299796 11932018 12621723 13375993 14203777 15115751 16123398
58209A6123398J116025J240455J385405J554418J750770J979757K249092K568540
$$ 16123398 17239423 18479878 19865283 21419701 23170471 25150228 27399320 29967860
58201B9967860K951856L418732L993526M704797N589731O696539Q075900R767569
$$ 29967860 32919716 36338448 40331974 45036771 50626502 57323041 65398941 75166510
58193G5166510J1794739J4165129J6870798J9890018K3188550K6686041L0163384
$$ 75166510 86961249 101126378 117997176 137887194 161075744 187761785 217925169
58186B17925169L3169489L5036108L5022126L2480758K6969057J8371794P127669
$$ 217925169 251094658 286130766 321152892 353633650 380602707 398974501 406102170
58179D06102170n573773j7921602k8041927l4683336l7575107l7283236l4778148
$$ 406102170 400528397 382606795 354564868 319881532 282306425 245023189 210245041
58172B10245041l1039324k6848550k2736188j9002623j5773577j3065405j0837265
$$ 210245041 179205717 152357167 129620979 110618356 94844779 81779374 70942109
58165G0942109r022697p549235o351479n375371m576049l916529l368736k912535
$$ 70942109 61919412 54370177 48018698 42643327 38067278 34150749 30782013 27869478
58157B7869478k532323k214906j949247j725800j535812j372319j231099j109090
$$ 27869478 25337155 23122249 21173002 19447202 17911390 16539071 15307972 14198882
58149A4198882j002247r06174q18415p38701o67236o03729n47646m98235m54499
$$ 14198882 13196635 12290461 11472046 10733345 10066109 9462380 8914734 8416499 7962000
58140G962000m15950l83094l56328l34709l16500l00355k85235k69857k53442
$$ 7962000 7546050 7162956 6806628 6471919 6155419 5855064 5569829 5299972 5046530
58131E046530k36674k20865k06279j92141j78173j65172j53963j44489j36103
$$ 5046530 4809856 4588991 4382712 4190571 4012398 3847226 3693263 3548774 3412671
58122C412671j28296j20980j14340j08493j03161r7916r2764q8162q4242q0523
$$ 3412671 3284375 3163395 3049055 2940562 2837401 2739485 2646721 2558559 2474317 2393794
58112B393794p6608p2732o9241o6001o2711n9449n6489n3916n1688m9720m7719
$$ 2393794 2317186 2244454 2175213 2109212 2046501 1987052 1930563 1876647 1824959 1775239 1727520
58101A727520m5377m2977m1281m0456l9693l8314l6664l5495l4909l4471l3840
$$ 1727520 1682143 1639166 1597885 1557429 1517736 1479422 1442758 1407263 1372354 1337883 1304043
58090A304043l2791l1004k8427k5531k2839k0529j8862j8362j9068k0083k0537
$$ 1304043 1271252 1240248 1211821 1186290 1163451 1142922 1124060 1105698 1086630 1066547 1046010
58079A046010k0542k0678k0954k0927k0463j9695j8552j7078j5879j5598j6047
$$ 1046010 1025468 1004790 983836 962909 942446 922751 904199 887121 871242 855644 839597
58068H39597j6425j6263j5675j4932j4293j3900j3440j2284j0515r222r104r379
$$ 839597 823172 806909 791234 776302 762009 748109 734669 722385 711870 702648 693544 684165
58056F84165q923q013p814q549r316r594r691r699r250q502q229q506q348p146
$$ 684165 675242 667229 659415 650866 641550 631956 622265 612566 603316 594814 586585 578079 569731 562585
58042E62585n585m649m497m842n587o462o738o099n292n234n822o308o411o472
$$ 562585 557000 552351 547854 543012 537425 530963 524225 518126 512834 507600 501778 495470 489059 482587
58028D82587o769p354q337r646j0681j0840j0324r774r239q264p004o373o732
$$ 482587 475818 468464 460127 450481 439800 428960 418636 408862 399623 391359 384355 377982 371250
58015C71250p171o722n716n168n153m711l458k305k199k784l053k800k709l138
$$ 371250 364079 357357 351641 346473 341320 336609 333151 330846 328647 325863 322810 320010 317301 314163
58001C14163l664l836l686l198k032j83J644K773L290L660M044M494N388O922
$$ 314163 310499 306663 302977 299779 297747 297564 299208 301981 305271 308931 312975 317469 322857 329779
57987C29779Q367Q550P113M827K626Q37o18j834k909l935m812n324n440n300m923
$$ 329779 338146 346696 353809 358636 361262 362099 361481 359647 356738 352803 347991 342667 337227 331927 327004
57972C27004m279l604l301l377l417l104k526j872j209o35k83l3M44J209J789
$$ 327004 322725 319121 315820 312443 309026 305922 303396 301524 300315 299680 299397 299364 299808 301017 302806
57957C02806J678Q48k70j226j857k281k657k920k908k792l099l948m540l933k247
$$ 302806 304484 305332 305062 303836 301979 299698 297041 294121 291213 288421 285322 281374 276834 272901 270654
57942B70654o09J99M71R28J833K970M013M648M714M571M924N990P056P237O470
$$ 270654 270045 270244 270715 271643 273476 276446 280459 285107 289821 294392 299316 305306 312362 319599 326069
57927C26069N434M651L985L010J577n1j483k540l323l985m500m759m825m901n088
$$ 326069 331503 336154 340139 343149 344726 344675 343192 340652 337329 333344 328844 324085 319260 314359 309271
57912C09271n250n142m523l272j633k32M07M22L85N54O43L54k28q66j488k105
$$ 309271 304021 298879 294356 291084 289451 289219 289626 290048 290433 290987 291630 291984 291756 290890 289402 287297
57896B87297k611k774k373j433m42j91j004k199k753k494k145k215k334j914j016
$$ 287297 284686 281912 279539 278106 277664 277473 276469 274270 271517 269023 266878 264663 262329 260415 259399
57881B59399j94J43Kl75o63o74n42n98r12j220j357j469j667j781j615j234q37
$$ 259399 259205 259348 259350 258975 258312 257638 257096 256498 255586 254366 253009 251540 249873 248092 246477 245243 244406
57864B44406o20p39j111j220o24L29P99O15N66J246K284L122L959N180O325O444
$$ 244406 243786 243047 241936 240716 240092 240421 241220 241835 242401 243647 245931 249053 253012 258192 264517 270961
57848B70961N385M024L049K170Q00q71j926j831j200j208k267l577m153l992l781
$$ 270961 276346 280370 283419 285589 286389 285518 283592 281761 280561 279353 277086 273509 269356 265364 261583
57833B61583l821l830l759l893m097l754k843k206k278k343j716q99o99q18l27
$$ 261583 257762 253932 250173 246280 242183 238429 235586 233380 231102 228759 227043 226144 225445 224627 224300
57818B24300Q48J962K678L229L437K755J360J34o94j967m147o303p211o870o272
$$ 224300 225148 227110 229788 233017 236454 239209 240569 240703 240009 238042 233895 227592 220381 213511 207239
57803B07239o082o063n647m581l166k037j632j689j549r90m05r4J90P09J298J759
$$ 207239 201157 195094 189447 184866 181700 179663 178031 176342 174793 173803 173398 173304 173494 174203 175501 177260
57787A77260K260K930L397L280K872K813L257L823M224M464M520M368M304M664
$$ 177260 179520 182450 185847 189127 191999 194812 198069 201892 206116 210580 215100 219468 223772 228436
57773B28436N160N035M069L006K588K645K429J596L88q92k141l206l868m201m562
$$ 228436 233596 238631 242700 245706 248294 250939 253368 254964 255352 254460 252319 249113 245245 241044 236482
57758B36482n173n924o658p274p442o659m935l095j973j496j042m48o0J22O26
$$ 236482 231309 225385 218727 211453 204011 197352 192417 189322 187349 185853 184811 184363 184303 184425 185051
57743A85051J565K209J940J222J064J743K590K987L090L417M046M466M124L096
$$ 185051 186616 188825 190765 191987 193051 194794 197384 200371 203461 206878 210924 215390 219514 222610
57729B22610K140J955K441K816K529J752Q72n2j041j761j808j337r40r69j322
$$ 222610 224750 226705 229146 231962 234491 236243 237115 237063 236022 234261 232453 231116 230176 229207 227885
57714B27885j807k375k927l280l332l151k871k699k826l107l032k489k216k954
$$ 227885 226078 223703 220776 217496 214164 211013 208142 205443 202617 199510 196478 193989 191773 188819
57700A88819m151m322k863q97K1m37j378j885j710j115n97o62j402k253k543k262
$$ 188819 184668 180346 177483 176586 176607 176170 174792 172907 171197 170082 169485 168823 167421 165168 162625 160363
57684A60363j937j768j328k85R58J741K111K862M509O585Q282R599J1372J4182
$$ 160363 158426 156658 155330 155045 156003 157744 159855 162717 167226 173811 182093 191692 203064 217246
57670B17246J7696K1379K5408L0321L5866M0726M3516M3597M0701L4198K3242
$$ 217246 234942 256321 281729 312050 347916 388642 432158 475755 516456 550654 573896
57659E73896P877j0020k7003l9566m5891m6488m3326l8400l2955k7569k2462j7758
$$ 573896 581773 571753 544750 505184 459293 412805 369479 331079 298124 270555 248093 230335
57647B30335j3757j0922r309q185o654m659k987k176j942j731j366q80j57Q23
$$ 230335 216578 205656 196347 188162 181508 176849 173862 171686 169744 168013 166647 165767 165610 166433
57633A66433J615J604O91m89j024m59P40J450R44l34j344j755k141k842l313k975
$$ 166433 168048 169652 170343 169854 168830 168371 169111 170561 171505 171171 169827 168072 165931 163089 159776 156801
57617A56801k111j382r23m95j95l11p28j099j455j987k357j973j021n03r49j735
$$ 156801 154690 153308 152385 151890 151695 151384 150656 149557 148102 146115 143758 141785 140764 140261 139312 137577
57601A37577j975j663j479j846k499k895k706k060j431j199j314j492j682j971
$$ 137577 135602 133939 132460 130614 128115 125220 122514 120454 119023 117824 116510 115018 113336 111365
57587A11365k126j707q30k48m01q27q45l96J91Q15J405J454M94j039k082k144
$$ 111365 109239 107532 106702 106454 106053 105226 104381 103985 104176 104991 106396 107850 108344 107305 105223 103079
57571A03079j670j205q22n20n46q60q93k84M27M04l57j039j062o96n06n64m59
$$ 103079 101409 100204 99382 98862 98316 97456 96563 96279 96706 97110 96753 95714 94652 93956 93450 92886 92427
57554I2427R9Q68J370J461J490J787K166K146J658J183J026Q83L21n41j195j342
$$ 92427 92526 93394 94764 96225 97715 99502 101668 103814 105472 106655 107681 108564 108885 108344 107149 105807
57538A05807r76j51R01J584J381N28j87l17j48j97p36j716k743l077k223o29O35
$$ 105807 104831 104680 105581 107165 108546 109074 108887 108570 108422 108225 107489 105773 103030 99953 97730 97101 97736
57521I7736R91O79K4r16j788j887j141m99p32j376j565j326j214j129n46K26J29
$$ 97736 98727 99406 99430 98514 96726 94839 93698 93199 92467 91091 89526 88200 86986 85857 85311 85537 85666
57504H5666j076k270k360j502n74p5mk74o95r08q57j018j718k457k447j677q90
$$ 85666 84590 82320 79960 78458 77884 77809 77805 77531 76836 75928 75071 74053 72335 69878 67431 65754 64864
57487F4864n36k82K88R76J252R60L94k36r70j756k238k179j835j585j363q73l46
$$ 64864 64328 64046 64334 65310 66562 67522 67916 67680 66710 64954 62716 60537 58702 57117 55754 54881 54535
57470E4535m96j456k330k212j375p96p86p67m09j17k15k82J37O82O73K59L48J322
$$ 54535 54039 52583 50253 48041 46666 45870 45084 44317 43908 43791 43576 43294 43431 44113 44786 45045 45393 46715
57452D6715K383K471J551N11k7k89o18o92m1R12J106K45o82p80m67p04j424j567
$$ 46715 49098 51569 53120 53631 53604 53315 52697 52005 51964 52876 53982 54227 53545 52765 52298 51594 50170 48603
57434D8603o34O01J094P00P5j22K94J050J639J713J370R09M38j4k02P4N08N40
$$ 48603 47969 48570 49664 50364 50439 50317 50611 51661 53300 55013 56383 57292 57730 57716 57514 57588 58096 58636
57416E8636O1o01j234j722j622n58R09J677J501J186J199J068N15J27K25L4j064
$$ 58636 58697 58096 56862 55140 53518 52960 53869 55546 57047 58233 59432 60500 61015 61142 61367 61401 60337
57399F0337k198k044p59J76j01r85j438j062j03R22J508J567J522J657J634J125
$$ 60337 58139 56095 55336 55512 55411 54426 52988 51926 51823 52745 54253 55820 57342 58999 60633 61758
57383F1758N91P05J321J797K095K653L306L329K619J834J270N46l18o09j94n7
$$ 61758 62349 63054 64375 66172 68267 70920 74226 77555 80174 82008 83278 83824 83506 82897 82703 82646
57367H2646r55k210k661k301k105k574l191l212k470j386n48k40j43K72R68J300
$$ 82646 81691 79481 76820 74519 72414 69840 66649 63437 60967 59581 59033 58793 58650 58922 59890 61190
57351F1190J007P18J025J475J205K59l95j82M10N72J12n32q84q32o03m82n32o32
$$ 61190 62197 62915 63940 65415 66620 66879 66484 66302 66712 67284 67396 66864 65980 65148 64545 64063 63531 62899
57333F2899p04p36n18J73R67J022K13l93R9R62P35o17j527j049j82l58j496k348
$$ 62899 62195 61459 60941 61114 62081 63103 63316 62923 63022 63984 64719 64102 62575 61526 61344 60986 59490 57142
57315E7142k306j870j517j090m07K06L31K2l65o58r29j163j132n97L26J082J153
$$ 57142 54836 52966 51449 50359 49952 50158 50489 50511 50146 49488 48559 47396 46264 45667 45993 47075 48228
57298D8228P58P05J348J992J804J014N79Q19J168J345J826K797L491L284K721
$$ 48228 48986 49691 51039 53031 54835 55849 56428 57247 58415 59760 61586 64383 67874 71158 73879
57283G3879K698L114L239L093L418M348N077M970M245L357K565K242K734L516
$$ 73879 76577 79691 82930 86023 89441 93789 98866 103836 108081 111438 114003 116245 118979 122495
57269A22495L312J642m39j725k323l052l989m496m352l905l339k579j939k003
$$ 122495 125807 127449 127010 125285 122962 119910 115921 111425 107073 103168 99829 97250 95311 93308
57255I3308k681l128k769j859q72j1N22L58m56j152j004j84M87M71l1m47m03j1
$$ 93308 90627 87499 84730 82871 81999 81988 82510 82868 82412 81260 80256 80072 80559 81030 80999 80552 80149 80138
57237H0138L14L61M29Q84J495J545P71k04n43l0R77K021K731K823K357J835J727
$$ 80138 80452 80813 81242 82126 83621 85166 85937 85733 85190 85160 86137 88158 90889 93712 96069 97904 99631
57220I9631J920K003J926J953K024J673P46j93m93j92J65L03M05N55M23k25r72
$$ 99631 101551 103554 105480 107433 109457 111130 111876 111683 111190 110998 111163 111466 111871 112426 112849 112624 111652
57203A11652j066k35J041K075K540K543K356K239K310K484K584K585K562K361
$$ 111652 110586 110351 111392 113467 116007 118550 120906 123145 125455 127939 130523 133108 135670 138031
57189A38031J627L96o10n95M20J600K160K030J663J391J187Q72M86L40O78J352
$$ 138031 139658 140054 139444 138849 139269 140869 143029 145059 146722 148113 149300 150172 150658 150998 151676 153028
57173A53028J950K321K773L693N052O398P266P496P338P282P631Q112Q067P133
$$ 153028 154978 157299 160072 163765 168817 175215 182481 189977 197315 204597 212228 220340 228407 235540
57159B35540N661M394L906M384N619P061Q161Q897R733J0912J2147J3177J4240
$$ 235540 241201 245595 249501 253885 259504 266565 274726 283623 293356 304268 316415 329592 343832
57146C43832J5631J7229J8861K0746K2987K4882K5507K4937K4248K4293K4913
$$ 343832 359463 376692 395553 416299 439286 464168 489675 514612 538860 563153 588066
57135E88066K5534K5978K6567K7697K9519L1809L4110L6123L7926L9650M1177
$$ 588066 613600 639578 666145 693842 723361 755170 789280 825403 863329 902979 944156
57124I44156M2472M4021M6514N0130N4423N8703O2268O4624O5951O7217O9343
$$ 944156 986628 1030649 1077163 1127293 1181716 1240419 1302687 1367311 1433262 1500479 1569822
57113A569822P2432P6183Q0691Q6234R2659R9737J07939J18221J31194J47192
$$ 1569822 1642254 1718437 1799128 1885362 1978021 2077758 2185697 2303918 2435112 2582304
57103B582304J66817J90594K18479K50807K89612L38029L98422M72053N60261
$$ 2582304 2749121 2939715 3158194 3409001 3698613 4036642 4435064 4907117 5467378
57094E467378O64556P85389R21552J070187J225634J378712J519127J638730J730638
$$ 5467378 6131934 6917323 7838875 8909062 10134696 11513408 13032535 14671265 16401903
57085A6401903J786654J800742J776989J729216J667555J586621J470884J311104
$$ 16401903 18188557 19989299 21766288 23495504 25163059 26749680 28220564 29531668
57077B9531668J111860Q83591O31924L56020N3524k75101o23503r76393j309951
$$ 29531668 30643528 31527119 32159043 32515063 32568587 32293486 31669983 30693590 29383639
57068B9383639j598365j821980j970616k042317k041852j980035j871503j731198
$$ 29383639 27785274 25963294 23992678 21950361 19908509 17928474 16056971 14325773
57060A4325773j572287j406152j242461j088498r48906q26134p20613o30787n53979
$$ 14325773 12753486 11347334 10104873 9016375 8067469 7241335 6520722 5889935 5335956
57051E335956m87862m30982l82134l39909l03066k70816k42484k17198j94159
$$ 5335956 4848094 4417112 4034978 3695069 3392003 3121187 2878703 2661505 2467346
57042B467346j73042j53868j36607j20943j06392r2589p9536o7509n6640m6520
$$ 2467346 2294304 2140436 2003829 1882886 1776494 1683905 1604369 1536860 1480220 1433700
57032A433700l6278k5181j3342j873P842J5078J9775K1253J7404N948j2940l5554
$$ 1433700 1397422 1372241 1358899 1357026 1364868 1379946 1399721 1420974 1438378 1444326 1431386 1395832
57020A395832n6416p1246p8584p9404p5765o9568o2057n4067m6467m0041l5004
$$ 1395832 1339416 1268170 1189586 1110182 1034417 964849 902792 848725 802258 762217 727213
57009G27213l1024k7765k5069k2618j9994j7382j5642j5291j5735j5984j5711
$$ 727213 696189 668424 643355 620737 600743 583361 567719 552428 536693 520709 504998
56998E04998j5218j4639j3842j2841j1742j0311q309o163m709m130l696k789j550
$$ 504998 489780 475141 461299 448458 436716 426405 418096 411933 407224 403094 399398 396609 395059
56985C95059l03J149L116N258O714O878N711L441L94k974o207r103j1557j3267
$$ 395059 394756 395905 399021 404279 410993 417871 423582 427023 427417 424443 418236 409133 397576 384309
56971C84309j3886j3461j2411j1008r250p223n185l138p36K060M631O357P471
$$ 384309 370423 356962 344551 333543 324293 317070 311885 308747 308011 310071 314702 321059 328530
56958C28530Q783J0662J2622J3880J3918J2515R639N515N59m764r905j4133j6795
$$ 328530 337313 347975 360597 374477 388395 400910 410549 416064 416623 411859 401954 387821 371026
56945C71026j7774j7375j5853j3379j0464p869n850l910j497J353M310P293J0432
$$ 371026 353252 335877 320024 306645 296181 288312 282462 278552 277055 278408 282718 290011 300443
56932C00443J3756J7138K0234K2307K2418K0103J5612R328J531p057j5024k1157
$$ 300443 314199 331337 351571 373878 396296 416399 432011 441339 442870 435813 420789 399632
56920C99632k5176k7215k7120k5015k1995j9309j7042j4461j1563r321q304p931
$$ 399632 374456 347241 320121 295106 273111 253802 236760 222299 210736 201415 193111 185180
56908A85180p398o615n912n390m928m393l579k317q10N11J497K302K936L440M447
$$ 185180 177782 171167 165255 159865 154937 150544 146965 144648 143838 144349 145846 148148 151084 154524 158971
56893A58971O685R764J2343J3841J5198J7366J9938K1937K3340K4757K6063K6162
$$ 158971 165656 175420 187763 201604 216802 234168 254106 276043 299383 324140 350203 376365
56881C76365K4002J9251J2280M246l009q058j0914j2472j3042j2268j0310q103
$$ 376365 400367 419618 431898 436144 433135 425077 414163 401691 388649 376381 366071 357968
56869C57968o083l562J70M749R369J3993J9144K4811L0295L5179L9609M3250M4577
$$ 357968 351885 348323 348493 353242 362611 376604 395748 420559 450854 486033 525642 568892 613469
56856F13469M1892L4870K4619J2292j529j5790k8069l5720l7950l6203l2444k7586
$$ 613469 655361 690231 714850 727142 725613 709823 681754 646034 608084 571881 539437 511851
56844E11851k1693j4904p612p1P659J5566K3748L2390M1338M9986N7846O4898
$$ 511851 490158 475254 467642 467571 475230 490796 514544 546934 588272 638258 696104 761002
56832G61002P0804P4028P2300O4013M8914K7821K546k3744m6975o3740p2673p4426
$$ 761002 831806 905834 978134 1042147 1091061 1118882 1121428 1097684 1050709 986969 914296 839870
56820H39870p0701o3411n4216m4278l4227k4351j4739n368L724J2289K0114K7413
$$ 839870 769169 705758 651542 607264 573037 548686 533947 528579 532303 544592 564706 592119
56808E92119L4617M1666M7656N1298N1438M7079L7383K2319L292j7101l6000n0988
$$ 592119 626736 668402 716058 767356 818794 865873 903256 925575 928867 911766 875766 824778
56796H24778o0313o3260o0615n4484m7168l9962l2979k5942j8875j2195o284j155
$$ 824778 764465 701205 640590 586106 538938 498976 465997 440055 421180 408985 402701 401546
56784D01546L696Q946J4764K0356K4427K6238K5982K3978J9842J2880L178q063
$$ 401546 405242 414188 428952 449308 473735 499973 525955 549933 569775 582655 585833 577770
56772E77770j9178k8642l5196l8182l8016l5945l2969k9334k5169k1099j7767
$$ 577770 558592 529950 494754 456572 418556 382611 349642 320308 295139 274040 256273
56761B56273j5120j2696j0395q522p204o257n550n020m431l614k937l078m049
$$ 256273 241153 228457 218062 209540 202336 196079 190529 185509 181078 177464 174527 171449 167400
56748A67400m911m710l479k105j398j467j888k192k179j936j607j238p86k74J33
$$ 167400 162489 157779 154300 152195 150797 149330 147442 145250 143071 141135 139528 138290 137504 137230 137363
56733A37363J48m10j256j612r19M08J292J286J034J174J345Q49j16o23k82M73
$$ 137363 137511 137101 135845 134233 133314 133722 135014 136300 137334 138508 139853 140702 140586 139963 139681 140154
56717A40154J261K106K794K753J892R02L12j64r14j610j691j240q23o58n01j25
$$ 140154 141415 143521 146315 149068 150960 151862 152174 152010 151096 149486 147795 146555 145732 145074 144573 144448
56701A44448M52J138J690J725J194O72P79J385J836J783J393Q85L84J51L68O85
$$ 144448 144900 146038 147728 149453 150647 151319 152098 153483 155319 157102 158495 159380 159764 159915 160283 160968
56685A60968N36q6o13p11n81l89K9O44J003Q63N74M99M08j25r90j622j616r68
$$ 160968 161504 161418 160805 160094 159513 159124 159153 159797 160800 161663 162237 162736 163144 163019 162029 160407 158791 157823
56667A57823P3J115J780K058K259K407K094J270O88R44J479J264K77n39p23p89
$$ 157823 157896 159011 160791 162849 165108 167515 169609 170879 171567 172511 173990 175254 175531 174992 174269 173480
56651A73480j154j506j641k021k896l560l240k264j512j122n27K85N87Q8n23n71
$$ 173480 172326 170820 169179 167158 164262 160702 157462 155198 153686 152564 152037 152322 152909 152997 152474 151903
56635A51903l21m36r43j269j055m96N7M10M61J68k84n36l79QK31P8l17o69q25
$$ 151903 151582 151146 150203 148934 147879 147383 147440 147850 148311 148479 148195 147659 147280 147288 147519 147597 147280 146611 145786
56616A45786q45p86n39J7P07J064P13k08j071j219n30M40R38P43K88M8o6l93q05
$$ 145786 144941 144155 143616 143633 144340 145404 146117 145909 144838 143619 143089 143529 144467 145210 145498 145546 145480 145087 144282
56597A44282o89J34R79J040M52J12M41P93L41p10j222m51J124K423K911K815K485
$$ 144282 143593 143727 144706 145746 146198 146310 146751 147544 147885 147175 145953 145502 146626 149049 151960 154775 157260
56580A57260J991J405R75Q45Q89R66J106J227J052O00M47J043J911K104J441P92
$$ 157260 159251 160656 161631 162476 163365 164331 165437 166664 167716 168316 168763 169806 171717 173821 175262 176054
56564A76054J058K223L603M711N553O354P273Q288R180R616R386Q513P101N132
$$ 176054 177112 179335 182938 187649 193202 199556 206829 215117 224297 233913 243299 251812 258913 264045
56550B64045K610j91k678m223m559l953l013k250j800j500j173q12n59n21o40
$$ 264045 266655 266464 263786 259563 255004 251051 248038 245788 243988 242488 241315 240503 239944 239423 238783
56535B38783q08j188k135l477m202l462j867r47j243j697j440j156j861l099l558
$$ 238783 237975 236787 234652 231175 226973 223511 221644 220697 219454 217757 216317 215161 213300 210201 206643
56520B06643l005k361j998j319j86N08J63p02j442k143k850k904j912o83l78j027
$$ 206643 203638 201277 199279 197960 197774 198282 198445 197743 196301 194158 191308 188404 186492 185809 185431 184404
56504A84404j694j767j451j177j163j382j558j325o95q6L56J000J894K297J589
$$ 184404 182710 180943 179492 178315 177152 175770 174212 172887 172192 172106 172462 173462 175356 177653 179242
56489A79242K20q46j254j184o78J95Q07N97N7K34J218K000J900J356J036Q87M54
$$ 179242 179462 178616 177362 176178 175500 175695 176502 177099 177156 177390 178608 180608 182508 183864 184900 185787 186241
56472A86241k99r06r45m57J70O24J006J573K121K067J349P11O98Q67N78N7r8k2
$$ 186241 185942 185036 184091 183634 183804 184428 185434 187007 189128 191195 192544 193255 193953 194820 195398 195455 195357 195335
56454A95335k73p10o41pO12J086J748K294J844M53o07n34j4J9l32n21n42n38j62
$$ 195335 195062 194352 193711 193704 194316 195402 197150 199444 201288 201741 201134 200600 200586 200605 200273 199752 199210 198672 198510
56435A98510P50J479J313P13O23J019J057M71j30l13k28RN01R63P59j85j105j364
$$ 198510 199260 200739 202052 202765 203388 204407 205464 205935 205805 205492 205264 205273 205774 206737 207496 207311 206206 204842
56417B04842j105p51l72P3M30O88J188K038K636K330J345M96J02k09o52q35m24
$$ 204842 203737 202986 202614 202687 203117 203805 204993 207031 209667 211997 213342 213838 213940 213731 213079 212244 211820
56400B11820K49O10N98O18Q68J126J178J110J111J180J178J062J035J409K197
$$ 211820 212069 212679 213277 213895 214763 215889 217067 218177 219288 220468 221646 222708 223743 225152 227349
56385B27349K809K497J315L60N74J523J959J433O59J91k57q77j011r6J238J855
$$ 227349 230158 232655 233970 234330 234904 236427 238386 239819 240478 240669 240412 239535 238524 238428 239666 241521
56369B41521J545J040Q66R64J254J699J891J323K21n42m78J39Q88J496J590R38
$$ 241521 243066 244106 244972 245936 247190 248889 250780 252103 252324 251782 251304 251443 252331 253827 255417 256355
56353B56355J57K27J047J312L48q10q74j33J32l85o69qJ022J466J231R55J067
$$ 256355 256512 256739 257786 259098 259446 258636 257762 257629 257761 257376 256707 256699 257721 259187 260418 261373 262440
56336B62440J434J812K192K616K936L024L030L154L161K638J838J736K801M136
$$ 262440 263874 265686 267878 270494 273430 276454 279484 282638 285799 288437 290275 292011 294812 298948
56322B98948M447L619K619K064J723J347J106R53M27n14j225j294j082r17n37
$$ 298948 303395 307014 309633 311697 313420 314767 315873 316826 317253 316739 315514 314220 313138 312221 311684
56307C11684J49N54L61K90J074K238K877L101L572M053L684K668K308L098M001
$$ 311684 311833 312387 312748 313038 314112 316350 319227 322328 325900 329953 333637 336305 338613 341711 345712
56292C45712M069L712L631L511K783K012K374L870N164N261M649M437M983N712
$$ 345712 349781 353493 357124 360635 363418 365430 367804 371674 376838 382099 386748 391185 396168 401880
56278D01880N977N747N561N960O992Q152Q954R523J0416J1804J3129J3703J3558
$$ 401880 407857 413604 419165 425125 432117 440269 449223 458746 469162 480966 494095 507798 521356
56265E21356J3496J4295J5978J7848J9221K0139K1361K3513K6396K9343L2183
$$ 521356 534852 549147 565125 582973 602194 622333 643694 667207 693603 722946 755129
56254G55129L5492L9769M4786N0055N5621O1999O9490P8007Q7355R7213J06941
$$ 755129 790621 830390 875176 925231 980852 1042851 1112341 1190348 1277703 1374916 1481857
56243A481857J15874J23842J30836J36304J39383J39904J38416J34928J28309
$$ 1481857 1597731 1721573 1852409 1988713 2128096 2268000 2406416 2541344 2669653
56234B669653J17446J02435Q4186O3412M0681J7051o170k8231m9037o8484q6094
$$ 2669653 2787099 2889534 2973720 3037132 3077813 3094864 3088694 3060463 3011426 2942942 2856848
56223B856848j01197j13098j21276j25809j27447j26905j24314j19699j13670
$$ 2856848 2755651 2642553 2521277 2395468 2268021 2141116 2016802 1897103 1783433
56214A783433j07090j00369r3532q6719q0054p3376o6665o0526n5509n1255m7022
$$ 1783433 1676343 1575974 1482442 1395723 1315669 1242293 1175628 1115102 1059593 1008338 961316
56203I61316m2759l8924l5451l1888k8423k5731k3729k1490j8660j6011j4246
$$ 961316 918557 879633 844182 812294 783871 758140 734411 712921 694261 678250 664004
56192F64004j3060j1808j0443r306q545q067p663o959n743m445l751l612l248
$$ 664004 650944 639136 628693 619387 610842 602775 595112 588153 582410 577965 574214 570602 567354
56179E67354k298j306q77r38j109j129p74L1Q40J126J202J925L302M292M333M066
$$ 567354 565056 563750 562873 561935 560826 559697 558923 558954 559794 560920 562122 564047 567349 571641 575974 580040
56163E80040M116M112L650L302L826M946N819O229O599P121P626Q130Q930J0194
$$ 580040 584156 588268 591918 595220 599046 603992 609811 616040 622639 629760 637386 645516 654446 664640
56149F64640J1837J3624J5267J6753J8713K2000K6677L1975L7442M3407N0093
$$ 664640 676477 690101 705368 722121 740834 762834 789511 821486 858928 902335 952428
56138I52428N6955O3325O9008P3842P7224P8449P6953P2067O3548N2848M2874
$$ 952428 1009383 1072708 1141716 1215558 1292782 1371231 1448184 1520251 1583799 1636647 1679521
56127A679521L5735L1350K8573K6563K4400K0628J4577P444R79m424r358j3931
$$ 1679521 1715256 1746606 1775179 1801742 1826142 1846770 1861347 1868791 1869770 1865346 1855988 1842057
56115A842057j8015k2494k8886l7543m7233n6382o3983o9275p1522p0380o6139
$$ 1842057 1824042 1801548 1772662 1735119 1687886 1631504 1567521 1498246 1426724 1356344 1290205
56104A290205n9653n2218m5070l8520l1970k5228j9213j4829j1781r227o950n075
$$ 1290205 1230552 1178334 1133264 1094744 1062774 1037546 1018333 1003504 991723 982496 975546 970471
56092I70471l218j013R93J970K104K333L017L805M604N706P005P923Q260Q450
$$ 970471 967253 966240 967233 969203 971307 973640 976657 980462 985066 990772 997777 1005700 1013960 1022410
56078A022410Q912R612J0315J0849J1194J1531J2060J2661J3096J3515J4214J4834
$$ 1022410 1031322 1040934 1051249 1062098 1073292 1084823 1096883 1109544 1122640 1136155 1150369 1165203
56066A165203J4715J4196J4500J5956J7410J7885J7701J7421J7058J6930J7864
$$ 1165203 1179918 1194114 1208614 1224570 1241980 1259865 1277566 1294987 1312045 1328975 1346839
56055A346839J9602K0504J9951J9546K0590K1954K2145K1956K2922K4345K4237
$$ 1346839 1366441 1386945 1406896 1426442 1447032 1468986 1491131 1513087 1536009 1560354 1584591
56044A584591K2562K1265K1327K1928K2413K3158K4427K5925K7513K9106L0111
$$ 1584591 1607153 1628418 1649745 1671673 1694086 1717244 1741671 1767596 1795109 1824215 1854326
56033A854326L0289L0737L2564L5175L7253L8878M0902M2977M4097M4684M6092
$$ 1854326 1884615 1915352 1947916 1983091 2020344 2059222 2100124 2143101 2187198 2231882 2277974
56022B277974M8282M9928N0673N1456N2762N4312N6403N9709O3802O7461P0351
$$ 2277974 2326256 2376184 2426857 2478313 2531075 2585387 2641790 2701499 2765301 2832762 2903113
56011B903113P3008P5589P8065Q1109Q5202Q9558R3498R7892J03418J08700J12439
$$ 2903113 2976121 3051710 3129775 3210884 3296086 3385644 3479142 3577034 3680452 3789152 3901591
56000C901591J16139J22016J29342J35926J42115J49994J59335J68023J76137
$$ 3901591 4017730 4139746 4269088 4405014 4547129 4697123 4856458 5024481 5200618
55991E200618J85991J98105K10759K23677K38552K55668K73497K92066L13334
$$ 5200618 5386609 5584714 5795473 6019150 6257702 6513370 6786867 7078933 7392267
55982G392267L37805L64085L92169M23725M58987M96788N37928N84933O38368
$$ 7392267 7730072 8094157 8486326 8910051 9369038 9865826 10403754 10988687 11627055
55973A1627055O97161P62580Q37953R24673J022741J135138J267220J422239J602350
$$ 11627055 12324216 13086796 13924749 14849422 15872163 17007301 18274521 19696760 21299110
55964B1299110J813856K066659K369888K734081L176820L720484M387901N209376
$$ 21299110 23112966 25179625 27549513 30283594 33460414 37180898 41568799 46778175
55956D6778175O231522P506891R072837J0947071J3137298J5639604J8430388
$$ 46778175 53009697 60516588 69589425 80536496 93673794 109313398 127743786
55949A27743786K1471413K4694826K7916208L0726368L2499054L2544704L0267595
$$ 127743786 149215199 173910025 201826233 232552601 265051655 297596359 327863954
55942C27863954K5232741J7270090O747668n174067j6691890k5996268l1978116
$$ 327863954 353096695 370366785 377114453 371940386 355248496 329252228 297274112
55935B97274112l4504601l4179000l1900395k8535372k4769617k1067617j7690085
$$ 297274112 262769511 228590511 196690116 168154744 143385127 122317510 104627425
55928A04627425j4749000j2266903j0214313q533191p159792o039194n124534
$$ 104627425 89878425 77611522 67397209 58864018 51704226 45665032 40540498
55921D0540498m373169l750168l231335k798641k435656k129106j870117j650812
$$ 40540498 36167329 32417161 29185826 26387185 23951529 21822423 19952306 18301494
55913A8301494j462634j299405j158368j036553r29502q34698p52438o81863o19516
$$ 18301494 16838860 15539455 14381087 13344534 12415032 11580334 10827896 10146033 9526517
55904I526517n63130n13357m70329m31963l97179l67468l43344l22119l01147
$$ 9526517 8963387 8450030 7979701 7547738 7150559 6783091 6439747 6117628 5816481
55895E816481k80711k61969k44448k27336k11214j96653j82851j69099j56060
$$ 5816481 5535770 5273801 5029353 4802017 4590803 4394150 4211299 4042200 3886140
55886C886140j44347j33342j22665j13361j06565j02230r9905r9410r9945r9952
$$ 3886140 3741793 3608451 3485786 3372425 3265860 3163630 3063725 2964315 2864370 2764418
55876B764418r8602r6226r2904q8124q2234p6632p1978o7824o4390o2738o2505
$$ 2764418 2665816 2569590 2476686 2388562 2306328 2229696 2157718 2089894 2025504 1962766 1900261
55865A900261o1476n8459n4881n2363n0304m7213m3120l9304l6587l5005l4415
$$ 1900261 1838785 1780326 1725445 1673082 1622778 1575565 1532445 1493141 1456554 1421549 1387134
55854A387134l4443l4388l3830l2766l0987k8379k5948k5092k5481k5175k3468
$$ 1387134 1352691 1318303 1284473 1251707 1220720 1192341 1166393 1141301 1115820 1090645 1067177
55843A067177k2020k2276k3356k3678k3234k2925k2718k2009k0932k0007j9041
$$ 1067177 1045157 1022881 999525 975847 952613 929688 906970 884961 864029 844022 824981
55832H24981j7646j6193j5137j3973j2089j0161r416r797j0072r708r465j0002
$$ 824981 807335 791142 776005 762032 749943 739782 730366 720569 710497 700789 691324 681322
55820F81322j0865j1158j0669r989r876j0587j1652j2308j2217j1624j0802r794
$$ 681322 670457 659299 648630 638641 628765 618178 606526 594218 582001 570377 559575 549781
55808E49781q811q314q285p962o741n008l557k567j695q87m77n55p04m86J50Q89
$$ 549781 540970 532656 524371 516409 509668 504660 501103 498536 496841 495954 495477 494922 494218 493732 493882 494771
55792D94771J307J144N58J02K87J133K138K732K759K533K306J795N44j364l464
$$ 494771 496078 497222 497780 497882 498169 499302 501440 504172 506931 509464 511770 513565 514109 512745 509281
55777E09281n907r422j3745j6843j6736j3760j0075p218n078l067j146M38J356
$$ 509281 503374 493952 480207 463364 446628 432868 422793 415575 410497 407430 406284 406722 408078
55764D08078R09j501n330r035j1550j2862j3060j1849r404o780m873l605k582
$$ 408078 408987 407486 402156 393121 381571 368709 355649 343800 334396 327616 322743 319138 316556
55751C16556j869j649j720j819j997k316k659l087l829m627m721l879k763k054
$$ 316556 314687 313038 311318 309499 307502 305186 302527 299440 295611 290984 286263 282384 279621 277567
55737B77567j757j657j699j602r44r4k08j647l229l721l403l327l734m081m194
$$ 277567 275810 274153 272454 270852 269908 269814 269606 267959 264730 261009 257606 254279 250545 246464 242270
55722B42270m362m600m678m718m973n147m634l407j958n47Q57K014K558K722L203
$$ 242270 237908 233308 228630 223912 218939 213792 209158 205751 203793 203246 204103 206117 208675 211397 214600
55707B14600M171M990N062M447L480K243P34p66j870k564l274m361n626o466o616
$$ 214600 218771 223761 228823 233270 236750 238993 239727 238961 237091 234527 231253 226892 221266 214800 208184
55692B08184o486o479o239n135l449k333k329k638k297j477q86m73L89J643K414
$$ 208184 201698 195219 188980 183845 180396 178063 175734 173096 170799 169322 168436 167963 168352 169995 172409
55677A72409K222J581J200J155J144J056R50P62L90r4n34r27j358j809k117k146
$$ 172409 174631 176212 177412 178567 179711 180767 181717 182479 182869 182775 182241 181314 179956 178147 176030 173884
55661A73884j854j311o85k43k55p30j203r84K24J902L110L320K743J880J033K56
$$ 173884 172030 170719 170034 169791 169536 168806 167603 166619 166843 168745 171855 175175 177918 179798 180831 181087
55645A81087m39j003j406j592j490j051l09N70J251J389R52K21o60j882l459m795
$$ 181087 180648 179645 178239 176647 175157 174106 173797 174367 175618 177007 177959 178180 177520 175638 172179 167384
55629A67384n231m869m358l964l431k689k054j616j076m52l63j177k299k728k129
$$ 167384 162153 157284 152926 148962 145531 142842 140788 139172 138096 137644 137281 136104 133805 131077 128948
55614A28948j086m75p48j623k341k383j946j530j244r33q31j365k254k510j624
$$ 128948 127862 127387 126639 125016 122675 120292 118346 116816 115572 114639 113808 112443 110189 107679 106055
55599A06055k28P39Q73J71j241k687l024j856k57M16J13j53J40M44J15p40j523
$$ 106055 105827 106566 107439 107610 106369 103682 100658 98802 98545 98961 99074 98921 99061 99505 99620 98880 97357
55582I7357j835j711j443j310j377j464j271n29Q58K549L779L980L445K986K958
$$ 97357 95522 93811 92368 91058 89681 88217 86946 86417 87275 89824 93603 97583 101028 104014 106972
55567A06972L051K998K875K594J712J17j653k997l671l544k629j624j569k503
$$ 106972 110023 113021 115896 118490 120202 120319 118666 115669 111998 108454 105825 104201 102632 100129
55553A00129l240l023k537k657l028k821k124j571j127m25J90J51o5N31J747K316
$$ 100129 96889 93866 91329 88672 85644 82823 80699 79128 78001 77576 77766 77917 77852 78383 80130 82446
55537H2446J818J220J248J352Q47J04m1N64J409J931J748P21p09j701j870j602
$$ 82446 84264 85484 86732 88084 88931 89035 88994 89558 90967 92898 94646 95367 94658 92957 91087 89485
55521H9485j307r09l85j82n68j082j203j219j747k597k838k045r40n11r04j426
$$ 89485 88178 87269 86884 86702 86134 85052 83849 82630 80883 78286 75448 73403 72463 71952 71048 69622
55505F9622j493j218j014r26o31p2L03J63j51k2N99J187J398J426J488J365P31
$$ 69622 68129 66911 65897 64971 64340 64268 64571 64734 64583 64561 65160 66347 67745 69171 70659 72024 72755
55488G2755k54r77r85m60k5o4l17k80Q4K95J19o8R8L82L85K23K19K64Q9p4J84
$$ 72755 72501 71524 70539 70079 70054 69990 69673 69393 69477 69772 69891 69823 69921 70303 70688 70911 71130 71394 71483 71409 71593
55467G1593N34K23o43j035n44j44p58j812j969r57J50M12j2m29n41m95m32l13
$$ 71593 72127 72350 71707 70672 70128 69984 69226 67414 65445 64488 64638 65050 65038 64609 64068 63573 63141 62828
55449F2828o7K82O26P89O49L39K47N76J007R31J61p58j113p79j80L78R70J576
$$ 62828 62761 63043 63669 64458 65107 65446 65693 66269 67276 68207 68368 67610 66497 65718 65538 65916 66886 68462
55431F8462J795J341N72R3L2N6nJ9J77J57k73q59j133r60p15p78r66o33M99J768
$$ 68462 70257 71598 72170 72263 72295 72351 72346 72365 72542 72699 72426 71567 70434 69474 68759 67981 67015 66382 66881 68649
55411F8649K178J620R15N85J91o96j491j365n23N2k7l13n35q87j253j073l53M0
$$ 68649 70827 72447 73362 73947 74138 73442 71951 70586 70063 70115 70088 69775 69240 68353 67100 66027 65674 65714
55393F5714m65j287j557j242q91p40n92l14Q0O48J318J722J603J211R33P00K02
$$ 65714 65249 63962 62405 61163 60272 59532 58940 58626 58706 59354 60672 62394 63997 65208 66141 66841 67043
55376F7043n32j139j386j211n20O20J628J788R86j69j034j417j484j437j381j216
$$ 67043 66511 65372 63986 62775 62255 62875 64503 66291 67277 67108 66074 64657 63173 61736 60355 59139
55360E9139p45m8L45j6q91j588j756j641j485j166m68N35J546K270K502K259J882
$$ 59139 58394 58346 58691 58675 57784 56196 54440 52799 51314 50148 49680 50215 51761 54031 56533 58792 60674
55343F0674J720J650J213L47m01o04n54p30r59o28L09J034P86k94j399j955j953
$$ 60674 62394 64044 65257 65604 65203 64599 64045 63315 62356 61728 62037 63071 63857 63563 62164 60209 58256
55326E8256j615j062l92J61L91L66L42M23M76L99L69N86R25J020P98O14P36Q59
$$ 58256 56641 55579 55187 55348 55739 56105 56447 56870 57346 57745 58114 58700 59625 60645 61443 62057 62793 63652
55308F3652M95k81q43q32n60m39l78o8L78N29K80qm7L2j1j59k66k74k41k33l24
$$ 63652 64147 63866 63023 62191 61631 61192 60814 60746 61124 61653 61933 61925 61878 61910 61899 61740 61474 61200 60959 60726 60402
55287F0402m62l12M72J685K520K391J633J131J333J842J938J287J50r48j689k126
$$ 60402 59940 59628 60100 61785 64305 66696 68329 69460 70793 72635 74573 75860 76010 75062 73373 71247
55271G1247k439k570k301j586o62K35R93J437J345Q01L25L31O54P65L80l41r85
$$ 71247 68808 66238 63937 62351 61689 61924 62917 64354 65699 66500 66825 67156 67810 68575 68955 68614 67629
55254F7629j178q35k95k6j09j86k1K00K50J81J2m28j034j150l69P79J370J148
$$ 67629 66451 65616 65321 65295 65186 65000 64979 65179 65429 65610 65622 65194 64160 63010 62641 63420 64790 65938
55236F5938M60m76j544k094j325M88J889J782O35k19j06N12Q48O36K24N2J17m
$$ 65938 66398 65922 64378 62284 60959 61447 63336 65118 65753 65534 65428 65940 66788 67424 67648 67700 67817 67813
55218F7813n59j161j190n84R0L31J64j13k88k45O5N13Q25Q65P06M84L23L82P13
$$ 67813 67254 66093 64903 64319 64409 64740 64904 64791 64503 64258 64323 64836 65661 66526 67232 67716 68039 68421 69134
55199F9134J112J263J028M33m08j123j163m35L34M11j7k11j8J24J42M53J063J354
$$ 69134 70246 71509 72537 72970 72562 71439 70276 69841 70175 70586 70569 70358 70340 70464 70606 71059 72122 73476
55181G3476J006L80k65j072j791j599l67O96M68n85j054m45M92R39Q11M19P7O5
$$ 73476 74482 74862 74597 73525 71734 70135 69768 70464 70932 70347 69293 68848 69340 70279 71090 71509 71586 71651
55163G1651M42Q78J036R96R15N45l80j398j675j113m47j85m2L04N18J03p39j214
$$ 71651 72093 72971 74007 75003 75918 76463 76083 74685 73010 71897 71450 71265 71223 71527 72045 72148 71409 70195
55145G0195q47QO27O70M30L90O36Q24P14N07N05N79K87m88j261j405p90J15P12
$$ 70195 69348 69356 69983 70653 71083 71473 72109 72933 73647 74154 74659 75238 75525 75037 73776 72371 71581 71696 72408
55126G2408Q00N82K29l71j197j738j448n50J72M11O37J163J550J332Q02M85K53
$$ 72408 73208 73790 74019 73648 72451 70713 69265 68715 68887 69298 69935 71098 72648 73980 74782 75267 75520
55109G5520l11r62j027m70l8j64m43l92j57j38k79j22O56J926L135L513K644J031
$$ 75520 75209 74247 73220 72750 72712 72548 72105 71713 71556 71418 71139 71017 71673 73599 76734 80247 82891 83922
55091H3922k03m35j53j79n94q01m88j8J69M5k26o33j068j057k48Q70J305P38j04
$$ 83922 83719 83284 83131 82952 82358 81557 81069 81051 81220 81265 81039 80406 79338 78281 78033 78903 80208 80946 80842
55072H0842m94o34r90j200m55J091K162J898Q60J73K27N84O78J67r47k046k206
$$ 80842 80348 79714 78724 77524 77069 78160 80322 82220 83080 83253 83480 84064 84742 84909 83962 81916 79710
55055G9710j261j69K78N21J318K250K172R56l11q84j077j271j210p46l87m88o17
$$ 79710 78449 78280 78558 79079 80397 82647 84819 85775 85464 84580 83503 82232 81022 80276 79889 79401 78784
55038G8784l54j04m09r52j047p88q18j104p93N05K008K645K166J122J17n08n43
$$ 78784 78430 78326 77917 76965 75918 75130 74312 73208 72415 72920 74928 77573 79739 80861 80978 80470 79927
55021G9927pO50Q33M56N6P6K71Q8m28o46l12k5l99j124j393r98l82K32J024J751
$$ 79927 79920 80570 81403 81859 81915 81991 82262 82350 81922 81276 80964 80939 80540 79416 78023 77025 76643 76875 77899 79650
55001G9650J623M18q57j044j63Q26J296J405J471J498J332Q65J48m29k63P24J703
$$ 79650 81273 81691 80834 79790 79627 80453 81749 83154 84625 86123 87455 88320 88468 88039 87776 88500 90203
54984I0203J802J121M10j12q28j665j927j378o90m34l53j15j6l09m36J72J028
$$ 90203 92005 93126 93536 93424 92596 90931 89004 87626 86936 86502 86149 86034 86018 85709 85273 85445 86473
54967H6473J171O41M19R80J676J675Q42l99j456j753j170l81j87m29k62M33P81
$$ 86473 87644 88285 88704 89684 91360 93035 93877 93478 92022 90269 89099 88718 88531 88102 87840 88273 89054
54950H9054L01l15l00J52M62N67N84K51n52j240j290j077j139j170o10J81M63
$$ 89054 89355 89040 88740 88892 89354 89921 90505 90756 90204 88964 87674 86597 85458 84288 83678 83859 84322
54933H4322M21P92J338R69m47j626j522m64O68J423J595J065L20L33J301K269
$$ 84322 84743 85535 86873 87842 87395 85769 84247 83783 84451 85874 87469 88534 88854 89187 90488 92757
54917I2757K502K435K740L239L467L585L990M490M649M443L958K959J444J60k96
$$ 92757 95259 97694 100434 103673 107140 110725 114715 119205 123854 128297 132255 135214 136658 136818 136522
54902A36522m07j009k074l007l721m463m938m639l815l127k477j243L73J282R70
$$ 136522 136115 135106 133032 130025 126304 121841 116903 112264 108449 105322 102845 101602 101975 103257 104227
54887A04227P1o97j260j640j605j217r19p27q9J067J890J744J120Q92J214J675
$$ 104227 104298 103601 102341 100701 99096 97879 96960 96233 96144 97211 99101 100845 101965 102857 104071 105746
54871A05746K080K520L051L787M906O113O458N325L360J836J188P23l26j887l260
$$ 105746 107826 110346 113397 117184 122090 128203 134661 139986 143346 145182 146370 147093 146767 144880 141620
54856A41620l929m034m175m740n422n572m990m098l264k362j312n70o73j434k064
$$ 141620 137691 133657 129482 124742 119320 113748 108758 104660 101396 99034 97722 97152 96479 95045 92981
54841I2981j992j341o79m83p87j108r35m10k34o54r52l86O44J018L78m63o59l43
$$ 92981 90989 89648 88969 88486 87699 86591 85656 85246 85012 84358 83406 83020 83664 84682 85060 84597 83938 83595
54823H3595j65l51n64m76p3M74R35J041O48o6p16j050j036o72O1R38J474J398
$$ 83595 83430 83079 82515 82039 81966 82440 83375 84416 85064 84998 84282 83232 82196 81524 81585 82523 83997 85395
54805H5395J051J001J319J481J107M76J90M13P35O95L14J2P2K12j20r40j470j048
$$ 85395 86446 87447 88766 90247 91354 91830 92020 92433 93168 93863 94177 94189 94261 94473 94353 93413 91943 90895
54787I0895j21K20l11q17n36K01P04R57J273J490J325J141J456J936J846J325
$$ 90895 90774 90994 90683 89866 89330 89531 90235 91192 92465 93955 95280 96421 97877 99813 101659 102984
54771A02984J205J556J540R57P63J579K697L265L564M254N074N275M925M735M806
$$ 102984 104189 105745 107285 108242 109005 110584 113281 116546 120110 124364 129438 134713 139638 144373 149179
54756A49179M511L584K498J667R44O8r24j908k857l637m032m069m004l974l989
$$ 149179 153690 157274 159772 161439 162383 162451 161527 159619 156762 153125 149093 145024 141020 137046 133057
54741A33057m216m782n268m888l484j825p88n22p16j180j787k103j690p09K17
$$ 133057 128841 124059 118791 113903 110419 108594 107806 107284 106568 105388 103601 101498 99808 99099 99316
54726I9316P27J007J299J550J662J724J789J695J442J515K369L662M495M456M024
$$ 99316 100043 101050 102349 103899 105561 107285 109074 110769 112211 113726 116095 119757 124252 128708 132732
54711A32732L777L645L251K597J952J252J64j342k837l895m393m386m071l774
$$ 132732 136509 140154 143405 146002 147954 149206 149370 148028 145191 141296 136903 132517 128446 124672
54697A24672l636l329k532j616j321j672j882j531j205j520j989j602l03P40M99
$$ 124672 121036 117707 115175 113559 112238 110566 108684 107153 105948 104428 102439 100837 100534 101274 101773
54682A01773p32j679j480n02K20J63k43l36r3O8lj01k13n35r27r31m85j00p9j05
$$ 101773 101041 99362 97882 97380 97600 97763 97520 97184 97091 97159 97156 97055 96842 96307 95380 94449 93964 93864 93785 93680
54662I3680R0J85j62o25o47j80L38N49L13l16r00p88J3N79K77k29N1Q32R52K30
$$ 93680 93770 93955 93793 93168 92521 92341 92679 93228 93541 93225 92325 91537 91550 92129 92406 92177 92228 93060 94012 94242
54642I4242k10K78Q45M70n04r49n58oK46N33J171J710J390J22j281j899j582r89
$$ 94242 94032 94310 95155 95625 95121 94172 93614 93608 93854 94387 95558 97268 98658 98780 97499 95600 94018 93029
54624I3029p78q43n16N05J629K005J474O69J65j04m34o83m61J66O23N92L92L89
$$ 93029 92251 91408 90892 91397 93026 95031 96505 97174 97339 97235 96801 96118 95657 95823 96446 97038 97430 97819
54606I7819M73M30L82M20J93n32j213j166o96o57j005p64L33J163P84k27n94O8
$$ 97819 98292 98722 99104 99524 99717 99185 97972 96806 96110 95453 94448 93684 94017 95180 95964 95737 95143 95211
54588I5211J192K127K335J322p09k435k581j352j7O97R89J059P44J57k11k11j42
$$ 95211 96403 98530 100865 102187 101478 99043 96462 95110 95093 95790 96779 97838 98582 98739 98528 98317 98175
54571I8175m4L31P66O23j10n89l41K6j50n03k27O43J205Q70L2l96Q1J063J551
$$ 98175 98131 98462 99228 99851 99741 99152 98811 98837 98687 98184 97957 98600 99805 100675 100707 100311 100392 101455 103006
54552A03006Q94m27j195p71K03N96O9o78p13J86J338J750J083O8j93N90J696K333
$$ 103006 103900 103473 102278 101507 101710 102306 102375 101697 100984 101170 102508 104258 105341 105409 105216 105806 107502 109835
54534A09835K364K020J384N23k46o27o97o44m05P8M17Q6p66j278q88j16N5n86
$$ 109835 112199 114219 115603 116126 115880 115253 114556 113912 113507 113585 114002 114088 113322 112044 111156 111040 111095 110509
54516A10509j129o73M77J174Q64K19N7J76k12j130j664j249m63j80m07m34N4N42
$$ 110509 109380 108707 109184 110358 111222 111441 111498 111674 111462 110332 108668 107419 106956 106776 106369 105935 105989 106531
54498A06531L96k85p52m68K56O14K31m64q51p83m65L6O53R11K84r29j639j118
$$ 106531 106927 106642 105890 105422 105678 106292 106523 106059 105208 104425 103960 103996 104649 105560 105844 104915 103276 102158
54480A02158K38J412J727J182K93j92J83J032J442J090O22O84R60P48Q6l42k54
$$ 102158 102396 103808 105535 106717 107010 106818 107001 108033 109475 110565 111187 111871 112831 113579 113665 113323 113069
54463A13069j62n29j090j167m63O50J457J438P30P2J27P46J152Q65K31j29j01
$$ 113069 112907 112378 111288 110121 109658 110308 111765 113203 113933 114005 114132 114878 116030 116895 117126 116997 116896
54446A16896l7j63l34m59o77r65q93k09N37M62m86j358j401r67q20r32n95M13
$$ 116896 116859 116696 116362 115903 115226 114261 113368 113159 113696 114158 113672 112314 110913 109946 109126 108194 107599 108012
54428A08012J350J458Q47K45J03L04N59Q10J116J327J093L17n08p08k43J83k4
$$ 108012 109362 110820 111667 111912 112015 112319 112878 113688 114804 116131 117224 117541 117033 116325 116082 116265 116241
54411A16241o40r93p43p8O34J028Q47K50k39l86n41q49o91L93J637J818R86M21
$$ 116241 115601 114608 113865 113787 114421 115449 116296 116546 116307 115921 115380 114531 113840 114233 115870 117688 118674 119095
54393A19095P93J405J500J368J572J942J878J163M6j010j333m99Q68J456R05L54
$$ 119095 119888 121293 122793 124161 125733 127675 129553 130716 130762 129752 128419 127920 128788 130244 131149 131503
54377A31503P26J309Q99k82r29n84q6j80o70j028j083q29k19O34J431K035K398
$$ 131503 132229 133538 134437 134155 133226 132642 132556 132376 131706 130678 129595 128766 128547 129181 130612 132647 135045
54360A35045K305J628Q66Q26J626K523K845K642K316K085J965J914J781J381P42
$$ 135045 137350 138978 139844 140670 142296 144819 147664 150306 152622 154707 156672 158586 160367 161748 162490
54345A62490O0o10j388k263l075l766m326m543m187l486k981k811k553j895j126
$$ 162490 162550 161940 160552 158289 155214 151448 147122 142579 138392 134906 131925 129114 126561 124666 123540
54330A23540p83j036j561j766j198j2R11P98jl09L99J296J329N31k18m13l38l54
$$ 123540 122757 121721 120160 118394 117196 117184 118095 118893 118892 118583 118982 120278 121607 122138 121920 121507 121169 120815
54312A20815l73j73J92N13P59J033J305J324Q74O0o96r78p10j81J93J60k28o72
$$ 120815 120442 120269 120461 120974 121733 122766 124071 125395 126269 126329 125633 124655 123945 123764 123957 124117 123889 123217
54294A23217q94q76p81o37k21N27J155J054J92p25r49l89L58O13J94m80p80m79
$$ 123217 122323 121447 120666 120029 119808 120335 121490 122544 122736 122011 121062 120673 121031 121644 121838 121358 120578 120099
54276A20099L9K21K2r5J64M62L12j29j10O87J493J297K65k64M92J573J424j9j189
$$ 120099 120138 120359 120381 120286 120450 120912 121224 121095 120985 121672 123165 124462 124727 124463 124955 126528 127952 127933 126744
54257A26744q88L31J159J177R37Q57P86N16J07k96n63m45J90R76J277Q85K13k08
$$ 126744 125856 126187 127346 128523 129460 130317 131103 131619 131726 131430 130867 130422 130612 131588 132865 133750 133963 133755
54239A33755j89J98P31J009N83o11k060k954k789j779o97k25k91k54K58Q99J158
$$ 133755 133566 133764 134495 135504 136087 135476 133416 130462 127673 125894 125197 124972 124681 124427 124685 125584 126742
54222A26742R47M45k04p08n45M17J498J995K055K204K180J222n90k077k360j767
$$ 126742 127689 128134 127930 127222 126677 127094 128592 130587 132642 134846 137026 138248 137658 135581 133221 131454
54206A31454j134q01p38r86j432j505p37M98J226R20N9m05n0N89N89k97j252j345
$$ 131454 130320 129519 128781 127795 126363 124858 124121 124619 125845 126765 126824 126419 126369 126958 127547 127250 125998 124653
54188A24653o14R1J98o7k03lM81R87J039L72n23p88k87K02M6m78o83k65O24J539
$$ 124653 124039 124130 124328 124261 124058 124055 124536 125523 126562 126934 126411 125623 125336 125538 125584 125106 124423 124158 124782 126321
54168A26321J847J170k8q19j024j313j838j727o02L95P9q89q65M14J553J569R58
$$ 126321 128168 129338 129310 128491 127467 126154 124316 122589 121987 122382 122461 121572 120707 121121 122674 124243 125201
54151A25201M98J71k36m22j52J13n3k38K00R76J161M86l28n54k52Q2J73k1n12
$$ 125201 125699 125870 125634 125212 125060 125173 125120 124882 125082 126058 127219 127705 127377 126823 126571 126653 126826 126805 126293
54132A26293j178j614j439o56M52J598K436K419J255m23j377j045j55K67R1q0
$$ 126293 125115 123501 122062 121406 121858 123456 125892 128311 129566 129143 127766 126721 126566 126833 126924 126844
54116A26844K9J62K19M62R37J330J504J578J369N26n00n07Q22K089J864O29rK92
$$ 126844 126873 127035 127254 127716 128653 129983 131487 133065 134434 134960 134460 133953 134775 136864 138728 139357 139348 139640
54098A39640L02o53j510j067J96P60O8r64j294q36j47L84P18Q96R51R59R66Q57
$$ 139640 139942 139289 137779 136712 136908 137668 137736 136772 135478 134642 134495 134879 135597 136493 137444 138403 139369 140226
54080A40226N28J46Q7M99J105J572J913K316K683K723K533K694L597M935O005
$$ 140226 140754 140900 140987 141486 142591 144163 146076 148392 151075 153798 156331 159025 162622 167557 173562
54065A73562O300N645M062J849l87k097l137l605l558l132k697k495k309j862
$$ 173562 179862 185507 189569 191418 191031 188934 185797 182192 178634 175502 172805 170310 168001 166139
54051A66139j348j203j349j193l79P97J795K313K336K067J946K348L164L817L878
$$ 166139 164791 163588 162239 161046 160667 161464 163259 165572 167908 169975 171921 174269 177433 181250 185128
54036A85128L509L259L550M332N113N406N309N428O008O368N699M230K982K452
$$ 185128 188637 191896 195446 199778 204891 210297 215606 221034 227042 233410 239109 243339 246321 248773
54022B48773K193J769J368J147O88k95j248j436j063j057j811k674k899k610k584
$$ 248773 250966 252735 254103 255250 255938 255643 254395 252959 251896 250839 249028 246354 243455 240845 238261
54007B38261l236m108m445m109l649l428l088k195j064l51q1K54O65O37K70M23
$$ 238261 235025 230917 226472 222363 218714 215286 212198 210003 208939 208588 208507 208761 209426 210063 210333 210756
53991B10756J233J521M03j289k209k434k972l804l877l066k650l348m112l631
$$ 210756 211989 213510 213913 212624 210415 207981 205009 201205 197328 194262 191612 188264 184152 180521
53977A80521k188j154j149j570j652j296q45o55q34j111j008l88K98N85N70O23
$$ 180521 178333 177179 176030 174460 172808 171512 170667 170012 169178 168067 167059 166671 166969 167554 168124 168747
53961A68747P52O31J60l35m20J26J128J986K047J363P80R48J483J570J137Q91
$$ 168747 169499 170130 170290 169955 169535 169661 170789 172775 174822 176185 176965 177913 179396 180966 182103 182994
53945A82994J251J919K582L363M338N101N287N185N459O344P392P994P944P571
$$ 182994 184245 186164 188746 192109 196447 201548 206835 212020 217479 223823 231215 239209 247153 254724
53931B54724P482Q120R419J0893J2066J2766J3026J2783J1753R534O014J796j912
$$ 254724 262206 270326 279745 290638 302704 315470 328496 341279 353032 362566 368580 370376 368464
53918C68464m161n005n125m818l788j962J5J436K280K930L408L337K568J446M01
$$ 368464 364303 359298 354173 349355 345567 343605 343620 345056 347336 350266 353674 357011 359579 361025 361426
53903C61426m39j176j870k432k702k655k545k722l275l898m270m411m595n060
$$ 361426 360987 359811 357941 355509 352807 350152 347607 344885 341610 337712 333442 329031 324436 319376
53889C19376n858o851p633p721p108o458o446o942p161o594n519m479l675k994
$$ 319376 313518 306667 299034 291313 284205 277747 271301 264359 257198 250604 245085 240606 236931 233937
53875B33937k451k261k475k792k849k642k508k639k819k735k485k419k582k573
$$ 233937 231486 229225 226750 223958 221109 218467 215959 213320 210501 207766 205281 202862 200280 197707
53861A97707k171j709j662k004k295k234j876j341o66ML39P7o62j430j800j733
$$ 197707 195536 193827 192165 190161 187866 185632 183756 182415 181749 181753 182092 182169 181507 180077 178277 176544
53845A76544j501j257q44k00K57N9n87r71q55p33r07r12k57P23J350J462J361
$$ 176544 175043 173786 172942 172742 172999 173058 172471 171500 170645 169912 169005 168093 167836 168559 169909 171371 172732
53828A72732J187R19P52Q77J070R84O95M22K7n96q98k43R98J729J520R29M86K30
$$ 172732 173919 174838 175590 176467 177537 178521 179216 179638 179665 179069 178171 177928 178926 180655 182175 183104 183590 183820
53810A83820L36J194K536L330L135K774L114L833M019L576L218L401L868M175
$$ 183820 184156 185350 187886 191216 194351 197125 200239 204072 208091 211667 214885 218286 222154 226329
53796B26329M188M026L846L666L333K818K439K439K373J550J83n59n3Q74J049
$$ 226329 230517 234543 238389 242055 245388 248206 250645 253084 255457 257007 257190 256631 256578 257452 258501
53781B58501L62m16q06r52j147j607k486l622m466m678m516m321m055l779l988
$$ 258501 258863 258447 257641 256689 255542 253935 251449 247827 243361 238683 234167 229846 225791 222012 218024
53766B18024m849n540n107l736k449j800j568j513j624j688j396r61r55j447j816
$$ 218024 213175 207635 202528 198792 196343 194543 192975 191462 189838 188150 186754 185793 184838 183391 181575
53751A81575j512n67N42J162P81l35j091p31R8J96m94q84l87L89O97N51K79k4
$$ 181575 180063 179496 180038 181200 181981 181646 180555 179824 179922 180118 179624 178740 178353 178742 179439 179990 180269 180245
53733A80245k46r7L85P28O75N34O02P95R84J199J276R35M07M40J313K387K929
$$ 180245 179999 179902 180287 181015 181690 182224 182826 183621 184605 185804 187080 188015 188422 188862 190175 192562 195491
53716A95491K859K380J574P49O02J374K296K412J744J090R95J344J819K229K494
$$ 195491 198350 200730 202304 203053 203655 205029 207325 209737 211481 212571 213566 214910 216729 218958 221452
53701B21452K644K822L042L068K717K144J684J519J601J781J918K091K528L085
$$ 221452 224096 226918 229960 233028 235745 237889 239573 241092 242693 244474 246392 248483 251011 254096
53687B54096L005J770Q8p54n38l39q45j370j045j56L26M2o32j264j577j391r05
$$ 254096 257101 258871 258959 258205 257667 257328 256483 255113 254068 253912 254238 254280 253648 252384 250807 249416 248511
53670B48511p59j210j679j604j274j283j506j389q44k25L07P17O88Q0m87k85M22
$$ 248511 247752 246542 244863 243259 241985 240702 239196 237807 236963 236738 237045 237762 238450 238530 238043 237758 238180
53653B38180P09K94k18l49k80l05m22m94l23L89J559K372K071J031L01J69K4l49
$$ 238180 238889 239183 238965 238616 238336 238031 237609 237115 236792 237181 238740 241112 243183 244214 244515 244684 244708 244359
53635B44359k99N66J613K003J729J421J550K111K748K984K666K231K254K707L144
$$ 244359 244060 244626 246239 248242 249971 251392 252942 255053 257801 260785 263451 265682 267936 270643 273787
53620B73787L453L866M282M382M418N007O005O460O010N414N327N386N057M508
$$ 273787 277240 281106 285388 289770 294188 299195 305200 311660 317670 323084 328411 333797 338854 343362
53606C43362L986L118J713N74N64J269J454O90l44r51j017o69n9M68N70L38O2
$$ 343362 347348 350466 352179 352753 353317 354586 356040 356730 356386 355435 354418 353749 353690 354158 354728 355066 355128
53589C55128k69p93j257j303j171j421j957k026j363o68p19j479k336k846k932
$$ 355128 354859 354066 352809 351506 350335 348914 346957 344931 343568 342900 342181 340702 338366 335520 332588
53574C32588k688k299j963j696j348q73m47k33k41m24o83p13j90P70J539J593
$$ 332588 329900 327601 325638 323942 322594 321721 321274 321041 320800 320376 319693 318980 318790 319560 321099 322692
53558C22692J068N71N41Q89J202J239J126J082J059Q85P39J118K106L117L650
$$ 322692 323760 324331 324872 325761 326963 328202 329328 330410 331469 332354 333093 334211 336317 339434 343084
53543C43084L976M501M849M325L276L057M296N865O198N220M357M800O348P955
$$ 343084 347060 351561 356410 360735 364011 367068 371364 377229 383427 388647 393004 397804 404152 412107
53529D12107Q907R264R445R788J0426J1335J2292J2910J2917J2530J2409J3095
$$ 412107 421014 430278 439723 449511 459937 471272 483564 496474 509391 521921 534330 547425
53517E47425J4489J6025J7295J8310J9230K0023K0537K0795K1079K1708K2698
$$ 547425 561914 577939 595234 613544 632774 652797 673334 694129 715208 736916 759614
53506G59614K3707K4382K4791K5234K5654K5525K4546K3190K2163K1531K0852
$$ 759614 783321 807703 832494 857728 883382 908907 933453 956643 978806 1000337 1021189
53495A021189J9975J9253J8902J8703J8448J8256J8159J7851J7201J6675J6782
$$ 1021189 1041164 1060417 1079319 1098022 1116470 1134726 1152885 1170736 1187937 1204612 1221394
53484A221394J7267J7313J6603J5758J5557J5972J6157J5350J3499J1017Q197
$$ 1221394 1238661 1255974 1272577 1288335 1303892 1319864 1336021 1351371 1364870 1375887 1384084
53473A384084N169K240j62k035l903o157q522j0460j1793j2686j3278j3772j4506
$$ 1384084 1389253 1391493 1391331 1389296 1385393 1379236 1370714 1360254 1348461 1335775 1322497 1308725 1294219
53460A294219j5485j6084j5895j5646j6549j8725k0994k2280k2487k1926k0843
$$ 1294219 1278734 1262650 1246755 1231109 1214560 1195835 1174841 1152561 1130074 1108148 1087305
53449A087305j9784j9558k0197k0617j9856j8145j6224j4249j2048r908q210o686
$$ 1087305 1067521 1047963 1027766 1007149 987293 969148 952924 938675 926627 916719 908509 901823
53437I01823m835k908j670j309j283j146p62J77K032M432O292O935O790O856P869
$$ 901823 896988 894080 892410 891101 889818 888672 887910 888087 890119 894551 900843 907778 914568 921424 929293
53422I29293R986J2772J5366J7076J8012J8831J9908K1068K2132K3179K4353K5761
$$ 929293 939279 952051 967417 984493 1002505 1021336 1041244 1062312 1084444 1107623 1131976 1157737
53410A157737K7559K9665L1503L2637L3587L5302L7846M0308M2137M3777M5714
$$ 1157737 1185296 1214961 1246464 1279101 1312688 1347990 1385836 1426144 1468281 1512058 1557772
53399A557772M7695M9299N0652N2061N3419N4449N5124N5464N5353N4911N4592
$$ 1557772 1605467 1654766 1705418 1757479 1810898 1865347 1920471 1975935 2031288 2086199 2140791
53388B140791N4491N4053N2825N1048M9095M6855M4183M1369L8565L5217L0837
$$ 2140791 2195282 2249335 2302160 2353208 2402303 2449158 2493341 2534710 2573275 2608492 2639329
53377B639329K5938K1436J7399J3159Q475L679j223o716j2896j9198k5235l1262
$$ 2639329 2665267 2686703 2704102 2717261 2725736 2729415 2728192 2721476 2708580 2689382 2664147 2632885
53365B632885l7479m3399m8253n1698n3907n5251n6068n6431n6105n4928n3266
$$ 2632885 2595406 2552007 2503754 2452056 2398149 2342898 2286830 2230399 2174294 2119366 2066100
53354B066100n1718n0367m8737m6577m4280m2375m1029m0188l9800l9647l9338
$$ 2066100 2014382 1964015 1915278 1868701 1824421 1782046 1741017 1700829 1661029 1621382 1582044
53343A582044l8643l7616l6209l4169l1524k8869k6749k5031k3195k1078j8996
$$ 1582044 1543401 1505785 1469576 1435407 1403883 1375014 1348265 1323234 1300039 1278961 1259965
53332A259965j7229j5735j4337j2988j1784j0954j0876j1837j3603j5279j5847
$$ 1259965 1242736 1227001 1212664 1199676 1187892 1176938 1166062 1154225 1140622 1125343 1109496
53321A109496j4935j3064j1059r302p735o398n511m964m173k819j286n1J098K612
$$ 1109496 1094561 1081497 1070438 1061136 1053401 1047003 1041492 1036528 1032355 1029536 1028250 1028199 1029297 1031909
53307A031909M287N510O405P911J0489J3353J5416J6514J7322J8389J9732K1178
$$ 1031909 1036196 1041706 1048111 1056022 1066511 1079864 1095280 1111794 1129116 1147505 1167237 1188415
53295A188415K2665K4176K5640K6941K7919K8409K8384K7991K7360K6466K5124
$$ 1188415 1211080 1235256 1260896 1287837 1315756 1344165 1372549 1400540 1427900 1454366 1479490
53284A479490K3103K0344J7271J4642J2739J0844P963M118K85k930n906r066j2064
$$ 1479490 1502593 1522937 1540208 1554850 1567589 1578433 1586396 1590514 1590799 1587869 1581963 1572897 1560833
53271A560833j4381j6243j8277k0547k2576k4110k5343k6446k7311k7842k8063
$$ 1560833 1546452 1530209 1511932 1491385 1468809 1444699 1419356 1392910 1365599 1337757 1309694
53260A309694k8037k7925k8089k8733k9523k9877k9616k9026k8382k7741k7160
$$ 1309694 1281657 1253732 1225643 1196910 1167387 1137510 1107894 1078868 1050486 1022745 995585
53249I95585k6709k6246k5546k4741k4257k4216k4213k3803k2971k1974k0967
$$ 995585 968876 942630 917084 892343 868086 843870 819657 795854 772883 750909 729942
53238G29942j9917j8738j7361j5816j4289j2937j1665j0242q693p387o653o523
$$ 729942 710025 691287 673926 658110 643821 630884 619219 608977 600284 592897 586244 579721
53226E79721o841p457q152q655q886r066r455j0087j0872j1805j2853j3739j4057
$$ 579721 572880 565423 557271 548616 539730 530664 521209 511122 500250 488445 475592 461853 447796
53213D47796j3645j2722j1622j0486r308q181p382p101p159p153o885o568o439
$$ 447796 434151 421429 409807 399321 390013 381832 374450 367349 360190 353037 346152 339584 333145
53200C33145o380o106n675n497n746o059n968n447m844m414m213m293m565m513
$$ 333145 326765 320659 314984 309487 303741 297682 291714 286267 281423 277009 272796 268503 263938 259425
53186B59425l570k008r71j238k265k938k962k850k712j996n93O27R17N98L42O1
$$ 259425 255855 253847 252876 251638 249373 246435 243473 240623 237911 235915 235322 235949 236866 237464 237806 237867
53170B37867o82j612j957j628j266j187j064p62o82r66j098o89j18pm34r88j221
$$ 237867 237185 235573 233616 231988 230722 229535 228471 227709 227027 226061 224963 224274 224156 224149 223715 222727 221506
53153B21506r20l03j6m52j025p80J27M27m77j585j730j044l83rK89L95J57KK99
$$ 221506 220586 220283 220267 219815 218790 218010 218137 218564 218087 216502 214772 213728 213345 213336 213625 214020 214177 214179 214478
53134B14478M96j24j137j443q75k31K25J050K209K565J382m65j423r48J98R48
$$ 214478 214974 214850 213713 212270 211395 211164 211389 212439 214648 217213 218595 218130 216707 215759 215957 216905
53118B16905Q73L82J86M45N36qn79j78J107K132K229J840J466Q50k35j263j640
$$ 216905 217778 218160 218346 218791 219327 219319 218740 218562 219669 221801 224030 225870 227336 228186 227951 226688 225048
53101B25048j649k009k754l143k628j584j025j598k698k840j342N80J131K57m06
$$ 225048 223399 221390 218636 215493 212865 211281 210256 208658 205960 203120 201778 202358 203489 203746 203340
53086B03340J17R44R70M70K48J99k19p31o21M9N43N32J85m72j328j648q22M86
$$ 203340 203457 204401 205371 205841 206089 206288 206069 205338 204717 204766 205309 205841 206026 205554 204226 202578 201756 202242
53068B02242R50L60k59l06k43m07l11L13P77M51k57n81n84q62j467j821j534p59
$$ 202242 203192 203552 203293 202987 202744 202337 202026 202339 203116 203567 203310 202729 202145 201283 199816 197995 196461 195702
53050A95702J58Q81J103P99M65O26J108J152L59p79j377j059k83J56p7n29n24
$$ 195702 195860 196741 197844 198643 199108 199734 200842 201994 202353 201574 200197 199138 198855 199011 198934 198405 197881
53033A97881RM22J85m70r24r32o35m8R11J843J943R87j46m69o5K00K1QN07Q73
$$ 197881 197890 198312 198497 198027 197103 196171 195536 195488 196399 198242 200185 201172 201026 200557 200492 200692 200713 200721 201228 202101
53013B02101M06m62o67J8Q01J089J126J155P88k92j445j712j031k98k46p23j109
$$ 202101 202507 202045 201378 201396 202197 203286 204412 205567 206355 206063 204618 202906 201875 201577 201331 200608 199499
52996A99499r47k25O61J135R10L56R2K80N02L63o0m25n10k91J61P46J385J941
$$ 199499 198552 198327 198988 200123 201033 201389 201481 201761 202263 202626 202566 202141 201631 201340 201501 202247 203632 205573
52978B05573K147J793J126P34Q26Q89M82L5L01J221J950J990J581J033L40l08
$$ 205573 207720 209513 210639 211373 212199 213088 213570 213605 213906 215127 217077 219067 220648 221681 222021 221713
52962B21713m20M3M10K26o5R3M76N04J76j23m31j051j725j797j316j146j775k553
$$ 221713 221293 221336 221746 221972 221907 222000 222476 222980 223156 223033 222602 221551 219826 218029 216713 215567 213792 211239
52944B11239k635k144j871k057k134j619p65r7K71N56P55N36k03r80j096l95N10
$$ 211239 208604 206460 204589 202532 200398 198779 198014 197917 198188 198744 199499 200035 199832 198852 197756 197361 197871
52927A97871P53M7j029j525j074k30J74k3k54j13J33Q2q6R7O33J043J092R81Q45
$$ 197871 198624 198671 197642 196117 195043 194813 194987 194964 194710 194597 194730 194812 194726 194823 195456 196499 197591 198572 199417
52908A99417N26J4l53m11m81q53j293j410j269j232j291j035k34P63J303J004
$$ 199417 199943 199957 199604 199193 198712 197859 196566 195156 193887 192655 191364 190329 190095 190858 192161 193165
52892A93165J73l52Q6J195J957J720Q68J84o2m1K43Q77J500J464O89j56n11m67
$$ 193165 193338 192986 193072 194267 196224 197944 198812 198996 198934 198893 199136 200013 201513 202977 203666 203510 202999 202532
52874B02532l03J11R65J858K009J226K89J13O90J099O24l85r77p24o6M19O08N95
$$ 202532 202229 202340 203305 205163 207172 208398 208687 208800 209490 210589 211213 210828 209851 209127 209061 209480 210088 210683
52856B10683L63R4L07J149J817J398J41p43p11n14j055k128k850k847k538k389
$$ 210683 211046 211140 211447 212596 214413 215811 215952 215209 214498 213984 212929 210801 207951 205104 202566 200177
52840B00177k394k282j903j372r30p31p99j124j701k263k162r14J083K736L239
$$ 200177 197783 195501 193598 192226 191296 190565 189766 188642 186941 184678 182516 181602 182685 185421 188660
52825A88660K631J465L10l73l93p8O3J7J16K10l09j351j847j178j21L13L09N89
$$ 188660 191291 192756 193066 192693 192300 192222 192285 192302 192418 192628 192319 190968 189121 187943 187822 188135 188444 189033
52807A89033J003Q88M38M04N95K1j216j585l14J255J331q7j548k116k070j920
$$ 189033 190036 190924 191362 191766 192361 192382 191166 189581 189267 190522 191853 191766 190218 188102 186032 184112
52791A84112j717j368j000p88p56p59n40Q9R13J410J435J467J823J985J251j32
$$ 184112 182395 181027 180027 179239 178483 177724 177184 177273 178186 179596 181031 182498 184321 186306 187557 187425
52775A87425j125j116n46j99l55o91o76mJ119J966J904J048J36l54o01r39j256
$$ 187425 186300 185184 184638 184439 184084 183393 182717 182713 183832 185798 187702 188750 188886 188532 187931 186992 185736
52758A85736j146m76M16J092J403J456J374J142P21J98k73n66n80k64K17N18N44
$$ 185736 184590 184114 184530 185622 187025 188481 189855 190997 191718 191916 191643 191077 190497 190233 190450 190968 191512
52741A91512O55J057J263P40m7%J073K104K315K226K597L141L070K381J670J050
$$ 191512 192167 193224 194487 195227 195180 195180 196253 198357 200672 202898 205495 208636 211706 214087 215757 216807
52725B16807K46n26p26m97o02j248j849k029k079k211k161j870j761j970j933
$$ 216807 217053 216527 215801 215304 214702 213454 211605 209576 207497 205286 203125 201255 199494 197524 195591
52710A95591j166L0R65J203O15p06k157k793k174p73O55J653J907J234J29l36
$$ 195591 194425 194455 195420 196623 197238 196532 194375 191582 189408 188635 189290 190943 192850 194084 194213 193877
52694A93877L03J212J320O24k5o4L99R93J357J231P59M41M33K91k23n72l04P9
$$ 193877 194180 195392 196712 197336 197311 197247 197646 198639 199996 201227 201986 202427 202860 203151 202928 202356 202052 202131
52676B02131j27o26n76MK55j55n84n21k56j55j9L94P71O99L31J72L71O14N95L74
$$ 202131 202004 201378 200802 200806 201061 200906 200322 199801 199545 199390 199371 199765 200536 201235 201566 201738 202109 202723 203318 203692
52656B03692K66N36J107J630J927K239K825L408L399K601J373N0j294k492l101
$$ 203692 203958 204494 205601 207231 209158 211397 214222 217630 221029 223630 225003 225053 223759 221267 218166
52641B18166k893k257j839j860k004j881j442r11l93K50J030J461R79j69r19n25
$$ 218166 215273 213016 211177 209317 207313 205432 203990 203079 202686 202936 203966 205427 206406 206237 205318 204793
52625B04793O04J565K006K065J736J054N42O57Q53J11j443k387j761k47P87P93
$$ 204793 205397 206962 208968 211033 212769 213823 214365 215022 215875 215986 214543 212156 210395 210148 210935 211728
52609B11728J66n16q35n76Q5O55Q64R14R42Q04N95P81J369J514O23o82j357j326
$$ 211728 211894 211378 210543 209967 210052 210707 211571 212485 213427 214231 214826 215607 216976 218490 219113 218431 217074 215748
52591B15748j289j467j379p97j34K19L44M47O41J024J531J690J121K79M7M73O76
$$ 215748 214459 212992 211613 210816 210682 210901 211245 211692 212333 213357 214888 216578 217699 217978 218025 218498 219174
52574B19174J73l75j77N61R87O27l40j461k160j945r36M8L80L20L63L43j42p18
$$ 219174 219347 218972 218795 219356 220343 220970 220630 219169 217009 215064 214128 214176 214556 214876 215239 215582 215440 214722
52556B14722n77K43P00R6j091j994k292k094j486o40L4L61O29J001J058M40m72
$$ 214722 214145 214388 215088 215184 214093 212099 209807 207713 206227 205587 205621 205982 206611 207612 208670 209110 208638
52539B08638j025j126j030n79M70J507J424J56r42o66O85J939K482K472K121J457
$$ 208638 207613 206487 205457 204878 205348 206855 208279 208435 207493 206827 207512 209451 211933 214405 216526 217983
52523B17983O63K1m63r36j231j023m79j81l34l92J82J182J951K213K226K244K208
$$ 217983 218646 218667 218204 217268 216037 215014 214535 214354 214020 213628 213810 214992 216943 219156 221382 223626 225834
52506B25834K046J938K092K399K555K399J976J303L71o21j336j693j894j963j636
$$ 225834 227880 229818 231910 234309 236864 239263 241239 242542 242913 242292 240956 239263 237369 235406 233770
52491B33770r86p50j447k492k836k352j882j834j600p02K96N67J87j06O2N54J224
$$ 233770 232784 232034 230587 228095 225259 222907 221025 219191 217591 216889 217185 217752 217939 217833 217895 218449 219673
52474B19673J928K249J854J123P92R70J065P20K33k2p8l2K78R38J630J997K099
$$ 219673 221601 223850 225704 226827 227619 228589 229654 230374 230607 230585 230507 230475 230753 231691 233321 235318 237417
52457B37417K220K324K020J194L40J33N63P66m2j582k728k783k216j920k187k689
$$ 237417 239637 241961 243981 245175 245515 245648 246211 246977 246935 245353 242625 239842 237626 235706 233519 230830
52441B30830l105l294l072k344j418p62m63l00k51m27o00k64O41J487J676J272
$$ 230830 227725 224431 221359 219015 217597 216835 216372 216072 215821 215394 214794 214530 215171 216658 218334 219606
52425B19606Q22P62J085J407J236M44m69p16nJ100J698J442R18J045J988K888
$$ 219606 220428 221190 222275 223682 224918 225362 224893 224177 224172 225272 226970 228412 229330 230375 232363 235251
52409B35251K947K636L164M762O339P075P550Q573R688R705Q240N749K481j511
$$ 235251 238198 240834 243998 248760 255099 262174 269724 278297 287985 297690 305930 311679 314160 312649
52395C12649n442q052q899q642p919o803n428m242l394k607j805j241q48k68M08
$$ 312649 307207 299155 290256 281614 273695 266892 261464 257222 253828 251221 249416 248175 247327 247059 247467
52380B47467O67N16N66J028J484J781K267K868K950K445K197K687L322L482L400
$$ 247467 248134 248650 249216 250244 251728 253509 255776 258644 261594 264039 266236 268923 272245 275727 279127
52365B79127L465L519L483L768M356M330L126J491L89l09j119j683j309k57N72
$$ 279127 282592 286111 289594 293362 297718 302048 305174 306665 307054 306745 305626 303943 302634 302377 302949
52350C02949Q56R26R16Q59J241K501M089M932M702L966L276K957L418M716N982
$$ 302949 303805 304731 305647 306506 307747 310248 314337 319269 323971 327937 331213 334170 337588 342304 348286
52335C48286O276O009O515Q144R770J0459J0720J1623J3266J4756J5394J5504
$$ 348286 354562 360571 367086 375230 385000 395459 406179 417802 431068 445824 461218 476722
52323D76722J6011J7352J8915J9818K0133K0729K1847K2526K1960K0645J9418
$$ 476722 492733 510085 529000 548818 568951 589680 611527 634053 656013 676658 696076
52312F96076J8150J6330J4421J3455J3493J3566J3038J2065J0779R050P122N501
$$ 696076 714226 730556 744977 758432 771925 785491 798529 810594 821373 830423 837545 843046
52300H43046M097K423O74k62p6N36P95M33p23k762n073o619p144p361p703p794
$$ 843046 847143 849566 850240 849978 849902 850438 851233 851666 850943 848181 843108 836489 829345 821984 814281 806487
52284H06487p393o883o406n391l528j430K27J577L009M455N853P690J0248J2768
$$ 806487 799094 792211 785805 780414 776886 775456 775683 777260 780269 784724 790577 798267 808515 821283
52270H21283J4190J4453J4428J4649J4783J4399J3637J2960J2486J1855J0737
$$ 821283 835473 849926 864354 879003 893786 908185 921822 934782 947268 959123 969860
52259I69860R314Q128P417O892O310N851N547M777L066J048j70m80q31j748k769
$$ 969860 979174 987302 994719 1001611 1007921 1013772 1019319 1024096 1027162 1028210 1028040 1027560 1026729 1024981 1022212
52244A022212l497m281n563p268r190j1183j2734j3147j2595j2264j2877j3749
$$ 1022212 1018715 1014434 1008871 1001603 992413 981230 968496 955349 942754 930490 917613 903864
52232I03864j3754j2622j0909r249q160p823p614o522m497k714j957j541n55O23
$$ 903864 890110 877488 866579 857330 849170 841347 833733 827211 822714 820000 818043 816502 815947 816570
52218H16570J022P17O98J396K309L000L609M354N184N958O560O818O686O371N990
$$ 816570 817592 818309 819007 820403 822712 825712 829321 833675 838859 844817 851377 858195 864881 871252 877242
52203H77242N341M380L575L326L345L077K387J520O83J62L46J181J972K235K231
$$ 877242 882583 886963 890538 893864 897209 900286 902673 904193 904876 905038 905384 906565 908537 910772 913003
52188I13003K240J902J026L59O19J252J177M13j47k88p02j695k782l698m695n711
$$ 913003 915243 917145 918171 918530 919149 920401 921578 921991 921844 921556 920854 919159 916377 912679 907984 902273
52172I02273o218o267o633p505p895o959n181l687k864k330j759j146m54M37J431
$$ 902273 896055 889788 883155 875650 867755 860796 855615 851928 849064 846734 844975 843829 843375 843812 845243
52157H45243K232K704L017L429L923M153L790L049K500K221J557J91r93q12N55
$$ 845243 847475 850179 853196 856625 860548 864701 868491 871540 874040 876261 877818 878009 877016 876204 876759
52142H76759J740J925J637J642J947K297K866L848M861N403N638O238P520R176
$$ 876759 878499 880424 882061 883703 885650 887947 890813 894661 899522 904925 910563 916801 924321 933497
52128I33497J0723J2018J3355J5181J7572J9965K1745K3102K4849K7249K9490
$$ 933497 944220 956238 969593 984774 1002346 1022311 1044056 1067158 1092007 1119256 1148746
52117A148746L0652L0752L0465L0093K9298K7675K5208K2132J8670J4966J1158
$$ 1148746 1179398 1210150 1240615 1270708 1300006 1327681 1352889 1375021 1393691 1408657 1419815
52106A419815P517M358J745o75l238n737p740r347j1089j2944j4069j3871j2813
$$ 1419815 1427332 1431690 1433435 1432760 1429522 1423785 1416045 1406698 1395609 1382665 1368596 1354725 1341912
52093A341912j1695j0695r641q794q597q841q874q640q742r316r595q916p619
$$ 1341912 1330217 1319522 1309881 1301087 1292490 1283649 1274775 1266135 1257393 1248077 1238482 1229566 1221947
52080A221947o437n392l925j862K82K147M065O542R428J1982J3587J4178J4069
$$ 1221947 1215510 1210118 1206193 1204331 1204613 1206760 1210825 1217367 1226795 1238777 1252364 1266542 1280611
52067A280611J3677J3449J3701J4299J4685J4444J3734J2955J2084J0621Q163
$$ 1280611 1294288 1307737 1321438 1335737 1350422 1364866 1378600 1391555 1403639 1414260 1422423
52056A422423M855J229k147m848o669p681q201q617r284j0437j1987j3419j4221
$$ 1422423 1427278 1428507 1426360 1421512 1414843 1407162 1398961 1390344 1381060 1370623 1358636 1345217 1330996
52043A330996j4522j5079j6425j8223j9720k0599k1138k1520k1443k0507j8872
$$ 1330996 1316474 1301395 1284970 1266747 1247027 1226428 1205290 1183770 1162327 1141820 1122948
52032A122948j7185j5872j4723j3224j1233r154p454o260n460n035n059n404n786
$$ 1122948 1105763 1089891 1075168 1061944 1050711 1041557 1034103 1027843 1022383 1017348 1012289 1006885 1001099
52019A001099o150o767p802q899r497r507r379r462r528r180q547q258q717r759
$$ 1001099 994949 988182 980380 971481 961984 952477 943098 933636 924108 914928 906381 898123 889406 879647
52005H79647j1044j2535j4276j5955j7037j7271j6834j6020j5071j4323j4133
$$ 879647 868603 856068 841792 825837 808800 791529 774695 758675 743604 729281 715148
51994G15148j4521j5019j5045j4334j3065j1656j0450r448q401p221o186n538
$$ 715148 700627 685608 670563 656229 643164 631508 621058 611610 603209 595988 589802 584264
51982E84264n115m693m426m512m655m464m291m910o294p515q035q355q985r618
$$ 584264 579149 574456 570030 565518 560863 556399 552108 547198 540904 533389 525354 516999 508014 498396
$$ [...]
##END NTUPLES=NMR SPECTRUM
##END=
