
##TITLE=UV1201_M3_1292-1211_7185378_DBZX67YYmX
##JCAMPDX= 6.0         $$ Bruker NMR JCAMP-DX V2.0
##DATA TYPE= NMR SPECTRUM
##DATA CLASS= NTUPLES
##ORIGIN= BRUKER
##OWNER= Administrator
$$ 1.72 TOPSPIN		Version 2.1
$$ 2012-12-06 01:46:14.659 -0500  Administrator@X
$$ Compression mode = diff/dup
##.OBSERVE FREQUENCY= 400.02188249412
##.OBSERVE NUCLEUS= ^1H
##.ACQUISITION MODE= SIMULTANEOUS (DQD)
##.ACQUISITION SCHEME= undefined
##.AVERAGES= 8
##.DIGITISER RES= 22
##SPECTROMETER/DATA SYSTEM= spect
##.PULSE SEQUENCE= zg30
##.SOLVENT NAME= COFFEE_meoh
##.SHIFT REFERENCE= INTERNAL, COFFEE_meoh, 1, 14.98509
##AUDIT TRAIL= $$ (NUMBER, WHEN, WHO, WHERE, PROCESS, VERSION, WHAT)
$$ ##TITLE= Audit trail, TOPSPIN		Version 2.1
$$ ##JCAMPDX= 5.01
$$ ##ORIGIN= Bruker BioSpin GmbH
$$ ##OWNER= Administrator
$$ $$ E:\/data/COFFEE/nmr/UV1201_M3_1292-1211_7185378_DBZX67YYmX/10/pdata/1/auditp.txt
$$ ##AUDIT TRAIL=  $$ (NUMBER, WHEN, WHO, WHERE, PROCESS, VERSION, WHAT)
(   1,<2012-12-06 01:46:06.644 -0500>,<Administrator>,<X>,<go>,<TOPSPIN 2.1>,
      <created by zg
	started at 2012-12-06 01:45:00.191 -0500,
	POWCHK enabled, PULCHK disabled,
       configuration hash MD5:
       86 BA 57 50 F2 9D 5C 9B 26 00 A9 28 5F 66 2E 89
       data hash MD5: 64K
       4E AA 0C 6E 4F 0D 31 D5 47 55 EC AB 6B 24 FA 92>)
(   2,<2012-12-06 01:46:09.753 -0500>,<Administrator>,<X>,<proc1d>,<TOPSPIN 2.1>,
      <Start of raw data processing
       efp LB = 0 FT_mod = 6 PKNL = 1 PHC0 = 0 PHC1 = 0 SI = 32K 
       data hash MD5: 32K
       82 2B 8F 2F 69 CF 94 99 61 9B CF CD 43 CC 4F 7E>)
(   3,<2012-12-06 01:46:10.206 -0500>,<Administrator>,<X>,<proc1d>,<TOPSPIN 2.1>,
      <pk PHC0 = 100.1019 PHC1 = 0 
       data hash MD5: 32K
       91 2D BD FC 90 3A 3D E1 D7 4B 1E FB 55 DC E9 CD>)
(   4,<2012-12-06 01:46:10.441 -0500>,<Administrator>,<X>,<proc1d>,<TOPSPIN 2.1>,
      <abs ABSG = 1 
       data hash MD5: 32K
       87 65 38 F4 C8 E6 10 42 E0 BD 09 EA FB 96 6F 70>)
(   5,<2012-12-06 01:46:10.597 -0500>,<Administrator>,<X>,<proc1d>,<TOPSPIN 2.1>,
      <abs ABSG = 2 
       data hash MD5: 32K
       DB 23 4A C4 C8 9F D8 27 46 7E 21 29 A3 FE AC CA>)
(   6,<2012-12-06 01:46:10.737 -0500>,<Administrator>,<X>,<proc1d>,<TOPSPIN 2.1>,
      <abs ABSG = 3 
       data hash MD5: 32K
       F4 C3 F5 91 50 4B E9 E7 35 3B 6A D1 03 95 64 29>)
(   7,<2012-12-06 01:46:10.894 -0500>,<Administrator>,<X>,<proc1d>,<TOPSPIN 2.1>,
      <abs ABSG = 4 
       data hash MD5: 32K
       FA 17 ED D8 CF 6B FC E6 5C D1 20 21 AF 03 F7 37>)
(   8,<2012-12-06 01:46:11.050 -0500>,<Administrator>,<X>,<proc1d>,<TOPSPIN 2.1>,
      <abs ABSG = 5 
       data hash MD5: 32K
       23 C0 11 4A 18 3A 74 CC 7E AE 9E BC 75 D1 B8 39>)
$$ ##END=
$$ 
$$ $$ hash MD5
$$ $$ 3F 54 BB 60 23 1D 2A 50 B5 3F 41 FF 23 88 9C 6D
##$RELAX= 
##$RELAX= 
##$RELAX= 
##$RELAX= 
##$RELAX= 
##$RELAX= 
##$RELAX= 
$$ Bruker specific parameters
$$ --------------------------
##$DU= <E:\>
##$EXPNO= 10
$$ [...]
##$TP= (0..7)
150 150 150 150 150 150 150 150
##$TP07= 0
##$TPNAME0= <>
##$TPNAME1= <>
##$TPNAME2= <>
##$TPNAME3= <>
##$TPNAME4= <>
##$TPNAME5= <>
##$TPNAME6= <>
##$TPNAME7= <>
##$TPOAL= (0..7)
0.5 0.5 0.5 0.5 0.5 0.5 0.5 0.5
##$TPOFFS= (0..7)
0 0 0 0 0 0 0 0
##$TUNHIN= 0
##$TUNHOUT= 0
##$TUNXOUT= 0
##$USERA1= <user>
##$USERA2= <user>
##$USERA3= <user>
##$USERA4= <user>
##$USERA5= <user>
##$V9= 5
##$VALIST= <valist>
##$VCLIST= <CCCCCCCCCCCCCCC>
##$VD= 0
##$VDLIST= <DDDDDDDDDDDDDDD>
##$VPLIST= <PPPPPPPPPPPPPPP>
##$VTLIST= <TTTTTTTTTTTTTTT>
##$WBST= 1024
##$WBSW= 4
##$XGAIN= (0..3)
0 0 0 0
##$XL= 0
##$YL= 0
##$YMAX_a= 682173
##$YMIN_a= -582209
##$ZGOPTNS= <>
##$ZL1= 120
##$ZL2= 120
##$ZL3= 120
##$ZL4= 120
##$ABSF1= 14.98509
##$ABSF2= -5.573092
##$ABSG= 5
##$ABSL= 3
##$ALPHA= 0
##$AQORDER= 0
##$ASSFAC= 0
##$ASSFACI= 0
##$ASSFACX= 0
##$ASSWID= 0
##$AUNMP= <proc_prof1d_extract_pilot.lims>
##$AXLEFT= 0
##$AXNAME= <>
##$AXNUC= <1H>
##$AXRIGHT= 0
##$AXTYPE= 0
##$AXUNIT= <>
##$AZFE= 0.1
##$AZFW= 0.1
##$BCFW= 0
##$BC_mod= 0
##$BYTORDP= 0
##$COROFFS= 0
##$CY= 15
##$DATMOD= 1
##$DC= 0
##$DFILT= <>
##$DTYPP= 0
##$F1P= 0
##$F2P= 0
##$FCOR= 0.5
##$FTSIZE= 32768
##$FT_mod= 6
##$GAMMA= 0
##$GB= 0
##$INTBC= 1
##$INTSCL= 1
##$ISEN= 128
##$LB= 0
##$LEV0= 0
##$LPBIN= 0
##$MAXI= 10000
##$MC2= 0
##$MEAN= 0
##$ME_mod= 0
##$MI= 0
##$NCOEF= 0
##$NC_proc= -8
##$NLEV= 6
##$NOISF1= 0
##$NOISF2= 0
##$NSP= 0
##$NTH_PI= 0
##$NZP= 0
##$OFFSET= 14.98509
##$PC= 1
##$PHC0= 100.1019
##$PHC1= 0
##$PH_mod= 1
##$PKNL= yes
##$PPARMOD= 0
##$PPDIAG= 0
##$PPIPTYP= 0
##$PPMPNUM= 2147483647
##$PPRESOL= 1
##$PSCAL= 4
##$PSIGN= 0
##$PYNMP= <proc.py>
##$REVERSE= no
##$SF= 400.02
##$SI= 32768
##$SIGF1= 0
##$SIGF2= 0
##$SINO= 400
##$SIOLD= 32768
##$SPECTYP= <>
##$SREGLST= <1H.CDCl3>
##$SSB= 0
##$STSI= 32768
##$STSR= 0
##$SW_p= 8223.68421052631
##$SYMM= 0
##$S_DEV= 0
##$TDeff= 65536
##$TDoff= 0
##$TI= <>
##$TILT= no
##$TM1= 0
##$TM2= 0
##$TOPLEV= 0
##$USERP1= <user>
##$USERP2= <user>
##$USERP3= <user>
##$USERP4= <user>
##$USERP5= <user>
##$WDW= 1
##$XDIM= 32768
##$YMAX_p= 474346095
##$YMIN_p= -978074
##$CURPLOT= <Network HP LaserJet P1505>
##$CURPRIN= <$Network HP LaserJet P1505>
##$DFORMAT= <normdp>
##$LAYOUT= <+/1D_H.xwp>
##$LFORMAT= <normlp>
##$PFORMAT= <normpl>
##$SURQMSG= 1
$$ End of Bruker specific parameters
$$ ---------------------------------
##NTUPLES= NMR SPECTRUM
##VAR_NAME=  FREQUENCY,     SPECTRUM/REAL,   SPECTRUM/IMAG
##SYMBOL=    X,             R,               I
##VAR_TYPE=  INDEPENDENT,   DEPENDENT,       DEPENDENT
##VAR_FORM=  AFFN,          ASDF,            ASDF
##VAR_DIM=   32768,         32768,           32768
##UNITS=     HZ,            ARBITRARY UNITS, ARBITRARY UNITS
##FACTOR=    0.250966925370066, 1,           1
##FIRST=     8223.43324360094, 52437,        37816
##LAST=      0,             -174161,         21218
##MIN=       0,             -978074,         0
##MAX=       8223.43324360094, 474346095,    0
$$ Real data points
##PAGE= N=1
##DATA TABLE= (X++(R..R)), XYDATA
$$ [...]
23854 -173128 3815 -136339 -1648 -8104 52478 -269454 -61772 50576 -40354 -171196 -248160
23843 -248160 -230260 27206 -143030 -97296 -383195 262664 31195 235662 -298440 252052
23832 -199988 -167565 -71938 -396750 -110411 62815 -206782 -122776 98075 -120405 254092
23821 73564 -291406 66318 -211503 -223177 -187596 52408 -189226 -73965 482476 -117515 135161
23809 129952 90861 142162 358022 51455 201235 -95580 86683 -187895 202860 -104497
23798 36657 -295225 41130 197593 7524 -79364 -50814 -157009 -174827 148207 135997 194213
23787 194213 331622 11175 -90650 -115058 -17975 142319 -365079 7063 142658 -17804 140908
23775 -25900 179613 454990 15210 -80982 76412 -222186 232109 13103 8095 -208403 74714
23763 188863 -216399 -13261 -37306 -234714 -7087 -262834 67344 116289 -41632 36025 160746
23752 160746 310131 -200046 -62177 -120014 45835 394549 -362927 -61158 -115890 340389
23741 18048 -46278 -207034 259651 79340 -26678 225478 19343 -44911 -32228 -12054 180290
23729 -11310 -294313 -40268 257032 35025 -86220 -342871 -22760 233201 296368 -212769 27924
23717 6867 40623 -110609 190337 -220396 -2416 29142 -228993 -225232 -50239 -127433 115961
23705 -30416 -95215 108820 -225659 -245474 33862 218024 219901 -172272 99515 27249 133416
23694 133416 93847 -335827 540926 28577 89680 -265249 228356 -134690 -182971 -159115
23684 -159115 84158 -250306 -453770 245213 -160257 -218263 -89622 2683 25775 54934 -206634
23672 202488 -391319 20441 -132482 -90510 -71514 -219933 -175719 109596 178574 5001 104785
23661 104785 42875 131380 -279433 -44583 -42365 65260 -126539 29129 -97675 217190 62712
23649 42710 -18410 74372 456362 -180718 213791 77978 29777 -143926 138589 -215581
23638 -367924 87803 -44518 40641 63847 51318 88608 313971 -217683 -138561 -246324 122008
23626 -142195 -212875 -298528 -127083 13430 -73036 82057 71400 -225129 -187412 170091 79086
23614 126310 -126348 408717 331029 -256259 -136908 -43947 69133 -197591 11917 -310123
23603 -151928 101321 -181606 88346 -304225 -57220 -135988 108405 27361 -194034 82630
23592 8672 244069 100077 74262 -286796 101593 277816 -34226 97476 23365 153433 240923
23581 240923 358994 56705 15562 -283267 -7521 2465 149222 -13685 -215801 80707 -113969
23569 10546 297965 95766 133348 -48723 -49435 -237352 -165590 185428 1730 220385 -141671
23557 251545 -421105 -199690 202623 8468 39235 103711 -731 -209909 64475 42248 -276421
23545 -372109 -220782 -80661 -160351 27303 120130 -394223 220526 -84029 -119909 59909 151955
23534 151955 -22274 276194 -318843 60202 -25514 74019 -68919 -370897 -241785 31263 314928
23523 314928 -34740 -373708 171709 91890 -33065 58625 -133669 -219108 -86561 132090 94023
23512 94023 388444 207174 204200 -29668 220765 227436 170934 -127919 -30334 293930 -308860
23500 -118973 -68524 75505 47453 -157638 -179742 83263 -109384 -255133 71012 89866 183609
23489 183609 -106156 -91865 -100068 217953 77022 -121665 -157175 23705 -126914 -201475 21584
23477 -38990 -7782 171079 -41839 -78210 272175 -289492 -176592 -199073 -63240 134494 -40950
23465 -188974 -85435 -186759 -8776 94566 60860 -65589 233609 -204573 -172031 111816 -153798
23453 -433288 157066 -189839 -153856 -138392 -95536 98753 280222 150688 -72580 15283 -142715
23441 9872 -82157 469812 -30578 -108186 -297446 59201 -122249 -176762 -144235 157200 262332
23430 262332 89007 -137736 244260 300307 152375 66486 67419 -217169 288471 132171 -139282
23418 149220 14538 -121251 -137427 30905 187392 46375 -44601 -49597 285860 -14835 -132391
23407 -132391 235788 -62852 -4190 2462 -28128 129970 -36559 240696 22334 -184639 44557
23395 -293503 -63046 -173929 -80185 -139924 16990 -102269 175621 234415 43048 -102789 -53686
23384 -53686 -64765 -12349 54516 10486 295457 262914 -167348 56397 -401166 97367 -10866
23372 185803 -320307 159074 132485 -201154 -412593 -21471 -424884 -130699 -249355 162909
23361 187429 36260 -212867 -161951 174899 -23827 16282 137138 129534 137720 46548 -238329
23349 140804 -359158 -26528 -75447 -158287 -127118 -269714 -123868 96030 38119 -94397 51050
23337 30961 56856 -28718 -41741 220621 -36529 30983 105278 92297 -99017 150352 -377949
23325 58416 19261 12818 -112376 -19561 -165338 81561 -316854 -115721 272301 147426 -4632
23313 -242095 -213477 -213125 38200 -155150 85795 297025 -357984 -12332 -184831 -343627 142422
23301 -198718 -46817 72694 97766 126153 10031 -109534 267643 -407893 -118027 -57537 84812
23289 -49156 -66411 -7178 -127381 163957 132438 49835 35396 -38246 -175588 -78921 -191435
23278 -191435 51783 -50319 155873 426 -54697 -61065 143482 -110160 22167 -11011 -35561
23267 -35561 71478 -63073 55388 334022 73090 19885 254797 -262079 60172 74266 41480
23256 41480 -63322 343878 83976 -53056 -207080 -2434 -37639 62211 57045 -191638 -244976
23245 -244976 -56376 7361 -16279 -298498 279817 77856 158473 -49279 105770 -279057 -10428
23233 140201 -198268 48524 116580 -423034 -20523 -164754 178609 90894 -110107 -7722 174849
23221 -33795 -89680 45700 122539 55035 -218721 109784 -165991 1305 -28094 24911 -86654
23209 -140243 -118936 -192337 -155842 -313754 -219784 -256922 -271833 -80812 -33252 39668 -11062
23197 -6141 15518 238027 -62890 -112042 74056 -12394 -69549 -57283 -309318 91761 -157149
23185 -263318 -82913 -120373 -92356 -108419 -196568 136358 276977 -148654 174189 -60806 145935
23173 -15882 -191339 -65872 149284 89661 108225 -166929 1518 15386 190382 -34327 -313915
23162 -313915 54841 -321822 43498 39906 350576 233928 -32670 -21053 183169 155014 81604
23151 81604 -225415 -94078 -185597 -195268 28899 -84043 -35483 -72413 181151 -49834 168031
23139 -231434 -298509 376296 141012 -123620 95798 104725 -162595 237998 -268509 -43051
23128 268851 162485 182029 23588 -188725 -75123 -76722 31135 54672 -129249 443333 133351
23116 169336 -296713 -178171 85975 -121736 -192340 -111444 1276 352931 -80822 -248251 43081
23104 -17628 -187631 41453 -78257 86405 -129909 -56499 -159283 -108457 226526 88814 255551
23093 255551 -155019 -13636 -13697 250796 -90733 309399 -146446 -40814 248434 -106528 378282
23081 20604 114495 104290 -143054 -93932 -159074 162070 -50700 -178071 -72424 -209459 -148972
23070 -148972 82549 -122120 -90501 20983 107949 103051 8031 -137216 -90046 266479 -7677
23058 -27562 -116518 -137054 34660 -84243 83207 -238154 94130 -177806 -126430 -129570 -35733
23046 43359 75419 226865 -92091 6806 131313 41699 129474 147029 37617 -197981 -201289
23035 -201289 -309460 -114081 -57195 -137298 59920 336557 -110023 -17292 30533 120865 -50865
23023 136315 -178491 -186489 -13631 6985 -46455 -127964 -176782 52822 -174909 -9817 73384 138257
23011 138257 15464 -62922 -232605 102425 -249233 -22085 -186102 71251 -51769 74772 235047
23000 235047 -113889 -418 25280 267176 -56716 -89656 -119646 172107 66306 115406 -39522
22988 185871 -131296 112581 -3787 49982 -39826 -280724 173161 189193 2313 -59893 -155193
22977 -155193 -9399 60692 -61392 238549 -195254 143085 -13374 147616 -257442 -140571
22967 -140571 -322306 -113394 -200082 -83835 -265912 273914 -200134 -180892 34580 -74139
22956 27820 -126660 106182 -105125 78038 -184387 145481 -77749 -210801 -40784 161644
22945 169293 -271137 -57718 -121193 99582 -105747 33503 -74951 -84570 177621 227154 145096
22934 145096 -56807 -232924 -188655 19925 -149187 241022 -55284 -307770 96117 160025 -92551
22922 -94039 65477 92026 -331747 398582 198074 -225508 -252515 418524 -145380 20799
22911 72694 126688 70607 118916 131609 161072 4698 -89171 126680 -116231 241811 108003
22899 -132258 -48242 -134048 -282166 291724 -283081 -358145 -91490 -60812 -157982 140172 -138493
22887 -168981 -176580 77857 32439 -245453 75547 143086 -159549 351710 -46131 127232 169895
22876 169895 -54662 -387709 -302086 -176927 -207084 -356097 -266301 112389 290311 -32529
22865 -5777 -12230 92094 4040 36386 -221584 117817 -25651 64074 -52461 297598 115132
22853 40763 25883 164209 321676 -261071 -124669 111291 -244039 -8848 208460 11183
22842 -18710 59984 -79694 -63638 64440 269321 122178 149200 -96056 -350903 -20849 -123443
22831 -123443 58037 328169 -522876 194985 78206 -35266 -160210 -173023 -27682 -113695 -294019
22820 -294019 -191231 50960 133828 -97018 -130007 100875 250301 173574 -147084 42118 -108953
22808 166335 -224465 -149452 207802 167706 71993 -201630 -47988 -131386 147277 47001 138231
22797 138231 -150889 377969 -165779 -10012 -27854 60261 39659 -3831 -111826 106278 -208817
22785 -187963 278431 153032 -248405 -155370 -212116 162014 -113448 -400595 -126291 -78281
22775 -78281 26128 276827 -1708 -92736 -187805 -114527 65734 -153106 169995 234284 -90348
22763 288672 111717 59516 -33077 -46301 -107883 121227 147309 81407 150349 63663 -202341
22751 353137 34087 -77360 53507 -6267 -160969 -362140 376475 -40588 -368766 -185639 -359718
22740 -359718 -48092 122985 -289183 -159141 62921 8648 -96061 26325 -139802 205607 -164898
22728 47576 98373 -33147 72216 -301123 34324 -102901 -40215 -35148 -249083 -381085 -6135
22716 84280 -120810 10021 -238474 76221 183913 -74095 148463 202242 185542 -60596 80534
22704 112238 -190367 2068 -503762 186496 -174926 -224482 -216541 67598 110635 281152 -105130
22692 213149 -320927 -287259 -23453 76754 137802 95894 -286230 220729 -388509 -291615 -361180
22681 -361180 -277490 -101555 -13932 -86010 50473 -166415 -232009 213088 135686 120459 -229052
22669 73975 -181749 -171431 37827 127397 -108198 -144764 191289 -62115 -45 22842 -380286
22657 111 -25193 166275 148659 -71680 -89971 -94854 -231191 -66833 136030 75159 2462 100708
22645 100708 -134860 134274 136307 -44909 -27407 91608 -34191 364213 -27313 -200786 -194230
22634 -194230 203768 49398 -97462 -304194 -266932 7614 -98950 -348770 -119427 100707 143975
22623 143975 13021 -60770 12669 -79176 -161134 -44389 209658 10744 152392 -143329 -71462
22611 23533 -39697 -196190 30421 -152627 27385 -34303 -317872 390455 -277368 68656 -267165
22599 42551 -323180 245067 -37197 -180807 -13318 -310714 -161457 206541 44071 -164135
22588 90008 67472 144817 -289226 72492 -168847 -7039 114986 -21533 -141670 -68856 184238
22576 298115 -11688 213708 -180902 -147474 251677 -58700 -65078 -95872 24495 -311085 -135890
22564 -58097 60725 68932 59241 204872 746993 -35421 -61385 282388 -228084 -281138 -110267
22552 -111147 404363 -110240 94287 37734 -188232 72301 168674 -241199 46825 -50753 344291
22540 172760 138348 174522 35617 -190426 -65259 -23930 -37804 236742 130602 -136381 170523
22528 -163962 -94849 88952 -40402 -72647 52098 -134365 -94592 258731 -200762 -268556 179648
22516 -174114 208288 118706 87827 -157910 -57810 136856 -107838 88221 30515 -156228
22505 -76845 -260833 11725 150079 -333379 -317751 39681 -88932 59519 159595 -196178 -6028
22493 88194 113380 173618 14334 -101169 -72601 -60195 -92786 -247410 -155585 57080 198923
22482 198923 -127651 -104457 123551 134971 -190889 -341657 -242962 -227225 88398 -374793
22471 -79136 -516661 -123962 -80689 80898 154858 103769 -64017 125977 61647 69669 -242985
22459 -232365 -16970 72088 203054 -154552 72006 406153 72397 -371096 -178197 -164428
22449 -164428 81252 68799 113665 -146892 269898 -235180 -69336 -35106 271694 130343
22438 -34261 -84760 103479 -433161 -271769 174252 -156811 29587 190795 -149674 96071
22427 -236373 -257485 200548 44946 -211601 36225 -154665 241131 -2559 -40820 -159742 175489
22415 46299 156616 198355 -73293 85445 -155529 243038 -210715 6038 -244477 -269155 -219669
22404 -219669 27584 -85733 -164354 -64044 36894 -30055 -313441 81221 373118 -233313 408350
22392 407191 120728 -215825 -81696 -151440 -251371 -193029 -26896 395759 -62887 -197740 53535
22380 334312 297957 -25258 -387200 36758 -142354 380691 -10532 -163207 18756 121370
22370 121370 254411 17585 -345347 -217439 49384 2240 -150341 -79220 -147817 -373982 374614
22358 120093 167812 26476 225241 -76673 301898 -7421 -104974 91213 -110702 21436 30349
22347 30349 92522 -2931 200787 55112 -111959 -287076 63307 -226473 17154 22830 -272132
22335 278413 89930 52628 162411 -30738 224401 -72815 243423 71211 27075 90102 260467
22324 260467 19992 -129425 61665 17925 -147849 -2386 -179785 -27704 187867 -7653 356139
22312 24889 -56055 148898 81193 262802 -96062 -167410 97899 64109 261031 -220372 -18392
22300 -67746 20416 -384967 -216613 124487 -90303 -205615 -318676 -233480 -410387 261844
22289 45408 224580 -187866 221681 -32064 153013 -118052 -367706 -263245 57641 -10948
22278 -132245 -279426 -323026 -135297 78232 53634 177567 -49375 -17588 -223871 -10763 393880
22266 -40565 33316 17908 -197158 -235581 -67151 -153818 282509 -343072 -120175 -77856 118770
22254 -363250 -213832 -362537 -48382 105975 -135347 -189265 -252528 -12556 194053 -298244
22243 -457904 -222603 231747 -81300 -85136 -211598 -329122 -66879 -110696 -317034 -163455
22233 -163455 -365138 3793 -557710 101392 51678 -10613 -60580 -117278 12299 16263 53354
22222 53354 60452 -283710 -47513 21158 -150921 -13741 -220556 -51993 3832 252 133287 80126
22210 80126 -139270 132754 317352 -258919 -39507 102017 16477 -53623 54830 87101 -89673
22198 -41712 -227717 108786 -241896 -72438 74059 -95366 -386482 22670 29089 79929 8760
22186 229339 347722 -235352 103101 -206872 -146588 48229 -360002 -41163 162575 -68001
22175 394341 116934 -40705 50754 316570 -126481 154208 -122416 -5932 -207503 -94367
22164 199920 -398195 -68957 -37349 84687 -110245 -163014 -47586 -220984 -103622 -135432 -110516
22153 -110516 -7188 -172582 259110 -191622 -64776 235277 -123971 372134 -81378 148120
22142 295668 23437 426556 138310 -15491 -133030 -299063 -17238 105792 -125301 -1458
22131 206092 226378 25944 -150823 -61220 427180 -182386 -153146 -32616 238268 246929 43993
22119 -140423 211390 -43952 -304014 -54736 -254126 481933 74273 213356 -218484 -26627
22108 40572 64768 65184 -173356 119348 408349 -410969 121989 -186129 -118530 334685 -382155
22096 20504 261888 57645 151682 -132225 117835 -147843 -182652 -169304 -253478 -131894 -350985
22085 -350985 -347658 52452 -145844 -162739 -217296 -144531 -92530 -180556 97565 7492 -9588 88692
22072 213952 -170937 -309481 -188279 -245006 -24132 -276537 292536 -55568 -92114 -2308 106172
22060 -168740 219279 215624 -161252 -4688 6036 8570 131952 -106439 -77181 49870 -345646
22048 1734 127819 217487 -225981 -196850 -237331 319115 -141897 -143501 107683 -87152 14901
22036 658 -365101 -253509 122937 -124487 -137639 159676 75288 -413995 -316910 101548 250448
22025 250448 -36305 -454546 129580 7241 57788 179890 191644 -239999 185307 -42771 -171495
22014 -171495 123121 10814 -139727 -134786 105971 -117987 91553 414813 -79689 14484 -159376
22002 -108236 253801 50296 21570 -451913 -102719 -292124 -24379 62431 -484721 109784
21991 -397370 192067 -143577 247600 -351284 -332863 -14536 -207562 -350262 -70077 270501
21980 -72743 -9565 -22027 -27855 295717 39102 -304659 -156882 -75513 37051 -213336 250670
21968 -31023 -152205 283825 28327 84758 86815 13430 -252296 -8386 -358997 -60756 155147
21956 9172 63590 -31079 109285 -207485 164394 -207314 63455 285143 -137826 -15338 31785
21944 -216099 -238157 58839 -98372 -106586 519464 16401 -97753 -15486 -82268 -348885 -214497
21933 -214497 521351 57779 -23816 153229 -11980 -255273 -205667 -26609 90663 201836 36411
21921 -172219 112142 -44451 73380 -428070 54027 -17157 -276512 58127 -201504 -225617 352836
21909 -131194 -6316 33060 -106264 68024 -135661 30334 186072 131532 -181529 108443 -228944
21897 272940 -118874 209907 145634 116108 331975 265530 -277377 -122279 16416 -92203
21886 183978 -238115 -21346 357156 9975 -142422 57853 261671 199554 130408 -480309 -13177
21874 -213424 -79242 -66511 -442192 -224496 95022 -299987 2094 51751 98669 -244175 -377392
21863 -377392 40081 60574 -299863 -43775 -110094 -127211 11025 -105546 -6810 -101181 59222
21851 -35937 -109231 -242914 -183783 -410085 -19159 22052 -86955 -114652 -240465 -117849 -180886
21840 -180886 198569 21918 158073 -230542 -433409 -89542 360669 -100873 -162988 7641
21829 -203415 32933 -18603 224690 166945 179115 114582 -168217 -71817 -196267 -175477 -37778
21817 -284896 98376 16035 -117977 -69869 179640 -174288 -376351 -59298 40103 -110041
21806 4968 -319553 -77250 10226 -122642 -8820 65963 172479 -386086 -416621 -119978 186493
21794 48996 -85758 -116811 -73333 38647 113294 -2168 -11895 -67379 53961 315363 -86066 -4417
21781 142854 -16528 -114298 187702 -103215 -162487 151426 -363247 119790 230004 -19128
21770 8826 87143 -32563 -135384 -221826 -276051 -140905 -111772 68195 49588 -187563 279216
21758 39021 -220753 -35845 -94077 128334 106484 -43595 98913 110467 -32406 -51857 -14606
21746 161778 -292028 -177937 42341 126640 -110078 80333 233630 82210 -283948 -224423
21736 -224423 8578 -255937 104020 130020 -246789 -48856 -243189 -389310 129817 20989
21725 84437 76052 -188390 -69249 117473 -203937 15183 427239 -234371 138323 68891 70449
21714 70449 452886 -211304 335074 -196537 106037 -122114 105046 67690 117334 -33176
21703 -310354 -77286 -69066 -248935 -348802 -116620 -70006 -332525 -123302 -335058 -104139
21692 403421 -297945 -207019 -23492 152197 156468 387405 -386243 -180843 114428 -21659
21681 -89900 -113976 -47752 137012 -154192 242183 -66546 29144 -89708 77171 -172483 -161624
21670 -161624 -243705 -121594 -50966 -278301 -312676 -186986 -355071 167747 -347500 -37270
21659 -164086 -26912 -41034 -217449 -136112 303273 -73857 152103 -15199 266060 -25469 312610
21647 -103305 -94163 327075 254054 -257605 22990 -310114 33126 119092 -420602 -94751 133139
21635 77157 -138323 -164689 95801 68317 -198017 12752 -36189 -104859 -106035 -48418 -60079
21624 -60079 -199141 20960 82061 195911 -180804 121081 52135 -39264 -247409 -93601 73659
21612 -137573 132934 -248935 -37613 -125114 520065 140243 -112165 268474 117797 173265
21602 173265 122246 -107710 -235658 362829 92883 184298 30365 -265070 -131918 66246
21591 90346 -307352 -22467 -333506 5268 278484 -138380 57730 -73793 244011 -298339 -55619
21579 -169702 -303131 159589 -194365 -76635 52377 -407095 -156917 -144880 -168366 -129256
21569 -129256 -96214 -390540 98251 182219 -266350 28402 -4080 -93757 -298893 290683 -139149
21557 -9335 -214815 -57659 37595 -98164 -202306 -112007 195725 -120494 -202001 -90514 -156520
21546 -156520 44453 393590 -70355 -218359 -22759 -196773 277205 357992 -70849 -115090 -132895
21535 -132895 -14356 145057 52277 -261794 52508 -49646 -109114 73719 -263414 -16280 -9977
21524 -9977 11085 -27229 -397423 -47855 -135293 -172777 187120 78789 -107934 72714 -94928
21512 -173050 443 -94293 -160468 -36520 -158084 -337567 103689 264738 -48352 392427 16734
21500 131653 -31763 76145 13945 -308453 -64905 -162031 168865 -290606 218740 -217466
21489 -148941 49632 50329 146520 230421 -192597 -45130 121067 -33741 -568565 23518 184203
21478 184203 82039 -162397 100542 106659 70696 201617 207858 -18389 67531 140499 145075
21467 145075 -50963 -18286 -120859 -135885 -193358 -167259 394431 -128781 -116646 -575131 73582
21455 -192129 -280145 -127838 -191134 -108153 187786 81538 -261267 -202988 -48084 -235350 -177534
21444 -177534 -63003 -7865 -73135 30472 565050 -195993 110855 346832 341524 -27518 239341
21432 318322 197428 168973 -11935 321799 -299997 878 -55692 -34081 126828 72841 -242750
21420 -174876 -8026 -201545 -355555 7719 -51357 -350707 -166468 -150986 -377669 13229 -165460
21408 -45845 -173824 158039 305239 71347 -232398 -132654 -44479 54705 -211258 -111419 102241
21396 -154020 -145858 51716 53655 246754 91071 72298 -185557 -278501 3550 -21037 -234223
21385 -234223 -34245 -139618 62097 38069 -135443 -155303 -73079 -191067 -74215 -240548 -180279
21374 -180279 -294784 214032 -305562 -9665 -108319 -29756 -51201 -96147 94977 225758 -87997
21362 116989 -256122 -77764 88226 81354 -1436 -168758 205809 23906 -298144 -264274 -42128
21350 53688 228134 -326068 -57939 309473 -87134 -94315 -95874 323287 -18463 146625 57321
21338 227315 -26067 -170892 -116175 108246 -152047 -27641 -226599 -255793 54814 49774 -27469
21326 48753 204474 219382 -327594 369118 -310002 89028 46754 278382 214701 190640 -190520
21314 48459 -137296 95978 -175055 -60208 -16675 -263815 211731 -4347 -166384 -185313 -20492
21302 -202277 -115541 208004 -400581 16355 -368246 -104886 -64459 -149670 69053 -33215 -19277
21291 -19277 -123696 -92440 -1312 -91526 -98330 -200091 97807 257229 -63227 -27194 -53183
21280 -53183 -251779 11954 -186125 -61651 27586 -86357 68277 123487 47341 54650 -179054
21268 -219672 145945 35705 -62422 -194771 -196137 -374695 -106282 210547 -58567 -717964
21258 -717964 -46649 55316 32965 -14950 232475 -195762 78032 -86699 -258164 -135100 -65218
21246 -104091 -338427 33659 34367 215086 84018 -209656 -74746 -122094 -263386 -53188 -92045
21235 -92045 -15348 -611869 132947 -208384 148293 286297 66352 43647 -51297 57552 94368
21224 94368 224801 -58213 9058 -190692 -121256 -304200 -207694 -146890 -204019 16768 -17560
21212 -113002 -203669 -316537 257025 39312 120412 148065 -5380 -250835 -158914 -467213 139087
21200 86946 -177225 -200038 -129527 -248947 -160495 -60224 200498 142018 14980 -117395 -296656
21189 -296656 104256 198808 -70715 147798 -29368 28471 -308825 -112360 210373 -161556
21178 -63541 61382 42991 328375 -21054 -128174 -88715 21721 -44602 -94748 157345 -332588
21166 327263 -97725 -248759 124400 -56912 -119147 -307879 -172427 -60738 -17926 174912
21155 -41107 -79842 -356667 67009 30184 54998 -194158 -61978 -16728 160253 -179445 194643
21143 1997 77893 -237932 -380235 -57850 -194563 143718 -97630 136925 28719 -62288 -108701
21132 -108701 -48719 58963 -243260 404385 26347 28767 -120500 -344909 40398 -161030 26672
21120 -120784 94398 301214 73810 -83037 -18731 -68037 -124180 -292210 -128354 294421 -274866
21108 11853 70666 -211844 333026 472911 83605 -138749 123740 -16549 -203175 -72562
21097 164975 27768 -80680 -44806 -163498 -322484 -365703 -264248 -89296 -32516 -189607 54547
21085 -29916 -127905 258272 100785 -77760 -178469 -100744 101471 54368 -56825 -155511 119575
21073 132067 -21272 -150822 -93757 -129073 113951 139077 -187230 163273 -356552 48202
21062 -311734 86335 -281207 14304 -275763 185250 -129174 -136094 -196786 177479 -72598 -84378
21051 -84378 -61366 -225659 -225295 -93731 -100337 32562 9751 -158374 -155606 -202583 187438 57945
21038 18813 32034 -50408 -68775 -187820 41042 -334924 279153 -50120 -60334 -128564 -39481
21026 -164081 317311 -24643 78143 276813 -101459 -388526 163837 202411 -31514 90821
21015 285733 279968 81031 -347306 208488 -183968 -105000 71608 -334672 -143963 -280521
21005 -280521 -156493 79373 1967 87657 -31094 140723 -99431 120501 -106640 -80409 -54960
20994 -54960 -486053 225801 -227867 -98879 82427 19967 169073 104206 292863 -47926 -109787
20983 -109787 -155018 -150602 -151185 58925 -63489 -48745 471085 -194157 -51421 -30590 -150035
20972 -150035 124197 -232171 25445 -221105 86761 -156771 -344668 230983 -278231 -20786
20961 -118347 -356421 -8929 168133 -12910 -81170 58336 95866 -385143 -22660 154770 118833
20950 118833 -62754 -397130 74502 -122884 -286135 309273 252897 -124179 -172062 -101463
20940 -101463 294544 12907 17976 217718 -136385 80855 -210438 77900 -95467 259969 10597
20928 -189979 229401 288806 -204773 -183582 153902 -22661 -28855 -242971 -281721 212197 -116118
20916 100633 -106623 -342391 138982 -107410 215561 -476031 119604 -60574 -201215 -69374
20905 54284 -145643 233344 115241 38297 -70572 -51139 -145868 144342 -112401 166819
20894 -156446 -198529 -226994 179606 -614705 -114258 42843 -98093 109610 -56011 -259280
20884 -259280 -56486 -76708 -260526 318843 50191 -279793 -154083 -169315 64484 -33603 -329394
20873 -329394 -260930 370482 59026 205438 21093 -97396 -439369 -274623 -33788 182670
20862 101966 28794 159945 -417144 -99718 68841 -45574 256016 340189 -163599 67013 -32125
20850 -503333 -252278 -239322 -211969 261027 -50375 -219182 -246863 222364 -100063 -222967
20840 -222967 -111048 37067 213686 -17541 -127220 336694 -26709 14934 -223683 59717
20829 -39657 -203588 -22669 233776 -101224 75419 -500210 -135643 36514 -242046 22449
20818 123552 -56481 -255715 241557 -269451 96085 -230367 -72427 -220218 374148 -185069
20807 -133613 -31359 -278178 8030 -224618 -302643 -66044 49405 267953 -130518 108511 -415790
20795 77610 -172481 65904 -61245 4822 270242 15366 25072 41720 92946 -129746 -492487
20784 -492487 -421625 30560 -273427 67014 -185681 55606 296547 -15256 2469 -44091 262518
20772 255162 -104207 -8609 -233024 -30673 6221 34909 -199072 -168063 -232700 202043 29394
20760 271967 -94660 -126788 -98082 74633 23143 106990 77222 -87825 -269616 -179609 -2097
20748 26497 -291417 93977 87812 -77858 149236 -10923 -94255 -133216 101850 62783 -17785
20736 -65045 16164 -5295 79749 83241 277366 188478 -384461 -8439 -92138 -164052 -116613 -103309
20724 -103309 -235703 -41779 192163 -185510 164752 158625 -230500 -101900 -98796 -101451 125031
20712 -96753 252789 -7893 -77948 -198103 -86696 -261159 -125337 156192 -174529 297097
20701 -55053 105083 -324041 -344471 -378734 38880 1735 -238969 -41011 -122765 11938 -72742
20689 -184108 -226973 17194 -231011 -89198 -5169 364201 -290517 334859 -96745 153186 91821
20678 91821 -6317 -27090 -313365 -20006 299503 -39018 -251454 -269323 -95446 -467333 70785
20666 -240263 105256 -7888 81334 18796 -104778 -253871 -124705 -130208 -347251 21759 -158162
20654 91660 56130 -109459 -405909 -147163 46458 -154172 -53493 -179857 144292 52328
20643 -68839 8757 212106 -107160 140651 29697 -208152 273097 -245011 180518 -69010
20632 -137067 -108349 -645669 364244 -23127 -244127 -95146 -86748 213335 64573 -189509 -91149
20620 35423 -221497 -69454 -37678 93603 19837 -51899 -247146 189371 85131 30767 158902
20609 158902 -194136 -34915 -323033 -196649 -27653 63644 107364 113461 315790 343157 -117263
20597 -102967 -19929 -59733 -133356 -445863 -270661 -245468 408927 -104172 -83477 -83279 -198417
20586 -198417 110826 157578 27775 177178 125418 41448 121801 -236981 85291 8238 175509
20575 175509 -131819 -109909 -48069 181540 -335552 -77841 -60430 107059 37324 73975 323156
20564 323156 302938 -26930 -220362 52219 1748 202437 -172753 -131563 -141120 29041 -44155
20552 -176117 69494 202474 218411 -75503 184457 108633 -166773 -247232 107841 -209527
20541 218436 73841 -359616 -114374 126864 47617 31738 -394272 -249618 -122551 124901
20530 122305 128644 -330422 -233509 3134 -96917 18117 -11328 -33362 -110230 -334 2422 -11443
20517 201068 -162152 -235529 -117373 71678 105054 -20238 -222747 -77573 -128748 46897 -79234
20505 -243664 227271 -79013 -137934 -109770 -190767 -161521 -90852 -90156 -61940 193360 -47652
20493 210047 -140598 29762 232102 -204465 137526 113171 67753 -407967 -346287 -40300
20482 -291946 -12705 285455 -99962 -202247 86547 -389381 -74141 -288502 113442 -3379 69824
20470 289449 -145464 -240558 139285 6247 -10727 207092 -163866 310300 -88238 168426
20459 24208 -88211 169114 67540 80453 39458 64823 52131 92980 -188019 -195599 -29834
20447 -92566 178054 217210 -46467 -155594 211722 -294707 -224467 7964 100970 -49500 75205
20435 -105035 77055 159663 140142 -228240 -88723 119313 -150289 -41887 122419 -164188
20424 227396 51233 -145348 -120473 -76130 -149873 -167626 3989 -123218 -118826 -328458 -101882
20412 66856 -192047 -328911 -121898 -214192 -156564 -430622 -28191 -164094 123327 -133751
20401 -45191 35074 -124651 -202844 41256 -47640 119132 6246 -161775 42829 -51574 -331485
20390 -331485 -137476 -1919 -236541 51792 -66985 -368480 231061 187982 -80208 -442328 -129074
20378 -127649 -94799 105746 -62553 46378 -156379 243657 189141 187685 -241466 -93003 -185879
20367 -185879 -92355 220486 -18558 -104400 -160138 147027 12934 -94592 282485 127641 115319
20356 115319 -65866 130636 210655 55498 182919 -141946 136115 -551271 -31972 -87023
20346 -87023 -245124 -383008 -228692 86876 -1569 -271 82830 106942 56481 103861 158142 -276516
20333 285418 -31959 -214828 202425 -224120 -88439 -141563 -7797 213640 20882 -288848 -245290
20322 -245290 -324717 71597 4745 -155308 -533797 -40254 -261414 -48451 -27990 -141278 -438255
20311 -438255 212037 -290810 -40792 -246732 -79463 240657 -14353 16104 203751 -139653
20300 56186 -149889 -219313 30223 52349 -435215 2120 -350981 -61901 -221474 225140 52284
20288 -316647 154070 220648 464568 -195095 14226 -399556 -167114 -184244 31729 -78060
20277 54766 -196377 193067 -353270 -458228 -187288 40492 346212 -19679 -438017 99270
20266 -136430 -61543 -185766 93329 -72174 54618 -81482 -10301 198779 157911 -212578 -169480
20255 -169480 -213020 -322162 -347645 -173179 -271233 97979 -125254 175377 335086 -9370 -292727
20244 -292727 -13628 189134 -124348 254330 105231 -44594 159659 48413 331861 -161530
20233 -34694 -178071 -8229 -123651 180843 -115696 -209944 -17581 86905 105083 -398159 -281990
20222 -281990 -168179 -153014 38346 16158 -189017 -247778 -55657 -33074 -221912 10172 -89873
20210 -54634 81344 -8478 -3422 153708 -176744 -67825 -312423 128384 92192 -299412 1005
20198 -39668 -47168 30578 299124 -67777 79324 -198673 -329260 77669 183358 53903 -146753
20186 -197882 -26053 38671 41544 -152474 -228219 622 147007 129869 115314 -93032 -203680
20175 -203680 -133441 -91444 -224290 203454 56866 -109921 -67308 -191441 -15221 -117815
20165 -117815 -141059 -331772 -73071 -134832 -250950 130856 69843 119083 -48110 -327797 -71395
20153 -359000 -6430 -301130 33118 42490 176099 -266524 -138011 -28661 -61462 368022 395586
20142 395586 156258 40053 -119656 52453 120961 -110246 -328550 165152 6593 241759
20132 241759 -357251 -92924 -5606 -144039 -195349 377541 -290622 198850 -14080 -15236 -136669
20121 -136669 174749 24176 240859 -102251 -44937 67565 320252 -99493 -263218 33551
20110 128397 -204290 -248077 73958 33946 -263084 -366334 -209895 -578021 14036 -76071
20099 21381 -307318 -161249 269894 -35209 -77519 -159 -205595 248417 13814 -94839 -277030
20088 -277030 -285451 127675 64294 214015 97824 -6088 -42720 -92017 -11302 -59468 -99392
20077 -99392 34957 21628 -79737 -123 -46637 167592 -33116 -201335 -87598 2398 -70141 35038
20064 -139184 42048 -215722 -70057 181588 -48374 -134358 31121 -270615 168612 43553 96918
20053 96918 117547 -138626 -331652 -267799 -109879 -476163 38698 34452 56028 -35799 -292377
20042 -292377 16629 -107198 -86217 170684 -70676 -174091 102560 -60589 36929 -352575
20031 -58395 -75790 -497694 -382451 190483 -101912 96690 92293 89573 -130823 -58134 133612
20019 19015 274757 -61492 -178366 -98220 74282 -15529 161179 207298 -262262 36564 -275913
20007 -47019 -162235 -102666 59165 -53456 83728 -146046 190527 123342 -13894 -40399 -56012
19996 -56012 338843 165226 -121009 56264 -279924 -134103 -319686 100006 11331 -67496
19985 -163772 43714 77751 -190762 -144502 -256555 57613 57281 -142401 -272520 -135218 -105662
19974 -105662 -223541 -44223 1291 -149476 37839 -139711 109043 -289092 72939 156758 -58393
19962 779 -235366 -71449 29901 -30479 -255228 -379109 -132850 33019 200205 229792 251960
19951 251960 -128641 -226047 -351156 -58415 -40941 -93087 55552 91553 175 352989 -742 37334
19938 -304137 252545 -162769 127640 39442 -64299 96056 -139123 -250611 94892 225296
19928 225296 -247633 -180708 -187866 -71052 -176562 62572 -426136 -180594 121700 149593 11896
19916 -27372 -24756 -9996 70969 108248 280901 -115766 18960 -40865 -271707 86717 14968
19904 -114581 -106245 -37443 -12237 -12969 -171443 -29351 157541 -78457 391397 -41356 -231798
19893 -231798 88616 -358478 188990 76147 149816 -147735 -360590 -80801 61991 -101302
19882 -51688 154162 -308079 -3588 -36049 -313556 422164 -93835 230050 -85851 -70615 -148653
19871 -148653 -226939 182063 -86670 -187384 -28649 -64505 41692 -238566 -26752 -53119 199667
19859 -79616 -349458 -116551 159774 32529 -74211 -272766 -185200 42951 -237197 196653
19848 -43930 -5754 -194872 -33749 -153345 -127197 -53853 138321 -127874 -211835 -27167 37637
19836 -171192 257294 -74035 -9237 -24798 -22342 89306 -90201 -127236 -199994 170725 223545
19825 223545 184611 -169791 -153915 -125189 111880 64239 18222 102785 -2170 -136077 -256620
19814 -256620 -140848 262710 -128203 -176590 451905 108001 -45657 -191021 135805 -41381
19803 71712 -179500 140379 -403367 -43001 -34970 -86689 127170 -58965 320528 -301563 -97008
19791 119717 46549 -234990 -95459 -470159 -175837 -151695 88797 -238426 44305 150385
19781 150385 54376 -105051 -203 -73027 -58572 -125374 -8339 -161658 100398 24394 -204122
19769 -210210 -58796 234325 -146337 -193947 107378 -97576 107218 -303703 70692 222884
19759 222884 -103451 159611 150377 -70289 52915 90908 192718 109621 -93333 -276653 -234781
19748 -234781 79971 -135734 120418 118296 -230743 -157982 -115508 -43581 -156787 -280226 27671
19736 88238 24016 -130969 -70814 -151036 147326 -27959 -12391 -233638 -85956 -247292 134135
19724 -233291 -255055 -47103 -217085 -17485 98492 -488086 187077 -85043 106174 13181 -185898
19712 155130 -37010 -134304 -119408 -348285 -140331 -97601 -19640 -5756 9350 -51478 -82484
19701 -82484 385735 8214 177584 19061 38733 -116161 22925 -156224 206017 -240691 -74294
19689 -11135 -277694 110443 9601 71518 41481 -295095 -135111 -168305 -64743 87929 -103981
19677 43563 106690 -43858 -138065 62726 -323143 140191 -153768 -73177 -129469 -324929 91485
19665 26591 207849 90036 -176634 -231241 -378820 206159 -28477 24843 105171 -118 94781
19653 353981 108341 -37739 119035 75996 -331157 -94797 -35608 449366 -39989 165940
19642 308403 -99779 -227382 -9553 -108053 5681 81498 -63143 -211781 -14176 29412 146420
19631 146420 231 127590 -71335 206560 -74152 -140048 268523 316412 -43212 -32271 91457
19619 99074 109829 -371564 -75801 135003 109035 -34843 363583 -145295 -320021 -29401 -40910
19608 -40910 -297670 -257266 138475 11671 322775 60801 174235 121686 -218475 -100019
19597 40023 -66913 37068 -104046 -76396 65610 -110384 115646 160660 130878 337871 -85294
19585 40409 48314 -222097 105449 179005 -249092 -105888 -220334 242712 -337020 -62425
19574 216746 -291899 33865 181589 328481 106094 -139390 302698 -159993 51139 -12328
19563 -152137 205389 -288224 76839 -51175 -106652 -47223 -306674 -301183 -40252 -61531 223615
19551 -40209 -33695 -160599 -298762 151116 -227586 -162866 -45809 -167806 196521 -133248
19540 -330614 106706 -205785 88666 74016 99067 -310621 127056 -289205 -65549 -358364
19530 -358364 -152044 122871 55238 -380040 -304454 211779 -105414 -244250 -478041 66198
19519 -144688 -97946 239252 -25254 -87457 -53823 103192 104367 -163145 -253301 -104953 -189428
19508 -189428 -117011 82064 -144517 -95129 -170034 -70834 -229498 -12909 129381 105851 -7081
19496 -16439 -60754 -16575 98344 -282523 -190506 -35531 28279 -83809 274438 -89007 -235761
19485 -235761 -112979 372815 -100698 -301788 -97923 161923 -28570 344959 -240851 4992
19474 243737 -57362 -291118 189324 72104 235101 145807 -43549 -248398 47111 -135322
19463 -119532 -207910 -116831 83718 112372 20639 -203309 -81697 -487055 45962 133643 -81664
19451 119328 175602 -300817 -67203 -179297 220547 -355831 171324 -117335 -61539 311970
19440 -28088 33441 81313 -34228 149512 -210128 -209736 106644 -1025 -167929 58435 -151937
19428 -39183 179949 -133822 -556416 -127879 -128034 156244 107051 85362 -117056 44319 -389939
19416 19331 59938 23226 140514 -161538 -347735 -305956 -9063 -61695 407102 -102914 -95159
19405 -95159 -33535 19692 177128 81109 -131399 -109133 100456 -374157 -120716 72222 33592
19393 77531 220143 -369680 -148907 182056 -190134 60315 -103620 -71940 -90888 -66024
19383 -66024 -78828 236417 189700 9500 -136358 -283075 90014 -181355 -3202 -192318 -96363
19372 -96363 -119384 -167355 -384714 337342 48717 -122450 -59419 -220177 -40444 65974 49063
19361 49063 44465 43095 23112 -51122 322107 -46758 -26006 -115072 50270 -180526 350280
19349 157382 -217865 -56850 -264548 -259868 -191007 -130785 -207101 309847 41882 -97529 74419
19337 -37612 -194282 -133950 -23075 40879 105611 -153693 211066 -144719 83126 143793 119134
19326 119134 191116 12494 -2293 -67666 -169890 317189 -312579 187527 187580 13517 -78043
19314 135832 -207745 -194757 -320669 149897 12386 -448213 -139863 233873 -82677 -197782
19304 -197782 -226370 -303429 -194114 -309506 -272077 -287766 70994 -112157 -318693 61701 -128488
19292 -16578 26139 -213854 -113802 -217414 107188 -196843 -182021 1918 81667 -9720 -105956
19281 -105956 436867 -56533 -40577 -218657 -126086 63145 -141131 -106642 -148801 102782 -370935
19269 -68048 -165842 70108 -126700 -314163 125493 314982 -42756 -56773 -122928 -249640 153999
19257 -189119 154185 57360 -265688 -59179 -149398 369309 184537 -273855 186976 31936
19246 -120552 -103469 -345519 70805 -91789 -117565 35189 -259379 -119689 -161885 104638 -12648
19234 -419880 -51204 237242 -190062 177533 -211436 -212426 39500 -172168 -309891 -190073
19224 -190073 -245664 123609 -33456 -116200 379331 55858 -220916 36268 99608 -55556 60257
19212 -41772 -310089 33188 86012 -79514 -193759 -380877 18261 257635 161478 -142576 -33449
19200 282015 187399 27497 133539 -21610 -298059 18610 101887 -329147 36300 -154665 -229541
19189 -229541 -23731 221781 -220092 -297399 153449 89128 -11753 133043 -67364 154148
19178 29666 44484 -260771 -224091 -9802 -38969 333058 -21036 137044 120814 98598 -185055
19166 -18213 180863 -71243 -338079 -210426 -107476 26333 5087 9451 -41243 -194663 143154
19154 -103099 -201590 -5871 105797 55775 -206192 -400931 -400104 -141817 -85804 -159881 -174985
19143 -174985 -138023 145979 -171826 4593 -90200 38522 -62959 -52983 -121724 -263754 -45909
19131 8263 115108 -453663 25493 220842 -154776 11196 -368006 61683 119745 43744 -193077
19119 36614 -182294 71734 -419586 -279703 -15269 -47544 -147831 -256793 -153822 63981
19108 -23068 -286321 72177 53122 122186 102660 45430 197509 -24296 3036 238775 -66635
19096 -51164 -687209 534605 -49731 -48370 45838 87278 -74125 26170 -220462 -125358 -127808
19085 -127808 55939 -275562 64460 136494 17365 22269 193085 58429 -193346 -19430 104535
19073 -465239 184379 268003 3864 -220989 -259909 -91850 59408 139565 -87164 -265225 35373
19061 -90887 -127498 -266435 -78129 -130959 40420 -56618 7906 95318 337196 -402244 -251611
19050 -251611 327471 -12951 -289471 -99807 -83030 166599 -158395 19075 -306070 -41164
19039 -367580 99386 15853 5728 119132 -256633 -271264 78871 44890 -141045 -117224 -53412
19027 -185230 101914 172383 116317 -222679 133217 -17822 155096 11512 -337541 199567
19016 119978 -115605 244168 50144 -173077 -65511 -115243 59362 -52568 292288 -149767
19005 -235478 -11559 -130958 282966 -50785 31252 25602 91734 354468 -140689 -4550 -281472
18994 -281472 17618 -37253 -249360 -79866 -118618 136840 117592 67953 -116610 324155 -277590
18982 -261923 286371 -165386 -99579 191165 24881 -90767 30451 158668 -268661 166053
18971 109007 57479 59615 35555 62004 -299375 -28566 -279941 -144641 203054 15447 248598
18960 248598 -140120 -363393 213741 -114578 42623 98724 -277473 -22001 -93528 -158589
18950 -158589 -23662 -139771 -221760 -445385 -8374 49010 30725 -138292 -133192 13108 191851
18939 191851 -32855 -339926 -91723 -296546 211147 -173208 -83245 216366 -47611 -230655
18929 -230655 1844 238216 -39692 -137302 122173 102795 114596 30554 51715 -159585 87965
18917 -280577 -466442 -224539 -331270 77178 30714 -304901 73768 -54476 -214085 -137242
18907 -137242 -290750 132342 -185895 85758 -666 -101132 91109 1089 -283875 56244 -160825
18895 73122 -4560 263730 37260 -2412 -235464 -66260 -177934 87058 -79575 272042 -100490
18883 -13319 -55395 42748 -318743 -237972 -35728 -382321 -98897 126896 254954 -157314 -175612
18872 -175612 -179579 46398 -129695 -340619 -302981 410084 5359 57085 245772 -121855 73273
18860 -260245 -57271 -191624 -187572 98475 -127044 211206 -298853 -65081 257 -11502 -76741
18849 -76741 13150 -60947 -98530 44780 -408486 -21095 -295400 17888 -116779 12760 -87313
18837 -42094 -183405 -150067 -209924 -306000 -169415 -125748 204769 -224311 75205 -213385 119774
18825 -78231 -129361 81015 -11389 71609 -302143 -56668 405008 207941 133721 144066 347313
18814 347313 204611 106305 51502 57985 205821 30255 67277 254520 58148 -100446 623
18802 -253578 -172879 194935 -172235 -345342 272509 201742 108263 -255592 -269641 174552
18791 -150283 -181499 -390183 -15406 -80815 -388969 -234433 -58911 1005 -120786 -128347 -73772
18780 -73772 210798 252935 88630 -96624 -277265 97156 -168967 5750 193862 -360863 -67601
18768 114538 -229264 54787 -24433 -107199 58122 -130814 136141 160328 154640 -86525 -132599
18757 -132599 -193782 -158474 -321211 -170282 -243943 -5894 -69051 -125241 251159 -102517 -160374
18746 -160374 -53789 2386 -83102 135123 129220 185853 168948 -5661 2058 161013 113392 -51068
18733 -158380 -26853 56080 -82587 -27981 -97131 7006 169998 -75756 -64765 -256495 -376632
18722 -376632 403334 -17815 -77211 -16351 -102434 -135293 -95374 -291011 186912 -139244 -89595
18711 -89595 -125562 110921 -3662 39011 -197498 -89458 -37478 -254444 39405 76434 119918
18700 119918 4633 -43838 -133605 88974 -370744 -237667 -185182 150186 6142 49041 -19990
18688 125307 -6725 -70454 14499 -170063 -98912 -67943 182913 33189 289323 -209621 9724
18676 -42724 201210 -231870 -26647 -5382 -53778 -279246 -87067 -30158 -174544 195838 134971
18665 134971 -234528 112365 301201 245789 221416 -402640 -151546 62436 207385 -164262
18654 -8568 99934 -79560 -27963 -38648 -160457 -168129 -6861 -198844 296389 -351300 -17033
18642 -38230 45535 67950 -68165 56863 68727 46627 -61070 -24294 -1489 -104567 256453
18630 -71201 14758 -244989 -6675 -181433 -77848 58008 -75611 -77458 212017 62411 -284974
18618 -224434 11634 145893 -363768 150228 -464370 -518390 -147329 -82211 -173850 -252375
18608 -252375 -335043 42843 -172342 -98307 -5855 -52122 -56374 -232455 278672 -234925 -104160
18596 223869 -139382 -205441 -43822 -218190 51284 15348 200408 31774 140012 122332 -330733
18584 -111805 8085 -70319 328818 20399 -264152 -11823 -286127 -151388 -64402 -73337 -23316
18572 -159447 8229 -275851 -5479 -114119 131966 18261 52446 140640 -33874 -125523 -239453
18561 -239453 -227512 -199549 36314 138878 -207830 174631 31726 57734 141358 -63388 162470
18549 -146943 -65405 128043 -78683 -150122 1816 87149 -201647 141905 -68124 102790 -67380
18537 -12888 53552 -60796 -72672 -132023 76061 180739 256502 -27189 66529 146632 -104763
18525 139305 -218220 234098 -106333 -231542 9937 -170332 -214268 -150322 340758 -376841
18514 -232671 73273 43808 57878 -223011 46030 72276 -133740 -95498 -200730 -459420 -28531
18502 -245835 -46846 -69559 5354 -97365 -58022 -125041 4675 190828 39884 165996 -77550
18490 20151 39005 -92582 -512596 -61105 -63077 -426736 153471 -129891 -124363 -174249 -73755
18478 -114048 -349449 147892 295004 200538 -283710 105334 -143861 -324560 -232355 -234314
18468 -234314 -196818 72967 -363332 -158373 293583 -104648 -409464 -156713 92864 -371224
18457 -143269 80139 53004 -196097 -11078 94893 -176031 44971 -183283 91751 -75688 -178089
18446 -178089 -154498 18910 -29992 233982 -201323 140743 -14764 205 -98608 -6836 219351
18434 274648 -390560 -18714 84022 -190495 -115901 -49918 15245 -61888 36937 224662 117449
18423 117449 -138043 -209744 113102 92672 -135530 -229766 189943 243773 -187488 98194
18412 255614 122134 -41390 275272 -75559 -46738 365450 42049 104471 302300 140639
18401 -106664 -48235 -145528 41256 63748 355463 89260 -190466 -312333 -312147 89483 -137696
18389 -5973 -257787 9541 -96949 59792 282834 -188079 -100550 -51299 -53330 -167268 153654
18377 116064 -41968 241413 201170 143295 36019 169293 138692 -199499 -127994 293510 342512
18366 342512 -85085 -269753 -130562 -200410 -16886 278945 -159193 -77808 28735 -250956
18355 -97123 -30573 -255498 85797 -37974 286394 -81555 -195874 269998 324096 -43872 -108258
18344 -108258 109622 178798 -362751 102828 -436791 -159253 -256082 -356969 81681 84062
18334 84062 81144 -102905 -33566 -60123 -254891 -104269 118009 67936 -36789 129881 -14237
18322 -118977 -91160 252472 149102 -196320 25917 -72414 -82388 126626 -106473 39714 -241154
18310 132951 36368 -23060 -36520 103181 -363742 183664 -182016 -164772 169121 -62081
18299 -175371 116465 116487 -133635 4293 148250 -345096 -106835 59226 215981 227077 801
18287 -25623 57822 -245834 172325 -108125 -54921 -174114 -12593 200474 273802 -52424 -124950
18276 -124950 -122689 -196076 -17756 56844 -414636 18577 41094 -231882 -97795 -257554 212175
18264 34621 30434 51828 -303270 -119806 -153360 244944 250289 307822 84526 -191567 316568
18252 -296393 7693 -255111 -61661 182136 -220757 10891 -124993 326729 47955 219102
18242 219102 55784 210917 -96501 -279234 -176992 -104841 -259172 -42564 66786 34363 -279044
18230 -46363 -26634 99091 -150386 -135454 -129661 -225035 -14542 -109187 -384496 -151273 -58937
18218 -204373 -153457 230664 14540 184031 123093 -204202 -62962 -81618 -195933 -155767 -276174
18207 -276174 -49272 -332267 11113 403919 229206 -254 -162763 -192385 -109733 -216109 161794
18195 -361908 -110529 188989 193772 -158442 -66398 -39096 -208551 -277972 138199 228736 -94223
18183 -179719 216321 43225 -103989 396954 196776 -196930 5050 260230 -130871 -95938
18173 -95938 130174 -147152 1028 -646 149614 -61517 -147938 -154915 49567 50426 -185356 -280161
18161 -280161 -301643 19133 127315 -102105 -168603 231348 -204963 -135943 187873 -146578
18150 -158790 -232864 135412 344215 70211 53339 -71045 61964 -70413 -69184 -6026 -196340
18139 -196340 77346 38658 29215 133158 122208 193926 -148518 147893 -34241 -115370 171873
18127 -9842 -71102 -98804 197967 59832 128827 138855 -71125 35971 300713 -105542 18228
18115 -42243 -178118 -112320 -194539 52779 287499 131397 -320223 -113850 -58639 -193110
18105 -193110 -158682 -225240 -166942 121886 128913 48843 -184304 -64328 -160831 -50365 -180719
18094 -180719 -79300 -176406 114791 -410174 36889 -202783 -206273 181280 157424 -148214 -170510
18083 -170510 -372379 -424403 -314868 4978 237887 -160383 -249392 131322 -24041 155622
18072 -13389 127859 -6660 -26666 -37102 -352066 -175110 -120517 116978 -86289 41647 151494
18061 151494 -94237 65990 242782 178140 86273 -423765 229412 -369777 -142383 -280488
18051 -280488 253555 -58906 -202398 -127857 -354107 -268417 -64552 49855 -90099 3450 50214
18040 50214 306104 128672 85594 -119397 219600 -31161 -12254 -287879 45700 215375
18030 215375 -219080 100679 -307793 281519 -71117 236543 96881 37442 131554 -179886
18019 -62723 3006 267688 -132478 -409453 63084 222800 -103141 -273345 -113503 10395
18008 141552 -150823 -145137 -94232 69136 -44804 -92456 -336982 -204832 6526 -136136 -249657
17997 -249657 171410 64424 -38291 -40001 -56185 161184 103476 -173647 -26683 -22700 68727
17985 -155128 216085 189476 -18587 -56410 197500 304337 10200 -17887 48545 2252 -161119
17973 -7133 -40777 328252 59575 -24528 253500 -38414 -221537 139723 -51240 -104373 282457
17961 4642 -216050 -215713 6932 262601 115689 -136657 -13888 91079 95252 -234137 81889 -106200
17948 -148962 -56760 108675 34992 -236902 28816 -200471 54803 -172981 -206742 141878
17937 201052 -36041 -172764 10105 -52021 19742 125445 -50551 -310534 -20742 -9246 53515
17925 -57058 -302622 -156232 33511 -267885 -27152 -307132 35973 180549 169684 -2839 6376
17913 81666 -16487 20614 58647 -31618 266511 352732 230977 182042 42997 5227 -127770
17901 91722 262370 -212951 -158561 -157977 -53636 225115 82394 -69629 -371747 394246 -271008
17889 -18740 257914 19386 147102 -13407 -215562 -94419 -354449 -188160 215198 103118
17878 282129 -207426 68467 67679 122929 -57936 -113604 -247187 -242652 211314 -236541 -21730
17866 36810 98206 66363 -92304 16879 25953 -400646 611 150238 23406 132836 -203895
17854 261608 43478 -302951 -112599 69824 15803 18204 332763 60295 212062 340329 51660
17842 -198524 -35448 347412 230542 -136594 -46611 -4836 310282 40645 -99909 -72805 29410
17830 -288671 220541 -70072 -118609 -173358 -417597 24637 -430151 -156680 -81305 -60547 114813
17818 -10572 53113 -69543 -143997 -93680 7581 103241 132151 -18805 -113943 34270 199710 -129061
17805 -372290 175014 -292278 102428 138870 -151113 -381884 90056 36175 111142 139941
17795 139941 305856 -189744 1499 3596 18244 166769 -109797 -103219 -166210 161864 -397540
17783 -191708 146027 31086 145105 -359870 299149 -384412 6823 -15101 -73865 45924 40634
17772 40634 104842 58863 -181928 -314093 -35949 -135085 -202203 93747 281103 105983 57009
17761 57009 -60320 -67819 23248 -261780 -40885 76599 -14199 310710 71472 33943 32511 -160793
17748 22776 128723 4697 -309161 88666 -191678 -44439 184 -74235 -43569 507241 156551
17736 182381 -152853 27638 -345942 20912 156500 240079 -66975 -76564 144712 -347262 -83035
17724 338750 -133011 183021 30850 -460998 239279 25977 21388 -53689 -6119 -41182 29649
17712 20736 34681 149803 194241 100429 -260934 -81859 49362 -103794 -37121 124314 -69185
17700 -64880 -71618 -20089 180464 125490 -122146 -233157 311402 11219 128493 -145789 -33851
17688 253459 -2440 -145715 -172791 297781 142275 47100 168723 -59334 486801 -45195 -365064
17677 -365064 218579 37972 208431 42075 73983 171516 124410 203110 -151564 87452 270746
17666 270746 -156840 373700 -18128 -87287 52300 -127203 240629 -66972 285773 -41947
17655 340943 85603 22500 16658 -137874 -332575 105886 -111813 -120354 355770 52546 -59445
17643 165145 89663 64885 -339154 -182035 55975 143464 73723 -234042 -110995 52529 704
17631 -108359 -27453 243029 -160879 -79468 219995 -117466 -35604 -135441 395848 179158
17620 -157161 -21475 -88033 106886 5925 404065 137342 88970 244793 29913 59232 195050
17609 195050 -221379 248622 152710 -51698 3127 244328 101534 39341 -73075 8193 197868
17598 197868 285777 -870 226825 134943 103199 353547 48419 182690 150218 368524 431059
17587 431059 -16654 328016 129628 -120021 -64823 -78547 -256749 -3022 247670 -68913 -211417
17576 -211417 -153369 251815 -339604 206077 -226575 -36500 -65283 47412 70843 -168646
17565 -170385 101776 -132039 82468 -277784 417262 374973 39739 -185379 -234406 -108281
17554 -89432 -82099 236532 -141170 -25694 272344 -9238 178039 18981 -11263 134257 248390
17543 248390 -115479 -57499 -120297 6592 130485 205073 273667 -43850 -130739 -33334 163422
17531 266570 -145430 38065 -69726 77797 -73123 71985 -25281 124942 -62184 171903 -169693
17519 216702 481162 158930 355887 128061 357599 -120842 39943 215600 -128974 -3078
17508 16106 -76227 1376 77209 -94240 311564 229128 -152288 172518 -70634 131306 146263
17497 146263 216676 111783 70624 131645 96605 134771 38211 213556 24153 26102 524318
17486 524318 126070 247226 115792 132778 247295 186816 365842 13193 -168630 424002
17475 91317 154209 169099 121850 -98809 196693 180849 176203 -164953 413034 86773 10599
17463 28057 -5790 -94196 200954 162773 87183 -246968 -7549 10072 189540 124163 278273
17452 278273 79158 173412 245390 181345 157729 164849 115955 501570 881 -219367 350190
17440 297840 95449 333727 -130981 115013 74571 138966 173057 422056 214728 236469
17430 236469 170365 -35692 269015 496209 99311 290576 189258 283333 141958 -15757
17419 359011 65170 235670 -98916 118324 210158 155662 -36782 149968 197769 151041 256261
17408 256261 301237 -68413 61594 117836 -111288 44181 148825 10306 246357 305895 188548
17397 188548 184836 122778 -54672 13429 -185808 255454 40400 116902 -118390 214595 20111
17385 258492 261304 441217 136606 11912 -54103 173888 -91063 200043 381261 195796
17375 195796 285995 162676 47063 -64120 35464 152863 239416 273154 -76329 -11978 13757
17363 278869 81192 304414 23923 132445 -89424 117036 66465 -518 -135255 -38112 132489
17351 337537 179519 133556 -69008 263729 265840 63444 241165 99065 199378 62102 397737
17340 397737 204416 125961 349120 434988 87003 629656 87338 129461 256615 208166 488172
17329 488172 -35201 -88053 166241 -21601 101036 324255 159984 -145959 -16948 -99214
17319 -99214 150308 81192 114560 161768 330952 92416 102116 233324 54430 346076 49256
17307 139768 355304 -199876 -62069 89006 -132913 392451 100923 401433 -157440 -24772
17296 63758 112221 44141 440530 89444 95367 168371 -49274 -132246 293487 426836 -26295
17284 261536 216502 280207 246855 234639 16263 -64060 100484 403149 313407 -125627 106283
17272 170691 363580 251596 138499 189324 210330 -8070 -100384 26419 145939 150847 391390
17261 391390 81557 97582 -285653 -134698 -58186 -64887 194457 182916 -143308 -5888 197743
17249 121781 400402 89306 271637 425317 444933 266526 183075 37580 345133 43327
17238 17606 186708 110824 -107864 216573 468801 501102 192926 385772 132602 180042
17228 180042 191973 310028 251504 33119 -167320 -14609 71154 359033 405073 20028 218359
17217 218359 193586 359787 -9026 117674 10791 242837 85154 247663 400627 200711
17207 200711 259737 567533 394505 186661 213009 66576 629696 305451 449984 79951
17196 307881 64733 456598 431460 396234 -64912 201883 446312 306590 -60978 148508
17185 166023 197982 373253 217996 349761 278700 262836 128595 13654 69975 -56031 357673
17173 521775 -21028 175559 307609 226725 235653 47291 505294 292791 119963 306273
17163 306273 612574 386664 35140 601474 186922 459446 207840 315892 234943 372147
17153 372147 399363 377735 -91802 418399 270266 231701 5020 191050 199687 374063 221854
17142 221854 249774 77941 620771 508202 137632 -57776 640116 424865 488450 241008
17131 108555 180839 176285 162207 132901 358516 307042 37819 498645 333163 182715 238779
17120 238779 505637 119912 637099 31492 512008 221019 136658 391765 372165 318045
17110 318045 458780 139425 122061 618 351314 167223 266899 429480 379178 216536 -11916
17098 431450 435827 633131 481957 81465 308675 576268 382988 225830 390024 440652
17088 440652 390416 237375 473918 525499 366785 455349 269534 621285 286551 365452
17078 365452 306657 314750 548321 576109 400207 398959 221699 356160 351019 299669 433165
17067 433165 321882 168507 507417 515069 617756 434111 467991 460520 394454 573489 624476
17056 624476 320857 453667 354190 542383 419105 744405 452571 598069 558848 508271
17046 508271 474198 490256 583362 550345 222835 348886 510772 585197 800874 283381
17035 529304 485932 936814 417611 856634 443057 397561 544656 321128 346441 673735
17025 673735 382230 891640 491197 510119 517458 628899 545983 568457 402649 660978
17015 660978 735315 152245 1046286 594426 512225 422090 324000 595502 506875 853491
17005 853491 758605 886768 752005 602346 626082 637454 402650 622945 442651 519076
16995 519076 833288 628139 398894 439170 604636 794992 567172 566811 560614 644962 1146431
16984 1146431 780531 1035774 566596 884520 646331 723043 762892 739551 1035757 1081758
16974 1081758 1017873 762601 674304 936507 697025 906574 973497 886714 981351 884513
16964 884513 800204 936215 1020675 692637 1068155 951087 1165696 892350 915149 483408
16954 483408 712592 906145 1035925 1000579 956128 893168 1307714 588330 1184802 907935
16944 907935 1115633 800878 968192 1066011 1154169 1011508 900011 762392 865581 1240561
16934 1240561 1214897 864603 1240545 1190170 1150508 944378 1507246 1180645 1429483 864389
16924 864389 1041838 937503 1195057 1377659 1249039 1423772 1432115 1251100 1530689 1467807
16914 1467807 1110466 1498624 1454114 1166485 1340755 1267735 1255985 1829881 1549957 1662374
16904 1662374 1499611 1517362 1741509 1680310 1659293 1377472 1745463 1995646 1524888 1820926
16894 1820926 1817742 1720600 1833607 1945539 1362207 1962896 1931846 1928191 2174446 1757708
16884 1757708 1956553 1933953 1692897 1925809 2339445 1784197 2043877 2232545 2176635 2221584
16874 2221584 1841351 2366105 2281505 2118817 2375393 2561206 2193843 2600685 2464578 2665194
16864 2665194 2706348 2678113 2503350 2681178 2775423 2805114 2778011 2954636 2720121 2529696
16854 2529696 2940494 2645426 2766992 3196873 3006240 2925621 3095029 3155286 3307906 3021013
16844 3021013 3538757 3082934 3265360 3253942 3701583 3369424 3604863 3873229 3845286 3569441
16834 3569441 3693633 3926064 3612488 4147340 3958204 4389105 4227817 4303605 4450444 4207475
16824 4207475 4623957 4681932 5061458 5094955 4634081 5230699 5038862 5111935 5185682 5306151
16814 5306151 5543297 5366263 5885873 6003864 6036276 6072419 6346837 6565690 6641702 6236194
16804 6236194 6793238 6827186 6700523 7253225 7355130 7812331 7922613 7570955 8050570 8433336
16794 8433336 8359589 8669265 9115383 9422362 9287136 9300678 9578297 10413533 10443249 10303300
16784 10303300 10793639 11029788 11249049 11948659 12209940 12606984 12654275 13212310 13478380
16775 13478380 13995064 14426228 15153991 15626150 16127111 16273339 16946117 17440573 18201423
16766 18201423 18564654 19442384 20012328 20687139 21334389 22542714 23428666 24069906 24747840
16757 24747840 26259215 27604019 28336266 29517478 31001795 32394186 33640665 35582459
16749 35582459 37502217 39240446 41201420 43124378 45042162 47410528 49954196 52696725
16741 52696725 55656383 58955964 62393053 65672572 69909285 74046752 78425573 83615246
16733 83615246 88722521 94377058 100269496 106954029 114104945 121166914 128678137 136816441
16725 136816441 144963278 153339769 162391376 170466238 178948804 186522441 193937725 200824354
16717 200824354 205463798 209878824 212297745 213348330 212946262 211111186 207365223 202980773
16709 202980773 196949410 190329070 182525239 174554018 165753874 157294080 148507914 139612128
16701 139612128 131681578 123531050 115793670 108977481 102109045 95584439 89695344 83998513
16693 83998513 79254065 74269112 69771867 65923395 62195863 58334161 55274961 52429708
16685 52429708 49088652 46810135 44178469 42206465 40016879 37856456 36035372 34939785
16677 34939785 32703710 31293025 29997830 28897704 27484684 26285324 24926689 23955711
16669 23955711 22811518 21906564 21193539 20378537 19816746 18747606 18292607 17485645 16973433
16660 16973433 16209537 16046933 14995269 14923389 14447099 13807517 13374961 12992860 12268461
16651 12268461 12017881 11629141 11369201 11269117 10765747 10250791 10179478 9906245 9600824
16642 9600824 9361086 9110070 8640538 8616262 8184937 8196789 7785289 7883584 7490348 7155732
16632 7155732 7259724 6911359 6815067 6467868 6110278 6154798 6224712 6184514 5781636 5685419
16622 5685419 5335927 5214195 5339902 5384563 5364971 5077732 4630013 4794288 4897836 4419809
16612 4419809 4552507 4539839 4471391 4147859 4125713 4046083 3929241 4245640 4044332 3641392
16602 3641392 3497832 3486403 3723145 3665421 3436412 3161641 3119618 3229383 3074927 3483334
16592 3483334 3068433 3067915 2946330 3115778 2797416 2546938 2782049 2761028 2591823 2576195
16582 2576195 2698486 2408102 2385301 2811052 2303096 2467349 2333389 2353519 2436053 2426260
16572 2426260 2508334 2063099 2146954 2016188 1811132 2025594 2213492 2113787 2010361 1909753
16562 1909753 1771876 2065748 1878313 1857337 1888958 2112950 1648286 2207445 1531660 1600325
16552 1600325 1860252 1664832 1730323 1430911 1245573 1735204 1459223 1642372 1571999 1313896
16542 1313896 1728500 1458256 1380736 1463019 1782497 1573191 1021621 1010290 1066632 1271418
16532 1271418 1237274 1132315 1279588 1101407 843087 1197670 940123 1366045 1118767 1235750
16522 1235750 1285420 1204560 1225884 1103196 1096839 1017910 1129277 1000595 889652 1217767
16512 1217767 857704 1103807 1380964 1092126 1269015 1286703 870280 605908 1014380 601324
16502 601324 986964 928508 946379 690492 1044964 800559 730284 713903 814567 981476
16492 981476 833356 997851 1069164 630922 728117 784081 1152888 907494 798111 507890
16482 507890 991577 549237 889713 755043 757258 635565 888746 541509 753182 893713
16472 893713 387313 991521 517662 588946 455455 750758 658116 824703 351866 555856
16462 555856 895075 970393 839983 689165 516222 752404 408840 175497 611441 673881
16452 673881 309293 554399 551527 495210 491801 756187 576817 577112 690805 841013 504542
16441 504542 471416 323458 18016 152985 623025 485936 519376 419846 458233 324698
16431 324698 577243 410822 632017 394216 451559 584109 338709 624674 590031 327730
16421 327730 811355 276822 345901 179242 679629 553887 293573 381952 326054 435816
16411 435816 652217 188695 221235 368070 492594 183908 -16482 234581 584028 213140
16400 135042 370857 329915 320565 398766 500382 -107576 412078 407494 154256 488419 295853
16389 295853 263341 627787 414645 165462 -706 458986 515693 197594 69373 -49538 412965
16377 343416 291620 367530 161674 379850 410630 202597 272389 257665 63715 307713 296474
16366 296474 58123 531259 334748 423985 496154 317349 369800 364207 -168679 141438 116274
16355 116274 366213 220516 148864 193413 74075 91320 -21739 126607 -50678 438923 265975
16344 265975 187332 326060 184438 304076 24287 438549 220794 314516 253628 498419
16334 498419 402851 106482 299422 533838 524728 286197 192826 -293960 80647 279413
16324 279413 234225 349807 121853 32768 290645 186671 22001 11833 296665 179846
16314 179846 -23060 98322 364993 -26715 286921 134247 -59293 -194745 177170 -81398
16303 372448 133662 46613 104123 211441 68050 293332 117119 -14464 490688 519300
16293 519300 199064 369997 307971 235891 305898 265066 254935 181154 243940 40099 270721
16282 270721 286908 60739 168485 84616 -221652 211465 91700 -140011 203762 229590
16272 229590 -26138 32197 195060 349832 74484 -152816 -87760 -30568 -87794 135226 339688
16261 339688 -250731 147307 -10696 130438 104860 -75886 -83734 143051 169177 443349 191143
16249 84209 71791 84748 -303827 -136993 237157 85268 302600 133129 -225341 220884
16238 24107 59903 271995 -86476 7039 -93146 391463 359223 -13461 123722 -282684 300531
16226 -392723 -33534 69439 -110303 286456 -91719 181587 92833 -212840 -131689 53390 -38517
16214 -178868 69218 137610 38879 -203970 253181 131901 191792 -173176 190307 123943
16204 123943 -184524 158027 -162088 -39475 -30636 -52188 -93356 222758 82651 -68124 271300
16192 23228 381518 138095 68228 -55725 109535 33791 -83283 68414 130398 -264905 -136247
16181 -136247 175822 -97738 60378 145659 -115 101852 157392 92173 90647 -37088 -120984 177366
16168 291825 25774 37037 -162780 82544 -148477 142915 -20172 4741 -21618 286557 110948
16156 507059 -230010 -119604 -14529 302527 -19184 -66111 174018 42727 304098 141321
16145 -190963 303565 66056 -38214 -143239 -242907 -187014 -65552 -175264 229562 -66426 -29610
16133 104884 -111874 -37848 -202931 213302 -18089 -47345 -46538 159221 -74266 -7491 -106565
16122 -106565 -78355 66867 180440 -170362 254068 439795 78582 -145947 294555 -106845
16111 59107 -174441 394798 -118826 -276569 69537 -8197 14658 114713 296208 47727 -156147
16099 -54970 38549 -177492 -165016 -88851 -274228 -31987 22145 170793 220345 204075 -203372
16087 433168 111254 100481 188707 -178112 -63309 -79806 -371776 55151 -298272 52698 -126194
16075 -75567 -62687 194909 13204 72030 96349 -203192 -238732 -153015 108431 -15687 -12998
16064 -12998 -5354 194573 -86166 -104389 -244904 63255 -165255 36919 -6196 -227400 61073
16052 -17948 36511 148821 -623828 -5658 -259614 -155808 232351 -143553 -358981 26666
16041 34814 176936 -429955 70972 -175 97346 -304147 -264520 -6147 56246 -84046 27502 -139937
16028 -91791 -309985 -107859 304077 172630 189044 -15024 -350248 127865 45988 -39239
16017 -287877 -117450 -25268 -463430 186853 -28267 26105 136576 163461 -356156 37854
16006 -10302 -82303 22980 -165154 -54463 169164 364648 77846 117195 -65047 -94963 -497529
15995 -497529 138742 17917 -294806 -11383 3170 -321758 -136591 53036 -106801 -315291
15985 -315291 -100964 -595 353446 86609 56134 547201 48688 -65699 203803 -98459 93919
15973 -82485 -120373 46075 253359 -119036 -378567 -8003 70701 -103907 421231 413790 -455083
15961 -230619 110058 278392 88883 -106719 -63910 -329087 -216981 -205956 107145 -74114
15950 270723 -29092 201330 -166833 -288537 28442 -8260 -353047 -269137 63020 115233 170978
15939 170978 -495403 -260381 -124045 -21466 5745 -315031 -7065 244992 -323977 -147381
15928 -278 -271085 -280949 156589 -321942 344643 -60554 -16646 -19644 -147423 -237860 -362621
15917 -362621 -26122 -143206 -14684 321994 -73939 37855 196177 -54166 183381 -78152 -339158
15906 -339158 -49916 -149293 -534940 -105268 125955 -248518 138504 -372342 148504 390667
15896 390667 34580 -36774 -64272 -262608 -10870 51782 -76339 309627 23731 -224190 136055
15884 -266496 61543 -148326 152630 -9672 431380 229080 -137683 -15938 -118582 20158
15873 127885 -278036 -138569 -218552 92200 148064 116925 -62376 -36292 22245 -38033 50934
15861 -269928 3686 92705 -67944 69844 -104364 122880 525315 58687 -174027 -16276 168777
15849 142742 -45582 198868 -116472 -154880 -223816 -54289 -422597 239960 -23297 86502 150327
15838 150327 324447 414900 47642 -21018 140245 -120138 -294620 -55558 -438318 263299
15827 -327842 -381588 -299911 -217675 -174374 -69824 545 -179806 8913 -76653 -99972 377960 -367323
15814 -77731 -19128 -18610 -66393 47776 -52737 -278046 42901 -100112 19066 -174644 68357
15802 54176 156410 143633 -152833 -59000 -58373 -86918 -24303 -284580 20672 -71074 230990
15790 178450 -41183 310777 49671 44420 241954 -117528 -303156 47611 -757 -246638 11463
15778 129893 279941 -104809 -97450 300790 132056 -377080 26665 -471573 -227848 -58621
15767 -96140 20688 -326222 -49870 1406 -153368 -308824 98060 42153 161655 231826 140611
15756 140611 -62880 121141 -59357 81467 -73624 -290614 62935 -401000 170065 -163210
15745 -40442 86745 -331524 -281048 94025 103525 9390 -414029 -138061 47222 260034 -71662
15733 337334 -59245 -266715 76961 19810 148520 68876 432899 -60485 160090 -9629 4637
15721 -311304 108358 -279451 316845 107181 48108 -130508 -300590 64942 -166744 160298
15710 -63819 -324757 -203853 -180923 147000 -233610 69403 100877 -209327 -202216 -53446 -224851
15699 -224851 -278089 218412 -364137 -266980 124143 95384 -32652 199674 29157 180113
15689 180113 -63258 453597 860 39610 152687 94854 -232278 -215049 -417858 -285693 10048
15677 -366580 -163037 60398 -237047 2929 -100658 -135942 -125568 358114 43676 -42707 -18026
15665 -81918 -243395 13539 -182036 -71975 -334516 141625 242439 -176076 -14181 441515
15654 53120 -227677 22847 533 -191951 -172260 17072 135184 44035 203473 -161138 -4411
15642 35542 -142837 95437 53453 87842 -34394 150250 -79182 -283073 -92864 42867 -460282
15630 -251129 -49826 40555 -88789 -133034 -13711 61931 214833 -22718 345490 28931 26377
15619 26377 83984 70537 -139198 -341105 95908 113019 -265059 200163 327106 155310
15608 26085 -26232 -111556 -85357 -87394 -160547 -48869 -159116 -130470 -108342 -172326 -3463 -30579
15596 -30579 44308 -189634 -14397 52219 -118186 42631 -25868 103365 -251526 -226590 -27445
15584 -11761 46832 -237411 93153 239937 59317 -62918 -90029 142399 71778 -31482 -103926
15573 -103926 64290 177472 -380264 54276 -146526 -153665 168668 130039 -212274 -94136 8953
15561 27721 151973 -138806 254079 -48740 -258253 -118879 -372743 245759 -177653 -85210
15550 -213791 193901 -151287 170463 179664 280804 -135927 10637 -229145 257888 162696
15540 162696 -168657 -29581 375607 -93609 237240 -353785 -13231 240264 -395026 -156715
15529 -83395 -69840 86346 -43614 289857 -54380 -3238 234576 402627 -469465 -60973 -18427
15517 -135603 -180666 -86657 127974 -32923 -142284 -88584 -93917 -246359 -212710 176209 -35906
15505 -164404 -187248 242247 129537 -45816 24312 177776 38929 -138560 155780 -168595
15494 -213292 -44455 -92283 338931 139919 207429 45448 -129655 -298126 20532 -184654
15483 264784 -81101 92497 113819 -107714 276220 43225 -1250 54158 -66021 -15753 -80065
15472 -80065 -160464 197080 -51652 24333 217897 131718 39328 -29455 193191 1796 -27325
15460 -125527 -73404 -30047 11259 18280 20073 -86023 330013 -112640 133387 -39014 -101208
15449 -101208 -193743 40840 -32510 -267870 -40884 -106524 115160 267669 172905 -300712 201671
15437 335260 -134637 58089 -183723 -19710 -345389 59786 20244 355578 149832 146738 -188929
15425 -121603 -31382 234412 135970 15304 -215245 -162837 26703 237068 4760 12930 119063
15414 119063 -24640 16804 154265 -125029 -97453 -108253 139790 251353 -181624 -4622 -21601
15403 -21601 -319280 -170769 53044 -42721 -40854 858 -230381 165547 25408 14331 -110301
15391 137314 -133065 -18909 207078 507897 128886 57993 -44711 229576 18545 70206
15381 70206 159725 -244123 -203169 386805 44909 144771 -34460 218511 -83638 -204893 188710
15369 -156370 284319 627 -51576 101768 -166930 105057 90680 -28701 61216 140150 16079
15357 -318350 -64009 -355185 16771 -110630 -157929 133113 -180813 45764 -9333 90420 162531
15346 162531 115186 -35905 299492 254158 -97088 -113112 -6312 -272131 -161672 218707 231157
15335 231157 -204433 135026 70549 109483 -481142 79424 29263 92115 -262464 -55395 261459
15323 -45435 42240 -114010 190444 -84760 112661 150296 327267 139726 392825 288756
15313 288756 -327754 109417 106373 167793 -10441 155806 23259 248673 -178235 -241286 -169366
15302 -169366 -131295 -343917 -21051 216785 217597 -25114 -275502 -79044 -156844 121411 -44164
15290 340940 168583 96202 341689 195207 -464003 -15103 31376 -78568 139554 5640 -135666
15278 187701 -196187 -139171 -133271 9445 -6772 90163 -283906 212953 27096 258903 -155221
15266 -122488 90111 91673 134967 249302 -92117 -151813 42180 95034 106725 214167 -16009
15254 -7383 191183 182967 420575 433290 569372 996611 1530587 1267600 1523746 911541
15244 911541 489313 135796 -26319 17136 167860 -137146 -281755 -214873 1691 -258625
15233 123674 37317 -1955 -25407 212798 86872 42829 -101463 272629 363376 187025 47515
15221 84324 136386 2393 120433 78917 -57928 -85761 134907 70351 477348 -7819 -75778
15210 -75778 -124747 -148561 -126224 163206 104704 -46888 -148197 -49696 360045 150672 -174540
15198 104189 136641 135129 40807 -4241 -88712 -347456 140126 115431 55204 312664 401185
15187 401185 236159 497208 179640 113997 440328 63973 292795 -58296 -81914 -71794
15177 -71794 159976 147401 162628 466256 410610 274257 73468 168955 -70591 331327 171100
15166 171100 -14815 555362 103814 259596 281066 145362 -4990 -234716 176401 178691 143568
15155 143568 331360 178747 138671 277740 128499 43162 -192754 32429 373925 244280
15145 244280 -101093 38748 215682 -9122 465072 -53722 229462 -244430 -141940 172431
15134 29097 -139029 247944 10341 638949 338338 52922 27895 430971 -50966 134832
15123 -112386 -231317 -37570 -31710 257631 406408 38794 -215343 -82578 116154 -25573 136427
15111 85745 6335 297894 -251861 241513 -9610 -2401 63056 400446 88424 13790 320779
15100 320779 -266554 363319 195848 407383 -37564 70819 -65674 170092 31670 602197
15090 602197 69878 219690 -68888 135437 406313 274695 122056 -16079 24420 248725
15080 248725 234220 466698 564849 269560 -52471 199832 302903 154836 40971 109873
15070 109873 -103109 248826 -166181 -18216 -3867 290462 95874 -129823 56287 174866
15060 174866 139320 -19306 214748 296900 -11474 174594 123590 62640 75080 27578 220975
15049 220975 318400 -171398 -196910 -104206 141687 248787 175598 231728 153176 -121558 -144735
15038 -144735 320796 191097 -75653 229370 61142 15533 134509 -168804 112283 222947
15028 222947 253420 162686 -173891 173290 315902 86631 15451 468706 475692 193080 208773
15017 208773 382791 366049 376225 347205 282221 153265 -28322 427744 19891 42501 113111
15006 113111 47587 407534 335067 183894 -62274 183005 118987 278954 361425 42368 270098
14995 270098 475998 45625 391986 12264 -93742 50933 364080 368007 414118 193197 97596
14984 97596 20884 307256 334644 238935 63345 217544 58269 317296 539190 201736 -161531
14972 32792 63258 191797 363268 94441 426002 395975 85553 -159476 172405 753072
14962 753072 353171 235392 285890 484643 231427 128196 274770 379084 112822 624239
14952 624239 499353 45628 615234 162758 591850 454063 164109 176762 528550 548751
14942 548751 229446 211886 301457 121546 208497 450634 287204 263506 166294 265378 -116946
14930 654982 402671 250851 569169 420591 126856 324795 207336 468194 488019 68567
14919 149338 304246 504969 358029 194341 227638 364868 163383 313804 353516 328948
14909 328948 102057 112378 319497 264419 314818 361312 99376 475506 612210 513115 630503
14898 630503 475398 616904 210966 682052 342076 263634 370538 447125 169863 257722
14888 257722 42334 443856 358952 413183 465322 633145 549512 678796 432068 352423 257822
14877 257822 521310 295478 430498 317535 211466 605708 466430 454968 472839 513402
14867 513402 293715 410805 643405 399638 787516 359826 397968 702507 526024 752256
14857 752256 427636 517834 660701 619100 593711 396012 747814 228225 656615 511356
14847 511356 532923 333416 406925 438809 651909 173363 551059 742022 497252 287993
14837 287993 605510 510921 382603 734528 491364 614005 240424 359329 330507 195938
14827 195938 605947 457588 372159 446353 316890 452809 624106 521918 574695 432987
14817 432987 282134 428087 757586 165272 822116 376053 557884 474527 314663 645573
14807 645573 582139 605464 325612 655062 288629 751748 418150 325658 277078 404375
14797 404375 338766 928832 541307 263853 573417 722243 482804 427769 726318 249503
14786 598658 395165 470765 786585 919461 501853 474794 994335 881727 603754 517584
14776 517584 402796 784501 620446 418701 751589 492175 790397 567795 483961 539273
14766 539273 316887 847628 491905 607445 941562 499624 340191 606466 586457 633062
14756 633062 582002 703681 445951 392489 802578 578142 911993 702702 730388 666641
14746 666641 628824 822897 1074092 730772 882049 920128 973132 517402 459921 798963
14736 798963 711115 474247 642610 711596 802531 931819 654932 425915 580632 681054
14726 681054 796174 474213 785100 823578 1269972 811237 533701 778584 1256336 1012594
14716 1012594 958870 914647 1020805 868333 705690 1138074 1089265 710255 1022034 1001902
14706 1001902 980556 561327 743459 624344 999932 859389 1316786 949546 925043 1011941
14696 1011941 1087525 757847 985143 695989 1288477 806493 865021 670089 1155133 1083925
14686 1083925 931391 878614 1008987 1112626 843154 923947 910723 901193 1097403 1039989
14676 1039989 1311133 1005082 1162405 1186802 897625 1057114 1138941 914103 886769 1347285
14666 1347285 1162798 1078690 1449158 1486529 1305842 895753 786666 889212 1303670 1093105
14656 1093105 1297959 1619987 1337831 1457939 948163 1329725 1365624 1089652 1213823 1391649
14646 1391649 1428386 1145108 1568138 1009843 1261918 1321576 1163876 1122054 1254525 1476136
14636 1476136 1307875 1185832 1263942 1109512 1405808 1512033 1230385 1567144 1486676 1398306
14626 1398306 1253792 1468546 1543865 1330799 1752937 1789768 1644056 1407091 1698996 1599578
14616 1599578 1602275 1241139 1758614 1015490 1541536 1582915 1682636 1340340 1499095 1810973
14606 1810973 1865956 1841196 1559109 1521613 1654637 1795643 1672071 1987818 2007939 1877372
14596 1877372 1590893 1694764 1759583 2060440 1895778 1854842 1658717 1668880 1668964 2019481 1882679
14585 1882679 2124514 1775579 2178906 1968312 2003174 2048715 1936800 2185411 2032489 2283616
14575 2283616 2436414 2303634 1773464 2259740 2418183 2196789 2307022 2426730 2843281
14566 2843281 2608762 2476334 2637659 2601736 2837931 2604407 2937510 2739388 3038597 3375577
14556 3375577 3436136 3431967 3958215 3883274 4354858 5226423 6084828 8327782 12934394 22454565
14546 22454565 35243778 41229219 26072933 12644395 6376667 4449192 3629760 2741303
14538 2741303 2699865 2277893 2287578 2433105 2535728 2452356 2393365 2211979 2206410 2365906 2530809
14527 2530809 2165225 2338841 2639253 2342050 2519311 2690482 3046092 2418731 2640476
14518 2640476 3081524 2920863 2639093 2825172 2837740 2759494 3218375 2677534 2759563 3058541
14508 3058541 3170879 2918446 3246533 3185700 3053559 2984993 3123017 3267062 3237604 3320927
14498 3320927 3519089 3318829 3503432 3693751 3653022 3722627 3595906 3733853 3291359 3780881
14488 3780881 3651194 3631832 3984349 4087338 4075063 4107043 4051003 3884831 4048380 4215874
14478 4215874 4341039 4039658 4285804 4508368 4197935 4349029 4637894 4397101 4276567
14469 4276567 4554836 4821105 4913886 4954694 4918020 4606561 5094330 4563966 5040912 4999050
14459 4999050 5258752 5021620 5568023 5466730 5388710 5467863 5574441 5788265 5794553 5865418
14449 5865418 5729657 5739486 5945308 5903649 6245198 6312323 6344992 6392529 6548097 6596846 6877438
14438 6877438 6607374 6661618 6803350 6968074 7013995 6988037 7344814 7346046 7166746 7410148
14428 7410148 7815105 7912576 7878663 8051539 8305078 8260443 8040093 8310303 8666844 8377363
14418 8377363 8775256 8775652 8901219 9029393 9160395 9385735 9400394 9490181 9788418 9433643
14408 9433643 10114043 9902108 10305126 10440631 10250943 10605155 10957646 11134073 11106916 11626871
14398 11626871 11116100 11704292 12116956 12186815 12317203 12470387 12637489 12998135 13004553 13305649
14388 13305649 13695682 14036485 13864799 14477534 14450197 14855947 15411417 15402402 15976171 16027119
14378 16027119 16235730 16562693 17170937 17199760 17613654 18023627 18296423 18708644 18818496
14369 18818496 19421690 20117604 20513478 20858100 20804898 21598973 22162499 22488360 23084576
14360 23084576 23128129 23896454 24171480 25327844 25895728 26053953 26732951 27076160 28134342
14351 28134342 28367515 29434394 30065342 30642801 31338383 32491513 33171769 33908897 34915115
14342 34915115 35763601 36874708 37834973 38602641 39733767 40781247 42167141 43240146
14334 43240146 44563468 45832590 47133441 48210569 49890139 51409007 52985621 54771611
14326 54771611 56459577 58513536 60173913 62220646 64422843 66657118 69042038 71462403
14318 71462403 73839911 76679977 79347201 82419220 85721204 88804829 92205950 95985632
14310 95985632 99866028 104007912 108139967 113194041 117985414 122949308 128141633 134016757
14302 134016757 140247778 146809109 153370608 160707590 168317275 176834855 185126831 194199898
14294 194199898 203660887 214009382 224412528 236202067 247935674 260505056 273313137
14287 273313137 286936209 300683587 315072459 329915388 345276874 360253676 375611602
14280 375611602 390944933 405656259 419803749 433230289 445667262 456296038 465398467
14273 465398467 471795189 474346095 472760892 471271577 471058083 470836081 466499154 460732235
14265 460732235 453495428 444836443 434479186 421943326 408172379 393444596 378051358
14258 378051358 362470426 346735935 331128511 316398183 301674758 287599064 273402256
14251 273402256 260451183 247477385 235408343 224139201 213151084 202887359 193400864
14244 193400864 184233036 175765691 167252023 159610580 152194941 145469664 139359071 133247464
14236 133247464 127328820 122221555 116504382 112215836 107579077 103429727 99424822 95707929
14228 95707929 91515231 88131160 84738532 81343343 78528434 75771554 72876027 70886701
14220 70886701 68699356 65895017 63781038 62038015 59757655 57491992 55815371 54535558
14212 54535558 52320958 51022451 49376617 47889952 46691280 45473289 44388589 43085870
14204 43085870 41819013 40454470 38954779 38348759 37685427 36578665 35583215 34451261
14196 34451261 33518192 32478759 32209683 31265032 30415270 29600846 28774515 28178645 27096856
14187 27096856 26359857 26171169 25529149 25106514 24464101 24148510 23519032 23012705 22734334
14178 22734334 22075854 21504657 20935957 20927605 20358084 19918124 19492617 19198132 18830936 18360347
14168 18360347 18130247 17478636 17391769 17192721 16400342 16229840 16119588 15606705 15695731 15223264
14158 15223264 15154613 14811739 14440503 14301140 14086264 13851597 13532111 13346201 13151530
14149 13151530 12673957 12393342 12352767 12370891 12126944 12395137 11715104 11615615 11231793 11379256
14139 11379256 11075892 11021770 10440276 10534530 10094902 10536468 9823646 9872149 10158091 9451294
14129 9451294 9619206 9543872 9520672 8609059 9004772 8773865 8834354 8504647 8398659 8560821
14119 8560821 7978103 8414508 8577378 7789328 7782031 7926690 7737908 7391547 7668447 7647665
14109 7647665 7415181 6638690 7082315 6953499 7081768 6748107 7070589 6545796 6445458
14100 6445458 6441874 6141781 6335131 6298151 6014018 5853488 6403346 5885641 5836043 5992157
14090 5992157 5663702 5834129 5607915 5684465 5701097 5537722 5518291 5453167 5307274 5448091
14080 5448091 5094407 5192988 5003188 5075718 5132328 5031797 4963693 4942630 5161705 4815592
14070 4815592 4788875 4523607 4730284 4524297 4521272 4176046 4663603 4521701 4322205 4611541
14060 4611541 4473113 4291092 4076687 4129790 4145311 4191760 4175916 3972210 4186561 3998723
14050 3998723 3828277 3935131 3886005 3662939 3712893 3828729 3655971 3745155 3769163 3421466
14040 3421466 3253134 3543393 3399835 3166564 3290702 3568097 3456919 3263204 3287248 3375190
14030 3375190 3026250 3171855 3311346 3184516 3129056 3304216 3113222 3072342 2991313 2965887
14020 2965887 2924006 2929336 2967144 2586245 2753454 2784025 2517808 2568912 2787167 2782413 2516793
14009 2516793 2815217 2501896 2445748 2794108 2390886 2620806 2564073 2446521 2433024 2354128
13999 2354128 2173349 2401102 2207682 2272460 2041893 2138154 2319560 2806241 2361084 2761066
13989 2761066 3911779 7662697 15594667 29544280 39532171 29681273 16514797 10740554
13981 10740554 7460168 5689381 5172898 4705588 3648121 3647546 3343173 3234591 3048821
13972 3048821 2804768 2881862 2772713 2908378 2810973 2527037 2412509 2637164 2557729 2495466
13962 2495466 2312475 2449924 2520957 2364954 2315712 2231965 2249039 2433979 2167331 2178210
13952 2178210 2095808 2543037 2207643 2311435 2111748 1873102 1838259 2420062 2155221 1839979
13942 1839979 1708507 1967165 1884518 2100723 1876139 1967296 1976469 2057422 1902808 1773663
13932 1773663 1537992 2080850 1549214 2145971 2050536 1394211 1715201 1807854 1776454 1742825
13922 1742825 2034994 1613810 1469170 1746877 2019957 1909028 1322821 1541598 1583255 1805077
13912 1805077 1783764 1170152 1647519 1310987 1516003 1273824 1393708 1652379 1596731 1545087
13902 1545087 1188719 1796595 1643485 1468676 1724225 1119814 1457172 1698133 1138533
13893 1138533 1589712 1354051 1244763 1658434 1210808 1622018 1489648 1260377 913856
13884 913856 1085353 1168939 1650675 1351291 1604115 1621095 984573 1199907 1417640 1072278
13874 1072278 1258494 1322387 1331230 1312396 973046 1306975 1322838 1276191 993823 970897 1209808
13863 1209808 1279616 1337700 760052 1107088 1050499 1094523 1196764 877028 1260282 1303840
13853 1303840 915814 1208983 967858 1292394 905195 1114484 1050278 942015 909870 1079033
13843 1079033 970107 919702 773079 1268119 950459 1049316 1312946 1043757 1249291 1020531
13833 1020531 1071754 876897 950936 1100089 636484 983390 723180 785070 1145666 823509
13823 823509 802631 871009 977281 1089887 1274603 1024561 743015 981430 826441 866659
13813 866659 1149498 1336696 1227173 807934 787724 536349 1142274 1240322 962314 715521
13803 715521 1107793 1153748 852820 995097 851463 1150740 413076 950883 826106 860732
13793 860732 612518 990287 910098 566139 1068272 678680 802769 482895 785401 1066498
13783 1066498 599716 906093 735094 775358 804113 818347 408567 559322 942916 595973
13773 595973 956981 589364 498078 881839 870103 831665 586217 836874 930772 610537
13763 610537 720079 877672 494417 317357 724936 872354 531889 573808 581970 1041221
13753 1041221 344530 598513 744147 914945 991387 815599 796496 434119 842888 756003
13743 756003 380902 660771 452987 640700 681169 529858 686521 597766 691979 803357
13733 803357 827824 671349 302818 643524 522074 871782 521029 617932 515436 685152
13723 685152 758466 879454 646334 617176 303682 727239 660461 679725 616708 734997
13713 734997 1003988 525703 579129 639018 353497 821860 584326 399025 499643 405342
13703 405342 692321 530205 503870 192353 501687 728171 530723 318786 568549 523739
13693 523739 689132 388233 267891 547832 723179 306222 491872 719264 392656 581675
13683 581675 373791 919973 221693 736180 160542 528118 338066 601005 417847 305152
13673 305152 176864 758231 519629 429982 720011 655483 643431 574442 612195 647906 367775
13662 367775 613524 493731 581106 359295 742109 807535 268575 313219 407587 315038
13652 315038 581300 591972 333729 413149 416095 359751 346466 290241 348436 481435 273761
13641 273761 438099 316923 683782 412075 574086 350375 274850 535142 477777 578887
13631 578887 419766 358982 223636 540931 660254 386464 163419 423740 427982 339354
13621 339354 315840 524315 288398 498704 -35847 366487 300837 459695 162111 242062
13611 242062 592617 18198 565634 487308 430606 221299 516723 284320 292301 390930 490768
13600 490768 284542 305589 488587 283078 260172 503866 585769 274131 629114 559615
13590 559615 265738 259503 644046 497859 116283 158637 297432 199467 -63574 422327
13579 225177 513734 201408 395293 444697 542668 285845 442425 688246 438535 245306
13569 245306 407601 -17053 173484 414813 364077 546425 380663 51095 334997 381233
13559 381233 182140 65542 331984 -57255 421077 493205 260424 782610 -49209 609182
13548 414515 477302 178229 213993 291714 390068 387650 177445 575422 29372 354343 459259
13537 459259 704801 479350 357067 309843 164662 201743 428983 353378 117682 280792
13527 280792 56904 98573 361262 304689 418380 418252 198690 600757 587041 115558 443011
13516 443011 -260678 487143 205340 266174 -56546 200476 180837 701615 -58592 -30287
13506 -30287 64572 240400 463407 365554 119009 298379 138071 288901 277145 394367
13496 394367 271697 -199124 266304 -6085 133621 182445 283686 277204 266527 296673 26023
13484 414758 264147 142062 247044 380186 410018 239745 400374 455855 -212132 503544
13473 269681 404850 251614 96653 54440 20009 192572 328638 492404 174302 113590
13463 113590 119476 -44160 42074 -40528 -23210 374523 -196398 368031 164169 312639 429496
13452 429496 44832 550351 27291 -68769 179995 -35612 342514 -55930 394062 46480 434830
13441 434830 157737 22996 439481 366881 279673 495677 443077 120752 173778 213095 287210
13430 287210 128272 205586 61857 61830 96600 163093 511788 121074 85742 -32180 307762
13418 229167 175103 75488 192007 291589 154984 156451 373977 390630 276234 423593 -37539
13406 293496 393068 -71585 101011 326585 227074 227079 380392 344765 25515 273812 -250421
13394 394049 314795 124827 -801 -38029 527412 197309 169708 447664 6867 518042 -80547
13382 242668 151066 538005 380214 49711 281363 403807 238759 250621 246835 175434 197273
13371 197273 -148489 306044 290219 -12166 433583 386452 146431 258390 141806 256091
13361 256091 91480 -13 282912 59372 61550 628137 81891 79545 278852 422541 251318
13350 251318 353586 335529 119819 721536 245240 273080 315459 230500 -60961 443933
13339 438386 465315 393737 325817 376215 430603 94489 87247 -145645 -87820 231545 374821
13328 374821 405737 229494 299041 235607 -41159 55135 14688 237752 -43845 522832 172512
13316 490023 484943 143828 306639 513907 418529 156539 138556 433813 126580 163089
13306 163089 164461 190170 169664 237297 -198827 352976 365989 28363 203000 -12541 165634
13294 321705 594674 60926 41464 -54553 169611 265227 -32624 176664 78564 -516049 -48234
13282 133504 413988 143919 28594 222152 -24706 362777 23018 -59161 92010 -68436 15806
13270 87936 242187 42992 -299195 298149 52273 455285 180015 50732 -20902 118155
13259 -113035 314472 -65008 42973 317041 36903 -41768 268990 -213142 373647 -58968
13248 -76722 139652 -93905 -220907 124415 -9813 132966 299857 78191 286593 239700 93750
13236 -52620 177479 66626 267703 15853 205069 14002 213428 238384 291069 388056 235597
13225 235597 146882 190038 -22257 93967 253958 104241 202724 108852 441697 78697 -96940
13213 488635 185180 155485 107032 40494 12717 89889 428121 -70614 24987 125589 -183536
13201 174190 129338 241287 -144978 334891 213418 20519 101215 -44809 -246370 207369
13190 168683 208148 -44025 62955 318341 325849 -128438 25198 287667 59803 8530 200868
13179 200868 123126 218672 -105791 -5923 443310 301102 301402 317731 -113416 189410 307514
13168 307514 -60572 355863 202468 280324 126553 183639 255416 194255 -90978 27997 357555
13157 357555 228705 11424 175528 -55670 118991 -177065 -67035 7687 355254 135359
13146 154633 -233959 56943 -58903 221245 80933 -23437 57427 23167 -155935 -39206 204204
13134 162284 -38271 210740 -230943 320395 -64113 103463 -4283 238595 162576 337231
13124 337231 200316 116308 59433 -38767 110143 199412 -187414 61819 15347 118886 213456
13113 213456 387731 179661 202278 13951 156414 165678 -112299 -31447 -49273 -123190 -135484
13102 -135484 32528 333692 -200203 289550 -209430 -136157 14042 221006 -65655 19009
13091 176722 -167583 133120 -41511 263202 202647 -59640 34656 50916 73915 271024 289559
13080 289559 98551 -182533 -53027 52146 527519 -26112 109115 148381 -46679 -140879 328606
13068 432445 -73473 232943 348834 204088 31665 -149392 237403 -149413 205393 343872
13058 343872 680952 165883 166556 63179 -221044 -118558 -157335 88006 251172 378111 -3820
13046 53781 205927 480934 202588 -126789 190971 292659 260364 105417 -28488 -238620
13036 -238620 -172409 92595 89499 372623 4632 15820 50246 -72389 -101 29284 372054 233788
13024 233788 -79166 150457 -68037 187910 -507611 30200 -45675 63372 253327 51564 199470
13013 199470 356348 199425 -101775 292873 384225 -11566 -3142 404387 221172 228873 -3743
13001 -43865 -90985 222433 53618 6727 -182555 53886 -101068 15483 32460 89718 -54812
12989 156181 -178254 97239 139821 -17453 279598 -179421 -23401 -69373 285319 -393868
12978 666 -16651 39541 107366 266999 -256854 22014 313908 7314 46279 24916 301468
12967 301468 -279732 478611 162949 129313 -43751 283555 78952 -42801 -26579 -332818
12957 -332818 75982 172506 162720 -288866 158348 35918 39297 212220 -415889 310819 220898
12946 220898 -84639 152355 122032 -2216 31431 61010 448684 176094 -37270 76741 42763
12935 42763 176680 -94852 96787 -23305 178424 -147 39868 -157765 -146582 144179 215135
12924 215135 169408 -27450 24290 187591 120941 -98521 83106 133990 -411794 254113 224246
12913 224246 256783 56892 -131879 -39558 180544 -25285 224589 167974 104310 -248268 76892
12901 -25115 -159016 160737 62523 2599 137703 208133 -146153 126676 104373 -84792 58143
12889 -43672 257831 -264254 309183 385788 50468 214369 236834 189493 131719 -172715 265996
12877 -1863 42369 -124135 194735 -54641 -23182 197032 -3115 326118 112744 70904 139531
12866 139531 238411 -115790 272944 -171814 239198 -28779 -163259 26911 -259468 -268864
12856 -268864 -106199 -4814 -246747 240614 -139656 93673 310732 -113346 355729 -292103
12845 -35761 -177066 -62314 -12761 -285629 -3937 112853 192285 69590 70298 253596 159012
12834 159012 199337 -254497 -286461 -89166 226260 94205 -28967 80687 33897 -78697 -446013
12823 -446013 -138744 101979 -11023 169554 120752 -345493 -207454 44443 46304 -143423
12812 -129258 -55745 268859 -154149 34240 226103 67923 -23171 371820 -78582 -95425 250984
12800 151407 32681 41414 -28297 260035 -303599 -50046 129281 8113 -30239 -101400 -21763
12788 89141 143583 122044 -313538 284414 -150397 4151 -280661 287072 50994 -85178 -206767
12777 -206767 -119102 193986 188614 -221603 -205056 158377 -6470 -34745 81655 -136538 109939
12765 290112 2314 227712 -30504 -176506 -102439 -106826 -95434 178213 65900 -305266 140964
12753 102250 -281083 7089 -126723 -21807 -137882 -62358 -95477 32469 -93518 -309607 127351
12741 8784 -2342 54608 70414 18749 1633 -12701 -95626 -115330 253966 448118 -71996 45430
12728 -583601 -34740 -150657 -13353 95588 131704 235098 -35185 86713 -36693 -6816 243984
12716 -204139 74340 -69905 22161 234788 105348 176833 -35103 -146466 -37209 135036 301626
12705 301626 366898 -90496 148132 -100545 97316 480608 -126441 27859 283533 -325887
12694 135684 -324868 242356 -27363 266069 281568 -120074 -185345 272347 374937 -233912
12683 -92795 255514 208878 -28324 467816 87398 225302 178189 74568 392872 361014 6535
12671 278739 217301 149726 -95450 318099 -351903 139912 67705 254798 -58692 -12201 -59904
12660 -59904 192773 67247 -208941 404852 178804 413352 -236689 358596 67406 148508
12650 148508 209638 325842 26955 -201766 152476 -21329 -226839 344011 77619 -156071
12639 -379633 -388394 -145596 263368 275389 305694 -97597 191169 -21902 272199 280006 63369
12627 164894 559826 226881 183438 316192 -195906 196017 22024 66499 392415 -215205
12616 97579 168570 -5348 113578 -40632 160753 259117 -145543 266705 208800 7389 177864
12605 177864 -283352 -23818 -39866 166107 26374 338251 -62270 131258 149814 128820 176841
12594 176841 223939 -10932 9847 82222 245685 53395 -165207 70219 4812 -204095 72498
12582 35888 139265 38802 -54933 -82284 -116999 109736 192448 9114 -41258 -115859 -222230
12571 -222230 303610 -32179 295916 -218990 71860 64526 -15976 -83314 133820 349192 245462
12560 245462 -148567 -84651 90954 -118481 108627 -16937 267836 177910 -104823 211577
12549 112612 125717 -19131 48031 -213816 -11819 -165140 -49311 678 267164 240771 -296152
12537 42288 -341208 236424 117104 36914 126343 96567 119995 -103858 -21239 -38280 105438
12525 9953 -222343 -192842 36392 251697 278972 168327 -264776 234568 -103105 -17572 139708
12513 -141758 -275149 199126 -251291 -58158 -345709 269437 -87932 366805 58190 -112883
12502 -109092 382749 -137273 206004 -39270 137237 114945 27071 -389490 126323 -17863
12491 103919 -17038 -113035 71311 134118 -141056 36393 -10694 119052 -53693 -131690 239871
12479 -236602 -50595 116865 22726 -297408 30972 21004 -341276 -311179 194917 -275781 258731
12467 368577 -22249 -9216 -16535 118427 -58064 385391 84237 -117955 -86611 28879 92861
12456 92861 -125881 179562 -202527 164820 198533 322879 187161 -322330 212521 -258638
12445 100305 -74192 -151280 -135221 -72582 -225327 -338088 98448 -249042 102774 -129253
12434 -56899 -165328 282609 -157664 21977 67199 -36263 103096 288876 -278309 203990
12423 89841 -135021 -193521 193870 -135614 323377 -91100 -228648 42964 -123133 -193995
12413 -193995 -326853 177033 -13909 55970 418472 121605 67770 272501 155485 -1714
12402 25736 80082 -48992 -19016 71046 -141535 139124 166863 -64603 -49680 -50988 18021
12390 120674 -103840 175185 55162 -80322 -173025 409913 100380 259098 -76903 -114713
12380 -114713 30391 234342 28842 81371 -191748 -76359 94907 178907 96779 -44933 88082
12368 38419 -208275 -151540 -50943 215079 -101323 374 86845 159723 14796 -38316 -44727 76857
12355 -148426 58955 126745 120804 235699 65499 311536 -34640 186240 -12942 -64819 122239
12343 -199786 239519 -309882 -23096 -116070 -164865 -307121 121876 -126939 -169190 20606
12332 -245448 -271092 -397610 -44103 -346958 232599 99062 198071 -62666 318808 -12211 -196192
12321 -196192 23845 -60669 -68471 -279593 -31263 354157 25910 45233 143329 99473 127664
12310 127664 137008 -215232 288916 185612 295845 98874 206077 164830 -26366 327520
12299 -368231 42369 -131497 262793 103751 -5448 -216600 -192258 -66568 197382 -147624
12288 -36984 59228 15880 11936 -60015 -68382 270365 170836 141435 -10541 -172824 22740 243869
12276 243869 51040 308828 57326 296487 115142 164971 211552 475752 -119031 -170865
12266 -170865 40117 73739 149130 76752 103859 -534119 28440 9062 -19401 95564 -30707
12254 -261283 65805 -91786 125690 -106758 34743 -169090 92110 -25265 -24144 128157 394662
12243 394662 23338 43382 128287 -47846 -42839 249361 -8077 213985 141263 34870 201445
12232 201445 126169 -74386 172561 107040 464458 293136 288703 296487 301765 -101344 312647
12220 -65391 50327 274031 124594 142333 419837 -116889 -143521 53582 175296 15160 -45571
12208 164392 180798 83881 74850 306433 162054 378131 -10164 319249 175479 114242 462456
12197 462456 202676 265078 168770 63253 282386 94942 -112794 245680 89622 101385 229171
12186 229171 -213133 -3227 -296164 -221867 432502 162738 186196 161246 14536 420313 -291479
12174 300060 155903 486652 62293 356588 -70245 50390 250112 -77846 112783 240437
12164 240437 122721 -317708 -227822 104778 267306 144519 -123949 -66643 -158874 249041
12153 91359 323932 -48599 -123992 42165 -10917 257598 136809 109892 89647 303746 158012
12142 158012 25155 -217712 -221220 107084 -126134 -16755 104308 323384 -480033 -54879
12131 -72081 -47890 240841 -188133 105955 20757 603736 46562 250499 51755 137099 -233325
12119 172207 -35413 78106 -111710 84805 68994 -239753 -3766 6693 203460 -153857 -213648
12108 -213648 -140201 195925 -200310 -107747 -232852 -85201 96453 -31124 -25322 95424 315567
12097 315567 -144334 -27541 44624 -120609 -84949 -199869 74640 -24999 -66614 -187095 -157795
12086 -157795 100639 -20153 111094 -286933 -34658 -142586 308150 225119 -23998 -77432
12076 -77432 -32143 -265447 70695 173568 1121518 1373057 1159373 169559 22754 209309
12066 209309 190906 170899 314388 -85030 -28448 -212467 -101315 264538 -133161 -179432
12056 -179432 -79070 -3645 387516 37348 -45428 -46919 112237 18156 -129105 -124045 -56783
12044 40366 254405 -240217 43026 105702 291286 127182 267580 -301415 150536 -134236
12033 -295342 -126151 -46152 -380285 -247008 21801 300619 -63793 -78364 -362442 -111034
12022 -245839 -267786 270673 250557 28041 -157445 -182894 184496 136057 21066 -236886 -224295
12011 -224295 78093 15917 -269471 6082 -214854 -236514 2033 -239046 -58397 7522 66518
12000 66518 -247085 -37760 -142537 -192242 12649 20494 -152326 -95601 -19561 332188 -181404
11988 -469799 -214600 251678 -137293 -15295 -109512 -78250 250251 -57889 -77029 361212
11977 -47459 -136412 -27820 261715 47990 42916 72650 226539 -149459 30018 81148 163565
11966 163565 -355709 124230 -16375 157034 -170330 -230117 -48904 122799 256050 -174606
11955 113933 327538 237543 -76074 107789 -66781 -336915 41657 -193243 126709 -149219
11944 158690 -114195 182995 8228 -103461 537130 99661 -143975 162096 -377958 -60275
11933 -71077 -233576 -101425 -97216 -91044 41639 -107635 -55824 -223008 70356 110983 45219
11921 -221655 142360 16320 -81272 159399 -197670 -181248 662 -41569 141395 -158306 368675
11909 -496322 -453783 228662 -142796 47733 -23102 194652 -11512 1409 -98865 36312 92950
11898 92950 52749 -55185 129205 -8251 86724 -120625 76417 133443 116109 -149069 -225515
11887 -225515 -189232 136281 -236379 -115891 -38732 -138145 -187671 3156 16828 119992 46573
11875 -248793 132142 -96405 83853 109638 25315 18203 -71954 -233767 -213634 65709 -141540
11863 86906 -99744 277677 -598120 -39303 -6282 -267416 -199037 -2549 44123 21164 -176549
11851 5859 39406 -131569 -66879 -1935 320752 -147490 37476 160601 -397061 120255 -141380
11839 -240645 -163530 -89832 -118099 183276 86181 131957 -59003 19998 -8681 6721 -111627
11827 -74289 35120 115841 -184208 48846 39984 167143 -257005 -222506 -158746 353633 -118284
11815 -453230 -137220 13348 -264271 -96115 190244 -203064 -447089 -108280 -63056 76712
11804 -218462 -62685 -137380 -63117 -232533 -26362 44273 -96855 -2578 88495 -350880 -71035
11792 -247955 -15297 -74831 94472 -105121 156729 50412 217827 -273130 31595 323426
11782 323426 -181588 -53754 277848 64200 -190746 50875 -141270 -82698 -136615 346342
11771 -186589 -55226 -219044 -125897 -107326 -4745 75863 -105214 -372017 107087 -114971 311499
11759 76164 96527 20648 79256 -71559 32877 75552 -154676 -130631 156324 -74797 143329
11747 -45378 -23874 1794 -20717 303652 67375 -89933 -73565 -235523 229082 -4575 261291
11735 4015 33366 94906 16885 -147905 200000 109258 22930 92181 -125375 -50053 -150036
11724 -150036 269449 4144 120630 167510 167523 152039 226608 -71717 -138649 -44752 269810 123206
11711 -11271 255040 73036 -183141 50053 28076 -192589 -303272 -131113 182944 155290
11701 155290 128288 -227771 -15067 -195093 -61190 -77686 -165614 -77633 -237791 98250 347732
11690 347732 156288 4620 109349 393302 82951 138910 177062 28805 -52916 -207081 214973
11678 -39778 297809 -51809 153845 -93216 6583 289972 -235596 -23052 247023 190977 230724
11667 230724 -86456 174279 -44375 77872 -75838 51248 67961 25408 219869 40642 46079
11656 46079 190750 -159595 -78672 191651 113485 -206073 104684 -44948 193004 -288909
11645 55322 -97741 339694 86825 17763 93357 -3359 -103944 16558 138063 190902 163070
11634 163070 84513 60935 324734 -62110 283890 53070 -14207 192437 -127061 187782
11623 -15181 31630 188438 412676 -42408 -100571 58044 14980 -245347 200486 -150304 -12860
11611 219656 -47507 -323881 -76935 -158338 -56463 168792 23024 128931 -187872 -98121 197943
11599 278617 31921 -60814 239613 -222873 164279 -144319 131994 194822 -89350 -60063
11589 -60063 503978 -223286 34888 138775 109041 222796 -100185 80436 149039 -151006
11578 -219949 137729 63157 -192800 52553 72461 -4111 9576 344199 246544 -108239 212058
11566 211058 75065 -354624 -97829 77470 206591 -94143 121083 204075 -45526 194979 -223657
11554 33030 -76215 105364 -256711 223110 237031 245710 -193552 -299696 124558 166177 131682
11543 131682 -108058 -18476 -64901 -34041 176701 422288 222216 -174056 133188 104665
11533 104665 84644 93097 248275 59706 -474399 313167 280374 340840 -207 288142 220500
11522 220500 -235639 -8890 131642 330403 -125805 -47071 120235 174977 136338 -201544
11511 188282 29136 111990 -310537 154439 153156 -148970 233879 207522 377440 158121
11500 286186 -135469 -425 142986 -147990 -80135 -85959 67944 272803 1055 147773 -224525
11488 291208 121367 -16363 -69432 188914 -169324 370589 236433 -231989 442053 -69298
11477 102970 111600 -116818 -29874 -60139 330059 -55153 108257 215834 69305 -117590 392439
11465 385667 142112 -85080 -32095 199640 116980 -47867 297154 243408 113878 313437
11455 313437 194554 377987 -107872 -111155 559192 106422 306163 103066 12785 -77959
11444 303099 139162 131689 -114760 57679 95936 42716 348426 130348 -87230 -237326 -70676
11432 4654 213970 54485 247540 294535 72109 -48825 128987 81254 -16648 202053 -27671
11420 -41808 253939 -140820 128943 -201979 -258185 23524 -212456 -97039 114932 -9967 65032
11408 -132396 256164 12758 184920 176034 -123459 171004 53348 518360 75221 -118052
11397 262257 -139722 269684 -192447 -137223 -66499 183790 -47159 78859 25813 -153094
11386 10691 65943 89374 -343678 147983 55964 -150385 -11684 190421 132231 -53662 379538
11374 -18705 70449 14039 124628 71795 -141459 21716 -3973 44162 -563690 -40019 28348
11362 -18386 -61906 -57009 -297857 134833 298161 -257631 -174392 -146868 85561 -12662 7060
11350 57308 -30077 -85422 13099 -408456 73049 -113214 99823 -68552 -211433 -57354 -88085
11339 -88085 -62977 -149272 -22890 -203763 -112907 -45105 28403 -33220 -32723 -59868 175214 -318639
11326 191054 82974 -80404 -89697 218785 -41601 -244261 -299740 18693 -135947 -49190 -163571
11315 -163571 263504 -316276 75641 -184721 -23808 31200 -158893 -58555 -57967 -187947 88949
11303 168932 -189280 275438 65257 196460 -69976 133993 82636 -66373 -130369 -276930
11293 -276930 -401278 63873 -115814 99936 107213 -12220 115861 -375625 267275 -132573
11282 92647 61748 -15665 -169385 42689 64256 24922 96184 -228428 -427618 -181386 81619
11270 -51341 36460 60188 27608 112418 -278390 -87335 -168942 -165966 115711 -110064 -105662
11259 -105662 -95603 205349 -187437 50286 -38416 -401106 -218433 170935 -119437 -36048
11248 -252148 156831 -135840 -137962 111543 34237 164964 -98610 62613 14652 98322 -227944
11236 136925 71772 167701 -146023 -298199 -72108 139266 67954 45495 -220295 -207199 -231617
11225 -231617 154592 243186 114298 -494067 50601 244709 -100346 -140133 41105 24406
11215 24406 -15351 -184436 106986 167211 -288311 42308 49293 20443 -181638 -174740 -227116
11204 -227116 -318756 -24287 -28467 94963 362501 435193 -367682 -207508 -46914 -77044 94849
11192 -152401 56789 93540 -150570 -104524 79936 -96758 27043 346145 -140876 -18582 49533
11180 -135757 -114355 214273 8547 327494 -341766 172413 -122652 -118578 -115612 -52011 -53714
11169 -53714 -130946 40706 87430 124159 -26334 -117364 -151040 -107503 185931 -206012 131523
11157 -71149 89633 13485 283813 152743 194641 229373 71988 -289100 159799 -79095 -167329
11146 -167329 -514916 -278595 -58542 11880 248712 -178534 -230234 -193618 318130 -37626
11135 22322 -371416 172066 178347 48945 2582 42339 47591 51528 -36554 317037 148921 44660
11122 -255533 169864 169361 -338202 40096 37519 25711 -30712 82880 85420 -182322 -114220 -13991
11109 56968 286422 484344 72221 383075 211076 96259 -275617 207483 -416269 162704
11098 -138834 -53037 -259500 9555 285102 92734 169409 338865 107897 -75594 -86673 61150
11086 293141 90464 134338 298277 463336 495829 38252 72514 -381843 186187 369771
11076 369771 134765 535031 131394 285688 125413 194022 335551 366810 103513 20464
11065 483864 419391 721874 20422 224602 365101 711228 423733 612400 534490 723849
11055 723849 595099 655173 527684 636863 804430 852376 542185 696191 776148 1061979
11045 1061979 656593 497090 771592 744684 687409 716395 677728 504273 967406 542332
11035 542332 625866 825585 591834 613251 609963 552532 1044226 578903 707211 497206
11025 497206 757156 708263 865656 531318 794579 559725 819271 567658 559956 538495
11015 538495 486100 721682 707752 789631 537485 386850 308375 346541 681067 762910 519692
11004 519692 466505 603523 788060 547357 809629 708916 651059 652920 793819 573295
10994 573295 711408 901708 666094 1171829 628219 1009955 844886 753205 1063309 841470
10984 841470 1015937 1011503 1030665 1238981 1105949 1112366 1319316 1454104 1917841 1997751 2462261
10973 2462261 2540067 2687519 2557826 2572868 2586337 2285899 2247394 1988830 1817197 1756608
10963 1756608 1244789 1460195 1980286 1731612 1761176 1267272 1580637 1715587 1192148 1328698
10953 1328698 1393823 848296 924532 763295 404852 632898 368934 189090 337903 169441
10943 169441 343334 106532 201322 225353 60868 55137 345295 109048 80400 250077 187803
10932 187803 14364 32760 -5130 -180645 194648 174204 124517 -130040 345295 92973 -59206
10920 143738 -167414 223257 65489 -59807 -76103 49907 -359742 339060 85093 -189463
10909 24734 33960 496180 172755 17939 -106334 3579 82426 88830 -320900 -315678 -63190 19010
10896 -179439 -333037 14418 97413 154151 81798 -263552 53888 99176 90838 -123978 141254
10884 60893 -176536 -142530 39605 -49351 -420638 130709 -63639 224561 31581 -2679 134394
10872 18838 -278232 -129245 191499 169609 -290087 388244 193528 -30040 -133632 76617
10861 482165 -18657 70227 25274 4289 -101710 188645 133315 -142541 18661 164663 -324138
10849 -257689 -55098 47753 2143 -31670 -34238 182463 145193 -47185 -152049 190461 -276566
10837 -242656 -191782 139673 -329760 -395289 -219075 125747 26649 -39675 18652 1190 102396
10826 102396 189381 21614 -12912 -245559 -63041 -146574 -170131 -57918 -465759 -252736 -245020
10815 -245020 -37637 202096 130677 -180080 7161 72005 51990 -111753 47584 285002 -15875
10803 -125276 56372 176417 -143515 31608 92364 -86909 434358 -8994 345860 -28033 35180
10791 91855 -187832 126816 -144717 -134424 -336961 86636 -235019 -156721 -50853 -86699 30269
10779 46914 -96415 -73129 -187846 87652 -166739 99096 -141526 -342575 -149918 -84120 -454513
10768 -454513 82676 139423 -204069 -33404 -173198 -94103 352468 -301713 21796 10473 -271553
10756 675 -395790 -25041 -261972 -71630 -173172 143786 124648 181877 50058 -91892 -201865
10745 -201865 -136346 -374182 42679 138477 91750 151498 16971 -149031 180952 -214038 -162708
10734 -162708 -25246 18652 63140 116362 279954 17341 84035 76949 -97478 95334 252936
10723 252936 72889 157271 108377 61500 -135026 100170 214105 52836 173127 -211385
10712 -207110 262811 264012 -60098 -163910 -106410 -119440 108252 153318 -327677 -517897 72334
10700 9067 -142633 -22313 162668 117325 181442 -453742 131390 86629 -116495 -221193 129227
10688 -78307 -3319 189739 -118660 76656 -321729 -31338 -93956 451357 -70854 -10018 178236
10676 -65053 -192406 191413 -392975 -3283 -104842 32902 -53497 67429 212566 -177728 93346
10664 133949 -288598 -162516 -134869 -63331 -33711 48319 -56713 -319481 23960 -171217 150818
10652 -406811 121060 -95424 67722 -16877 -5470 42628 -284613 -68740 -49366 98493 -127586
10640 -74198 -144264 -12909 294493 12278 -108397 -75923 25747 22728 8507 -200928 -11906
10628 228389 -296111 151550 26076 97866 -239432 219952 -190002 30379 -137513 36328
10617 20834 -15099 -47951 -400150 27699 114554 100317 -96452 58089 323777 4348 93377
10606 93377 85280 17621 -41523 -110521 133170 -277269 -399724 -12761 -76190 16853 -108251
10594 1446 153198 49125 212654 -24278 -509264 -65609 -239253 -496058 -326521 -272634 -125060
10582 -113143 10531 60572 112767 -75205 -183733 18313 -47637 9021 73008 -182997 63791
10570 54678 -129176 -14428 75457 109200 -206990 171890 -205706 193178 203837 73990 335116
10559 335116 -255849 121117 32511 -98101 -3046 -51314 -15017 -127619 -130311 -25998 -55288
10548 -55288 142603 -45598 252173 -167940 -270593 -235411 -88410 279164 -211291 -311253
10538 -311253 137958 -156104 85994 -30708 103730 76589 -327545 115387 82308 105241
10528 105241 -85784 -70377 81712 -57167 95194 18833 111640 134123 -326663 42188 26912
10517 26912 144461 -137887 -40011 181778 -49618 -63756 217463 -90441 134495 -189949
10506 -119999 -69248 113408 -123304 227751 -179834 407854 23455 -281747 244409 -35681
10495 118887 32947 -51094 -29197 -111422 166987 -146368 -283773 121043 -152437 132683
10484 163386 241470 134865 72248 570666 6723 258088 22199 -89136 -35718 122965 80203
10473 80203 170169 158571 -98966 105050 102726 -57650 131004 218719 -130984 -163423 188246
10461 99446 1561 250118 30912 -213950 -103750 -201036 85723 -234777 67653 -121292 -9018
10449 -231841 -27640 -10154 -340425 339923 -162404 -173769 -165670 -84518 2076 -147736 209016
10437 75359 261761 119849 -264810 -334838 102817 -285594 -51341 -187127 249893 -105550
10426 82321 76893 -202369 19804 32689 -47606 172320 -286946 -278002 102209 -55302 -258017
10415 -258017 71789 68794 133460 239674 140993 -353524 -61415 -31976 15379 -121733 -50621
10403 -140995 328012 -75587 100631 -360011 139792 -99406 141257 25377 238541 185685
10393 185685 131990 152920 46249 501137 293633 -106820 207253 154620 931 -222575 -81427
10381 57194 213214 31716 173005 -223107 42635 285369 -116991 309802 417189 125659
10370 464501 -30013 223583 355744 728968 447841 407406 176932 241512 126299 102281
10360 102281 429165 286983 167194 206537 150984 604778 470620 505365 255046 753872
10350 753872 404050 649888 545878 402953 362614 215116 235727 307380 156859 234820
10340 234820 351242 -56643 119419 161172 423210 230513 213400 255845 128370 153465
10330 153465 -115336 115438 186967 -97766 254295 -77765 325246 498442 -245676 -145479
10320 -145479 386844 -22726 -45252 292473 115231 9033 -26644 -199635 17708 213534 -168131
10308 155523 -343608 44382 204153 323376 -432001 20786 116424 38826 -60938 -163942
10298 -163942 -132045 -259314 -93211 136296 -457617 2588 -59771 57596 -50169 17160 -43331
10286 -431223 -122100 -178435 161810 38697 82 -198954 -127304 99794 -315961 -451076 -148634
10274 47426 -135001 -357929 205262 209246 68659 -199478 20170 138888 -113587 -92394 336419
10262 43452 -58637 211132 347832 281571 98976 444050 214595 167450 -114591 -410811
10252 -410811 -23418 33039 -205593 425273 131872 103213 -172963 143468 131445 217647
10242 217647 353770 -138415 98817 120946 -310170 21137 -219877 201958 391535 -1690
10231 -133681 192842 61407 -221390 63056 -116013 -179571 381200 -181385 37097 -21641
10220 153339 -110686 -186750 -93353 -383102 27384 -151758 175218 -262185 18558 -2677 62471
10208 239442 -10405 72722 -26871 125340 -94591 -70716 219573 -47057 103996 -157091 -199032
10197 -199032 -182437 -48243 232154 -477922 -106283 -282566 -62518 146786 -50813 -304219
10187 -304219 -96838 -260772 -301150 -65793 -241787 -205823 180810 -56814 -37778 -203859 -138546
10176 -138546 144585 157126 259671 -29957 229115 -15908 -107258 -162767 -53497 144869 -161613
10164 2115 -154128 -152748 6121 176285 90370 -252466 -172391 -1239 -158440 -197735 10263 -105343
10151 -217356 212346 57400 -87637 -170096 134165 271168 -19444 -221198 -162267 -67413 -14005
10139 61218 -226362 116887 -74824 -113308 237736 33977 -127233 -17652 -286517 -11560 39219
10127 214408 218836 -393969 16983 -118901 -16584 -202913 -319341 -227263 -366664 -7144 -122176
10116 -122176 -136792 -71654 144105 -213239 -17611 101072 19684 -6993 -94231 -622 -5103 136159
10103 14268 58635 100997 -261373 12915 341707 -210921 -398378 -135393 -128325 -485132 6439
10091 -277146 61399 -24129 32115 -216782 7377 -207784 50539 -303126 -355572 -51704 364084
10079 25494 -356617 17343 -227744 -261039 -159324 -228825 -112471 232171 -31874 -79989 146807
10067 241324 -83829 15410 136852 -306851 -71826 50210 -185627 -124319 160056 -345737
10056 -438656 -15089 347321 -355073 168413 -87827 -255868 164880 176228 217161 276449
10046 276449 -76531 103012 -8040 24257 -38964 18449 -316824 -442402 123316 -76219 48002
10034 73480 -84063 -71624 70931 -118749 -16913 173905 -338382 10925 -17509 -358183 -46477
10022 121461 -51769 3414 -125408 -174225 -141198 -115676 -148177 -141015 -68923 -271893 -270078 -144330
10010 -144330 211023 125733 31933 -309945 177739 133193 34115 -52968 -35200 -261698 -40125
9998 -11086 -232527 -63658 -109279 -63272 -91704 -54736 16013 -251005 -132760 -377990 144210
9986 171434 29367 143106 46620 -292959 282591 312373 -183516 -91639 -370666 -2341 168586
9974 -261332 -431436 -123759 -178293 -183432 -130288 158325 40818 61260 88335 -111424 -375281
9963 -375281 51493 -30835 233679 87207 23412 -38895 -31450 -10079 98570 -222648 -335774
9952 -335774 -89484 -200581 -331343 -23986 -405396 -133408 -179504 -71849 218005 185489 -172770
9940 63530 21969 -120552 -182955 277648 12169 -145430 103734 36661 -142895 -529057 25593
9928 1953 -254445 -148844 -95762 28436 -91200 -234385 -175744 -233451 -180010 -49816 -240377
9917 -240377 -124358 -107878 -199385 -83938 -8476 180387 -261453 -175212 -304387 -182861 -16456
9905 190805 -38624 -168197 -163952 429658 29344 -110386 -209080 -96855 207489 -163501 -213028
9894 -213028 -194681 -24969 83876 -97814 -119381 -202111 80151 -206132 -69023 231276 -12808
9882 122672 -82575 40782 215742 15101 -218370 -127315 -243580 -206228 -26385 229853 -268678
9870 -234595 -156738 -147548 -67940 -47654 165565 188004 -50266 -202098 -119038 177188 -247711
9858 -227121 50517 -52266 -107961 108772 -60344 -291168 -150842 -152353 -231701 -68055 68209
9846 -494549 -266417 -54913 -241769 -31220 -71089 -306791 -177650 76407 -187546 -114570 -91532
9835 -91532 -162636 -151619 -136945 49585 252941 -163520 -127929 83546 -72723 104569 214071
9824 214071 -7234 -160848 -282779 110184 -139342 -78946 -156558 -111295 -44361 -184508 95248
9812 61541 -158212 -215898 304284 41039 -138065 -64100 152063 -9041 -100836 -144398 -172194
9801 -172194 99165 -7647 100397 80322 2261 -249473 -24575 -355607 271617 140373 -148465
9789 -301579 -22309 -198805 -82817 -65769 149038 -33949 -78793 210478 -16331 1900 -30577
9777 -82561 -399375 -158767 -36723 -71045 -248869 -269455 -2393 275491 -404641 -151338 20818
9765 -79482 -122045 -68606 123139 55910 -11972 4447 193904 20368 -307833 -182952 -309216
9754 -309216 93186 390786 -175267 33299 127140 36943 57995 181262 81056 94262 -19636
9742 -224925 -146932 -23539 -243815 -78263 -69167 -37994 -88840 -29959 -368658 -456231 -249586
9731 -249586 -89556 122038 52428 -334006 -64898 76345 100813 -38884 -7659 -140553 226009
9719 261357 -76389 -252102 -134965 -101447 27527 -12506 -227511 -143101 5948 322750 -385616
9707 49328 -323323 -39733 -62406 -149017 -315639 -186437 99040 -280752 -47033 -204559 -75618
9695 192986 62813 186991 112128 120937 -150907 175732 -383053 -492609 -285904 -308139 204375
9683 54792 -271250 4723 66544 86291 4789 -27139 -68395 -69566 69543 -587476 -66536 -107993
9671 -107993 -128899 -50720 -479445 149130 -59958 -99330 -213071 79399 94652 -87018 -105435
9660 -105435 -300361 -79978 241223 -31382 202921 -51461 -241704 225200 64715 -27574 -25895
9649 -25895 -366250 -232427 -81703 -58213 105111 160106 -184725 -83902 -158479 -192783 -90156
9637 -56714 -18583 168080 65432 45276 -164155 -194793 -204254 33219 -19835 -126053 201733
9625 -60082 169830 -327419 -48564 66287 -173842 -105147 -69616 -5612 87875 96181 -270711
9613 33307 -377408 -27583 -34005 13181 -298831 182945 -64450 -127550 217225 191634 -323535
9601 13020 -113092 -102554 -451086 -222828 7574 168144 11340 -132586 9580 -280641 -55812
9589 -105322 -215501 140402 -129905 72328 -233153 -445706 103335 -295876 123832 -34006
9578 -200127 309247 -247637 53548 73400 -129401 -80712 -72880 -179899 150999 82552 -133122
9566 -241163 -201209 -296734 58899 -69560 -29691 -5203 -107469 -110113 -184458 165198 -184897
9554 314100 -279217 -143006 -80454 40820 200483 -214749 -303201 -162827 7982 323163 -140195
9542 -90791 -60832 70911 -93059 208324 -190224 -12455 -34996 -192707 -811 -575279 -100505
9530 -253756 150928 -182099 -171496 -246270 57003 3652 136847 -148643 -256807 -228188 86825
9518 10732 -311784 -5225 247204 -129010 -254500 -226482 -158521 51120 92161 -133969 205668
9506 215700 -279918 -48167 -295487 -125616 -131207 -180937 -1100 -70213 -390661 -84885 -212395
9495 -212395 189260 -58139 -66583 -119317 -384550 -427026 293716 244091 50922 -8392 306898
9483 -354175 86726 -649525 -488066 40248 34578 -189167 -231072 -63054 32412 62023 -16432
9471 91262 -304636 -31910 -139626 411823 -52333 50953 67983 -77604 -144577 -312163 72022
9459 35588 -425585 -199937 -138978 -40700 -23438 158535 117973 4499 -246492 16197 -191471
9447 31978 -227837 1473 -160339 104853 310268 48322 -248226 -143352 163937 100376 -16206
9435 -98689 109366 -4626 60333 -233732 157118 -56958 -167992 215099 -101237 -146008 -193906
9424 -193906 -237305 138785 11049 -164976 -311761 200278 -116968 -120091 220847 -9020 252653
9412 -113965 -208661 -9469 139229 -103569 23620 269853 63730 -30761 -279887 162339 -170192
9400 4489 51997 120396 69639 28513 86643 -62912 14212 -167391 -344122 -102072 -4668 -296147
9388 -296147 89633 71296 5192 -121085 -529067 -107651 -212590 2041 -104088 -62812 -283810
9377 -283810 197131 -158737 355355 -102181 -241306 -408031 18145 -355083 -74981 59623
9366 490 124837 -100477 100765 29978 -153675 -69688 39671 -72992 34235 -347059 4352
9354 -123246 -396415 -83078 -273284 -59878 206304 -37786 -40421 86342 -280352 182515 -38211
9342 59307 264388 -282044 -302382 -99627 -124293 11781 -81385 -11130 149871 -115384 -169946
9331 -169946 -14073 56406 -49433 -8610 120960 -424831 79 88929 -45647 -155708 -107636 14813
9318 49066 -217569 -142687 -68050 -236697 -245006 89239 10522 179834 215417 -68759 68029
9306 -142654 -99878 -244982 139637 34027 -322623 -151130 -159029 -48695 -233609 -120422 -153542
9295 -153542 -168997 -438291 84673 106913 15447 141436 212499 -86575 -414796 13167 4300
9283 -73424 60693 45594 -169524 154634 208678 -146266 -160404 -53174 71351 -265005 -267664
9272 -267664 -81714 -150839 -163783 -370264 -111013 -55865 -131971 -277097 104063 -10009 18098
9260 -218863 34786 188555 69707 -36344 61815 -331722 103149 141939 158151 57390 -183506
9248 228059 -287182 51349 368468 -92837 -403578 47777 -69492 273774 -275342 -195953 -151487
9237 -151487 -98265 -108545 -140469 -121139 -283178 -114770 189928 -104437 69201 -95547 -239391
9226 -239391 -129430 -350897 -219168 182587 -16241 281912 -248567 -189921 286715 -234116
9215 -244988 392849 -308520 117651 15828 -47731 -264461 23964 -104325 -43558 140155
9204 156730 211184 -38324 -57601 -196669 -46495 -67251 -27402 -131209 46733 -110582 47259
9192 -352230 -129528 -32971 139218 -246316 -16169 145636 -298206 196017 -200038 -145555
9182 -145555 -163784 -50239 -73266 -50836 13220 -230591 36291 314098 -151448 -408 -174648
9171 -174648 35318 328523 56536 153564 29651 -571197 -230894 -89353 -334053 103445 84202
9160 84202 61087 -270156 260549 -104985 -79141 104277 -315275 -106987 -219131 9167 65428
9149 65428 -277134 -221651 8303 4848 -141277 -3934 -406041 -320467 150109 -220566 76690
9137 -214007 -48531 33931 16330 -64465 101492 -170910 -310090 -25950 -132599 -165078 41369
9125 -999 66241 25166 -210977 -169745 -21789 -45668 -144120 356 71329 206066 -484376 -9840
9112 -167587 -184036 -153245 -220612 -268634 -190425 -153568 -112631 79861 28534 -4854 -129240 -105761
9100 -105761 12598 10335 -62275 133976 389775 -338993 -114031 109471 -168122 246002
9089 -60848 -348528 -301302 78136 65759 5073 -215384 192062 -42770 31342 -67192 -44353
9078 -44353 37813 146648 -182173 61356 144683 219843 134218 -55635 -296786 185205 16289
9066 -134577 -355507 102335 161040 -415785 -14610 -184063 249956 214637 -47004 46613 91110
9055 91110 -177225 -175811 -193538 -254923 -391285 176510 270898 162950 328891 -158827 -305761
9044 -305761 -90990 244002 -98065 -73538 -114087 -68124 58268 93450 -108111 178983 204385
9033 204385 -110417 85990 66272 -55884 -114001 -52924 80474 -389274 -145740 209429 134167
9022 134167 -24424 -245192 -84081 -81996 -323866 -129262 -118326 -155277 101642 -138595 -134381
9011 -134381 10248 -388623 133685 -126752 -113976 -108644 -67146 -17480 -190164 229997 -22202
8999 121717 11250 -246566 -52903 -298042 109043 -155593 -124422 -149782 -423282 -279345
8989 -279345 -131301 -249725 44767 368085 9908 -199499 -199209 8899 166834 -15641 -176562
8978 -176562 26032 -191370 -112282 -299864 -35471 -17512 -199654 -77399 -141799 -99918 -30525
8966 -14958 -81453 151700 -66259 -10270 -182886 -175820 -191307 -129251 -54363 65995 395578
8955 395578 139002 22365 -80785 -51598 166575 136487 -186635 -205867 -88781 -68620 -376941
8944 -376941 -16427 238522 234621 -223334 3792 -338171 158372 185684 225074 270288 230759
8933 230759 192289 133233 98188 48337 89063 30830 290601 226825 443141 1690004 4907192
8922 4907192 9087131 6754080 2066054 881652 432147 362343 164177 115989 -256687
8912 -105986 471883 -118904 8504 -132799 443062 -158096 -149049 114207 -314852 -335194 -443199
8901 -443199 195043 -201862 -311834 53157 127301 -547449 -400172 -171450 224987 -33441
8890 208251 78958 -3287 106132 -51485 -11070 -216222 55271 112070 52810 -276888 42937
8878 44269 -63374 -263896 63071 55708 -276269 108655 203876 224168 286900 -66558 -50156
8867 -50156 -43681 -92354 -73002 16538 39935 -128707 -280318 -212316 -76564 -89110 -385261
8856 -385261 -144888 212424 -53675 61624 -188450 -200771 -415206 140157 88790 -138782
8845 263073 69425 -369479 -117924 5667 -33690 -246822 -27262 -170978 -52623 49503 125984
8834 125984 387586 145194 430 201728 -353022 -43824 -115143 -38905 69554 64385 -184790
8822 -58753 305828 82370 -163998 234756 169189 3130 -195516 -223847 110447 -146201 56867
8810 -199542 -948 179392 -118569 -77558 71757 170941 -57162 8236 -68755 -295057 -28936 64768
8797 130064 -212023 -162102 37082 -278748 241980 58763 12973 26483 -246912 -85346 -106412
8786 -106412 -179838 -49061 -165291 189041 146096 -260172 -384436 -375822 70135 66226 -6162
8774 -38670 -433101 -15366 -84048 137294 -668545 39650 203941 -339556 120045 -215337
8763 -423927 87998 161778 -346656 108011 -18011 -259660 110330 -75907 -112024 -7103 -196977
8752 -196977 -104268 223019 7225 -150901 43101 -169371 -198709 -18024 131143 -343629 152444
8740 98372 333126 171110 -59814 6940 -63910 109552 29702 -166275 -324878 -350602 -174593
8728 -181078 -127655 -41254 2747 32417 -147076 165484 -58063 -48581 -77535 151035 -55847
8716 -138790 140300 -307914 -204842 -398247 -3551 97200 -84790 -118787 -34195 -13386 280689
8704 -118702 132141 -197682 -37135 -162848 -178909 106322 77264 -263262 116560 -156988
8693 -242125 -113227 -98538 339433 181642 120800 260589 33022 -227569 -201068 194057
8682 209553 58731 115282 -186208 163534 129180 145575 267132 86165 -404377 112837 421872
8671 421872 -41750 46272 116248 227302 -129076 -312772 -90253 628140 189648 437530
8661 437530 13980 -978074 -453135 -140258 -187979 -27381 636 60364 -339540 -97518 135197
8649 -47226 34874 272645 -21637 -190347 444663 251004 -216322 -242540 93378 -198345 11697
8637 -264620 -32148 -60567 408379 -136963 436655 113731 -24106 -205317 -171803 -190895 1567
8625 -30775 177415 -351304 -24052 -39021 -261135 -165089 -71244 55228 -378588 104510 -36961
8613 -175798 -210459 -151264 -28807 -462876 -44311 -358563 160680 -409326 -174477 308445
8602 143154 -60648 -25224 136005 -88464 -140554 -77599 -57664 -350593 -39039 -181400 -107235
8591 -107235 -373209 142416 213275 -155807 -321988 126231 -59137 14951 -289 373870 198247
8580 198247 134606 179512 55171 -164058 -155107 73366 -23154 105271 -120068 -68195 142768
8568 -202423 -285365 161888 6900 184125 -50401 -213477 -120008 -59301 15604 -160507 -340525
8557 -340525 129104 25033 106453 145862 -271259 -71111 -51919 -223767 34675 -211939 -234460
8546 -234460 -124050 -79120 -112501 -137899 -51795 -34819 -261209 -149001 178206 52693 -345335
8534 76912 -37050 137646 -318398 -89373 33240 11933 47970 -292695 223586 -271957 -90235
8522 -122298 -207857 -3106 43196 -188500 41231 -134859 -28952 63471 -91475 -70296 -261666
8511 -261666 -23488 -30811 98873 -108695 57305 21956 147710 -308032 -137313 -81914 -23380
8499 217836 11901 -311121 325903 278503 -74190 83998 -238915 10896 -133499 17766 282671
8488 282671 -283784 -25718 257619 481967 84002 101853 -100769 -301358 -159326 -249082
8478 -249082 262321 -88349 338766 -33553 142864 -264204 -34778 -303669 -86345 -89976 191225
8466 -16239 25143 100036 -150163 -284827 -291935 245602 -175761 234334 -17871 20926 136703
8455 136703 -47868 154114 96962 -69696 -151030 166877 206814 -33176 22065 -205233 17622
8443 100748 -262779 -80359 -267617 -348105 -117433 -41137 149704 -253631 -113588 -88463
8433 -88463 -37493 -300400 -155899 -6655 -133612 30560 -128276 -236216 -101598 351406 -147013
8421 106447 -138701 -312111 -236927 -410944 66230 -197038 -123886 84831 -117495 -318953
8411 -318953 251419 -245634 -169130 -175038 42864 -171450 111216 -41139 -86479 -93560 -365370
8400 -365370 237347 129894 -208280 -83773 113905 250470 -206031 144377 -162494 -63892
8389 -282859 77169 -234314 -92021 -52010 -158475 -27296 -354817 -162016 -331149 85341 -176262
8377 134155 -179961 -277001 27960 -89041 -382522 -121834 -253923 72830 208089 -283428
8366 -531795 174892 235158 -9323 67572 -41185 -344282 -224130 -299043 -222574 117847 146465
8355 146465 -185367 -214854 109118 -204875 403 -66385 -17435 -142788 -164835 -89421 221511
8343 -43931 -167165 -78801 -52531 -103196 169152 -3268 -177112 -134123 -124771 49322 -41646 280627
8330 250719 -162042 -130878 -66125 -274552 -11176 -277443 175592 -8077 7103 46283 -183483
8318 26835 -104237 52312 87018 64965 121951 199339 -286602 317428 365676 -69110 289432
8306 -37182 -291028 -16836 86998 -165987 -64456 -236141 47698 -158296 -184080 39920 582777
8295 582777 52324 -105149 -1485 255496 39010 -69728 -391433 197229 102849 -51680 -95571
8284 -95571 162568 -110577 -132024 -164050 -23532 21265 -354120 -45260 -44431 134276 -353654
8272 -7315 -177735 -85384 16433 113043 129960 -261920 -251770 -256552 -78094 -38836 -180341 -210429
8260 -210429 -11342 -80328 -295937 -153395 128023 -210263 -9915 -174582 -7339 -299320 -340598
8249 -340598 7782 -77491 141976 93985 -315238 86142 282893 40648 -121326 -44467 -55328
8238 -55328 256664 76411 75366 -252631 260946 -212588 -74752 90499 167617 -106844 -60174
8227 -60174 -15512 27049 -324511 -322112 -51773 -132837 8380 50836 37700 143598 -165496 57732
8214 92712 10275 54707 -156431 -84872 216668 -124226 262191 1647 -78470 -201976 -149529
8203 -149529 95868 -40558 -51820 -125986 -199961 68105 16612 -201427 -164568 -252723 -127979
8192 -127979 79287 143860 211057 -30758 -287895 186469 183786 -289811 -24881 33289 1536
8180 879 -267540 -91842 -125974 40672 -62233 -41494 16544 -241968 -143499 50144 182498 -103348
8167 -85551 -184252 -75977 231007 -298380 224284 -220048 38587 -109688 -156386 265894 129828
8155 -43208 -41928 61855 15378 -94582 -384992 -8270 -217777 -13462 -65543 85598 -131329 -56917
8142 389385 -160157 -238919 4187 -33120 -128383 71724 -98061 -17089 -65001 -446065 -142262
8130 -150168 53576 207012 226666 -375740 45365 105029 270610 -81837 -209331 -257004 -34115
8118 -98580 -239233 122312 21801 130278 -190798 -218110 218756 -286510 -67883 46638 101222
8107 101222 -244242 -347066 -201204 205579 -92610 -73504 -38443 -3922 124662 68957 153010
8096 153010 55668 -104641 355118 -360570 31334 -117035 -156991 61706 -171373 41089 -352571
8084 -89971 -110371 -158963 -370093 76911 130655 -146842 -258253 -432953 75291 -240258 103821
8072 -217386 -159602 -113043 -189412 -40637 -224559 269946 -63334 -207252 72456 -372496 113312
8060 -158181 4376 109549 41642 6984 -138992 -106871 77610 24069 204232 50876 -199549
8048 179950 127605 129576 28881 -76849 239640 -283052 142250 47828 161060 -191401 -110387
8037 -110387 36566 -440871 -365584 -55085 37168 58651 -82395 52192 -219797 -199079 159185
8025 -65917 398625 139019 -134064 159384 218154 -33371 -307774 57428 -169854 188631
8014 -47553 152008 97958 -46604 -167059 -26359 2563 -238148 3150 -93002 181261 -187036
8002 -190217 -219756 -168384 -18681 -4430 -190360 -86205 -195148 164050 -441358 228729 -96720
7990 -16257 -94395 130333 85097 -57132 -83741 -76295 -9948 57422 39109 -233752 -99909 -176171
7978 -176171 44908 -98688 -31158 76457 -11894 -54971 60148 281285 -238068 59015 -50685
7966 -16688 -327861 -13336 -72032 15600 -49381 -8645 55265 -39368 -168534 -83357 129419
7954 29317 191671 -118072 41028 -49848 154179 -179315 -413443 -177864 -307888 -112751
7943 156398 58570 -13292 33032 -230931 -306005 -162381 283256 -172632 -103489 7214 17467
7932 17467 -14879 234621 -52222 -122620 58909 70755 313740 45142 -32069 -85638 25730
7920 394529 -53650 395525 92633 -229488 -282147 -43661 -93616 -126974 -4882 -205067 -289641
7909 -289641 -343919 86925 -102397 -173858 -24004 -169894 -54510 -187647 -390130 407119 -88449
7897 53039 -213835 -126584 105271 -35591 -103466 -142648 -61749 231223 140276 -289900 -36555
7885 -326374 12649 -25529 236949 50842 -143563 -291989 -367443 -192122 -41528 -139604 -56389
7873 -29647 76815 -223312 13701 -27830 -3386 108508 38000 272132 -130127 -202202 -69460
7861 -69120 -24649 2589 -120296 58438 71267 -102809 -43489 -306934 -80862 -140157 -169818
7850 -169818 -108617 187467 46484 82943 -443536 -323 1255 114756 -7998 -205363 22105 -113836
7837 -25776 121718 -136681 -93615 123154 -85831 189082 -187982 -16608 72611 116700 39725
7825 -78529 118994 139254 -73060 2665 323236 -165041 97434 -77803 12451 277237 155138
7814 155138 -522113 -37756 64281 4609 57524 180309 103611 232525 -31895 -51443 208419
7802 3798 -71627 -199260 -267981 -330523 -251097 -4211 186451 -184955 121682 108403 160704
7791 160704 20940 -128833 323010 -26432 266 -23103 -145953 63113 -52763 -237575 278720
7779 -126557 39530 -1425 -298522 -43589 -131644 -161890 29726 24875 -151610 -485589 -162001
7767 209781 160184 -34897 168293 -47837 57418 -186030 68363 125073 15824 290268 -75235
7755 -126418 161669 152217 -8423 -134080 -258764 -163122 -113920 110714 -44244 133593 -68782
7743 -56969 -69540 -97710 71369 -62523 -411325 -25574 53167 -52117 -20337 -222046 -11491
7731 -96511 51228 23136 -165106 205384 -156729 -58477 -124771 -281149 181771 -15565 -193852
7720 -193852 -211966 139310 54084 -51877 201932 -101730 -72498 282172 -448319 -234007
7710 -234007 -140194 -196660 -6058 32693 -29250 -76100 -204767 -37710 -71354 -237540 -88363
7698 -60697 118163 -184617 -181912 159590 134962 112126 52348 -227080 -86313 -18771 52126
7686 -178476 -240314 -292854 -174445 -9375 -23250 127093 -908 28483 -137802 -387408 -5629 111762
7673 189845 12346 -61245 -173278 -243058 -79973 -250701 -203032 -63296 -19832 64181 -433055
7661 -109216 -195973 135462 -47325 169948 -202048 330109 -14490 10727 -207850 -92410 -360534
7650 -360534 -260679 -132716 22638 366793 130899 29854 -89066 234614 50486 -90830 -173072
7639 -173072 -261348 -89248 200236 404669 290827 6877 87233 303768 -29199 4176 33653
7628 33653 -88473 43193 -63856 -74919 221157 -182575 293799 46300 -63304 123742 -222360
7616 109914 -97772 -9599 -15811 333658 110877 -57735 7967 141280 91268 160155 65422 -53267
7603 10707 -499274 -158191 -75268 -151615 163350 -129727 -69056 191341 8377 -165825 -469297
7592 -469297 148200 -23395 -156115 -474389 -400489 -276142 -135973 -49471 336316 -55503
7581 38095 -12516 152887 -9980 -122569 161254 -51093 -298292 13039 -18357 204730 356921
7570 356921 -308254 184031 29116 -377946 -63336 337003 55578 -56212 16774 -172682 364882
7558 140108 87342 210360 -122630 48998 -170030 35501 -66538 274788 25603 84265 42246
7547 42246 -215090 -635089 258313 -307443 -22642 -93426 -170767 40347 4165 255547 233338
7536 233338 90934 -172835 172765 36690 95829 123586 -188075 -204922 -21363 -142924 -149181
7525 -149181 138739 -100630 -234643 -208660 86115 -91527 -267243 -205903 -145495 266293 127961
7513 19585 -203806 -43562 131213 114685 7101 -353430 -114078 27669 317295 -76685 134890
7501 208324 -268225 -399183 373301 -240760 -138212 47824 121526 -47267 -383239 53811
7490 327115 212036 -126050 194915 -156236 -871 -70694 -97583 -161012 -203967 -225964 158647
7478 13245 77536 -94809 246631 -211958 417855 146286 -109567 -253281 133008 113448
7468 113448 -13148 105319 -105285 260374 -378581 193790 210179 -200875 209507 7237
7457 -53466 -518032 -328695 17916 -77287 -194573 74358 -200036 -100513 -220025 -74957 50181
7445 51333 -7639 38399 102270 -48296 77229 -95078 -136767 -129608 -1671 -227460 -287456 184328
7432 47612 -197069 195937 -115487 -176187 -122422 23108 19354 -375613 -153448 -40104 -163407
7421 -163407 163439 -206752 -78436 -74605 -121111 243981 -4593 142305 5797 140628 66413
7409 -254704 -323493 79754 59447 -163096 -102531 97729 -94358 244035 -51242 185747 -101124
7397 -292891 41632 48067 269406 58019 11119 -115273 -73455 55339 -28161 -47495 -17591
7385 -5873 157121 367832 130877 -155522 -250476 -83839 -227806 224366 -180172 -189860 -321189
7374 -321189 94954 -219601 -189833 96177 125661 -116422 21185 -150636 -28181 47621 -35446
7362 -45426 -76904 -174717 -122184 392521 -348745 -112727 -139605 202712 -131293 209113 -20058
7350 -136718 -53772 -16219 25511 -186187 -87468 -766 -87365 191360 -122435 -3319 -202541
7339 -202541 -98280 -92957 -88478 -234216 -260252 98982 -73924 -13578 -480947 -227965 198904
7327 -230452 18596 30476 -115249 153258 -93508 235141 -125585 37143 83140 -193250 -51864
7315 -59400 -148324 -187624 -25257 -40609 -107181 262738 -372525 -83638 -97465 258835 -118261
7303 231520 -3349 -34936 -57026 27810 -313976 105308 -246003 -177673 -293672 116161 224181
7292 224181 -296958 185599 27906 -172561 183784 -336757 117926 66636 -170034 -51762
7281 173106 -59027 -189125 -264332 141566 7578 -266503 225811 -30951 271425 -247939 230200
7269 -114833 -28128 -295862 282261 -311324 213537 132553 67797 -70066 95921 187598 -4930
7257 125925 109126 -42502 -3902 16877 -400524 -27779 201775 -136832 5013 117510 241959
7246 241959 282044 237190 261982 -42841 -262395 237730 -174874 -157970 -135791 -30280 -266197
7235 -266197 56277 101749 33550 -84237 -5797 -262816 78146 95220 -271068 -36613 44848
7223 -47526 246566 45316 285216 400494 -179013 -280212 -115983 -272504 129428 154318
7213 154318 104178 -167478 -28296 1765 303389 -135847 29802 -289449 -14046 -331804 108148
7201 -258523 -24228 -154179 -58314 37955 255471 -293691 176798 -196225 -102062 -201276 -355349
7190 -355349 -195811 5254 188841 268029 136125 -174212 -309458 21896 -126794 -220412 134464
7178 183941 -282481 160562 -130262 -413014 296676 136178 -116167 297338 63793 -264706
7167 143341 -123622 -14893 -326209 106569 -149486 -130754 -113429 -79427 15254 -234786 -482020
7156 -482020 66014 -93281 -73719 59823 -20744 -226492 22988 276524 96359 -31008 -133842
7145 -133842 99305 -294625 15968 -344500 -303034 219225 -293253 -55328 56478 -175272 -304810
7134 -304810 90731 -165035 -71021 -54605 -69934 -170072 50626 144643 -44077 -64010 57580
7122 42604 118711 -287224 97161 -199456 -110604 -7524 -223077 -5171 -282910 111784 59739
7111 59739 -95088 -92042 169469 -74634 -184054 125040 73500 68222 -192653 157264 101221
7100 101221 133906 -117421 20526 150120 269625 215249 -69731 85641 -126709 -159487 84074
7088 -140349 -67709 -1859 -188693 -289735 -156700 -432427 591096 39414 40731 36004 -50757
7076 -225609 24984 55782 -318360 -74802 21403 196657 113104 155430 -198810 -73686 -9583
7064 142156 20547 -14497 192313 241368 -1503 -45457 -193586 52356 317303 -162145 27561
7052 -98126 -79715 80344 -98401 116869 119096 -281266 156580 69416 -77841 -267756 -259977
7041 -259977 -91386 -34182 -250482 -64161 -101911 -241340 178207 -44940 380860 417700 -29320
7029 -35512 203443 -37704 -119043 121923 -88256 -267723 67143 -3812 -120745 -1921 -159586
7018 -159586 -183012 -67007 -207194 -313877 17917 158177 -81013 -94786 -283372 -132787 150035
7006 -161531 516224 -165713 -167258 -191857 -114023 -14711 9141 -26257 -64811 183972 109330
6995 109330 105328 -34330 -27372 -30092 221740 -219017 -13582 216245 -19782 -72350 -337439
6984 -337439 -206382 195542 -126145 286711 -61097 167735 58586 -355999 -245697 -13110
6973 151625 482223 -237921 236853 -246245 -549773 -22025 -94427 177940 -317949 -324023
6963 -324023 207412 109331 2329 -216551 -354408 -132079 343747 -16208 718 130968 376208
6952 376208 -141199 -91124 80186 303836 87403 -215381 -78095 -191171 -215511 138286 -307037
6940 -122271 187486 105830 -73220 31783 -77481 -135910 -72165 -307387 -195530 104080 141140
6929 141140 211382 43259 -111188 -85437 -38954 169985 250515 -133825 -14069 24098 -4802
6917 122360 109872 -218162 -340969 48307 -135766 236092 48026 371692 -352371 196172
6906 80891 -226399 92985 -281545 -136895 -68613 63663 -56365 -118560 264495 53145 115939
6895 115939 193072 260497 -316616 -172124 -80627 -101759 196553 -100317 -318555 -134077
6884 154794 -198783 -231860 -209097 107374 -88458 -318517 -43609 11640 -122531 58130 -9910
6872 -109597 21910 51126 558 -146894 -31474 -72571 46592 -87863 3121 -178704 -79776 221960
6859 -131864 259985 -30280 92433 -261723 479085 -83332 -9287 -3431 158716 121134 -5449
6847 -129181 -184138 336518 354479 106117 -330094 -7850 -29069 -184677 -128907 252457 10500
6835 176340 -193216 -259322 92501 115737 -15206 -126550 -13363 -237224 7389 -124326 -126087
6824 -126087 -3906 257980 -112946 135345 -70612 119282 109129 -44409 40881 -87811 -168621
6813 -168621 245039 57863 -173625 246833 -19930 -89637 -224674 -121446 -53579 -260069
6803 -260069 297794 -37859 2207 218722 93313 -101185 -333805 175700 342920 45068 -155122
6791 35738 116018 162789 44014 -41014 -79598 -172617 -381389 71527 -227110 -94167 41583
6779 -70384 -55904 106737 -4172 65234 69725 277806 147132 107848 4584 172743 -164500
6767 61800 -249068 108574 212714 -385262 -168201 -336732 -24801 40823 172874 -300772
6756 -43661 -96560 -113026 -86757 -370402 -14768 169146 -327562 302700 -353360 64397 17065
6744 -26626 -73894 80195 -28993 277351 21924 -140788 53717 -335478 -28538 -85356 -106127
6733 -106127 -101479 -147152 -109926 -603464 8653 -42010 -28106 261138 283000 254439 -152894
6721 43757 -97399 -173153 -82610 -302995 241315 -48274 -317064 -162693 101630 -46358 -19060
6709 254453 198634 -31542 3531 -8804 -203395 58367 -252729 79043 168776 -176930 81438
6697 -25650 -73362 303752 -280452 55296 222455 -276767 49134 -119026 -293912 366410
6686 90079 -150946 -39932 309769 335365 119904 267719 -122545 149803 -206936 -314376
6676 -314376 167365 -18275 -42866 217544 -196488 290765 35062 278796 -293468 -245222
6666 -245222 247740 201319 -449225 139497 -119252 -74001 90673 30629 -289823 257136
6655 104639 -202959 -37122 52582 184055 -21288 -221480 -64057 -259762 -244978 64732 -72312
6643 55588 -4945 50725 -343894 260091 172737 -138484 -127446 -148149 80317 -136174 143175
6631 151319 -182613 -133983 -68876 79995 23630 -344252 -320670 -199198 -260410 -153822 -360034
6620 -360034 28951 -79678 -180205 245969 -79709 302717 228873 92317 178847 88326 -380237
6608 -203382 134488 79547 -206063 -253516 1015 355926 45645 10614 133976 -269714 -11797
6596 -28242 -229820 125146 -235671 -135038 156005 -114789 198810 232160 69622 -2076 124346
6584 52680 167198 492814 -143719 -148262 195990 -147582 98475 151818 24835 -171910 -291646
6573 -291646 -202971 -3390 -311371 152736 265036 -78076 -311575 54845 -5170 -77751 12662
6561 -28376 -234325 45278 -3603 111256 -136892 70041 -178925 -62090 -81943 -42938 -212990
6550 -212990 251971 215004 -96883 -133124 -169505 114820 -341904 175548 11520 114701 -44028
6538 -11299 52562 -210645 171376 278886 -40071 179585 -157023 68333 -236400 238976
6527 127227 309563 -206073 216847 -24726 -75383 68927 81989 -42513 80034 -192665 -35055
6515 -311252 -113499 268321 -290042 -246341 -56209 -209486 -26608 5686 109725 -9323 -13347
6504 -13347 100406 48872 -242440 31453 19350 -25770 -99058 -209374 218476 194762 -18415
6492 -216735 -46085 8027 -2452 186926 -148333 242832 312899 43614 24441 -183211 164224
6480 74881 323001 -211972 128793 -41140 -180552 -88393 66478 166525 -422019 55451 -915
6468 96803 10638 6479 87986 -262581 333592 95806 -111926 90445 -125952 -116111 -268550
6457 -268550 -209451 -309174 30299 -342229 -56856 54077 -322906 -165920 5921 -35428 -499822
6446 -499822 -41001 -47093 -176096 300509 195653 -241751 148456 216922 -274124 45834 347901
6435 347901 26162 22931 311578 -20411 -15244 251426 374123 26786 -249034 311850 -191225
6423 -87130 17996 35919 -51492 207648 -172766 9032 -398170 28150 -11443 274803 -137575
6411 194606 20670 77992 130107 131431 277855 -294198 97769 28106 114251 -100729 184977
6399 -67781 60887 9813 154681 280597 27938 -240494 451099 -133156 141399 30237 -194698
6387 29795 -165679 85835 -60246 -81097 93415 -365837 -110406 131977 186753 -47251 112455
6375 -100945 168191 51805 -137542 67126 -43504 -58475 -155297 -81028 -63002 213121 -69675
6363 -117828 -222934 -80843 -162758 -50238 23617 38747 -244303 -51027 -190095 -198520 57026
6351 64499 98881 -197945 -253430 17557 66680 -333459 -141436 -32285 -185326 4642 192399
6340 192399 -134397 -41977 -137670 -297050 -108468 167267 -19476 -42153 -160859 -4510 -18358
6329 -18358 -140453 140157 93592 -203433 230360 -205824 -344085 169304 -120170 -317483
6319 -317483 -55300 -28897 -122006 285129 -144957 -11924 98081 -20197 -134184 49542 -37840
6307 72695 -99844 -220782 193039 184886 96629 -242174 179702 344063 -188664 221449 331057
6296 331057 252711 -154218 -198875 2007 21377 -7777 166978 -128242 175603 -152009 310019
6284 -107702 -169034 -18243 -17708 216719 280127 -24679 -14149 95552 79516 278787 -56468 56595
6271 -129668 1357 291228 47280 -165274 -82444 -49221 44619 24059 -230307 517947 -155604
6259 170044 309737 -106131 -50801 278326 125919 -117423 -35043 202334 240328 -300263
6248 -60700 -155980 -104283 493611 15630 -259644 69729 469332 198523 847 -341341 24135
6236 479919 -157464 -27830 -147564 64145 -153566 136053 -146023 -191536 -58727 -111446 478280
6224 176223 100729 -136919 -356033 255891 -274561 2089 114224 33491 2952 -31072 -100169
6213 -100169 5148 386679 87362 90669 205019 83684 -345786 62792 -101343 61965 -186380
6201 117913 147397 -187686 -52227 21234 202762 181948 -158095 -123783 -68677 60556 13330
6189 62602 -478582 47134 -342458 22583 -221667 122049 82947 109841 117689 -197482 -52697
6177 -242235 323948 -133705 -164372 327059 -48817 5937 -34990 153688 238647 171432 167361
6166 167361 -279176 120827 30696 -1596 -18075 127450 -26744 24458 -429324 -166815 48128
6154 103235 -156760 -223697 41989 143899 -75709 -170164 -94323 -5145 -61268 -91247 -91822 -134616
6142 -134616 -416552 28195 -77703 -73284 -525609 217213 -181456 72499 -12675 -42611 -179089
6131 -179089 148535 197264 -61009 194052 -218955 -193458 15467 204546 227714 182417 243941
6120 243941 -339884 -53209 100229 28559 -78366 -288215 -90540 127763 -275518 44182 108157
6109 108157 -5793 -327195 -88050 182445 -268475 67572 92121 -78852 13114 81056 -342275
6097 272447 25598 -95351 191204 -36756 120157 -12482 -46491 -146002 -11639 124132 -102112
6085 -98492 -120273 -171856 135815 122993 52653 -234295 -81976 -394048 118153 -165205 -220292
6074 -220292 -1444 283367 -67142 107487 27511 -192101 76151 -35872 116906 102712 81532
6063 81532 241856 10446 152899 -406301 -170940 -66559 461356 -276850 160293 183515
6053 183515 122915 23393 -66514 190513 -89993 -206688 -101046 -168298 26304 -100256 35366
6041 -184022 14365 55287 6541 -185046 6763 234997 6541 11100 -289734 72508 -127953 90221
6028 47597 97696 -102155 -155828 268607 -324010 -161126 -71873 -106323 28834 214544 -146487
6016 3702 52421 154364 66615 -76305 -4647 -6501 -46446 -225334 -2513 -259066 263380 -148525
6003 -202275 -140900 181844 54286 -343437 -147490 -201445 -110530 -116091 12313 75327 -214512
5991 -204706 31890 133643 81192 -97812 -281516 324330 49191 -22466 60584 25971 -225044
5979 14935 177771 -187985 197941 -75841 -37630 -8792 152529 266575 -18735 127358 200827
5968 200827 245001 362788 200794 -122465 104295 183299 16046 -20207 214878 104783
5957 -166271 10297 -31378 -83345 46496 8445 5656 -239872 400041 78930 -277202 -186060
5946 -186060 -174910 -41595 -156083 -119019 -122517 -98186 62147 -50534 -79914 203751 73020
5934 11522 6921 -139105 -603500 -316746 117260 -89595 -107063 -15073 68481 62128 243003
5923 243003 422649 -152494 -70785 -201439 -268252 36914 60554 -44645 297812 -272184 144301
5911 286233 -93001 321592 61568 43847 161166 -106297 -223718 -34828 -108715 74547 -132828
5899 -80455 -200702 70671 -122026 205196 8071 -134519 31051 282434 -532057 162950 227785
5888 227785 -231459 -15669 -72376 -208820 22904 -15803 -162847 -200411 -168769 -122971 -220022
5877 -220022 -180804 -406639 -5559 73510 55671 70356 268273 -161883 -160275 -181198 -111777
5866 -111777 69559 112273 -58875 -340313 -139660 219762 -230232 24789 192028 19307 -199577
5854 -220404 334915 24326 345974 -111278 214249 -35440 -280423 -191249 5146 6778 -19485
5842 -5035 387701 -116279 -293954 582 -86202 4421 -53644 -194435 175232 -416972 -127706
5830 238826 63677 -164612 32164 -164863 -172352 -235258 3572 -165911 33152 -208577 -144074
5819 -144074 202149 11299 -190530 -276817 -37563 297221 14960 -35250 49344 -372715 -104763
5807 -271149 -119535 57797 169895 -133540 210810 -266472 -257664 -201486 -115201 -236624 -304078
5796 -304078 -14978 -412907 304727 61781 77605 3452 159414 363334 57980 81529 379978
5785 379978 9902 69045 287414 -44302 52976 -142553 174915 87480 -310398 21733 68184
5774 68184 46766 226889 -53960 211596 -10728 15644 -41652 -275212 323806 233477 25799
5762 -109089 -68162 -131639 -284753 -62101 -319198 70957 152478 -169856 38507 -159903 -112328
5751 -112328 264504 171015 61309 9038 -189802 -52386 -47737 -34173 92786 150523 -100350
5739 -113036 -204817 -28873 -156835 -68810 -125428 -58508 76206 166281 -109078 -196271 -242283
5728 -242283 261876 -11394 46185 73334 -136723 -57719 228647 -235471 323538 -79912 8106
5716 -100099 -93288 73688 155561 -207275 -9159 53750 -157260 110245 -56896 -21455 309064
5704 386494 126409 182645 244962 436009 -188907 -23382 350140 -87530 180001 58483 -456345
5692 1723 108672 -256217 54249 51150 -173889 156896 83395 35022 -53461 -165389 90078
5680 220157 59822 -58266 91002 -141209 184444 -88380 288546 -73658 45404 -132364 -110982
5669 -110982 -20800 368383 440366 -24843 88364 -44149 -60245 92773 -106703 294533 -245514
5657 -72817 189053 254049 62197 23143 94619 -11378 86452 -123757 23415 53980 247533
5646 247533 202517 -86473 -186845 129816 275893 -252310 43227 -91024 -173357 299364 177221
5635 177221 -136275 -314334 -54348 162 269778 141543 -97968 16492 -92736 193231 -211768
5623 71018 -286263 270046 58301 150469 120199 70076 -66369 -61383 -11283 49987 -240692
5611 -186851 -225221 41890 140989 -7195 -33468 -32798 34527 -62939 -227342 180944 70799 -105446
5598 -59169 -9813 -304017 157190 79121 -82026 -91451 102247 -282667 12470 140184 338334
5587 338334 -5626 280657 103750 -226049 51106 164809 127394 135586 -13010 -242503 -234796
5576 -234796 191082 14535 166679 74250 -106138 258722 -23263 -57049 -7287 -270931 -131967
5564 -104373 18812 -112544 -77827 266457 -23197 -90537 26014 -43220 -214274 -148650 -198423
5553 -198423 -189512 131722 58633 -185276 148702 -67641 200396 -98785 170828 -283062 346323
5541 116874 305768 6322 -129460 293514 25389 -131094 49293 228715 -165160 -11088 163056
5529 -8956 -22557 -56922 -120831 -208590 229553 359908 -267396 -62189 -96742 353978 215648
5518 215648 2407 978 36990 91488 -190972 -84962 319071 -115637 -261462 142808 120316
5507 120316 -88804 2959 -188969 18471 111718 -3832 377380 -72522 -334235 14222 -330074
5495 -226988 -315333 -112179 191537 113804 74457 206278 -137572 295352 -64068 184136
5484 -288334 -195803 370210 -118405 167103 73294 -7008 -211453 57846 -224539 -26273 -89685
5473 -89685 -253222 144216 268660 197336 119079 -212578 -503216 124196 118106 5245 140446
5462 140446 -163329 -70878 11835 99992 -266929 291 -154158 116196 -238999 48144 -103968
5450 -66672 -379001 -39836 347450 208528 -130019 2820 56884 179745 -65603 136353 56402
5438 -23491 254231 -126794 -54731 83927 -136121 -306471 58165 -127691 -147036 316728 -57477
5426 -34173 -5079 -205026 14708 -286034 222757 -226344 -128869 141833 -20112 -518355 -59910
5414 366816 108989 225529 107932 244176 162051 -8252 -74420 51755 40835 -181191 -290912
5403 -290912 9113 -248732 114707 36340 360450 431928 76097 -306645 121173 28185 -27939
5391 -331591 13391 -63536 238931 9763 -124676 -124896 291277 -124701 83922 -53647 11684
5379 364078 61670 201182 -247110 -231667 174203 177262 -199520 123580 -130232 -64889 370471
5367 -15994 -65919 -175716 -155322 62893 -197023 -6955 -168503 174339 61650 531732 -188511
5355 9167 241173 65341 29142 131486 -145424 226231 -55081 233223 -70590 -224527 89675
5343 -249461 -4485 89407 -76082 48035 -20307 42113 115693 -59331 238770 -104962 -144978
5332 -144978 -23591 -219918 67433 -8026 -235684 342999 97255 282263 -123829 154153 188674
5321 188674 128315 278106 86013 -196440 -93188 -219426 -48255 114480 77202 207091 -123803
5309 81991 303510 225545 -129599 68548 53829 133370 -102367 -168045 -139719 158979 26287
5297 -12762 -155184 78556 127624 183806 -144076 121555 320842 139102 82670 -207161 124665
5285 -77453 30287 162700 -168983 -169949 90512 312400 -156314 -104415 465332 154389 264717
5274 264717 -78789 30547 88353 -277790 33523 -207707 -83474 298977 92400 -223618 -266971
5263 -266971 22098 -161537 98899 50155 126649 -160636 -274546 110654 -104001 -118523 -303193
5252 -303193 -66477 -121303 -197303 -291969 166614 21343 151677 137239 78018 -286813 -12749
5240 -448473 309049 -104725 76597 359655 -11103 3045 4940 -136038 -49801 170234 37951
5228 43925 123867 -135598 554915 -263507 125045 63752 -61065 -28470 39593 353391 64827
5216 315661 76206 257753 60403 -154896 -296075 -136862 66224 284264 131779 50498
5205 104501 396665 55884 82851 -87217 84633 -20519 -37252 -40534 -57600 144975 -224719
5193 207560 1908 103568 95130 13362 58847 -122105 147799 -353874 -264232 -110010 12550
5181 -35306 -3372 366991 363832 -10657 181192 173000 57450 -116771 415315 163023 -217899
5169 -188198 -415344 285147 51388 -75264 153651 -1563 -48926 -111232 161328 192381 49044
5157 11284 -101121 134175 97404 24267 -52580 211863 41141 -120413 9040 596528 12089
5145 -191843 -55756 8684 -224211 -52141 -224761 -76042 436311 195366 -90222 -201883 194798
5133 -124268 4832 154001 101753 -172866 -217354 -149037 106423 137308 10634 -102529 -120409
5122 -120409 -101779 87561 -148374 193659 122258 -194154 -18258 306501 149786 -6054 263088
5110 123839 260024 -161049 51931 -195295 -74425 -192968 77009 -291840 301544 -167421
5099 249039 57238 154048 -194446 235367 -93736 -345478 -70920 37961 -33115 -94638 29588
5087 -308294 -78211 -114966 -368378 -102613 173627 -22762 366997 -126893 81698 -76832 -34455
5075 -6874 -203984 -199612 -170988 -123940 -4933 -241482 -208602 -448337 58416 43841 167580 258071
5063 258071 -26348 -25366 148849 12593 -42033 78684 257678 -128193 153542 249908 -61157
5051 132046 -9577 -44432 131144 -64051 165761 -156550 -95832 106415 -74621 -194924 -160893
5040 -160893 -165075 123247 140748 317884 38953 -362580 110581 -374103 -159682 168204
5029 7617 -84579 -177757 358315 -97677 393762 121348 -147015 -159547 277158 -127975 -400113
5018 -400113 137518 -348734 -56508 20551 -64800 241178 80203 -73089 -50707 5066 42326
5007 42326 204723 183824 217071 104412 -156340 -66327 80322 -132213 -66384 503410 -103548
4995 -115515 314828 -230651 170698 94306 -82974 -323324 71404 291369 245354 104160
4984 -71103 82278 240770 -136518 10278 319724 -165410 -160446 -31606 -114403 450596 -171693
4972 -186545 72808 59027 146225 186837 -234336 -124859 140022 -237997 -68959 184561 -337090
4960 106378 83484 99981 89968 -66219 -64579 -2523 -109621 257215 109438 -295007 220340
4948 -34640 194918 -10016 -1390 -154343 61624 186003 351379 69468 -147009 189486 287021
4937 287021 97940 -11319 157879 139604 194127 85064 -93403 233008 406466 -105720 10078
4925 281847 -15327 242798 193458 -166664 -98733 295269 -330160 243273 -295117 -220738
4915 -220738 123497 -247318 346565 145122 69533 20140 236096 -256818 -57855 16533
4904 1698 -46318 57087 -142710 317706 -183443 -239263 280336 -12516 -40977 -133643 25546
4892 141427 127880 -45900 345166 136387 -155397 223673 6043 -284346 -26683 80253 191786
4881 191786 99549 -278410 -22586 -3528 -33690 -75609 177677 247749 100012 -81660 -53940
4870 -53940 -253060 -110380 -87732 212782 64703 140298 30345 -168221 -123868 7900 -28385
4858 2907 23486 173021 105954 82228 315107 -64933 58424 -213642 -88713 56732 156915
4847 156915 257740 -132499 -139591 -107358 -53909 -47637 -307072 -84003 -204028 247091 203829
4836 203829 194889 321078 -43786 -269907 -2863 -14862 136483 46263 27609 210931 -34775
4824 62242 178724 -28809 66348 -226095 -21130 -187251 -201839 18384 76158 180049 -3484
4812 -35103 -137576 336212 -148468 -363553 88301 -103330 -108020 -60487 149651 -40618 -112615
4801 -112615 -138134 142145 59688 92020 -299372 -102831 183731 -182101 83573 42976 -261539
4789 -297962 -95185 -201575 37323 288358 -88214 111780 -77879 183276 -123503 -133585 76906
4777 -68953 204351 150258 -178313 193373 79843 -70021 -287034 90635 147150 25005 -191208
4765 -167995 317472 -52710 -37529 44682 -96099 116351 197191 -95951 -317208 32205 177385
4754 177385 26596 -75016 209168 -102850 -22706 -40135 -366521 138817 9775 67643 -45048
4742 -85491 183373 -198923 -49672 -341780 -51889 -49544 6372 269557 102865 -82625 200759
4730 -86369 -54973 120794 56469 -279869 -4086 2658 22766 -190470 -20384 -90146 -84521 -28534
4717 76309 -309382 342891 -166696 -232258 141113 -348725 -80349 151241 116267 -203043
4706 -261647 309753 12287 -173852 -150739 255652 -158098 -14551 -247766 -140128 202536
4695 -109931 67319 -37450 145681 -431997 -60956 212152 12190 306568 250559 161264 -37907
4683 29071 21375 339562 -22098 180381 -84554 263470 -28211 -115878 -60448 218519 -25239
4671 -247924 193449 -12900 70897 -16864 202900 -11487 186669 24961 -235051 -122178 206889
4659 217852 -258467 -309084 -216112 214768 75944 -65497 166111 367550 -20962 354388 -8956
4647 -30471 -304851 107151 -118645 346415 138582 27917 -85876 -382001 109522 117061 -225593
4635 5077 195352 -124012 110440 -146587 -105517 181429 187182 114815 69655 3122 96406
4624 96406 169861 -43195 105264 91852 -94683 113448 21969 275875 -114663 -45649 276289
4612 -96276 -65268 216129 419550 -8457 126761 75325 -44842 -105677 18718 -82176 122756
4600 213131 -200355 -120572 126361 103057 -19942 10514 -238161 158122 -172874 -313539
4590 -313539 107109 69860 -180909 -29224 -93430 -44917 -152839 -50357 389388 -14263 119528
4578 142457 41890 367540 8883 24237 179034 -288617 5922 -15515 -88204 -31580 185932
4566 63969 -301570 4012 -44277 129488 91803 165647 41642 180716 82891 -318529 -172336
4555 -172336 73529 221571 154251 382432 -16104 93006 -172358 8016 -128772 -68230 394220
4543 -2522 -55653 162660 -107562 -113679 -298573 -167281 -60007 279007 12948 65846 130355
4532 130355 144991 154219 120501 -157631 177024 107090 108650 -66158 302256 -66412 64375
$$ [...]
##END NTUPLES=NMR SPECTRUM
##END=
