
##TITLE=UV1201_M3_1292-1211_7185378_DBZX67YYmX
##JCAMPDX= 6.0         $$ Bruker NMR JCAMP-DX V2.0
##DATA TYPE= NMR SPECTRUM
##DATA CLASS= NTUPLES
##ORIGIN= BRUKER
##OWNER= Administrator
$$ 1.72 TOPSPIN		Version 2.1
$$ 2012-12-06 01:59:16.862 -0500  Administrator@X
$$ Compression mode = diff/dup
##.OBSERVE FREQUENCY= 400.02188249412
##.OBSERVE NUCLEUS= ^1H
##.ACQUISITION MODE= SIMULTANEOUS (DQD)
##.ACQUISITION SCHEME= undefined
##.AVERAGES= 64
##.DIGITISER RES= 22
##SPECTROMETER/DATA SYSTEM= spect
##.PULSE SEQUENCE= noesygpps1d.comp
##.SOLVENT NAME= COFFEE_meoh
##.SHIFT REFERENCE= INTERNAL, COFFEE_meoh, 1, 14.96066
##AUDIT TRAIL= $$ (NUMBER, WHEN, WHO, WHERE, PROCESS, VERSION, WHAT)
$$ ##TITLE= Audit trail, TOPSPIN		Version 2.1
$$ ##JCAMPDX= 5.01
$$ ##ORIGIN= Bruker BioSpin GmbH
$$ ##OWNER= Administrator
$$ $$ E:\/data/COFFEE/nmr/UV1201_M3_1292-1211_7185378_DBZX67YYmX/12/pdata/1/auditp.txt
$$ ##AUDIT TRAIL=  $$ (NUMBER, WHEN, WHO, WHERE, PROCESS, VERSION, WHAT)
(   1,<2012-12-06 01:59:10.956 -0500>,<Administrator>,<X>,<go>,<TOPSPIN 2.1>,
      <created by zg
	started at 2012-12-06 01:47:41.097 -0500,
	POWCHK enabled, PULCHK disabled,
       configuration hash MD5:
       86 BA 57 50 F2 9D 5C 9B 26 00 A9 28 5F 66 2E 89
       data hash MD5: 64K
       EF 90 11 C8 F4 71 87 77 56 05 2D 52 CC 68 8D 3D>)
(   2,<2012-12-06 01:59:14.081 -0500>,<Administrator>,<X>,<proc1d>,<TOPSPIN 2.1>,
      <Start of raw data processing
       efp LB = 0.3 FT_mod = 6 PKNL = 1 PHC0 = 0 PHC1 = 0 SI = 128K 
       data hash MD5: 128K
       89 59 44 C5 AF 43 2D 3A A8 3A 78 4E 2A CB 01 F3>)
(   3,<2012-12-06 01:59:15.144 -0500>,<Administrator>,<X>,<proc1d>,<TOPSPIN 2.1>,
      <pk PHC0 = -77.65686 PHC1 = 0 
       data hash MD5: 128K
       49 69 E9 BB FF 55 B7 B6 C1 08 4C E5 5D D1 70 C2>)
(   4,<2012-12-06 01:59:15.831 -0500>,<Administrator>,<X>,<proc1d>,<TOPSPIN 2.1>,
      <abs ABSG = 1 
       data hash MD5: 128K
       4B 5F F5 A3 6C 61 A9 CE 23 19 70 D9 77 C0 9D 01>)
(   5,<2012-12-06 01:59:16.003 -0500>,<Administrator>,<X>,<proc1d>,<TOPSPIN 2.1>,
      <abs ABSG = 2 
       data hash MD5: 128K
       3F 65 EC 41 62 6B 9A 8A 10 04 6B 0C 25 D3 72 DC>)
(   6,<2012-12-06 01:59:16.159 -0500>,<Administrator>,<X>,<proc1d>,<TOPSPIN 2.1>,
      <abs ABSG = 3 
       data hash MD5: 128K
       99 BD 89 31 FC BB 93 E9 28 07 FB ED 9C 81 CC 40>)
(   7,<2012-12-06 01:59:16.331 -0500>,<Administrator>,<X>,<proc1d>,<TOPSPIN 2.1>,
      <abs ABSG = 4 
       data hash MD5: 128K
       F1 0E DD 39 30 67 33 83 72 E8 00 75 96 BB 2F 8E>)
(   8,<2012-12-06 01:59:16.519 -0500>,<Administrator>,<X>,<proc1d>,<TOPSPIN 2.1>,
      <abs ABSG = 5 
       data hash MD5: 128K
       9B 88 00 44 D6 A6 2E B5 22 CE 3E B1 CC 3E 77 F5>)
$$ ##END=
$$ 
$$ $$ hash MD5
$$ $$ BE FF 16 26 74 A1 91 13 A5 2E 02 61 D7 92 AE 1B
##$RELAX= 
##$RELAX= 
##$RELAX= 
##$RELAX= 
##$RELAX= 
##$RELAX= 
##$RELAX= 
##$RELAX= 
$$ Bruker specific parameters
$$ --------------------------
##$DU= <E:\>
##$EXPNO= 12
$$ [...]
##$TP07= 0
##$TPNAME0= <>
##$TPNAME1= <>
##$TPNAME2= <>
##$TPNAME3= <>
##$TPNAME4= <>
##$TPNAME5= <>
##$TPNAME6= <>
##$TPNAME7= <>
##$TPOAL= (0..7)
0.5 0.5 0.5 0.5 0.5 0.5 0.5 0.5
##$TPOFFS= (0..7)
0 0 0 0 0 0 0 0
##$TUNHIN= 0
##$TUNHOUT= 0
##$TUNXOUT= 0
##$USERA1= <user>
##$USERA2= <user>
##$USERA3= <user>
##$USERA4= <user>
##$USERA5= <user>
##$V9= 5
##$VALIST= <valist>
##$VCLIST= <CCCCCCCCCCCCCCC>
##$VD= 0
##$VDLIST= <DDDDDDDDDDDDDDD>
##$VPLIST= <PPPPPPPPPPPPPPP>
##$VTLIST= <TTTTTTTTTTTTTTT>
##$WBST= 1024
##$WBSW= 4
##$XGAIN= (0..3)
0 0 0 0
##$XL= 0
##$YL= 0
##$YMAX_a= 6083946
##$YMIN_a= -12609142
##$ZGOPTNS= <>
##$ZL1= 120
##$ZL2= 120
##$ZL3= 120
##$ZL4= 120
##$ABSF1= 14.96066
##$ABSF2= -5.597522
##$ABSG= 5
##$ABSL= 3
##$ALPHA= 0
##$AQORDER= 0
##$ASSFAC= 0
##$ASSFACI= 0
##$ASSFACX= 0
##$ASSWID= 0
##$AUNMP= <proc_prof1d_extract.lims>
##$AXLEFT= 0
##$AXNAME= <>
##$AXNUC= <1H>
##$AXRIGHT= 0
##$AXTYPE= 0
##$AXUNIT= <>
##$AZFE= 0.1
##$AZFW= 0.1
##$BCFW= 0
##$BC_mod= 0
##$BYTORDP= 0
##$COROFFS= 0
##$CY= 15
##$DATMOD= 1
##$DC= 0
##$DFILT= <>
##$DTYPP= 0
##$F1P= 0
##$F2P= 0
##$FCOR= 0.5
##$FTSIZE= 131072
##$FT_mod= 6
##$GAMMA= 0
##$GB= 0
##$INTBC= 1
##$INTSCL= 1
##$ISEN= 128
##$LB= 0.3
##$LEV0= 0
##$LPBIN= 0
##$MAXI= 10000
##$MC2= 0
##$MEAN= 0
##$ME_mod= 0
##$MI= 0
##$NCOEF= 0
##$NC_proc= -2
##$NLEV= 6
##$NOISF1= 0
##$NOISF2= 0
##$NSP= 0
##$NTH_PI= 0
##$NZP= 0
##$OFFSET= 14.96066
##$PC= 1
##$PHC0= -77.65686
##$PHC1= 0
##$PH_mod= 1
##$PKNL= yes
##$PPARMOD= 0
##$PPDIAG= 0
##$PPIPTYP= 0
##$PPMPNUM= 2147483647
##$PPRESOL= 1
##$PSCAL= 4
##$PSIGN= 0
##$PYNMP= <proc.py>
##$REVERSE= no
##$SF= 400.020009771531
##$SI= 131072
##$SIGF1= 0
##$SIGF2= 0
##$SINO= 400
##$SIOLD= 131072
##$SPECTYP= <>
##$SREGLST= <1H.CDCl3>
##$SSB= 0
##$STSI= 131072
##$STSR= 0
##$SW_p= 8223.68421052631
##$SYMM= 0
##$S_DEV= 0
##$TDeff= 65536
##$TDoff= 0
##$TI= <>
##$TILT= no
##$TM1= 0
##$TM2= 0
##$TOPLEV= 0
##$USERP1= <user>
##$USERP2= <user>
##$USERP3= <user>
##$USERP4= <user>
##$USERP5= <user>
##$WDW= 1
##$XDIM= 131072
##$YMAX_p= 393579452
##$YMIN_p= -11906
##$CURPLOT= <Network HP LaserJet P1505>
##$CURPRIN= <$Network HP LaserJet P1505>
##$DFORMAT= <normdp>
##$LAYOUT= <+/1D_H.xwp>
##$LFORMAT= <normlp>
##$PFORMAT= <normpl>
##$SURQMSG= 1
$$ End of Bruker specific parameters
$$ ---------------------------------
##NTUPLES= NMR SPECTRUM
##VAR_NAME=  FREQUENCY,     SPECTRUM/REAL,   SPECTRUM/IMAG
##SYMBOL=    X,             R,               I
##VAR_TYPE=  INDEPENDENT,   DEPENDENT,       DEPENDENT
##VAR_FORM=  AFFN,          ASDF,            ASDF
##VAR_DIM=   131072,        131072,          131072
##UNITS=     HZ,            ARBITRARY UNITS, ARBITRARY UNITS
##FACTOR=    0.0627417313425164, 1,          1
##FIRST=     8223.62146879497, 699,          -60686
##LAST=      0,             2059,            -61062
##MIN=       0,             -11906,          0
##MAX=       8223.62146879497, 393579452,    0
$$ Real data points
##PAGE= N=1
##DATA TABLE= (X++(R..R)), XYDATA
$$ [...]
65243 136864 137109 136488 135007 132730 130053 127634 125700 123769 121429 119193 118079 118388 119349 120036 120295 120595
65227 120595 121226 121948 122331 122222 121800 121322 120972 120934 121369 122133 122688 122574 121979 121531 121523 121657 121623 121475 121291 120884
65207 120884 120234 119840 120216 121227 122284 122943 122946 122019 120261 118584 118067 118794 119833 120396 120483 120365 120114 119859
65189 119859 119881 120137 120190 119931 119849 120149 120213 119555 118936 119716 122169 125127 127356 128708 129759 130833 131725 132077
65171 132077 131743 130923 130157 130042 130752 131900 132951 133693 134205 134551 134722 134842 135233 136213 137937 140414 143504
65154 143504 146777 149592 151627 153346 155633 158825 162390 165814 169501 174330 180446 187053 193602 200662
65140 200662 209219 219428 230489 241605 252605 263581 274322 284347 293345 301392 308789 315762
65128 315762 322287 328197 333344 337569 340503 341663 340977 339084 336838 334444 331291 326663 320472 313209
65114 313209 305384 297162 288503 279501 270565 262255 254894 248240 241561 234201 226176 218142 210716 203892
65100 203892 197282 190818 184914 179787 174966 169771 164173 158873 154549 151295 148725 146359 143883 141345
65086 141345 139167 137713 136884 136444 136645 137945 139940 141247 140938 139734 139202 139936 141058 141454 141002 140505
65070 140505 140749 141764 142805 142980 142059 140668 139627 139181 139004 138748 138318 137749 137164 136769 136613 136393 135829
65053 135829 135216 135265 136332 138026 139653 140844 141737 142726 143993 145125 145284 144059 142072 140453 139757 139687
65037 139687 139750 139729 139484 138802 137696 136501 135487 134572 133575 132499 131468 130574 129813 128909 127230 124361 120916
65020 120916 118312 117481 118129 119401 120796 122068 122761 122489 121544 120656 120190 119981 119911 120199 120993 122083 123193
65003 123193 124383 125956 128062 130500 132909 135144 137431 140071 142927 145370 146849 147479 147933 148788 150033
64988 150033 151137 151562 151289 150868 150861 151269 151711 152112 152877 154305 156237 158480 161159 164285 167268 169318 170194
64971 170194 170222 169679 168534 166739 164463 162033 159801 157966 156278 154138 151273 148160 145505 143523 142091
64956 142091 141264 141029 140686 139246 136624 133847 131869 130687 129813 129123 128854 129116 129784 130610 131212 131213 130685 130146
64938 130146 129859 129429 128441 127200 126424 126351 126619 126932 127370 127982 128500 128677 128686 128955 129731 130881 132039 132838 133085
64919 133085 132828 132354 132068 132201 132507 132324 131280 129908 129278 129840 130938 131708 132073 132459 132866 132905 132807 133665
64901 133665 136192 139589 142176 143151 143402 144528 147346 151424 155822 159980 163959 168085 172575 177407 182343
64886 182343 187035 191243 195073 198927 203128 207627 212115 216316 220048 223080 225148 226192 226435 226115 225196
64871 225196 223442 220734 217252 213320 209197 205093 201297 198128 195652 193616 191824 190475 189828 189522 188590
64856 188590 186417 183493 180881 179002 177246 174798 171539 167976 164543 161260 158020 154955 152383 150526
64842 150526 149350 148649 148152 147514 146371 144597 142600 141192 140944 141639 142448 142660 142228 141615 141284 141370 141742
64825 141742 142140 142240 141745 140650 139441 138838 139132 139824 140144 140005 140265 141890 144964 148670 152151 155154
64809 155154 157875 160515 163191 166131 169661 173945 178874 184197 189655 194934 199636 203464 206447 208902
64795 208902 211121 213113 214602 215195 214537 212487 209302 205610 202056 198918 196094 193423 190896 188594 186610
64780 186610 185040 183857 182809 181615 180336 179338 178775 178360 177797 177211 176942 177171 178017 179720 182259 184967
64764 184967 187155 189166 192240 197097 203084 209009 214347 219210 223589 227349 230878 235018 240124 245579
64750 245579 250453 254341 257377 259785 261744 263516 265317 267065 268492 269504 270211 270593 270341 269089 266700
64735 266700 263270 258990 254080 248696 242810 236325 229501 223172 218256 214930 212459 209984 207345 205030
64721 205030 203432 202455 201834 201542 201693 202209 202860 203581 204527 205798 207298 208947 210845 213063 215435 217742
64705 217742 220091 222835 226017 229003 230833 230956 229608 227501 225172 222595 219392 215381 210877 206352
64691 206352 201891 197195 192181 187337 183256 179983 177110 174495 172511 171524 171411 171804 172560 173717 175114
64676 175114 176406 177485 178664 180336 182582 185203 188030 191133 194708 198802 203212 207718 212425 217691
64662 217691 223593 229579 234831 238913 241895 243931 244947 244741 243199 240392 236690 232728 228975 225253
64648 225253 220980 216091 211439 208011 205893 204304 202581 200854 199707 199430 199797 200520 201775 204144 208029
64633 208029 213166 218850 224680 230931 238158 246523 255614 264824 273742 282164 289814 296121 300402 302336
64619 302336 302188 300389 296963 291610 284383 276003 267430 259317 251972 245449 239490 233721 228263 223863
64605 223863 220985 218985 216679 213724 210951 209227 208414 207639 206362 204944 204246 204770 206147 207501 208400
64590 208400 209264 210664 212450 214029 215366 217118 219662 222523 225085 227426 230064 233151 236252 238786
64576 238786 240381 241082 241599 243196 246814 252141 257789 262471 265888 268535 270945 273191 274926 275659 275005
64561 275005 272748 268756 262972 255583 247163 238555 230544 223529 217346 211417 205306 199288 194259 190949
64547 190949 189278 188542 188127 187889 187969 188447 189168 189846 190321 190788 191716 193424 195737 198053 199769 200682 200990
64530 200990 200834 199891 197681 194414 191188 188901 187191 185016 182209 179784 178547 178124 177712 177198 176992 177229
64514 177229 177712 178382 179261 180102 180615 180907 181285 181734 182109 182712 184168 186673 189765 192836 195570 197966 200276
64497 200276 202839 205741 208817 212231 216677 222485 228855 234620 239509 243981 248044 251145 253196 254813
64483 254813 256335 257383 257627 257259 256484 255246 253749 252484 251416 249838 247417 244720 242305 240008 237550
64468 237550 235121 232775 230002 226572 223269 221059 220095 220171 221502 224155 227262 229880 232331 235665 239922
64453 239922 243906 246664 248277 249150 249474 249523 249748 250332 251216 252616 254871 257762 260749 263946 268113 273541
64437 273541 279676 286030 292733 299970 307690 316241 326463 338723 352524 367610 384832 405426 429967
64424 429967 458589 491604 529281 571521 618480 671156 730659 797160 870155 949310 1034149
64413 1034149 1123035 1213312 1302547 1388951 1470649 1545395 1611380 1667675 1713411 1746980 1766575
64402 1766575 1771398 1762091 1740113 1706970 1663870 1611704 1551116 1482637 1406880 1324834 1238189 1149359
64390 1149359 1060986 975263 893704 817432 747450 684497 628732 579684 536578 498718 465632
64379 465632 436955 412304 391321 373665 358810 345966 334464 324171 315231 307401 300081 293035
64367 293035 286604 280956 275547 269754 263652 257701 251897 245875 239738 234138 229433 225337 221599 218508
64353 218508 216409 215081 214009 213029 212354 212098 212221 212884 214461 217000 219937 222618 225024 227755 231197
64338 231197 234834 237528 238458 237713 235973 233795 231311 228543 225776 223482 221886 220745 219639 218454 217431
64323 217431 216801 216544 216582 216900 217261 217103 216169 215090 214793 215336 215880 215942 216056 216847 218078 219152 220073 221132
64305 221132 221893 221338 219131 216093 213240 210849 208683 206582 204474 202156 199480 196621 193842 191054 187886
64290 187886 184235 180657 178195 177682 179035 181169 182882 183886 184841 186394 188506 190830 193360 196317 199607
64275 199607 202756 205476 207987 210697 213723 216873 220053 223555 227834 232972 238370 243042 246269 248008
64261 248008 248751 249004 248835 247860 245775 243021 240787 240150 241201 243135 245084 246591 247349 246877 244756 241053
64245 241053 236322 231226 226241 221526 216947 212291 207641 203502 200405 198360 196829 195349 194058 193491
64231 193491 193821 194513 194839 194623 194253 194094 194233 194769 195839 197138 197905 197792 197425 197627 198364 199017 199421 199905
64213 199905 200346 200031 198679 196885 195196 193368 191008 188442 186352 184915 183855 183104 182794 182702 182317 181527
64197 181527 180837 180773 181394 182430 183637 184863 185978 186912 187790 189068 191423 195286 200396 206128 212367 219708
64181 219708 228530 238276 248061 257583 266832 275122 281187 284301 284741 283049 279442 274127 267598 260261
64167 260261 252153 243401 234693 226927 220548 215397 211008 206889 202769 198764 195118 191689 188045 184258
64153 184258 181158 179398 178589 177825 176803 175935 175578 175799 176868 179278 182964 187036 190648 193824 197111
64138 197111 200651 203992 206701 208841 210824 212968 215143 216697 216844 215428 213290 211584 210602 209537 207518
64123 207518 204669 201952 200198 199640 200277 202188 205251 208899 212562 216293 220697 226249 232868 240116 247525
64108 247525 254676 261281 267451 273755 280795 288635 296664 303898 309467 313050 315084 316457 317901 319751
64094 319751 322343 326312 332164 339657 347896 355986 363329 369422 373831 376446 377316 376040 371761 364204
64080 364204 354496 344509 335298 326443 316931 306455 295768 285978 277676 270739 264853 259965 256089 252810
64066 252810 249428 245737 242361 240058 238973 238823 239530 241154 243350 245399 246885 248004 249180 250744 252949
64051 252949 255819 258872 261507 263779 266379 269671 273308 277073 281522 287289 294165 301430 308772 316421
64037 316421 324594 333387 342866 352651 361638 368857 374483 379241 382957 384571 383690 381146 377740 373385
64023 373385 367995 362345 357262 352593 347830 343322 339970 337925 336435 334896 333267 331447 329058 326032
64009 326032 322745 319297 315225 310210 304619 299050 293787 289048 285282 282711 280790 278676 276210 274073
63995 274073 272959 272876 273327 273908 274571 275433 276556 277976 279865 282451 285628 288817 291496 293970 297351 302557
63979 302557 309400 316789 323789 330380 337211 344762 352854 361041 369366 378431 388557 399220 409716
63966 409716 420226 431649 444394 457977 472047 487131 503892 522218 541758 563063 587387
63955 587387 615448 647175 682765 723128 769044 820770 879131 946423 1025350 1117252 1222010
63944 1222010 1339460 1470084 1614232 1771471 1940938 2121655 2312020 2509415 2710842
63935 2710842 2913576 3114693 3310228 3495382 3665515 3816561 3944781 4046965 4121155 4166633
63925 4166633 4182979 4169535 4126016 4053169 3952568 3826316 3677522 3510674 3330778 3142078
63915 3142078 2948028 2752343 2559327 2372861 2195494 2028626 1873093 1729315 1597405
63906 1597405 1477719 1371051 1277736 1196594 1125254 1061617 1004724 954210 909451 869592 834007
63895 834007 802235 773565 747214 723037 701593 683148 666848 651261 635702 620692 607144
63884 607144 595372 584996 575472 566565 558582 552321 548534 547202 547581 549250 552867 559438 569056 580830
63870 580830 594006 608491 624190 640525 657070 674229 692659 712235 732039 751282 769699
63859 769699 787022 802584 815747 826395 834774 841003 845003 846741 846243 843357 837731 829107 817608
63846 817608 803760 788318 771947 754804 736374 715963 693594 670262 647055 624136 600873
63835 600873 576945 552887 529431 506722 484580 463199 443084 424401 406888 390446 375349
63824 375349 361736 349315 337783 327138 317344 308064 299118 290887 283797 277597 271656 265901 260888
63811 260888 256800 252930 248494 243690 239561 236883 235429 234368 233159 231942 231072 230440 229548 228339 227590
63796 227590 228008 229020 229046 227176 224154 221352 219185 217023 214405 211692 209462 207839 206688 206016 205756
63781 205756 205416 204330 202334 199946 197898 196582 195851 195198 194214 193060 192361 192459 192876 192837 192228 191623 191343
63764 191343 190987 190122 189048 188473 188665 189326 190181 191245 192467 193516 194101 194319 194550 195112 196040 197049 197700
63747 197700 197755 197387 196921 196435 195865 195515 196090 197971 200615 202914 204197 204849 205959 208336 211799 215472
63731 215472 218788 221991 225407 228510 230297 230642 230774 232196 235498 240377 246250 252424 258078 262674 266322
63716 266322 269382 271932 273949 275678 277234 278095 277688 276415 275382 274923 274111 272024 268924 265773 263092
63701 263092 260853 259122 258120 257697 257293 256584 255816 255376 255286 255306 255385 255840 257096 259287 262133 265196 268250
63684 268250 271386 274765 278400 282203 286065 289760 292839 294776 295340 294835 293992 293529 293689 294162 294520 294687
63668 294687 294863 295175 295643 296510 298172 300579 302931 304264 304207 303047 301182 298791 295964 292882 289740 286560
63652 286560 283124 279174 274784 270508 266984 264340 262206 260274 258595 257244 256046 254883 253986 253673 253997
63637 253997 254836 256076 257506 258863 260318 262583 266118 270502 275056 279804 285198 291164 297174 303290
63623 303290 310317 318725 328103 337939 348266 359194 370430 381837 394058 407984 423833 441181
63611 441181 459714 479572 501121 524753 550732 578920 608800 639992 672419 705582 738033
63600 738033 768025 794427 816525 833317 843893 848547 848778 846005 840821 833654 825422 817019 808448
63587 808448 798919 787601 774016 757899 739070 717536 693627 668064 641837 615865 590683 566624
63575 566624 544247 524298 507175 492663 480320 469954 461638 455465 451403 449224 448567 449217 451304
63562 451304 454982 459943 465604 471832 479128 487988 498450 510317 523378 537234 551438 566214 582689
63549 582689 602015 624415 649405 676698 706585 739620 776229 816254 858391 900061 938130
63538 938130 969727 992508 1004964 1007279 1001779 991777 979801 967043 954127 941629 929825 918528
63526 918528 907356 895683 882316 865780 845226 820801 793064 762492 729702 695719 661622
63515 661622 628164 595867 565247 536690 510293 485997 463818 443916 426557 411847 399229
63504 399229 387444 375561 364080 354460 347403 342184 337837 334287 331856 330188 328387 325934 322944
63491 322944 319699 316468 313612 311297 309222 307149 305656 305711 307390 309599 311357 312894 315146 318516 322576
63476 322576 326819 331147 335562 339784 343434 346423 348842 350527 351002 349959 347551 344161 340134 335941
63462 335941 332236 329323 326701 323649 320233 317296 315430 314461 314007 313929 314020 313883 313580 313898 315414 317716
63446 317716 320140 322960 327099 332799 339374 346392 354434 364380 376453 390352 405966 423553 443354
63433 443354 465366 489530 515932 544550 574619 604236 630922 652882 669762 682124 690545 695657
63421 695657 698968 703015 710341 722379 739384 761153 787568 818426 852983 889918 927918 966054
63409 966054 1003204 1037182 1065121 1085172 1097482 1103208 1103077 1097501 1087631 1075345 1062118 1048502
63397 1048502 1034562 1020035 1003966 985038 962603 936834 907714 874720 838089 799699 761987
63386 761987 726256 692575 660939 631778 605329 581239 559105 539149 522111 508504 498067
63375 498067 489952 483446 478489 475431 474501 475695 478992 484228 490869 498415 507115 517765 530752 545850
63361 545850 563088 583091 606219 631986 659825 689870 722436 757257 793863 832184 871956
63350 871956 911761 949420 983243 1012330 1035964 1053554 1065112 1070995 1071198 1065716 1055723 1043477
63338 1043477 1030649 1017321 1002851 987090 970292 952365 932687 910391 884616 854946 821998
63327 821998 787306 752392 718281 686035 657049 632196 611103 592940 577757 566412 559220 555132
63315 555132 552178 548250 541572 531046 516563 498878 479136 458606 438603 420172 403724 389215
63303 389215 376597 365788 356334 347710 340064 334133 330128 327123 323916 320129 316102 312055 307967 304082
63289 304082 300877 298423 296311 294295 292526 290907 288838 286000 283004 280720 279257 278121 277141 276514 276033
63274 276033 275125 273878 273256 273850 275022 275837 276347 277268 278707 279994 280709 281164 281814 282821 284330 286551
63258 286551 289310 292027 294412 296788 299519 302525 305678 309221 313423 318100 322881 327693 332700 338106
63244 338106 344398 352393 362441 373805 385458 397405 410611 425634 441989 458932 476212 493806
63232 493806 511598 529775 549044 569833 591546 613134 634229 655152 675941 696058 715287
63221 715287 734291 753864 773879 793479 812217 830532 848946 867097 883869 898337 910261
63210 910261 919595 925813 927983 925359 917647 904800 886937 864620 839004 811506 783427 755909
63198 755909 730000 706437 685496 667305 652170 640299 631303 624403 619326 616688 617341 621523 628740
63185 628740 638183 649006 660417 671960 683798 696522 710603 726071 742641 759934 777567 795158
63173 795158 812344 828778 844193 858549 871956 884251 894701 902393 906924 908470 907105 902381
63161 902381 893737 881094 864772 844975 821728 795389 766995 737899 709084 680900 653419 626906
63149 626906 601871 578721 557523 538160 520595 504837 490815 478497 468059 459602 452677 446384
63137 446384 440128 434082 428732 424211 420278 416765 413763 411470 410094 409782 410383 411404 412505 413981 416366
63122 416366 419595 423008 426281 429877 434209 438733 442333 444576 446176 448256 451420 455577 460275 464976
63108 464976 469220 472821 475962 478995 482141 485403 488701 492027 495504 499291 503301 506932 509334 510159
63094 510159 510029 510011 510645 511645 512451 512747 512423 511504 510331 509498 509250 509221 509129 509474 511036 513810 516988 520050
63076 520050 523305 527242 531834 536789 542083 547904 554373 561659 570091 579821 590539 601845 613739
63063 613739 626534 640462 655716 672715 691979 713743 737899 764233 792649 823387 857161
63052 857161 894684 935766 979211 1023993 1070173 1118223 1167878 1218362 1269420 1321246 1373415
63041 1373415 1424786 1474687 1523511 1571905 1620016 1667825 1715553 1763240 1810326 1855947 1899261
63030 1899261 1939211 1974420 2003629 2025823 2039730 2043796 2037152 2020138 1993411 1957059 1911174 1856906
63018 1856906 1796380 1731934 1665983 1601152 1539581 1482136 1428993 1380880 1339060 1304193 1276019
63007 1276019 1254193 1238686 1229207 1225065 1225977 1232381 1244530 1261724 1282806 1306955 1333579 1361835
62995 1361835 1390785 1419882 1448970 1477938 1506656 1535062 1562992 1590042 1615752 1639771 1661593
62984 1661593 1680280 1694691 1703870 1707050 1703492 1692647 1674362 1648718 1615805 1575938 1530031 1479479
62972 1479479 1425673 1369788 1312941 1256300 1200996 1148063 1098366 1052370 1009931 970558 933973
62961 933973 900420 870412 844197 821363 800934 781958 764076 747418 731925 716983 701903
62950 701903 686558 671290 656389 641905 627859 614266 600997 587906 575141 563038 551703
62939 551703 540990 530964 521996 514182 506960 499605 492005 484754 478551 473696 470049 467221 464763 462375
62925 462375 460043 457923 456076 454369 452676 451072 449757 448791 447992 447213 446651 446682 447226 447458 446504 444430
62909 444430 442221 440653 439462 437888 435741 433536 431645 429832 427800 425801 424413 423824 423617 423243 422562
62894 422562 421923 421816 422434 423489 424492 425245 425987 426924 427756 427882 427029 425513 423850 422293 420836 419477
62878 419477 418358 417698 417686 418347 419429 420561 421562 422505 423340 423668 423173 422202 421582 421696 421984 421563 420228
62861 420228 418600 417371 416633 415993 415171 414339 413996 414657 416555 419436 422570 425130 426736 427666 428437 429236
62845 429236 429812 429946 429859 430058 430800 431856 432799 433406 433733 433903 433993 434076 434179 434166 433834 433238 432730 432494 432205 431484
62825 431484 430648 430629 431954 434076 435939 436982 437410 437777 438656 440472 443126 445866 448035 450064 453182 457960
62809 457960 463579 468844 473423 477708 481897 485909 490010 494788 500378 506288 512263 518918 527206 537502
62795 537502 549442 562368 575704 589159 603033 618308 636075 656768 680077 705666 733829
62784 733829 765362 801036 841396 887061 938839 997169 1061365 1129816 1201292 1275947 1354610
62773 1354610 1436936 1520565 1602277 1679713 1751675 1817000 1873661 1919134 1951450 1969841 1974543
62762 1974543 1966110 1944845 1910801 1864375 1806963 1741015 1669399 1594626 1518414 1441773 1365420
62751 1365420 1290282 1217629 1148689 1084110 1023912 967953 916304 869055 825873 785996 748840
62740 748840 714600 684111 657908 635390 615093 595956 578200 562754 549959 539160 529532 520842
62728 520842 513191 506439 500379 495312 491856 490122 489513 489581 490670 493296 497123 501035 504333 507559 511966
62713 511966 518399 526851 536949 548553 561802 576820 593686 612757 634817 660663 690517 723955
62701 723955 760490 800129 843390 890941 943228 1000133 1060750 1123641 1187640 1252351 1317679
62690 1317679 1382939 1446608 1506818 1561675 1609109 1646920 1673335 1687388 1688772 1677722 1655205
62679 1655205 1622756 1581709 1532773 1476719 1415230 1350630 1284875 1219199 1154576 1091933 1031815
62668 1031815 974358 919832 868850 821840 778676 739095 703196 671201 642910 617702 594973
62657 594973 574281 555172 537227 520450 505383 492648 482291 473572 465383 456917 448093 439410
62645 439410 431499 424748 419135 414257 409642 405308 401927 400106 399532 399205 398607 398200 398532 399281 399579 399045
62629 399045 398026 396953 395936 395048 394600 394937 396138 397946 399889 401500 402618 403515 404591 405993 407692
62614 407692 409789 412463 415718 419492 424007 429642 436428 443945 451824 460067 468920 478801 490382 504272
62600 504272 520369 537937 556552 576668 599038 623993 651619 682225 716055 752734 791457
62589 791457 831497 871988 911390 947868 980346 1008649 1032473 1050808 1062589 1067418 1065264 1055959
62577 1055959 1039536 1016835 989308 958231 924442 888663 851654 814031 776363 739557 704795
62566 704795 672915 643958 617445 592923 570201 549258 530136 512847 497257 483075 470064
62555 470064 458291 448131 439928 433608 428598 424183 419971 415961 412207 408572 404967 401702 399366 398317
62541 398317 398327 398728 398874 398598 398365 398881 400350 402176 403579 404462 405437 407048 409254 411730 414475 417973
62525 417973 422914 429740 438267 447719 457397 467500 479086 493141 509905 529263 551467 577096
62513 577096 606345 638665 673117 708938 745755 783413 821651 859826 896951 931891 963432
62502 963432 990207 1010935 1025068 1033032 1035588 1032981 1024921 1011378 993129 971553 948096 923960
62490 923960 900145 877624 857389 840211 826390 815964 809308 807243 810276 817903 829012 842958
62478 842958 859931 880337 904118 930723 959327 988955 1018563 1047108 1073396 1095973 1113513
62467 1113513 1125396 1131554 1131685 1125046 1111244 1090882 1065033 1034328 998991 959718 918052 875724
62455 875724 833807 792687 752765 714935 680257 649218 621509 596685 574826 556351 541284
62444 541284 529059 519044 510951 504670 500073 497184 496233 497210 499506 502266 505008 507797 510904 514432
62430 514432 518048 520911 522002 520772 517419 512433 506169 499043 491771 484850 477872 469882 460588 450825
62416 450825 441685 433509 425991 419000 412878 407989 404258 401301 398829 396760 395008 393337 391491 389380
62402 389380 387000 384281 381162 377855 374848 372513 370810 369478 368482 368151 368866 370633 372921 375010 376548
62387 376548 377764 379031 380347 381472 382477 383790 385650 387921 390583 394016 398490 403716 409276 415284
62373 415284 422165 429953 438220 446708 455626 465333 476118 488324 502384 518579 536990 557681 580736
62360 580736 606094 633724 664057 697972 736256 779215 826795 878675 934086 991833 1050779
62349 1050779 1109991 1168117 1222756 1270869 1310036 1339305 1358991 1369879 1372609 1367544 1354911 1335004
62337 1335004 1308308 1275501 1237411 1195005 1149492 1102462 1055761 1010953 968872 929793 894052
62326 894052 862190 834407 810174 788634 769195 751536 735329 720223 705905 691836 677167
62315 677167 661329 644526 627213 609348 590778 572140 554554 538392 523204 509065 497020
62304 497020 487630 479893 472365 464828 458050 452355 447379 443039 439699 437275 435075 432799 430975 430060
62290 430060 429770 429724 430197 431664 433916 436181 437951 439306 440629 442461 445425 449719 454698 459420 463647
62275 463647 467864 472317 476670 480857 485652 491856 499283 507147 515296 524459 535287 547714 561504
62262 561504 576956 594761 615456 639335 666734 698096 733844 774421 820302 871670 927984
62251 927984 988008 1050197 1112977 1174712 1233587 1287588 1334622 1372910 1401411 1419840 1428301 1427228
62239 1427228 1417701 1401252 1378745 1349679 1313106 1269156 1219249 1165000 1107708 1049058 991546
62228 991546 937574 888295 843639 803186 766704 734075 705217 680208 659290 642629 630012
62217 630012 620714 613729 608308 604241 601363 598950 596049 592524 589218 586792 584797 582251 578818 574967
62203 574967 571200 567555 563791 559652 554968 549818 544606 539790 535599 532145 529610 528047 527215 527004 527908
62188 527908 530598 534988 540175 545497 551263 558243 566662 576000 585660 595467 605461 615407 624777 633251
62174 633251 641034 648528 655865 663070 670663 679723 691272 705906 724163 746755 774042 805579 840603
62161 840603 878787 920085 963882 1008665 1052464 1093308 1129432 1159574 1183203 1200137 1209972 1212252
62149 1212252 1207220 1195871 1179117 1157232 1130399 1099459 1065809 1030628 994421 957342 919904
62138 919904 883411 849587 819687 793986 772177 754012 739287 727521 718208 711354 707194 705256
62126 705256 704250 703182 702257 702474 704635 708946 715157 722623 730343 737286 742736 746284 747778 747481 745996
62111 745996 743762 740816 737320 734012 731605 729723 726933 722023 714998 706665 697599 687957 678206 669487
62097 669487 662857 658396 655480 653903 654216 656785 661027 666010 671446 677568 684324 691370 698783 707035
62083 707035 716103 725316 734345 743768 754327 766132 778956 792819 807805 823704 840363 858046
62071 858046 876983 896837 917085 937681 958784 980124 1001263 1022451 1044630 1068568 1094383
62060 1094383 1121876 1150792 1180676 1210757 1239996 1266959 1289837 1307066 1317916 1322196 1319667 1310398
62048 1310398 1295466 1276413 1253821 1227078 1195648 1159932 1120698 1078519 1034235 989266 944863
62037 944863 901487 859338 819025 781187 745890 713026 682916 655881 631525 609122 588484
62026 588484 569804 552916 537537 524090 513351 505089 497905 490680 483479 476690 470030 463020 455911
62013 455911 449491 444231 440122 437093 435004 433429 431998 430936 430791 431727 433549 436395 440741 446520 452805
61998 452805 458745 464499 470813 477832 484710 490374 494374 496977 498710 499970 500925 501517 501465 500292 497516
61983 497516 492937 486830 479786 472353 464816 457254 449704 442224 434862 427687 420841 414587 409238 404905
61969 404905 401248 397648 393795 390040 386883 384173 381137 377352 373366 370128 368057 366929 366420 366346 366462
61954 366462 366529 366686 367386 368839 370795 373102 376183 380618 386413 392966 399757 406797 414433 422982 432643
61939 432643 443506 455449 468095 481135 494635 508857 523682 538410 552360 565554 578556
61928 578556 591601 604146 615398 624989 632901 638983 642996 645046 645514 644444 641481 636633 630690 624479
61914 624479 617971 610585 602417 594793 589544 587860 589769 594376 600642 608237 617752 629766 643602 657322
61900 657322 669210 679009 687445 694775 700268 703088 703097 700502 695131 686651 675529 663222 651070 639232
61886 639232 627066 614410 602039 590781 580648 571117 561936 553314 545430 538188 531411 524899 518247
61873 518247 510914 502728 494173 486124 479425 474663 471970 470821 470265 469698 469391 470152 472547 476594 481992
61858 481992 488381 495475 503278 512251 523049 535939 550628 566761 584435 604008 625441 648048
61846 648048 671089 694523 718916 744427 770017 793910 814851 832661 847557 859239 866874 869789
61834 869789 867973 862108 853425 843343 832837 822121 811255 801053 793043 788437 787412 789453 794025
61821 794025 800746 809237 819119 829886 840462 849090 854033 854473 850518 842501 830562 814868 795848
61808 795848 774044 749987 724339 698033 672003 646771 622397 598924 576877 557195 540486
61797 540486 526342 513628 501478 489849 479055 469189 460300 452812 447203 443307 440376 437823 435568
61784 435568 433632 431860 430156 428579 427022 425168 422906 420486 418110 415824 413986 413277 413767 414426 414182
61769 414182 413183 412374 412018 411430 410276 409347 409577 410764 411747 411691 410882 410332 410831 412326 414130 415737 417397
61752 417397 419646 422285 424277 424872 424571 424566 425369 426334 426476 425415 423509 421408 419627 418331 417277 415991
61736 415991 414125 411706 409089 406729 405011 404117 403993 404417 405185 406250 407719 409707 412114 414551 416568
61721 416568 418069 419417 421022 422903 424842 426916 429574 433030 436726 439666 441265 441770 441873 442039 442190
61706 442190 441850 440533 438202 435433 432970 431002 428965 426286 423146 420255 417902 415576 412669 409247
61692 409247 405888 402940 400256 397612 395025 392543 389962 386996 383647 380230 376989 373886 370779 367699
61678 367699 364774 362000 359314 356899 355146 354134 353392 352417 351263 350260 349302 347901 346039 344467 343822
61663 343822 343802 343576 342868 342312 342778 344521 346923 348925 349881 350127 350529 351405 352263 352805 353688 355738 358675
61646 358675 361242 362500 362540 362026 361665 362111 363723 366201 368888 371576 374605 378078 381489 384287 386289
61631 386289 387323 387028 385379 383005 380586 378271 375927 373517 370878 367588 363584 359611 356503 354291
61617 354291 352561 351393 351225 351818 352111 351366 349951 348692 347805 346727 344773 341606 337198 331699 325533
61602 325533 319500 314464 310714 307680 304573 301309 298473 296331 294268 291486 287972 284409 281351 278851
61588 278851 276722 274807 272985 271154 269225 267009 264355 261592 259566 258859 259054 259026 257879 255448 252276
61573 252276 249423 247916 247828 248070 247619 246748 246475 246986 247391 247085 246607 246859 247999 249448 250616 251398 252235
61556 252235 253769 256133 258521 259790 259613 258666 257779 257419 257934 259493 261524 262962 263531 264184 265747 267667
61540 267667 268799 269056 269499 270928 273013 274847 275802 275757 274972 273954 273222 273044 273389 274034 274608 274790 274709 274972
61522 274972 275938 277083 277414 276484 274720 272849 271353 270433 270076 269974 269698 269115 268482 268039 267684 267231 266850
61505 266850 266995 267830 268890 269419 269070 268126 266996 265691 264012 262123 260553 259601 259046 258624 258512 259110 260561
61488 260561 262658 265032 267199 268597 268911 268357 267503 266833 266558 266663 266946 267127 267072 266916 266941 267483 268906 271288
61470 271288 274017 276060 276919 277063 277240 277708 278388 279282 280226 280576 279785 278189 276688 275749 275218 275043 275503
61453 275503 276640 277989 279062 279677 279697 278990 277850 277083 277334 278559 280278 282033 283453 284322 284898 285900
61437 285900 287823 290435 293181 295850 298565 301402 304379 307678 311456 315417 318928 321633 323680 325252
61423 325252 326194 326354 326071 326033 326585 327468 328360 329440 331141 333406 335579 337157 338359 339686 341150 342254
61407 342254 342674 342596 342360 342025 341375 340169 338280 335790 333000 330270 327801 325619 323653 321720 319539 317059
61391 317059 314686 312943 311917 311324 311045 311217 311776 312321 312636 313015 313810 314869 315660 315836 315536 315228 315354
61374 315354 316017 316945 317876 318972 320639 322944 325454 327648 329196 329822 329403 328393 327758 328173 329542 331497
61358 331497 333910 336580 338824 340018 340468 341289 343400 346912 351457 356727 362710 369582 377324 385233 392043
61343 392043 396964 400568 404260 408853 413956 418659 422494 425669 428815 432556 436999 441494 445212 447972
61329 447972 450203 452094 453308 453682 453652 453605 453238 452077 450368 448888 447967 447245 446499 446222 447138 449394 452465
61312 452465 455734 459006 462581 467002 472696 479685 487600 495967 504494 513143 522087 531568 541595 551627
61298 551627 560705 568083 573645 577559 579636 579420 576922 572868 567926 561969 554470 545536 536126 527164
61284 527164 518780 510537 502120 493631 485448 478066 471882 466877 462575 458577 455088 452730 451911 452510 454106
61269 454106 456232 458541 461024 464071 467970 472341 476401 479841 483093 486608 490339 494250 498932 505127
61255 505127 512699 520556 527637 533638 538745 543069 546596 549418 551741 553811 555953 558431 561009 562861
61241 562861 563326 562763 562288 562554 563095 563015 562048 560652 559266 557793 555850 553300 550450 547878 546084 545207
61225 545207 545012 545234 545919 547386 549925 553645 558473 564092 569955 575673 581414 587664 594524 601479 607893
61210 607893 613478 618243 622361 626222 630214 634194 637498 639751 641382 643067 645047 647348 650246 653953
61196 653953 658141 662452 667286 673468 681248 690301 700522 711831 723169 732831 740244 746467 752310
61183 752310 756895 758926 758630 757363 755758 753493 750706 748350 746830 745279 742698 739169 735455 731922
61169 731922 728322 724374 720078 715555 710771 705423 699159 692137 685140 678641 671883 663611 653850 644167
61155 644167 635864 628617 621365 613835 606476 599392 592270 585251 579157 574749 572179 571067 570591 569581
61141 569581 567099 563068 557975 552006 544977 537146 529560 523334 518844 515711 513301 511169 509324 508217
61127 508217 508294 509578 511898 515409 520458 526983 534482 542667 551681 561647 572552 584731 598860 615103
61113 615103 632756 651140 670441 691144 712990 735123 757095 779121 801263 822946 843439
61102 843439 862525 880490 897695 914200 929524 942602 952200 957706 959497 958428 954914 948618 939034
61089 939034 926326 911510 895836 880013 864035 847559 830341 812370 793814 774940 756059
61078 756059 737588 720156 704360 690197 676927 663857 651193 639741 629832 621044 613010 605991
61066 605991 600432 596425 593835 592534 592219 592452 593248 595210 598672 603100 607814 612944 619039 626064 633527
61051 633527 641496 650706 661545 673585 686366 700091 715212 731787 749631 768848 789768 812464
61039 812464 836661 862225 889635 919832 953512 990513 1030008 1071364 1114721 1160631 1209386
61028 1209386 1260849 1314693 1370467 1427713 1486486 1547779 1613080 1683541 1759988 1843656 1936394
61017 1936394 2039902 2155101 2282501 2423249 2580105 2757968 2963968 3207488 3500636
61008 3500636 3858803 4300038 4843096 5506027 6306027 7258283 8372834 9653838 11104483
60999 11104483 12728936 14515747 16403070 18254406 19879576 21102706 21836298 22112891
60991 22112891 22061423 21854742 21659052 21592390 21686427 21861383 21940572 21715741 21034845 19862203
60981 19862203 18280999 16448370 14536573 12688293 10996451 9505329 8223567 7138908
60973 7138908 6228901 5467772 4831372 4299741 3856400 3486278 3175258 2911325 2685167
60964 2685167 2489529 2318620 2168032 2034531 1915702 1810009 1716805 1635547 1564973 1503447
60954 1503447 1449920 1403926 1364807 1331577 1303440 1279714 1259265 1240894 1224460 1210957 1201230
60943 1201230 1195183 1192329 1192382 1194859 1198786 1203420 1208885 1215578 1223148 1230523 1236776 1241548 1244607 1245435 1243420
60928 1243420 1238347 1230604 1220783 1208994 1194589 1176748 1155348 1131132 1105131 1078137 1050606 1022614
60916 1022614 993762 963609 932530 901952 873443 847573 823793 801300 779803 759527 740720
60905 740720 723385 707539 693470 681383 670771 660590 650370 640876 633261 627847 624121 621665
60893 621665 620382 619850 619155 617655 615462 612952 610177 606909 602906 597954 592024 585498 578911 572287 565122
60878 565122 557215 549118 541546 534721 528468 522581 516838 511097 505663 501181 497788 494736 491254 487433
60864 487433 483866 480692 477476 473837 469756 465450 461408 458306 456366 454857 452749 449811 446620 443580
60850 443580 440525 437374 434554 432430 430694 428665 426018 422930 419691 416438 413277 410412 407998 405833
60836 405833 403322 399956 395903 391933 388599 385649 382450 378854 375304 372215 369658 367732 366823 367198 368596
60821 368596 370481 372612 375113 378006 380909 383323 385129 386678 388341 390099 391672 393017 394433 396038
60807 396038 397361 397709 396930 395575 394307 393370 392677 392109 391545 390744 389466 387695 385651 383514 381272 378841
60791 378841 376205 373358 370187 366635 363025 360035 358060 356584 354407 350669 345607 340309 335885 332937
60777 332937 331516 331192 331150 330580 329280 327827 326983 326967 327363 327731 328131 328988 330534 332524 334499 336268 338079
60760 338079 340304 342916 345293 346667 346889 346658 346822 347531 348306 348901 349752 351433 354023 357209 360727 364434
60744 364434 368168 371851 375505 378851 381134 381738 380754 378537 374977 369874 363825 357921 352433 346619 340108
60729 340108 333704 328307 323725 319206 314742 311048 308403 306209 303764 300989 298336 296322 295225 294887
60715 294887 294724 294139 292997 291566 290108 288693 287380 286246 285205 284012 282575 281202 280467 280714 281665
60700 281665 282604 283090 283359 283786 284222 284351 284589 285888 288490 291589 294544 297633 301043 303872 305112 305236
60684 305236 305864 307926 310967 314269 317813 321972 326921 332630 338908 345214 350835 355515 359616 363553
60670 363553 367373 370928 374069 376529 378001 378444 378089 377063 375282 372689 369324 365281 361003 357428 355216
60655 355216 353791 351805 348697 345226 342358 340373 339301 339460 340901 342822 344194 344763 344964 345093 345049 344730
60639 344730 344156 343200 341554 339056 335846 332242 328550 324923 321359 317971 315233 313661 313180 313151 313137 313227
60623 313227 313462 313492 313182 313136 314068 315877 317788 319214 320081 320496 320637 320903 321706 322984 324208 324926 325112 325020
60605 325020 324864 324662 324311 323907 323970 325036 326899 328648 329741 330639 332014 333748 335248 336461 337848 339453
60589 339453 340663 341005 340641 339987 339299 338796 338717 339079 339660 340337 341193 342236 343414 344929 347123 349903 352703
60572 352703 355240 357972 361589 366384 372378 379707 388561 398858 410190 421901 433044 442506 449554
60559 449554 454166 456630 456903 454686 450075 443931 437536 431864 427114 422910 419125 416493 416114 418274 422098
60544 422098 426639 431921 438506 446375 454958 464270 475293 488817 504272 520116 535208 549379 562689
60531 562689 574528 583676 589149 590776 589030 584519 577871 569994 562045 554784 548070 541309 534421 528056
60517 528056 522769 518414 514631 511584 509731 509032 508859 508748 508813 509363 510636 513130 517738 525155 535400
60502 535400 548324 564250 583661 606457 632087 660409 691865 726698 764412 804019 844334
60491 844334 883878 921094 954953 984917 1009984 1028227 1037800 1038173 1029908 1013574 989502 958553
60479 958553 922420 882983 841712 799822 758527 718830 681243 645966 613258 583546 557207
60468 557207 534291 514368 496697 480695 466280 453641 442755 433299 424967 417553 410711 403993
60456 403993 397313 391172 386208 382618 380063 377998 375962 373737 371403 369166 366996 364545 361522 358088
60442 358088 354760 351980 349829 348086 346432 344658 342914 341768 341845 343198 345018 346200 346361 346244 346872
60427 346872 348325 349633 349957 349537 349165 349050 348691 347799 346805 346328 346582 347409 348530 349504 349909 349905 350358 351906
60409 351906 354057 355634 356068 355899 355980 356605 357507 358412 359287 360217 361257 362440 363857 365709 368190 371204
60393 371204 374268 376892 379073 381215 383523 385738 387604 389346 391386 393764 396130 398244 400178 401968
60379 401968 403451 404606 405815 407538 409819 412325 414771 417118 419420 421745 424248 427127 430409 433866
60365 433866 437088 439534 440694 440624 440305 441040 443237 446107 448811 451501 454866 458994 463375 467982 473673
60350 473673 481253 490585 500929 511701 522474 532498 540817 546931 550933 552925 552610 549602 543912
60337 543912 535936 526248 515698 505502 496821 490116 485078 481203 478113 475283 471967 467803 463320 459362
60323 459362 456023 452585 448598 444607 441605 440060 439723 440094 440763 441535 442619 444682 448433 454121 461601
60308 461601 470768 481709 494593 509709 527469 547900 570073 592350 613238 631700 646615 656474
60296 656474 659958 656597 646690 630917 610418 587028 562898 539665 518118 498649 481762 467996
60284 467996 457507 449898 444415 440253 436739 433503 430622 428509 427466 427290 427381 427234 426676 425630 423892
60269 423892 421284 417911 414181 410690 408078 406646 405927 404918 403051 400707 398546 396654 394765 393023
60255 393023 391859 391222 390556 389685 389169 389594 390909 392629 394334 395828 397143 398480 399814 400649 400696 400730 401989
60238 401989 404463 406639 407392 407368 407818 408784 409414 409599 410152 411338 412291 412280 411809 411970 413140 414763 416188
60221 416188 417295 418292 419165 419594 419493 419494 420518 422766 425555 428442 431999 436884 442473 447208 450320 452573
60205 452573 455198 458711 462980 467797 472960 478197 483440 488973 494999 501168 506784 511390 515085 518384
60191 518384 521823 525502 528943 531613 533572 535338 537080 538335 538653 538109 536958 535134 532418 528841 524652
60176 524652 520063 515263 510503 505881 501225 496438 491842 487903 484686 481767 478669 475285 471940 469169
60162 469169 467239 465795 464139 462014 459935 458571 457996 457779 457684 458007 459227 461418 463976 465979 467056
60147 467056 467871 469386 471595 473484 474415 474926 475771 476800 477564 478535 480776 484462 488669 492806 497370 502890
60131 502890 508848 514226 518674 522606 526377 529890 532847 534953 535946 535830 535165 534862 535568 537226 539152
60116 539152 540516 541025 541285 542316 544559 547542 550702 554140 558175 562365 565558 566985 566932 566232 565434 564613
60100 564613 563675 562537 561122 559405 557455 555357 553122 550736 548265 545870 543805 542378 541787 541931 542488
60085 542488 543178 543835 544230 544058 543272 542192 541140 540051 538638 536885 535086 533400 531590 529292 526434
60070 526434 523269 520112 517100 514178 511187 507935 504232 499942 495066 489778 484292 478678 472929 467261
60056 467261 462157 457867 453965 449719 445021 440680 437622 435985 435230 435028 435665 437437 439944 442295 444042
60041 444042 445659 447914 450906 453956 456509 458799 461426 464483 467497 470239 473138 476641 480377 483269
60027 483269 484466 484014 482693 481273 479916 478101 475140 470805 465457 459663 453905 448642 444243 440538
60013 440538 436729 432134 426938 421850 417109 412297 407186 402297 398337 395354 392721 389844 386715 383847
59999 383847 381809 380777 380402 380148 379699 379018 378189 377418 377127 377704 379120 381064 383442 386396 389769 392975
59983 392975 395614 397859 399965 401767 402964 403644 404153 404633 405007 405272 405463 405480 405200 404628 403673 402038 399686
59966 399686 397199 395256 393936 392994 392591 393090 394180 394871 394547 393457 392079 390565 389085 388127 388030 388545
59950 388545 389202 389759 390026 389719 388945 388545 389367 391349 393627 395407 396334 396298 395525 394818 395087 396409 397874
59933 397874 398530 398214 397436 396781 396620 397120 398205 399575 400924 402173 403520 405356 408060 411709 415990 420544
59917 420544 425393 430839 436989 443627 450521 457458 463882 468923 472125 473892 474851 474971 473753 471292 468618
59902 468618 466739 465644 464576 463083 461410 459888 458439 456903 455531 454694 454267 453802 453432 454080 456457
59887 456457 460072 463687 466636 469379 472820 477434 483123 489491 496005 502096 507445 512208 516873 521836
59873 521836 526994 531672 535033 536767 537359 537503 537257 536047 533491 529887 525817 521633 517550 513941 511174
59858 511174 509317 508247 507916 508284 509210 510779 513547 518056 524115 530950 538007 545133 551874 557167 560084
59843 560084 560668 559741 558122 556322 554724 553594 552840 551974 550401 547613 543268 537345 530264 522636 514886
59828 514886 507311 500450 495046 491440 489207 487646 486463 485754 485368 484671 483153 481126 479540 479033 479343
59813 479343 479735 479857 479916 480073 480027 479426 478475 477753 477413 476828 475157 472128 468190 464099 460437 457360 454627
59796 454627 451966 449446 447377 445710 443819 441101 437724 434511 432177 430898 430456 430415 430186 429355 428152
59781 428152 427244 426886 426628 426039 425364 425043 424951 424642 424195 424212 424891 425689 426153 426631 427805 429816 432217 434588
59763 434588 436804 438756 440270 441409 442535 443882 445238 446235 446867 447573 448817 450692 452961 455411 458077
59748 458077 461130 464591 468240 471831 475330 478893 482616 486348 489775 492676 495122 497412 499772 502105
59734 502105 504071 505417 506216 506778 507388 508145 508920 509454 509586 509517 509734 510515 511490 511846 511018 509112 506650 504066
59716 504066 501591 499484 498103 497633 497909 498591 499414 500134 500379 499850 498721 497565 496721 495947 494919 493934 493806
59699 493806 495070 497506 500450 503317 505764 507625 508893 509771 510712 512351 515149 518769 521919 523280 522757
59684 522757 521517 520618 519996 518991 517485 516071 515284 515060 514862 513975 511820 508352 504207 500176 496507 492925
59668 492925 489194 485364 481573 478001 474981 472765 471107 469494 467838 466560 465848 465267 464312 463048 461987
59653 461987 461638 462370 464381 467465 471037 474650 478288 481900 484913 486681 487259 487331 487371 487212 486457 484943
59637 484943 482693 479708 476047 472060 468394 465696 464202 463558 463130 462572 462053 461889 462150 462671 463193 463269 462310
59620 462310 460122 457307 454772 452826 451019 448834 446195 443303 440383 437701 435471 433559 431581 429510
59606 429510 427945 427560 428481 430439 433230 436594 439781 441785 442232 441730 441175 440892 440706 440609 440959 441989 443446
59589 443446 444887 446156 447335 448378 449050 449211 448937 448350 447521 446561 445518 444075 441680 438279 434742 432200
59573 432200 430935 430129 428715 426291 423249 420262 417768 415833 414336 413286 412863 413171 414065 415270 416563
59558 416563 417709 418434 418699 418822 419094 419413 419649 420199 421700 424168 426885 429254 431338 433411 435540 437993
59542 437993 441593 447063 454152 461958 470143 479437 490896 504922 520973 537705 553149 565054 571568
59529 571568 571879 566378 556470 544268 532087 521762 514171 509331 506872 506377 507392 509319 511441 513121
59515 513121 514072 514512 514993 515859 516764 516843 515498 512965 509963 506811 503147 498558 493172 487370 481166 474373
59499 474373 467382 461326 457136 454614 452660 450313 447390 444302 441570 439507 438085 436960 435819 434798
59485 434798 434444 435134 436615 438261 439743 441295 443299 445820 448701 451938 455680 459868 464229 468768 473923
59470 473923 479860 485778 490373 493079 494518 495630 496712 497531 498042 498582 499436 500522 501616 502710 504089
59455 504089 506136 509084 512888 517330 522265 527792 534197 541715 550270 559345 568182 576288 583704 590537
59441 590537 596203 599476 599479 596458 591438 585341 578637 571604 564544 557682 551039 544486 537935 531580 525948
59426 525948 521473 518007 515084 512825 512137 513688 517120 521794 527969 536563 547922 561588 577328 595588
59412 595588 616692 640287 665888 693160 720886 746100 765084 775418 776884 770855 759589 746010
59400 746010 733164 723204 716998 714789 716656 721749 727277 729058 723656 710233 690427 666827 641772
59387 641772 617267 595140 576588 561601 549266 538773 529915 522729 517081 512793 509856 508240 507749
59374 507749 508272 509930 512685 516049 519501 523005 526740 530484 533778 536636 539629 543137 546959 550788
59360 550788 554712 558991 563622 568355 572924 577150 581067 585189 590374 597036 604629 612230 619575 627210
59346 627210 635640 644695 653918 663376 673816 685897 699267 712475 723990 733387 741453 749045 756010
59333 756010 761363 764298 764773 763254 760252 756101 750811 744026 735418 725260 714388 703481 692652
59320 692652 681844 671271 661186 651509 642163 633582 626415 620742 616090 612305 609910 609349 610369 612528
59306 612528 615965 621058 627498 634389 641444 649509 659411 670481 680437 686632 687282 681964 671596 657985
59292 657985 642903 627204 610933 594347 578523 564727 553345 543740 535133 527404 521014 516313
59280 516313 513126 510952 509432 508557 508418 508939 510032 511918 515006 519365 524615 530547 537524 545914 555340
59265 555340 564990 574595 584493 594593 603886 611410 617290 622271 626396 628711 628314 625251 620258 614015
59251 614015 606910 599297 591741 585003 579767 576149 573378 570192 565797 560483 555241 550981 548197 547097
59237 547097 547621 549291 551370 553363 555251 557194 559227 561461 564315 568205 572961 577861 582347 586411
59223 586411 590122 593104 594821 595197 594567 593102 590782 587922 585170 582726 579955 576194 571662 567207 563359
59208 563359 560010 556859 553756 550633 547515 544654 542385 540783 539608 538519 537124 535065 532405 529786
59194 529786 527742 525981 523874 521540 519797 518966 518498 518042 518132 519298 521094 522640 523713 524633 525409 525792
59178 525792 526023 526773 528194 529692 530838 532007 533841 536432 539352 542248 545173 548477 552597 557851 564286
59163 564286 571714 579895 588615 597597 606420 614568 621517 626916 630769 633351 634868 635344 634891 633768 631876
59148 631876 628498 623027 615870 608206 600852 593746 586541 579186 571730 564003 555794 547187 538483 529968
59134 529968 521844 514257 507321 501213 496127 491932 487964 483605 479111 475509 473542 473086 473658 475063 477276
59119 477276 480134 483505 487495 492138 497142 502263 507784 514268 521916 530365 539005 547321 555113 562535
59105 562535 569771 576552 582326 587122 591790 597016 602393 606919 610148 612363 613880 614807 615446 616208 617079
59090 617079 617619 617624 617295 616658 615422 613597 611725 610188 608677 606692 604162 601150 597301 592181 586038 579734
59074 579734 573820 568068 562045 555856 550097 545163 540814 536487 531986 527733 524216 521330 518516 515466
59060 515466 512425 509694 507229 504861 502552 500143 497197 493584 489999 487417 486086 485461 485067 484945 485172
59045 485172 485451 485370 484767 483686 482315 481103 480598 480914 481669 482566 483644 484708 485065 484343 483253 482968 483935
59028 483935 485822 488416 491806 495703 499403 502770 506677 512079 519031 526895 535138 543564 552165 561125
59014 561125 570644 580302 588866 595296 599784 603305 606196 607760 607367 605503 603517 602508 602544 602804 602500
58999 602500 601888 602251 604622 608621 612942 616886 620906 625617 630861 635960 640404 643940 646369 647722 648454
58984 648454 649029 649366 648999 647750 646032 644486 643490 643011 642800 642757 643143 644384 646641 649750 653652 658687
58968 658687 665337 673751 683577 694078 704406 714086 723430 733169 743441 753388 761995 769102 775206
58955 775206 780466 784347 786264 786152 784234 780499 774622 766390 756118 744570 732411 719735 706330
58942 706330 692400 678744 666114 654712 644500 635587 627946 621097 614586 608540 603219 598285 593265
58929 593265 588612 585398 583738 582378 580329 578187 577152 577260 577404 576892 576164 575930 576284 576856 577357 577693
58913 577693 577901 578165 578665 579302 579879 580612 582138 584815 588384 592526 597362 603121 609710 617049 625488 635267
58897 635267 645711 655673 664877 674215 684550 695777 707317 718929 730581 742040 753270 765018
58885 765018 778314 793408 809661 826439 843598 860990 877941 893373 906205 915693 921791 925182
58873 925182 926534 925657 921790 914774 905453 894824 883322 871114 858486 845569 832221 818681 805940
58860 805940 794952 785714 777469 769483 761207 752100 742009 731553 721483 711751 701775 691521 681653
58847 681653 672495 663475 653885 643735 633646 624240 615849 608457 601683 595086 588709 583047 578268 573721
58833 573721 568530 562595 556746 551919 548265 545121 541787 538316 535464 533814 533136 532761 532451 532638 533911
58818 533911 536519 540307 544739 549062 552807 556297 560424 565765 572057 578391 583696 587158 588703 589175
58804 589175 589654 590406 590774 590127 588506 586247 583500 580411 577352 574546 571728 568539 565021 561364 557383
58789 557383 552686 547224 541274 534947 528217 521533 516011 512664 511559 511894 512928 514680 517614 521720
58775 521720 526150 529948 532961 535647 538001 539204 538584 536552 534093 531506 528122 523311 517368 511240
58761 511240 505654 500689 496071 491639 487561 484204 481846 480485 479900 479873 480335 481302 482731 484499 486536
58746 486536 488908 491656 494585 497387 500087 503163 507001 511354 515655 519885 524762 530854 537754 544377
58732 544377 549954 554496 558354 561656 564429 567079 570430 575047 580605 586160 591095 595581 600051 604457
58718 604457 608323 611373 613864 616357 619430 623531 628828 635106 641976 649183 656587 663910 670715 676587
58704 676587 681144 684006 684986 684211 681769 677321 670419 661100 649803 636793 622165 606420 590523
58691 590523 575196 560600 546828 534255 523166 513451 504936 497663 491498 485776 479710 473097 466485
58678 466485 460828 456972 455073 454297 453422 452026 450845 450779 451811 453173 454278 455206 456512 458834 462553
58663 462553 467572 473430 479694 486046 492044 497170 501181 503995 505211 504305 501534 498056 494762 491496
58649 491496 487847 484185 481283 479240 477407 475190 472501 469625 467114 465584 465164 465266 465298 465335 465735 466451
58633 466451 467292 468568 470730 473475 475864 477363 478270 479182 480536 482654 485669 489325 493237 497295 501331
58618 501331 504571 506111 506057 505603 505806 506767 508131 509822 512020 514833 518290 522329 526563 530331 533255
58603 533255 535500 537339 538709 539388 539437 539237 539167 539358 539647 539729 539395 538663 537672 536539 535384 534366 533599 533275
58585 533275 533937 536270 540329 545286 550340 555573 561518 568161 574952 581657 588542 595709 602815 609568
58571 609568 616058 622453 628710 634751 640754 647293 655301 665620 678256 692271 706753 721755 737958
58558 737958 755744 774967 795247 815818 835384 852834 868000 881148 891929 899520 903611 904511
58546 904511 902487 897843 891509 884671 877743 870498 863072 855898 848663 840411 830828 820393 809082 796124
58532 796124 781422 766062 750884 735649 720349 706352 695244 687183 681183 676458 672726 669716
58520 669716 667212 665281 663852 662374 660390 658058 655740 653472 651210 649037 646771 644012 640947 638335
58506 638335 636224 633626 630109 626803 624908 624069 623247 622410 622147 622221 621823 620967 620411 620401 620574 620902 621511 621800
58488 621800 621002 619661 619367 620873 623585 626999 631437 636982 642880 648622 654756 662016 670316 679170 688542
58473 688542 698730 709776 721334 732788 743248 751811 758062 761986 763432 762212 758804 754239 749056
58460 749056 743013 736188 729716 724971 722468 721978 723276 726289 730857 736836 744269 753046 762503 771610
58446 771610 779527 785824 790305 792752 792790 790072 784824 778142 771361 765069 759035 753079 747642 743451 741031
58431 741031 740596 741987 744564 747554 750690 754252 758512 763500 769365 776459 784915 794503 804914 815743
58417 815743 826060 834601 840641 844374 846302 846678 845693 843629 840536 836193 830654 824454 818014 811272
58403 811272 804207 797303 791157 785983 781838 778990 777673 777672 778484 779720 781249 783221 786091 790268 795485
58388 795485 800870 805809 810333 814484 817831 820000 821231 821969 822299 822222 822081 822192 822342 822203 822049 822496 823771
58371 823771 825785 828799 833390 839674 847015 854622 862130 869653 877600 886409 896123 906205 916091 925961
58357 925961 936634 948668 961820 975379 988681 1001254 1012805 1023259 1032623 1040723 1047279 1052326
58345 1052326 1056435 1060368 1064635 1069458 1075044 1081619 1089180 1097404 1106038 1115380 1126125 1138565 1152103
58332 1152103 1165868 1179711 1194294 1210184 1227166 1244491 1261430 1277445 1292199 1305756 1318545
58321 1318545 1330824 1342289 1352429 1361161 1368945 1376440 1384264 1392905 1402485 1412554 1422391 1431651 1440667
58308 1440667 1450166 1460772 1472765 1486065 1500369 1515323 1530787 1547023 1564538 1583621 1604021
58297 1604021 1625305 1647478 1670861 1695195 1719361 1742486 1765008 1788060 1812011 1836336 1860843
58286 1860843 1886225 1913179 1941655 1971311 2002102 2033973 2066479 2099234 2132483 2166824 2202603
58275 2202603 2239886 2278677 2318741 2359540 2400819 2443138 2487401 2534025 2582928 2634121 2687823
58264 2687823 2744057 2802624 2863546 2927197 2993909 3063721 3136583 3212563 3291658 3373597 3457978
58253 3457978 3544624 3633641 3725113 3818823 3914446 4012045 4112283 4216174 4324805 4439293
58243 4439293 4560607 4689213 4825165 4968787 5120896 5282115 5452431 5631952 5821667
58234 5821667 6022862 6236160 6461895 6701139 6955527 7226230 7513982 7820050 8146422
58225 8146422 8495178 8868580 9269584 9701281 10165910 10665595 11204174 11787335 12421092
58216 12421092 13111451 13865700 14692733 15602043 16604016 17711731 18941435 20311381 21842290
58207 21842290 23559781 25495151 27683782 30165355 32987638 36210800 39911192 44187654
58199 44187654 49170076 55025455 61961043 70228832 80128190 91995193 106175255 122987645
58191 122987645 142685587 165408440 191136668 219665658 250565205 283036073 315638304
58184 315638304 346059533 371221428 387886129 393579452 387386737 370226096 344505852
58177 344505852 313385677 279992458 246868440 215748578 187601224 162799753 141318668
58170 141318668 122903757 107200178 93834189 82454422 72748261 64447134 57325552
58163 57325552 51195523 45900261 41309748 37316524 33830528 30775137 28085682 25708394
58155 25708394 23598375 21717841 20035439 18525262 17165308 15937036 14825885 13820406
58147 13820406 12909932 12083658 11332021 10647572 10023895 9454546 8933392 8454753 8012609
58138 8012609 7600796 7214834 6852803 6513786 6196320 5898916 5621012 5362272 5121504
58129 5121504 4897081 4687899 4493090 4311338 4141311 3982363 3833964 3694718 3562813
58120 3562813 3437262 3318030 3205097 3098068 2996593 2900496 2809460 2723111 2641390 2564365
58110 2564365 2491629 2422258 2355403 2290701 2228228 2168320 2111270 2056785 2003867 1951613 1900144
58099 1900144 1850377 1802967 1757768 1714323 1672433 1632112 1593288 1555812 1519648 1484892 1451580
58088 1451580 1419577 1388748 1359208 1331228 1304750 1279159 1253803 1228684 1204367 1181181 1158846
58077 1158846 1136918 1115250 1093979 1073392 1053895 1035693 1018296 1000747 982636 964593 947534
58066 947534 931729 916883 902674 888782 874763 860543 846973 835260 825657 817071 808101 798216
58054 798216 787797 777310 766718 755669 744096 732531 721763 712210 703681 695726 688060 680619
58042 680619 673428 666531 659899 653346 646656 639878 633207 626525 619367 611571 603637 596089 588663 580537
58028 580537 571323 561478 551722 542407 533487 524815 516226 507492 498412 489028 479788 471413 464440 458714
58014 458714 453494 448181 442898 438176 434274 431013 428157 425629 423344 421221 419421 418322 418057 418268 418536
57999 418536 418956 420043 422112 424932 428069 431417 435210 439503 443812 447430 449978 451510 452124 451711 450142
57984 450142 447436 443570 438339 431681 424080 416451 409568 403660 398442 393358 387966 382324 376967 372294
57970 372294 368044 363692 359334 355753 353438 351865 350069 347785 345753 344957 345738 347602 349692 351442 352836
57955 352836 353982 354476 353530 350989 347891 345512 343968 342307 339976 337492 335449 333611 331559 329656 328570
57940 328570 328165 327858 327969 329667 333291 337692 341829 346250 352225 359963 368467 376761 384334 390572 394770
57925 394770 396877 397458 396705 394205 390022 385358 381578 378938 376669 374008 370773 367204 363637 360252 356923
57910 356923 353469 350152 347567 345859 344495 343139 342249 342297 342756 342551 341353 339674 337760 335148 331588
57895 331588 327731 324458 321883 319407 316483 312986 309061 305062 301619 299314 298114 297348 296421 295495 295338
57880 295338 296450 298425 300207 300979 300706 299822 298557 296732 294190 291247 288644 287062 286618 286714 286454 285391
57864 285391 283915 282839 282680 283501 285320 288257 292122 296238 300017 303542 307245 311125 314697 317713 320475
57849 320475 323260 325786 327556 328453 328636 328019 326376 323972 321619 319841 318234 315896 312345 307878 303255
57834 303255 299195 295951 293089 289839 285909 281844 278332 275353 272424 269503 267146 265727 265076 265071 266043
57819 266043 268201 271014 273681 276086 278751 281774 284197 284661 282558 278424 273281 267776 262008 256044
57805 256044 250303 245269 240999 237243 233993 231553 229960 228732 227426 226180 225364 224844 224018 222607 221140
57790 221140 220565 221486 223835 227175 231132 235455 239718 243345 246248 249263 253380 258477 263273 266821 269587
57775 269587 272704 276595 280793 284785 288391 291499 294005 295956 297206 297048 294841 291093 287205 283905
57761 283905 280579 276480 271971 267982 264719 261590 258166 254573 250952 247251 243668 240774 238880 237704
57747 237704 236962 237007 238429 241119 244191 246949 249593 252713 256310 259744 262645 265453 268773 272443 275658
57732 275658 277961 279698 281327 282709 283397 283449 283491 283941 284479 284447 283571 282133 280575 279139 277850 276594 275158
57715 275158 273314 271017 268497 266106 264111 262635 261643 260856 259778 258027 255663 253031 250304 247377 244256
57700 244256 241266 238724 236677 235213 234818 235982 238394 240871 242271 242321 241444 239996 237871 234798 230826
57685 230826 226443 222265 218613 215360 212192 209125 206833 206467 209043 214810 223200 233510 245807 261127
57671 261127 280692 304957 333435 365400 400612 439226 480811 523101 561598 590671 605724
57660 605724 604859 588958 560707 523779 482448 440968 402524 368593 339346 314545 294025 277542
57648 277542 264415 253474 243520 234072 225709 219433 215504 213019 210747 208274 206134 204967 204810 205181
57634 205181 205539 205475 204694 203146 201176 199334 197941 196948 196275 196051 196368 196881 196953 196240 194971 193631 192502
57617 192502 191571 190659 189518 188010 186347 185011 184242 183675 182659 180890 178615 176321 174364 172829 171549
57602 171549 170257 168822 167307 165773 164181 162620 161426 160832 160592 160156 159131 157404 154999 152160 149475
57587 149475 147567 146574 146124 145799 145376 144707 143669 142287 140670 138871 137041 135608 134887 134503 133603 131742
57571 131742 129228 126626 124362 122827 122309 122516 122639 122218 121574 121135 120777 120274 119979 120447 121593 122785 123692
57554 123692 124506 125354 126055 126607 127393 128681 130179 131314 131719 131339 130332 129046 127866 126853 125729 124453
57538 124453 123609 123924 125435 127476 129496 131580 134040 136822 139533 141874 143729 145006 145737 146243 146834
57523 146834 147334 147326 146934 146907 147730 149123 150729 152767 155486 158469 161120 163552 166187 168603 169660 168876
57507 168876 166923 164662 162469 160748 160180 160848 161784 162025 161683 161362 160969 159826 157704 155065 152446 150138
57491 150138 148321 146941 145550 143809 142093 141069 140787 140746 140775 141167 141868 142216 141783 141030 140747 141190 142030
57474 142030 142909 143705 144278 144205 142936 140393 137382 135123 134121 133680 132839 131506 130330 129707 129411 129035 128246
57457 128246 126677 124294 121898 120624 120711 121271 121471 121367 121308 121193 120880 120887 121942 123925 125814 126824 127266
57440 127266 128090 129766 131775 133243 133940 134455 135360 136521 137459 138098 138701 139311 139841 140575 141935 143658 144888
57423 144888 145271 145307 145449 145566 145650 146289 147833 149668 150997 151885 152869 153917 154561 154809 155149 155766 156490 157429
57405 157429 158874 160579 161880 162657 163466 164551 165422 165700 165727 165959 166340 166706 167319 168487 170043 171693 173589
57388 173589 176007 178673 180983 182733 184190 185610 187243 189673 193363 197691 201197 203197 204634 206785
57374 206785 209570 211829 213021 213878 215231 216960 218392 219236 219610 219535 219037 218657 219235 221035 223424 225565
57358 225565 227183 228565 230114 232027 234182 236227 237960 239656 241735 244033 245865 247049 248426 250960
57344 250960 254521 258035 260693 262548 264018 265316 266572 268065 270037 272408 274843 277039 278896 280530
57330 280530 282217 284210 286533 288969 291171 292732 293381 293456 294065 296262 299875 303562 306305 308556 311540
57315 311540 315590 319670 322587 324355 326193 329381 334245 340043 345580 349944 352925 355010 357054 359826
57301 359826 363598 367976 372230 375963 379460 383197 387057 390368 392920 395632 399763 405490 411751 417612
57287 417612 423374 430047 438089 447119 456585 466195 475735 485122 494827 505812 518737 533445 549342
57274 549342 565887 582539 598621 613622 627442 640153 651858 663036 674498 686439 697818
57263 697818 707328 714823 721257 727387 733278 739039 745204 752043 759140 766043 772828 779696 786526 793324
57249 793324 800680 809210 818810 828951 839500 850643 862137 873325 884022 894842 906432 918713
57237 918713 931150 943496 956014 969100 982844 996918 1010820 1024320 1037718 1051570 1066146
57226 1066146 1081226 1096410 1111492 1126509 1141574 1156745 1171972 1187203 1202582 1218432 1234889
57215 1234889 1251638 1268194 1284399 1300396 1316218 1331824 1347605 1364349 1382425 1401213 1419724
57204 1419724 1437668 1455649 1474386 1493981 1513938 1533681 1553044 1572387 1592169 1612340 1632281
57193 1632281 1651467 1669993 1688207 1706030 1723029 1739133 1754869 1770849 1787351 1804393 1821811
57182 1821811 1839081 1855535 1871127 1886680 1903051 1920233 1937666 1955239 1973471 1992713 2012674
57171 2012674 2032937 2053538 2074739 2096445 2118192 2139640 2160802 2181775 2202485 2222824 2242879
57160 2242879 2262771 2282269 2300773 2317793 2333370 2347882 2361611 2374718 2387531 2400424 2413260
57149 2413260 2425278 2435815 2444978 2453363 2461322 2468787 2475638 2481879 2487530 2492720 2497862 2503396 2509294
57136 2509294 2515167 2520973 2527396 2535488 2546141 2559919 2577051 2597454 2621020 2647919 2678410 2712323
57124 2712323 2749082 2788251 2829687 2873140 2918318 2965660 3016536 3072209 3132902 3198411 3269399
57113 3269399 3347643 3435112 3533343 3643723 3768005 3908470 4067865 4249381 4456697 4694257
57103 4694257 4967734 5284268 5652358 6081966 6585084 7176063 7871122 8687700 9644301
57094 9644301 10760253 12054534 13543842 15240396 17149245 19265316 21571743 24040685
57086 24040685 26635895 29315770 32036097 34750052 37402004 39917635 42202494 44159295
57078 44159295 45716572 46845981 47552982 47849813 47734252 47189040 46198066 44765437 42926253
57069 42926253 40745475 38307727 35704255 33022544 30340109 27720930 25213704 22852241
57061 22852241 20657685 18640949 16804655 15145155 13654659 12322611 11136269 10081600
57053 10081600 9144769 8313098 7574872 6918978 6335248 5815000 5350902 4936355 4565115
57044 4565115 4231463 3930564 3658544 3412097 3187996 2983332 2796492 2627620 2477613
57035 2477613 2346731 2234467 2140307 2063740 2003572 1958211 1926968 1910069 1906219 1909984 1911857
57024 1911857 1901088 1869227 1812732 1733775 1638749 1535164 1429222 1325604 1228231 1140012 1061853
57013 1061853 992748 931172 876171 827265 783949 745571 711405 680719 653027 628271 606380
57002 606380 586680 568189 550583 534429 520263 507887 496825 486992 478554 471398 465228 460055
56990 460055 456289 454373 454506 456554 460001 464190 468961 474849 482178 489936 495905 498009 495378 488243
56976 488243 477310 463498 447886 431497 415091 399300 384870 372598 363010 356112 351382 348023
56964 348023 345502 344111 344986 349334 357502 368761 381944 396202 411145 426351 440784 452670 459946
56951 459946 461037 455476 444033 428316 410144 391153 372778 356248 342269 330712 320974 312886
56939 312886 307188 304960 306767 312561 322105 335031 350596 367990 387073 408227 430918 452584
56927 452584 469404 478285 478090 469356 453448 432106 407272 380840 354325 328769 304832 282945
56915 282945 263400 246356 231796 219516 209161 200180 191806 183420 175145 167900 162499 158762 155788
56902 155788 153026 150741 149393 148992 149356 150745 153835 159108 166516 175822 187145 201087 218407 239527
56888 239527 264312 292212 322630 355047 388701 422171 453371 480090 500703 514545 521853 523533
56876 523533 520957 515721 509217 502301 495430 489189 484597 482820 484706 490600 500492 514272 532070 554496
56862 554496 582312 615630 653596 695002 738681 782498 822001 851102 864967 862408 845561 817908
56850 817908 783109 745078 707774 674144 645497 622187 604663 593662 589829 593752 606317 628482
56838 628482 660519 701925 752264 811593 879535 954055 1031480 1107249 1175786 1229864 1261698
56827 1261698 1266149 1243227 1197458 1135363 1063800 989511 918322 853954 797982 751058 713646
56816 713646 685692 666636 656357 655531 664537 682529 708169 740881 780691 826963 877680 929538
56804 929538 977906 1016790 1039940 1043023 1025218 989100 939378 881518 820672 760921 704957 654232
56792 654232 609403 570915 539329 515028 497659 486346 480696 481162 487987 500256 516687 537053
56780 537053 561712 589400 616227 637319 649124 650021 639705 618986 589994 555630 518448 480291
56768 480291 442844 407852 376444 348623 323836 301898 283095 267499 254604 243622 233852 224673
56756 224673 215628 206851 199188 193393 189184 185438 181388 177287 173799 171116 168920 166886 164842 162663
56742 162663 160360 158156 156182 154216 152067 150068 148760 148092 147422 146420 145522 145300 145710 146208 146432 146507
56726 146507 146815 147571 148561 149226 149179 148747 148786 149848 151681 153634 155323 156750 157924 158631 158595 157817 156790
56709 156790 156327 156942 158279 159363 159557 159182 159073 159724 160978 162281 162978 162529 160853 158502 156307 154774
56693 154774 153931 153672 153946 154522 154918 154837 154567 154689 155393 156317 157117 157914 158964 160063 160661 160632 160587 161190 162356
56674 162356 163328 163414 162504 161079 159975 159988 161258 162998 164122 164245 163870 163658 163869 164498 165511 166704 167700
56657 167700 168408 169272 170726 172549 174074 174956 175415 175721 175749 175204 174133 173023 172366 172191 172054 171535 170665
56640 170665 169821 169255 168881 168534 168251 168271 168802 169850 171154 172295 173001 173384 173742 174197 174676 175181 175788 176384
56622 176384 176761 177081 177773 178807 179489 179412 179193 179730 180893 181553 180965 179584 178395 177897 177975 178339 178685 178608
56604 178608 177765 176156 174074 171823 169646 167818 166588 165985 165869 166198 167069 168472 170165 171876 173510
56589 173510 175047 176397 177478 178342 179018 179265 178736 177479 176139 175520 176017 177436 179262 181022 182525 183863
56573 183863 185192 186549 188006 189896 192623 196211 200309 204661 209158 213383 216762 219535 223014 228226
56559 228226 234705 241406 248445 256872 266661 276000 283024 287434 289928 290893 290434 289144 287847 286731 285426
56544 285426 283830 282236 280668 278789 276524 274204 271963 269539 266901 264569 262929 261552 259591 256741
56530 256741 253559 250830 248804 247051 244978 242390 239542 236678 233734 230599 227508 224901 222951 221438
56516 221438 220067 218706 217274 215652 213787 211728 209575 207458 205599 204202 203270 202642 202198 201890 201628
56501 201628 201327 201045 200861 200622 200055 199165 198258 197518 196859 196333 196331 197080 198107 198585 198254 197769 198025 199253 200890
56482 200890 202239 203066 203508 203550 202940 201757 200782 200961 202418 204298 205732 206705 207762 209113 210441 211590
56466 211590 212925 214722 216494 217394 217247 216769 216597 216521 215958 214970 214310 214513 215333 216219 216999 217824 218623 218959
56448 218959 218511 217576 216973 217382 218719 220220 221226 221819 222568 223743 225015 225957 226574 227233 228190 229258 229805
56431 229805 229163 227316 225223 224093 224181 224551 224201 223200 222510 222893 224238 225743 226542 226273 225286 224260 223534
56414 223534 222986 222545 222457 222819 223241 223381 223546 224286 225538 226718 227632 228757 230396 231968 232508 231793 230721
56397 230721 230559 231875 234218 236705 238737 240141 240915 241258 241735 242929 244817 246900 249086 251919 255611
56382 255611 259315 261884 263027 263261 263046 262539 261993 261735 261745 261761 261771 261927 262055 261789 261268 261161 261889 263253
56364 263253 264904 266687 268357 269482 269951 270315 271291 273096 275387 277676 279667 281337 282809 284027 284635
56349 284635 284402 283785 283717 284695 286280 287574 288016 287745 287372 287516 288344 289548 290855 292452 294781 298065 302158
56332 302158 306582 310477 312951 314048 315084 317359 320655 323720 326084 328540 331655 334771 336909 338017
56318 338017 338767 339613 340587 341644 342667 343358 343545 343455 343401 343413 343453 343776 344778 346632 349271 352515 356011 359339
56300 359339 362480 366019 370605 376305 382615 388946 394874 400143 404611 408157 410667 412348 414019 416685
56286 416685 420671 425477 430553 435809 441299 446959 452989 459959 468117 476881 485449 493718 502291 511762
56272 511762 522264 533509 545098 557045 570095 585151 602213 620355 639008 658715 680223
56261 680223 703396 727746 753651 782363 814963 851911 893536 940382 993020 1051953 1117733
56250 1117733 1190861 1271691 1360716 1458741 1566303 1683041 1807981 1940224 2078810 2222027
56240 2222027 2367375 2512209 2653908 2789453 2915442 3028606 3125898 3204090 3260075 3292017
56230 3292017 3299901 3284679 3247256 3188658 3110902 3017184 2911127 2795995 2674535 2549194 2422248
56219 2422248 2295664 2170899 2048966 1930835 1817806 1711406 1612796 1522221 1439024 1362260
56209 1362260 1291374 1226325 1167100 1113255 1064071 1019008 977785 940075 905441 873604 844537
56198 844537 818258 794714 773845 755480 739190 724573 711617 700392 690453 681089 672239 664534
56186 664534 658235 652767 647660 643269 640030 637503 634860 631997 629488 627650 626278 625231 624688 624770 625378
56171 625378 626450 627991 629829 631739 633870 636746 640737 645674 651033 656325 661338 666170 671085 676335
56157 676335 682168 688952 697070 706677 717765 730400 744570 759886 775875 792697 811211 832347
56145 832347 856935 886098 921064 962388 1010003 1064235 1125929 1195154 1270497 1349994 1431876
56134 1431876 1513850 1592670 1665427 1730941 1789386 1841358 1888021 1931240 1972308 2010808 2045423
56123 2045423 2075248 2099397 2116158 2123966 2123000 2114659 2099728 2078012 2049167 2012450 1965996 1908158
56111 1908158 1839933 1764878 1686518 1607133 1529087 1455600 1389317 1331117 1280939 1238718 1203900
56100 1203900 1175055 1150862 1130956 1115262 1103240 1094360 1088638 1085993 1085521 1086070 1087178 1088955 1091375
56087 1091375 1094194 1097434 1101608 1107499 1115678 1125883 1136869 1147337 1157114 1166998 1177538 1188527 1199737
56074 1199737 1211430 1223882 1236983 1250569 1264723 1279561 1295044 1311068 1327433 1343844 1360380
56063 1360380 1377733 1396429 1416030 1435797 1455881 1477072 1499571 1522927 1547020 1572070 1597700
56052 1597700 1623078 1648097 1673472 1699572 1726128 1753115 1780805 1808840 1836342 1863194 1890132
56041 1890132 1917490 1945032 1973186 2003075 2034958 2067958 2101800 2137480 2175652 2215655 2256938
56030 2256938 2300224 2346353 2394951 2445119 2496605 2549591 2604076 2660176 2718297 2778519 2840561
56019 2840561 2904708 2971825 3042116 3115011 3190649 3270206 3354139 3441437 3531316 3624483 3721974
56008 3721974 3823959 3930441 4041931 4158658 4280371 4407765 4542808 4686704 4838731
55999 4838731 4998018 5165240 5341659 5527683 5723378 5929179 6145250 6371427 6608732
55990 6608732 6859699 7126399 7409637 7710870 8033131 8378986 8749425 9146041 9572478
55981 9572478 10032417 10528078 11062345 11640564 12268728 12951845 13695889 14509531 15402375
55972 15402375 16383761 17465478 18663921 19998075 21488133 23158720 25041598 27173669
55964 27173669 29595874 32357786 35522602 39168227 43390836 48315100 54103021 60956051
55956 60956051 69118248 78882367 90582505 104563019 121137733 140551571 162936250
55949 162936250 188264117 216328187 246725525 278727995 310973783 341164825 366149047
55942 366149047 382596497 388024686 381622240 364448491 338992090 308391870 275681376
55935 275681376 243290590 212863803 185317108 161006571 139910057 121785143 106293176
55928 106293176 93079512 81810184 72184334 63940805 56860040 50758097 45479440 40894922
55920 40894922 36900204 33409210 30347603 27652161 25271884 23164829 21293809 19626218
55912 19626218 18135578 16800049 15599884 14517757 13539893 12654575 11850206 11116287 10445103
55903 10445103 9830567 9266187 8745667 8264747 7820882 7411511 7033624 6684300 6360605
55894 6360605 6059531 5778896 5517674 5274967 5049535 4840756 4648697 4472438 4309600
55885 4309600 4158285 4017989 3887549 3763651 3642735 3523376 3405686 3289741 3176010
55876 3176010 3066181 2961818 2862794 2768278 2678390 2593472 2512461 2433530 2355946 2280082 2206222
55865 2206222 2134668 2066452 2002549 1942672 1886011 1832612 1782757 1735462 1689155 1643648 1600072
55854 1600072 1558945 1519617 1481592 1445075 1410110 1376281 1343475 1311887 1281098 1250086 1218386
55843 1218386 1186550 1155413 1125616 1097744 1071994 1047637 1023685 1000219 978291 958459 940261
55832 940261 923201 907338 892666 878765 865464 853173 842125 831845 821628 811086 799981
55821 799981 788054 775373 762478 749823 737313 724525 711168 697298 683366 670049 657740
55810 657740 646251 635330 625294 616663 609298 602541 596255 591088 587551 585381 584042 583303 583068 583072 583125
55795 583125 583342 583793 584152 583997 583393 582991 583577 585510 588440 591536 594102 595936 597032 597085 595556 592018
55779 592018 586077 577160 564979 550452 535764 523228 514096 508440 505899 506384 510128 516999 525638
55766 525638 533386 537334 535527 527351 513433 495705 477152 460509 446871 435873 427083 420566 416056
55753 416056 412395 408319 403414 397860 391566 384108 375493 366573 358468 351626 345547 339516 333641 328894
55739 328894 325898 323960 321812 319174 316881 315365 313709 310677 306246 301537 297487 294068 290705 286873
55725 286873 282243 276729 270670 264710 259271 254245 249400 244973 241622 239779 239235 239477 240217 241533 243648
55710 243648 246847 251469 257576 264483 270909 275783 278772 279979 279456 277211 273394 268218 261881 254773
55696 254773 247516 240516 233738 227177 221236 216178 211561 206813 202189 198521 196037 194160 192580 191792
55682 191792 192240 193567 195180 197098 199675 202716 205481 207558 209296 211193 213132 214413 214483 213455 211818
55667 211818 209752 207054 203850 201024 199483 199126 198998 198399 197427 196460 195723 195509 196203 197690 199179 200020
55651 200020 200390 200809 201344 201747 202048 202476 202896 202961 202821 203168 204391 206022 207202 207458 206900 205890 204625
55634 204625 202871 199982 195340 188964 181692 174716 168921 164620 161669 159721 158450 157659 157234 156983 156589
55619 156589 155815 154764 153833 153271 152806 151818 150009 147773 145786 144310 143010 141335 138964 135997 132983
55604 132983 130661 129359 128617 127751 126728 126117 126108 126066 125300 123895 122453 121332 120506 119922 119643 119712 120178 121076
55586 121076 122149 122790 122631 122005 121576 121699 122456 124010 126370 129022 131461 134076 137829 142995 148854 154892
55570 154892 161645 169823 179014 187770 194825 199837 203108 204968 205452 204284 201173 196264 190237 183836
55556 183836 177318 170473 163057 155164 147323 140300 134594 129992 125851 121934 118632 116231 114372 112598
55542 112598 110969 109661 108315 106521 104778 104159 104928 106156 106911 107125 107048 106582 105754 105253 105746 106967 108096
55525 108096 108860 109573 110257 110496 110233 110000 110099 110133 109612 108518 106975 104924 102549 100499 99091 97653 95362
55508 95362 92524 90286 89074 88120 86701 85136 84140 83801 83741 83854 84277 84854 85299 85804 86865 88437 89841
55491 89841 90668 91241 91919 92511 92747 92871 93125 93004 91788 89843 88643 89194 90949 92600 93461 93683 93550
55474 93550 93234 93093 93490 94218 94560 94121 93118 91699 89557 86578 83507 81334 80237 79639 79196 79112 79419
55457 79419 79587 79179 78433 77803 77228 76382 75392 74781 74660 74498 73854 72954 72323 72124 72166 72346 72725 73200 73487
55438 73487 73540 73740 74506 75835 77386 78877 80196 81179 81579 81421 81211 81524 82319 82817 82205 80517 78687
55421 78687 77743 77953 78868 80063 81641 83846 86408 88574 89835 90354 90545 90528 90252 89930 89904 90093 89957 89188
55403 89188 88089 87114 86253 85130 83573 81844 80367 79321 78389 76967 74904 73136 73085 75085 77788 79574
55387 79574 80167 80271 80118 79433 78700 79173 81099 83005 83530 83187 83330 83965 83804 82341 80692 80105 80568 81247
55369 81247 81533 81142 79859 77861 76027 75286 75671 76308 76295 75404 74060 72905 72325 72296 72669 73463 74587 75431
55351 75431 75269 74235 73365 73390 73962 74400 74643 74941 75025 74367 73082 71929 71373 71178 70938 70555 70162 70017 70463
55332 70463 71509 72425 72244 70847 69180 68251 68280 68846 69440 69712 69585 69349 69395 69761 70214 70766 71631 72646
55314 72646 73325 73637 74105 74831 75085 74400 73555 73769 75237 77049 78300 78627 77869 76077 73973 72651 72454
55297 72454 72600 72241 71566 71492 72494 74145 75735 76977 77967 78661 78751 78140 77339 77113 77766 79004 80427 81815
55279 81815 82867 83130 82429 81065 79413 77712 76459 76419 77635 78857 78702 77224 75747 75264 75682 76493
55263 76493 77342 77822 77555 76843 76598 77195 77906 77838 76941 75742 74597 73719 73514 74220 75410 76287 76415 75862
55245 75862 74929 74087 73859 74278 74687 74540 74134 74057 74205 74049 73682 73775 74430 74888 74615 74051 73942 74466 75363 76399
55225 76399 77312 77713 77527 77218 77171 77167 76887 76617 76855 77403 77491 76837 76048 75800 76032 76142 75701 74855 74208 74353
55205 74353 75255 76047 75841 74884 74526 75786 78182 80232 80879 80100 78392 76251 74243 73072 73118 73950 74646
55188 74646 74759 74852 75849 77832 79752 80467 79896 78798 77669 76378 74942 73963 73931 74539 75235 76065 77331
55171 77331 78665 79275 79205 79550 81058 83115 84543 84955 84757 84198 83151 81755 80603 80043 79703 79007 77958
55154 77958 77143 77018 77403 77816 78210 79197 81293 84039 86215 87118 87278 87646 88369 88794 88527 87944 87583 87464
55136 87464 87207 86544 85511 84318 83193 82244 81408 80618 79989 79684 79675 79897 80502 81590 82727 83237 83079 82927
55118 82927 83151 83232 82606 81630 81201 81714 82884 84303 85574 86100 85547 84598 84515 85700 87238 88115 88316 88351
55100 88351 88292 87942 87655 88189 89729 91542 92737 92963 92340 91162 89898 89154 89283 90130 91292 92473 93454
55083 93454 94002 94099 94176 94721 95595 95998 95353 94076 93269 93635 94836 95971 96526 96694 96877 97155 97330 97274 96982
55064 96982 96431 95658 94952 94702 94937 95241 95184 94669 93730 92335 90626 89170 88558 88769 89222 89487 89657 89912
55046 89912 90051 89745 89102 88687 88942 89780 90762 91491 91685 91062 89516 87510 86050 85927 86983 88344 89312
55029 89312 89786 89814 89244 88128 87115 86890 87348 87819 88144 88952 90629 92463 93264 92684 91556 90951 91179 91752
55011 91752 92075 91999 91790 91748 92015 92678 93866 95522 97200 98325 98654 98414 98048 97988 98520 99560 100609 101216
54993 101216 101477 101768 102076 102126 102159 102869 104240 105075 104283 102316 100686 100201 100285 99981 99082 98107 97601 97697 98195
54974 98195 98898 99806 100949 102002 102365 101863 101119 100918 101371 102037 102657 103361 104270 105309 106390 107375 107934 107835
54956 107835 107328 106816 106226 105235 104095 103649 104325 105595 106604 106899 106450 105488 104625 104565 105297 105920 105680 104822
54938 104822 104073 103624 103139 102526 102091 101987 102002 101960 101956 102091 102256 102342 102500 103092 104448 106595 109114 111289 112640
54919 112640 113407 114457 116614 120068 124349 128832 133265 137805 142558 147263 151528 155205 158193 160002
54905 160002 160000 158219 155569 152995 150616 147897 144402 140138 135383 130499 125890 121890 118669 116277 114653
54890 114653 113535 112551 111490 110409 109445 108746 108545 108961 109643 109985 109884 109879 110376 111218 112311 114163 117194
54873 117194 120888 124280 127178 130305 134253 138886 143771 148595 152981 156359 158345 158951 158290 156323 153110
54858 153110 149078 144865 141027 137921 135632 133859 132068 129914 127439 124878 122439 120306 118566 116997
54844 116997 115166 112924 110671 108936 107834 107086 106474 106023 105727 105359 104683 103753 102899 102461 102617 103340 104319
54827 104319 104936 104685 103809 103302 103952 105455 106750 107140 106777 106131 105495 105051 104964 105094 105004 104501 103910 103575 103389
54808 103389 103075 102631 102275 102204 102622 103643 104893 105613 105522 105183 105124 105098 104800 104869 106289 108970 111731 113724
54790 113724 115082 116117 116646 116493 116013 115714 115718 115850 115938 115813 115360 114761 114395 114360 114438 114551 114826 115106 114977 114552
54770 114552 114726 116235 118848 121842 124936 128307 131977 135738 139574 143705 148209 152950 157916 163277
54756 163277 168988 174515 179095 182201 183717 183803 182673 180505 177380 173221 167808 161134 153794 146784 140756
54741 140756 135683 131404 128168 126203 125062 123939 122554 121220 120115 119107 118278 117971 118113 118079 117491 116713
54725 116713 116328 116580 117526 119209 121404 123643 125804 128231 131107 134220 137546 141380 145497 148887 150959
54710 150959 152373 153977 155465 155924 155262 154061 152287 149224 144812 140072 135929 132363 129045 126194 124339
54695 124339 123668 123925 124571 124828 123989 122060 119818 117977 116514 115057 113607 112551 112086 111993 111931 111697 111196
54678 111196 110384 109287 108041 106851 105890 105257 105059 105431 106325 107225 107398 106647 105620 105079 105097 105287 105578 106199
54660 106199 106974 107281 106894 106344 106180 106309 106362 106345 106496 106773 106936 107051 107493 108412 109500 110359 110840 110973 110781
54641 110781 110338 109869 109657 109830 110279 110734 110919 110730 110361 110193 110451 110955 111288 111258 111077 111021 111016 110729 110050 109279
54621 109279 108836 108908 109365 109781 109581 108466 106851 105625 105251 105358 105413 105475 105907 106587 106918 106672 106360 106639 107669
54602 107669 109104 110451 111260 111286 110693 109921 109170 108137 106485 104445 102773 102161 102839 104581 106817 108690
54586 108690 109408 108873 107881 107423 107672 107876 107408 106678 106696 107800 109203 109930 109902 109864 110430 111423 112118 112033 111457
54567 111457 111206 111766 112728 113299 113291 113244 113539 113881 113915 113825 113870 113715 112801 111244 109855 109304 109636 110543 111654 112590
54547 112590 113146 113455 113709 113822 113704 113711 114282 115266 116221 117321 119255 122037 124595 125933 126219 126326 126717 127192
54529 127192 127425 127294 126837 126286 125986 125973 125698 124491 122275 119640 117313 115728 114965 114863 115127 115490 115804
54512 115804 116015 116142 116255 116338 116169 115542 114662 114042 113970 114306 114876 115758 117016 118374 119336 119526 118922 117962 117429
54493 117429 117907 119239 120723 121824 122406 122377 121722 120997 121095 122144 123120 122995 121847 120484 119454 118962 119257
54476 119257 120374 121668 122294 122151 121885 122047 122703 123698 124784 125584 125981 126457 127538 128962 130025 130674 131564
54459 131564 132940 134188 134783 135087 135820 137153 138592 139403 138894 136778 133665 130917 129602 129707 130486 131296
54443 131296 131856 132033 131808 131289 130557 129651 128803 128326 128064 127394 126135 125023 124753 124957 124799 124392 124789 126462
54425 126462 128528 129842 130384 131101 132636 134612 136071 136359 135536 134145 132703 131487 130750 130888 132052 133696
54409 133696 134916 135326 135371 135597 135959 136040 135745 135448 135556 136180 137127 138041 138587 138717 138740 138993 139473 139914 140185
54390 140185 140439 140899 141605 142353 142771 142596 141971 141342 140934 140508 139896 139512 139865 140710 141224 141105 140953 141355 142124
54371 142124 142784 143352 144157 145199 146205 147156 148237 149376 150334 151240 152513 154208 155895 157334 158820 160681
54355 160681 162795 164855 166760 168509 170061 171617 173708 176494 179104 180110 178753 175500 171473 167587
54341 167587 164224 161375 158840 156446 154192 152188 150423 148694 146797 144716 142585 140533 138612 136901
54327 136901 135581 134825 134587 134577 134495 134215 133699 132932 132107 131694 131996 132674 133092 133118 133192 133527 133764 133667 133716 134526
54307 134526 135985 137403 138307 138635 138364 137548 136699 136514 136995 137352 136996 136227 135659 135367 134973 134361 133851 133742
54289 133742 134107 135022 136600 138616 140358 141148 141024 140690 140743 141071 141147 140782 140352 140213 140192 139864 139195 138634 138581
54270 138581 139014 139649 140198 140418 140200 139792 139726 140271 141093 141672 141975 142430 143270 144202 144850 145270 145813 146573 147167
54251 147167 147114 146268 144928 143633 142881 142811 143034 142920 142224 141382 141049 141427 142208 143028 143742 144274 144522 144427 143933
54232 143933 142890 141329 139841 139174 139268 139153 138170 136899 136375 136746 137317 137750 138491 139925 141695 143130 143905
54215 143905 144055 143696 142968 141990 140691 138972 137162 135987 135832 136366 137138 138166 139570 140930 141528 141143
54199 141143 140210 139225 138334 137520 136806 136202 135725 135584 136096 137267 138587 139435 139637 139601 139873 140522 140985 140611
54181 140611 139430 138230 137728 137844 137957 137705 137247 136888 136795 137084 137793 138689 139385 139800 140225 140833 141351 141422 141101
54162 141101 140789 140826 141307 142075 142696 142651 141875 141022 140846 141312 141659 141434 141100 141400 142302 142994 142875 142225 141673
54143 141673 141264 140438 138981 137642 137482 138696 140346 141319 141283 140648 139913 139359 139261 139938 141445 143332 144905
54126 144905 145718 145845 145747 145822 146020 145929 145338 144622 144377 144704 145153 145435 145897 147089 149025 151090 152594 153236
54108 153236 153146 152681 152202 151892 151764 151861 152348 153263 154346 155245 155806 155948 155404 153940 151854 150012 149288 150011
54090 150011 151844 153918 155159 154913 153461 151816 150928 151207 152623 154815 156999 158295 158523 158432 158874 160031
54074 160031 161685 163883 166834 170323 173772 176951 180269 184331 189457 195575 202160 208215 212627 214742
54060 214742 214491 212095 207977 202998 198346 194882 192647 191055 189428 187456 185466 184282 184466 185605 186714
54045 186714 187460 188570 190784 193831 196840 199483 202226 205605 209740 214578 220106 226174 232373 238261
54031 238261 243616 248352 252400 255733 258408 260511 262176 263626 265025 266261 267065 267456 267878 268746 269890
54016 269890 270583 270145 268487 266141 263760 261543 259088 255891 251990 248052 244702 241856 238816 235061 230873
54001 230873 227158 224617 223093 221724 219765 217332 215274 214366 214650 215588 216725 218045 219712 221640 223396
53986 223396 224495 224752 224399 223858 223344 222679 221532 219807 217668 215184 212171 208500 204388 200237 196344
53971 196344 192978 190574 189490 189534 190041 190498 190894 191410 192040 192613 192972 193126 193448 194652 197053 199738 201084
53954 201084 200537 199364 199151 200023 201051 201997 203593 206126 208857 211318 214291 218714 224148 229125 232826
53939 232826 235808 239095 243133 247713 252462 257272 262479 268726 276425 285295 294601 303878 313282 323291
53925 323291 334316 346578 359963 373706 386280 395950 401678 403663 403054 401079 398371 395100 391653
53912 391653 388909 387658 387863 388697 389307 389405 389166 388742 388007 386710 384823 382625 380376 377954 375005 371505
53896 371505 367956 364826 361897 358375 353616 347611 340868 334003 327410 321115 314834 308263 301302 294019
53882 294019 286547 279210 272579 267095 262594 258434 254176 249960 246162 242934 240218 238026 236410 235121
53868 235121 233501 230912 227317 223379 219851 216865 213930 210659 207343 204661 202905 201725 200632 199564
53854 199564 198845 198709 199005 199347 199453 199297 199002 198717 198612 198755 198835 198145 196263 193764 191893 191297 191360 190974
53836 190974 189737 188124 186821 186268 186613 187560 188336 188338 187864 187840 188758 190318 192101 194016 195883 197202 197753
53819 197753 198040 198698 199788 201085 202634 204472 206048 206726 206893 207864 210441 214091 217765 221034 224056
53804 224056 226951 229775 232860 236552 240643 244576 248207 251887 255724 259282 262288 265124 268213 271248
53790 271248 273535 274927 275900 276821 277720 278785 280363 282171 283137 282577 281167 280146 279687 278729 276411 273062
53774 273062 269578 266339 263112 259649 255926 251922 247582 243013 238449 234009 229717 225781 222554 220080
53760 220080 217895 215514 213003 210832 209172 207643 205880 204081 202734 201918 201233 200405 199593 198984 198488 198086
53744 198086 198131 198865 199830 200240 199935 199566 199738 200357 200933 201193 201239 201376 201973 203184 204650 205697 206066 206205
53726 206205 206678 207575 208744 210292 212358 214576 216237 216983 217019 216685 216290 216369 217606 220176 223489 226811
53710 226811 229876 232719 235241 237353 239279 241297 243237 244737 246015 247923 250974 254662 258039 260715
53696 260715 263017 265377 267968 270854 274033 277239 280000 282061 283513 284475 284942 285045 285049 284839 283751 281339
53680 281339 278084 274957 272437 270379 268686 267532 266846 266210 265433 264755 264232 263395 261965 260494 259824 260090
53664 260090 260712 261197 261480 261574 261410 261047 260643 260141 259394 258653 258447 258840 259269 259344 259362 259647 259852 259534 259157 259833
53644 259833 261938 264588 266685 268075 269349 270893 272548 274022 275252 276364 277602 279250 281368 283539
53630 283539 285153 286010 286462 287011 288041 289937 292996 296962 300951 304267 307187 310670 315311 320777 326228
53615 326228 331107 335593 340443 346297 352897 359193 364463 369185 374380 380236 385921 390743 394798 398200
53601 398200 400339 400478 398789 396226 393587 391214 389438 388584 388348 387725 385910 383063 379976 377219 374798
53586 374798 372430 369834 366873 363683 360725 358491 357090 356189 355413 354695 354241 354248 354689 355276 355539 355060 353844
53569 353844 352489 351775 351997 352801 353752 354807 356034 357139 357695 357743 357757 357958 358134 358256 358822 360268 362429
53552 362429 364942 367856 371346 375052 378263 380742 382933 385314 387931 390602 393207 395735 398428 401942
53538 401942 406935 413287 420124 426854 433873 441954 451156 460707 469891 478765 488040 498476 510422 523719
53524 523719 537898 552413 566823 580971 595201 610239 626598 644142 662516 681898 702858
53513 702858 725392 748642 771888 795384 819824 845370 871646 898407 925539 952486 978356
53502 978356 1002819 1026477 1050088 1073735 1096898 1119037 1139880 1159452 1178146 1196644 1215414
53491 1215414 1234281 1252681 1270402 1287921 1305987 1324905 1344283 1363448 1382028 1400056 1417514
53480 1417514 1433962 1448772 1461677 1472879 1482569 1490497 1496089 1498841 1498619 1495694 1490592 1483751 1475240
53467 1475240 1464815 1452333 1438032 1422395 1405860 1388726 1371262 1353733 1336285 1318819 1300984
53456 1300984 1282361 1262753 1242292 1221248 1199772 1177925 1155868 1133864 1112183 1091195 1071491
53445 1071491 1053559 1037286 1022101 1007790 994927 984307 976239 970551 966977 965158 964491 964409 964876
53432 964876 966321 969121 973349 978938 985771 993672 1002591 1012750 1024293 1036911 1050275 1064804 1081464
53419 1081464 1100678 1121944 1144695 1168948 1194740 1221552 1248973 1277565 1308337 1341496 1376418
53408 1376418 1412840 1451227 1491727 1533541 1575929 1619425 1665414 1714618 1766521 1820270 1875566
53397 1875566 1932451 1990598 2049235 2107711 2165886 2223878 2281639 2338919 2395530 2451336 2505934
53386 2505934 2558580 2608668 2656142 2701142 2743311 2781835 2816245 2846840 2874048 2897582 2916473
53375 2916473 2929832 2937301 2938869 2934605 2924623 2909048 2887775 2860351 2826293 2785588 2738894 2687337
53363 2687337 2632217 2574922 2516922 2459402 2402622 2345788 2288046 2229804 2172786 2118551 2067154
53352 2067154 2017501 1968706 1920679 1873610 1827561 1782646 1739106 1696883 1655521 1614864 1575586
53341 1575586 1538671 1504515 1472855 1443404 1416149 1391112 1368216 1347458 1328844 1312066 1296517
53330 1296517 1281772 1267785 1254536 1241735 1229019 1216208 1203180 1189795 1176243 1163312 1151943
53319 1151943 1142467 1134491 1127488 1121328 1116246 1112559 1110436 1109785 1110375 1112245 1115941 1122032 1130311 1139789
53305 1139789 1149661 1160068 1171749 1185175 1200336 1217218 1236145 1257539 1281559 1307966 1336193
53294 1336193 1365595 1395799 1426776 1458328 1489556 1519168 1546417 1571512 1594977 1616873 1636840
53283 1636840 1654554 1669797 1682210 1691414 1697404 1700455 1700593 1697449 1690748 1680724 1667916 1652835 1635929
53270 1635929 1617494 1597301 1574602 1549029 1521370 1493005 1464511 1435326 1404948 1373921 1343270
53259 1343270 1313320 1283574 1253593 1223514 1193659 1164070 1134572 1105057 1075588 1046371 1017656
53248 1017656 989508 961744 934297 907585 882162 858006 834558 811549 789360 768331 748210
53237 748210 728700 710287 693943 680037 667914 656632 645826 635812 627035 619476 612468 605086
53225 605086 596782 587567 577505 566325 553736 539948 525534 510991 496756 483423 471388 460263
53213 460263 449204 437958 427172 417522 408922 400805 392856 385230 378271 372167 366604 360710 353725
53200 353725 345926 338463 332079 326390 320746 315286 310564 306465 302203 297359 292378 287873 283908 280160
53186 280160 276513 273269 270869 269500 268865 268325 267347 265807 263840 261571 259166 256961 255257 253998 252889
53171 252889 251831 251005 250510 250073 249215 247656 245631 243844 242888 242608 242267 241489 240713 240406 240192 239299 237656
53154 237656 235967 234730 233799 232955 232304 231897 231474 230895 230413 230191 229978 229594 229390 229779 230580 231293 231827 232480
53136 232480 233263 233752 233713 233465 233424 233616 233868 234254 235011 236009 236628 236345 235350 234377 233910 233763 233539 233295 233486
53117 233486 234374 235753 237238 238522 239374 239729 239928 240543 241725 242881 243219 242464 240916 238979 236920 234961
53101 234961 233279 231899 230713 229655 228765 228073 227541 227050 226441 225625 224750 224149 224021 224237 224503 224630 224603 224533
53083 224533 224655 225213 226169 227082 227389 226790 225387 223649 222271 221797 222104 222438 222154 221300 220345 219544 218817 218025
53065 218025 217058 215780 214286 213145 212995 213858 215119 216157 216730 216755 216186 215308 214781 215070 215943 216729 216957
53048 216957 216634 216072 215643 215599 215883 216106 215834 214922 213565 212124 210999 210564 210994 212060 213202 213897 213975 213581
53030 213581 212850 211752 210334 208984 208219 208148 208375 208605 209095 210218 211770 213124 214047 214892 215827 216362 215997
53013 215997 215075 214476 214555 214879 215038 215247 215838 216525 216661 216128 215522 215308 215243 214967 214813 215442 216688 217408 216833
52994 216833 215628 215122 215727 216651 217065 216895 216354 215396 214106 213125 213014 213465 213777 214045 215163 217477 220072
52977 220072 221797 222529 222934 223382 223747 224141 225111 226905 229054 230985 232665 234351 235975 237207 237979 238575
52961 238575 239175 239495 239019 237527 235480 233844 233345 233794 234313 234281 233768 232988 231878 230555 229592 229174 228383
52944 228383 226243 223349 221455 221281 221626 221090 219760 218606 217938 217288 216419 215597 215032 214693 214560 214475 213897
52927 213897 212390 210270 208251 206601 205234 204463 204848 206207 207484 207811 207184 205986 204505 203191 202707
52912 202707 203265 204298 205147 205737 206257 206584 206444 205888 205171 204407 203663 203205 203286 203805 204418 204898 205198 205353 205525
52893 205525 205943 206576 207084 207310 207568 208211 209170 210131 210920 211430 211565 211609 212321 214114 216302 217686 217821 217310
52875 217310 216964 217147 217871 219026 220402 221859 223503 225376 227051 227934 228003 227792 227621 227301 226707 226194 226226
52858 226226 226934 228146 229485 230375 230392 229811 229348 229114 228340 226524 224386 223095 222873 222937 222661 222058 221061 219034
52840 219034 215469 210867 206572 203742 202578 202366 202054 200986 199383 198153 198024 198803 199596 199801 199738 200211
52824 200211 201589 203451 205034 205802 205609 204651 203396 202360 201692 201034 199941 198399 196873 196026 196427 198239
52808 198239 200884 203277 204826 206072 207919 210340 212380 213486 214086 214613 214557 213142 210579 207980 206121
52793 206121 204847 203722 202727 202053 201594 200992 200079 199042 198193 197742 197768 198257 199087 200028 200846 201466 201976 202476
52775 202476 203012 203713 204843 206451 207996 208581 207760 205952 204008 202459 201280 200241 199344 198894 199150 199866
52759 199866 200320 200008 199227 198673 198591 198772 199303 200631 202597 204102 204266 203515 202965 203090 203597 204334 205506 207087
52741 207087 208748 210465 212565 215015 217237 218799 219821 220519 220900 221105 221542 222380 223333 224195 225131 226129
52725 226129 226729 226734 226705 227168 227652 227179 225545 223557 221991 220862 219743 218380 216868 215534 214680 214223 213564
52708 213564 212114 209967 207868 206542 206245 206838 207957 209127 209962 210348 210342 210069 209909 210508 212139 214229 215915
52691 215915 216978 217724 218120 217798 216984 216670 217477 218931 220227 221189 221987 222408 222106 221344 220824 220781 220719 220089
52673 220089 218848 217362 216108 215453 215405 215563 215618 215830 216630 217817 218637 218765 218734 219149 219927 220642 221300 222343
52655 222343 224028 226214 228710 231513 234673 238130 241668 244831 246919 247419 246475 244731 242604 240007 236866
52640 236866 233612 230829 228572 226395 224067 221984 220749 220560 221150 222118 223171 224183 225235 226549 228139
52625 228139 229610 230531 231050 231774 232913 233838 233812 232954 232068 231570 231037 229989 228773 228279 228851 229776 229910 228722
52607 228722 226736 225068 224528 225013 225723 225986 225876 226006 226815 228176 229645 230897 231900 232838 233909 235082
52591 235082 236015 236310 235922 235176 234385 233617 232905 232421 232255 232218 232102 231978 232048 232313 232673 233198 233992 234821 235287
52572 235287 235386 235517 235843 236022 235805 235549 235817 236685 237663 238162 237829 236658 235065 233697 232910 232520 232255 232180
52554 232180 232377 232526 232358 232328 233181 234684 235495 234687 232952 231823 231941 232608 232926 232848 232894 233273 233677 233819 233803
52535 233803 233781 233513 232597 231118 229773 229174 229229 229428 229536 229738 230167 230588 230579 229858 228487 226990 226194 226631 228078
52516 228078 229848 231498 232961 234158 234958 235617 236717 238506 240692 243107 246081 249750 253427 256191 257966
52501 257966 259466 261091 262310 262253 260581 257688 254297 250997 248076 245652 243838 242653 241830 241041 240373
52486 240373 240256 240706 241043 240709 240070 239931 240483 241269 242011 242849 243755 244427 244946 245889 247393 248617 248715 248006
52468 248006 247594 247984 248653 249005 249171 249621 250487 251659 253304 255764 258943 262140 264658 266273 267075 267152 266668
52451 266668 265947 265055 263491 260802 257467 254646 252895 251631 250077 248205 246385 244597 242644 240828 239696
52436 239696 239101 238223 236710 235248 234715 235111 235632 235592 235033 234569 234761 235556 236253 236206 235605 235356 236138 237820
52418 237820 239848 241823 243517 244713 245455 246334 248142 251208 255248 259838 264855 270472 276962 284527 293107
52403 293107 302215 311045 318826 325059 329335 331046 329543 324788 317771 310021 302579 295609 289023 283135
52389 283135 278435 274971 272417 270642 269791 269751 270047 270379 270945 271997 273419 274992 276788 278983 281488 284092
52373 284092 286832 289868 293023 295826 298137 300541 303898 308547 313945 319103 323332 326611 329236 331260
52359 331260 332421 332639 332354 332176 332260 332214 331715 331129 331408 333206 336094 338754 340150 340500 341018 342727 345655
52342 345655 349123 352585 356125 360292 365586 372001 379064 386370 394031 402467 411884 422190 433361 445522
52328 445522 458571 472072 485717 499739 514691 531035 549019 568733 590006 612295 634843
52317 634843 656932 678012 697779 716187 733258 748896 763109 776363 789316 802055 813963
52306 813963 824621 834428 843954 852928 860445 866128 870580 874523 877851 879874 880388 880124 880016 880118 879436
52291 879436 876872 872171 865922 858911 851737 844830 838363 832087 825683 819439 814325 811248 810497 811900
52277 811900 815185 819991 825970 833145 841864 852181 863628 875891 889300 904128 919673 934605
52265 934605 948202 960774 972823 984224 994447 1003310 1011225 1018772 1026186 1033296 1039812 1045494 1050061
52252 1050061 1053272 1055333 1056932 1058419 1059182 1058383 1056139 1053185 1049344 1043342 1034542 1023967 1012909 1001314
52238 1001314 988451 974635 961203 948991 937805 927361 917812 909174 901048 893286 886368 880828
52226 880828 876622 873208 869983 866579 863104 860149 858321 857808 858573 860660 863907 867694 871608 876118 881852
52211 881852 888358 894416 899551 904400 909534 914860 920396 926540 933003 938342 941421 942840 944230 946521
52197 946521 949454 952393 954889 956632 957602 958294 959320 960734 962095 963210 964462 966341 968930 971893 974815
52182 974815 977406 979394 980254 979287 976206 971537 966120 960253 953747 946733 939851 933424 927038 920301 913620
52167 913620 907840 903415 900187 897740 895715 894101 893445 894397 896837 899915 903227 907376 912864 918954 924300
52152 924300 928326 931308 933391 934390 934470 934210 933832 933054 931898 931071 931293 932676 934977 937996 941430 944829
52136 944829 948161 952155 957568 964243 971392 978808 987283 997585 1009511 1022504 1036912 1053852 1073702
52123 1073702 1095513 1118488 1143336 1171268 1201861 1232963 1262815 1291396 1319399 1346800 1372950
52112 1372950 1397301 1419277 1437985 1452821 1464119 1472551 1478164 1480625 1480117 1477229 1472145 1464713 1455325
52099 1455325 1445008 1434486 1423750 1412723 1401820 1391572 1382042 1372873 1363733 1354626 1345837 1337569
52087 1337569 1329510 1321052 1312112 1303346 1295201 1287263 1279236 1272202 1267922 1266910 1268100 1270542 1274486 1280480
52073 1280480 1288302 1297409 1307781 1319552 1332246 1345116 1358103 1371811 1386504 1401540 1415805 1428395
52061 1428395 1438872 1447223 1453700 1458554 1461829 1463425 1463284 1461420 1457806 1452363 1445157 1436597 1427304 1417616
52047 1417616 1407152 1395167 1381486 1366788 1351718 1336017 1318997 1300610 1281444 1261776 1241373
52036 1241373 1220389 1199797 1180629 1163181 1147275 1132858 1120065 1108994 1099691 1092011 1085344 1078889
52024 1078889 1072426 1066402 1060978 1055439 1048951 1041502 1033685 1025845 1017872 1009559 1000789 991535 981992 972395
52010 972395 962443 951375 939062 926534 914712 902950 889690 874492 858602 843391 828951 814468
51998 814468 799368 783691 767765 751894 736206 720584 704952 689725 675776 663869 654285 646910
51986 646910 641226 636214 630826 624877 619122 614210 609893 605475 600565 594989 588353 580294 571022 561148
51972 561148 551021 540673 530400 520912 512794 506145 500865 496914 494201 492528 491917 492704 495110 498898
51958 498898 503684 509372 516013 523413 531145 538760 545645 550831 553447 553463 551600 548463 544153 538856 533329
51943 533329 528441 524661 522348 522180 524654 529352 535392 542648 551870 563428 576482 589703 602273
51930 602273 613820 623831 631748 637393 640738 641344 638595 632526 623998 613971 603039 591712 580698
51917 580698 570646 561904 554772 549638 546616 545383 545681 547746 551755 556902 561359 563193 561164 554927
51903 554927 545055 533011 520590 509077 499054 490983 485416 482373 481010 480411 480428 481258 482402 482686
51889 482686 481268 478010 472907 465910 457567 449152 441592 434669 427748 420933 415045 410766 408376 408036
51875 408036 409668 412604 416051 420009 425172 431833 439318 446627 453160 458702 463218 466858 469677 471113
51861 471113 470240 466880 461990 456625 451012 445097 439492 435188 432547 431229 430958 431673 432989 434277 435451
51846 435451 437030 439161 441100 442052 441998 441231 439494 436228 431573 426563 422176 418531 415069 411193 406642
51831 406642 401596 396674 392682 390137 389022 388994 389632 390409 390804 390746 390741 391137 391365 390403 388060 385305 383096
51814 383096 381353 379468 377425 375779 374700 373801 373112 373594 376157 380354 384537 387333 388706 389520 390347
51799 390347 390986 391084 390854 390787 390735 389729 387037 383113 379131 375732 372648 369429 366046 362677 359390 356277
51783 356277 353604 351642 350489 350151 350469 350946 351040 350791 350831 351577 352813 354206 355780 357589 359449 361457
51767 361457 364317 368569 373750 378923 383880 389288 395788 403560 412623 422746 432951 441784 448446 453178
51753 453178 456229 456927 454292 448386 440607 432615 425137 417790 409942 401734 394220 388419 384360 381326
51739 381326 378984 377841 378453 380602 383614 387297 392204 398968 407564 417201 426742 435225 442111 447284
51725 447284 451044 454144 457466 461246 464657 466480 466158 463849 459594 453138 444857 436276 429094 423875
51711 423875 420001 416624 413222 409515 405506 401670 398683 396827 395933 395883 396793 398666 401233 404275 407677
51696 407677 410948 413023 412942 410754 407621 405036 403896 404076 404764 405285 405643 406081 406199 404993 402012 398069
51680 398069 394402 391422 388776 386384 384726 384063 384083 384595 386063 389042 393492 399031 405568 413239 421985
51665 421985 431661 442293 453583 464228 472459 477419 479479 479070 475894 469814 461980 454341 448115 443305
51651 443305 439711 437829 438451 441606 446179 450586 453731 455325 455383 453615 449586 443411 435891 427770 419136
51636 419136 409865 400295 391024 382201 373663 365830 359885 356665 355659 355438 354953 354180 353603 353428 353414 353280
51620 353280 353050 352942 352962 352789 352128 351067 349960 349066 348524 348606 349656 351615 353810 355363 355783 355136 353840
51603 353840 352463 351584 351577 352414 353781 355504 357882 361473 366426 372105 377655 382979 388844 395698 402587
51588 402587 407658 409694 408826 405804 401177 395467 389683 385022 382041 380494 380070 381022 383919 388922 395544
51573 395544 403217 412007 422591 435504 450504 466774 483585 500592 517641 534587 551311 567601
51561 567601 583059 597532 611842 627769 646956 669946 696420 726011 758345 792285 825626
51550 825626 855772 880634 898877 909688 912697 908141 896873 879956 858166 831869 801441 767754
51538 767754 732224 696325 661148 627439 595987 567772 543617 523605 506915 492347 479148
51527 479148 467333 457211 448768 441642 435505 430188 425450 421043 417100 414097 412213 410976 409833 408794
51513 408794 408228 408167 408293 408513 409106 410153 411178 411540 410951 409428 406989 403649 399585 395131 390612 386307
51497 386307 382439 379054 376031 373401 371556 370885 371205 371724 371634 370648 369084 367680 367258 368080 369369 369775
51481 369775 368634 366575 364556 362570 359738 355639 350981 346792 343387 340438 337705 335247 333075 331050
51467 331050 329194 327723 326609 325381 323622 321575 319980 319229 318841 318018 316737 316069 317192 320151 323797
51452 323797 326882 328963 330303 331358 332633 334769 338338 343504 349993 357354 365203 373454 382465 392683
51438 392683 403839 414614 423428 429504 432969 434197 433533 431556 429078 426661 424383 422082 419479 416017
51424 416017 411044 404478 397092 389907 383431 377656 372556 368289 364944 362409 360631 359836 360305 361908 364094
51409 364094 366515 369480 373453 378122 382457 385772 388246 390149 391196 391238 391069 391777 393461 395267 396518
51394 396518 397095 396988 396429 396477 398428 402372 407257 412654 419495 428575 439361 451057 464129 479921
51380 479921 499329 522643 550070 581484 616101 653412 694170 739358 788222 838041 885675
51369 885675 928439 963785 989605 1005433 1012515 1012215 1004836 990174 968318 939510 904034 862986
51357 862986 818720 773863 730018 687756 647471 609791 575351 544597 517660 494189 473536
51346 473536 455455 440311 428302 418766 410632 403312 396699 390519 384258 377745 371355 365536 360436
51333 360436 355981 351970 348007 343717 339188 335006 331668 329151 327150 325547 324440 323856 323648 323673 323883
51318 323883 324210 324528 324838 325426 326623 328314 329795 330294 329700 328739 328427 329406 331738 335067 338725 341807
51302 341807 343517 343707 343012 342226 341593 340891 340102 339565 339239 338272 335814 332137 328419 325464 323165 321313
51286 321313 320202 320061 320500 321147 322446 325119 329015 333209 337213 341421 346180 351011 354981 357421 358138
51271 358138 357371 355891 354767 354663 355427 356573 357950 359778 362215 365081 367887 370032 371178 371516 371531 371382
51255 371382 370754 369374 367411 365237 363036 360764 358305 355563 352642 350030 348309 347541 347199 346856 346584
51240 346584 346486 346191 345173 343333 340946 338226 335251 332211 329418 327113 325381 324096 322838 321201 319385
51225 319385 318182 318049 318518 318860 319062 319641 320707 321791 322567 323289 324414 326192 328648 331589 334604 337368
51209 337368 340081 343256 347042 351010 354643 357780 360534 363067 365457 367497 368625 368404 367148 365764
51195 365764 364903 364476 363993 362979 361084 358272 355096 352355 350298 348548 346985 346211 346740 348136 349432
51180 349432 350149 350442 350503 350427 350602 351636 353675 356159 358411 360196 361603 362679 363371 363657 363616 363463 363561 364191
51162 364191 365219 366187 366841 367467 368585 370392 372572 374506 375656 375910 375690 375629 375990 376479 376689 376538 376143
51145 376143 375429 374152 372244 369927 367447 364895 362314 359760 357182 354474 351753 349398 347599 346059
51131 346059 344420 342915 342244 342640 343391 343577 343155 343029 344017 346065 348518 350838 352821 354364 355534 356852
51115 356852 359049 362313 366032 369521 372777 376232 379996 383703 386992 389678 391511 392339 392639 393387 395039
51100 395039 397025 398533 399460 400153 400613 400599 400330 400394 400848 401048 400547 399665 398961 398625 398664 399129 399741 399721 398601
51081 398601 397029 396179 396392 396909 396994 396883 397409 398988 401182 403119 404192 404560 405090 406772 410080 414848
51065 414848 420599 426901 433590 440949 449676 460404 473179 487560 503056 519066 534361 547258
51053 547258 556812 563815 570398 578721 590056 604563 621328 638634 654729 668657 680212 689100
51041 689100 694470 695462 692074 685249 676248 666103 655541 645054 634747 624084 611970 597344 579941
51028 579941 560635 541027 522690 506692 493582 483510 476264 471399 468557 467663 468732 471604 475921
51015 475921 481312 487496 494289 501584 509203 516667 523299 528847 533909 539519 546307 554228 562916 571938
51001 571938 580810 589341 598055 607714 618205 628376 637393 645814 654856 664912 675330 685287 694221
50988 694221 701611 707206 711599 715886 720488 724866 728646 732437 737148 743001 749618 756697 764112 771660
50974 771660 779266 787351 796713 808226 822876 841704 865167 892778 923930 958876 998297 1041996
50962 1041996 1088768 1137742 1189190 1243719 1301178 1360724 1421464 1482459 1542333 1599497 1652848
50951 1652848 1701889 1746140 1784823 1817337 1843812 1864980 1881595 1894123 1902950 1908618 1911847 1913419
50939 1913419 1914064 1914178 1913410 1910663 1904843 1895697 1883838 1869992 1854437 1837100 1817772 1796071 1771531
50926 1771531 1744004 1713794 1681185 1646087 1608338 1568011 1525094 1479235 1430397 1379676 1328929
50915 1328929 1279603 1232319 1187542 1145975 1108026 1073396 1041592 1012634 986955 964735 945577
50904 945577 928728 913490 899505 886762 875272 864772 854916 845716 837497 830387 824100 818275 812760
50891 812760 807521 802559 798001 793976 790358 787051 784573 783830 784989 787055 788931 790526 792415 794841
50877 794841 797655 800937 805023 809970 815645 822309 830513 840272 850898 861923 873745 887101 902249
50864 902249 919002 937307 957462 979803 1004462 1031468 1061046 1093841 1130783 1172565 1219273
50853 1219273 1270727 1327208 1389621 1458919 1535692 1620322 1713109 1813897 1921875 2036099 2156065
50842 2156065 2281439 2411291 2543958 2677645 2810861 2942115 3069334 3189612 3299365
50833 3299365 3394865 3473145 3532911 3574641 3599715 3609453 3605077 3588433 3562377 3530220 3494887 3458747
50821 3458747 3424125 3393577 3369277 3352065 3341136 3334601 3330186 3325506 3318026 3305067 3283874 3251754
50809 3251754 3206533 3147339 3074912 2990861 2896537 2792835 2681086 2563723 2443796 2324124
50799 2324124 2207154 2095279 1990568 1894075 1805941 1726425 1656359 1596252 1545339 1502121 1465690
50788 1465690 1435956 1412607 1394537 1380547 1370053 1362700 1357714 1354151 1351466 1349210 1346376 1341782 1335298
50775 1335298 1328065 1321195 1314643 1307604 1299531 1290242 1279448 1266861 1252772 1237869 1222307 1205438
50763 1205438 1186748 1166745 1146609 1127162 1108510 1090548 1073453 1057607 1043252 1030452 1019333
50752 1019333 1010244 1003495 998872 995623 993231 992233 993935 999187 1007763 1019177 1033693 1052058 1074571
50739 1074571 1101068 1131814 1167638 1208894 1254851 1304505 1357591 1414315 1474457 1537313 1602336
50728 1602336 1669212 1737272 1805396 1872678 1938831 2003747 2067031 2128157 2186760 2242398 2294041
50717 2294041 2339937 2377931 2405960 2422531 2427035 2419762 2401723 2374637 2340939 2303398 2264585 2226808
50705 2226808 2192403 2163382 2140473 2122953 2109899 2101339 2097738 2098538 2101653 2104287 2103771 2097752 2084300
50692 2084300 2062205 2031046 1990935 1942537 1887339 1827489 1765175 1702319 1640709 1581908 1526931
50681 1526931 1476545 1432080 1395274 1366854 1345760 1330403 1320462 1316873 1320239 1329956 1344870 1364095
50669 1364095 1386965 1412682 1440409 1469381 1498700 1527198 1553781 1577870 1599437 1618788 1636305
50658 1636305 1652284 1667020 1681195 1695967 1712174 1729444 1746622 1763202 1779876 1797600 1816803
50647 1816803 1837839 1861468 1888258 1918034 1950663 1986936 2027688 2072253 2118821 2166411 2215498
50636 2215498 2266410 2318075 2368898 2418065 2465232 2509554 2549999 2586515 2620108 2651711 2681438
50625 2681438 2708791 2732737 2751136 2760438 2756558 2736590 2700442 2651512 2595811 2539758 2488137 2443678
50613 2443678 2407969 2382043 2366024 2358686 2357868 2361220 2366513 2371458 2373649 2370832 2361229 2343586 2316963
50600 2316963 2280584 2234084 2177962 2113695 2043347 1969167 1893434 1818204 1744780 1673691 1605539
50589 1605539 1541660 1483467 1431305 1384420 1342032 1303914 1269870 1239322 1211710 1186843 1164531
50578 1164531 1144228 1125441 1108287 1093369 1081271 1072352 1066676 1063790 1062849 1063430 1066089 1071714 1080310
50565 1080310 1090817 1102113 1113915 1126685 1141064 1157567 1176483 1197710 1220739 1245094 1270939
50554 1270939 1299100 1330297 1364262 1399749 1435477 1470895 1505851 1539727 1571391 1600143 1626423
50543 1626423 1651467 1676567 1702837 1731375 1763260 1799432 1840716 1887815 1941142 2000885 2067406
50532 2067406 2141322 2222997 2312310 2409304 2514603 2628507 2749849 2876520 3007218 3141886
50522 3141886 3280111 3419745 3557529 3690576 3816557 3932867 4036509 4124981 4196662 4250081
50512 4250081 4283335 4294713 4283719 4251169 4198463 4127217 4039621 3938771 3828419 3712553 3595316
50501 3595316 3481079 3374259 3278968 3198690 3135904 3091735 3066082 3058324 3067749 3092973 3131070
50490 3131070 3177598 3227406 3275048 3314669 3340364 3347229 3331918 3292357 3227702 3139193 3030542
50479 3030542 2906825 2772970 2633484 2492904 2355453 2224056 2100195 1984691 1878107
50470 1878107 1780458 1691360 1610824 1539382 1477085 1422813 1374965 1332551 1295268 1262922 1235307
50459 1235307 1212455 1194423 1180754 1170580 1163332 1158926 1157049 1156604 1156300 1155722 1155468 1156200 1157932 1160468
50445 1160468 1164205 1169973 1178146 1188342 1200064 1213121 1227098 1240880 1253163 1263272 1271124 1276732
50433 1276732 1280348 1282958 1285921 1289944 1294860 1300501 1307375 1316307 1327827 1341986 1358387 1376308 1395304
50420 1395304 1415916 1439325 1466164 1496155 1529134 1565729 1606554 1651359 1699724 1752122 1809454
50409 1809454 1871609 1937216 2004771 2073266 2141740 2208963 2273824 2335345 2392067 2442109 2484299
50398 2484299 2518746 2545668 2563974 2571592 2566971 2549677 2519666 2476827 2421672 2356088 2283029 2205660
50386 2205660 2127002 2050025 1977422 1911121 1852324 1802220 1762413 1734312 1718115 1712588 1715897 1726525
50374 1726525 1743349 1764941 1788933 1812109 1831127 1843229 1846379 1838972 1819747 1788233 1745243 1692817
50362 1692817 1633724 1570903 1506997 1443877 1382503 1323432 1267370 1214981 1166263 1120645 1077877
50351 1077877 1038424 1002742 970565 941328 915009 892174 873304 858514 847782 840946 837492 836871
50339 836871 839200 845195 855096 867919 882089 896581 911051 924860 936449 944023 946777 945279 940717
50326 940717 934131 926530 919311 913879 910627 908640 906731 904542 902471 900894 899899 899607 900131 901143 901867
50311 901867 901702 900592 898794 896669 894818 893938 894253 895328 896734 898574 901039 903758 906174 908567 912198
50296 912198 918158 926264 935254 943875 951693 959069 966710 975274 985145 996281 1008271 1020680 1033471
50283 1033471 1047093 1062093 1078736 1097019 1116713 1136744 1154333 1165267 1165927 1155565 1136718 1113490
50271 1113490 1089456 1066750 1046298 1028301 1012550 998713 986540 975777 966034 957001 948819 941983
50259 941983 936774 932929 930050 928190 927827 929316 932644 937789 945060 954906 967549 983005 1001298 1022325
50245 1022325 1045511 1069967 1095068 1120604 1146163 1170790 1193734 1215339 1236586 1257602 1277170
50234 1277170 1294007 1308080 1320164 1330377 1337755 1341085 1339488 1332052 1317695 1295982 1267790 1234807
50222 1234807 1198643 1160794 1123055 1087250 1054514 1025273 999902 978837 961902 947977 935497
50211 935497 922991 909133 892904 874107 853470 831972 810331 789285 769882 753036 738975
50200 738975 727417 718026 710381 703854 697974 692665 687753 682598 676851 671216 666643 662790 658217 652285
50186 652285 645974 640359 635050 628853 621545 614192 607867 602670 598036 593438 588678 583884 579482 575983
50172 575983 573655 572427 572022 572043 572042 571794 571577 571981 573379 575682 578586 581930 585807 590473 596137 602705
50156 602705 609799 617220 625398 635128 646701 659412 672073 683943 695067 705810 716234 725980
50144 725980 734633 742024 748195 753251 757456 761418 765959 771701 778953 788104 799999 815729 836085
50131 836085 861303 891250 925763 964766 1008007 1054621 1103068 1151821 1200180 1248050 1294869
50120 1294869 1339346 1380743 1419953 1458528 1496782 1533476 1567281 1597484 1622903 1641007 1649067
50109 1649067 1645964 1632283 1608957 1576634 1536366 1490094 1440037 1387989 1335392 1283659 1234051
50098 1234051 1187526 1144992 1107413 1075219 1047696 1023435 1001514 982054 965587 952132 941011
50087 941011 931405 922953 915846 910417 906598 903854 901698 900145 899450 899398 899136 897780 894966 890742 885236
50072 885236 878722 871748 864750 857530 849475 840400 830916 821883 813741 806451 799767 793273 786409 778881
50058 778881 771120 764146 758910 755841 754838 755378 756662 757956 759123 760801 763973 769234 776341 784302
50044 784302 792012 799013 805746 812982 821005 829410 837596 845188 852036 858076 863353 867971 871918 875096
50030 875096 877606 879788 881817 883478 884550 885225 885904 886750 887729 888981 890744 892876 894825 896217 897309
50015 897309 898771 901200 904989 910449 917853 927399 939254 953586 970453 989616 1010415 1031850 1052877
50002 1052877 1072841 1091699 1109777 1127399 1144884 1162745 1181516 1201204 1221051 1239875 1256441
49991 1256441 1269369 1276955 1277387 1269279 1252115 1226509 1194169 1157370 1118130 1077812 1037473 998267
49979 998267 961236 926814 894772 864638 836033 808826 783232 759712 738526 719443 702062
49968 702062 686324 672419 660316 649679 640261 631995 624669 617890 611581 606184 602096 599037 596251
49955 596251 593330 590693 589294 589891 592532 596658 601764 607987 615984 626164 638132 650824 663131
49942 663131 674438 684769 694447 703481 711250 716934 720287 721808 722142 721420 719131 714372 706284 694662
49928 694662 680377 664969 649652 634863 620764 607801 596487 586899 578705 571563 565313 560056
49916 560056 556278 554665 555417 557830 560771 563443 565562 567117 568373 569874 571986 574592 577585 581461
49902 581461 586856 593589 600807 608154 616170 625386 635670 646688 658349 670235 681097 689651 695765
49889 695765 700323 703956 706366 706948 705669 703203 700414 697688 694449 689302 681034 669687 656510 642748
49875 642748 628692 614011 598747 583742 570146 558766 549834 543156 538356 535051 532926 531698 531146
49862 531146 531334 532768 535996 540877 546400 551557 556341 561640 568110 575513 583296 591463 600453 610305
49848 610305 620387 630080 639389 648709 658090 666878 674033 678792 681197 682033 682119 681558 679740 676101 670750
49833 670750 664316 657300 649758 641602 633055 624775 617497 611545 606712 602630 599216 596728 595453 595407 596296
49818 596296 597740 599671 602590 607261 613906 621815 629985 638063 646353 655047 663820 672173 679769 686308
49804 686308 691543 695609 698988 701866 703796 704260 703260 701035 697419 691857 684039 674278 663400 652382
49790 652382 641871 631752 621343 610282 599058 588431 578692 569911 562578 557244 553590 550532 547414
49777 547414 544454 541809 538969 535592 532413 530607 530456 531259 532504 534534 537946 542823 548767 555338 562177
49762 562177 569004 575851 583219 591660 601045 610335 618197 623928 627832 630845 633751 636602 638606 638505
49748 638505 635209 628412 618802 607638 596050 584741 574343 565748 559683 555905 553146 550161 546803
49735 546803 543876 542058 541231 540890 540814 541078 541580 541976 542152 542483 543443 545070 547033 549210 552051 556284 562276
49718 562276 569719 577994 586826 596521 607478 619482 631556 642469 651276 657415 660582 660800 658565
49705 658565 654742 650198 645517 640979 636676 632605 628732 624999 621298 617468 613416 609222 605023 600768
49691 600768 596172 591031 585615 580599 576604 573829 572237 571965 573336 576456 581073 587002 594489 603865
49677 603865 614941 627039 639645 652782 666695 681322 696086 709946 721595 729944 734744 736697
49665 736697 736919 736349 735654 735395 736080 738124 741837 747216 753673 760186 765854 769964 771394 768407 759637
49650 759637 745263 726955 706837 686739 668091 651779 637879 625927 615650 607215 600767 596057
49638 596057 592674 590381 589057 588520 588548 588924 589378 589621 589488 588870 587492 585035 581518 577291 572529 567037
49622 567037 560830 554611 549326 545224 541667 537973 534287 531427 529904 529224 528340 526747 524879 523406 522527
49607 522527 522256 523019 525344 529006 533077 536887 540451 543797 546450 547939 548388 548297 548060 548028 548578 549657
49591 549657 550538 550611 550273 550553 552011 554428 557441 560848 564234 566905 568501 569395 570308 571762 573912 576576
49575 576576 579251 581376 582781 583827 585120 587294 590928 596196 602531 609063 615590 622744 630964 639722
49561 639722 648049 655472 661994 667449 671394 673543 673873 672359 669036 664352 659088 653868 649007 644802
49547 644802 641561 639249 637576 636599 636878 638679 641325 643754 645557 647143 648993 651158 653526 656213 659497
49532 659497 663557 668409 674010 680375 687690 696313 706533 718293 731290 745364 760548 776595 792611
49519 792611 807323 819728 829465 836733 842061 845998 848879 850851 852240 853772 856263 860150 865481 872231
49505 872231 880226 888640 895889 900331 901041 897766 890333 878510 862597 843881 824202 805007 786935
49492 786935 770232 755246 742339 731528 722510 715069 709214 704815 701348 698237 695375 693194 692225
49479 692225 692656 694173 696090 697686 698592 698907 698895 698711 698555 698909 700255 702491 704872 706732 708134 709724
49463 709724 711979 714776 717597 720054 722140 724075 725969 727670 728865 729230 728536 726786 724276 721365 718044
49448 718044 713964 708990 703566 698321 693485 688943 684705 680941 677602 674344 670965 667682 665002 663534
49434 663534 663813 665947 669425 673675 678907 685977 695297 706297 718201 730959 745071 760818 778029
49421 778029 796413 815742 835814 856488 877556 898230 916785 931032 939282 941017 937059 929402
49409 929402 920557 912473 905997 901426 899195 899584 902049 905615 910050 916118 924452 934600 945469 956330
49395 956330 967088 977794 988297 998376 1007936 1016923 1025050 1031654 1035926 1037440 1036443 1033495 1028900
49382 1028900 1022617 1014684 1005513 995740 986017 976976 969094 962438 956646 951337 946437 942154 938823 936863
49368 936863 936684 938393 941563 945380 949022 951987 954172 955685 956483 956183 954328 950852 946194 940977 935687
49353 935687 930629 925954 921639 917571 913723 910239 907352 905327 904402 904593 905600 907093 909042 911443 913736
49338 913736 914910 914457 912978 911599 910907 910673 910430 909930 909013 907358 904725 901444 898464 896710 896340 896731
49322 896731 897227 897761 898717 900446 903113 906793 911374 916458 921775 927701 935004 943966 954078 964701
49308 964701 975688 987135 998887 1010642 1022369 1034335 1046736 1059417 1071780 1082723 1090757 1094466
49296 1094466 1092949 1085982 1074101 1058751 1042121 1026368 1012807 1001795 993220 986899 982653 980237
49284 980237 979289 979273 979513 979429 978750 977484 975722 973503 970845 967819 964613 961405 958110 954497 950824 948147
49268 948147 947414 948213 948965 948593 947541 946876 946927 947246 947441 947396 946976 946270 946078 947553 951313 957411 966197 978548
49250 978548 994967 1014844 1036864 1059759 1082415 1103485 1121217 1133597 1138715 1135448 1124130 1106555
49238 1106555 1085101 1061864 1038422 1016003 995592 977965 963697 952994 945495 940579 938004 938016
49226 938016 940623 945073 950299 955692 961141 966507 971514 976210 981125 986647 992368 997323 1000974 1003857
49212 1003857 1007127 1011560 1017157 1023626 1030925 1039146 1048125 1057514 1067117 1076877 1086639 1096328 1106300 1117083
49198 1117083 1128672 1140472 1152146 1164117 1176932 1190391 1203621 1215863 1226897 1236872 1246071 1254861
49186 1254861 1263521 1272028 1280127 1287771 1295443 1303996 1314135 1326004 1339337 1354143 1371122 1391207
49174 1391207 1414703 1441218 1470540 1503200 1539936 1580871 1625457 1672843 1721540 1768539 1809254
49163 1809254 1838935 1854653 1856382 1846671 1829422 1808682 1787971 1770030 1756591 1748195 1744424 1744487 1747563
49150 1747563 1752629 1758439 1763983 1768931 1773461 1777794 1782116 1786775 1792253 1798952 1807124 1816864 1827978 1839997
49136 1839997 1852603 1865951 1880388 1895988 1912596 1930137 1948505 1967257 1985831 2004094 2022313
49125 2022313 2040558 2058484 2075756 2092323 2108218 2123410 2138061 2152650 2167737 2183818 2201433
49114 2201433 2221080 2242956 2267149 2294349 2326147 2364420 2410579 2465496 2529987 2605264 2692902
49103 2692902 2793743 2905663 3022155 3134424 3236597 3329313 3417428 3503349 3581969 3641450
49093 3641450 3669114 3658388 3612488 3542403 3460271 3372941 3280643 3180989 3073739 2962277 2852044
49082 2852044 2748542 2656206 2577694 2513490 2462340 2422300 2391478 2368035 2350082 2335941 2324461
49071 2324461 2315020 2307258 2300797 2295073 2289327 2282876 2275542 2267790 2260368 2253707 2247623 2241582 2235264 2228909
49057 2228909 2223110 2218298 2214473 2211390 2208926 2207201 2206427 2206731 2208037 2210019 2212249 2214551 2217260 2220946
49043 2220946 2225821 2231464 2237286 2243166 2249547 2256918 2265420 2274971 2285489 2296690 2307727 2317399 2324934
49030 2324934 2330456 2334584 2337745 2340084 2341834 2343407 2345005 2346429 2347400 2347974 2348501 2349302 2350489 2352036 2353924
49015 2353924 2356202 2358988 2362357 2366265 2370635 2375537 2381161 2387583 2394699 2402422 2410780 2419664 2428647 2437264
49001 2437264 2445436 2453499 2461708 2469732 2476607 2481258 2483289 2483312 2482353 2480819 2478254 2474170 2468847 2463101 2457451
48986 2457451 2451843 2445923 2439307 2431767 2423676 2416237 2410760 2407600 2406104 2405606 2406041 2407503 2409779 2412671
48972 2412671 2416362 2421055 2426448 2431901 2436999 2441692 2446077 2450285 2454377 2458049 2460696 2462117 2462949 2463985
48958 2463985 2465248 2466235 2466986 2468303 2470876 2474792 2480159 2487722 2498447 2512692 2530065 2549896 2571703
48945 2571703 2595428 2621483 2650423 2682333 2716622 2752552 2789760 2828093 2867202 2906724 2946815
48934 2946815 2988210 3031644 3077447 3125659 3176206 3228753 3282622 3337137 3392109 3447805 3504420
48923 3504420 3561715 3619260 3676928 3734888 3793072 3850913 3907787 3963579 4018569 4072773 4125630
48912 4125630 4176293 4224066 4268622 4310111 4349152 4386455 4422344 4456793 4489822 4521477 4551360
48901 4551360 4578661 4602930 4624506 4643933 4661319 4676592 4690003 4701841 4711861 4719533 4724750 4727760
48889 4727760 4728412 4726002 4719935 4710074 4696343 4678558 4656863 4631810 4603685 4572149 4536997 4498949
48877 4498949 4459164 4418090 4375283 4330335 4283478 4235126 4185170 4133057 4078487 4021852 3964005
48866 3964005 3905654 3847063 3788322 3729935 3673057 3619060 3568853 3522583 3479914 3440481 3404184
48855 3404184 3371205 3341782 3315966 3293632 3274698 3259119 3246545 3236139 3227071 3219174 3212961 3208999
48843 3208999 3207562 3208901 3213413 3221241 3231930 3244865 3259996 3277728 3298059 3320112 3342681 3365007
48831 3365007 3386891 3408401 3429806 3451649 3474431 3498113 3522108 3545817 3569064 3592044 3615066
48820 3615066 3638366 3661975 3685713 3709391 3733012 3756666 3780359 3804173 3828410 3853116 3877586
48809 3877586 3900948 3923385 3946110 3969867 3994046 4017720 4040917 4064168 4087367 4110038 4132478
48798 4132478 4155596 4179494 4203167 4225934 4248331 4271154 4294272 4316896 4338443 4358524 4376473
48787 4376473 4391625 4403914 4413655 4420801 4424845 4425373 4422261 4415363 4404312 4388605 4367610 4340543 4306833
48774 4306833 4266627 4220839 4170764 4117687 4062547 4005577 3946438 3885107 3822568 3760353 3699480
48763 3699480 3640206 3582578 3526657 3472160 3418477 3365477 3314062 3265673 3221288 3180932 3143986
48752 3143986 3109881 3078601 3050511 3025727 3003888 2984775 2968850 2956714 2948168 2942371 2938837 2937638
48740 2937638 2938487 2940378 2942558 2945257 2948950 2953355 2957840 2962499 2968027 2974465 2980761 2985722 2988937 2990549
48726 2990549 2990639 2989260 2986802 2983807 2980410 2976324 2971477 2966376 2961640 2957302 2952849 2947933 2942771 2937695
48712 2937695 2932601 2927109 2921203 2915374 2910115 2905556 2901678 2898446 2895558 2892404 2888713 2885123 2882703 2881909
48698 2881909 2882318 2883266 2884405 2885576 2886694 2888102 2890745 2895491 2902237 2909963 2917734 2925484 2933702 2942480
48684 2942480 2951047 2958277 2963628 2967527 2970773 2973641 2975735 2976723 2976881 2976625 2975701 2973278 2968897 2962833 2955301
48669 2955301 2945690 2933023 2917003 2898177 2877220 2854570 2830697 2806103 2780747 2753909 2725036
48658 2725036 2694498 2663223 2631764 2599956 2567274 2533194 2497393 2460004 2421719 2383513 2346375
48647 2346375 2311370 2279556 2251350 2226196 2203265 2182300 2163308 2145673 2128338 2110855 2093527
48636 2093527 2076283 2058159 2038406 2017629 1997330 1978508 1961135 1944824 1929620 1916084 1904664
48625 1904664 1894950 1885583 1875200 1863492 1851048 1838224 1824774 1810633 1796393 1782626 1769429 1757055
48613 1757055 1746363 1737977 1731509 1726354 1722793 1721466 1722135 1723971 1726834 1731213 1736820 1742382 1747093 1751295
48599 1751295 1755257 1758267 1759622 1759800 1759907 1760415 1761198 1762375 1764299 1766781 1768999 1770161 1769743 1767122 1761510
48584 1761510 1752474 1740315 1726023 1710996 1696510 1682977 1669820 1656453 1643298 1631438 1621431
48573 1621431 1612985 1605717 1599617 1594747 1591115 1589064 1589171 1591386 1594721 1598176 1601643 1605533 1609841 1614038
48559 1614038 1617641 1620351 1621661 1620842 1617456 1611600 1603564 1593535 1581775 1568899 1555806 1543356 1532113
48546 1532113 1522264 1513728 1506328 1499729 1493144 1485403 1475739 1464487 1452666 1440802 1428540 1415559 1402449
48533 1402449 1390355 1379946 1371153 1363811 1358153 1354584 1353315 1354403 1357955 1364015 1372302 1382177 1392783
48520 1392783 1402972 1410958 1414280 1410612 1399088 1381013 1359164 1336351 1314504 1294815 1278113 1264775
48508 1264775 1254632 1247530 1243993 1244935 1250591 1260156 1272720 1288202 1306950 1328560 1351560 1374191
48496 1374191 1394932 1411938 1422491 1423864 1415208 1398490 1377443 1355520 1334714 1315757 1298861 1284095
48484 1284095 1271370 1260294 1250143 1240034 1229390 1218341 1207531 1197415 1187869 1178560 1169500 1161094
48472 1161094 1153807 1147938 1143527 1140184 1137165 1133914 1130555 1127616 1125341 1123561 1122187 1121493 1121817 1123216
48458 1123216 1125542 1128633 1132399 1136890 1142258 1148377 1154516 1159730 1163610 1166280 1167646 1167128 1164367 1159780
48444 1159780 1154099 1147784 1141173 1134738 1128645 1122417 1115605 1108637 1102284 1096419 1089966 1082246 1073725 1065227
48430 1065227 1056938 1048545 1039935 1031343 1023152 1015841 1009832 1004940 1000186 994703 988744 983327 978843 974545
48416 974545 969523 963722 957743 952016 946589 941478 936779 932544 928933 926384 925118 924450 923174 920880
48402 920880 918394 916588 915200 913366 910974 908743 907056 905359 902873 899351 894954 889893 884461 878994
48388 878994 873428 867163 859744 851532 843487 836449 830828 826733 824050 822447 821498 820761 819721 817954 815572
48373 815572 813258 811605 810559 809670 808698 807733 806884 806133 805399 804569 803551 802452 801524 800803 800028 799104 798465
48356 798465 798699 799963 801923 804118 806146 807729 808824 809703 810867 812931 816438 821438 827349 833690 840897
48341 840897 849814 860428 871908 884072 897806 913422 929427 943628 954815 962761 967401 969094
48329 969094 969292 969895 972020 975977 982059 990588 1001584 1015114 1031626 1051279 1073487 1097923 1125332
48316 1125332 1156371 1190283 1225944 1263725 1305103 1350944 1401575 1458129 1522413 1595801 1679853
48305 1679853 1777696 1893327 2030093 2191797 2385275 2620406 2908738 3264871 3709021 4265483
48295 4265483 4958194 5808772 6835130 8045611 9435865 10999647 12739948 14645391
48287 14645391 16626771 18469209 19866678 20538053 20348059 19354138 17764061 15846966
48279 15846966 13850140 11951200 10249625 8783732 7553339 6536495 5701065 5014539
48271 5014539 4449865 3985147 3601148 3281355 3013305 2787704 2596492 2432894 2292453
48262 2292453 2172217 2068951 1979220 1900801 1832673 1773623 1721819 1675641 1634108 1596494 1562187
48251 1562187 1530837 1502147 1475738 1451560 1429935 1410727 1393074 1376501 1361623 1348979 1337862
48240 1337862 1327263 1317515 1309868 1304718 1301202 1298496 1296552 1295543 1295288 1295173 1293865 1289164 1279059 1263238
48226 1263238 1243213 1220971 1197904 1174844 1152324 1130632 1109958 1090508 1072165 1054341 1036672
48215 1036672 1019643 1003925 989294 974935 960634 946830 933483 919792 905301 890561 876298
48204 876298 862459 848473 834045 819377 804873 790896 777632 765125 753609 743655 735578 728681
48192 728681 721666 713920 705949 698469 691645 685441 680094 675722 671844 667802 663516 659405 655705 652235
48178 652235 648805 645547 642772 640661 639085 637616 635782 633467 631061 629110 627834 626996 626150 624886 622991
48163 622991 620623 618364 616928 616596 616900 616924 616012 614270 612465 611513 611968 613772 616244 618383 619457 619413
48147 619413 618690 617668 616486 615356 614703 614813 615538 616547 617739 619215 620992 622958 625048 627297 629760
48132 629760 632485 635486 638600 641475 643867 645951 648234 651169 654895 659234 663860 668518 673173 677990
48118 677990 683222 689091 695682 702824 710248 718016 726546 735901 745338 754083 762449 771611 782240 794036
48104 794036 806656 820291 834971 850057 864987 880020 895614 911496 926941 941691 956003
48093 956003 970046 983799 997365 1010814 1023864 1036172 1047799 1058982 1069656 1079624 1088911 1097472
48081 1097472 1104869 1110874 1116173 1121746 1127643 1133031 1137378 1140892 1143788 1145833 1146873 1147282 1147703 1148678 1150550
48066 1150550 1153301 1156490 1159736 1163236 1167368 1171907 1176145 1179683 1182492 1184305 1184637 1183418 1180853 1176645
48052 1176645 1170128 1161389 1151432 1140905 1129292 1115744 1100129 1082961 1064846 1046370 1028029 1009919
48040 1009919 991902 974220 957354 941075 924350 906600 888412 870566 853066 835733 819067
48029 819067 803720 789550 775958 762840 750443 738546 726575 714472 702772 691892 681940 673145
48017 673145 665817 659795 654464 649368 644338 639089 633396 627813 623535 621084 619487 617214 613796 610170
48003 610170 607593 606558 606783 607864 609614 611753 613655 614662 614627 613948 613163 612732 613086 614431 616364 618093
47987 618093 619247 620143 621105 621909 622206 622119 621922 621343 619657 616532 612486 608513 605393 603227 601413 599166
47971 599166 596296 593367 591001 589221 587631 586036 584569 583465 582965 583221 583959 584485 584377 584086 584437 585714
47955 585714 587613 589998 593189 597422 602408 607575 612572 617493 622815 629087 636493 644684 653167 661796
47941 661796 670688 679827 688924 697610 705506 712253 717778 722467 726834 730992 734624 737341 738893 739195
47927 739195 738403 736832 734528 731067 726100 719984 713545 707302 701241 695188 688979 682337 674985 667018
47913 667018 658872 650975 643642 637225 631990 627908 624859 622935 622151 621971 621625 620948 620559 621177 623065 626029
47897 626029 629557 633046 636446 640619 646483 653768 661248 668323 675611 683737 692338 700801 709354 718599
47883 718599 728334 737579 745743 753103 760040 766324 771379 774959 777323 778776 779225 778197 775302 770660
47869 770660 764768 758011 750473 742214 733448 724319 714747 704648 694162 683552 673016 662734 652921
47856 652921 643723 635183 627358 620268 613728 607515 601775 596942 593123 589927 587144 585207 584614 585175 586229
47841 586229 587439 588980 591057 593650 596712 600256 604180 608214 612030 615254 617480 618583 618996 619404 620181
47826 620181 621320 622747 624361 625778 626539 626735 627088 628164 629683 630864 631330 631504 632209 634086 637362 641982
47810 641982 647869 655104 663968 674861 688142 703974 722234 742569 764535 787624 811187 834573
47798 834573 857492 880108 902505 924105 943808 960709 974387 984553 990907 993649 993778 992304
47786 992304 989148 983297 974294 963226 951856 940929 929770 917586 904744 892485 881616 871830
47774 871830 862274 852483 842672 833415 825262 818553 813317 809194 805566 801881 797923 793724 789299 784584
47760 784584 779729 775230 771497 768297 764975 761281 757657 754555 751846 749263 747116 746109 746524 748096
47746 748096 750663 754460 759625 765832 772658 780044 788267 797684 808561 820850 833968 847162 860236
47733 860236 873619 887528 901370 914173 925260 934307 941155 945960 949226 951255 951775 950451 947471
47720 947471 943153 937257 929303 919511 908798 897769 886194 873593 859887 845352 830379 815469
47708 815469 801142 787655 775111 763879 754543 747260 741624 737342 734637 733710 734213 735656 738001 741420
47694 741420 745726 750563 756024 762574 770390 779219 788924 799713 811743 824810 838561 852679 866723
47681 866723 880103 892464 903877 914450 923925 931872 938132 942835 946090 947858 948078 946717 943742
47668 943742 939199 933288 926140 917590 907321 895266 881724 867167 852127 837189 822797 809005
47656 809005 795688 783111 772024 763011 755919 750081 744869 739856 734754 729658 725282 722550 721847 722897
47642 722897 725365 729214 734308 739981 745309 749757 753490 757120 761209 765851 770644 775232 779893 785337
47628 785337 791847 798992 806436 814720 824817 837101 851225 867047 885191 906448 930815 957310
47616 957310 984554 1011419 1037235 1061578 1083821 1102871 1117424 1126521 1129896 1127787 1120557 1108497
47604 1108497 1091810 1070701 1045522 1016899 985617 952421 918002 883162 848829 815865 784887
47593 784887 756206 729728 705000 681728 660383 641957 626847 614176 602501 591103 580326
47582 580326 570847 562981 556607 551259 546153 540580 534679 529602 526471 525188 524572 523657 522537 521808 521574
47567 521574 521330 520687 519745 518685 517366 515593 513636 512137 511487 511487 511651 511685 511637 511739 512173 512848 513325 513092
47549 513092 512032 510521 508969 507426 505811 504353 503503 503376 503517 503332 502639 501728 501014 500682 500599 500446 500001
47532 500001 499325 498642 498095 497755 497833 498602 499926 501080 501376 500971 500782 501484 502798 503853 504101 503640 502820 501887
47514 501887 501100 500875 501528 502917 504587 506210 507717 509036 509985 510507 510781 510919 510753 510144 509281 508424 507492
47497 507492 506230 504790 503704 503238 503084 502865 502618 502513 502367 501806 500849 500073 500174 501504 503972 507158 510479
47480 510479 513365 515446 516709 517603 518866 520886 523209 524979 525981 526854 528068 529216 529820 530364 531798
47465 531798 534166 536486 538028 538985 539695 539937 539357 538036 536264 534306 532742 532404 533369 534521 534880 535034
47449 535034 536403 539309 542788 546396 551150 558152 566999 576313 585402 594752 605074 616656 629699
47436 629699 644563 661287 679274 697951 717619 739189 762986 788135 813210 837105 859046
47425 859046 878196 893873 906167 915715 922631 926120 925414 920728 912944 902714 890366 876384 861302
47412 861302 845168 827727 809346 791239 774534 759474 745715 732999 721226 710248 700123
47401 700123 691404 684675 679749 675711 671930 668671 666476 665195 664136 663217 663424 665734 669761 674038 677674
47386 677674 681220 685695 691248 697283 703541 710382 717932 725464 731834 736304 738930 740395 741462 742215
47372 742215 741797 739211 734433 728377 721752 714428 706021 696602 686449 675561 663926 651967 640216
47359 640216 628630 616733 604475 592541 581632 571710 562188 552739 543697 535662 528864 523071 518040
47346 518040 513849 510624 508106 505726 503076 500161 497254 494785 493251 492886 493309 493835 494245 494979 496496
47331 496496 498754 501425 504257 507063 509757 512643 516276 520649 524777 527486 528504 528538 528453 528694 529300 530085
47315 530085 530782 531237 531379 530970 529680 527667 525727 524480 523710 522919 522221 522161 522848 523956 525469 527716 530564
47298 530564 533387 536099 539606 544730 551116 557688 563957 570377 577561 585558 593923 602197 610285 618504
47284 618504 627220 636291 644988 652689 659541 666191 672893 679253 684879 689894 694527 698489 701264 703027
47270 703027 704744 707044 709285 710213 709500 708161 707315 706945 706169 704489 702433 701044 701060 702608 705449 709367
47254 709367 714256 719770 724899 728082 727881 723575 715233 703641 690353 677421 666544 658306 652293
47241 652293 647839 644535 642300 641233 641346 642344 643880 646174 649969 655532 662032 668421 674684 681626 689579
47226 689579 697988 706281 714482 722751 730893 738640 745988 752912 759058 764032 767754 770228 771186 770266 767486
47211 767486 763337 758473 753363 748087 742395 736089 729366 722630 716020 709434 703087 697635 693560 690753
47197 690753 688941 688195 688695 690281 692617 695672 699647 704505 710020 716410 724506 734952 747349 760515
47183 760515 773669 787151 801816 817896 834750 851727 868847 886441 904404 922137 939059
47172 939059 954841 969237 981996 992880 1001525 1007472 1010712 1012030 1012349 1011810 1009970 1006805 1002775 997896
47158 997896 991521 983401 974348 965364 956585 947546 938132 928777 919949 911926 904901 898932 893895 889735
47144 889735 886571 884353 882775 881842 882187 884338 887906 892012 896325 901166 906685 912446 917823 922319 925435
47129 925435 926736 926206 924223 921024 916401 910064 902086 892943 883263 873535 863891 854105 843937 833399
47115 833399 822602 811574 800507 789927 780257 771245 762236 752955 743673 734653 725911 717638 710310
47102 710310 704101 698520 692952 687408 682472 678678 676080 674333 673008 671900 671208 671342 672484 674378 676583
47087 676583 678882 681389 684349 687828 691548 695017 698043 701108 705054 710277 716300 722126 726886 730185
47073 730185 732185 733501 734810 736247 737287 737467 737105 737005 737436 737813 737614 737336 738101 740395 743640 747121
47057 747121 750818 754978 759311 763276 767086 771674 777395 783360 788492 792846 797406 802844 809019 815546
47043 815546 822264 829048 835662 842063 848540 855325 862305 869336 876678 884794 893679 902570 910532 917348
47029 917348 923731 930492 937581 944143 949540 953919 957598 960215 960914 959322 955967 951745 947260 942683
47015 942683 937952 932920 927482 921685 915758 910062 905043 901040 898007 895554 893409 891647 890328 889171
47001 889171 887955 887034 887076 888379 890829 894384 899138 904893 911205 917956 925442 933726 942298 950541 958276
46986 958276 965746 973369 981559 990415 999443 1008043 1016470 1025875 1037063 1049540 1062164 1074411 1086575
46973 1086575 1098883 1110910 1121877 1131295 1139297 1146517 1153558 1160364 1166268 1170826 1174384 1177523 1180142
46960 1180142 1181636 1182024 1182389 1183906 1186625 1189502 1191581 1192931 1194480 1197176 1201337 1206620 1212361 1217958
46946 1217958 1223201 1228362 1233882 1239874 1246137 1252694 1260020 1268429 1277527 1286704 1295978 1305746 1315756 1325009
46932 1325009 1332925 1339961 1346665 1352654 1356972 1359013 1358500 1354986 1348184 1338716 1327765 1315851 1302550
46919 1302550 1287613 1271739 1255886 1240297 1224695 1209146 1194206 1180286 1167413 1155742 1145898
46908 1145898 1138476 1133357 1129903 1127904 1128108 1131576 1138550 1148144 1159148 1170980 1183863 1198375 1215049
46895 1215049 1234199 1255727 1278954 1302840 1326550 1349795 1372557 1394522 1414919 1433097 1449222
46884 1449222 1464203 1478633 1491898 1502705 1510601 1516609 1522137 1527545 1532159 1535429 1537578 1539196 1540827
46871 1540827 1543177 1547163 1553285 1561125 1569893 1579388 1590094 1602338 1615764 1629814 1644408 1659815
46859 1659815 1675944 1692027 1707116 1720699 1732746 1743303 1752195 1759112 1763856 1766468 1767104 1765746 1762078
46846 1762078 1755907 1747790 1738999 1730506 1722112 1712976 1703014 1693402 1685545 1679947 1676353 1674534 1674450 1675778
46832 1675778 1677941 1680724 1684496 1689634 1696018 1703296 1711401 1720552 1730841 1742050 1753714 1765138 1775417
46819 1775417 1783775 1789997 1794322 1796900 1797550 1796175 1793110 1788794 1783285 1776456 1768571 1760225 1751598 1742246
46805 1742246 1731932 1721316 1711331 1702052 1692686 1682687 1672430 1662659 1653740 1645732 1638779 1633007 1628126
46792 1628126 1623612 1619412 1616235 1614958 1615772 1617996 1620691 1623387 1626246 1629652 1633815 1638701 1644061 1649397
46778 1649397 1654184 1658406 1662712 1667713 1673256 1678752 1684062 1689586 1695526 1701682 1708133 1715460 1723911 1732860
46764 1732860 1741629 1750493 1760340 1771603 1784057 1797482 1811861 1826884 1841824 1856195 1870170 1884207
46752 1884207 1898452 1912657 1926409 1939279 1950892 1960945 1969191 1975457 1979865 1982918 1985116 1986472
46740 1986472 1986661 1985679 1984163 1982992 1982664 1983068 1983667 1983991 1984138 1984805 1986653 1989581 1992833 1995765 1998357 2001040
46724 2001040 2004268 2008284 2013040 2018193 2023287 2027899 2031526 2033499 2033323 2031045 2027006 2021265 2013570 2003877
46710 2003877 1992503 1979711 1965526 1950076 1933734 1916710 1898826 1879912 1860158 1839811 1818690
46699 1818690 1796347 1772689 1748324 1724298 1701490 1680075 1659546 1639414 1619906 1601737 1585250
46688 1585250 1570132 1556002 1542812 1530522 1518829 1507533 1496797 1486769 1477328 1468531 1460909 1454878
46676 1454878 1450178 1446390 1443607 1441972 1440939 1439819 1439062 1440040 1443412 1448430 1454237 1461055 1469481 1479082
46662 1479082 1488495 1496837 1504491 1512440 1521206 1530505 1539643 1548038 1555444 1561759 1566754 1570156 1571988 1572527
46648 1572527 1571874 1569909 1566931 1564039 1562412 1562335 1563360 1565340 1568886 1574751 1583140 1593783 1606348 1620591
46634 1620591 1636351 1653627 1672461 1692509 1712823 1732304 1750326 1766787 1781598 1794321 1804238
46623 1804238 1810649 1813127 1811679 1806735 1798878 1788497 1775710 1760569 1743316 1724430 1704467 1683802
46611 1683802 1662544 1640748 1618717 1596989 1576038 1556143 1537598 1520826 1506159 1493628 1483004
46600 1483004 1473789 1465032 1455579 1444957 1433958 1423971 1415762 1409145 1403554 1398393 1392919 1386522 1379414
46587 1379414 1372564 1366591 1361070 1355156 1348530 1341443 1334289 1327595 1322064 1318027 1314954 1311996 1308919 1306089
46573 1306089 1303739 1301839 1300675 1300831 1302300 1304099 1305164 1305407 1305629 1306545 1308147 1309867 1311201 1312214 1313486
46558 1313486 1315458 1317848 1319939 1321486 1323048 1325316 1328398 1332014 1336136 1341062 1346891 1353171 1359252 1364955
46544 1364955 1370881 1377971 1386682 1396608 1407045 1417877 1429708 1443166 1458359 1475009 1492805 1511485
46532 1511485 1530941 1551502 1573788 1597917 1623039 1648054 1672770 1698012 1724525 1752070 1779713
46521 1779713 1806727 1832945 1858299 1882372 1904594 1924747 1942957 1959184 1973062 1984460 1993872
46510 1993872 2001780 2007848 2011276 2012001 2010973 2009121 2006602 2003344 1999708 1996063 1992125 1987349 1981804 1976065
46496 1976065 1970243 1963661 1955613 1946085 1935594 1924566 1912963 1900309 1886010 1869738 1851488 1831253
46484 1831253 1808914 1784665 1759209 1733141 1706340 1678360 1649287 1619728 1590182 1560971 1532693
46473 1532693 1506041 1481098 1457474 1435293 1415424 1398493 1384286 1372438 1363065 1356293 1351844 1349689
46461 1349689 1350575 1355070 1362403 1371088 1380607 1391668 1404761 1419213 1433940 1448457 1462730 1476556
46449 1476556 1489578 1501667 1512809 1522719 1530956 1537372 1542151 1545366 1546836 1546546 1544988 1542838 1540351
46436 1540351 1537288 1533456 1529089 1524594 1520184 1516106 1513040 1511768 1512275 1513661 1515266 1517648 1522071 1529259
46422 1529259 1539080 1551282 1565996 1583453 1603666 1626595 1652232 1680323 1710258 1741499 1773990
46411 1773990 1807969 1843501 1880250 1917507 1954307 1989749 2023408 2055288 2085263 2112758 2137089
46400 2137089 2157935 2175265 2189013 2199101 2205654 2208977 2209375 2207138 2202568 2195747 2186421 2174323 2159508
46387 2159508 2142167 2122378 2100539 2077968 2056455 2036973 2019212 2002568 1987148 1973473 1961681
46376 1961681 1951712 1944174 1940329 1941001 1945941 1954506 1966603 1982585 2002579 2026436 2054395 2087228 2125481
$$ [...]
##END NTUPLES=NMR SPECTRUM
##END=
