
##TITLE=UV1202_M3_1292-1211_7185555_A9px6Ysfh0
##JCAMPDX= 6.0         $$ Bruker NMR JCAMP-DX V2.0
##DATA TYPE= NMR SPECTRUM
##DATA CLASS= NTUPLES
##ORIGIN= BRUKER
##OWNER= Administrator
$$ 1.72 TOPSPIN		Version 2.1
$$ 2012-12-06 01:09:19.081 -0500  Administrator@X
$$ Compression mode = diff/dup
##.OBSERVE FREQUENCY= 400.02188249412
##.OBSERVE NUCLEUS= ^1H
##.ACQUISITION MODE= SIMULTANEOUS (DQD)
##.ACQUISITION SCHEME= undefined
##.AVERAGES= 8
##.DIGITISER RES= 22
##SPECTROMETER/DATA SYSTEM= spect
##.PULSE SEQUENCE= zg30
##.SOLVENT NAME= COFFEE_meoh
##.SHIFT REFERENCE= INTERNAL, COFFEE_meoh, 1, 14.98509
##AUDIT TRAIL= $$ (NUMBER, WHEN, WHO, WHERE, PROCESS, VERSION, WHAT)
$$ ##TITLE= Audit trail, TOPSPIN		Version 2.1
$$ ##JCAMPDX= 5.01
$$ ##ORIGIN= Bruker BioSpin GmbH
$$ ##OWNER= Administrator
$$ $$ E:\/data/COFFEE/nmr/UV1202_M3_1292-1211_7185555_A9px6Ysfh0/10/pdata/1/auditp.txt
$$ ##AUDIT TRAIL=  $$ (NUMBER, WHEN, WHO, WHERE, PROCESS, VERSION, WHAT)
(   1,<2012-12-06 01:09:10.925 -0500>,<Administrator>,<X>,<go>,<TOPSPIN 2.1>,
      <created by zg
	started at 2012-12-06 01:08:04.534 -0500,
	POWCHK enabled, PULCHK disabled,
       configuration hash MD5:
       86 BA 57 50 F2 9D 5C 9B 26 00 A9 28 5F 66 2E 89
       data hash MD5: 64K
       58 7A 0E C6 BB 64 AC E2 98 4D 2E 0B 8E CA B1 26>)
(   2,<2012-12-06 01:09:14.050 -0500>,<Administrator>,<X>,<proc1d>,<TOPSPIN 2.1>,
      <Start of raw data processing
       efp LB = 0 FT_mod = 6 PKNL = 1 PHC0 = 0 PHC1 = 0 SI = 32K 
       data hash MD5: 32K
       5D DE E5 C9 8C 0B 23 CA B9 E2 37 E1 81 2B 43 62>)
(   3,<2012-12-06 01:09:14.503 -0500>,<Administrator>,<X>,<proc1d>,<TOPSPIN 2.1>,
      <pk PHC0 = 97.41577 PHC1 = 0 
       data hash MD5: 32K
       2D 45 A8 86 6D D6 AD CF 6C 81 6C 30 88 F5 80 05>)
(   4,<2012-12-06 01:09:14.753 -0500>,<Administrator>,<X>,<proc1d>,<TOPSPIN 2.1>,
      <abs ABSG = 1 
       data hash MD5: 32K
       BD 13 95 B3 35 88 DC EB E2 E7 4A F7 42 BC BF F1>)
(   5,<2012-12-06 01:09:14.909 -0500>,<Administrator>,<X>,<proc1d>,<TOPSPIN 2.1>,
      <abs ABSG = 2 
       data hash MD5: 32K
       B2 1C 2E 8C A6 FE 10 CA 79 56 7A 7B 89 C5 0D 5E>)
(   6,<2012-12-06 01:09:15.050 -0500>,<Administrator>,<X>,<proc1d>,<TOPSPIN 2.1>,
      <abs ABSG = 3 
       data hash MD5: 32K
       2D A4 17 51 1D 7A 0B 3C BE CF BB B3 26 9A 17 36>)
(   7,<2012-12-06 01:09:15.191 -0500>,<Administrator>,<X>,<proc1d>,<TOPSPIN 2.1>,
      <abs ABSG = 4 
       data hash MD5: 32K
       39 CA CB 8E F4 5A 26 C3 48 39 7A 22 31 FE 7D 16>)
(   8,<2012-12-06 01:09:15.347 -0500>,<Administrator>,<X>,<proc1d>,<TOPSPIN 2.1>,
      <abs ABSG = 5 
       data hash MD5: 32K
       44 FF C8 27 CE 77 7D 28 D5 4A 49 BD C0 2E 3A 88>)
$$ ##END=
$$ 
$$ $$ hash MD5
$$ $$ 92 70 01 72 CF 75 9E 6A 57 EB 12 C3 4E 01 8D 09
##$RELAX= 
##$RELAX= 
##$RELAX= 
##$RELAX= 
##$RELAX= 
##$RELAX= 
##$RELAX= 
$$ Bruker specific parameters
$$ --------------------------
##$DU= <E:\>
##$EXPNO= 10
$$ [...]
##$TP= (0..7)
150 150 150 150 150 150 150 150
##$TP07= 0
##$TPNAME0= <>
##$TPNAME1= <>
##$TPNAME2= <>
##$TPNAME3= <>
##$TPNAME4= <>
##$TPNAME5= <>
##$TPNAME6= <>
##$TPNAME7= <>
##$TPOAL= (0..7)
0.5 0.5 0.5 0.5 0.5 0.5 0.5 0.5
##$TPOFFS= (0..7)
0 0 0 0 0 0 0 0
##$TUNHIN= 0
##$TUNHOUT= 0
##$TUNXOUT= 0
##$USERA1= <user>
##$USERA2= <user>
##$USERA3= <user>
##$USERA4= <user>
##$USERA5= <user>
##$V9= 5
##$VALIST= <valist>
##$VCLIST= <CCCCCCCCCCCCCCC>
##$VD= 0
##$VDLIST= <DDDDDDDDDDDDDDD>
##$VPLIST= <PPPPPPPPPPPPPPP>
##$VTLIST= <TTTTTTTTTTTTTTT>
##$WBST= 1024
##$WBSW= 4
##$XGAIN= (0..3)
0 0 0 0
##$XL= 0
##$YL= 0
##$YMAX_a= 625771
##$YMIN_a= -533442
##$ZGOPTNS= <>
##$ZL1= 120
##$ZL2= 120
##$ZL3= 120
##$ZL4= 120
##$ABSF1= 14.98509
##$ABSF2= -5.573092
##$ABSG= 5
##$ABSL= 3
##$ALPHA= 0
##$AQORDER= 0
##$ASSFAC= 0
##$ASSFACI= 0
##$ASSFACX= 0
##$ASSWID= 0
##$AUNMP= <proc_prof1d_extract_pilot.lims>
##$AXLEFT= 0
##$AXNAME= <>
##$AXNUC= <1H>
##$AXRIGHT= 0
##$AXTYPE= 0
##$AXUNIT= <>
##$AZFE= 0.1
##$AZFW= 0.1
##$BCFW= 0
##$BC_mod= 0
##$BYTORDP= 0
##$COROFFS= 0
##$CY= 15
##$DATMOD= 1
##$DC= 0
##$DFILT= <>
##$DTYPP= 0
##$F1P= 0
##$F2P= 0
##$FCOR= 0.5
##$FTSIZE= 32768
##$FT_mod= 6
##$GAMMA= 0
##$GB= 0
##$INTBC= 1
##$INTSCL= 1
##$ISEN= 128
##$LB= 0
##$LEV0= 0
##$LPBIN= 0
##$MAXI= 10000
##$MC2= 0
##$MEAN= 0
##$ME_mod= 0
##$MI= 0
##$NCOEF= 0
##$NC_proc= -8
##$NLEV= 6
##$NOISF1= 0
##$NOISF2= 0
##$NSP= 0
##$NTH_PI= 0
##$NZP= 0
##$OFFSET= 14.98509
##$PC= 1
##$PHC0= 97.41577
##$PHC1= 0
##$PH_mod= 1
##$PKNL= yes
##$PPARMOD= 0
##$PPDIAG= 0
##$PPIPTYP= 0
##$PPMPNUM= 2147483647
##$PPRESOL= 1
##$PSCAL= 4
##$PSIGN= 0
##$PYNMP= <proc.py>
##$REVERSE= no
##$SF= 400.02
##$SI= 32768
##$SIGF1= 0
##$SIGF2= 0
##$SINO= 400
##$SIOLD= 32768
##$SPECTYP= <>
##$SREGLST= <1H.CDCl3>
##$SSB= 0
##$STSI= 32768
##$STSR= 0
##$SW_p= 8223.68421052631
##$SYMM= 0
##$S_DEV= 0
##$TDeff= 65536
##$TDoff= 0
##$TI= <>
##$TILT= no
##$TM1= 0
##$TM2= 0
##$TOPLEV= 0
##$USERP1= <user>
##$USERP2= <user>
##$USERP3= <user>
##$USERP4= <user>
##$USERP5= <user>
##$WDW= 1
##$XDIM= 32768
##$YMAX_p= 442320791
##$YMIN_p= -773154
##$CURPLOT= <Network HP LaserJet P1505>
##$CURPRIN= <$Network HP LaserJet P1505>
##$DFORMAT= <normdp>
##$LAYOUT= <+/1D_H.xwp>
##$LFORMAT= <normlp>
##$PFORMAT= <normpl>
##$SURQMSG= 1
$$ End of Bruker specific parameters
$$ ---------------------------------
##NTUPLES= NMR SPECTRUM
##VAR_NAME=  FREQUENCY,     SPECTRUM/REAL,   SPECTRUM/IMAG
##SYMBOL=    X,             R,               I
##VAR_TYPE=  INDEPENDENT,   DEPENDENT,       DEPENDENT
##VAR_FORM=  AFFN,          ASDF,            ASDF
##VAR_DIM=   32768,         32768,           32768
##UNITS=     HZ,            ARBITRARY UNITS, ARBITRARY UNITS
##FACTOR=    0.250966925370066, 1,           1
##FIRST=     8223.43324360094, 51732,        -77008
##LAST=      0,             -62749,          -75953
##MIN=       0,             -773154,         0
##MAX=       8223.43324360094, 442320791,    0
$$ Real data points
##PAGE= N=1
##DATA TABLE= (X++(R..R)), XYDATA
$$ [...]
23854 52267 -29071 105854 157352 203866 -224213 -201273 -42158 -381659 -32662 136663 429359
23843 429359 96771 -2130 -202196 111526 -48077 149987 150031 -5399 -223257 -88038 91215 -3431
23830 569453 111477 -24703 310105 216768 84113 115788 -15358 153132 -22395 -138454 246169
23818 52801 34126 236014 -117229 -86406 144645 137209 222776 -279039 34225 44396 165554
23807 165554 58950 193634 188862 -12283 -151825 -103965 -4283 -23632 -164544 108154 192670
23796 192670 216606 -104745 -180682 90362 51092 102703 -233897 -37418 -218361 156124 -71579
23784 166010 519629 -136378 95572 -162307 331694 152027 114360 161279 203970 -143419
23773 -15872 -320736 115148 -135602 122866 133661 -362493 184013 -306444 24178 -1700
23762 -170931 249867 56547 -205987 -275650 202162 87122 215660 -143961 -279167 86231
23751 -107375 37340 287233 -250580 50223 -237749 -127237 48161 -222003 179581 -55242
23740 264463 124614 154168 -260941 -138838 430 -254808 384657 32265 217852 115335
23730 115335 -140967 -114154 69870 -301229 -59697 253260 148232 63411 3553 94358 110135
23719 110135 66026 38160 -344416 -563851 -14071 -19724 -180143 -357774 -181066 -239486 104996
23707 46555 -363198 5813 -9262 208615 85991 -102696 140096 297295 -268995 -92623 -127704
23696 -127704 -206989 -304746 -354940 -17796 -438526 28353 -161514 11213 -38032 -69153 2868
23684 -183432 -75013 212268 -188239 -185054 29935 -37175 -99908 -205866 -39291 -11051 252813
23672 -50354 -24951 -286232 97734 41464 -288195 167494 -119940 35441 132613 -122583 48677
23660 -87574 -40518 86682 -34228 99940 -338987 110935 78736 -58522 24297 -63385 -144592
23649 -144592 202303 45107 -63766 -119495 -84676 447622 222085 31274 116844 175896 -119402
23637 -239440 7946 103419 -19219 -3306 163403 -153235 61178 241428 35618 -187509 152230
23625 -102325 -146524 -313560 919 240425 -224887 101460 233066 331604 -213657 15371 -184757
23613 134449 -38822 -105190 -51469 -217299 34629 -209993 -196093 -125798 -329893 -64435 -61135
23602 -61135 233860 90542 73514 7066 251821 -4562 -221616 -88168 313843 130118 -322706
23590 -111024 111113 -350457 -40070 -79865 -104065 -93271 -12951 119131 90415 54460 121812
23579 121812 -217475 -34144 -215024 -253979 -18646 67970 -35145 -41319 -54853 -94833 -324819
23568 -324819 236717 -134993 90244 77570 5009 229264 -89623 13076 -255749 47383 -40751
23556 48077 -131193 -92256 -279088 177711 -189017 -85016 -168116 -22515 129147 -214348
23545 -71674 164046 46859 -239933 73048 82619 -16811 -130694 364118 86572 -268430 -203078
23534 -203078 -9086 -346698 98823 -66126 -223004 -76532 -49928 88769 -256829 99017 -86935
23522 32359 97179 -42563 -85806 -297787 -287267 31921 156059 -347533 215317 -2784 -32647
23511 -32647 -356073 62997 -104401 66584 21055 41969 46818 -84476 23065 -294413 374293
23499 -293956 32477 -70891 -5337 11306 -377592 199778 -120258 28229 337677 97838 613
23487 -100907 -226517 428283 -93100 260366 -37956 144511 -122401 -154168 -59835 -257148
23477 -257148 -414240 90472 -164849 -90245 10142 175568 -97431 26306 -149574 -84526 -45683
23466 -45683 -115014 -152128 -15552 103537 100035 90395 -106157 138196 -217377 -237448 71524
23454 -78570 41363 213264 -364776 -160270 134847 -221184 -244266 -140105 231995 292352
23444 292352 -121859 93445 -184117 124777 -227671 7727 129647 397977 116838 222651
23434 222651 214662 24109 200248 -80157 -109171 220492 -260607 -43583 31139 -222377 -89495
23422 58147 -223137 -190320 -389567 -19899 546 -232124 65614 119016 214818 -11742 -195935
23411 -195935 -195647 -223666 64846 45951 192539 92099 170987 -22205 280133 -171545 -36962
23399 116474 -403367 -412054 -16756 6275 -8684 456664 -47162 -81635 13336 -251650 290135
23387 -108859 -215804 -215624 -80991 42491 69508 -2516 168236 219264 -170782 -273897 89668
23375 104912 5209 235673 55088 -70194 47846 67208 -536064 -136563 196185 79594 -53570
23363 -70323 219476 -310684 -208105 -54792 -148851 80767 18562 -191365 169316 -37199 -257865
23352 -257865 116435 125341 196227 -195325 387882 -290950 -38591 -8573 47702 163446 48372
23340 -391055 -128827 145096 -252218 151191 4906 18107 113662 -205900 -37994 28599 -324540
23328 168512 -152538 -41455 -93573 97448 -256668 -75377 -332625 -263040 -166652 290260 57012
23316 125420 74088 76234 -64227 161052 -423640 69807 -212957 -4116 79466 -45322 206158
23304 -105361 9910 -219204 -366241 372444 27779 81029 -43841 113834 -248884 -397868
23294 -397868 43254 -242199 62576 -157938 -255573 -10007 141902 81949 -23032 -7959 -67704
23283 -67704 34375 401 58457 337847 -274103 -27892 11728 512008 199730 -150154 220814
23271 -397155 -133679 -369255 -104392 1465 28893 34330 38023 -228068 -89463 -216379 -166703
23260 -166703 83042 103738 -44758 -206565 108234 -388108 -42685 -100627 60529 54320 -181950
23248 241633 90868 -32512 -244847 608202 -31539 17324 256486 -83862 215834 21145 -82687
23236 -66055 110251 -50949 -97007 -144913 -3489 -297403 -194660 25843 13850 64318 280782
23225 280782 20058 90935 -21071 -118431 -76474 197063 -532160 -198313 -150958 273849 -206749
23213 89830 18852 117953 110739 188709 -73512 -91943 -117769 86597 -97810 -157356 118898 -299223
23200 -38870 135314 60076 20013 62909 -240483 -344345 -20617 106015 -49414 -187924 248998
23188 -262377 -249139 -245876 -405151 333027 170898 -75084 -143501 94863 -67715 -23360 78799
23176 92315 -68264 -162737 25398 -119075 116085 -53587 32152 -442163 152065 -75860 37020
23164 164776 360648 -87068 65480 -163268 203208 116632 -272283 153160 201222 -149996
23153 -299388 -185408 -285312 151876 156856 -185382 251666 131825 143882 19207 167649
23143 167649 -141367 -174237 201759 204420 -193153 -154929 -294434 -62797 -58478 129768 -123597
23131 -117313 29546 -142064 -93873 -159541 -23381 148990 -16397 -699 -8641 104258 327221
23120 327221 -288421 -165205 -110972 -48230 -99167 -354223 -33207 59493 -3666 190557 80027
23108 -166239 10023 -125832 -32836 -2687 -186107 214748 99901 95492 2085 -39985 170500
23096 82002 424428 226866 -132343 -360189 -46598 23017 -305958 -147566 176592 -149180
23085 -95251 181222 120048 120728 -54862 164578 -211861 -158416 245143 61407 -344686 157111
23073 326792 -71401 72257 -230208 -208246 -184739 -174863 108354 -376832 -553747 123265 -41463
23061 -111933 -91993 -197984 93312 112160 -50521 -317140 293857 -71548 115331 -154098
23050 109264 -247941 197377 213579 55077 -7694 -238495 14224 -499672 -543377 262490 391759
23039 391759 -72619 123520 140381 -385992 270164 -188826 24141 -259793 -204098 -9226 154890
23027 -52299 345233 -43981 101613 193265 113849 61895 208271 544613 -10754 -129043 268731
23015 -10572 99013 -129734 -156448 17014 -216749 -293728 -723835 95998 55396 370337 -70640
23003 79803 -129896 12546 -135737 -354488 -272292 -17933 179251 -149288 -86906 189308
22992 63786 -248047 -17917 26424 -207152 34818 25002 103122 -102641 -64816 50318 130734
22981 130734 29323 -106530 264422 83199 -63871 -157867 134371 58843 -201661 47891 171936
22970 171936 -115432 -137883 -136294 -62071 -169421 -292658 472089 27726 -247305 -264976 -133989
22959 -133989 -209388 -113341 236877 -152179 59366 -131657 144026 -117352 -145032 175095
22948 119659 -59039 -42789 48715 -125918 -429435 -214987 -117569 -328202 42704 -219740
22937 -166516 133937 -27449 23457 -41904 125296 -255175 16885 -32288 141765 -68529 -95051
22926 -95051 59023 -113387 196434 322769 58813 -118358 146410 -84209 -135620 -106212 -398295
22915 -398295 41989 -17436 24524 145156 813 -232977 -445377 57643 212948 -156475 -112704
22904 -112704 -139704 -28400 53773 16962 77649 -18489 -405845 -24423 -72684 16389 23136
22893 23136 51924 -314765 -178721 76397 276679 358654 152725 157574 -29815 117228 -238464
22881 171727 330134 -365558 153258 -55695 -190723 -4897 -143192 -24732 363325 74521
22870 27071 291334 25970 -52705 77353 -218133 135816 120842 -233136 -69187 8065 46490
22859 46490 -205367 25017 -7671 43486 -25366 378494 -18065 14138 -280195 -284360 -335952
22848 -335952 -302829 -5096 -203409 5450 189126 -111727 76548 50320 -15183 -217103 -227089
22837 -227089 -49404 -187804 133463 -28757 -221229 -220139 -224071 22831 -117373 91246 -153495
22825 201634 23243 -210378 133934 36517 -1106 165469 -282003 14069 11942 -64031 -22438
22813 -109760 -121061 89714 -2100 126231 -311763 -159145 16567 30011 -154631 -71845 -104394
22802 -104394 -1195 81245 -65381 99477 210903 -100097 -246521 -137223 243363 278742 -92274
22790 -65932 -75784 -143040 415803 -361205 26287 5688 -125985 -208048 118185 -927 -101029
22779 -101029 -144635 -259993 -93123 -238971 -344465 -179289 99974 936 -31645 -4837 111421
22767 -162954 152405 191575 61691 221505 450723 161125 159466 -59489 -298794 -83256 -7841
22755 396834 232655 -267012 -33025 -148047 6110 24315 -417573 299205 168318 -36415
22744 -126702 -225573 -193483 -2636 -194124 304284 -142600 152039 -176365 -328207 268881
22733 -44534 -67765 75570 -163117 -337112 151493 198978 32593 217967 2608 -71743 -85433
22722 -85433 -115494 25589 -6182 -20039 367374 -460210 -268032 -112332 -113412 117509 -40078
22710 9207 -124344 -148748 230955 -216226 -39838 -361607 -231318 -21401 -234518 -3574 -98822
22699 -98822 -78331 -28358 207720 87638 -225093 166717 24550 -121458 -77744 -27713 83101
22687 87657 -65348 3732 129359 -437175 -762266 19616 -26882 77503 161419 204613 134096
22676 134096 52893 -415439 37524 -126435 -110112 -154299 62509 -87186 187364 -142870 -46219
22664 177371 73904 310861 -277889 -88111 -219926 -7384 106993 -14359 -267535 8448 114104
22653 114104 124947 143343 -202395 174205 81742 345273 -130559 -42820 202702 103022
22643 103022 -169765 -154081 366817 381532 150694 -222932 347487 -79293 -59257 249602
22632 -405725 51506 -35054 -95549 417957 88706 8528 246650 302719 -135384 -364724 177882
22620 6653 8620 -70380 4327 31921 -23742 -90560 -375105 34171 139405 -52115 82788 65283
22608 65283 314170 108590 -176511 -69331 134167 -48010 68075 69791 100027 -64784 -272943
22597 -272943 62085 -212826 141277 60410 -137399 -404917 -169983 -194851 102738 261081
22587 261081 -37369 -71527 -118826 284193 229335 -260117 41880 -152739 -49661 149370 90495
22576 90495 -174710 59801 -30210 154798 108121 -387290 94356 57003 37531 183709 178348
22565 178348 444891 76382 48961 -185358 -12740 172582 55873 3479 29133 -51924 -163391
22554 -163391 -108090 440 109833 -155467 -173796 -15657 20619 -124548 131107 117274 242249
22543 242249 104491 80318 160814 -228233 63339 230689 -176881 51945 27437 270602
22533 270602 132675 158055 140367 -162736 -96089 39760 -95162 59719 10202 -91479 -300163
22522 -300163 -53406 228528 11367 -146778 -378438 -39419 -271149 -329715 -280589 -437143
22512 -437143 -281223 -125778 -39509 -130874 25996 -136581 430715 171295 -202294 -198440
22502 -198440 -109288 -254799 91400 -171428 217490 -249658 43712 -111254 -155193 -240075
22492 -240075 -54309 -154316 -22552 88381 180889 -296174 96739 305635 -364215 -30250 112614
22480 163348 107914 133471 -68515 -42231 -2707 -184803 -96018 82717 148424 -157692 115027
22468 -277729 -152698 -29010 284449 -62982 63149 -186597 -384456 -49855 -11472 12320 405996
22457 405996 -306822 70471 2200 193589 288770 121493 -48632 307317 -137264 72595 46200
22446 46200 -81434 -102069 293919 -264971 191463 -112077 241596 389136 53857 -355653
22435 -57324 -276555 143708 133340 90954 125822 -21709 163628 -258291 -326284 71598 30141
22423 -202707 -230360 225722 -142436 -266889 -53385 -129857 -380388 99662 -382609 -241116
22413 -241116 -410652 -281397 94874 -290623 -61695 73652 221065 -25487 -212543 301775
22402 168867 104023 -166298 -315125 -203939 -195422 -153856 -205069 -206675 -96084 180929 -49398
22390 -119021 -59463 -39943 -173671 173462 -14369 -74906 -112711 1622 -179622 -183157 -298643
22379 -298643 233818 -174019 97467 47592 -136277 -261575 149378 9178 -334986 301745
22368 9747 -346869 -259148 -135984 48854 91908 -159884 -51206 110603 113859 -156589 -20996
22356 -124444 83035 -185936 -180960 -36711 35260 158072 246043 -97991 -18782 140469 -118912
22344 261676 230341 200311 -32642 155097 97195 171912 23677 -418182 -44103 31767 503245
22333 503245 -88769 -78353 131851 -282264 133730 -288501 -29274 305705 74040 -78715
22322 -68844 -68768 8668 14072 57011 188109 -185007 148317 -415801 297037 367065 -380189
22310 82237 7302 175891 -137259 -45485 -127850 -116805 151423 -127449 -324456 281955 -204872
22298 -33376 121268 147476 39311 -7420 212737 -231531 -417791 82745 6671 -16664 363330
22286 -127613 101571 -407806 -268276 -11213 57690 -7147 15761 37475 208376 -205959 -34276
22274 -40483 326894 -181959 -122155 -178773 310086 -187703 -9391 161298 -63258 245324 -33844
22262 -102162 -99758 8502 -275362 -266770 41232 125031 -138559 50912 146479 -357781 -665 -78033
22250 -78033 -103626 37531 258708 215766 211300 272549 125613 -88599 -211222 -517211 -163940
22238 -242561 -205975 131315 72227 46871 -170423 17667 49144 112380 -6630 -148741 -73167
22226 312458 146820 -89914 -147836 68019 -67665 -85034 30601 -35627 -192053 -78070 -58346
22215 -58346 -317137 117541 -53669 -100067 -49641 -67809 123090 -193559 -94181 -155082 -12735
22203 -204842 79232 -357726 -106790 -78342 69999 -77297 155562 187232 -28158 -171863 -302990
22192 -302990 -111944 106579 -293690 -229158 35499 -89897 107151 -136336 -50408 170403
22181 -36935 3352 -87974 -51426 -325973 -130020 113366 174082 -65953 1380 27894 137375
22170 137375 46376 112106 -43351 -92126 165228 191405 -170636 -127466 381034 291058 155783
22159 155783 -136398 -17897 395223 67642 -55127 150580 90191 124001 196150 -414763 131700
22147 67907 182417 21142 -109158 -164588 35880 50640 -168085 -151347 91609 -218127 -6384
22135 -38219 159378 80857 74442 -80540 -45369 -4947 49972 -135178 41245 -403351 193228
22123 34856 -266650 -21969 276780 11646 21711 249563 -281583 -144003 -5409 -72653 -284188
22112 -284188 -287261 -431291 264703 52615 -113163 258983 141005 152062 16979 5524 -260015
22100 122787 -329047 -144199 256046 -134116 -231344 229872 570266 25307 17761 -8764 239299
22088 -93202 -262442 232402 122416 -202215 -368434 -7482 84813 298977 -92521 -48647 -213233
22077 -213233 93442 -267417 122763 237511 -21965 116154 173590 -172769 89280 -355121
22066 78338 -297551 62010 -137368 -75740 -56790 78093 -228712 -142098 104188 -164524 -150718
22055 -150718 -421074 -3212 -173214 -23020 208889 187599 -240078 -85284 44748 118256 -420547
22043 -233756 -3800 -130768 194282 -10627 -184229 -254565 28359 -142689 -114399 -139844 59939
22031 -7992 -232942 -76253 -28563 104872 -75291 184658 211354 -117701 -107619 -111411 -364398
22020 -364398 180889 -136063 6720 -88876 -114271 7826 -1057 -196441 -308837 23144 153359
22009 153359 -39492 -60513 -223822 241342 591 139785 94843 -134806 -437874 18257 -13494
21997 -96674 77632 -14173 138788 -4154 379529 -377412 -137630 132449 -37864 165802 -76177
21985 -232796 -54359 -23255 -91728 -424600 71736 104872 126589 232561 -194574 279823 -123992
21973 -76206 -17049 224942 -73133 -420662 93448 -278388 42710 -101800 70811 -362078 96152
21961 -60122 -198072 99752 90392 -91266 -91179 -157405 31343 -106543 -232921 304446 184588
21950 184588 342570 -132868 158797 -14409 -56299 -97629 -80634 226866 82288 236780
21940 236780 -179946 -191398 85786 -90055 134538 -197374 -225036 237458 -102894 -47971
21929 -25050 61753 104963 -85861 -69364 40219 170441 -206260 101390 -146316 198615 -50415
21917 44244 -84009 160487 -218899 -191819 -174539 -91848 -47249 -1638 52340 1138 -289103
21905 -130126 -17012 -401482 -15121 -83238 62496 -129715 125497 -171939 360794 -229463
21894 171626 -162858 -206305 -33653 -265987 154682 19827 187965 211361 316044 508392
21884 508392 119936 -85054 112528 180294 84760 -57990 -229069 -67408 166410 -11751 -314879
21873 -314879 -140675 5525 69031 48448 316554 -21034 358371 -67577 -76819 193582 -30739
21861 -104696 -15354 139733 -49546 -142563 -60657 -102762 -273522 -67678 -363181 -123867 25268
21849 -31833 -107282 -507405 76912 9988 60236 -161440 -113051 108372 -194854 -205747 -178908
21838 -178908 122625 -177047 40946 -138214 21614 5885 -281357 -324880 -145155 203148
21827 -147201 -155874 -101767 73691 -126320 111767 -212545 -77370 85758 -74438 210677 114862
21816 114862 -281863 186332 94964 234708 60406 -93580 -107703 -167771 -105715 46806 112609
21805 112609 122686 79202 139386 122572 138269 -188078 -329389 33957 159274 150535 -20018
21793 -111109 148991 -71603 -241104 -259018 -522259 133586 179288 -292818 -77823 -91052
21783 -91052 163506 -287844 84198 203738 52392 257893 69834 -228351 -109475 32996
21772 -130363 56087 -97968 -558641 45444 -224660 220930 253011 -277466 -70763 -319351
21762 -319351 -146218 26204 -336845 -52092 -92677 -49240 -140853 -386255 -100423 264931
21751 -333743 -76536 -48567 283564 -156599 -99663 -150219 -15189 -191501 -51502 -34714 239369
21739 -183293 -44628 -145804 -316782 -103951 42153 -160197 75262 -265517 -115396 4014
21728 -11350 -231220 33318 147800 -199170 -56140 280684 -352529 35613 -77113 21305 -323190
21716 99354 -10057 3691 -67523 -204879 42541 -118903 -96855 -236151 16027 -200799 332012
21704 -65660 -368574 117435 110662 -100501 80713 -75702 239170 -400354 -292947 -271700 -67611
21692 -179632 144986 -74065 -187383 -142006 -44914 -245800 969 150676 -112257 144695 127104
21681 127104 -214582 184431 -24373 -269144 -192240 -2663 257017 -26944 18204 -376537 -223234
21670 -223234 -158631 274353 -397502 63024 -10778 -142333 -101765 -205652 126646 -532316
21659 -36892 -197823 273263 -46285 31541 -195288 41981 186789 -52234 -247870 -93344 8519
21647 -200848 -81927 -14079 -233194 258791 40976 -3379 -316673 -69829 6252 120135 -121088
21635 -57035 -48062 231551 -113942 244977 453919 368 -118326 -33107 375329 94193 353699
21624 353699 85487 -116417 -104803 -130021 290843 -216606 144130 -100824 95750 4390 -59235
21612 -43635 -73797 114898 62779 8236 -34388 -56890 113241 110167 211281 41758 72624
21601 72624 -224901 -334542 -38418 7235 74100 -8446 120874 -45148 -44452 -135376 -187392 -336976
21589 -336976 -90351 246536 173463 -25004 206523 -354492 -195939 -477801 87983 -12373
21578 160822 115454 -75263 36686 -205039 23221 216965 98228 -582086 -262856 155255
21567 98281 -31930 -207295 72322 -328241 12316 230059 -75374 423083 -175592 3431 -121267
21555 15344 253660 164947 144244 42286 236063 49045 46923 -24749 -227062 -100221 -157552
21544 -157552 79899 -436946 -14717 -130560 -24760 -25375 -462769 -226971 -140925 -149619 -38007
21532 515 75266 -197468 -194500 194606 -235 -97643 -109554 -48199 -183094 144925 -101376 -247400
21520 -247400 -64728 -207606 -213957 -186806 125697 6156 -234655 58423 228929 -9592 -188322
21509 -188322 -543960 -339600 -7689 23621 -59686 -83219 145120 -221762 384783 163468
21498 -43996 -130866 -158480 9136 -72703 51047 270714 -409316 -31603 -210206 -213526 -125208
21487 -125208 138871 -89523 12868 109919 98037 -20894 340215 -355648 -188116 -49944 90846
21475 8937 38614 -31930 -77620 -80291 180700 53755 69049 -39269 -25601 -141820 228385
21463 36137 216927 170598 -135598 -39060 55333 87780 57404 -89592 -397303 -84380 168901
21451 -164319 -225001 -9786 -204961 10177 -16701 66689 263170 -112725 19315 50954 -71261
21439 55759 240626 424419 70467 219765 228556 -90720 186707 -292352 76586 -114405 -15496
21427 16498 53470 58396 -209576 -112621 -53179 16975 68509 277790 -49529 -95063 -463989
21416 -463989 -246791 -118380 -150018 -121630 -2460 101290 235066 -282010 -140532 -243335
21406 -243335 52141 -52306 60239 144609 -242590 -47813 1144 -125460 -9641 -420480 -258119
21395 -258119 89818 7488 -60094 6653 68402 -54645 -264670 -11516 -49094 -241007 -279438
21384 -279438 50956 131109 -122436 8684 19764 -288345 -107197 77098 -88209 2152 -313739
21372 -81887 -124302 378659 -271648 -161012 16810 -58384 -157944 122824 -37607 -115585 -75796
21361 -75796 -91624 332332 -5389 -265110 33153 -92585 -25142 -408095 252315 168788 35278
21349 -294469 -26328 -62191 -198899 19395 -339348 455705 160788 -254307 -298752 -140537
21338 75013 -139645 -69106 -54355 62871 -40298 -424208 -129914 202355 -123704 107151
21327 -241402 -175204 -87251 -194135 8748 16085 69394 164596 387889 83327 -66657 -66225 -204109
21315 -204109 308465 -273157 53118 -207224 -18335 -170453 127333 -16699 277574 -246868
21304 4646 -266693 -54764 -4063 -111222 -215310 190146 -8482 78725 176129 -294624 -84769
21292 139764 74201 224510 -220885 -81277 206522 -143875 -48491 224307 -357850 -34162
21281 112665 -181889 181355 -46155 -285633 -71723 223330 13507 297160 317040 29148
21270 -287127 28091 59761 -55810 -159924 -156929 -179304 15749 -268787 -197108 -43826 -70270
21259 -70270 -197760 -121121 53902 -50197 88963 -126827 -219716 -99508 -116247 -79778 -39702
21247 91300 172577 -320989 74583 102547 -148085 278675 24636 -67188 -148298 -332694 276815
21235 133283 -117063 -147688 -83476 -1371 301924 117569 -129829 -116034 148038 -176102
21224 75058 142533 -125350 -143186 -96857 -197550 134786 150162 -192808 112263 123158 -343821
21212 -59328 161467 -197904 105417 -138286 -272002 278478 -188024 -363875 -338556 56394
21201 -190494 26873 -98373 -271412 -87232 198683 367770 -170755 106193 90898 -178333
21190 -379928 -74153 -48295 -232791 -86357 -325960 -291721 -92147 -48614 -154746 154942 -37263
21178 -56633 -356365 -369321 268055 70172 -74406 -186392 105388 -353132 -157063 232039
21167 -112541 8844 -39134 94758 -22654 -248681 -12344 -191498 -148283 -197045 97963 -49178
21155 -193166 124006 113201 384360 -95606 -132536 -238275 560060 10102 -639274 -209463
21144 25283 -366907 -204430 -252998 60046 -172124 110163 28126 -236222 149086 192464
21134 192464 -101065 -187255 -309820 -181539 -201755 -302883 136183 29980 -260012 37302
21123 145883 -17662 73838 260436 54900 -188245 -45206 4766 117138 65659 249199 -259779
21111 -99881 59077 266113 -183678 235920 -157956 -10378 232424 128232 12159 -494677
21100 -182756 417152 104579 208540 85964 102363 112682 195339 -133669 125311 -101565
21089 339111 -366809 -418729 97967 -177501 90527 441614 31585 23320 -17595 -107010 -252078
21078 -252078 -207080 -207949 -111657 17102 -66837 -12607 141787 96982 -41679 -322060 60655
21066 165108 -156741 -255827 231303 -154437 24352 16024 -263709 65804 -91960 -292637 94220
21054 -324951 -258446 -15074 -105773 161726 2832 -121213 100254 -39783 -76429 163290 304234
21043 304234 -57969 -163662 410060 -259467 185304 -150784 81162 -129640 207955 47558
21032 -88651 -116664 96497 -330653 -340387 -194140 -1497 -431092 52723 -132825 34747 113299
21021 113299 202960 167476 95190 -228610 -1899 177727 -42119 159182 150115 -164620 -301946
21010 -301946 69691 -29723 -14055 -342019 133119 -24434 -187495 -199725 86072 82589 -164246
20998 133621 -186870 113921 -13508 -98103 -61955 -181733 -81377 -80870 -254192 -256122 -264138
20987 -264138 -227795 -302757 -158369 50442 -127936 57781 -108402 -317765 -161183 -123926
20977 -123926 -123069 -122798 -137644 -75032 -340679 -116462 196546 -28352 -166821 -80679 -157943
20966 -157943 -119278 -64154 -254902 296188 51870 -3081 -357758 63312 -1934 -43031 113610
20954 -225290 -25980 -141292 -19975 -262882 138384 129775 103431 371359 -257011 -60808 60296
20942 -195750 -36050 98209 8587 -147635 -214136 32642 -9838 65843 -120220 46835 -14938
20930 -140170 -188602 39403 -71834 -126624 33109 -129159 -275448 -151308 120180 -30209 -7112
20918 -54332 -44198 246834 -115647 210489 -170815 -44667 5189 115982 112422 283034 -27074
20906 -153764 229977 43761 289721 -64250 -265803 38942 58446 -92973 -86280 -250674 18309
20894 -144911 51252 -36059 46178 169775 -133382 54321 1079 -130452 -73489 -20498 97783
20882 -163670 6713 -116165 -208890 48196 -283029 -107363 -147925 52677 31147 -295295 -227904
20871 -227904 -255210 49617 -361707 -322058 4153 -254994 -174346 56732 -120276 -69120 -101402
20860 -101402 -12899 -34307 157132 62943 -64259 -166971 41606 -78864 -210579 -13058 342862
20848 -130260 -104879 -1633 -116621 -10984 57201 26843 -128594 73309 136960 53830 190314
20837 190314 63638 -498358 -341459 -174523 -21116 78312 -42067 -32261 -73856 -235446 310152
20825 31081 -141664 127490 16082 -250818 -34250 -66828 -312586 -104053 -60629 -36510 -233276
20814 -233276 -101822 36245 -76692 -289680 -13792 -96503 162076 -83921 127528 -444505
20803 -43298 210517 208125 352029 -170059 -243053 115383 -170222 181406 29324 11405 201840
20792 201840 -174012 211843 -46972 -239095 -346360 -163733 60547 -182133 -68773 -139466
20782 -139466 77875 9098 -251239 -66950 6654 -100860 -107909 68203 -525928 -154042 299046
20770 -202714 -163594 -114917 182762 70946 -360967 -121040 -77869 -135067 28004 -65255 -131237
20759 -131237 59505 -7430 -176794 -137968 -48102 -72807 223983 -191286 162435 109409 18828
20747 -89299 178241 -194499 -45180 96840 -155103 -196182 -125256 72137 -276555 -241033 53512
20735 -28231 107346 -14775 -26032 31194 -4779 75446 162872 203336 94363 71769 99124 -172091
20722 40132 -201192 -78166 26747 126326 -191034 63110 136531 -273951 106676 -13685 -44831
20711 -44831 -238662 153262 -79566 128796 -14915 309418 -177118 -103118 -27132 167481
20700 -43528 -69128 -422586 -130948 -172676 -91397 -52631 149120 -78075 -259073 -193101 33833
20688 -68609 169117 -229224 -48006 58581 103167 -23903 68951 -39664 -372637 190523 -89795
20676 86659 46802 -87206 -227930 -141572 -135673 -99772 -192961 -39765 126965 91994 23470
20664 -201496 -119267 39174 -218583 -209581 -137128 -282937 80372 -37850 108165 -221746 -196557
20653 -196557 -225506 -80507 221419 124765 14247 -136793 198054 78287 -60072 212148 -334746
20641 -133975 -387501 -76032 -480674 -206572 -419561 -195842 38806 -73535 23578 -88799
20630 -262539 -91464 -406552 18686 -155468 155381 19923 70850 -222437 -74928 -110054 5972
20618 13555 -56540 -443997 -101494 -286342 87986 51166 -18940 340609 -285773 101101
20607 -40042 -84502 -237561 53816 173249 -207897 37411 50247 -263549 -280485 -68018 142109
20595 -59781 -261347 -164584 -36761 -59793 72056 52908 -76667 69824 403044 358373 -31705
20583 53039 262913 73294 -152571 -7486 -395029 -192319 482490 214641 162028 64937 -20607
20571 75668 57655 -93555 282264 -106289 -276760 -55254 8120 -6540 37026 -57148 121904
20559 -74272 325121 158916 -15940 -102919 526853 -134531 50206 -94535 51414 59640 -263801
20547 -28409 -80027 -208029 -56823 -281468 117084 84959 -83491 -102534 115816 19649 5285
20535 -246300 -9222 82471 -259092 -148351 231640 -79480 -167342 -127637 -57679 98531 143767
20524 143767 203954 -68928 -410951 -495071 98696 13882 227998 -387634 -113586 -578220
20514 -578220 149225 -193031 -260278 39048 -99198 -218185 340002 356565 -64867 -38063 -9269
20502 -289903 171660 -67853 -206932 268766 -42073 -154666 -25718 -47901 -411242 -215135
20492 -215135 -49295 -53330 -192086 -18185 292719 6857 -3654 3933 -358317 190980 16265
20480 36108 -485675 -42085 106512 48905 -61810 -136141 -183838 117192 32871 147321 28337
20468 -105934 -195450 -73502 105901 -243460 393696 -131860 -47747 -102819 -351662 35850
20457 61900 382231 -6361 -187582 -45135 243859 206598 6450 54973 -372634 -14405 -213445
20446 -213445 18658 317954 -142055 165866 163433 16012 -192331 -447466 -135062 -88497
20436 -88497 -41570 -57310 23790 -16963 342745 -10557 -174450 -67421 -328839 67643 -139089
20424 -195257 -73618 117137 189295 102855 -97523 71799 -331475 -88908 -73456 -201722 -104663
20413 -104663 -156665 -156370 49725 -285699 -130247 -343539 -125467 53315 -221107 -110493 -76901
20402 -76901 94383 -70770 116077 75249 -121514 -124262 -428841 111352 119564 215608 -293369
20390 -49127 -312948 -31939 87223 -244610 -93221 -12803 -265531 36125 171766 -112147 -23904
20378 2349 -338164 162854 -137034 175668 249478 -207454 382644 -118621 -12994 -256957
20368 -256957 -219698 -10225 -91743 -49532 21277 -117107 71469 -95843 222649 -1379 -79557
20357 -79557 -126606 114057 -17005 -188153 1353 100504 15023 -55721 275619 82197 55175
20346 55175 140877 -1589 131571 229228 -75899 -133485 -323772 18323 184145 117841 -183968
20334 -97408 -228918 -320297 -129492 157715 138412 -99046 -7709 173415 68512 66225 -121989
20322 217506 -441034 -40217 -67309 -103953 -114618 -253740 -274584 2855 -121609 -64546 -315342
20311 -315342 -125235 -232813 -231681 -195896 -240188 125503 400975 -64528 -10957 126076 -70892
20299 190864 -81421 -109346 -65194 129729 87732 -12845 -162244 139911 452108 -225188
20288 64006 -101756 -58059 -139727 54815 -346074 -354282 9541 -29410 -22836 -75213 122193 -72463
20275 61095 -63877 111382 -265998 80678 28977 -194237 48168 -42172 121344 185271 -328063
20263 -14300 -146013 -30731 -210089 -37195 -90798 115749 -230272 132683 178125 -218583
20252 -214570 207480 80425 89007 -306772 -34083 54775 -101379 101994 -229029 149853
20241 -345687 -256725 144077 -140913 3964 -144013 9936 -90303 -283560 -11134 -177342 -266904
20230 -266904 -284112 -27032 59098 9993 -28632 -303227 146287 -102125 -123903 -174560 -160993
20219 -160993 -144179 -109321 -180737 -28422 -127098 114149 -397748 90594 -159664 -326385 -30767
20207 -245140 -227763 -112768 165995 44647 193267 -956 -104979 84690 -192345 -108644 -79468
20196 -79468 -91348 -101381 -10226 -311979 -35450 67426 105294 -148808 -250558 -128362 -107482
20185 -107482 -180490 -156878 58999 -697246 138775 -202957 102292 -233805 -342135 147149
20174 94115 -418585 -94295 23896 -163440 -171335 -152378 185362 -111959 318598 48265 -10613
20162 163093 -161025 286080 -230552 -782 28361 -152817 -210611 -6000 -66053 -326730 -166040
20151 -166040 258928 -2938 -95063 49246 -103590 -16687 -17059 -244607 -113958 -5645 30906
20139 -68788 -110717 -171501 -9799 91962 313781 245043 -87733 -348362 207750 62509 115143
20128 115143 -50432 -183294 -308166 173339 -24302 -189312 -128286 -2154 -254457 20251 115676
20117 115676 -269422 -144596 -235316 -8231 -206723 -160780 -146710 -157031 -20465 36096 -96866
20105 -171505 9674 206854 84144 -173154 140374 -47161 -98068 87734 117551 -45466 7129
20093 -168818 -337321 -194011 5237 -250524 79327 -115171 -23436 -118109 -166473 -230740 114421
20081 -348 262215 -221280 166612 168316 -82501 73388 -82594 -316930 -91149 -39896 -164351
20070 -164351 -149035 -53727 23321 -139734 233727 -102018 25446 -303421 -78453 -21308 92494
20058 115016 -120581 -183745 156128 -113062 82751 204768 41518 -251575 15717 -256173
20047 92004 137564 16065 -104469 219185 -263137 244719 111059 294185 -28772 -213802
20037 -213802 -63213 -14961 -199645 -243605 118088 248660 -8647 166413 1551 -59988 -216768
20026 -216768 89848 68559 -100810 49593 -225166 165608 198451 137282 -196553 3444 141145
20015 141145 43908 -239897 -274752 71542 -117170 -151672 -41206 143416 302086 108393
20004 15648 -37879 107634 3782 -99339 127846 -48172 -78712 -8545 16549 -187224 -84238
19992 78149 21515 69583 -165067 -363252 -10644 -7887 58100 -42586 -300261 -164860 -121462
19981 -121462 -115635 261835 -59603 109797 -70246 -46983 -47809 -237172 -79730 -97194 3922 -21775
19968 70437 20073 -47291 -306962 -31389 -197756 -355548 -14603 -292241 -69957 7258 -74373
19956 36831 249575 -17535 -141739 -196128 239132 -172196 -268248 -220200 -338127 53105 -135973
19944 84049 42588 112387 -365673 82739 -246923 -340351 70842 154890 31216 -63859 -183237
19933 -183237 24287 -56908 -285905 214819 -304891 231131 -155202 150953 -43548 -171720
19923 -171720 13930 143244 -12479 227196 145592 -141506 -230162 -43221 122177 62373 31111
19911 -75889 37470 350945 -194431 -71636 -194879 -25902 52296 -113955 -4527 -305671 128816
19899 -154025 193204 -224720 -117449 47581 -317176 -90457 15435 -330194 -246871 -37100
19888 -193131 -242923 -196479 -412587 -346091 -62068 -27448 -287069 -29438 -300866 -74678 -202530
19877 -202530 -185354 -240841 -60145 -183938 -334337 189535 201335 -160562 -237164 -199708 -22974
19865 -43156 35929 -213042 46687 -319375 -92370 -198353 -237926 12651 142024 -69445 -231514
19854 -231514 -233789 -189151 -408028 -237309 -137450 60068 -178473 -83252 -301765 -209985 14724
19842 80739 146703 108055 -297212 -19877 82210 -175859 121989 130697 -219179 -360521 47489
19830 116324 252981 -280962 28855 -22681 -79285 -509768 -39532 184898 66923 -82866 111190
19818 -167254 -158956 30170 -14609 -400179 -445589 58035 113180 254907 75957 -157064 -166975
19807 -166975 -460222 -146787 150333 134437 296576 51809 -322815 114693 -13592 -81682
19797 -81682 43930 -62236 -404163 -218171 53011 141642 53473 7075 -120485 -47013 -62209
19786 -62209 -151587 -28042 -166805 136071 -1002 32627 149633 -347895 -183520 -26625 -243558
19775 -243558 -117827 -177760 -16669 -111757 148501 136311 -11416 125390 -178882 -23552 -197071
19764 -197071 -135563 -49066 192051 402659 21442 -120185 227743 -326344 94872 -57597
19753 -232702 196798 -622494 -45501 116733 -35004 -300863 136803 35602 127036 255994
19743 255994 23600 -39516 48966 -146878 89679 -21952 15119 -13954 -314052 -227094 -74499
19731 82836 -195681 -98380 130497 -153869 224190 19665 87162 -97673 79797 284073 -337553
19719 525474 183936 -329676 -203327 64096 -97251 -44033 -135482 -251759 -10731 299049
19708 -59770 48645 -97878 38491 -157474 -376222 -281595 -92008 -17344 98828 -9355 -9888 1139
19695 26209 -66703 2083 74108 -180994 -180963 -96769 121103 -85339 -2885 86240 -190061 -342723
19683 -342723 259742 191832 63243 107972 69621 -1693 10160 -224594 -47924 62793 -112153
19671 40827 -270300 -139040 -131269 63250 81718 105529 140907 106900 -5597 32653 -314383
19659 -27663 24423 -24797 46496 -296711 249884 -3885 -31609 -246416 13615 5395 -229091
19647 -294694 -223118 -279618 -141677 -231919 67478 -147374 -159536 -361239 -101474 -74473 177661
19635 184915 -63229 29917 153904 -182288 -37919 -489225 43964 257309 158876 -107667
19624 -225930 -286226 -4918 -147027 -105709 -330276 87277 -203883 -46270 -4083 14403 -72805
19612 -152418 -262510 -156754 81015 313538 89289 -16550 17351 16926 21485 -137703 43379
19600 -99238 27940 -209123 83732 51887 -183053 50711 140089 205613 -106687 165849 80516
19588 15412 -420514 107018 -260320 -142 326490 318922 -103167 -242309 203705 -92112 61093
19576 157984 -320171 -354173 -9080 127380 15385 -153335 -54643 448842 -26795 -122760 -56406
19564 143554 167637 -40394 -271198 -374309 14038 -30748 138448 28811 -108923 -25459 196059
19552 -292389 -132456 -205435 -28163 54027 148747 -183206 236436 -19608 -122321 208493
19541 -17644 44914 -396264 -298219 -180904 -80171 -82016 79482 66519 188365 -108960 166247
19529 101197 15739 -43659 -77453 91741 -109077 -56233 86799 -153459 -278050 -161845 79973
19517 -38983 -86752 -160410 149160 81005 -184120 85018 70503 -348531 -105163 -139068 222766
19505 -174390 -242872 432764 83330 100522 -99559 -149558 287043 -102335 99608 -266435 -475497
19494 -475497 119986 126737 -250833 244979 65422 -29286 -150677 149564 -120899 -50332
19483 -131370 -124162 34654 -197183 2922 -126769 31291 -116779 -111318 250281 -65980 225973
19471 120802 37414 20871 -82978 106223 -118734 -146452 -225142 -315554 -166811 -423728 -368576
19460 -368576 -5901 375391 -82598 -117882 -3462 -44595 -313294 -281098 115960 -324771 340590
19448 60711 -509402 -88546 -183999 -92592 189759 33522 -213605 -4173 -318392 -2929 -284363
19437 -284363 -7262 -214340 49140 94133 -64005 -94473 -157446 12677 -161909 172594 -196074
19425 -61963 96974 11320 68272 218147 -118638 -157385 12422 -48414 308633 -285042 -107001
19413 -271565 -101232 396 -33692 98339 -131488 -473961 -205737 -60682 31494 -173572 -116697
19402 -116697 -122354 -17462 -61370 -339796 120287 -114575 -14421 -282683 275652 -253630
19391 118497 -372354 -89733 -300577 -63136 -225586 23839 339119 244051 -317882 -371939
19381 -371939 -295632 -140514 -83555 -327800 -286948 -2934 -191088 -46835 -380948 28226 -174293
19369 53225 -150116 -241008 47518 -280367 245067 -66864 -225782 -346657 -25825 37799 -61106
19357 202240 -84666 -47946 -67942 -197274 -82793 -310144 -166196 158555 -152562 -13872
19346 -82233 -174470 -94530 168049 -248374 -351641 -98054 -79091 -194286 169774 -328996
19335 -60159 194693 11675 241817 -69397 -71980 16450 -84547 17868 50470 -215723 13369
19323 -30736 -124712 -469308 80874 -203853 96593 38933 -145016 165831 234786 -78964 -15257
19311 66300 -156857 -149263 251712 -46529 -185255 -169299 -315128 -67100 173817 88740 79831
19300 79831 -29418 112689 22606 -109524 -184307 45546 -228199 -71504 -55002 -138162 -143647
19289 -143647 -183643 -109906 37722 8734 -485 55402 94970 2381 -141459 -107985 -120338 6743
19276 -96229 121105 40207 163306 -111927 -178591 252645 -43757 120410 136263 71394 -86240
19264 46442 -166685 134475 -216590 -175079 201910 264628 -222094 170859 -85293 89640
19253 43802 -148098 -69955 -436795 -296639 -105293 178498 102830 -138958 -136026 -336891
19243 -336891 275755 184863 -215749 -89258 -58338 51978 -220267 -122171 153524 -67123 -6477
19231 -188165 26901 176248 -18616 127106 -42720 -314306 -48436 -119695 -36698 -36700 -199214
19220 -199214 -99208 139953 -99829 -493602 214267 -288740 -4655 167893 93728 254865
19210 254865 128021 88930 55940 149813 -240683 -223798 -102042 177897 -34690 -249939
19200 -249939 -39050 4259 -30383 -332103 40485 -235353 -211096 255852 -32830 287205 474963
19189 474963 -179594 109118 50898 -347656 -75305 109608 164701 -112373 47362 133052
19179 133052 102659 92667 193463 42522 -48664 37149 -125067 67026 86428 229944 91330
19167 -79964 -381951 -301496 122270 273066 -157649 114269 -15139 -12225 138065 180252 -141787
19155 43514 -152513 42665 -125943 210494 182134 45054 -15362 359286 -149580 95464 -212970
19143 -263071 -57774 -186222 -292612 -497469 -90799 130694 -249852 11192 185375 -196454
19132 14410 71850 -207116 -210277 90980 -33796 -114368 -240524 216167 129760 -52069 -301850
19121 -301850 -29699 -158450 16018 316803 -333540 -101317 -151883 -119842 -250319 -204940
19111 -204940 -131333 165785 -13182 14410 -134386 -82558 -21232 -112903 -131055 -112890 -371521
19100 -371521 -264442 76395 -13763 -265650 192600 47399 3415 125688 -125691 -153358 -174274
19089 -174274 -22232 -205936 -73009 39004 -78919 -148260 140055 100509 18404 -101853 65235
19077 77202 -20879 -129508 -153127 -259041 -251282 -169325 -172308 297914 -189448 -261560 -263762
19066 -263762 294319 207037 -125024 -185825 -5554 -92330 -238854 -143459 -284742 121997 195845
19055 195845 -277971 117290 -25458 -292965 -183625 -152834 99599 -5573 -354892 105553
19044 45070 -42655 167770 127392 -143074 -130518 -38493 -340048 -2384 83747 -97208 169936
19032 -199134 397860 171106 187075 98834 28202 -32484 357151 -62294 24964 209002 44980
19020 111342 71809 -55999 -229072 -64883 -209741 -159663 -193721 -208818 31346 -249025 -73913
19008 -222397 -155487 -62577 -259096 -81104 78020 -117255 4599 -24591 4656 93458 268753
18997 268753 195006 351516 249304 275415 -147164 5636 26686 71080 -388030 -217765 -78593
18985 -375251 -259742 9136 260302 15288 73419 -28817 263141 -135449 -89375 265648 141162
18974 141162 50927 69004 -69300 263458 122049 56672 234051 16427 78589 -401320 207784
18962 -56563 -322243 74333 -139596 -23291 -268005 29975 -5480 267267 -144452 -63563 -25504
18950 -182944 -93803 15514 114112 162800 -150625 5808 230924 -10272 216596 -321053 19278
18938 -75178 -186990 -27370 -130567 -85465 271502 23413 -348850 -416544 -242793 -196032 29849
18926 120766 -212458 55432 29774 177469 75636 251571 -185692 -298914 -103290 -193718
18916 -193718 -287684 -291140 40993 46976 -12374 -157256 -140226 157381 -162889 -66928 26816
18904 -159700 243205 -72910 -200495 96529 -79657 -263780 59325 -76144 -122513 364016 352007
18893 352007 -466581 163990 -226976 -240205 -109686 -326160 -79089 -581857 -101673 -163097
18883 -163097 280645 26258 166628 55161 -4384 195516 -320267 40775 -77210 -244736 -81763
18871 -24067 -187082 7296 -96823 62572 17598 -1318 -80363 -221845 -266315 -14204 -224904
18860 -224904 -33741 96519 241768 -274671 87175 -17601 207478 -115859 265388 86585
18849 -142482 52312 -276366 104243 -68424 -213320 -38046 82718 30692 32953 -80456 257624
18837 -228044 34956 -383894 256417 86982 -240859 238437 42194 419396 64176 -24639
18826 356156 154256 37406 -214961 -208707 -57530 -311807 52958 -146800 72873 -298272 39738
18814 79006 -29056 66465 -186142 -120297 -203220 -184231 -74442 438773 -71948 230834 -251460
18802 159907 139660 199620 -65779 18811 90940 -116522 88054 -48552 -174797 -196010 -235440
18791 -235440 9453 170809 -360894 -452209 -442579 597406 106012 159281 21325 90987 -56209
18779 -226128 48066 -179545 118156 187293 -373537 84597 135945 -478928 85188 83533 -27592
18767 27399 -25376 -111953 -115475 -205513 -125425 61239 320056 39233 152158 193689 -52402
18755 32093 -231025 44103 -118022 -291032 -144771 154402 -204850 59177 -112678 110578
18744 -106798 -251998 -89717 -320329 -270215 25649 165845 -9871 214350 77246 -139129 -174936
18733 -174936 -73506 -25023 455834 8919 -12609 -95620 -185834 194711 -177768 165613 119994
18722 119994 238115 334241 178463 -43032 -164269 -333227 14573 56646 314374 195823
18712 195823 111794 -113793 -48572 -217544 -96356 -278342 -280111 -46750 -164558 -234822 5003
18700 152160 61700 -309456 265624 37746 -121827 -55617 14364 30051 -194546 32784 92576
18689 92576 -204654 26641 148859 -244768 -41304 115994 -82154 -197271 -354444 -24211
18678 -214696 -307408 -124106 30090 -215018 115013 273901 136903 33309 -157486 227401
18667 -158616 -78809 -301086 -365744 87845 -216109 -267613 75506 -86291 12898 -312113 -387535
18656 -387535 265270 -139169 182197 -246426 -45906 -120416 -165282 -143383 -79977 -14367 -85304
18645 -85304 -236414 -73792 -219679 180355 -218730 83279 -490196 48049 -3662 142987 -1637
18633 -184646 -352086 -12872 -343558 -351362 47898 -119253 252271 280092 -13107 -138072 -84033
18622 -84033 -84966 324828 -146489 251864 -287306 132446 -250946 -150745 -201731 162250
18611 8789 -246334 10091 -63020 -227246 -15673 -127707 -284802 -110328 23636 326379 159852
18599 131635 4680 -16832 23427 -351912 20131 81928 195658 -8501 281991 -2238 97935
18587 -51635 155561 -23394 338143 -294031 96609 -218161 37340 -360955 127724 -219621
18576 -34768 -14119 250624 181992 -171466 -212050 -98132 -109288 -187365 -118994 -193646 -198317
18565 -198317 11647 -98899 -4394 -23834 7685 76645 -63215 -41342 -25347 -175860 -152969 23589
18552 -85817 -237659 392171 -65120 20745 15435 36497 -192131 -325096 -7434 138797 44647
18540 76242 -132980 -139842 112815 -268657 -475788 -247554 177544 8886 286591 93673 -158995
18528 80857 256951 7780 -80730 78591 72908 120008 -263328 -3443 -52139 20107 -92677 22312
18515 -307950 -58393 -112063 -138242 314044 -4441 -92002 -113395 78848 22132 -149031 396122
18503 -102968 -47008 166725 -146302 -103836 140924 -57850 -138030 -148671 69690 113155 -33132
18491 -306246 90018 -198220 328589 -69492 133571 -124899 -105760 30111 76012 53340 -135617
18479 -102528 17557 267491 28247 -188155 -168144 -273955 67247 -44701 46785 -179609 -147611
18468 -147611 -6812 -319645 -13232 32492 -289859 -65958 -143607 114506 90624 -341220 10277
18456 -80314 -17882 344077 -93653 -108095 -155379 206772 -270781 -36699 -480413 -188041 -260673
18445 -260673 223860 -276436 -401697 -123240 35875 254738 -74885 -88318 -56015 -252549
18435 -252549 -35382 -105010 131555 102503 -87266 122506 100245 18355 -290017 -265493 -34666
18423 -204967 -140618 -51294 -274394 169577 -264675 -385548 36613 420194 79185 -123354
18412 505163 -197960 203350 -177044 354233 175534 82604 -10077 317141 340964 -149012
18401 -44553 44146 -49950 -46516 -303728 126717 136617 185667 88048 -372 114563 -205007 -50376
18388 -357285 -133164 172084 185894 -92192 -205273 50753 169120 -17866 94003 -288085
18377 72158 -76814 119626 -15156 -217327 -23681 122511 -78093 -41541 209901 -22388 56410
18365 123429 20371 -24523 -331216 239166 -66077 145441 -74442 -223851 -262159 267708
18354 123418 -20763 -143976 -310587 111037 227328 51429 183456 28505 207170 -148916
18343 -489042 -189692 -137262 -123559 49419 -53005 -35223 36484 -9226 126457 -107606 69076
18331 21500 104291 160211 -274091 156612 -152996 -126536 -125248 168195 -5260 -127519 -19397
18319 53952 -3995 30967 96100 -55798 -98042 -148791 -32450 364316 -67745 247272 -224968
18307 16873 42090 271339 -293205 -344035 267592 -150172 -54425 2170 22022 123721 93012
18296 93012 220234 -67143 -42764 156193 50039 -59961 57533 -187516 -303215 -312636 251478
18284 93837 -78826 -288881 -167261 48763 71514 155831 -117707 76837 -10255 -71874 -43852
18273 -43852 -399733 47484 -54967 113216 -119088 -76497 46354 -155479 204870 97233 24573
18261 127901 -206202 -321283 -226129 -112311 -8484 65841 236649 122480 -182289 -281424
18251 -281424 -239827 400851 415735 -263514 -13777 155714 -26967 41023 166567 100676 -11000
18239 -187857 -7825 -349555 -300431 25421 -197283 -80882 197103 -126626 33473 336573 -207413
18227 -91660 -134475 -74416 -391958 423031 -218595 -218332 -2032 38218 -57077 31839 -130613
18215 -253286 -139682 68815 -56344 238927 103012 208284 -1630 -42166 62695 134929 -153650
18203 -69792 182154 -165622 7031 -49771 106346 -202646 -306634 -201716 -12038 -143278
18193 -143278 -2847 53910 -63869 -34266 -105950 -221703 209180 64384 -150246 -190041 -402999
18182 -402999 -53903 122601 -319513 -100288 -210048 121920 -154506 21659 405007 -215004
18171 -116373 -223701 -59642 260087 71675 -51077 25274 125269 189572 35998 -237182 -22740
18159 227157 65268 111813 189318 -349837 -87937 -36272 -60718 81575 -289135 -385560 -58765
18147 -86128 -587021 210266 78154 50004 104137 92228 107121 -137407 117432 -24622 171126
18135 -356619 -246834 294612 -55320 3400 217438 -99804 53096 -236408 47778 -132991 39317
18123 -310195 64837 -166429 -49432 -205090 -16092 -79749 -181415 -106812 -131124 99528 -87124
18111 11266 -223177 -241257 -32709 37931 82277 257433 -75917 237998 67407 27992 -224724
18099 41729 -1004 -30664 75478 -196185 -57086 43904 275010 63112 206587 241862 -229452
18087 -25931 -197795 -256885 -410149 -131493 69761 -47382 -193390 -126868 -60121 -131729 112777
18075 -149552 197465 -184014 10616 181232 -205354 -117241 -55046 346041 -153082 -91661
18065 -91661 54890 60964 47057 -99060 134113 153851 -109299 -77926 -324128 -244014 -19926
18053 -78969 -206932 -107173 213078 52742 332388 85861 -219654 -27252 272973 135583
18042 -253119 347676 -306537 84266 -377889 43207 -426736 56485 -179385 -63922 93449
18031 330233 52503 -141956 -215575 -48375 -49445 -92901 -61127 183311 415124 225968 -109114
18019 76269 42112 -4066 9081 197715 307507 -290808 -49115 -218796 22384 25636 8029 135883
18007 135883 203826 65755 542016 -33177 -142780 -155840 247377 12760 -230708 -287917 9700
17995 -22580 -141139 -62938 -252313 50960 -392590 -28989 3672 125086 -101433 -74367 -68279
17984 -68279 17535 406664 -149358 -283600 -247420 19811 -226274 152337 56453 351503
17974 351503 19055 249781 22633 -130318 85292 -42398 90320 161880 392636 -174281 -105264
17963 -105264 -38007 -232124 25404 43741 -32526 -368718 -424579 -213854 -493029 -189280
17952 296505 145228 61716 -17977 -26798 241392 22666 -217723 81097 46681 -37417 -3545
17940 -142022 93569 -179012 -309146 109631 -17272 -2282 -93011 -77804 -20316 124507 174651
17929 174651 -231504 -284116 -97090 177431 -14121 -164347 -241686 -44303 -217096 36019 88394
17918 88394 -51239 190994 -188305 213130 -135964 62221 -181124 21296 -88097 42120 -60750
17906 -199835 50667 25072 -114535 39903 -59909 -190926 -345318 74199 -182032 77600 -36084
17894 -1996 -228445 -41453 -7937 124299 -258863 -91506 -34465 120140 -287700 152330 35384
17882 132768 95887 -137036 -226326 264396 -193198 -35250 -161530 90854 -40766 -104939 -375764
17871 -375764 -176937 238803 -45508 97500 291271 -10046 -252754 -193034 -1702 66002 21356
17859 -12941 -364883 -47955 317858 101286 155385 46512 -31212 -201516 -252618 -332049 235366
17847 -1900 98143 -31333 -11249 41325 308560 -182330 -9642 33225 63983 -29110 -202 -257168
17835 -257168 474502 94653 298495 104475 39585 -337982 85832 -44782 190810 -180893
17824 36650 -192672 230037 222321 -81217 196670 117836 -197407 -87578 -11483 106228 35586
17812 -277519 124194 90444 72576 14756 -205757 -6038 236558 -94211 -61956 -58214 -169578
17801 -169578 -165540 238131 195399 -49056 -366509 425280 222119 28114 -107073 125895
17790 -178585 -99057 60437 -98345 -152943 -39743 103464 30544 286 84348 36477 89608 -230949
17777 -105289 243263 -81359 -125577 14318 -54500 -120007 -4217 122827 -161957 -163266 -45042
17765 241841 -55651 -55013 8618 117566 67771 -71266 -180153 181662 -190433 -290622 155096
17753 -257935 -104425 167097 82722 -192391 -15279 -262385 136356 -80223 244150 -182809
17742 80105 -218907 -114537 92620 -8552 379028 -207802 111949 -92331 62098 -186123 -187683
17731 -187683 230101 40340 -156937 288741 -67429 -243581 -213040 -219111 115796 -144170
17720 -24396 -23675 -26974 -222847 -125661 -91796 -223687 -101003 -36425 -52651 36293 339061
17709 339061 -500740 -75602 230101 -16270 -54010 -204821 343 208926 110246 42194 175535
17698 175535 73610 120977 -42168 85685 -171775 -334361 -191822 -110303 60650 -23665 110383
17686 233403 231396 196106 -23546 -12979 24348 -225928 22947 308262 22808 -59935 79183
17674 -131023 -56270 359578 203210 98727 448332 177062 74656 64466 129785 173579 -137847
17662 -210217 -87941 -236521 257993 -83728 223503 -141282 50261 -191851 -97146 -132032
17652 -132032 254550 274735 22301 -272601 -18992 51026 35302 -153045 96708 -472 -3697
17641 -3697 11858 -265002 69279 170024 -18476 -85906 17874 228346 119488 82443 84612
17630 84612 333430 -50104 179635 68480 -9578 -35100 99114 146773 -124031 -179035 325824
17618 -115006 139781 -215350 60031 74933 -59171 -244713 -45174 -124690 -81318 -179267 376676
17606 51941 -135377 148223 251563 -35613 127859 -57037 44659 -67192 268342 15289 -193447
17594 67729 -67417 237955 121456 187815 39686 313037 82013 86761 90203 114984 -20087
17582 38721 -65307 -20452 -258863 392881 -245368 94997 38634 -91397 260022 -13896 -53961
17571 -53961 94627 270676 123508 -99370 56807 125774 -4076 171609 -5667 149696 147439
17560 147439 -309255 -101411 -48541 30715 214710 159148 33643 -236641 -195607 46560 114528
17549 114528 -111677 -247117 52698 -200440 88089 218952 175891 123087 12049 -42099 -8285
17537 -204750 72766 216852 303191 37532 266086 58966 -196407 169664 254577 206772 205828
17526 205828 160026 167140 -139845 99286 79761 -39510 408568 30996 208725 199293 -285951
17514 -86964 173901 167608 -75309 96479 -107587 -39900 -34567 239354 92627 321672 -18780
17502 414250 103487 -22534 96892 -52539 8956 73581 106397 -268157 57179 132907 -176842
17490 243657 211316 -25009 196387 557693 100691 301395 299060 -42115 258377 91845 348147
17479 348147 52633 -208282 -37358 93997 21933 319913 -308626 178426 248814 148248
17469 148248 -74788 332377 306215 -35390 -77983 253699 15790 -19226 202241 276797 228448
17458 228448 114387 -147551 -14358 435402 202238 130628 41139 305082 36858 179846
17448 179846 406539 201264 483011 -105279 190352 212620 134631 -63011 198576 295194
17438 295194 -63721 208248 178719 270097 153342 364083 397403 212445 411401 216894
17428 216894 -41304 16258 65111 242842 -120597 127621 -80659 20138 96480 333656 -95202
17416 315099 221322 101167 363590 -62058 833420 369810 54274 150479 212628 129810 -51606
17404 -105362 167667 38528 372768 257344 143327 -63006 197602 346362 -123877 235979
17393 28239 35707 85813 344291 -80382 -78547 340980 247253 2724 237403 4085 -132748 421944
17380 -226706 198414 6062 324533 122501 159379 165630 -242349 280744 234981 261361 -459795
17368 -60359 -233990 32895 197516 -211632 517055 54137 -180657 7783 -55372 102613 -70741
17356 21143 139670 128810 7233 331043 -127066 81883 90267 390383 302731 142781 28466
17344 17974 -109869 -141985 359405 340228 252573 45820 305058 120112 32730 117931 443340
17333 443340 151063 -11623 25394 221941 258010 160192 302435 -4193 190975 167763 461917
17322 461917 -187569 -20561 190280 41789 -32719 -80871 121660 145371 269314 142738
17312 142738 220077 377573 11669 156452 -92506 11885 -61847 83189 254608 334548 140969
17300 49477 334785 148942 239640 356941 293870 101916 61400 182115 114291 68922 281328
17289 281328 84172 67639 296564 126552 172314 30618 5765 258278 -152262 427489 74630
17277 381105 187978 52443 398652 -335726 -78087 123868 334049 210086 -29109 -124586
17267 -124586 116288 119476 52211 222630 -165592 254971 86569 223924 199400 268424 -85919
17255 102220 278965 34329 -37771 124108 133530 202800 175643 166580 -126651 -53412 177892
17243 523070 189087 116870 198126 340060 93249 183291 -430578 -117273 -19110 366866
17232 229605 228227 159079 110701 88991 280072 75398 244131 -87694 40535 110456 -184588
17220 297762 79962 -35725 156847 275425 137264 511891 294980 296266 384247 293834 -38449
17208 217635 38631 164382 136315 168800 477761 517962 146756 299456 -197329 158141
17197 -197301 181817 105178 92147 51112 -70548 726608 71081 140477 -31170 321083 -23749
17185 325234 -45153 381750 326922 202007 -267880 -102346 -80286 122715 512485 -77059
17174 184485 197244 -133166 436751 142920 198108 315979 496972 335644 279730 188578
17164 188578 60338 -46374 57901 290131 296700 113079 336685 333686 158446 259759 151280
17153 151280 344724 202165 -100552 -22847 486257 336006 -129397 51985 -67950 -7751
17142 -11184 88296 164957 -17074 304100 410012 149540 237649 228769 533590 140996 359569
17131 359569 240848 493381 271455 372548 283957 200555 141278 223560 179765 282196
17121 282196 53710 202438 407183 231879 319633 196800 127607 258197 277046 545059
17111 545059 83625 311024 -3648 316183 96165 542953 94596 -4723 204904 330804 839211
17100 839211 368912 334401 811284 170916 163116 423385 18504 260779 386854 373226
17090 373226 467424 489976 639339 413799 132066 405117 189975 230431 227974 781600
17080 781600 681919 487292 196514 335959 208560 377448 450944 297856 508828 67086
17069 248712 417975 241701 331868 344507 259177 213560 490332 539024 204477 707049
17059 707049 508568 525926 623833 675336 299685 47761 220871 254539 603226 466298
17049 466298 180208 183688 391027 371461 589188 494541 34440 664102 529393 336323
17039 336323 504388 353222 545097 389273 547852 316477 389082 422076 340969 858198
17029 858198 572589 671698 434863 697312 610233 440843 418710 472923 695814 750643
17019 750643 522418 267187 575169 726199 508051 455683 585959 878705 374937 592397
17009 592397 687880 389849 672707 686022 548663 881090 514786 667590 480403 880805
16999 880805 666447 729119 587544 566089 540227 498757 651868 532055 508279 605941 838221
16988 838221 462954 856109 830359 656663 875307 603358 509813 290126 612058 885223
16978 885223 878029 560394 543094 1039821 830897 644929 1006341 635819 792056 985463
16968 985463 726127 953689 727685 888382 566905 639144 838410 957548 463676 956437
16958 956437 784178 815639 537807 611481 1153048 827438 935970 873942 778187 970800
16948 970800 889635 1232337 961337 1044092 971855 983493 1253621 749065 831806 731544
16938 731544 830323 1129934 663155 975819 906169 929914 927280 980124 980676 672450 712327
16927 712327 1125122 1054979 1112464 872106 1281191 1167007 1280832 929332 985791 1037289
16917 1037289 872173 944634 1745674 1274511 943422 1381359 1551469 1635138 1437818 1443018
16907 1443018 1318699 1423583 1570196 1344052 1234841 1480173 1392545 1341172 1508541 1387775
16897 1387775 1542598 1357178 1530764 1665659 1503630 1302577 1551609 1529227 1470906 1656832
16887 1656832 1603636 1912500 1857678 1671888 1839740 1674154 1688762 1802042 1861966 1787349
16877 1787349 2081103 2070313 1882289 1949888 1920757 2150924 2067469 1960718 1977631 1955454
16867 1955454 2062558 2306552 2118810 2146477 1981967 2548843 2621379 2433705 2612698 2310799
16857 2310799 2508548 2621037 2448781 2555519 2422008 2883138 2849550 2942350 2649359 2681219
16847 2681219 3025476 2938147 3062422 3106095 3305903 3108601 3225106 3513984 3054721 3248287
16837 3248287 3463115 3163107 3360772 3435480 3338356 3578004 3650071 3645834 3469939 3856496
16827 3856496 3880457 4080731 4226298 3791549 4173089 4453767 4207217 4242856 4581366 4779905
16817 4779905 4744044 4887758 4786487 4934572 5244227 5400091 5293755 5453139 5614042 5579398
16807 5579398 5748387 6161638 6013348 6164698 6303908 6720813 6805551 7025479 6937209 7197749
16797 7197749 7214880 7271756 7865985 7870498 8076668 8126711 8275983 8475532 8870081 9073866
16787 9073866 9416325 9818740 9907906 9944793 10378832 10718074 10863982 11198530 11820765 11774404
16777 11774404 12356992 12412290 13131568 13439767 13762231 13999065 14637792 15344128 15701446
16768 15701446 16249420 16907748 17303204 17823564 18935144 19800245 20386766 21052817 22069732
16759 22069732 22701158 23785063 25059859 25714243 27028689 27790455 29466677 30443224 31829023
16750 31829023 33424593 35353837 36546998 38697928 40430275 42554356 45121055 47508794
16742 47508794 49964439 52691085 55710426 58637608 62070915 66115812 70164359 74484286
16734 74484286 79122136 83831320 89134756 94650533 100819105 107257429 114251684 121232355
16726 121232355 128855968 135995454 144315282 152288390 160303758 168038224 174899116 181204320
16718 181204320 187046860 191428625 194876171 196545180 197101082 195991936 193371980 189864286
16710 189864286 184957373 179035860 172344344 164912939 157500390 149132418 141528655 133623026
16702 133623026 125682265 117877769 111028374 104006998 97883129 91591740 85838617 80639812
16694 80639812 75708945 71372813 66887992 62861922 59137035 55923326 52856474 50086023
16686 50086023 47525132 44853008 42220853 40387908 38421616 36307541 34653767 32967322
16678 32967322 31291318 29793263 28610895 27373627 26087934 24772100 24089618 23407507
16670 23407507 22084765 20822857 20289661 19562270 18910547 18048031 17619174 16556443 15903957
16661 15903957 15821717 15106330 14556166 14020730 13779700 13256012 12640324 12257606 11828805
16652 11828805 11339322 11211438 10471202 10387529 10402990 9964373 9476348 9514681 9106996 9014018
16642 9014018 8879461 8578802 8548346 7828424 7881285 7538490 7203729 7308128 6952394 6646883
16632 6646883 6519897 6279141 6573565 5874029 6097333 5481452 5971497 5380861 5500953
16623 5500953 5334670 5413446 5095526 5275189 4709479 4678010 4674005 4286759 4656121 4170712
16613 4170712 4505564 4142559 3973626 3988365 4051949 4194026 3965013 3731660 3580784 3591730
16603 3591730 3515664 3526553 3813678 3593648 3177751 3417664 3079206 3347928 3224792 2950382
16593 2950382 3149347 3018570 2714059 2789028 2835780 2594945 2766117 3077882 2513982 2593004
16583 2593004 2718213 2330279 2640831 2177624 2279838 2369614 2098162 2184457 2293955 2291301
16573 2291301 2303776 1886047 1721831 1829898 1984504 1965536 2356747 2207703 1813827 1614387
16563 1614387 1931480 2017585 1877027 1761646 1790852 2176095 1976500 1507472 1655869 1544681
16553 1544681 1652183 1695331 1409108 1506788 1901480 1284613 1135279 1360485 1485951 1386861
16543 1386861 1253120 1220156 1465501 1285233 1036083 1049364 1409831 1203874 1472661 941488
16533 941488 1196064 1316051 1168048 1185966 1165292 1344569 1166028 1106982 1165477 1186500
16523 1186500 851349 1199718 1010727 1125089 869869 605099 988051 1197305 888696
16514 888696 1107394 1036145 1115767 748283 787816 564238 1030333 613096 992888 1234555
16504 1234555 924115 998848 875240 1100062 425852 925234 1033930 869926 904390 726978
16494 726978 808160 507700 550249 648627 1106434 1043003 867836 658446 917450 352785
16483 815855 192759 754669 535767 555136 491009 728627 544989 589089 623398 721906
16473 721906 697689 814888 663939 688106 672479 764918 617141 695868 635770 414733 387365
16462 387365 471780 714081 591861 737705 269326 567691 653317 223804 670469 466223
16452 466223 611791 540585 480099 657774 428311 681810 582907 378074 754110 509143
16442 509143 337711 203046 426260 554559 631701 462868 530185 78813 366291 262883
16432 262883 468971 803327 732993 598520 600064 368503 660158 485606 506890 306196
16422 306196 477139 375704 580840 491141 496019 307358 507256 451847 301926 115267
16411 617313 500416 410842 115835 447595 253665 713128 543762 543629 405383 231289
16401 231289 569588 133918 354529 514297 633595 474583 373192 281117 111260 424416
16391 424416 283278 260469 171363 -182174 254272 -50631 519558 239141 389127 386295
16381 386295 444077 340328 220331 423776 419009 161324 418354 260538 267019 19318 555616
16370 555616 343766 446090 475457 305129 352393 -123537 368328 376127 228357 -192158
16359 313174 168520 411190 173002 -65472 387435 122011 209153 233142 345976 295793
16349 295793 569772 140422 -5550 275392 127800 264296 -14087 153767 401159 120106
16338 402372 3756 320140 162280 104650 232510 -42311 145957 136866 55524 43054 262092
16327 262092 428686 80757 192760 170224 592641 79161 -291823 416119 104694 554510
16317 554510 3548 355452 443071 301262 333988 333340 236190 495517 95782 113355 -40607
16305 116847 230992 271189 262547 189679 112976 -169508 306885 296232 335338 213926 311985
16294 311985 255448 174307 315036 415879 -88751 93907 -175456 406019 211972 291187
16284 291187 260700 -57832 -180056 121042 341154 -31649 288872 81237 290848 192932
16274 192932 167823 397899 211098 282502 213527 47330 -66471 332119 115426 256322
16264 256322 307475 225091 117416 88724 -28625 183210 240553 216526 -280080 281430 37386
16252 345855 130399 132547 -11877 441990 169000 132225 -21117 34584 -1274 665306 -99809
16240 -143957 36663 -323729 171478 134239 140378 -71821 8015 217565 569556 212333 387082
16229 387082 -92918 -21734 12942 93328 -117262 240722 -77787 -14763 18847 98854 -259402
16217 -13805 30914 432727 172392 214919 -100981 -26300 58636 396417 -72439 -81540 314214
16205 192194 -34989 180420 193141 -15466 232657 -34568 -114990 -166097 -227010 41588 151845
16194 151845 145981 -463 -122188 -36299 -147556 -231924 -87454 -329855 -80694 266020 237048
16183 237048 -226779 356020 87062 -41949 82559 221040 255671 -70565 -65852 28979 -52195
16171 194971 97753 -18689 -115582 -104010 10998 -186925 -77428 -16490 244481 -163933 149267
16159 -92226 -129808 33112 60747 -92923 292379 89403 -38244 -302395 -313633 119407 308548
16148 308548 -216749 -254978 -126443 -126469 83634 -6089 185786 -309478 124618 185983 302178
16137 302178 -351464 127936 227466 -22171 246771 -174255 212465 -181123 -15527 158617
16126 250250 -163883 -59834 -204361 29094 -244791 21155 150893 65697 -305421 176027
16115 -142992 67089 -26300 193199 -265783 -59362 17611 -182097 -60778 51253 51643 -28092
16103 308268 165255 -181709 -103360 285799 -103734 -175545 204861 -141669 195404 -29280
16092 24770 87982 75569 7169 -77121 22647 178090 2985 -110289 69865 -175163 -34061
16080 233010 -98274 28134 -11058 121096 -21683 22247 266690 85339 53913 -87395 148218
16068 -86467 -210978 -46628 149753 -183479 211013 201478 -69738 -216858 -255498 19243 9081
16056 -254040 104985 -58839 -113560 363548 94904 -432496 83782 -76537 -115317 -218933 208525
16044 -212307 103978 -22709 -118250 -222752 190550 238994 117307 -107426 219138 -107871
16033 10855 -29813 -121219 -1181 -230116 -253653 -48010 -45744 -52612 232880 -306991 -304791 123481
16020 -427138 59491 141332 -342090 -22752 -32121 -181538 -349114 -81894 -114694 222625 41122
16008 105440 -67228 151891 -56467 71534 73887 74649 -35683 115571 53606 -269195 364752
15996 11231 -107826 -98144 271712 71112 193039 2277 -82415 45103 -133387 127274 -28044
15984 -290060 290974 135130 166777 211519 291969 11172 -12283 469339 -31126 1325 163316
15973 163316 -88947 -87323 -101395 -156371 -193829 117668 -164576 27510 48769 -189073 35122
15961 -169904 83608 13118 109350 114781 126477 221250 -163118 -58207 -364670 -163374 -114904
15950 -114904 -42157 -174644 -135204 285000 66966 -97308 47348 9565 -107746 -49870 -156622
15939 -156622 -223995 4089 -147393 -128572 -325273 -94355 3807 -80151 272173 -141966 -431025
15928 -431025 195556 31208 203623 44998 -398305 75398 428 -161035 52254 -95069 55042
15916 -80369 -99216 329314 253579 96485 -477335 190734 53377 -92159 -4859 -152020 -79912
15905 -79912 -194772 -98003 196875 -12677 133442 148397 323286 73011 -44016 -10456 224270
15893 20708 662 28389 -137165 74002 -485839 -193924 -450182 239366 -256756 139754 112748
15882 112748 209513 -81780 375258 120650 38677 -3873 -63644 29971 216386 -89976 -241451
15871 -241451 -159333 -18311 -502021 -406748 -81383 81322 -132666 -481366 109219 114613 -214252
15859 77474 -57426 387136 5485 224055 -121777 225213 -101584 -367517 76931 163336 -11181
15847 39029 218144 195256 -303357 -6232 -78406 251725 -4255 114734 45220 -90381 166594
15835 -366525 237477 180799 41691 66225 139077 80073 -147868 -145874 151597 -268157 -167441
15824 -167441 -34881 442265 69330 -34560 -350748 -183886 -159330 -45944 -128067 -33396 -37359
15813 -37359 -63446 96357 13851 -225562 -224572 164118 51945 -48246 52142 -84964 -178886 70554
15800 165560 89581 -275453 12798 149206 33533 88071 -120361 -3359 148561 -35973 -439430
15789 -439430 -25704 96389 -186748 -201672 153808 -160219 -272962 24036 -37400 -158926
15779 -158926 -133650 -32464 -110512 -410632 -175723 -94132 -89134 -180044 143397 106402 -37124
15767 29224 -99977 -216046 -119565 170743 -227806 94683 2471 -56109 140779 336297 -155186
15755 -123824 98925 -127892 -3645 233373 26312 120681 122510 95247 65995 -45865 111195
15743 -113988 -161925 159957 -369691 60796 33453 -182867 -8515 -248231 -145530 -89166 21877
15731 -148234 28737 276891 -106815 -345503 -472293 190907 44028 -211686 -19780 -138204
15721 -138204 64756 -6597 91562 -281374 -8319 -201868 101273 223221 -284094 31541 -281754
15709 92719 -90424 -157159 135056 -91388 20208 -284926 -142184 7096 -5950 -170790 -7496
15697 138143 -51776 345233 -66470 76452 -212854 100254 127125 237032 39031 -147632
15686 268532 -284386 -61111 -194678 -147440 -192758 -24029 -120626 -389336 -148380 5671 -34931
15674 -130140 -160334 42261 131693 -259107 -172258 107787 63893 -261078 -137195 236034
15663 -168968 471271 -102803 -389596 40657 -133404 71562 -81953 -2481 -162309 2839 -99965
15651 300771 -80052 187343 120781 103683 288539 -148324 -92971 90696 19592 -225952 -92419
15639 120081 -1092 -45707 -339117 50425 -105065 204362 -172460 84648 -106632 -37129 247593
15627 -206592 -113005 -56833 -163092 54123 -31869 94003 107861 -279242 -350948 70639 130876
15616 130876 186125 136091 -166018 49144 41112 -205480 157412 123960 96281 135596 258556
15605 258556 -272387 -8913 213536 -84026 190084 -4587 -223582 61532 126526 189542 67466
15593 58774 -192568 105172 -663370 -77571 230659 -157131 208841 -138674 -23248 -161428
15583 -161428 -284339 -251125 -107025 205887 -55622 59447 -185360 -71623 11217 8413 173865
15572 173865 -13106 -283143 -202190 135931 -143728 86782 124005 -130435 -17939 120033
15561 -8514 119083 258733 64615 -188101 -233578 -82298 200309 -109771 23448 202993 173547
15550 173547 186884 -89826 -167096 -354494 144556 127972 -162113 -202611 463598 176346
15539 -20430 -416348 210661 29380 -114550 190235 -106184 94148 417089 28277 -62617
15528 53247 -251153 239461 -154465 -22688 -235251 110149 94865 136601 -150859 309736
15517 -282991 -293812 149035 58110 46769 -20780 24553 -194341 -157477 -21374 32381 -213718
15505 -79070 78884 -208042 -107784 145758 77977 -128884 -36214 -59582 234478 -196437
15494 100257 -197333 -387722 -89655 -176062 147368 -130318 -243300 -123018 12396 -226052
15483 -112854 257450 -260270 -442473 147904 -373306 -145876 54625 45011 219050 110241
15473 110241 -105604 343840 -1569 144223 -111047 -5253 -273048 52511 -7034 -105586 -150350
15462 -150350 -151381 -231645 -160942 -200119 -126423 -138289 147488 221147 52681 -250357 -123100
15450 -107102 -121671 321964 97274 -128213 -203501 -227983 158724 64440 -506389 43372 24213
15439 24213 42170 153092 -222912 -425264 -209371 -7630 -302896 14810 -21540 7873 -326858
15427 216835 62293 -116669 -116758 56792 -122723 80266 -86545 -482405 132652 377499 82183
15415 -454499 -14326 -35810 -421378 282069 74859 -4756 -91761 104558 118439 -316020 124684
15403 -92607 128336 271708 -172431 -203390 167013 65099 45064 -77642 -207948 -155183 -72254
15391 -229088 23183 -27745 250585 -55034 -10999 182616 -182750 199714 72684 -240741
15380 50521 335507 74836 -105738 146294 -37305 -42232 -497631 134306 -251399 229220
15369 102981 175472 -59329 -16711 -245069 -65963 -14912 -114373 -102655 154470 -137616 -18140
15357 82061 74530 269015 -34316 -255290 179139 35645 98417 -222943 -25136 -25949 -7474 145639
15344 -91600 -155782 211685 -15618 -26860 11510 -93142 64295 184382 201142 414085 160405
15332 -142034 143631 175505 -85184 114507 -249396 199962 -361413 -77380 88927 -127631
15321 113880 76638 -25741 36171 151576 -13361 175683 218722 320636 -242834 51672 40168
15310 40168 -32250 5866 229797 -76258 164717 -244469 -115048 99277 -335751 184168 330297
15299 330297 193912 73460 -173366 45646 -14658 41638 -103602 7466 -47214 -244670 186583
15287 229543 -14474 -162380 -198475 -354408 -137095 146153 -451672 285252 373593 357967
15277 357967 -146909 -34850 -84111 -34649 -134135 -109165 176396 243749 -38768 13474 245181
15266 245181 133812 170167 43446 -41791 68847 297387 -81827 -60296 143020 -90283 -124721
15255 -124721 307509 35996 109533 32861 73924 437260 850818 1410438 1079330 1316797
15245 1316797 980889 289419 388855 350075 266928 -70783 55042 195921 178286 -110563
15234 9595 203897 -307931 192648 -245628 -248699 278642 -9826 -90459 -36215 175285 283327
15223 283327 -187891 268280 357838 -174126 -939 74689 -91265 -253391 85561 -54685 215482
15211 87841 29224 -74163 -19899 75021 -67402 54353 43244 -65701 43186 -381666 323802
15199 -90550 -36313 386514 -112020 932 2798 172662 -16311 39127 351472 -312949 146703
15187 58746 200367 -81382 -104804 -135390 53146 460453 57376 -130682 -132476 571309 -172561
15175 34698 130539 113491 27316 -263685 -96846 27229 81573 175244 359109 216255 -66875
15163 216252 217867 -169185 94960 -229457 177970 -306320 -60172 20057 -262870 174128
15152 251769 179892 130754 -108406 234579 235940 -30052 -180038 -102315 -242338 171273 232309
15141 232309 12104 -383155 175438 320315 -8891 -58775 -40572 130058 251558 229772 15742
15129 -216 99832 511193 354437 156371 907 -60688 148967 74618 238019 342537 632843
15118 632843 -140877 167682 100782 -57051 221513 111764 142393 252617 139115 379186
15108 379186 21558 331982 278666 -44595 277282 154057 18087 186203 -65162 128127
15097 337176 -106728 24035 -117565 268162 160554 -79539 337335 178481 229129 386646
15087 386646 216184 258186 34757 -30681 128022 -69524 -249058 12580 -9146 -118396 -42712
15075 122460 305229 -85170 500837 376848 144883 125181 415880 -171414 444029 530424
15065 530424 312259 92556 373700 -60422 217228 313338 220886 -8038 51208 67381 200531
15054 200531 -121499 307118 396771 102917 309967 119090 127619 -53788 -173866 97925
15043 6509 58436 164481 4124 416831 248947 242317 95347 399617 25615 127708 98131
15032 98131 451761 276082 53696 23492 221177 -39935 101850 -65864 -5626 693163 -238468
15020 -16754 174358 287669 20161 -29344 294628 173816 -14807 417300 316910 182511
15010 182511 223051 -90002 114491 421015 242830 254101 253613 120686 -63096 165282 352261
14999 352261 93592 416063 187970 5012 218192 193098 173855 80016 112028 71640 167375
14988 167375 126898 127551 321338 14873 512498 406138 71107 4871 457992 190108 362835
14977 362835 375523 364090 318538 25776 120569 531197 66373 -133681 75096 318428 424386
14966 424386 -118575 222695 132280 397664 168351 186546 258262 201344 64691 198794
14956 198794 222386 120076 39561 138221 -136141 77325 135962 35614 339084 256760 100553
14944 85993 359346 88707 170391 438115 270969 67142 319215 179004 162363 306068
14934 306068 126141 570858 24663 691218 369435 281724 469564 -73678 163904 106009
14924 106009 354820 384505 246126 166782 -53071 660751 190568 316140 305947 463573
14914 463573 232858 3264 608681 146692 188324 290837 555145 504022 204533 312702
14904 312702 261806 159488 382927 519367 114005 483080 -16414 13318 80269 542461
14894 542461 115377 206359 180181 432555 242833 483194 286383 237446 574697 375869
14884 375869 303462 53587 298605 456510 626868 386822 272544 485393 229151 394054
14874 394054 328521 196230 273694 404871 397629 642007 574915 727272 379245 179540
14863 598727 251405 527658 633576 -44853 116683 513559 627849 -108244 398588 398970
14853 398970 547173 483875 675855 182729 401676 191517 304976 375440 396623 252974
14843 252974 244703 251413 403370 521658 333663 433192 351542 427339 334399 190365 439965
14832 439965 639236 472461 484314 621428 455677 470232 340834 213963 389465 363584
14822 363584 259157 323733 541344 433138 190338 586999 418836 548273 395987 392735
14812 392735 410841 591901 201385 577972 297804 644878 665339 365188 549905 321528
14802 321528 440419 407891 368661 349271 570917 465566 315091 561803 218763 675360
14792 675360 553606 229713 688153 680423 438354 653495 187748 635980 269215 526731
14782 526731 869182 428472 826741 624606 247824 627734 348120 288216 480136 480577
14772 480577 501915 358861 621145 600058 382223 605345 646402 747848 599154 644723
14762 644723 590240 656752 627029 454295 435932 674150 696245 384589 456226 482406 518781
14751 518781 566577 684542 833200 910781 702029 718341 276838 813547 260975 555459
14741 555459 563564 544701 913656 665924 678764 613930 342793 778366 727522 782698 760980
14730 760980 626171 876129 721222 658821 668786 783149 784681 890682 743978 722642 1207499
14719 1207499 1056405 850749 607886 788578 801626 796644 771264 369770 635783 993055
14709 993055 630746 601359 854461 624315 791396 1052596 871231 705537 1057570 572179
14699 572179 903443 671870 1037750 615964 828768 983195 943165 751619 1006119 871397
14689 871397 762475 1030330 846054 974480 929473 1025467 1038348 840924 915352 1089573
14679 1089573 767672 755609 1099942 869332 846652 927558 933566 914267 1279886 1187044 833238
14668 833238 879228 1063484 812261 1320170 895534 859443 1420850 982284 1283320 1053479
14658 1053479 640924 1286454 1122300 1108836 937852 859394 1764817 883848 867597 992516
14648 992516 993274 1107891 969586 1178903 1091659 1459218 960303 1506179 1175004 1072853
14638 1072853 1076750 1248888 1128867 1515280 1546205 1165817 954281 1240491 1040785 1181978
14628 1181978 1200180 1225692 1456289 1328383 922300 1324952 1565677 1279703 1574149 1255367
14618 1255367 1410499 1351572 1219288 1148936 1421222 1486870 1218138 1246274 1521978 1596743
14608 1596743 1195735 1397108 1564026 1476118 1319085 1372979 1750174 1582506 1546379 1326042
14598 1326042 1312265 1671925 1435283 1653980 1529357 1880885 2246922 1572332 2051120 1613313
14588 1613313 1479816 1891476 1606235 1807770 1921887 2337977 1397885 2151072 1891622
14579 1891622 1874685 1706740 1698885 1888983 2029084 1892349 2262150 1901043 2046162 2029318
14569 2029318 2047471 2193342 2025228 2268555 2479283 2186749 2321739 2395407 2297291 2501445
14559 2501445 2805277 2388216 2913263 3178722 3052965 3365013 3499852 4296613 4697216
14550 4697216 5331976 7421017 10686811 17839813 31849660 40844679 25779779 12666534
14541 6876106 4185084 2975787 2433721 2151661 2213689 2170702 2003774 1675405 2107567
14532 2107567 1876895 2007553 2045559 2251502 2249398 2267430 2095366 2120701 2346073 2387125
14522 2387125 2588636 2348746 2354166 2410147 2324409 2543304 2751166 2669900 2525491 2669095
14512 2669095 2597156 2736749 2532091 2554411 2927007 3314828 2658281 3145890 3103636 3083798
14502 3083798 2873348 2942604 2854521 2973580 3015856 3337655 3196380 3082620 2974048 3261007
14492 3261007 3150033 3381597 3242660 3618988 3866699 3873937 3436173 3506741 3612649 3674127
14482 3674127 3895567 3459148 4023104 3563146 4053476 3909148 3769248 4125707 4023713
14473 4023713 3942285 4265750 4092397 3959833 4134251 4157884 4372496 4073227 4413952 4673871
14463 4673871 4308973 4295403 4880944 4538282 5004172 4865441 5149769 5022198 5049846 5056524
14453 5056524 4748854 5103005 4903184 5306527 5524171 5382063 5171444 5730265 5403512
14444 5403512 5481947 5599453 6364292 5757153 5898400 5999613 6101893 6165092 6061123 6304403
14434 6304403 6494427 6454260 6589410 6865976 6947668 6888824 6975111 7223613 7053819 7107937
14424 7107937 7057250 7797408 7523592 7738951 7920125 8104539 7551601 8255224 8480725 8230860
14414 8230860 8474417 8577345 8340972 9032120 8840374 8862182 9040254 9282034 9527522 9532626
14404 9532626 9590751 9791339 10190263 10364825 10410308 10328546 10668065 10999147 11110772 11225062
14394 11225062 11502330 11326771 11794933 11937294 12135458 12753810 12617499 13234870 13288213
14385 13288213 13201910 13023205 14065410 13683306 14483783 14519752 14575356 15216345 15391746 15865053
14375 15865053 16281397 16141290 16936251 16857942 17453574 17371188 18050763 18231859 18793754 19485481
14365 19485481 19434281 20038020 20308100 20562724 21088003 21586070 21769078 22859960 23223677
14356 23223677 23777187 23990856 24714441 25347934 25819863 26207405 27484150 27986200 28520275
14347 28520275 29247939 30240019 30731936 31444916 32164570 33067454 34269597 34967081 36128806
14338 36128806 36622395 37953754 39095273 40108531 41331426 42441870 43605976 45102314
14330 45102314 46662017 48025951 49513086 51190701 52849386 54309524 56180242 57964461
14322 57964461 60437145 62254095 64384389 66434078 69243763 71790287 74402849 77337737
14314 77337737 80327017 83145884 87031054 90527628 94163972 97666046 102182952 106133253
14306 106133253 110979761 116106147 121020547 126480641 132299708 138414317 144627754 151374187
14298 151374187 158520482 166353631 174578659 183133169 191959231 201569209 211814628 222024026
14290 222024026 233358109 244702064 257056730 269694352 282671456 296237266 310141989
14283 310141989 323897053 338159727 352541008 366270067 379897073 392864663 405031970
14276 405031970 416464409 426193450 434123657 439820225 442320791 441628656 439444506 437468818
14268 437468818 433449773 428907721 422983856 416514618 408157586 397228975 384938040 371505060
14260 371505060 357881858 343700461 329002101 314093962 300212498 286541069 272678564
14253 272678564 259552255 247131415 235004797 223278405 212568538 202012156 192064390
14246 192064390 182805280 174336021 166435029 158347995 151263948 143970610 137418127 131241027
14238 131241027 125915675 120712870 115586480 110402060 105903527 101581072 97497460 93559817
14230 93559817 90091442 86330789 83052858 79986170 76843866 73678915 71522896 68738670
14222 68738670 66539590 64079556 62231997 59802347 58131322 56000417 53936938 52656933
14214 52656933 50840185 49578317 48101831 46216112 45111783 43563203 42313562 41853317
14206 41853317 41165287 39463669 37888447 37283609 36192274 35128427 34620184 33596824
14198 33596824 32482283 31400657 30788261 29996473 29403841 28794246 28201273 27184074 26757145
14189 26757145 25897972 25292645 24686666 24124169 23478333 23298174 22812344 21885178 21611490
14180 21611490 21092848 20866406 20635362 19791716 19462085 19041050 18637652 18158013 18105408
14171 18105408 17627856 17256319 16765283 16638561 16472425 15897528 15746191 15492037 14915055
14162 14915055 14645273 14468717 14290322 14320810 13606152 13667294 13610456 13395448 12814752 12883418
14152 12883418 12320802 12539930 12019877 12124422 11493502 11371846 11276881 11409998 11068676
14143 11068676 10620342 10524977 10453603 10480193 10511634 10129048 9930753 9936636 9531528 9349129
14133 9349129 9091447 9231147 9119248 9369229 8936498 8673752 8581576 8784395 8347336 8090205
14123 8090205 8317266 7839118 7886371 7975978 7381865 7621330 7561740 7171009 7282888 6798130
14113 6798130 7171842 6651218 6995915 6962455 6652192 6755532 6762354 6757773 6524099 6385259
14103 6385259 6395980 6401696 5688649 6094354 6189565 5962970 5733700 5686953 5857414 5741114
14093 5741114 5486086 5418290 5531128 5363843 5268261 5293056 5507415 5058751 4945850 5216494
14083 5216494 5094419 4842417 4745816 4946799 4697704 4938098 4993788 4645623 4612600 4927820
14073 4927820 4279122 4166338 4334232 4343344 4423080 4548952 4265859 4385873 4174192 4079880
14063 4079880 3951092 3830729 4001544 3866311 4355624 3853147 4039644 3834340 3993809
14054 3993809 3974015 3531510 3934544 3547713 3619795 3756401 3189309 3432963 3540979 3396170
14044 3396170 3434922 3256835 3252403 3294600 3164694 3262416 3191794 3258398 3017395 3162592 2880409
14033 2880409 3204493 2934250 2985381 3012890 2870803 3407829 3005376 2819523 2821897 2897088
14023 2897088 2863517 2947578 2451933 2489775 2913219 2609348 2341274 2564388 2786768 2598013
14013 2598013 2260131 2515980 2683573 2729822 2278464 2539332 2502835 2345109 2433437 2251997
14003 2251997 2239021 2552808 1867750 2184401 2134583 2333471 2056996 2327116 2348302 2242853
13993 2242853 2308241 2452858 2238027 2760199 3476833 5756703 11865670 25508859 37999352
13984 37999352 28584366 16826746 10450508 7319357 5502094 4480374 4011899 3476735
13976 3476735 3425512 3320658 3089843 2710484 2620584 2705729 2955742 2530360 2145907 2393010
13966 2393010 2157226 2417725 2197809 2347515 2330701 2327936 2156133 2230422 2277366 1929485
13956 1929485 2091288 2149789 1861377 1997523 1940526 1950220 2008916 2234119 1938467 1878628
13946 1878628 2104594 1799768 1936659 1932391 1378260 2074844 1755902 1817492 1636532 1857391
13936 1857391 1370919 1942006 1750541 1610892 1626784 1658344 1738555 1665881 1346698 1518298
13926 1518298 1488586 1641349 1670504 1508454 1536976 1569096 1458123 1799977 1497050 1306324
13916 1306324 1573279 1768744 1643893 1232123 1227083 1312273 1830488 1684225 1700571 1402937
13906 1402937 1387919 1327024 1682541 1547529 1439963 1105041 1427696 1491799 1116548 1232102
13896 1232102 1269923 1260033 1306172 1429437 1077084 1487423 1346672 1367096 1469545 1233970
13886 1233970 1394371 1525041 1374924 1253245 1257514 1221409 1154905 1464090 1220155 1130060
13876 1130060 845058 1157059 1489474 1030021 1174731 1314184 1350335 1267970 1314170 1083790
13866 1083790 1381044 1027708 854447 1014193 1716696 1097420 1185587 1403884 771658 1049949
13856 1049949 1160395 959355 1138382 1074542 846374 1002604 552886 1033756 1184566 903546
13846 903546 989148 736705 1220004 795381 984588 1149204 720091 790955 787031 949652
13836 949652 617833 958268 1024403 569315 1226775 903532 633451 1187360 662400 989021
13826 989021 761720 558704 1098912 1071998 1141848 1045110 1101867 749942 803310 978717
13816 978717 1019037 1081455 976085 811824 801295 856894 895726 1012450 931349 606135 863616
13805 863616 784997 978349 678427 707046 748813 1065812 723314 984511 979486 635272
13795 635272 585799 816385 557401 1062122 747320 848834 579803 905318 1078693 585445
13785 585445 696548 778371 826101 1040093 846734 809843 873550 564798 823944 964538
13775 964538 802981 830713 617712 745721 726749 536389 406126 730094 1143362 1055130
13765 1055130 709525 773977 371357 702976 767748 789670 685142 565653 808560 528139
13755 528139 690199 828091 596548 304940 557784 640246 680295 227572 665106 760552
13745 760552 811946 555803 590945 416253 239028 398030 437599 546015 667926 625227
13735 625227 617656 765819 522009 818938 802816 622996 533028 557765 574182 338124 361573
13724 361573 525407 756273 292195 625917 523647 453713 817103 412319 564089 518098
13714 518098 873381 471998 554727 807774 643961 752835 530257 706806 329916 332356
13704 332356 654366 416926 410308 427500 339858 800554 499716 481791 403590 881324 436674
13692 531055 703566 801126 563529 476473 741502 439721 736987 580364 799234 352565
13681 291373 485235 846351 1010028 291970 628123 360646 36295 581504 366726 789756
13671 789756 291231 573453 507896 640176 574089 455674 24988 566730 373366 388290
13661 388290 237498 493670 372969 432190 466614 539146 780876 578975 301110 565516
13651 565516 593540 568095 497846 448519 308454 248737 434921 585814 397776 367190 841456
13640 841456 617415 524729 477805 366361 557962 417512 507263 364465 201059 336621
13630 336621 455697 246335 518307 604231 401538 632513 537619 413685 421445 447422
13620 447422 504945 460106 320171 497724 510316 534258 240165 210106 677667 585447 185207
13608 282949 455230 351408 786346 254821 271408 294192 405302 333374 214845 294004
13598 294004 550126 442987 299456 359298 312054 633324 99702 279583 288356 405758
13588 405758 411080 353449 434146 586976 447093 38781 483802 397630 379613 490643 328203
13577 328203 305051 289520 482654 28788 123018 315260 72548 465412 413965 674756 248865
13565 442143 618567 728981 450722 230551 225335 317221 -73870 483852 391705 700480
13555 700480 336093 228548 269212 444786 395890 644676 131053 224383 -33370 503989
13544 98802 594711 618243 134796 195792 594343 348771 159337 113724 381482 289692
13534 289692 153909 579570 215952 -11453 615 418580 107750 208233 298587 241799 195832
13523 195832 517664 505143 48258 291127 45877 454058 -50274 143142 340595 309988
13513 309988 561196 445929 114894 170334 407349 685746 279914 424032 432942 338147
13503 338147 127347 -492 256361 181327 582551 182625 251872 106073 46366 99493 121499
13492 121499 298409 214253 253439 380228 249534 174891 71982 540760 558231 10569 259866
13481 259866 125830 368042 -193959 167552 -135716 407547 253050 -82958 55556 430221
13471 430221 2215 347267 133156 275711 115081 586032 502516 281951 -101277 292951
13460 156316 193516 437411 -6987 61821 -96308 475710 -27292 345269 710966 244839 -177041
13448 281179 230687 167273 167876 462195 241510 449341 489064 234210 288129 -96616 368574
13436 382229 36238 338310 297564 -63956 463432 420494 197067 85455 230673 144493 -88183
13424 104684 -77000 551006 -41819 28870 174354 -31535 134072 344386 261919 213734 442013
13413 442013 308709 223962 222829 231938 147706 421405 -118002 -38776 306521 52956 218179
13402 218179 193857 104321 67409 504902 32446 613090 391973 364372 215761 110746
13392 110746 258580 123231 42322 309232 82617 66425 -147646 150182 114262 31729
13381 383299 191132 136774 309061 212358 310974 -102904 368757 28537 331810 99050
13370 272025 347870 139560 312070 216745 42328 284172 -93089 467638 353792 49699
13359 275265 -44096 203205 416170 272197 -42986 -227416 155654 169386 297621 57618
13348 -124283 99570 334121 308963 -3106 448158 251094 471325 489036 308915 185898
13338 185898 239211 129169 565434 328702 -169309 402462 53745 -80423 103789 228644
13328 228644 -88227 98557 278903 180054 58832 370927 209490 387953 250302 363734
13318 363734 250291 509411 95694 304929 197918 100834 204799 109142 -188661 194361
13307 327149 207998 99702 92185 -37023 393357 269600 13907 429486 373054 591307 284097
13295 212459 195202 300403 -17246 289152 99637 365143 -60886 355094 115628 -82544
13284 326326 456364 270241 241395 231572 402001 440807 344102 278327 76465 -38530 37889
13272 124344 377089 -198664 -79542 141020 112875 -109100 103037 119216 -111181 241560
13261 -43516 176391 101462 279152 136184 255790 -153679 208084 -296905 231956 227860
13251 227860 -23947 45042 273633 -166568 79679 266227 166037 124014 172942 4981 -68496
13239 -2228 175556 235123 -5408 154206 283611 -18434 -10920 26268 213728 155866 58315
13227 91020 -239469 213423 -2182 166609 -101532 508860 -72299 500193 70625 168866 46079
13215 160527 130171 360189 300822 -22226 221895 296032 94699 -2542 118074 119862 378202
13204 378202 -15872 476687 -71196 540213 48210 226649 -47054 -22510 -294025 240648
13193 8604 197397 -6365 108629 208300 106682 356307 49464 448076 -48344 384217 245430
13182 245430 600841 136823 231447 252491 -64683 74716 -83074 4311 59662 538551 58793
13170 78051 -60082 -175922 88257 -194095 277028 414230 -151602 202056 73556 106172
13160 106172 286162 161117 342329 500801 30872 125098 -169477 -287285 228333 257722
13150 257722 -129447 224032 159414 278839 117184 482910 89142 12519 190178 -115600
13139 -40295 72087 -101388 -7595 85391 227219 75657 245866 -121491 220709 202171 128634
13128 128634 300810 -16992 90695 -232009 304048 233977 161690 18479 128275 73178 106668
13117 106668 -99941 127638 279367 -256411 206545 37620 -6201 -251562 -20787 -24908 167030
13105 158601 61763 101680 113568 87168 -48099 -136425 -404309 1212 -152581 500560 135168
13093 115259 102488 -74642 -54906 65035 282076 47017 123195 -197546 48972 40670 10032
13081 20847 264256 -139896 145904 219114 100232 76683 -305392 135505 -34561 50415
13070 53311 133711 212552 -131481 -186915 34868 137430 58274 139306 319801 93296 19809
13058 -181402 -157207 45955 -385356 478631 243836 164474 78799 -10115 240273 164596 190555
13047 190555 5579 -64533 30647 208081 -25985 209167 16761 -7055 144302 157322 47153
13035 105393 80853 -137995 43622 -8763 -27898 65386 -197347 -105581 108581 -8256 357202
13023 -193478 57596 125624 247472 -56910 -37089 37268 62307 175633 79011 -69455 243042
13011 235404 10591 371255 -199836 56335 12645 569741 128112 243106 -75010 340666
13000 275080 -11332 118411 234704 223032 231797 102202 184919 112023 41848 -13266 418655
12988 -152535 291418 -17139 304161 27718 484801 76809 97638 -105177 -37179 83141 -85218
12976 84954 11584 -104441 -101084 271759 151098 245502 -47882 -35660 -43366 312740 162189
12965 162189 203019 86122 193752 376584 144206 -9089 155810 -32117 2463 -89904 158641
12953 -240410 160109 38926 262265 201248 203815 42729 237208 -81135 -139035 115084 199117
12942 199117 159019 187881 225806 340276 25215 391268 37106 -111436 -187610 -243867 -136139
12931 -136139 43908 497312 174616 -141109 -87841 62580 128757 -376474 -129660 -141602
12921 -141602 250957 100668 -45698 -55387 9367 -572001 235842 180106 30925 49780 169066
12910 169066 -147074 216500 -58722 340567 49587 140243 -217012 -224275 219870 -62025 147329
12898 -74486 46819 -103747 230133 13707 47360 132619 290363 -156106 92824 83761 -1342
12886 178222 248318 9560 -82691 351630 -48362 163159 -113581 97456 220461 215767 154055
12875 154055 -277201 -125590 -209180 19232 99771 241086 111423 -73168 -2493 -8964 28048
12863 -148991 24840 18611 -35045 -170615 253310 -190555 299690 -8008 -896 -228270 -493448
12852 -493448 -280997 -304703 -34833 409235 177075 435147 -69623 6081 292002 120456
12841 -170093 -44930 14511 110410 30685 -220064 -146352 -254458 136983 -218860 -159200 173485
12829 103318 33135 -261777 51496 503048 -63870 210451 148576 -11041 82004 -294298 -60220
12817 38182 151646 97896 184932 196907 206850 -320147 208813 130289 174054 286905 114841
12805 52465 -136597 277967 234585 -222471 152817 272972 -36886 84463 -56228 -201677
12795 -201677 325413 -77848 335984 -109535 17574 176055 22564 -303325 -416543 14316
12784 -128663 -97422 107836 -22965 -71690 74198 177505 94782 66539 -224938 85402 195195
12773 195195 -12773 71136 206447 -65057 -102599 -68667 -47560 185625 -15277 -47057 363337
12761 135740 -948 -61131 328697 131300 202432 61105 15552 64533 -139592 -137421 301132
12749 -313241 -184566 59912 125748 -174186 -89784 179528 -11855 3045 32493 -114320 16360
12737 -235280 44744 335152 -221761 -82402 218628 -49682 398052 284694 164008 14506
12726 -51140 -51802 -73541 205792 -236921 146431 -111613 356472 -90931 43727 -75073 -85378
12715 -85378 128200 120786 157699 549571 204912 253617 -25329 531307 368477 234692 -406057
12703 244787 126476 -225271 137180 180582 253617 66558 -185666 -45140 -91368 303471
12692 200807 432798 -13634 -161617 -77951 45160 103549 124299 80440 30938 137336 173370
12681 173370 167771 -358705 273098 20872 324146 317062 287330 151424 150416 -84639 18136
12669 -96581 -240814 101558 -67751 102590 -155442 329295 81254 -200482 215294 -41631
12658 129028 85599 -83534 -134742 261106 60395 336693 -615 -38034 -16373 263808 -46564
12646 -106471 -68732 -33730 -56003 -93342 199124 -8425 22343 -19399 289788 187431 142810
12635 142810 346963 319959 104735 173736 -317542 161135 -98892 25925 234463 166867
12625 166867 40391 -14916 88184 -151795 77937 39091 -235181 13137 -16728 566 257375
12614 257375 -186681 95889 -18753 -46740 364265 -85084 -158915 91807 194544 177148 -68441
12602 323996 277404 675327 185413 292310 145440 -91846 51866 190061 365938 119695
12591 138832 181195 99512 32394 -209441 66539 145721 96228 -128339 -52543 -247668 241060
12579 -171779 -158623 259508 145076 27799 -113441 290662 206257 147124 114356 -234292
12568 -162341 64780 31429 -166539 117341 -26751 -309900 49035 469702 -27502 347280
12557 96311 82832 -98836 156906 65599 -221604 128673 -262201 -102780 -289790 134958
12546 14962 -48982 11597 89436 241667 155580 181957 112504 -279994 -137281 64584 118227
12535 118227 -173086 -122402 -247460 -19807 -18217 222977 -116217 160734 -143787 174134
12524 -151473 98433 -42594 370105 -153732 106976 306584 -181627 163030 198639 347366
12514 347366 135071 245989 240003 -28100 47602 179806 127989 8036 86470 -135152 166744
12502 214037 242025 -85641 210941 305132 -88206 -208594 109573 89027 217943 -85380 69663
12490 -93853 210851 112541 15097 -254551 -186884 -130481 148217 -27521 377013 105820 81247
12479 81247 59712 -6944 78240 6633 -8442 -102673 -80057 144214 49545 -94316 -142679 -232411
12467 -232411 -76582 84 -347042 -28496 385746 -142202 136252 -33981 -67274 124838 167600
12456 167600 -92865 55638 -213815 -65068 -45161 37770 -5220 141128 -357121 56855 -35729
12444 114282 37178 -52399 42688 -241869 202793 -170480 20880 198607 -67940 -5571 298135
12432 4162 19745 589835 476709 168983 -194179 104478 -61589 116116 327988 325240 45261
12420 -146391 218317 205377 381875 -210599 -163007 149694 224455 -105244 -66081 -96451
12410 -96451 121198 42383 15521 60540 348095 -182941 -88082 209675 22829 -63846 173830
12398 -63194 -176572 -79421 -220021 290415 -89752 316468 -360096 -51808 121524 -99821
12387 209460 -137842 -246262 -29743 44882 -56444 230148 109053 -145813 -183674 -104560
12377 -104560 114165 103589 8432 -214240 -52590 66554 106163 -3257 294103 167919 132464
12366 132464 56102 -56510 259265 101046 -252755 -177269 21887 -276703 -30005 -92624 207057
12354 -273835 170370 81258 53797 -12059 121450 240519 -193851 -5269 -98421 54038 197660
12343 197660 -66079 30869 215753 108330 -145433 -161535 -23765 30687 -382843 -132329
12332 42352 -215304 -241470 211594 -254697 -244713 -162036 -148295 50724 -276261 33494 -39507
12320 77955 -138049 136300 89026 184762 -156657 13753 -161784 295189 -28990 322118
12309 152448 -532944 196566 -178702 28962 -17212 -29872 -217869 53815 -172554 33223
12298 -93569 -297887 134251 -130386 -153727 -114285 239247 -22564 -71028 -89475 -83544 -33944
12286 -88372 -183955 301226 209449 -354424 159966 -329083 147803 -76162 -198256 3328 113212
12275 113212 -41648 220147 272401 215146 -99312 136503 229469 170303 -281367 125129 258776
12264 258776 21553 35604 135220 75856 -164332 13498 287704 -49563 -114788 106674 69289
12253 69289 140844 153470 221384 -77373 224597 13312 -46472 -214671 94646 159253 -24098
12241 202883 339040 -148447 97597 78477 234032 17159 174165 -249694 222183 192574
12231 192574 315323 257258 226898 -63978 390217 414766 9197 223558 193827 176219 133639
12220 133639 187882 168511 279606 -36920 141489 149822 -78671 31778 -32505 270549 159820
12209 159820 42355 223555 -60259 -85441 112304 -108934 120613 176402 44595 645269
12199 645269 123755 -52931 86159 112185 455325 388627 12334 29418 276137 269446 -136411
12187 153404 264784 -177554 228781 198701 416333 275570 -65624 87007 107814 -371694
12176 112732 -12923 138645 243900 291919 248246 116834 154474 132 157993 -91003 -153364
12165 -153364 321282 442511 132200 -33980 -491298 -206286 105302 -237173 -146471 -53483
12154 134803 -310566 131450 128252 84811 30025 332434 83251 66344 190243 -229435 107110
12142 90929 268812 -56644 55403 143678 135453 -83295 40691 148122 -87689 -291136 -359987
12131 -359987 169614 26588 -118016 196429 497054 -67743 -249972 -213161 -76592 -183339
12121 -183339 253468 83898 -191769 -228152 227169 -11265 -33902 -184014 106340 69652
12111 69652 50928 256744 -133110 176824 333338 -41381 -144521 84953 85417 -292901 -119515
12099 -87627 470842 142253 -247006 -46953 883 218189 187241 -48256 124760 129248 -17719
12087 -411299 149610 -163323 -190245 -31681 -41716 -165335 -70290 112743 -117707 -188215
12077 -188215 106912 184889 -20864 -267507 -91034 245363 272199 1283319 1304250 425714
12066 167308 -291169 235184 -19782 -219168 -448419 -58474 -43298 62882 -236674 -69679
12055 277959 -180766 202475 75171 180574 41459 -64036 -80502 423898 67030 35263 -97110
12043 206781 96260 155866 -323124 -170109 -175194 -266692 40477 -129302 10024 -167566 32514
12031 -173264 97657 144062 -61902 3338 -8423 33477 10346 -199176 -86108 -26389 -349646
12020 -349646 -109451 -15654 152903 33183 -216782 -39525 86348 -37362 20549 113994 146599
12009 146599 -73770 17160 -56035 175663 -149394 -105011 195496 94345 -42571 -144727 69002
11997 -111640 -10707 -213786 68303 -27848 38352 -56388 -183702 399055 50907 46051 -300328
11985 -116904 -241813 90266 58330 11136 -96928 169697 405526 305324 -190123 -101379
11975 -101379 -268994 26657 166325 49539 151965 -135525 -158924 -48167 130052 102614
11965 102614 89895 -273607 -197792 -69356 -402600 21040 -41654 76534 -314733 -297657 86430
11953 13947 254421 21331 211487 -44300 -80532 -148540 72437 -3893 296777 17655 280818
11942 280818 157052 88098 166716 130923 -43169 -167046 -10015 -115607 433233 -175620
11931 115939 -275933 -73572 -215034 173152 175344 -15294 34976 35028 -98874 -16239 -423107
11920 -423107 -114939 134897 -292166 289359 -4415 -19349 -155015 -152442 -133486 -150822 -324355
11909 -324355 -112291 243083 -223 145899 -206960 -15399 308633 221972 269769 125347 -71963
11897 159411 121817 -205137 -324215 247954 -323281 -111182 90610 -160882 211950 187465
11887 187465 -58135 65719 -33095 26714 -111394 -64501 -15481 -42952 -71500 126361 202550
11876 202550 15909 12643 150682 25695 -78218 88093 35485 206007 42412 -152935 -64512
11864 45022 18594 -134442 -31441 -3161 -27257 380009 15737 133433 315769 -48540 -188098
11853 -188098 -129540 -189344 -208426 195340 -121791 -164677 -43306 -161002 -273308 -46544 -150641
11842 -150641 -85156 152086 -135169 269404 -257475 -138576 -204784 -174251 97276 -128100
11831 -458220 -275975 124743 18873 -53667 -294389 -104480 27232 -156334 -75862 -310222
11821 -310222 -17504 -234537 228762 -22223 112588 57566 138235 173851 258321 -113300 -3231
11809 167690 8627 -534 -230613 -171497 109443 173732 128763 -41284 149236 -328179 56048
11797 -43551 -70141 -89706 -192953 38301 120146 -289245 269238 175741 56190 -264468 -130233
11785 -224532 69000 -244029 567919 -251219 -59500 -90375 416206 -19706 4985 -20483 -45137
11774 -45137 -52078 -142100 -77682 -296875 -357438 57245 -21145 19494 81384 -179610 32597
11762 97649 -146196 -19389 110593 127423 -263604 -58538 81088 -251325 -193565 92000 -32967
11750 -92484 -116543 271957 94519 110681 94672 189383 120137 -31400 -342206 57629 -35552
11738 386744 -249306 -34780 -89263 181594 -140573 117161 -201178 77636 -162707 -124067
11728 -124067 -57943 79343 -123318 -83155 349754 -211960 -233057 -13147 203145 57193 -46172
11716 39278 -67124 -167923 156399 -60916 -140853 125589 31832 71683 184560 406221 61014
11704 282915 -37789 -43210 -193997 192795 173684 -191210 -19731 -168354 -188299 47045 -165752
11692 84143 113548 17831 90321 -288641 -348795 66357 113471 14639 -317298 -289746 13347
11680 260530 -58406 136174 188998 140944 -39755 121052 160452 12200 85996 -134629 133888
11668 -141408 -64292 30208 246692 -46611 12226 267423 -142788 105251 34108 82654 99716
11657 99716 172389 -60978 100154 26972 -92715 212741 284638 -216667 257781 -101113 -13254
11645 48882 -121825 54148 35035 -13446 -85522 17894 16799 -174324 158086 -75269 -301321
11634 -301321 340061 -38364 -51955 448754 -221100 -160507 397140 172908 238929 156235
11624 156235 72249 -114593 21824 119549 167075 -156247 114203 -317636 -190722 -47937
11613 211958 69716 -106868 -255412 109467 105770 -71935 -331979 -166321 -173271 24224 64678
11602 64678 171791 -218822 -63425 265973 -296382 -78746 99863 -38710 41250 112851 -106196
11590 71429 -292454 238985 84421 153258 404795 304870 176447 -244521 230524 140354
11580 140354 26913 251509 158764 108412 16021 376638 270193 -25490 -43202 219953 -262798
11568 69249 232692 157839 128411 185941 292019 -86180 18965 213225 -81557 71240 85387
11557 85387 -232441 -169088 200996 -86713 369972 -110946 59098 186901 -107020 -29133
11546 172400 166569 -100062 40247 137089 111224 59787 -213197 298547 1784 195140 -78175
11534 -33513 21923 10163 -80052 288369 28488 -9985 10390 2873 94612 57071 -16689 279267
11521 -123898 -198304 -41156 336706 177725 -169395 -121 82361 -444 309486 135633 274695
11510 274695 99433 166657 309474 -42591 53462 3689 191516 134949 -226226 57470 -49229
11498 20556 -48795 143128 173678 255658 -54777 142354 -130171 554637 206616 434303
11488 434303 -25964 -64394 249391 69152 44589 48002 78889 427731 153006 -128873 124567
11476 171575 -103038 110020 -105547 114754 141988 -65827 23920 -258914 -231444 189819
11465 207971 -116715 177637 -273820 -17421 189532 302240 125875 67502 245547 -14872
11454 12373 62583 258570 427730 -151139 -137887 -100480 109628 464148 355262 96591
11443 136503 25403 403703 -77189 -159817 323985 220257 235175 353578 -44434 -205038
11433 -205038 -302939 136221 121497 -30573 -727 -84189 263708 -158727 -160430 131091 143170
11422 143170 52225 -343898 23002 170693 48959 108501 157261 -21649 217407 129450 -329828
11410 -241274 169876 -123429 -99030 71840 -233802 147931 45947 -21211 -103327 290056
11399 21703 199266 -329931 5494 -276563 37819 204027 214627 48984 -274373 29674 209893
11388 209893 170954 -71014 -11875 -43594 -167798 -147750 17968 -134849 -202198 -101116 -93179
11377 -93179 369357 -106464 -184078 -302534 -59035 -39164 225044 -250800 166955 394379
11367 394379 -462448 -50445 339497 -121425 184957 110077 208874 94787 336975 -190613
11356 291711 172922 -148397 90383 -195442 -316726 -56277 -91417 -106789 197493 122908
11346 122908 -5293 -217181 147264 -29895 32580 -75448 314895 17853 147139 -75354 -154626
11335 -154626 107810 280255 -293716 -94307 -54211 -57801 91228 -64232 -288475 -40143 22699
11323 240175 113717 -352226 80419 -99539 -141627 -309977 79437 266430 195625 -8700 973
11311 57526 -184668 -117254 -355691 4339 -11629 -274535 -3626 -429734 -88937 51757 -113186
11299 146650 -12848 -18301 -165095 -92800 -73407 223823 -324762 122274 -20278 -101475 -412223
11288 -412223 35121 -49241 27991 -158364 51646 280550 26228 114585 111506 31991 -132007
11276 2471 176308 7431 -215867 -76878 56810 -164369 -85307 -131509 76598 -172119 100744
11264 -111351 -107542 -74763 219079 -69810 317256 1754 -146905 -318588 21874 25688 -8451
11252 -47051 -159580 -110428 12963 -204851 -43666 -369751 -284781 -155099 138497 -71248 -116358
11241 -116358 176719 77784 147622 -570453 22359 -190849 -131930 -36536 -324044 -138859
11230 284885 -140358 4776 -3173 110885 180446 -147328 -168250 153272 20892 89518 248978
11219 248978 -241459 -82458 207023 318710 141940 -378498 -262639 -372814 195320 -161662
11208 -244733 159557 85415 -114959 -81182 213605 -45955 -69205 -18543 2621 78518 -91591
11196 -307804 379893 -105354 -389320 -66161 5082 70985 482158 -160991 -134434 -161253 -160796
11185 -160796 -282573 -56414 -200035 -162226 7773 -67721 -158020 -85444 80852 -72422 -720155
11174 -720155 53025 223661 116635 -246478 -13135 -398069 27420 12687 -233575 7060 -13201
11162 -181691 14370 215287 230139 -322648 -97583 61621 -140510 -161529 -14016 163250 -34863
11150 -128119 37826 119287 67105 80501 106547 -125410 -2853 -75488 218124 162970 -196143
11138 -422072 108743 -263582 -269483 -31131 -81238 -263113 -77949 110024 304571 -20427 -78205
11127 -78205 -56476 288608 210317 41050 -413127 269217 174640 -24558 41325 -116462 157272
11115 -238766 133236 -54122 72690 -73857 7135 152932 52745 143900 131854 216331 183607
11104 183607 -267710 558231 107675 130627 43137 -28202 136284 188422 -33680 491274
11093 78526 170499 177021 -30020 83084 285985 96405 263286 233231 66121 267036 193724
11082 193724 234007 382701 149067 411281 -110198 201880 -79002 85168 63376 198932
11072 198932 293942 224862 109054 396798 261894 287875 106341 431506 380464 168590
11061 550174 326576 454229 267178 448559 476282 583065 580331 624266 416781 681387
11051 681387 742402 650723 565756 438950 565807 558144 650939 926817 626715 1010354 840467
11040 840467 523442 275588 609566 440260 938025 598061 485062 725897 562841 289520
11030 289520 575527 797294 654896 754343 685746 840657 474981 955006 595578 699512
11020 699512 216968 891556 158816 529292 406840 605815 381384 601164 532794 471514
11010 471514 649939 619008 402352 674588 334603 147317 1045773 563609 423656 346833
11000 346833 457628 619097 514286 426220 616332 771489 624500 665458 754249 493809
10990 493809 394859 758736 781631 587770 637858 874199 932126 774304 979026 1274357
10980 1274357 1491160 1406028 1338364 1520422 1766543 2002333 2184113 2486361 2481301 2553507
10970 2553507 2376217 2287362 1931036 1964728 1470867 1572205 1260824 948421 988461 1668881
10960 1668881 1418441 1795953 1438649 1472486 1142817 1680825 1165815 910100 852529 666398
10950 666398 720227 529407 434321 161337 62343 381994 60543 328865 -88584 332173
10939 158490 -79914 175023 192075 372078 175331 135242 18449 201829 -133621 -294271
10929 -294271 236903 -133742 129602 94847 -21857 12031 383768 22206 368132 237923
10919 237923 258611 -117686 -88359 -259824 43110 -79818 277467 -33684 -254015 -108030
10908 -19048 138478 217918 155346 -81131 92033 74965 -165980 38293 43789 -42955 204844
10896 -224172 49922 -86724 51605 -157299 -36929 -385742 181564 306055 202639 313838
10886 313838 61734 -34857 -115775 226069 329403 -22554 -373855 -312651 -38990 69626 12999
10874 275604 -166265 -353313 -63696 104763 70863 -3057 -175646 81716 -43024 -412873 -295593
10863 -295593 -25594 -227730 239574 -29251 -104055 101942 64805 -169173 108551 237934
10853 237934 -115274 112120 -40744 74837 23812 98674 -215580 -409331 70226 213124
10843 213124 -133542 290948 20124 -353478 128395 -165585 115657 -48336 227751 -64772
10832 200717 -179820 -120253 33778 124657 -412861 132246 85593 -236077 21550 -28163 130849
10820 130089 70185 106311 -65266 3365 105973 -98722 -8485 -183154 -68608 -87741 155300
10808 174121 -190804 310282 -257553 -243888 16880 18040 48762 91246 75638 21425 -129475
10796 -77740 -55985 -137019 -170480 -46111 158897 -25080 197652 79359 -8493 69109 172152
10785 172152 123712 55797 73088 -353496 -127182 -219589 62458 -207457 -338685 64738 -116315
10773 -90285 -256884 -21828 291089 -131039 286354 -277869 139241 295771 -231282 14044
10762 31145 -184021 -133092 274330 66042 13858 -98224 -161003 64916 -62883 152715 171548
10751 171548 168027 -381945 -57930 116411 -236114 59196 129482 -71528 206316 -149457 -226249
10740 -226249 -201266 -351071 -424881 295708 -126680 -21305 51137 61367 153138 -135079 197642
10728 -210474 68072 -29759 23279 -296165 -132014 -125829 -291293 -32833 -3656 -64990 9782
10716 44273 -573453 383797 182335 -91904 87442 -230886 383833 327307 146730 21117
10705 -233949 304477 132111 -701597 66648 -123534 135886 74484 50559 61446 -104880
10694 145056 -637 -58258 -91547 -461668 -241387 -377301 -61333 -102754 -4247 229139 -138059
10682 -9850 -3807 -103487 77868 145395 -360977 77995 -106281 -192826 44607 -126422 -70523
10671 -70523 -6563 -133155 85970 140816 -256452 19264 -45498 40258 -349180 -248811 33528
10659 175478 61779 186130 -193208 -65621 57170 48144 -240636 -6782 54864 -59730 85683
10647 -292591 -126969 -408876 62990 -65582 -155662 -84229 -219139 167831 -332066 7185 -263036
10635 65261 135247 11002 -418045 -60952 173280 -152570 -5539 8628 61636 -265821 482378
10623 -87975 -9061 -139126 134669 59514 -7874 -38944 218797 -181715 -192904 -161817 195121
10611 -410249 -24514 49163 -265413 294456 -208041 -137282 -188551 -295460 43413 285714
10601 285714 -100043 -123585 -202771 -100549 -101137 -221890 -56361 193249 -131131 42054 -96667
10589 -215850 59726 -94014 106309 60114 174196 103539 344646 -312932 298436 -150618
10578 -135436 -89408 -96602 112278 10407 45202 38687 -209652 -216840 -8153 -68354 20398 296168
10566 296168 -27819 -19899 114087 152104 3814 -100556 -83434 -24925 -266446 173820 -151647
10554 282293 50636 -111273 173972 -254404 135618 -41864 33120 -241117 -54728 -133247
10544 -133247 96225 22270 248567 -169316 336773 -118063 34126 -310015 53991 -237314
10533 -212939 -53054 226306 78366 -170900 276212 393376 -101229 59119 83436 -112502
10522 -163542 -216282 -237814 -47168 -228548 -233679 -98573 43832 -29264 -274415 -25572 -125605
10511 -125605 -218651 -221152 20810 63723 -198394 57528 -41374 -84205 203105 -107427 282201
10499 -176563 81356 -144772 482384 21587 65591 303125 87601 -127840 -38216 -63288 -219154
10488 -219154 -205295 388066 -53904 -112227 224305 484858 462520 475409 182082 110090 99988
10477 99988 -232297 267168 -41266 -9649 -51475 -114255 -133090 -18188 -214215 184325 -146771
10465 12144 186278 -40370 -450782 -53814 -61810 -115255 25518 -165749 83071 190868 255654
10454 255654 -31681 100683 180071 -234583 -150157 218351 -150728 39070 119181 42006 -59877
10442 15609 95368 49583 67367 -153024 164572 4725 11762 275122 -437753 -410062 -4114
10430 109384 -60176 -90206 -393470 -208597 -336452 234606 237581 -206482 -57639 -228972
10420 -228972 49979 -47657 300081 97578 -159641 22194 337407 -62862 -159961 84679 18272
10408 100651 46581 -66476 28358 -149456 60661 9242 277936 7811 -102566 110154 272802
10397 272802 39750 184770 137279 92935 217403 210878 361035 -222862 119391 -86498 593
10385 -45028 40523 145886 45523 34146 -355667 -113562 248303 324738 6473 320907 126841
10373 -48601 138366 392383 187682 291064 484553 647701 143723 461061 363570 375185
10363 375185 218781 -46386 308668 216785 571005 -9049 417660 138830 42772 226944
10353 226944 54293 383319 165720 210063 448244 229368 237772 459463 329523 419757
10343 419757 -171940 175743 212209 358311 346084 229335 203925 -45926 486564 85255
10332 -110972 40563 78819 329903 -59817 170009 150159 279143 241312 -52240 186680 319506
10321 319506 246292 20444 34045 -56728 82692 7409 28328 -120274 -64508 -26765 -304863
10310 -304863 -109682 -45936 -37374 23784 20814 4344 -123017 324445 373597 68694 287656
10299 287656 115750 97912 -19640 -117029 -187701 54640 -263594 221428 -275969 -140166
10289 -140166 157597 26662 -263202 -118668 -233672 -6570 -80664 -86331 100348 148789 -255255
10277 -111208 -89600 50857 -9844 221299 50979 -358282 -95631 194601 -108996 148217 83022
10266 83022 -166165 141561 -41822 156840 78807 49039 505440 252112 83747 -47397 -120121
10255 -120121 10219 -67589 -299498 23899 330227 -195206 -325437 3060 369058 -108992
10244 -61605 48075 186554 169284 18621 40326 -233015 -160990 -61876 -373958 -114420 -90668
10233 -90668 398690 31233 4884 101963 -65837 220144 177834 156143 5211 111756 214904
10222 214904 78162 216597 -34581 -158564 -173149 -383835 89941 121536 8490 157181 -112198
10210 90096 -109704 44464 56956 -269341 -131695 112067 78436 47167 59621 -48556 172775
10198 -183606 68875 -270768 86622 -144701 206980 449538 225693 58536 -270179 78232
10187 -340798 -139499 54766 -133298 -58498 212402 -108761 -200162 -73232 -29305 -275206
10177 -275206 61051 -61764 66857 -32305 157448 -225414 -291265 -63244 -231753 143336 -62135
10165 92842 -56105 235026 -123927 -67903 131747 -315403 -8979 -29206 -239516 -20349 -82923
10154 -82923 -140915 282085 234616 -124529 16865 48190 -27954 29166 -85882 78405 -171809
10142 -480986 -19196 -330071 -191027 -48166 104847 -121022 -146988 -42544 158787 -12920
10131 189789 -150850 -355741 -342939 -256431 -128434 77651 117327 65541 -538396 -363370
10121 -363370 -19396 -116567 -146027 -151844 18534 267509 96338 -56664 -97782 22868 167483
10110 167483 194638 59181 139177 -236142 -88770 -166814 -461930 -52767 -201728 -197037 185205
10098 -277275 186829 69278 -57368 -138301 -3207 255834 -104140 240109 -25407 123624 -180906
10086 81096 54775 208646 -55669 -95543 -262300 -10753 255717 -370708 129725 -273207
10075 -76596 49847 -189951 -139542 -194520 -124250 110990 -270041 267700 307378 -189837 -225414
10064 -225414 -154471 39990 -26809 200775 9567 -216232 -22426 34538 60613 131771 -51643
10052 -26546 -45502 321889 222595 109026 -94099 -34878 -237755 197882 79560 94710 -74187
10040 -40599 210284 -268830 129066 -130530 111570 -1359 -163592 -176610 -95617 126280
10029 41822 -80175 -191246 -48473 144070 255384 -58702 -92656 -713292 -262879 -40670 48005
10017 -161204 -363998 78137 78625 -164028 -238543 2688 6261 190006 -142969 -292047 -9493
10005 20751 -152639 -168785 -212645 -155541 163298 240539 -66348 21955 69946 -66710 115812
9993 -144044 -124719 -390598 -77075 -187269 87658 -118721 15371 -58517 -188375 -70326 83614
9981 -313109 -110095 -178896 -294264 -84631 -196831 -140276 9096 -81529 -389793 -114766 -1118
9969 -228642 -276699 182619 -286646 153412 -176852 -31018 -195894 152839 -285199 -9451
9958 40537 -3082 419335 -88663 20220 -219724 -371941 -300657 285589 -52385 -101539 181365
9946 -227590 165386 257459 -127880 147865 -295282 116808 360303 -184025 -178232 -122762
9936 -122762 -22853 -40302 -415805 53678 -246857 -351846 -368284 104526 -112695 168459
9925 7366 1139 62315 56809 -382040 -28575 -217967 54364 239381 -2670 -325639 81068 -3003
9912 235064 -11949 -163681 299899 -134084 5009 104938 32960 224455 56711 84058 -406039
9900 -175052 -249363 -116481 -103761 -261673 -455072 74549 -121699 -390385 -225131 85644
9889 -10309 -350956 171519 125738 -142563 -295380 10877 -221717 128069 67049 -348923
9878 35185 38047 -214283 20871 -23287 -168773 -82029 63263 -129354 -350790 -244767 141578
9866 29831 -12517 12691 -326484 -106936 -175984 202582 -131355 102887 -160017 311587
9855 55753 -106008 419649 -184340 -164556 369815 166714 -129458 -66438 -380271 -68959
9844 -361258 193325 136065 -297199 -277305 22652 88956 -187250 -422876 -39344 190402 290709
9833 290709 -49043 -522304 -19645 -26832 58400 -121543 -463883 -281290 -85544 -19101 -329928
9822 -329928 151976 235412 -82034 -147267 51757 92626 -163304 227513 33226 -98709 -67408
9811 -67408 99506 -145045 -283107 358470 38125 111371 -204667 37374 46271 45678 -48494 141427
9798 2276 80870 222230 -88974 16099 -1148 -202085 6296 -182988 -141425 228304 158199 103751
9786 103751 -27638 -81525 -53258 -70674 104373 -2896 -161919 -22489 226770 -181979 222617
9774 -152264 219587 187375 176106 -281539 -48846 12207 -60347 -240111 110562 98537 -34218
9762 -18017 17390 19293 -74515 -64722 102712 -245354 443975 -32497 -382462 46732 -12133
9750 -92708 126270 -172990 -176453 -447323 105525 108798 -152827 -265733 140023 -477080 -39113
9738 -120239 -21394 -70640 -177730 -43305 209376 25008 -326278 -22435 133146 -100546 302089
9726 9719 -61423 -276316 14536 15963 -30415 55757 -15071 -363686 -231708 47142 -122702
9714 80683 -264584 -208602 12388 -226152 -168551 33605 -168615 -328778 -365363 -132719 -203639
9703 -203639 -15957 -100891 -262645 -257345 283730 -276938 -17615 123239 -247590 -240638 -65092
9691 -106602 26164 -78381 14388 -13894 122578 254007 -15374 -47824 103849 -63323 162383
9679 18136 -9147 -131665 118758 3265 -28201 -109875 172229 -96688 -176979 -139261 182467
9667 -21919 48221 -366143 -374449 -46344 57025 -211135 70988 -161863 110239 16815 -86747
9655 -160591 -348966 -129773 -55766 73062 -79782 251415 -263630 -229912 -46021 -223972 -274605
9644 -274605 118918 376835 -468773 75774 -204555 85293 -250080 124604 -199732 -199821 -216109
9633 -216109 146064 212343 101801 210596 16614 134750 -39636 -157321 -16558 -246276
9623 -246276 111032 22125 -440082 93503 76009 203411 15053 -88740 -216817 -25173 -104272
9612 -104272 25053 220072 290321 -165701 -118842 -158078 -37787 -101884 -48576 -111503 -29461
9600 -56347 -60893 -238524 37422 79667 -250708 -77092 -285129 -225911 20667 -158023 -189594
9589 -189594 -149572 -170251 -223059 -10365 -139209 530075 77358 -37471 237004 51256 -15007
9577 84320 7392 -286654 -89036 -9353 -219635 89535 92273 177803 -47558 -17808 12419 -27380
9564 -20139 321104 -248864 -53824 -136714 40044 143802 -293518 140366 -84438 -351987 60472
9552 -114266 -171128 -91184 95120 17508 -164587 -131907 -302047 -7592 148917 -113103 -315792
9541 -315792 -140481 -124543 480784 308952 38368 -461266 -155245 100357 33091 -264507
9530 -328190 -107455 72476 255277 -342261 8516 -235451 -188979 -74157 124892 113339 38768
9518 -14806 -153597 110410 -185721 -28378 -385049 -88385 -27536 46896 -161058 4415 -207722
9506 -170039 -152301 -180461 -5509 -158196 -33715 -119003 520051 66434 6718 -32496 -28850 -87280
9494 -87280 -163281 85531 138277 -218628 -125320 -62064 -89027 -161065 225366 -165719 219747
9482 229252 -375810 -2073 121971 -186921 57746 -164950 -232949 -254970 -141066 199908 -85240
9470 133589 -101950 58867 -160884 167050 102880 -145065 7238 -318351 -316261 -208584 109009
9458 297799 -27383 -35193 -119035 -64727 317916 -28801 -84472 33148 -137595 18849 -27659
9446 -172472 37911 5334 54873 -113185 -191500 202360 -367587 -204105 -62367 -80410 -101165
9435 -101165 -49930 -28861 83081 -20822 43350 -367121 87530 -535378 -219697 206738 69141
9423 190928 -263880 -94433 -175519 191334 306631 -159131 206398 -25957 133692 -441403
9412 139642 -274583 -222800 -27178 -217714 -111719 -340228 7927 -186810 90233 -163163 153421
9400 134383 -8228 -13932 109259 -15200 -63080 -286873 197246 -251768 338326 58664 -123280
9388 133687 84271 253461 255435 -74141 32617 260006 -181493 172029 77157 -120786 -57490
9376 103770 -247162 200591 47938 -126479 48092 -23245 -84234 -172371 -280370 -203000 -137072
9365 -137072 97525 42429 -31713 -134563 34524 -60159 -399181 -36999 -69133 -73193 41191
9353 -303369 15317 -49204 -4497 -97683 231455 -18471 -70311 -261924 242527 248723 102607
9341 -50389 -92117 -36839 -274862 -440594 190826 73434 35505 -151955 -243541 -302896 -108802
9329 132964 -311166 81088 -310774 -72704 -177000 -256558 -343512 -265555 -27152 -222670 -75604
9317 -337185 60112 -66537 85895 23454 8362 -80593 330314 -8163 -55874 189580 109688 141738
9305 141738 24827 -104258 -365994 211691 -199694 237053 -52489 -119060 217403 164119
9295 164119 87802 -351707 79363 -360538 -207339 -40533 -273746 162637 -83818 -256012
9285 -256012 -247213 257477 -278064 159669 4286 214414 -49527 52043 339561 97830 145821
9274 145821 64636 1175 78803 -303962 -31347 -15785 -129288 -185960 -162082 -16463 73655
9262 -55895 55091 -34450 -95886 -270904 -14733 -524981 -176048 124375 136067 -13654 -152077
9251 -152077 -92059 -304258 98634 -141430 -215310 -125704 -345973 107099 -296130 -114674
9240 -107334 -294370 -237924 212650 29483 164893 -93085 -214680 -90870 -158244 -250813 34038
9228 -90224 -421611 502748 314656 -5109 -355660 -185300 -185317 171593 -9293 -5078 -31086 201658
9215 4916 -53073 -226546 271950 -436760 -138930 187927 167247 -63514 72141 -168909 -56521
9203 45561 111325 151747 178863 40154 -106275 33834 -60325 -58235 -28549 228322 -116554
9191 9017 -279497 80060 219279 -93043 171602 -282681 -308678 36235 235270 88076 -297210
9179 -47205 43173 -110994 -285854 -305307 197039 82564 -343341 -3884 -144696 -32905 -114793
9168 -114793 93024 -42054 -288494 -33692 -98302 350424 112819 -291302 64012 -88801 -28187
9156 -290615 -197313 -8095 359121 -275150 38147 -77342 -35654 102227 46714 100525 -43510
9144 -218337 -262539 -81603 -53781 -37999 -123099 -240056 -279381 -8791 -284684 -138035 -65438
9132 188210 105758 -115103 179532 -184755 -204697 185371 597 131894 -28879 -84683 -198036
9121 -198036 -200584 -34941 -285494 101504 316973 189742 -26346 -44554 -194849 -444269 -51107
9109 -121465 27893 -131231 212698 199099 9187 -348603 -15111 138100 138922 -397293 89187
9097 74160 -53068 71725 58745 101781 57579 96348 64134 -133699 -63375 52990 -64321 -161574
9085 -161574 1764 -65265 -91776 -215694 80038 -102591 165845 263285 129152 -422172 190796
9073 123902 318591 170046 -316851 59119 -242468 -379593 83129 54795 -217472 128706
9062 -170766 -363691 43453 162295 -28799 86630 -114596 50421 -158982 -76313 52504 56398
9051 56398 -18800 -132895 -82720 -92224 -270096 232110 31721 -24637 -71992 51738 -76256
9039 -32813 -13639 -118655 -110982 155416 -342337 323154 411923 -148230 -236718 164734 8073
9027 178293 -44300 -114339 -102187 -336445 -167285 111974 -143449 -304530 -353324 17171 -123551
9015 43194 -196362 -69539 -178771 29559 70156 -74424 -121207 269636 -304616 -311683 -17787
9003 -82511 -159384 -178533 -260308 -35959 -185322 35273 -62965 -32889 -308840 245908 -65326
8991 31554 187297 -85742 -98806 -320718 -79574 -166787 -22006 -166642 92808 -238060 165256
8979 -288861 -229772 -140454 429345 -219811 -315701 3490 100722 -76149 156539 -351451 -118099
8967 159105 -30899 -170070 -327815 -131222 -229990 -253328 138035 158488 287072 40150 -59489
8955 -14376 122548 159724 66375 72075 -93277 21646 -16401 -130475 -180629 10549 -126839
8943 193110 23798 26286 -160947 58549 -35713 -115408 53404 165384 276250 244011 304195
8932 304195 156763 -98216 12687 70459 85783 99704 243875 292199 1058707 3796430 10202678
8921 10202678 5747900 1707485 751254 492647 22485 153271 176414 41989 -35813 -138954
8911 -138954 84759 -142288 182646 161515 -237007 -51696 35926 -146442 -81377 -84836 112361
8899 -27950 -62910 -111047 -144155 252636 -265695 -261463 55298 -1831 189908 -21806 -691 88131
8886 -87242 -256663 -33285 -218090 92935 -266382 -229491 122158 -83635 -98562 201846 -208064
8874 -149666 1443 -224038 120596 251654 153659 -76632 -239803 94973 251285 -280588 -313501
8863 -313501 -419755 11623 -249354 -339447 -16896 -192088 -132505 -141589 -214545 136809 -293842
8851 39337 -269114 -159553 -315179 -177410 -161946 20174 107463 -356386 115548 -103451
8840 -255215 -56162 -117651 241305 48844 231824 98669 15275 86529 -294123 9841 160741
8829 160741 25500 -155489 -163717 144572 31970 48591 75848 249121 237117 19130 -67443
8817 -62480 -60987 -97836 13351 57850 -107112 -169992 -131548 142357 -163781 -47620 -35935
8806 -35935 50071 224965 -219384 -63412 -97887 62032 21133 -435625 -163401 199997 -377336
8794 -132392 77402 242220 34855 324815 -128347 65961 38156 218542 211560 223622 9300
8782 -232693 -181399 -228009 16578 -255360 150622 66790 273497 -128523 -265435 -109207
8771 -114116 -385181 -163310 310318 -45501 -433663 -170702 -52390 -10176 -321147 -102612
8760 -106667 -205081 207316 38585 -143380 175354 67279 -176780 -77644 339878 -49676 -331173
8749 -331173 100869 294757 188946 70080 163606 -81089 131344 -385749 -133689 -201541
8739 -201541 128143 -141945 410556 -35868 -78975 -272904 -189418 -116806 -38378 -238301 -376199
8728 -376199 -209794 -198913 221531 -347273 2995 150198 -350805 46282 14911 -122256 63886
8716 -100716 -128464 -142152 45761 94043 25222 -222633 -39028 322537 141842 -96908 -37063
8704 74374 -263745 154544 -186662 22061 -51682 -202212 152519 72730 -128500 113182
8693 39363 161477 241598 80449 -191352 -309534 -65979 217434 296347 -72059 164887 113612
8682 113612 -25571 197556 -118529 408723 -135765 19411 -67742 156765 -62158 -148738 -677070
8671 -677070 488810 -105194 -85635 32629 -365900 -264169 -244703 -255090 42894 -118678 -215517
8660 -215517 168704 -12638 -211346 -253857 -298613 -310759 2992 52554 138054 -33794 -56315
8649 -56315 -11609 -42256 -411005 -48047 -167350 -307839 -11878 -218380 41613 106391 -18979
8637 25413 -234285 -306856 -149168 -170012 -101175 97635 -2063 1167 -17324 -252820 -74629 33457
8624 -75660 260685 -425070 54649 -174424 -182316 -96612 -102578 -154628 397660 -193343 81318
8612 7958 207855 67961 -296639 -345466 -28794 -2313 -233816 -120443 -39223 -99018 -120797
8601 -120797 -84019 -49474 -37194 -236982 -11110 -115163 140426 -126417 -64187 175547 -2372
8589 -215833 -160582 44867 65876 -286166 -103972 -160621 216934 26916 -190702 -157536 169929
8577 99347 -141314 447608 -16078 -199089 7497 157785 195828 -301185 -42017 -37686 -152052
8566 -152052 32115 94236 235957 -41567 -8473 -158203 15070 13448 -163762 143884 -84311
8554 72663 -161843 -15310 98606 -159570 -404450 -140312 9155 246271 -276881 -446607 -8245
8542 349980 -11286 -14379 -107843 -270445 -43510 62195 11265 -394972 -198915 -167411 -98086
8531 -98086 -819 98545 10490 36290 50286 -150458 175760 96629 -126301 222730 -55538
8519 7213 174496 40120 -282814 -58688 101534 30140 -381492 -427037 182393 100975 -138771
8507 49951 246983 -94581 -337185 -226467 -233624 -151239 -224927 -240210 27471 -115234 -79257
8496 -79257 10905 167317 -132442 28578 -338633 -88428 179713 25150 195766 136000 -4807
8484 -63876 138567 169555 -267282 -39927 108353 -58087 -79963 -279732 -30062 -24475 96123
8472 -133988 -236172 82636 -240765 91114 -22576 170283 129430 87804 -158397 -158261 65936
8460 6070 -185576 -268979 186367 -45246 -334317 76319 -239206 -182663 -49078 35061 -243653
8448 -114085 68005 130399 -11762 -150150 70632 -135044 -37080 -124532 -284347 -107219 53154
8436 40014 -247482 141316 297643 49502 121816 -240340 15133 -215432 27481 -178773 94482
8424 -270955 -154741 -181185 -416387 -59024 -159154 -170183 -191993 -19419 -167774 -117699 32158
8412 -73088 125257 142099 -174468 283592 30597 160506 68475 -55322 -83465 279638 -114588
8400 -1269 64393 67616 67193 -29481 -132150 4458 -98447 -241649 18257 -61471 149276 -311618
8387 -149614 173231 53950 110612 5153 -271087 309835 -256358 -164360 192648 -272860 -231221
8376 -231221 -121345 -341038 -65431 -109157 -280208 -13970 4962 -147913 -174712 224491 78053
8364 -63327 -118519 77262 -253621 -217761 22251 4377 203823 -399185 -565844 -72133 -42718
8353 -42718 -86072 154380 301379 -80835 124034 -361736 117728 45785 -115315 -305489
8343 -305489 -148484 -311855 62473 -32186 165557 -108051 -248572 -126913 233154 -224776
8332 -49515 -35956 -27841 -116744 -176596 287835 7682 168915 49546 -193370 78306 -275815
8320 -146009 -41577 -153473 -243743 -247623 25050 11871 27813 105365 -97276 43607 -268641
8308 24128 -144190 69229 -77859 -205509 66367 -240310 -39932 -40811 160926 307300 153842
8297 153842 -49461 180661 131859 258589 -201459 115141 -221946 -134322 -100926 -68343 99152
8285 127718 -168200 154826 244977 82087 8626 143593 -341577 -138584 -150608 423672 -274858
8273 -57183 -350448 112771 -74310 -311668 194453 117696 -491659 -56506 -83177 -200104 -157180
8262 -157180 298544 -234129 -156185 -298371 46038 -39647 -78758 -136385 -98103 -107740 -477493
8251 -477493 -103101 108335 -28616 -65324 -261219 24112 -149666 -321065 -215332 35985
8240 -255682 -246489 134136 -112020 244735 -6360 267277 98556 -109551 -108503 -307933 296647
8228 13260 -78697 -122088 -49696 118470 -33201 113674 -122946 25506 -163911 -269775 -204029
8217 -204029 -79335 -144479 -113811 -92751 474477 -6738 137728 -244850 76836 -42846 111017
8205 -131735 14004 -15381 -7771 6709 4938 20629 189537 378696 127695 -157698 30612
8193 -42030 -184680 188395 10560 412279 1756 71252 -451546 -252852 -437498 257735 250287
8182 250287 36817 -122657 -19330 -40112 -39571 -158392 53131 -77922 -215705 70417 -29579
8170 8996 -54905 -282685 166470 -139579 -201554 324563 -209546 265473 -30814 110645 -174426
8158 36195 6517 -123939 79226 -207246 267296 71631 -145836 9292 23747 -23807 -145221
8147 -145221 29563 -132014 -383745 33009 138175 34199 100795 216085 -116208 316532
8136 108654 -193065 38773 -28454 -191384 -143220 237236 38626 -190222 -297358 120817
8125 -52123 -111145 -287498 -311868 -99552 217690 142823 -115136 -112198 -62532 -86280 -319886
8114 -319886 183615 -216565 -280423 36506 249976 110496 -2831 24790 288226 -141790 -329595
8103 -329595 -23490 -119229 66646 64906 204925 272251 -217915 -30375 -320522 -71059 17564
8091 -129723 -338665 -213325 207003 8831 -75047 -141749 -44137 89745 -208806 -65395 222378
8079 -58170 -115461 246723 -14993 -147696 53779 47218 239120 -123543 -161075 192847 90243
8067 -109914 208398 -299029 8499 57295 -175195 -16468 82007 44714 10408 -257824 35477
8055 9974 -180541 -62752 240735 -194750 -33685 -279121 92542 -93415 -69654 61236 19789
8043 -73808 -542942 50084 -168854 127534 -339232 38864 104903 -187271 35282 110082 -75387
8031 -255655 -270016 -79389 -174467 -47510 37018 -138752 113087 -258443 110212 247390 33596
8019 -238957 -127971 -412772 217797 224796 383162 223308 -6897 -4750 318621 -28290 137077
8007 -138331 -112724 110363 -153936 100041 46364 269858 -225017 24662 -48782 -309068
7997 -309068 -217318 -128575 -200884 175040 206144 -312956 -35123 -185622 6439 17222 -280761
7985 -93785 -240716 -40841 312576 -244875 70982 -273638 -171564 89333 90601 180097 -28575
7973 -139765 135358 -82713 77858 -278891 -430440 158290 -177291 324243 93393 130773
7963 130773 261582 -153455 63812 98585 -156918 168655 -48528 -3971 -169342 -343196 -132333
7951 35371 -131875 -174020 -38374 -337826 -349974 65035 -5869 491131 -153747 -83672 -173186
7940 -173186 12799 84272 -344598 -6444 6080 -176705 -52102 81112 214833 -98916 -196531
7929 -196531 18678 -93850 115724 -45319 110436 -8172 -203091 43262 -126683 -213951 -237339
7918 -237339 123916 -143398 124585 139569 -88736 117650 24490 -214982 -43772 -247867
7908 -247867 -143371 -243666 -146609 4418 44067 -89254 -365405 -199390 16683 -90476 87420
7896 -274877 149984 220450 166183 -82212 -160632 32938 93413 -67886 90096 81551 387757
7885 387757 -61354 -125048 -53037 -169152 -106051 -37850 -171203 -219042 76106 394640 -248215
7873 -183573 1526 -157154 -254174 243282 -212247 -62996 36434 -162831 -388246 -341867 43999
7861 164488 324911 -35218 46311 -11985 191684 -144486 -36451 -129990 -67882 167741 -83835
7849 -267486 12701 184715 106237 -59830 -332574 -288143 -126600 -258835 -219193 367857 -209285
7837 380080 -346114 -18122 168280 -218924 -7922 49211 50971 2949 -28597 36052 79652 -95135
7824 289014 92528 -169184 -135235 -181005 -136112 89880 7010 275047 205800 56792 -114512
7812 119201 -109994 244900 94051 157493 -79829 -95680 -207105 -60527 -19842 136699 -67179
7800 -140443 -188186 -62048 -15 -3118 -217717 121348 -248741 -122584 190580 66661 -188051
7788 -196682 23529 193647 -273621 -153166 -193234 86808 -49929 -101490 182277 178950 34706
7776 37219 -82731 -102923 -258947 -149286 149631 -230552 -132506 -16439 87424 349871 -41066
7764 96622 -188182 -201550 -31005 112223 62300 7505 -260838 -127117 171900 -465400 7532
7752 -76929 6570 129125 361468 -117153 -32669 55539 204123 -31253 -11701 6250 -132689
7740 -193003 -32894 1684 -51705 -97796 -131753 -46817 -167984 47339 -150198 104185 -18445
7728 -298849 151719 50870 -192096 132678 110592 3186 312470 203196 174902 131136 -22356
7716 19555 -126472 -275323 -46416 432393 78342 42358 -35818 -133586 84717 55805 -92689
7704 -118928 -172555 -182535 132144 155481 -175404 -70465 -96794 -158896 -190615 -187623 -167348 -322963
7692 -322963 -46958 -234566 -95271 -289699 73138 -53424 49048 -22346 4203 109901 -181276
7680 -213909 -289776 87104 -163757 -61330 -29966 -195680 253262 -235571 -71047 -323504 -214828
7669 -214828 -298014 182395 122272 21312 158360 274059 -131468 -46395 131275 14669 -56993
7657 5472 103475 -219553 99931 -90014 238206 168820 -70676 -122919 -61475 -322380 -98385
7645 -31981 -199450 62650 -62875 72002 -41356 84741 132085 6556 -53146 -157182 -63405 63529
7632 -157122 -305599 536713 -274950 -413215 653883 -260219 -77385 -115347 204830 -42312
7621 388664 5197 181239 58734 123231 -55014 146362 -57082 -311156 -258078 113295 270289
7610 270289 182756 135005 31408 -308263 112823 181970 238126 -176292 196292 7402 18112
7599 18112 -121967 -21742 160358 272716 -25259 177750 33967 134198 107964 -42611 -212123
7588 -212123 -188645 -329179 -214261 141630 -280608 -149331 -47809 -192306 -61605 184899
7577 -302735 -198560 -287626 -250001 -151142 243073 -213101 -274979 -246155 170429 -137829 -182411
7566 -182411 -5734 -33716 -164265 190943 -84841 -76388 -65438 -141695 -123541 -211070 100578
7554 -257884 202257 -89700 157415 -141229 -375274 51082 47312 -425534 189240 -115091
7543 -287834 -288478 158825 101154 128125 54483 -2009 107352 55769 -143298 -67668 -149495 30491
7530 -31674 -105655 54247 91934 -47859 284166 -134018 11118 37107 -33649 562 -268076 -172084
7518 -172084 -192397 -303536 -169276 -115651 -127045 -39121 25736 -163496 92766 93899 -319694
7506 65592 -243907 -78742 141 58178 -64974 470911 683 -93234 -398533 27008 33650 -217199
7493 -36854 73528 166778 174205 95463 3456 15556 -20094 -157632 212064 -267851 38034 39750
7481 39750 5035 142979 -24972 337163 -253257 111839 -88221 23208 -72731 -383253 -23696
7469 -243085 296261 -198513 2840 -11595 18905 -271181 4434 208530 -195553 133290 154963
7458 154963 149889 155858 352673 -84229 -180796 380439 -307528 -331686 -68529 -33846 251042
7446 -9997 -182198 258213 -193461 -61786 23466 210872 -10466 -142364 108050 -29806 260317
7434 174889 218247 -31642 55440 -52075 42125 -201587 -149590 -75862 -189186 -206281 45738
7422 -34720 -32535 2575 -375569 -103902 -71758 -91188 -84661 251951 125348 -163220 123605
7410 58984 21879 -47032 -206326 -67460 51903 -252306 -89508 -187599 69950 -219351 -129629
7399 -129629 5942 259285 -354791 -139774 217213 22137 77357 239193 -54301 -304281 -49488
7387 110136 -5423 130010 92420 45650 -200241 157966 220200 224671 -292171 -14378 -228724
7376 -228724 137135 -317563 -429709 -46363 -28556 -204778 105361 162881 -366723 -34734
7365 192483 -55639 63956 -29679 -192463 -272231 54042 112274 -11627 -99443 -64838 162428
7353 165186 237145 102199 71829 264160 19423 -28595 -95257 444187 -77627 30554 -35046
7341 -91381 97855 294681 258603 -76460 -14862 -92638 -226454 107218 -83261 -56011 -289973
7330 -289973 74455 31894 -54732 -59955 37560 -227307 -160597 -26052 -63104 111584 21093
7318 -253195 32690 -138294 -6953 144111 240072 29216 -342736 270524 341053 283390 227050
7307 227050 13376 -114344 -37882 -335742 -119988 294095 -284813 -163706 232172 -251162
7296 -163117 -12185 -48903 -232821 -54285 -144662 -192488 -80403 14558 24461 -56624 -117186 -58523
7283 9851 -173560 252190 -217638 -51091 58897 -257131 -57253 -272423 177173 173776 -256367
7271 133224 -65236 80079 175328 -70325 108038 -62147 -83392 -262642 -371443 -75785 -129586
7260 -129586 82996 -67569 -108487 111046 -114389 -232165 -98067 -23771 97113 62953 10254
7248 131231 111093 168608 -175962 -213178 -278714 -52629 -218199 114678 -63294 26599 -196297
7236 -153491 -99726 18089 195575 -149008 13063 21949 -194373 85900 -322703 66161 106955
7225 106955 105938 4781 -219390 -14227 167819 77721 -59110 10355 -233781 324159 103953
7213 -20687 144305 84337 -13344 -29328 -173567 -320939 -257049 138896 -209095 104346 142126
7202 142126 130729 274860 -12475 -152354 123070 -245868 -129164 266877 -182279 78652
7191 -219862 -262296 -50561 -217661 -191611 -111321 -309987 35438 245701 414846 -174677 -112266
7180 -112266 1720 -90632 299424 -74360 48572 -28689 235794 -283101 136615 -105383 78936
7168 67728 -250439 -21877 -11308 142771 -47114 -34652 27852 -131636 -8294 -199070 209988
7156 -144278 27213 -55143 -311893 -77195 -17805 -203532 -110886 -97009 78648 -302031 -23684
7144 -49192 109114 -204554 -114687 136876 88941 -283248 111487 -284129 -254285 59018 -20559
7132 38754 -189390 -101985 193453 119976 158124 148962 204187 -346842 61823 -80187 55180
7120 -65869 143466 -210316 40681 -68954 -183284 -172460 -12341 -93726 151232 -203855 -227719
7109 -227719 -185074 -230627 216635 -524802 13411 74711 -292942 272306 -154361 87711 272568
7098 272568 29725 -59020 182555 -524357 116786 168778 -40247 -145637 -192117 209866 -99466
7086 -172281 -113783 118239 80324 -304848 -6038 -70188 -48398 -44939 182626 223285 53123
7074 13573 -162855 75404 366550 -161734 -29114 -126519 -104974 382594 216225 13531 41638
7063 41638 -149832 -23065 -79698 306477 -94104 14398 140856 -324317 79994 -86948 -6876
7051 104705 -50356 78097 151540 139694 -108013 423072 -143713 167922 106945 22672 76337
7040 76337 -243487 -103106 -337536 174280 -151438 89851 64667 -236565 37797 -71755 -115408
7029 -115408 103768 -89813 -127723 -136443 -25119 112515 -37309 48405 -81504 5465 -24149 37623
7016 -343539 31590 -55195 -191291 5148 19129 132678 -73666 235500 -418553 185614 120430
7005 120430 -44260 5473 -314408 -214977 -328615 44898 295977 11435 -417882 108371 192100
6994 192100 -126367 238460 39319 49224 -188501 -49803 220618 -268892 -12273 59385 382885
6983 382885 113935 -152974 45086 139601 453650 -40185 115944 -238911 26638 -212473
6972 167770 127499 -60679 111083 363435 247330 193953 41289 -169401 -181785 23224 48129
6961 48129 -131919 73933 -216354 60637 78351 -124013 179001 3161 228730 -131996 -30350
6949 343191 78293 101007 171995 -173393 50949 119042 108476 71209 -166945 21602 226109
6938 226109 -221746 -120100 -63697 93892 -69690 145110 -340256 -114013 100987 -362513
6927 96422 -188691 -69749 -15487 -74765 -179288 -66861 157518 -368800 30253 -116083 -372622
6916 -372622 65851 -284319 -19465 180194 -1036 -248351 -73594 -294672 134542 178293 85292
6904 98575 162636 12109 -242933 -96307 -3398 -158982 -231232 -6709 -66027 -37877 81562 83736
6892 83736 110510 73962 17478 -92582 249335 -57190 -113182 29505 -300372 137305 -270601
6880 319511 -41029 -326789 -169037 222884 -179129 -537523 28364 12031 -74067 306579
6869 27189 -232929 -142931 10278 -142053 128554 307137 366155 46361 90580 92745 -11835
6857 -117134 129539 2977 -149824 -109248 -28241 -102152 62318 -33109 181611 131127 -106794
6845 -22313 234387 -304279 -1419 52430 -58370 -23824 130605 -230027 102316 384646 6734
6833 -50480 -27396 -264608 273830 -88599 32689 -384765 373 -5924 -262193 97945 287710
6822 287710 -263189 38003 233121 -53396 -63461 -23356 -211855 -446106 -8899 -89891 18698
6810 -71455 -73285 -183589 -179957 -94847 59983 74874 -68081 114299 74692 -128689 -81743 85722
6797 -319351 98361 48472 -324966 -55429 -238772 -388974 211600 124835 244940 -457752
6786 -216671 158338 12444 283760 -61733 35753 -104571 106455 -17760 -326565 -19682 -112756
6775 -112756 26036 -42332 -90145 -218230 32016 379778 -235269 169466 235892 -377489 -84506
6763 91968 90848 -105334 203823 120673 466699 198772 -201108 -15329 -724 -174388 -222242
6752 -222242 3722 115089 4793 162735 -72217 -157513 -154868 64325 -75116 125471 44502 40241
6740 40241 -62066 207858 101876 -243765 105347 -32468 4272 -102457 -36681 91648 -31913
6728 99614 -229102 280929 -40481 -84065 39058 -205899 314255 69816 46707 -129190 250492
6716 316937 374764 48534 260841 159254 12627 147553 25828 -28299 32546 104425 -60876
6704 -78443 -118577 -273153 -25560 -29314 -211045 118301 224133 345354 -118024 -325359 87368
6692 -139894 -348617 245139 116010 -179835 -9383 148421 -2989 232219 113795 251116
6682 251116 -63260 242068 -130856 94604 -213032 -161973 96133 258092 -337740 96523 301515
6671 301515 -6320 -255027 23382 -330080 -66364 93467 -77377 4568 91275 -77095 50278 16587
6658 210814 348863 -204237 -1964 -25237 13548 133007 104271 -178318 306713 -256038 -43980
6646 -120666 166977 -72409 -312260 47060 -392087 -28759 -23132 -20279 212396 37670 125255
6635 125255 272091 73753 15505 339782 -42013 -31362 34308 302179 -117846 -229867 -326009
6624 -326009 178434 -49669 -213582 -150977 -64171 -137282 -43348 39061 -75291 -198116 -100778
6613 -100778 -9521 42763 261127 -21964 144944 234388 34834 -63082 -23704 88225 -234613
6601 -286618 79899 263222 -221263 -30230 -276277 24733 -66653 43488 -173819 80171 146620
6590 146620 -54517 153633 99005 43996 -261785 -194296 106668 175028 11308 60210 29534
6578 163865 79590 398808 14162 -22009 -138641 -70093 -300132 -329872 -264553 111577 -124753
6566 81021 -2291 91736 110138 -245233 -157377 116409 -148433 68662 -278783 128070 -150537
6554 62138 -38478 -165842 -133105 -222225 -233610 -29761 -133025 -199789 342682 57327 -173820
6542 475243 133665 -310873 103059 220713 -183921 19479 73354 -97674 131945 -78592
6531 80159 -136606 132832 93335 106193 78987 293357 -132868 244949 80139 -98940 -284412
6520 -284412 -272940 -137183 253261 -108302 165505 -168539 42300 88842 125855 144082 -14712
6508 89405 23747 -130459 5644 -213487 286924 -229052 -178528 -189950 -40727 100386 -4872
6496 26498 195136 -30130 -114780 236618 -47842 303159 -288839 -275459 18992 110147 -367122
6484 -987 -87919 63518 198650 215684 262675 -212119 -24812 86736 32820 -30219 -234832 -275190
6472 -275190 128476 -222123 298452 -1497 82414 50755 -52623 -71688 142166 -37861 -82211
6461 -82211 124691 194975 -86438 -194232 -52018 -32347 -139438 -69590 -115365 296660 -226957
6449 -190179 -95185 372607 -127171 443351 18111 -222078 -334463 -17849 142226 -191241
6438 -224102 139464 -218520 -72964 718 -73558 -17181 -89851 377071 -35988 -43172 -107805 -72509
6426 -72509 106058 -127367 -77005 -115105 47192 -145256 -63212 -123449 -179894 -71518 -190365
6415 -190365 -353501 -269912 133458 -198583 112314 -93630 -153074 103955 -59818 -384474
6405 -384474 300950 17650 -37720 108258 -248232 -28366 182062 -182753 130152 -267337
6394 -319585 192110 254801 24987 -230538 256030 -20311 -149725 105064 386820 111628
6383 -211936 319928 35343 127021 -35633 60842 45009 86013 -173085 147010 -49852 281871
6371 24940 -35762 -80214 -21132 152029 -92000 166887 -85198 -31030 9649 94671 -191448
6359 -304798 72016 -190177 30279 -203867 141849 48941 -488021 -33047 -151227 201661
6348 -21401 -276332 319326 -58361 163499 -416430 54069 182895 -49551 389395 -166472
6337 244459 -46981 19756 235959 366133 -168622 -75455 -93412 78678 -277217 -94654 55489
6325 -81950 -150016 115231 -67776 232278 -140640 97030 -390159 -9606 -9214 -65969 -325981
6314 -325981 24515 48187 127565 -47313 141281 -71961 752 -182480 -133971 -301295 -152191
6303 -152191 -521793 -188 -223572 156248 234186 52806 -70840 108483 372895 35350 -186280
6291 -229781 -233207 -79582 -167488 -241747 169741 -88608 107817 -358862 -237225 249222 75190
6279 -252 67678 198744 6215 -206744 -40311 -106250 -252365 -263175 -9390 -114757 -41496 183662
6266 -191173 422620 -241238 -162371 -1523 102222 -464237 46055 -15272 362475 107880 -43273
6254 300350 -51215 37257 -149588 -407 -356244 -2928 -2988 -122720 122799 32704 109785 -25210
6241 351442 93162 108555 -394180 -32608 -140366 -294943 -120411 -205802 -56264 104022 25863
6229 -253208 81423 139365 65852 -91887 53401 -78604 -16507 152527 -66317 -43368 -97319
6218 -97319 9831 -285843 -90577 -217003 -38606 157698 209299 -286832 -8285 21497 -83647
6206 174245 -93939 -341371 -425943 28648 -100158 59742 32220 99174 -320890 -86886 110270
6194 21488 -168146 250789 -69269 463428 40679 -38456 -29671 -37684 -93010 178782 -51570
6182 97446 -60750 295983 -232434 -239783 -15350 -16395 195923 -155613 -321 329838 287850 -220562
6169 84475 9402 38346 -162288 171460 -283982 243731 128843 -341353 1792 200839 388801
6158 388801 24584 -25525 -14247 187233 -12239 -51135 -178462 64878 44183 46031 -66334
6146 -403792 492872 264648 152181 143935 185922 -26683 334776 -25309 399736 167722 247483
6135 247483 -69851 339172 104263 99294 43540 106085 260853 198860 264201 -74603 -58780
6124 -58780 -49829 -28404 -15718 -155669 133962 -1453 -153769 103778 93797 264575 -329947
6112 19586 -13878 6928 -52560 96104 55553 -176540 -123178 -91632 -181904 192967 57815 57981
6100 57981 -23740 -213920 15692 639 -222617 -20571 281759 -36005 281374 -270137 -17185
6088 -54717 -41651 -16937 53602 38734 214966 -16173 -336272 -299073 -151806 20689 -181769
6076 -105626 -462745 -420632 205548 -67002 -102140 71245 263502 -45060 -137865 -162904 -235934
6065 -235934 -188475 88122 302031 -30718 -107428 208424 64174 1456 119895 173372 -66349
6053 -10911 74970 -92382 171697 -11322 -172319 110194 75981 -243968 -247555 -38227 -84514
6042 -84514 15784 -298937 -26410 74250 7618 -436538 -248648 76180 -54424 -231778 -187589
6031 -187589 -119196 94426 -210766 -235054 -546 366370 122389 -82485 -131915 215562 -94919
6019 91376 -495079 -33582 -21032 -15052 29120 -77186 122578 -245041 -80146 -15700 215412
6007 78880 258451 -168615 47873 -68231 -158039 453466 -69225 181001 -164378 -156567 -213583
5996 -213583 45815 31388 -134061 83275 -61192 118214 137906 -160006 155388 -121892 30748
5984 43134 -220811 24246 133493 -44752 9559 483609 65316 138227 -220754 49371 75192
5973 75192 -154963 -266178 81904 187536 -27986 -177564 -26865 231687 182808 -100886 -157002
5962 -157002 234618 268809 284261 204591 -224246 109686 -89339 -25554 -310367 -396869 -107803
5950 -6378 -93899 -37676 -182264 282049 53624 -184838 -175368 21102 149476 -3329 -167785
5939 -167785 91833 -27610 26689 158166 -245605 -172679 113413 120369 -48186 162465 -26465
5927 278720 -112189 228316 -44062 -4354 -51082 -95167 24512 156686 -133645 52909 -115889
5915 -81856 -106389 -64278 284244 -12478 93577 221343 -21545 56485 -58074 157840 150451
5904 150451 -508025 95167 72638 -105996 225877 321852 226862 337456 -176472 -147327 111831
5892 269840 -278427 228899 -5754 -92486 190496 275711 -150193 17575 -1202 -81830 47240
5880 262908 127405 -43392 -110605 -228072 294675 -1000 109199 -171281 -11638 62563 59932
5869 59932 -92080 -13795 -474 -126320 62293 -71044 -25558 57638 101747 295799 192732 101538
5857 101538 6303 -3363 -190735 159580 183719 -16875 133512 20910 86230 -76353 -65146
5846 -65146 174086 -256947 183849 -219544 -249607 -207081 370455 -250792 289284 -65630
5835 22440 -35160 -31373 -245559 307869 43449 314685 -56653 -267523 -22328 239484 -3840
5823 20545 -125912 -15287 8475 61422 -52654 -36479 -261176 178444 -69166 19133 -87746
5811 46779 17814 -77014 154840 -136577 132893 -85701 -66967 97000 177030 115039 254237
5800 254237 -1726 -42827 -47488 -359309 -237304 -86036 -162364 35598 -47031 194051 161043
5789 161043 -66487 -130718 172258 -181452 -12863 -135030 21153 -143798 -74302 -350888 -4574
5777 -80119 321991 -261405 42303 -20181 -254309 -139971 -35170 31904 283218 -202326 150878
5765 -178551 -407638 -198737 -216320 190946 134262 -139468 -276976 -239199 -92327 67984 3949
5753 263045 -140944 41400 -13793 -23477 29278 -52717 -279059 -200665 -8505 -76547 66500 -26474
5740 292182 82358 -38720 -81248 -111599 -461348 343355 334184 -73001 -322964 -99929 64464
5728 -13197 118597 -363181 -172129 4232 -60472 -120659 66548 241591 -14160 -249245 168812
5716 -37510 -80053 87407 113404 -177505 384334 105199 67874 303502 411480 57432 -185797
5704 -303763 221891 34707 264003 -92115 186908 -148856 12727 -220489 7523 97477 21860
5692 -221500 -38800 135566 -125926 -490378 79678 -106996 -292072 -43773 -10019 -160772
5682 -160772 -294884 -920 2079 -22491 -83543 -73026 -45501 -16005 -59429 -117260 82016 -3542
5669 182783 92641 -20334 212760 126183 -48493 -96008 -258075 269823 249751 -234958 56524
5657 239662 120115 -59724 204647 -2848 -73634 -129715 166077 302170 127196 138628 -15531
5645 39464 231955 -113599 -267026 -111307 61555 -259650 250842 -58773 56980 -35258 259997
5633 56124 42962 -249095 -29208 -284002 -88811 55425 -8094 318639 49500 -14111 -373344
5622 -373344 -91187 81415 -91073 -258496 67924 -113214 -60438 -57357 -119445 96342 18165
5610 -31208 64957 -91576 -100604 -300733 -29556 -107275 -143978 301784 95558 127940 65793 200182
5598 200182 -48450 389519 172043 57801 143497 205630 -409517 -298587 -256189 126281 20699
5586 47097 -14881 -105468 30149 -44818 -254053 -346611 -249069 44589 -18169 -351129 -21694
5574 -274213 -65391 256409 179514 327009 196321 -15058 -82338 68645 33683 163968 -51890
5562 28659 45824 115008 -58290 -120657 146878 20971 -301540 -71268 31941 55141 50333 -85929
5549 -29295 380123 -225453 -116330 -15249 54739 52717 221034 51718 -277165 -79300 75585
5537 -141000 -116947 106379 46736 -3281 -388361 -81834 69775 36321 352416 -487801 -25914
5525 -26272 -285961 317994 -1222 -6519 279487 43606 -226340 -304745 280205 -220700 -302559
5514 -302559 -14169 -20424 39414 112132 -87040 292384 -94164 -110091 -60878 -117496 -90042 -58724
5502 -58724 -40779 -172058 78072 49944 -4870 -221459 -158078 -81351 30980 -54485 25451 -267433
5489 -55236 179826 49723 -250135 -81974 132320 -112122 -30237 -244578 -308348 10630 341554
5478 341554 192502 -162795 -235409 -150792 10059 43946 195120 27362 234521 44398 52881
5467 52881 -102368 321084 -242990 210130 377919 -201817 97230 179140 -44710 390624
5456 4635 304388 -16784 22018 33636 -62441 94129 115900 162881 287135 -97855 -108442 -107128
5444 -107128 -121659 196106 -44982 110896 -117690 130059 -237 -292833 -170139 -85809 -39051
5432 74579 78725 -70703 -34174 526246 17671 -145159 -136883 -83091 182445 -144539 -60978
5420 5454 233749 -66592 33921 4269 -119660 231742 -128502 35002 -109949 -157659 71745
5408 -39132 -59966 -287946 -13220 143077 -116915 86587 -208133 323691 430551 143229
5397 202772 -40865 38846 315877 -279642 242874 -135803 -108877 103509 267574 52059
5386 -31140 39597 -18178 151257 431839 -75986 198986 412107 58891 142542 203665 -92759
5374 -188547 -20732 47050 307451 270719 -273097 25509 -32633 -217661 43699 -8401 -313140
5363 -313140 92342 -115742 -41404 -208325 -201307 234561 -237366 -35336 -362859 -11961 5197
5351 141221 -205571 -375418 -275928 -337104 -76559 358889 48620 38787 -176115 312029 -112340
5339 -187574 -172938 -230915 148344 -227560 46191 382716 -86738 10283 135447 -332207 125622
5327 70495 218230 -43071 87878 30959 132935 46271 20663 32647 137605 -93263 1096
5315 -206810 -124406 -204832 145659 -96995 231364 -36091 828 -108630 48765 66947 -260983
5303 266157 171816 -106119 111085 -106389 23190 -19453 222148 344068 -148683 -287279
5293 -287279 -31004 -146844 -4152 215801 354286 -26996 83287 -159729 85034 -255267 -397703
5282 -397703 87176 108917 -69364 -51634 229009 24317 -2288 17019 -28737 181188 -69929
5270 190610 -43324 -121896 134117 326633 8566 -107969 -408 76165 -304618 107588 257897
5259 257897 31544 149403 -233820 -268028 13147 53689 -302959 -109427 288899 -112931
5248 153940 31128 340962 53538 164898 1223 -131239 95962 -393094 201406 -33258 41577
5236 -136405 50061 -5963 -44641 208397 -120540 10127 70934 -10834 -160658 13091 -131116
5224 98327 202055 -145485 139189 -220320 28146 -417027 119512 158685 -133920 -35265
5213 133352 -83336 -29676 221020 -101229 192586 265255 193212 -99753 262548 214321 46404
5201 -147267 68474 -127839 372062 71109 101009 199458 89797 122866 -95278 68365 -167558
5189 266495 -252593 -213732 86810 -78526 16271 51539 74477 -126120 -31436 251805 91276
5177 -34856 296229 -188379 349779 -160225 72073 -130869 129736 203909 -174280 -328746
5167 -328746 38397 193698 202496 -9109 -136648 -202535 -135939 53554 423 13241 -13843 123372
5154 -297189 -434955 -14216 27671 392700 -84004 96512 -89163 -222895 -3578 64436 -58702
5142 -170336 -26165 83881 -41683 161287 -260031 -240399 -32615 125432 -23208 -73062 -43867
5131 -43867 1667 131635 -195214 -289392 -127446 -126540 -135583 169314 -102038 -92501 211187 63975
5118 -27097 -339299 82854 -228226 84174 -8702 -32364 385935 247122 -73696 -31075 329088
5106 75204 -63027 -182035 251149 281681 147470 261131 248620 -123404 -70298 -47108 75143
5094 -237173 203308 -212782 57680 -176995 36408 56634 -168722 151576 -118225 -15468
5083 -55655 116432 43462 120276 -210802 129753 -140674 -253583 -232635 61366 513626 246700
5071 -220684 66550 -182196 297713 180537 -270540 124032 -21102 38298 -321156 -30060
5060 50427 64364 -44419 297566 -170238 -87167 -19589 -63988 36223 -265953 -92480 -173695
5049 -173695 156664 -419549 55291 -33453 -7174 36638 12295 15214 172302 144706 -6827 89315
5036 -71002 190296 -13605 -57370 127716 213226 -105173 129654 47507 61546 86374 -30920
5024 64652 17379 -28293 84924 95827 9755 -236593 33950 370244 -185121 162150 -161092
5012 16663 36658 57086 -125735 90175 -56289 14397 -24588 -145771 85180 104896 84709
5001 84709 -2794 -163102 333 -241469 269051 165863 94415 -162180 -45851 -86527 -89187 175875
4988 -58547 -131583 -134625 201680 85780 -90403 104630 126993 -125865 221830 149081 20848
4976 112564 264364 -31402 191588 173877 147633 -135839 -101656 -96076 104081 -48293 277512
4964 70216 253773 179009 -362202 167305 -172351 -31721 171818 -5579 71878 106815 113596
4953 113596 -30639 279110 59528 165667 90231 -311188 71967 -210406 -98943 236357 143951
4942 143951 -3483 -105836 252926 61938 99771 -194160 32200 -91186 111724 214782 37664
4930 -91188 275427 -10280 120931 191148 -34301 -21575 70796 3821 291523 1107 -50415 236786
4917 -13546 -158518 239937 77114 67257 -111035 -43080 72941 -40846 113153 4951 67214
4906 67214 29984 -270857 71108 -439617 -314117 -117301 -192907 -260871 3531 130884 -101654
4894 -46114 301331 251330 -37127 205367 -4843 -298586 19917 -432659 61818 -148720 86599
4882 -47896 55436 42674 -332146 -106239 28881 -19855 322004 291184 68337 25841 -158002
4870 281764 -350163 -54187 -354563 -142610 -141703 -204333 280973 -113549 -107300 77504 -56619
4858 -276374 -353797 -19455 17447 4291 219723 -75647 -122803 -10531 121891 12877 43286
4847 43286 -181544 33707 253583 315615 291953 -206214 -136475 114595 95036 -153593 450026
4835 13491 95090 -347401 54659 -17924 -122723 18602 276152 -163224 -7149 248677 -135266
4823 -182030 -86989 118794 -35044 -173549 -151031 -4855 -145493 271691 -157744 -283418 349787
4811 -154412 -41279 28706 -52818 100526 163878 35387 -107074 -107624 -107961 316666 -278489 -219425
4799 -219425 83250 -251 165785 218907 -187892 -10948 -290684 72679 -71263 -129354 82518
4787 266692 127598 -161010 -72589 249239 -164859 150935 -84962 178688 -90300 -86886 54989
4775 -120200 132698 70975 -102376 -28239 122117 99845 287070 -326219 154646 -226137
4764 -49979 237925 -141711 46737 130961 79476 17394 -59080 -13809 -249706 -198318 -275515
4753 -275515 108244 -134471 -246835 -104311 167317 -140306 -169160 122616 -214138 3222
4742 65798 32276 -20085 41033 212780 10657 37778 28867 -12524 -15996 121072 187248 -64794
4729 -192762 -18001 -41670 -45154 -48128 145277 -222581 -601834 -208950 -254519 286281 225967
4718 225967 315295 140297 163745 38172 -136563 40907 29510 -147510 -340007 318571 140678
4706 -173639 -2799 97434 -30476 77484 111404 218794 -125876 -297187 73205 -45271 194102
4694 385542 288280 -101889 -190705 10364 88264 -281919 -294354 52610 -20567 31212 7447
4682 211048 -168692 159503 -8026 -221082 -398510 -107849 -94347 96659 -71874 61395 142614
4671 142614 156538 41130 160968 69508 -105180 202611 -200724 -260500 -45829 -669940 -139953
4659 255428 -79086 -96850 -278 157543 129856 -162055 244582 -31994 263720 -191038 344537
4647 326739 -56826 -277643 63441 263861 156349 23518 -69156 133136 -115753 -13578 -177274
4636 -177274 -18792 -5143 190234 5162 -155125 110279 -324774 -81374 -118113 115896 -224160
4624 164063 27920 -218771 51952 198948 -52967 -118442 91898 13874 -88742 -264014 212471
4612 228579 -206410 -164761 -41292 175840 -49758 -29422 195138 -34975 -22740 -161544 -207958
4601 -207958 -195013 14705 66928 1787 95048 -41476 -23864 -89538 143597 119965 241731
4590 241731 166640 78929 14440 24860 300263 -221705 -246851 25268 372876 -16544 -39241
4579 -39241 -198074 -24816 -64053 -152371 -238905 -194841 84974 -143096 133283 243203 27396
4567 -124295 1447 218516 70887 -112730 50864 -57957 207951 -180865 -280339 -224524 115223
4555 -83483 -142963 66490 -281013 198734 -80221 -31904 543315 324254 -69574 8990 -27522
4543 100524 341793 -322689 84586 213961 362870 12371 120453 -70305 105308 7066 -137798
4531 -242073 -18641 198879 -44549 23729 156881 237582 -230108 42051 120971 149215 373675
4520 373675 -110104 -62034 -143270 -210628 -261645 146686 247509 -29374 -102131 151035 -151604
4508 -39281 -4518 -62521 -176223 -223515 126964 433067 -101424 121038 246927 161349 168410
4497 168410 -170114 -108305 -158511 304466 164569 -12250 153433 34051 -323368 -59979 21252
$$ [...]
##END NTUPLES=NMR SPECTRUM
##END=
