
##TITLE=UV1202_M3_1292-1211_7185555_A9px6Ysfh0
##JCAMPDX= 6.0         $$ Bruker NMR JCAMP-DX V2.0
##DATA TYPE= NMR SPECTRUM
##DATA CLASS= NTUPLES
##ORIGIN= BRUKER
##OWNER= Administrator
$$ 1.72 TOPSPIN		Version 2.1
$$ 2012-12-06 01:22:21.034 -0500  Administrator@X
$$ Compression mode = diff/dup
##.OBSERVE FREQUENCY= 400.02188249412
##.OBSERVE NUCLEUS= ^1H
##.ACQUISITION MODE= SIMULTANEOUS (DQD)
##.ACQUISITION SCHEME= undefined
##.AVERAGES= 64
##.DIGITISER RES= 22
##SPECTROMETER/DATA SYSTEM= spect
##.PULSE SEQUENCE= noesygpps1d.comp
##.SOLVENT NAME= COFFEE_meoh
##.SHIFT REFERENCE= INTERNAL, COFFEE_meoh, 1, 14.96068
##AUDIT TRAIL= $$ (NUMBER, WHEN, WHO, WHERE, PROCESS, VERSION, WHAT)
$$ ##TITLE= Audit trail, TOPSPIN		Version 2.1
$$ ##JCAMPDX= 5.01
$$ ##ORIGIN= Bruker BioSpin GmbH
$$ ##OWNER= Administrator
$$ $$ E:\/data/COFFEE/nmr/UV1202_M3_1292-1211_7185555_A9px6Ysfh0/12/pdata/1/auditp.txt
$$ ##AUDIT TRAIL=  $$ (NUMBER, WHEN, WHO, WHERE, PROCESS, VERSION, WHAT)
(   1,<2012-12-06 01:22:15.159 -0500>,<Administrator>,<X>,<go>,<TOPSPIN 2.1>,
      <created by zg
	started at 2012-12-06 01:10:45.597 -0500,
	POWCHK enabled, PULCHK disabled,
       configuration hash MD5:
       86 BA 57 50 F2 9D 5C 9B 26 00 A9 28 5F 66 2E 89
       data hash MD5: 64K
       4D 10 6E 07 3F 85 BB 71 5F 91 C8 37 9F 0D 14 52>)
(   2,<2012-12-06 01:22:18.253 -0500>,<Administrator>,<X>,<proc1d>,<TOPSPIN 2.1>,
      <Start of raw data processing
       efp LB = 0.3 FT_mod = 6 PKNL = 1 PHC0 = 0 PHC1 = 0 SI = 128K 
       data hash MD5: 128K
       12 AE A2 47 60 DD 53 04 60 5A 67 46 CA D8 E1 B4>)
(   3,<2012-12-06 01:22:19.347 -0500>,<Administrator>,<X>,<proc1d>,<TOPSPIN 2.1>,
      <pk PHC0 = -80.48035 PHC1 = 0 
       data hash MD5: 128K
       3E 4B 90 BA D8 02 12 DE 5D A0 A8 08 A5 08 6D EA>)
(   4,<2012-12-06 01:22:20.019 -0500>,<Administrator>,<X>,<proc1d>,<TOPSPIN 2.1>,
      <abs ABSG = 1 
       data hash MD5: 128K
       5D AE 86 70 45 CA 97 FF 95 B2 42 BC C7 3A 1D 89>)
(   5,<2012-12-06 01:22:20.191 -0500>,<Administrator>,<X>,<proc1d>,<TOPSPIN 2.1>,
      <abs ABSG = 2 
       data hash MD5: 128K
       37 DA 6E CA D9 E0 B9 0F 11 7A 5B 8C B0 66 F2 54>)
(   6,<2012-12-06 01:22:20.378 -0500>,<Administrator>,<X>,<proc1d>,<TOPSPIN 2.1>,
      <abs ABSG = 3 
       data hash MD5: 128K
       13 24 58 FE 37 BC 37 60 6E C1 62 02 AB CD 18 8C>)
(   7,<2012-12-06 01:22:20.534 -0500>,<Administrator>,<X>,<proc1d>,<TOPSPIN 2.1>,
      <abs ABSG = 4 
       data hash MD5: 128K
       DD 11 77 AB CE EB 7B 21 81 4B 32 98 EB 42 E6 28>)
(   8,<2012-12-06 01:22:20.691 -0500>,<Administrator>,<X>,<proc1d>,<TOPSPIN 2.1>,
      <abs ABSG = 5 
       data hash MD5: 128K
       08 EB 7E FE B2 4B E8 FC 34 20 05 E3 1A FD 9C AE>)
$$ ##END=
$$ 
$$ $$ hash MD5
$$ $$ 50 9B D7 34 AD 96 ED B3 6D 6B D1 1C CE EB 53 1C
##$RELAX= 
##$RELAX= 
##$RELAX= 
##$RELAX= 
##$RELAX= 
##$RELAX= 
##$RELAX= 
##$RELAX= 
$$ Bruker specific parameters
$$ --------------------------
##$DU= <E:\>
##$EXPNO= 12
$$ [...]
##$TP07= 0
##$TPNAME0= <>
##$TPNAME1= <>
##$TPNAME2= <>
##$TPNAME3= <>
##$TPNAME4= <>
##$TPNAME5= <>
##$TPNAME6= <>
##$TPNAME7= <>
##$TPOAL= (0..7)
0.5 0.5 0.5 0.5 0.5 0.5 0.5 0.5
##$TPOFFS= (0..7)
0 0 0 0 0 0 0 0
##$TUNHIN= 0
##$TUNHOUT= 0
##$TUNXOUT= 0
##$USERA1= <user>
##$USERA2= <user>
##$USERA3= <user>
##$USERA4= <user>
##$USERA5= <user>
##$V9= 5
##$VALIST= <valist>
##$VCLIST= <CCCCCCCCCCCCCCC>
##$VD= 0
##$VDLIST= <DDDDDDDDDDDDDDD>
##$VPLIST= <PPPPPPPPPPPPPPP>
##$VTLIST= <TTTTTTTTTTTTTTT>
##$WBST= 1024
##$WBSW= 4
##$XGAIN= (0..3)
0 0 0 0
##$XL= 0
##$YL= 0
##$YMAX_a= 6053921
##$YMIN_a= -12090841
##$ZGOPTNS= <>
##$ZL1= 120
##$ZL2= 120
##$ZL3= 120
##$ZL4= 120
##$ABSF1= 14.96068
##$ABSF2= -5.597502
##$ABSG= 5
##$ABSL= 3
##$ALPHA= 0
##$AQORDER= 0
##$ASSFAC= 0
##$ASSFACI= 0
##$ASSFACX= 0
##$ASSWID= 0
##$AUNMP= <proc_prof1d_extract.lims>
##$AXLEFT= 0
##$AXNAME= <>
##$AXNUC= <1H>
##$AXRIGHT= 0
##$AXTYPE= 0
##$AXUNIT= <>
##$AZFE= 0.1
##$AZFW= 0.1
##$BCFW= 0
##$BC_mod= 0
##$BYTORDP= 0
##$COROFFS= 0
##$CY= 15
##$DATMOD= 1
##$DC= 0
##$DFILT= <>
##$DTYPP= 0
##$F1P= 0
##$F2P= 0
##$FCOR= 0.5
##$FTSIZE= 131072
##$FT_mod= 6
##$GAMMA= 0
##$GB= 0
##$INTBC= 1
##$INTSCL= 1
##$ISEN= 128
##$LB= 0.3
##$LEV0= 0
##$LPBIN= 0
##$MAXI= 10000
##$MC2= 0
##$MEAN= 0
##$ME_mod= 0
##$MI= 0
##$NCOEF= 0
##$NC_proc= -2
##$NLEV= 6
##$NOISF1= 0
##$NOISF2= 0
##$NSP= 0
##$NTH_PI= 0
##$NZP= 0
##$OFFSET= 14.96068
##$PC= 1
##$PHC0= -80.48035
##$PHC1= 0
##$PH_mod= 1
##$PKNL= yes
##$PPARMOD= 0
##$PPDIAG= 0
##$PPIPTYP= 0
##$PPMPNUM= 2147483647
##$PPRESOL= 1
##$PSCAL= 4
##$PSIGN= 0
##$PYNMP= <proc.py>
##$REVERSE= no
##$SF= 400.020009766629
##$SI= 131072
##$SIGF1= 0
##$SIGF2= 0
##$SINO= 400
##$SIOLD= 131072
##$SPECTYP= <>
##$SREGLST= <1H.CDCl3>
##$SSB= 0
##$STSI= 131072
##$STSR= 0
##$SW_p= 8223.68421052631
##$SYMM= 0
##$S_DEV= 0
##$TDeff= 65536
##$TDoff= 0
##$TI= <>
##$TILT= no
##$TM1= 0
##$TM2= 0
##$TOPLEV= 0
##$USERP1= <user>
##$USERP2= <user>
##$USERP3= <user>
##$USERP4= <user>
##$USERP5= <user>
##$WDW= 1
##$XDIM= 131072
##$YMAX_p= 404456390
##$YMIN_p= -12131
##$CURPLOT= <Network HP LaserJet P1505>
##$CURPRIN= <$Network HP LaserJet P1505>
##$DFORMAT= <normdp>
##$LAYOUT= <+/1D_H.xwp>
##$LFORMAT= <normlp>
##$PFORMAT= <normpl>
##$SURQMSG= 1
$$ End of Bruker specific parameters
$$ ---------------------------------
##NTUPLES= NMR SPECTRUM
##VAR_NAME=  FREQUENCY,     SPECTRUM/REAL,   SPECTRUM/IMAG
##SYMBOL=    X,             R,               I
##VAR_TYPE=  INDEPENDENT,   DEPENDENT,       DEPENDENT
##VAR_FORM=  AFFN,          ASDF,            ASDF
##VAR_DIM=   131072,        131072,          131072
##UNITS=     HZ,            ARBITRARY UNITS, ARBITRARY UNITS
##FACTOR=    0.0627417313425164, 1,          1
##FIRST=     8223.62146879497, 1872,         -56281
##LAST=      0,             3037,            -56592
##MIN=       0,             -12131,          0
##MAX=       8223.62146879497, 404456390,    0
$$ Real data points
##PAGE= N=1
##DATA TABLE= (X++(R..R)), XYDATA
$$ [...]
$$ plain form
63980 269910 274275 279567 286100 293709 301711 309508 316917 323959 330694 337458 344897 353469 363042 373148
63966 373148 383439 393730 403889 414086 425035 437651 452342 468807 486546 505448 525859
63955 525859 548224 572791 599747 629700 663952 704127 751506 806896 871152 945515 1031242
63944 1031242 1129106 1239451 1362513 1498389 1646699 1806490 1976375 2154564 2338909 2527121
63934 2527121 2716801 2904854 3086880 3257576 3412060 3546810 3659434 3747941 3810551 3846001
63924 3846001 3853667 3833277 3784753 3708596 3606486 3481410 3337112 3177457 3006371 2828146
63914 2828146 2647256 2467482 2291267 2120169 1955923 1800851 1657191 1526155 1407707
63905 1407707 1301133 1205766 1121218 1047162 983058 928128 881413 841697 807609 778166 753204
$$ packed form
63980B69910M365N292O533P609Q002P797P409P042O735O764P439Q572R573J0106
63966C73148J0291J0291J0159J0197J0949J2616J4691J6465J7739J8902K0411
63955E25859K2365K4567K6956K9953L4252M0175M7379N5390O4256P4363Q5727
63944A031242R7864J10345J23062J35876J48310J59791J69885J78189J84345J88212
63934B527121J89680J88053J82026J70696J54484J34750J12624Q8507O2610L5450
63924C846001P666k0390m8524p6157j02110j25076j44298j59655j71086j78225
63914B828146j80890j79774j76215j71098j64246j55072j43660j31036j18448
63905A407707j06574r5367q4548p4056o4104n4930m6715l9716l4088k9443k4962
$$ plain form
63894 753204 732818 716206 701451 686771 671699 656738 642125 627399 612011 595886 579393
63883 579393 563209 548282 535505 525262 517449 511954 508806 507885 508854 511555 516231 523255 532799 544726
63869 544726 558517 573327 588514 604250 621238 639599 658378 676318 692868 708180 722422
63858 722422 735447 746976 756775 764647 770458 774187 775884 775596 773388 769237 762874 753934 742455 729076
63844 729076 714578 699281 682943 665128 645621 624649 602790 580599 558291 535900 513579
63833 513579 491424 469137 446455 424089 403675 386396 371921 358972 346563 334391 322512
63822 322512 311225 301048 292226 284328 276765 269570 263185 257646 252519 247600 243102 239070 235164 231243
63808 231243 227662 224718 222164 219576 216958 214686 213017 211875 211050 210400 209882 209403 208651 207175 204876
$$ packed form
63894G53204k0386j6612j4755j4680j5072j4961j4613j4726j5388j6125j6493
63883E79393j6184j4927j2777j0243p813n495l148r21R69K701M676P024R544J1927
63869E44726J3791J4810J5187J5736J6988J8361J8779J7940J6550J5312J4242
63858G22422J3025J1529R799P872N811L729J697k88k208m151o363q940j1479j3379
63844G29076j4498j5297j6338j7815j9507k0972k1859k2191k2308k2391k2321
63833E13579k2155k2287k2682k2366k0414j7279j4475j2949j2409j2172j1879
63822C22512j1287j0177q822p898p563p195o385n539n127m919m498m032l906l921
63808B31243l581k944k554k588k618k272j669j142q25o50n18m79p52j476k299
$$ plain form
63793 204876 202360 200503 199568 198961 197929 196286 194394 192660 191226 189948 188587 187093 185764 184961 184656
63778 184656 184422 183890 183030 181985 180926 180096 179720 179708 179709 179544 179390 179480 179920 180839 182305 183894 184765 184523 183734
63759 183734 183230 183128 182935 182416 181849 181463 181069 180417 179609 179000 178848 179188 179903 180798 181646 182235 182457 182444 182636
63740 182636 183496 185035 186734 188134 189313 190643 192277 194177 196503 199519 203092 206565 209301 211162
63726 211162 212506 213915 215945 218819 222227 225678 229138 233091 237842 243029 247989 252327 255867 258326
63712 258326 259520 259802 259855 259895 259432 257950 255548 252718 249809 247062 244940 243893 243707 243511 242696 241517
63696 241517 240564 239966 239479 239143 239292 239879 240340 240365 240445 241358 243343 246081 249301 253095 257665 262899 268107
63679 268107 272138 274126 274393 274333 274998 276038 276466 276149 275881 276074 276263 276160 276431 277857 280179 282409 284082
$$ packed form
63793B04876k516j857r35o07j032j643j892j734j434j278j361j494j329q03l05
63778A84656k34n32q60j045j059q30l76j2Jj65j54R0M40R19J466J589Q71k42p89
63759A83734n04j02j93n19n67l86l94o52q08o09j52L40P15Q95Q48N89K22j3J92
63740A82636Q60J539J699J400J179J330J634J900K326L016L573L473K736J861
63726B11162J344J409K030K874L408L451L460L953M751N187M960M338L540K459
63712B58326J194K82N3M0m63j482k402k830k909k747k122j047j86j96q15j179
63696B41517r53n98m87l36J49N87M61K5Q0R13J985K738L220L794M570N234N208
63679B68107M031J988K67o0O65J040M28l17k68J93J89j03K71J426K322K230J673
$$ plain form
63662 284082 285590 287341 289063 290054 289818 288386 286178 283576 280515 276625 271899 267029 262744 259013 255273
63647 255273 251374 247824 245057 242890 240939 239250 238296 238518 240035 242560 245407 247712 248926 249135 248962
63632 248962 249290 250983 254477 259388 264730 269777 274639 279889 285848 292400 299280 306287 313372 320829
63618 320829 329305 339255 350447 362349 375054 389497 406560 426212 447724 470669 495427 522687
63606 522687 552619 584674 618125 652521 687393 721708 753958 782786 807179 826098 838577
63595 838577 844673 845880 844044 840072 834244 827440 821040 815357 808913 799738 786930 770560 750730
63582 750730 727544 701810 674970 648099 621382 594737 568594 543863 521344 501371 483939
63571 483939 469041 456826 447439 440700 436029 432780 430647 429736 430330 432665 436812 442598 449700 457892
$$ packed form
63662B84082J508J751J722R91k36j432k208k602l061l890m726m870m285l731l740
63647B55273l899l550k767k167j951j689r54K22J517K525K847K305J214K09j73
63632B48962L28J693L494M911N342N047M862N250N959O552O880P007P085P457
63618C20829Q476R950J1192J1902J2705J4443J7063J9652K1512K2945K4758K7260
63606E22687K9932L2055L3451L4396L4872L4315L2250K8828K4393J8919J2479
63595H38577O096J207j836l972n828o804o400n683o444r175j2808j6370j9830
63582G50730k3186k5734k6840k6871k6717k6645k6143k4731k2519j9973j7432
63571D83939j4898j2215r387o739m671l249k133r11N94K335M147N786P102Q192
$$ plain form
63557 457892 467164 477539 488926 501271 514696 529334 545115 561859 579590 598709 620056 644846
63545 644846 674210 708488 747066 788965 833111 877523 918602 952088 975157 987472 990437 986084
63533 986084 976788 965230 953802 943859 935610 928497 921558 913777 904392 892834 878294 859669 836211
63520 836211 808065 776021 741072 704492 667974 633057 600352 569598 540452 512926 487235
63509 487235 463659 442570 424100 407624 392040 376894 362988 351532 342811 335961 329960 324466
63497 324466 319608 315333 311295 307289 303477 300059 296987 294313 292636 292667 294119 295462 295300 293907 292943
63482 292943 293657 295833 298598 301641 305175 309099 312904 316392 319943 323916 328171 332368 336329 339737
63468 339737 341793 341674 339395 335922 332296 328772 324819 319871 314076 308408 303954 300974 298761 296589
$$ packed form
63557D57892R272J0375J1387J2345J3425J4638J5781J6744J7731J9119K1347K4790
63545F44846K9364L4278L8578M1899M4146M4412M1079L3486K3069J2315K965m353
63533I86084r296j1558j1428r943q249p113o939p781r385j1558j4540j8625k3458
63520H36211k8146l2044l4949l6580l6518l4917l2705l0754k9146k7526k5691
63509D87235k3576k1089j8470j6476j5584j5146j3906j1456q721o850o001n494
63497C24466m858m275m038m006l812l418l072k674j677L1J452J343j62j393r64
63482B92943P14K176K765L043L534L924L805L488L551L973M255M197L961L408
63468C39737K056j19k279l473l626l524l953m948n795n668m454k980k213k172
$$ plain form
63454 296589 294592 293395 293091 293149 293353 294187 296006 298404 300941 304036 308477 314270 320697 327459 335040
63439 335040 343818 353566 364190 376363 390933 408137 427938 450798 477383 507366 538945 569593
63427 569593 597018 619602 636630 648558 656814 663050 668641 674947 683682 696531 714368 737100
63415 737100 764344 796016 832098 871999 914318 957156 998419 1035860 1067226 1090740 1105581
63404 1105581 1112015 1111274 1105397 1096728 1087017 1076847 1066035 1054468 1042059 1027959 1010434 988013
63392 988013 960592 929194 894931 858593 821018 783307 746504 711320 678170 647238 618464
63381 618464 591796 567633 546800 529892 516680 506227 497472 489688 482590 476319 471348 468301 467706
63368 467706 469868 474856 482485 492358 504062 517481 532924 550801 571111 593402 617419 643584
$$ packed form
63454B96589j997j197l04N8K04Q34J819K398K537L095M441N793O427O762P581
63439C35040Q778R748J0624J2173J4570J7204J9801K2860K6585K9983L1579L0648
63427E69593K7425K2584J7028J1928Q256O236N591O306Q735J2849J7837K2732
63415G37100K7244L1672L6082L9901M2319M2838M1263L7441L1366K3514J4841
63404A105581O434p41n877q669r711j0170j0812j1567j2409j4100j7525k2421
63392I88013k7421l1398l4263l6338l7575l7711l6803l5184l3150l0932k8774
63381F18464k6668k4163k0833j6908j3212j0453q755p784p098o271m971l047n95
63368D67706K162M988P629R873J1704J3419J5443J7877K0310K2291K4017K6165
$$ plain form
63356 643584 672561 704422 738636 774954 813753 855111 897835 939831 979158 1014241 1043307
63345 1043307 1064560 1077371 1082873 1082990 1079072 1071790 1062010 1051133 1040346 1029702 1018085 1003949
63333 1003949 986096 963958 937485 907060 873539 838132 802016 766040 730898 697428 666483
63322 666483 638547 613773 592422 574985 561731 552338 546005 541511 537001 530141 519125 503674
63310 503674 484948 464660 444445 425743 409539 395916 384135 373350 363210 353793 345253 337671
63298 337671 330987 324933 319175 313694 308833 304778 301180 297533 293839 290589 288056 285889 283579 281128
63284 281128 279042 277630 276494 274851 272369 269546 267218 265798 265128 264933 265033 265114 264745 263880 263007 262452
63268 262452 261851 260833 259984 260387 262159 264148 265365 266074 267079 268585 270377 272605 275603 279132 282607
$$ packed form
63356F43584K8977L1861L4214L6318L8799M1358M2724M1996L9327L5083K9066
63345A043307K1253J2811N502J17l918p282r780j0877j0787j0644j1617j4136
63333A003949j7853k2138k6473l0425l3521l5407l6116l5976l5142l3470l0945
63322F66483k7936k4774k1351j7437j3254r393o333m494m510o860j1016j5451
63310E03674j8726k0288k0215j8702j6204j3623j1781j0785j0140r417q540p582
63298C37671o684o054n758n481m861m055l598l647l694l250k533k167k310k451
63284B81128k086j412j136j643k482k823k328j420o70j95J00Q1l69q65q73n55
63268B62452o01j018q49M03J772J989J217P09J005J506J792K228K998L529L475
$$ plain form
63253 282607 285975 289612 293396 296781 299957 304021 309539 315714 321563 327290 333784 341295 349441 358235
63239 358235 368167 379318 391191 403583 416901 431478 447216 464199 482978 503714 525435 546667
63227 546667 566631 585463 603534 621106 638587 656507 674983 693525 711680 729708 748347
63216 748347 767907 787863 807416 826136 843729 859242 871040 877850 879595 876917 870122 858992
63204 858992 843513 824278 802083 777606 751723 725800 701307 679159 659562 642345 627288
63193 627288 614278 603374 594743 588492 584676 583513 585387 590539 598825 609829 623004 637624 652864
63180 652864 668244 683932 700433 717966 736255 754816 773308 791571 809425 826497 842348
63169 842348 856832 870214 882673 893733 902448 908161 910694 909712 904372 893955 878511 858558 834510
$$ packed form
63253B82607L368L637L784L385L176M064N518O175N849N727O494P511Q146Q794
63239C58235R932J1151J1873J2392J3318J4577J5738J6983J8779K0736K1721K1232
63227E46667J9964J8832J8071J7572J7481J7920J8476J8542J8155J8028J8639
63216G48347J9560J9956J9553J8720J7593J5513J1798O810J745k678o795j1130
63204H58992j5479j9235k2195k4477k5883k5923k4493k2148j9597j7217j5057
63193F27288j3010j0904q631o251l816j163J874N152Q286J1004J3175J4620J5240
63180F52864J5380J5688J6501J7533J8289J8561J8492J8263J7854J7072J5851
63169H42348J4484J3382J2459J1060Q715N713K533r82n340j0417j5444j9953k4048
$$ plain form
63156 834510 806928 777065 746444 715817 685169 654883 626215 600170 576379 553771 532192
63145 532192 512727 496339 482704 470711 459648 449478 440182 431468 423234 415846 409630 404416 399917
63132 399917 396274 393771 392175 390897 389851 389581 390340 391552 392535 393374 394662 396663 399158 401952 405082
63117 405082 408571 412393 416635 421338 426127 430353 433660 436190 438268 440175 442236 444742 447708 450958
63103 450958 454492 458434 462500 465966 468493 470753 473841 478090 482661 486323 488523 489746 490964 492734
63089 492734 494775 496435 497481 498266 499090 499708 499654 498897 497921 497248 497095 497492 498433 499847 501573 503597 506202
63072 506202 509731 514179 519184 524473 530167 536574 543924 552511 562873 575323 589269 603502 617465
63059 617465 631963 648332 667241 688659 712680 739743 770078 803450 839510 877985 918483
$$ packed form
63156H34510k7582k9863l0621l0627l0648l0286k8668k6045k3791k2608k1579
63145E32192j9465j6388j3635j1993j1063j0170r296q714q234p388o216n214m499
63132C99917l643k503j596j278j046k70P59J212R83Q39J288K001K495K794L130
63117D05082L489L822M242M703M789M226L307K530K078J907K061K506K966L250
63103D50958L534L942M066L466K527K260L088M249M571L662K200J223J218J770
63089D92734K041J660J046P85Q24O18n4p57r76o73j53L97R41J414J726K024K605
63072E06202L529M448N005N289N694O407P350Q587J0362J2450J3946J4233J3963
63059F17465J4498J6369J8909K1418K4021K7063L0335L3372L6060L8475M0498
$$ plain form
63048 918483 960602 1004341 1049930 1097064 1144784 1192343 1239741 1287061 1333774 1379243 1423721
63037 1423721 1468292 1513803 1560188 1606822 1653159 1698922 1743776 1786838 1826413 1860327 1886668
63026 1886668 1904183 1912022 1909492 1896329 1873002 1840469 1799805 1752267 1699429 1642907 1584162 1524855
63014 1524855 1467008 1412291 1361389 1314734 1273617 1239681 1213250 1193073 1178109 1168809 1166097 1169683
63002 1169683 1178184 1190604 1207001 1227711 1252518 1280598 1310844 1342172 1373915 1406050 1438781
62991 1438781 1471923 1504920 1537414 1569308 1600181 1629051 1654994 1677683 1696988 1712154 1721634
62980 1721634 1723721 1717284 1702013 1678198 1646354 1607002 1560860 1509112 1453296 1394876 1335170 1275701
62968 1275701 1218153 1163544 1111735 1062255 1015588 973068 935411 901908 871367 843356 818026
$$ packed form
63048I18483M2119M3739M5589M7134M7720M7559M7398M7320M6713M5469M4478
63037A423721M4571M5511M6385M6634M6337M5763M4854M3062L9575L3914K6341
63026A886668J7515P839k530j3163k3327l2533m0664m7538n2838n6522n8745n9307
63014A524855n7847n4717n0902m6655m1117l3936k6431k0177j4964r300k712L586
63002A169683Q501J2420J6397K0710K4807K8080L0246L1328L1743L2135L2731
62991A438781L3142L2997L2494L1894L0873K8870K5943K2689J9305J5166R480
62980A721634K087o437j5271k3815l1844l9352m6142n1748n5816n8420n9706n9469
62968A275701n7548n4609n1809m9480m6667m2520l7657l3503l0541k8011k5330
$$ plain form
62957 818026 795082 773711 753480 734619 717180 700530 684097 668183 653449 639797 626369
62946 626369 612676 599209 586683 575060 563590 551651 539208 526606 514224 502417 491560
62935 491560 481923 473473 465849 458642 451767 445565 440515 436806 434172 432014 429665 426690 423211 419980
62921 419980 417919 417374 417855 418488 418655 418216 417378 416510 415948 415732 415543 415011 414058 412854 411525 410056 408430
62904 408430 406678 404800 402788 400764 398953 397485 396354 395504 394815 393979 392642 390815 389038 387990 387969
62889 387969 388799 390111 391547 392763 393444 393417 392699 391448 389937 388518 387496 387020 387093 387608 388254 388569 388361
62872 388361 388080 388414 389358 389999 389534 388259 387144 386539 385821 384406 382573 380982 379769 378601 377434 376643
62856 376643 376441 376617 376965 377531 378230 378605 378338 377726 377302 377131 376892 376580 376641 377295 378122 378584 378694 378847 379137
$$ packed form
62957H18026k2944k1371k0231j8861j7439j6650j6433j5914j4734j3652j3428
62946F26369j3693j3467j2526j1623j1470j1939j2443j2602j2382j1807j0857
62935D91560r637q450p624p207o875o202n050l709k634k158k349k975l479l231
62921D19980k061n45M81O33J67m39q38q68n62k16j89n32r53j204j329j469j626
62904D08430j752j878k012k024j811j468j131q50o89q36j337j827j777j048k1
62889C87969Q30J312J436J216O81k7p18j251j511j419j022m76P3N15O46L15k08
62872C88361k81L34R44O41m65j275j115o05p18j415j833j591j213j168j167p91
62856C76643k02J76L48N66O99L75k67o12m24j71k39l12O1O54Q27M62J10J53K90
$$ plain form
62837 379137 379189 378687 377750 376671 375525 374209 372708 371099 369428 367848 366837 366912 368020 369485 370761 371991
62821 371991 373573 375401 377004 378389 380243 383092 386587 389940 392880 395881 399451 403408 406986 409623
62807 409623 411620 413931 417245 421414 425979 431108 437538 445536 454404 463277 472031 481104 490783 501089
62793 501089 512093 523884 536467 550219 566169 585141 606703 629732 654118 681249 712577
62782 712577 748453 788788 834096 885123 941775 1003157 1068573 1137937 1211164 1287672 1366355
62771 1366355 1445565 1522984 1596050 1662725 1721617 1771224 1809467 1834280 1844581 1840552 1823194
62760 1823194 1793793 1753678 1704259 1647108 1583996 1516754 1447087 1376551 1306561 1238233 1172152
62749 1172152 1108463 1047309 989089 934295 883261 836144 792987 753580 717339 683597 652181
$$ packed form
62837C79137N2n02r37j079j146j316j501j609j671j580j011P5J108J465J276J230
62821C71991J582J828J603J385J854K849L495L353K940L001L570L957L578K637
62807D09623J997K311L314M169M565N129O430P998Q868Q873Q754R073R679J0306
62793E01089J1004J1791J2583J3752J5950J8972K1562K3029K4386K7131L1328
62782G12577L5876M0335M5308N1027N6652O1382O5416O9364P3227P6508P8683
62771A366355P9210P7419P3066O6675N8892M9607L8243K4813J0301m029j7358
62760A823194k9401m0115m9419n7151o3112o7242o9667p0536o9990o8328o6081
62749A172152o3689o1154n8220n4794n1034m7117m3157l9407l6241l3742l1416
$$ plain form
62738 652181 623608 598573 577179 558759 542424 527686 514479 502802 492654 484205 477703 472989
62726 472989 469385 466262 463584 461669 460523 459695 458811 458073 458163 459756 463105 468034 474279 481803 490712
62711 490712 500932 512274 524959 539763 557288 577259 598918 622165 648017 677858 712471
62700 712471 751860 795804 844332 897638 955613 1017545 1082467 1149793 1219375 1290770 1362632
62689 1362632 1432992 1499924 1561647 1616238 1661690 1696292 1718734 1728054 1723969 1707220 1679105 1640597
62677 1640597 1592318 1535467 1472306 1405447 1336908 1267929 1199366 1132038 1066952 1005241 947613
62666 947613 893836 843226 795759 752220 713050 677657 645222 615605 588969 564959 542987
62655 542987 523041 505517 490261 476434 463408 451289 440492 431215 423380 416640 410329 403830
$$ packed form
62738F52181k8573k5035k1394j8420j6335j4738j3207j1677j0148q449o502m714
62726D72989l604l123k678j915j146q28q84p38R0J593L349M929O245P524Q909
62711D90712J0220J1342J2685J4804J7525J9971K1659K3247K5852K9841L4613
62700G12471L9389M3944M8528N3306N7975O1932O4922O7326O9582P1395P1862
62689A362632P0360O6932O1723N4591M5452L4602K2442R320m085j6749k8115l8508
62677A640597m8279n6851o3161o6859o8539o8979o8563o7328o5086o1711n7628
62666I47613n3777n0610m7467m3539l9170l5393l2435k9617k6636k4010k1972
62655E42987j9946j7524j5256j3827j3026j2119j0797r277p835o740o311o499
$$ plain form
62643 403830 397218 391219 386322 382186 378069 373627 369091 364913 361468 359004 357650 357363 357813 358349 358318
62628 358318 357657 357019 356981 357204 356813 355641 354639 354798 356042 357437 358199 358180 357699 357342 357805 359470 362069
62611 362069 365043 368309 372398 377774 384317 391536 399083 406930 415265 424428 434797 446546 459645
62598 459645 474254 491041 510805 533850 559943 588881 620714 655260 691720 729100 766792
62587 766792 804397 841043 875266 905635 931226 951362 965246 972128 971785 964613 951290 932475
62575 932475 908839 881248 850812 818654 785598 752122 718704 686125 655256 626614 600270
62564 600270 576053 553580 532176 511312 491292 473159 457586 444147 431917 420581 410603 402495
62552 402495 396265 391490 387584 384005 380523 377394 375095 373811 373235 372841 372254 371435 370623 370065 369736 369492
$$ packed form
62643D03830o612n999m897m136m117m442m536m178l445k464j354k87M50N36l1
62628C58318o61o38l8K23l91j172j002J59J244J395P62j9m81l57M63J665K599
62611C62069K974L266M089N376O543P219P547P847Q335R163J0369J1749J3099
62598D59645J4609J6787J9764K3045K6093K8938L1833L4546L6460L7380L7692
62587G66792L7605L6646L4223L0369K5591K0136J3884O882l43p172j3323j8815
62575I32475k3636k7591l0436l2158l3056l3476l3418l2579l0869k8642k6344
62564F00270k4217k2473k1404k0864k0020j8133j5573j3439j2230j1336r978q108
62552D02495o230m775l906l579l482l129k299j284n76l94n87q19q12n58l29k44
$$ plain form
62536 369492 369493 370211 371840 373866 375529 376578 377398 378524 380242 382607 385647 389601 395014 402378 411592
62521 411592 422065 433507 446309 460931 477390 495704 516410 540151 567088 597264 631152
62510 631152 669056 710069 752356 794470 835809 875844 913609 947997 977855 1001760 1018481
62499 1018481 1027915 1030907 1027899 1018499 1002688 981790 957768 932119 905856 879955 855235 832151
62487 832151 811216 793236 778696 767302 758684 753276 752014 755463 763614 776139 792269 810763
62475 810763 830701 852172 875682 900966 926835 951889 974758 993908 1008084 1017111 1021652 1021921
62463 1021921 1017076 1005981 988225 964355 935596 903414 868932 832612 794806 756614 719704
62452 719704 685172 653075 623251 596078 572056 551076 532603 516356 502425 490832 481313 473542
$$ packed form
62536C69492JP18J629K026J663J049Q20J126J718K365L040L954N413P364R214
62521D11592J0473J1442J2802J4622J6459J8314K0706K3741K6937L0176L3888
62510F31152L7904M1013M2287M2114M1339M0035L7765L4388K9858K3905J6721
62499A018481R434K992l008r400j5811k0898k4022k5649k6263k5901k4720k3084
62487H32151k0935j7980j4540j1394q618n408j262L449Q151J2525J6130J8494
62475H10763J9938K1471K3510K5284K5869K5054K2869J9150J4176R027M541K69
62463A021921m845j1095j7756k3870k8759l2182l4482l6320l7806l8192l6910
62452G19704l4532l2097k9824k7173k4022k0980j8473j6247j3931j1593r519p771
$$ plain form
62440 473542 467305 462525 459305 457878 458214 459711 461551 463461 465921 469413 473576 477192 479037 478655 476380
62425 476380 472819 468395 463199 457033 449611 440955 431657 422576 414188 406381 398975 392251 386684 382205
62411 382205 377978 373047 367224 361285 356270 352625 350069 348235 347067 346419 345684 344403 343074 342698 343368
62396 343368 343987 343709 343076 343267 344666 346722 348904 351151 353461 355605 357339 358618 359634 360878 362968
62381 362968 366067 369619 373012 376317 380014 384206 388642 393358 398761 405067 412175 420117 429175 439499
62367 439499 451057 463977 478504 494554 511722 529845 549236 570422 594141 621563 653877
62356 653877 691390 733515 779840 830778 886847 947628 1011568 1076449 1139789 1199135 1252325
62345 1252325 1297530 1333299 1359024 1375296 1383150 1382871 1374109 1357231 1333715 1304787 1270439 1230428
$$ packed form
62440D73542o237m780l220j427L36J497J840J910K460L492M163L616J845l82k275
62425D76380l561m424n196o166p422q656r298r081q388p807p406o724n567m479
62411C82205m227m931n823n939n015l645k556j834j168o48p35j281j329l76O70
62396C43368O19k78o33J91J399K056K182K247K310K144J734J279J016J244K090
62381C62968L099L552L393L305L697M192M436M716N403O306P108P942R058J0324
62367D39499J1558J2920J4527J6050J7168J8123J9391K1186K3719K7422L2314
62356F53877L7513M2125M6325N0938N6069O0781O3940O4881O3340N9346N3190
62345A252325M5205L5769K5725J6272P854k79q762j6878k3516k8928l4348m0011
$$ plain form
62333 1230428 1185724 1138245 1089629 1041010 993719 949347 908929 872580 839995 810932 785317
62322 785317 763210 744621 728925 714566 699836 683972 667224 650004 632453 614718 597051
62311 597051 579498 561981 544808 528618 513629 499406 485653 472834 461621 452008 443401 435478
62299 435478 428550 423025 418864 415652 412996 410689 408653 406952 405790 405279 405160 404976 404665 404785 405940
62284 405940 408099 410802 413916 417805 422660 428025 433213 438005 442720 447782 453368 459332 465348 471248
62270 471248 477272 483793 490860 498356 506632 516417 527902 540561 554366 570594 590722 614884 642230
62257 642230 672572 706791 745649 789160 837348 890672 949081 1011258 1075336 1139839 1203235
62246 1203235 1262962 1315845 1359641 1393717 1418188 1432972 1437937 1433535 1420775 1400515 1372930 1337741
$$ packed form
62333A230428m4704m7479m8616m8619m7291m4372m0418l6349l2585k9063k5615
62322G85317k2107j8589j5696j4359j4730j5864j6748j7220j7551j7735j7667
62311E97051j7553j7517j7173j6190j4989j4223j3753j2819j1213r613q607p923
62299D35478o928n525m161l212k656k307k036j701j162n11j19j84l11J20J155
62284D05940K159K703L114L889M855N365N188M792M715N062N586N964O016N900
62270D71248O024O521P067P496Q276R785J1485J2659J3805J6228K0128K4162K7346
62257F42230L0342L4219L8858M3511M8188N3324N8409O2177O4078O4503O3396
62246A203235N9727N2883M3796L4076K4471J4784M965m402j2760k0260k7585l5189
$$ plain form
62234 1337741 1294982 1245604 1191356 1134092 1075233 1015934 957536 901567 849235 801073 757128
62223 757128 717327 681556 649598 621290 596738 576121 559137 544789 531934 520049 509401
62212 509401 500437 493174 487242 482389 478786 476763 476282 476711 477232 477557 478241 480199 483908 489115 495239
62197 495239 501916 509064 516578 524007 530621 535958 540453 545328 551496 558557 565233 570864 576056 581720
62183 581720 587946 594281 600706 607695 615313 622824 629420 635019 640096 644948 649395 653251 656927 661418
62169 661418 667573 675553 685344 697819 714803 737706 766385 799764 837290 879137 924940 972950
62157 972950 1020654 1065808 1106729 1142044 1170683 1192011 1205786 1212062 1211257 1204044 1190998 1172408
62145 1172408 1148554 1119972 1087357 1051443 1013160 973744 934489 896482 860662 827897 798779
$$ packed form
62234A337741m2759m9378n4248n7264n8859n9299n8398n5969n2332m8162m3945
62223G57128l9801l5771l1958k8308k4552k0617j6984j4348j2855j1885j0648
62212E09401q964p263n932m853l603k023m81M29N21L25O84J958L709N207O124
62197D95239O677P148P514P429O614N337M495M875O168P061O676N631N192N664
62183E81720O226O335O425O989P618P511O596N599N077M852M447L856L676M491
62169F61418O155P980R791J2475J6984K2903K8679L3379L7526M1847M5803M8010
62157I72950M7704M5154M0921L5315K8639K1328J3775O276q05p213j3046j8590
62145A172408k3854k8582l2615l5914l8283l9416l9255l8007l5820l2765k9118
$$ plain form
62134 798779 773428 751704 733548 719001 707991 700168 694778 690588 686319 681589 677376 675215 675846
62121 675846 678816 683246 688601 694593 700670 705941 709596 711323 711328 710051 707868 705103 702267 699978 698349
62106 698349 696491 692934 686710 677937 667448 656198 645141 635214 626945 620123 614246 609376 606229
62093 606229 605340 606429 608826 612261 616905 622761 629374 636223 643155 650314 657836 665733 673983 682642
62079 682642 691983 702591 715129 729874 746557 764790 784551 806089 829418 854069 879331 904649
62067 904649 929846 955139 980967 1007705 1035555 1064704 1095483 1128115 1162368 1197526 1232660
62056 1232660 1266699 1298300 1325915 1348173 1364176 1373471 1375985 1372088 1362531 1348051 1328962 1305102
62044 1305102 1276124 1241896 1202843 1160041 1114875 1068447 1021329 973970 927260 882526 840906
$$ packed form
62134G98779k5351k1724j8156j4547j1010p823n390m190m269m730m213k161O31
62121F75846K970M430N355N992O077N271L655J727Nj277k183k765k836k289j629
62106F98349j858l557o224q773j0489j1250j1057r927q269o822n877m870l147
62093F06229q89J089K397L435M644N856O613O849O932P159P522P897Q250Q659
62079F82642R341J0608J2538J4745J6683J8233J9761K1538K3329K4651K5262K5318
62067I04649K5197K5293K5828K6738K7850K9149L0779L2632L4253L5158L5134
62056A232660L4039L1601K7615K2258J6003R295K514l897r557j4480j9089k3860
62044A305102k8978l4228l9053m2802m5166m6428m7118m7359m6710m4734m1620
$$ plain form
62033 840906 802767 767727 735159 704654 676216 650173 626952 606742 589269 573878 559894
62022 559894 546903 534771 523521 513205 503697 494488 484911 474807 464851 455910 448197 441309 434922
62009 434922 429009 423468 418177 413555 410422 408978 408420 408031 408144 409501 412065 415127 418333 421921 426028
61994 426028 430404 434786 438931 442269 444209 444904 445149 445368 445224 444371 442975 441230 438945 435929 432314
61979 432314 428157 423264 417788 412503 407937 403661 399026 394271 390243 387207 384612 382009 379543 377408
61965 377408 375451 373622 372369 372084 372304 371922 370321 368108 366504 366050 366106 365751 364920 364381 364775 366100 368195
61948 368195 371098 374657 378235 381366 384544 388893 395058 402718 411210 420303 430347 441921 455388
61935 455388 470618 487029 503943 520919 537718 554122 569886 584781 598572 611095 622425
$$ packed form
62033H40906l8139l5040l2568l0505k8438k6043k3221k0210j7473j5391j3984
62022E59894j2991j2132j1250j0316r508r209r577j0104r956q941p713o888o387
62009D34922n913n541n291m622l133j444n58l89J13J357K564L062L206L588M107
61994D26028M376M382M145L338J940O95K45K19j44q53j396j745k285l016l615
61979D32314m157m893n476n285m566m276m635m755m028l036k595k603k466k135
61965C77408j957j829j253k85K20l82j601k213j604m54N6l55q31n39L94J325K095
61948C68195K903L559L578L131L178M349O165P660Q492R093J0044J1574J3467
61935D55388J5230J6411J6914J6976J6799J6404J5764J4895J3791J2523J1330
$$ plain form
61924 622425 632780 642073 649784 655388 658674 659451 657330 652255 645094 637195 629311 621308 612971 604825
61910 604825 598074 593882 592751 594397 598224 603942 611606 621035 631518 642424 653753 665602 677173
61897 677173 686809 693100 695620 694573 690183 682685 672673 661132 649037 636871 624463 611420 597809
61884 597809 584279 571386 559131 547432 536692 527368 519062 510701 501687 492428 483599 475303 467175
61871 467175 458988 450924 443448 436997 431672 427218 423544 421106 420474 421550 423623 426207 429401 433421
61857 433421 438337 444441 452352 462451 474490 488030 502983 519608 538284 559453 583409 609915
61845 609915 638269 667817 698122 728499 757865 785206 809861 831233 848729 862141 871520 876450
61833 876450 876112 870590 861546 851096 840444 830083 820702 813069 807420 803778 802717 805064 810945 819738
$$ packed form
61924F22425J0355R293P711N604L286P77k121n075p161p899p884q003q337q146
61910F04825o751m192j131J646L827N718P664R429J0483J0906J1329J1849J1571
61897F77173R636O291K520j047m390p498j0012j1541j2095j2166j2408j3043j3611
61884E97809j3530j2893j2255j1699j0740r324q306q361r014r259q829q296q128
61871D67175q187q064p476o451n325m454l674k438o32J076K073K584L194M020
61857D33421M916O104P911J0099J2039J3540J4953J6625J8676K1169K3956K6506
61845F09915K8354K9548L0305L0377K9366K7341K4655K1372J7496J3412R379M930
61833H76450l38n522r044j0450j0652j0361r381p633n649l642j061K347N881Q793
$$ plain form
61819 819738 830670 842688 853976 862674 868183 870911 870577 865766 855572 840745 822625 801625 777520
61806 777520 750716 722460 694020 666339 640265 616374 594464 573721 553641 534528 517054
61795 517054 501595 488066 476163 465668 456561 448852 442268 436285 430578 425287 420590 416175 411478
61782 411478 406454 401752 397977 394998 392197 389293 386719 385097 384474 384222 383735 383053 382630 382582 382484 381985 381380
61765 381380 381271 381795 382449 382702 382583 382581 383074 383998 385067 386199 387525 388998 390206 390907 391627 393376 396542
61748 396542 400323 403447 405285 406057 406193 405911 405376 404829 404287 403358 401625 399204 396764 394931 393771 392849
61732 392849 391651 389946 387886 386005 385053 385571 387427 389937 392584 395502 399041 403022 406768 409881 412580
61717 412580 415198 417753 420240 422980 426277 429893 433231 435944 438041 439465 439965 439471 438290 436756 434900
$$ packed form
61819H19738J0932J2018J1288Q698N509K728l34m811j0194j4827j8120k1000k4105
61806G77520k6804k8256k8440k7681k6074k3891k1910k0743k0080j9113j7474
61795E17054j5459j3529j1903j0495r107p709o584n983n707n291m697m415m697
61782D11478n024m702l775k979k801k904k574j622o23k52m87o82m23m8r8m99o05
61765C81380j09N24O54K53j19kM93R24J069J132J326J473J208P01P20J749L166
61748C96542L781L124J838P72J36k82n35n47n42r29j733k421k440j833j160r22
61732C92849j198j705k060j881r52N18J856K510K647K918L539L981L746L113K699
61717D12580K618K555K487K740L297L616L338K713K097J424N00m94j181j534j856
$$ plain form
61702 434900 432570 429717 426441 422869 419127 415383 411757 408209 404562 400681 396652 392750 389186 385864
61688 385864 382472 378871 375338 372351 370242 369069 368606 368305 367541 366185 364828 364117 363933 363526 362392 360643
61672 360643 358516 355998 353123 350267 347844 345962 344609 343938 344046 344601 345024 345047 344856 344712 344588 344247 343576
61655 343576 342823 342492 342890 343748 344440 344626 344503 344379 344307 344368 345017 346734 349441 352586 355749 358840 361725
61638 361725 364131 366100 368176 370818 373702 375856 376572 376060 375112 374143 372731 370251 366899 363723 361530
61623 361530 360080 358650 357053 355618 354347 352749 350693 348848 347924 347768 347599 346974 346175 345708 345651 345484
61607 345484 344436 342017 338445 334550 331096 328115 324937 320906 316036 310956 306236 301843 297367 292708
61593 292708 288260 284316 280610 276814 273300 270887 269787 269277 268532 267331 265771 263814 261536 259457 258073
$$ packed form
61702D34900k330k853l276l572l742l744l626l548l647l881m029l902l564l322
61688C85864l392l601l533k987k109j173m63l01p64j356j357p11j84m07j134j749
61672C60643k127k518k875k856k423j882j353o71J08N55M23K3j91j44j24l41o71
61655C43576p53l31L98Q58O92J86j23j24p2O1O49J717K707L145L163L091K885
61638C61725K406J969K076K642K884K154P16n12r48r69j412k480l352l176k193
61623C61530j450j430j597j435j271j598k056j845r24j56j69o25p99m67n7j67
61607C45484j048k419l572l895l454k981l178m031m870n080m720m393m476m659
61593B92708m448l944l706l796l514k413j100n10p45j201j560j957k278k079j384
$$ plain form
61578 258073 257183 256150 254734 253226 251803 250275 248643 247472 247312 247895 248186 247356 245623 244057 243482 243641
61562 243641 243568 242747 241586 240742 240407 240581 241586 243671 246250 248245 249310 250137 251350 252667 253507 253970
61546 253970 254688 255963 257563 259204 260762 262062 262943 263596 264396 265278 265666 265294 264730 264737 265322 265798 265730 265427
61528 265427 265381 265577 265578 265087 264157 262888 261220 259100 256811 254969 254115 254199 254475 254134 253145 252270 252107 252366
61510 252366 252374 252040 251804 251765 251543 251121 251139 251914 252730 252624 251568 250286 249223 248375 247907 248149 248834 249081 248455
61491 248455 247520 247027 247011 247042 246963 246927 246944 246866 246721 246724 247026 247724 249004 250929 253165 255206 256869 258315 259617
61472 259617 260573 261027 261168 261407 262026 262988 263993 264781 265394 266046 266711 267071 267055 267146 267804 268720 269142 268887 268529
61453 268529 268471 268352 267691 266724 266193 266476 267308 268189 268763 268957 269154 270055 271897 273870 274894 275072 275703 277598
$$ packed form
61578B58073q90j033j416j508j423j528j632j171j60N83K91q30j733j566n75J59
61562B43641p3q21j161q44l35J74J005K085K579J995J065Q27J213J317Q40M63
61546B53970P18J275J600J641J558J300Q81O53Q00Q82L88l72n64PN85M76o8l03
61528B65427m6J96Jm91r30j269j668k120k289j842q54Q4K76l41r89q75j63K59
61510B52366Ql34k36l9k22m22J8P75Q16j06j056j282j063q48m68K42O85K47o26
61491B48455r35m93j6L1p9l6J7p8j45LL02O98J280J925K236K041J663J446J302
61472B59617R56M54J41K39O19R62J005P88O13O52O65L60j6R1O58R16M22k55l58
61453B68529n8j19o61r67n31K83Q32Q81N74J94J97R01J842J973J024J78O31J895
$$ plain form
61435 277598 279997 281678 282583 283702 285687 288402 291660 295426 299102 301484 301934 301069 299899 298833 298020
61420 298020 298034 299428 301849 304246 305880 306607 306497 305970 306206 308465 312697 317422 321240 323924 325829 326995
61404 326995 327304 326992 326323 325082 323001 320547 318701 317956 317941 318004 317710 316777 315057 312845 310940 310035 310053
61387 310053 310203 309707 308417 306777 305326 304333 303880 304021 304600 305066 304874 304191 303890 304612 306051 307351 308042
61370 308042 308392 308990 310226 312120 314412 316783 319030 321014 322500 323316 323685 324119 324843 325569 325992 326242
61354 326242 326683 327580 329234 332088 336351 341693 347634 353974 360539 366817 372361 377349 382207 386797 390555
61339 390555 393406 395957 398740 401831 405336 409660 414965 420753 426310 431283 435609 439177 441846 443547
61325 443547 444160 443531 441872 439898 438258 436966 435661 434234 432893 431771 430853 430315 430565 431820 433846
$$ packed form
61435B77598K399J681R05J119J985K715L258L766L676K382M50q65j170j066q13
61420B98020J4J394K421K397J634P27j10n27K36K259M232M725L818K684J905J166
61404C26995L09l12o69j241k081k454j846p45j5O3k94r33j720k212j905r05J8
61387C10053J50m96j290j640j451r93m53J41N79M66j92o83l01P22J439J300O91
61370C08042L50N98J236J894K292K371K247J984J486Q16L69M34P24P26M23K50
61354C26242M41Q97J654K854M263N342N941O340O565O278N544M988M858M590L758
61339C90555K851K551K783L091L505M324N305N788N557M973M326L568K669J701
61325D43547O13o29j659j974j640j292j305j427j341j122r18n38K50J255K026
$$ plain form
61310 433846 436303 439211 442913 447642 453388 460263 468648 478670 489644 500534 511086 521981 533530
61297 533530 544657 553784 560459 565385 568845 569970 567939 563318 557632 551910 546097 539712 532586 524947
61283 524947 517097 509141 500946 492441 483972 476155 469316 463316 458066 453853 450890 448852 447244 446041
61269 446041 445494 445495 445612 445798 446579 448413 451187 454478 457954 461389 464614 467795 471581 476608 482820 489448
61253 489448 495683 501261 506352 511073 515327 519151 522962 527252 532072 537020 541662 545684 548658 550192
61239 550192 550588 550900 551835 552868 553024 552318 551670 551343 550366 547948 544810 542426 541367 541094 541147 541673 542764
61222 542764 544125 545778 548451 552693 557988 563291 568264 573447 579232 585225 590716 595433 599621 603685
61208 603685 607893 612195 616127 619101 621004 622423 624113 626334 628786 631011 632724 633958 635225 637466
$$ packed form
61310D33846K457K908L702M729N746O875Q385J0022J0974J0890J0552J0895J1549
61297E33530J1127R127O675M926L460J125k031m621n686n722n813o385p126p639
61283E24947p850p956q195q505q469p817o839o000n250m213k963k038j608j203
61269D46041n47JJ17J86P81J834K774L291L476L435L225L181L786N027O212O628
61253D89448O235N578N091M721M254L824L811M290M820M948M642M022K974J534
61239E50192L96L12R35J033J56p06o48l27r77k418l138k384j059k73N3N26J091
61222E42764J361J653K673M242N295N303M973N183N785N993N491M717M188M064
61208F03685M208M302L932K974J903J419J690K221K452K225J713J234J267K241
$$ plain form
61194 637466 641535 647649 655377 664108 673393 682922 692432 701663 710275 717758 723559 727290 728867 728663
61180 728663 727667 727144 727634 728333 727877 725819 722971 720280 717887 715477 713014 710641 708079 704658 699984
61165 699984 694316 688324 682634 677459 672376 666540 659466 651603 643806 636186 627881 618161 607483 597161
61151 597161 588136 580450 573849 568443 564440 561498 558841 556098 553647 551782 549770 546227 540566 533778
61137 533778 527516 522576 518500 514570 510797 507690 505320 503079 500653 498907 499269 502029 505723 508588
61123 508588 510431 512575 516146 521076 526873 533742 542464 553507 566672 581411 597224 613920 631800
61110 631800 651354 672468 694120 715253 735718 755969 776016 795321 813651 831392 848844
61099 848844 865747 881630 896010 907960 916197 920269 921258 920632 918574 914113 906750 897129 886016
$$ packed form
61194F37466M069O114P728Q731R285R529R510R231Q612P483N801L731J577k04
61180G28663r96n23M90O99m56k058k848k691k393k410k463k373k562l421m674
61165F99984n668n992n690n175n083n836p074p863p797p620q305r720j0678j0322
61151E97161r025p686o601n406m003k942k657k743k451j865k012l543n661o788
61137E33778o262m940m076l930l773l107k370k241k426j746L62K760L694K865
61123E08588J843K144L571M930N797O869Q722J1043J3165J4739J5813J6696J7880
61110F31800J9554K1114K1652K1133K0465K0251K0047J9305J8330J7741J7452
61099H48844J6903J5883J4380J1950Q237M072R89o26k058m461p363r621j1113
$$ plain form
61086 886016 873440 859208 843642 827213 809953 791834 773473 755744 738801 722195 705987
61075 705987 691008 677731 665481 653241 640832 628833 617633 607236 597926 590523 585691 583207
61063 583207 582062 581202 580167 579248 579087 580020 581829 584200 587293 591630 597499 604729 613040 622322 632502
61048 632502 643376 654705 666396 678603 691759 706493 723302 742269 763162 785777 810082
61037 810082 836151 864215 894679 927925 964134 1003442 1045998 1091558 1139282 1188397 1238947
61026 1238947 1291449 1345997 1402344 1460903 1523088 1590596 1664821 1746835 1837181 1935592 2041792
61015 2041792 2157034 2284439 2427985 2592334 2784119 3012512 3288131 3622719 4030924
61006 4030924 4531705 5147584 5904270 6832343 7966606 9338237 10961864 12821692 14854330
$$ packed form
61086H86016j2576j4232j5566j6429j7260j8119j8361j7729j6943j6606j6208
61075G05987j4979j3277j2250j2240j2409j1999j1200j0397r310p403m832k484
61063E83207j145q60j035r19j61R33J809K371L093M337N869P230Q311R282J0180
61048F32502J0874J1329J1691J2207J3156J4734J6809J8967K0893K2615K4305
61037H10082K6069K8064L0464L3246L6209L9308M2556M5560M7724M9115N0550
61026A238947N2502N4548N6347N8559O2185O7508P4225Q2014R0346R8411J06200
61015B041792J15242J27405J43546J64349J91785K28393K75619L34588M08205
61006D030924N00781O15879P56686R28073J134263J371631J623627J859828K032638
$$ plain form
60997 14854330 16928519 18842234 20367916 21344834 21763545 21775104 21614505 21497593 21557006
60988 21557006 21826175 22237643 22623204 22745965 22385745 21440023 19968695 18151160 16195941
60979 16195941 14269229 12472918 10856425 9435091 8203880 7147385 6246766 5482633
60971 5482633 4835650 4287654 3823179 3429580 3095764 2811275 2566588 2353943 2167750
60962 2167750 2004149 1860034 1732538 1619399 1519341 1431526 1354739 1287530 1228792 1177586
60952 1177586 1132475 1091788 1054444 1019903 987435 956315 926760 899775 875822 854418 835200
60941 835200 818447 804269 792159 781799 773403 766758 760780 754678 748831 743815 739234 734308 728967
60928 728967 723513 717718 711248 704641 698906 694312 690392 687018 684626 683445 683287 684143 686296 689804 694449
$$ packed form
60997A4854330K074189J913715J525682R76918M18711J1559j60599j16912N9413
60988B1557006K69169M11468L85561J22761l60220r45722j471328j817535j955219
60979A6195941j926712j796311j616493j421334j231211j056495r00619p64133
60971E482633o46983n47996m64475l93599l33816k84489k44687k12645j86193
60962B167750j63601j44115j27496j13139j00058q7815p6787o7209n8738n1206
60952A177586m5111m0687l7344l4541l2468l1120k9555k6985k3953k1404j9218
60941H35200j6753j4178j2110j0360q396o645n978o102n847n016m581m926n341
60928G28967n454n795o470o607n735m594l920l374k392j181j58Q56K153L508M645
$$ plain form
60913 694449 700248 707423 715833 725059 735121 746554 759725 774578 791066 809191 828468 847954
60901 847954 867034 885716 903955 921159 936616 950005 961229 970068 976225 979455 979491 976076 969235
60888 969235 959352 946983 932788 917474 901334 883879 864494 843573 822461 802025 781797 760906
60876 760906 739417 718364 698736 680865 664623 649758 636052 623395 611774 601110 591240 582081
60864 582081 573674 565964 558781 552098 546004 540300 534440 528118 521606 515279 509074 502768 496527 490744
60850 490744 485475 480477 475688 471214 466820 461927 456268 450172 443984 437581 430827 424186 418412 413616
60836 413616 409096 404177 398808 393119 386840 379714 372321 365860 360897 356810 352724 348662 345396 343457
60822 343457 342746 342951 343836 345017 345944 346357 346550 347003 347850 348835 349665 350378 351377 353094 355475 357917 359903
$$ packed form
60913F94449N799P175Q410R226J0062J1433J3171J4853J6488J8125J9277J9486
60901H47954J9080J8682J8239J7204J5457J3389J1224Q839O157L230L6l415o841
60888I69235r883j2369j4195j5314j6140j7455j9385k0921k1112k0436k0228k0891
60876G60906k1489k1053j9628j7871j6242j4865j3706j2657j1621j0664r870r159
60864E82081q407p710p183o683o094n704n860o322o512o327o205o306o241n783
60850D90744n269m998m789m474m394m893n659o096o188o403o754o641n774m796
60836D13616m520m919n369n689o279p126p393o461m963m087m086m062l266j939
60822C43457p11K05Q85J181R27M13J93M53Q47R85Q30P13R99J717K381K442J986
$$ plain form
60805 359903 361622 363665 366189 368703 370728 372277 373517 374349 374638 374597 374577 374557 374205 373480 372872 372878 373364 373637
60787 373637 373101 371732 369830 367459 364391 360651 356846 353747 351634 350187 348831 346974 344138 340296
60773 340296 336070 332244 329043 326185 323560 321427 319865 318538 317229 316242 315872 315803 315430 314688 314168 314374
60757 314374 315133 315782 315822 315264 314428 313533 312660 312091 312352 313656 315534 317501 319964 323856 329324 335364 340975
60740 340975 345990 350410 353671 355314 355911 356419 356760 355909 353425 350096 346834 343646 340077 336045 331705
60725 331705 326950 321606 315980 310696 306047 301916 298250 295132 292374 289480 286266 283204 280912 279462
60711 279462 278373 277067 275132 272353 268931 265619 263301 262248 261979 261941 262055 262497 263269 264240 265387 266660
60695 266660 267782 268511 269039 269804 270938 272223 273565 275107 276825 278375 279490 280237 280836 281575 283014 285733
$$ packed form
60805C59903J719K043K524K514K025J549J240Q32K89m1k0k0l52p25o08OM86K73
60787C73637n36j369j902k371l068l740l805l099k113j447j356j857k836l842
60773C40296m226l826l201k858k625k133j562j327j309r87l70o9l73p42n20K06
60757C14374P59O49M0n58q36q95q73n69K61J304J878J967K463L892N468O040N611
60740C40975N015M420L261J643N97N08L41q51k484l329l262l188l569m032m340
60725C31705m755n344n626n284m649m131l666l118k758k894l214l062k292j450
60711B79462j089j306j935k779l422l312k318j053k69l8J14M42P72R71J147J273
60695B66660J122P29N28P65J134J285J342J542J718J550J115P47N99P39J439K719
$$ plain form
60679 285733 289585 293584 297012 300342 304589 309913 315329 319823 323354 326678 330501 334922 339507 343748
60665 343748 347474 350846 353940 356528 358363 359466 359980 359921 359346 358531 357726 356869 355819 354698 353655 352476
60649 352476 350916 349304 348297 347982 347775 347304 346867 346790 346783 346245 344843 342532 339350 335561 331688 328020 324330
60632 324330 320398 316600 313473 310888 308186 305167 302487 300928 300595 300959 301382 301459 301136 300737 300762 301463 302617
60615 302617 303765 304546 304812 304648 304343 304203 304230 304133 303769 303400 303352 303569 303729 303714 303762 304209 305309 307155 309502
60596 309502 311698 313199 314291 315935 318629 321619 323595 324054 323629 323185 322943 322641 322171 321775 321765 322273 323160
60579 323160 323999 324310 324105 324181 325546 328464 332314 336530 341364 347483 355045 363654 373116 383753 395744
60564 395744 408569 421415 433787 445277 454977 461709 464937 464997 462361 457185 449861 441552 433699 427132
$$ packed form
60679B85733L852L999L428L330M247N324N416M494L531L324L823M421M585M241
60665C43748L726L372L094K588J835J103N14n9n75q15q05q57j050j121j043j179
60649C52476j560j612j007l15k07m71m37p7pn38j402k311l182l789l873l668l690
60632C24330l932l798l127k585k702l019k680j559l33L64M23P7l23l99K5P01J154
60615C02617J148P81K66j64l05j40K7r7l64l69m8K17J60j5M8M47J100J846K347
60596C09502K196J501J092J644K694K990J976M59m25m44k42l02m70l96j0N08Q87
60579C23160Q39L11k05P6J365K918L850M216M834O119P562Q609R462J0637J1991
60564C95744J2825J2846J2372J1490R700O732L228O0k636n176p324q309p853o567
$$ plain form
60550 427132 421958 418117 415680 414743 415340 417454 420947 425684 431974 440580 451840 465053 479291 494665
60536 494665 511971 531016 550068 567255 581828 593620 602013 606272 606603 604065 599451 592881 584571
60523 584571 575382 566339 557959 550281 543251 536828 530940 525682 521502 518818 517373 516267 514935 513969
60509 513969 514561 517086 520656 524352 528556 534625 543550 555572 570988 590464 614307 642126 673631
60496 673631 709159 748904 792093 837534 884504 932311 979194 1022498 1060020 1090589 1113274
60485 1113274 1126733 1129738 1121930 1103807 1076299 1040641 998447 951674 902500 853171 805573 760767
60473 760767 719019 680355 644941 612939 584234 558433 535095 514028 495485 479890 467120
60462 467120 456153 445745 435424 425543 416510 408362 401085 394850 389713 385345 381228 377013 372680
$$ packed form
60550D27132n174l841k437r37N97K114L493M737O290Q606J1260J3213J4238J5374
60536D94665J7306J9045J9052J7187J4573J1792Q393M259L31k538m614o570q310
60523E84571r189r043q380p678p030o423n888n258m180k684j445j106j332r66
60509E13969N92K525L570L696M204O069Q925J2022J5416J9476K3843K7819L1505
60496F73631L5528L9745M3189M5441M6970M7807M6883M3304L7522L0569K2685
60485A113274J3459L005p808j8123k7508l5658m2194m6773m9174m9329m7598m4806
60473G60767m1748l8664l5414l2002k8705k5801k3338k1067j8543j5595j2770
60462D67120j0967j0408j0321r881r033q148p277o235n137m368m117m215m333
$$ plain form
60449 372680 368514 364887 361901 359306 356951 355011 353449 351589 348863 345870 343967 343793 344784 346120 347384
60434 347384 348178 348006 346996 346004 345487 344890 343653 342197 341217 340527 339390 337702 336091 334989 334314 333926
60418 333926 333808 333854 334036 334701 336143 337954 339326 339965 340184 340202 340036 340004 340586 341631 342319 342168 341493 340741
60400 340741 339972 339273 339008 339280 339743 340438 342152 345298 348910 351600 353280 355061 357520 360024 361972 363843
60384 363843 366409 369466 372045 373667 374828 376287 378360 380882 383424 385508 387033 388625 391146 394653
60370 394653 398160 400733 402447 403952 405417 406425 406748 406622 406278 405774 405461 406094 408146 411356 415190 419437
60354 419437 424141 429280 434903 441295 448654 456747 465273 474377 484402 495131 505523 514158 519762
60341 519762 521591 519766 515274 509284 502378 494625 486255 477904 470215 463542 458087 453945 450911 448497
$$ packed form
60449C72680m166l627k986k595k355j940j562j860k726k993j903j74R91J336J264
60434C47384P94j72j010r92n17n97j237j456r80o90j137j688j611j102o75l88
60418C33926j18M6J82O65J442J811J372O39K19J8j66l2N82J045O88j51o75p52
60400C40741p69o99k65K72M63O95J714L146L612K690J680J781K459K504J948J871
60384C63843K566L057K579J622J161J459K073K522K542K084J525J592K521L507
60370C94653L507K573J714J505J465J008L23j26l44n04l13O33K052L210L834M247
60354D19437M704N139N623O392P359Q093Q526R104J0025J0729J0392Q635N604
60341E19762J829j825m492n990o906p753q370q351p689o673n455m142l034k414
$$ plain form
60327 448497 446256 443934 441334 438303 434919 431447 428042 424711 421522 418615 416022 413801 412281 411822
60313 411822 412262 413131 414546 417436 422601 429996 439338 451027 465920 484371 505988 530141 556039
60300 556039 582119 605996 625470 639426 647425 648714 642233 627883 607449 583856 559508 535587
60288 535587 512849 492481 475656 462486 451992 443248 436160 430951 427259 424128 420739 416955 413249
60275 413249 410363 408841 408580 408752 408409 407237 405640 404098 402587 400648 397897 394469 391020 388296 386477
60260 386477 384962 382960 380380 377969 376472 375850 375497 375028 374532 374070 373388 372297 371102 370321 370109 370228
60244 370228 370538 371211 372455 374198 376071 377570 378431 379108 380650 383523 386632 388254 388149 388019 389384 391808
60228 391808 393874 395251 396657 398207 399092 399030 398828 399063 399212 398719 398113 398264 399128 400047 400890 402073 403677
$$ packed form
60327D48497k241k322k600l031l384l472l405l331l189k907k593k221j520m59
60313D11822M40Q69J415K890N165P395R342J1689J4893J8451K1617K4153K5898
60300E56039K6080K3877J9474J3956P999J289o481j4350k0434k3593k4348k3921
60288E35587k2738k0368j6825j3170j0494q744p088n209l692l131l389l784l706
60275D13249k886j522k61J72l43j172j597j542j511j939k751l428l449k724j819
60260C86477j515k002k580k411j497o22l53m69m96m62o82j091j195p81k12J19
60244C70228L10O73J244J743J873J499Q61O77J542K873L109J622j05j30J365K424
60228C91808K066J377J406J550Q85o2k02K35J49m93o06J51Q64R19Q43J183J604
$$ plain form
60211 403677 405397 407314 409904 413261 416962 420853 425266 430244 435198 439742 444332 449545 455055 459918
60197 459918 463801 467390 471461 475952 480163 483692 486903 490439 494478 498581 502194 505079 507184 508308
60183 508308 508224 507119 505637 504261 502747 500394 496849 492516 488128 484066 480216 476395 472692 469255 465936
60168 465936 462432 458809 455626 453344 451721 449998 447677 444974 442465 440474 438907 437618 436730 436435 436561
60153 436561 436585 436269 436156 437136 439450 442385 445016 447002 448476 449448 449803 449881 450605 452687 455844 459078 461787
60136 461787 464382 467705 471994 476677 481183 485593 490259 494969 498940 501663 503431 504856 506119 506936
60122 506936 507069 506662 506135 505972 506513 507743 509278 510704 511918 513121 514579 516542 519235 522685 526560
60107 526560 530338 533634 536222 537824 538139 537241 535764 534558 534055 533987 533683 532721 531264 529755 528335 526752
$$ packed form
60211D03677J720J917K590L357L701L891M413M978M954M544M590N213N510M863
60197D59918L883L589M071M491M211L529L211L536M039M103L613K885K105J124
60183E08308q4j105j482j376j514k353l545m333m388m062l850l821l703l437l319
60168D65936l504l623l183k282j623j723k321k703k509j991j567j289q88k95J26
60153D36561K4l16j13R80K314K935K631J986J474R72L55P8P24K082L157L234K709
60136D61787K595L323M289M683M506M410M666M710L971K723J768J425J263Q17
60122E06936J33m07n27j63N41J230J535J426J214J203J458J963K693L450L875
60107E26560L778L296K588J602L15q98j477j206n03o8l04r62j457j509j420j583
$$ plain form
60091 526752 524850 522904 521320 520252 519764 520146 521689 524084 526362 527544 527316 526079 524477 522876 521184
60076 521184 519193 517092 515445 514497 513675 512079 509371 505938 502247 498379 494130 489218 483344 476463 469180
60061 469180 462584 457403 453352 449444 444853 439491 433927 428871 424621 420997 417819 415280 413602 412451
60047 412451 411173 409598 408210 407450 407342 407983 409835 413073 417032 420817 424256 427812 431767 435959 440137
60032 440137 444031 447122 448969 449811 450319 450663 450365 449190 447549 445680 443111 439472 435370 431773 428816
60017 428816 425926 422955 420351 418118 415423 411637 407227 403216 400142 397918 396222 394464 391712 387382
60003 387382 382026 376934 372921 369889 367484 365568 363975 362421 360962 360047 359771 359530 358845 358200 358514 359980
59987 359980 361940 363811 365596 367422 369142 370651 372226 374166 376260 377937 378993 379890 381185 382734
$$ packed form
60091E26752j902j946j584j068m88L82J543K395K278J182k28j237j602j601j692
60076E21184j991k101j647r48q22j596k708l433l691l868m249m912n874o881p283
60061D69180o596n181m051l908m591n362n564n056m250l624l178k539j678j151
60047D12451j278j575j388p60j08O41J852L238L959L785L439L556L955M192M178
60032D40137L894L091J847Q42N08L44k98j175j641j869k569l639m102l597k957
60017D28816k890k971k604k233k695l786m410m011l074k224j696j758k752m330
60003C87382n356n092m013l032k405j916j593j554j459r15k76k41o85o45L14J466
59987C59980J960J871J785J826J720J509J575J940K094J677J056Q97J295J549
$$ plain form
59973 382734 383723 383611 382827 382248 382052 381554 380342 379101 378902 379887 381138 381752 381609 381099 380580 380255 380185 380161
59955 380161 379813 379044 378220 377717 377489 377234 376920 376871 377329 378112 378845 379471 380313 381531 382726 383405 383807 384817
59937 384817 386884 389416 391542 393022 393981 394154 393171 391450 390018 389348 389053 388901 389409 391070 393583 396333
59921 396333 399206 402464 406146 410026 413911 417585 420771 423555 426531 430033 433533 436378 438852 441766
59907 441766 445050 447572 448552 448518 448481 448661 448422 447183 444972 442260 439633 437531 436000 434724 433537 432844
59891 432844 433288 435001 437425 439898 442198 444488 447069 450414 455144 461418 468350 474544 479450 483879
59877 483879 488901 494579 500259 505727 511311 516802 521080 523236 523542 522844 521372 518740 514899 510451 506003
59862 506003 501656 497267 492848 488491 484203 480085 476638 474653 474700 476727 480267 485065 491318 499116 507763
$$ packed form
59973C82734R89j12p84n79j96m98j212j241j99R85J251O14j43n10n19l25p0k4
59955C80161l48p69q24n03k28k55l14m9M58P83P33O26Q42J218J195O79M02J010
59937C84817K067K532K126J480R59J73r83j721j432o70k95j52N08J661K513K750
59921C96333K873L258L682L880L885L674L186K784K976L502L500K845K474K914
59907D41766L284K522R80l4l7J80k39j239k211k712k627k102j531j276j187o93
59891D32844M44J713K424K473K300K290K581L345M730O274O932O194M906M429
59877D83879N022N678N680N468N584N491M278K156L06o98j472k632l841m448m448
59862E06003m347m389m419m357m288m118l447j985M7K027L540M798O253P798Q647
$$ plain form
59847 507763 516035 523097 528735 532658 534255 533446 531344 529463 528511 528378 528914 529942 530575 529336 525321
59832 525321 518928 511401 503992 497560 492397 488168 484305 480686 477699 475562 473934 472273 470304 467988
59818 467988 465409 462825 460463 458132 455366 452213 449530 448188 448186 448762 449163 449036 448279 446862 444811 442241
59802 442241 439352 436359 433307 430064 426706 423749 421561 419646 417078 413758 410638 408464 406970 405674
59788 405674 404799 404718 404991 404818 404267 404276 405403 407199 408907 410168 410929 411210 411249 411489 412133 412901 413421 413691 414050
59769 414050 414849 416146 417541 418417 418574 418523 418788 419031 418429 416943 415598 415251 415554 415572 415010 414371 414146 414453
59751 414453 415462 417616 421079 425128 428474 430361 431381 432971 435997 439884 443332 445694 447385 449046
59737 449046 450823 452567 454262 455941 457567 459281 461464 464164 466731 468456 469373 470059 470767 471283 471554
$$ packed form
59847E07763Q272P062N638L923J597q09k102j881r52j33N36J028O33j239m015
59832E25321o393p527p409o432n163m229l863l619k987k137j628j661j969k316
59818D67988k579k584k362k331k766l153k683j342kN76M01j27p57j417k051k570
59802D42241k889k993l052l243l358k957k188j915k568l320l120k174j494j296
59788D05674q75q1K73j73n51RJ127J796J708J261P61K81L9K40O44P68N20K70L59
59769D14050P99J297J395Q76J57n1K65K43o02j486j345l47L03J8n62o39k25L07
59751D14453J009K154L463M049L346J887J020J590L026L887L448K362J691J661
59737D49046J777J744J695J679J626J714K183K700K567J725R17O86P08N16K71
$$ plain form
59722 471554 471889 472377 472578 472079 471096 470258 469978 470219 470696 471084 471064 470425 469211 467754 466517 465844 465767 466066
59704 466066 466556 467215 467964 468514 468668 468721 469213 470310 471727 473341 475453 478200 481023 483161 484582 486060
59688 486060 488179 490475 491802 491512 490111 488652 487588 486488 484892 483134 482011 481847 482238 482609 482558 481657
59672 481657 479486 476096 472046 467755 463159 458231 453401 449111 445291 441754 438788 436867 435990 435794 436140
59657 436140 437079 438342 439484 440459 441529 442651 443601 444687 446568 449184 451655 453573 455622 458348 460978
59642 460978 462273 462185 461791 461749 461614 460752 459204 457313 455032 452097 448704 445649 443695 442870 442409 441466 439895
59625 439895 438267 437130 436492 436120 435951 435886 435487 434373 432818 431455 430396 429050 426846 423717 419923 415910
59609 415910 412465 410420 409848 409881 409659 409178 408914 409039 409459 410375 412167 414679 417109 418852 420128 421545
$$ packed form
59722D71554L35M88K01m99r83q38k80K41M77L88k0o39j214j457j237o73p7K99
59704D66066M90O59P49N50J54N3M92J097J417J614K112K747K823K138J421J478
59688D86060K119K296J327k90j401j459j064j100j596j758j123j64L91L71n1r01
59672D81657k171l390m050m291m596m928m830m290l820l537k966j921q77j96L46
59657D36140R39J263J142R75J070J122R50J086J881K616K471J918K049K726K630
59642D60978J295q8l94m2j35q62j548j891k281k935l393l055j954q25m61r43j571
59625D39895j628j137o38l72j69o5l99j114j555j363j059j346k204l129l794m013
59609D15910l445k045n72L3k22m81k64J25M20R16J792K512K430J743J276J417
$$ plain form
59593 421545 423179 424357 424358 423253 421966 421459 421897 422701 423426 424310 425729 427319 428090 427480 425983 424510 423345
59576 423345 421984 419823 416765 413223 409832 407184 405545 404608 403643 402034 399702 397025 394501 392475 391028
59561 391028 389988 389201 388874 389429 390834 392294 392880 392394 391412 390617 390425 391126 392875 395432 398252 400958
59545 400958 403488 405795 407868 410166 413589 418774 425769 434581 445584 459038 474623 491732 509636
59532 509636 526741 540168 547068 546604 540293 530575 519581 508993 500044 493176 488115 484575 482558
59519 482558 481951 482402 483749 486047 488877 491201 492317 492585 492748 492863 492378 490971 488799 486024 482631 478689
59503 478689 474383 469720 464576 459113 453850 449119 444684 440122 435460 431223 427834 425149 422650 420001
59489 420001 417245 414516 411860 409436 407691 407072 407632 409056 410903 412665 413923 414872 416531 419911 424969
$$ packed form
59593D21545J634J178Jj105j287n07M38Q04P25Q84J419J590P71o10j497j473j165
59576D23345j361k161l058l542l391k648j639r37r65j609k332k677k524k026j447
59561C91028j040p87l27N55J405J460N86m86r82p95j92P01J749K557K820K706
59545D00958K530K307K073K298L423N185O995Q812J1003J3454J5585J7109J7904
59532E09636J7105J3427O900m64o311r718j0994j0588q949o868n061l540k017
59519D82558o07M51J347K298K830K324J116K68J63J15m85j407k172k775l393l942
59503D78689m306m663n144n463n263m731m435m562m662m237l389k685k499k649
59489D20001k756k729k656k424j745o19N60J424J847J762J258R49J659L380N058
$$ plain form
59474 424969 430773 436667 442724 448957 454745 459382 462782 465340 467439 469346 471178 472571 472753 471439
59460 471439 469510 468363 468675 470102 472104 474595 477778 481728 486341 491572 497499 504104 511101 518192
59446 518192 525575 533923 543482 553298 561714 567606 570787 571386 569473 565432 560060 553982 547371 540446
59432 540446 533660 527164 520682 514229 508342 503179 498097 492710 487819 484571 483152 483026 484048 486560
59418 486560 490705 496494 504351 514886 528295 544653 564490 588224 615221 644143 673710 701866
59406 701866 724481 736725 736732 727229 713194 698731 686331 677643 673634 674358 679299 687448 696277 701311
59392 701311 698031 684769 663541 638281 612537 588399 566650 547482 531130 517829 507221 498283
59380 498283 490219 483201 477880 474400 472284 471075 470589 470626 470942 471594 473032 475705 479686 484562 489478
$$ packed form
59474D24969N804N894O057O233N788M637L400K558K099J907J832J393J82j314
59460D71439j929j147L12J427K002K491L183L950M613N231N927O605O997P091
59446E18192P383Q348R559R816Q416N892L181N99j913m041n372o078o611o925
59432E40446o786o496o482o453n887n163n082n387m891l248j419j26J022K512
59418D86560M145N789P857J0535J3409J6358J9837K3734K6997K8922K9567K8156
59406G01866K2615J2244Pr503j4035j4463j2400q688m009P24M941Q149Q829N034
59392G01311l280j3262k1228k5260k5744k4138k1749j9168j6352j3301j0608q938
59380D98283q064p018n321l480k116j209m86L7L16O52J438K673L981M876M916
$$ plain form
59365 489478 493418 495848 497244 498810 501484 505222 509255 513016 516723 520982 525923 531036 536021 541406
59351 541406 547918 555516 563609 572055 581144 590597 599556 607947 617024 627884 640015 652035 663368
59338 663368 674379 685190 695310 704390 712458 719256 724073 726607 727415 727098 725420 721629 715474 707547
59324 707547 698666 689175 678927 667815 656153 644494 633217 622570 613059 605355 599546 594823 590276
59311 590276 585775 581789 578664 576633 576346 578635 583636 590711 599453 610244 623437 638255 652770
59298 652770 664709 672108 673644 669053 659424 646761 632985 619163 605567 592303 579820 568777
59286 568777 559415 551239 543556 536328 530187 525505 521781 518245 514807 512021 510258 509361 509149 509722 511007
59271 511007 512517 514093 516639 521455 528734 537242 545597 553430 561040 568445 575297 581425 586901 591622
$$ packed form
59365D89478L940K430J396J566K674L738M033L761L707M259M941N113M985N385
59351E41406O512P598Q093Q446R089R453Q959Q391R077J0860J2131J2020J1333
59338F63368J1011J0811J0120R080Q068O798M817K534Q08l17j678l791o155p927
59324G07547q881r491j0248j1112j1662j1659j1277j0647r511p704n809m723m547
59311E90276m501l986l125k031k87K289N001P075Q742J0791J3193J4818J4515
59298F52770J1939P399J536m591r629j2663j3776j3822j3596j3264j2483j1043
59286E68777r362q176p683p228o141m682l724l536l438k786j763q97k12N73J285
59271E11007J510J576K546M816P279Q508Q355P833P610P405O852O128N476M721
$$ plain form
59257 591622 595204 597250 597419 595442 591515 586497 581137 575221 568076 559945 552147 545673 540288 535296
59243 535296 530583 526472 523138 520660 519247 518862 518911 518839 518822 519392 520615 522091 523576 525113 526703 528345
59227 528345 530302 532790 535472 537718 539365 540769 542058 542795 542470 541055 538913 536468 534019 531728 529714
59212 529714 528179 527255 526570 525287 522914 519887 517018 514603 512549 511071 510583 510858 511013 510538 509874 509718
59196 509718 510186 510919 511654 512376 513109 513864 514701 515676 516740 517695 518197 517881 516680 515038 513626 512868 512835 513466
59178 513466 514622 516018 517331 518314 518667 518061 516645 515365 515320 516814 519330 522307 525555 529089 533103
59163 533103 538083 544476 552162 560622 569484 578443 586797 593704 598966 602989 605992 607884 608959 609917
59149 609917 610901 611126 609805 606934 602966 598259 593139 587922 582506 576396 569473 562246 555130 548072 541186
$$ packed form
59257E91622L582K046J69j977l927n018n360n916p145q131p798o474n385m992
59243E35296m713m111l334k478j413l85M9p2j7N70J223J476J485J537J590J642
59227E28345J957K488K682K246J647J404J289P37l25j415k142k445k449k291k014
59212E29714j535r24o85j283k373l027k869k415k054j478m88K75J55m75o64j56
59196E09718M68P33P35P22P33P55Q37R75J064R55N02l16j201j642j412p58l3O31
59178E13466J156J396J313R83L53o06j416j280m5J494K516K977L248L534M014
59163E33103M980O393P686Q460Q862Q959Q354O907N262M023L003J892J075R58
59149F09917R84K25j321k871l968m707n120n217n416o110o923p227p116p058o886
$$ plain form
59134 541186 535030 529762 524687 519247 513911 509413 505624 501922 498293 495305 493228 491905 491258 491238 491461
59119 491461 491617 492161 493922 497104 501271 506179 511968 518535 525370 532061 538425 544243 549469 554657 560469
59104 560469 566760 572787 578256 583385 587965 591332 593547 595652 598286 600810 602379 603140 603711 604016 603444
59089 603444 601861 599750 597582 595668 594420 594050 594033 593472 592006 589882 587205 583710 579326 574401 569192
59074 569192 563596 557575 551451 545514 539683 533750 527676 521513 515366 509682 505174 502084 499775 497408
59060 497408 494839 492437 490241 487852 485191 482816 481243 480205 478815 476410 473186 470161 468428 468129
59046 468129 468184 467355 465595 463923 462990 462409 461721 461177 460993 460521 459198 457937 458413 460854 463632 465355 466421
59029 466421 467918 469843 471308 472072 472915 474631 477376 481045 485642 491111 497282 504170 511996 520763 530088
$$ packed form
59134E41186o156n268n075n440n336m498l789l702l629k988k077j323o47k0K23
59119D91461J56N44J761L182M167M908N789O567O835O691O364N818N226N188N812
59104E60469O291O027N469N129M580L367K215K105K634K524J569P61N71L05n72
59089F03444j583k111k168j914j248l70j7n61j466k124k677l495m384m925n209
59074E69192n596o021o124n937n831n933o074o163o147n684m508l090k309k367
59060D97408k569k402k196k389k661k375j573j038j390k405l224l025j733k99
59046D68129N5q29j760j672r33n81o88n44j84m72j323j261M76K441K778J723J066
59029D66421J497J925J465P64Q43J716K745L669M597N469O171O888P826Q767R325
$$ plain form
59014 530088 539566 549080 558594 567802 576079 582764 587507 590458 592028 592388 591401 589252 586941 585695 585850
58999 585850 586651 587266 587699 588616 590512 593267 596382 599491 602641 606116 609945 613613 616381 617901 618478
58984 618478 618720 618995 619161 618700 617199 614790 612055 609467 607125 605154 604082 604460 606319 609356 613560
58969 613560 619228 626408 634712 643758 653374 663346 673388 683501 693926 704541 714679 723816 732068
58956 732068 739692 746395 751541 754815 756279 755886 753409 748869 742641 735017 725937 715273 703210 690218
58942 690218 676868 663798 651659 640853 631317 622726 614866 607656 600802 593809 586592 579953 574960
58929 574960 571762 569377 566903 564599 563345 563301 563663 563722 563468 562954 561769 559698 557479 556179 555896 555715
58913 555715 555038 554415 554806 556401 558510 560340 561569 562357 563195 564766 567630 571889 577272 583621 591142
$$ packed form
59014E30088R478R514R514R208Q277O685M743K951J570L60r87k149k311j246J55
58999E85850Q01O15M33R17J896K755L115L109L150L475L829L668K768J520N77
58984F18478K42K75J66m61j501k409k735k588k342j971j072L78J859L037M204
58969F13560N668P180Q304R046R616R972J0042J0113J0425J0615J0138R137Q252
58956G32068P624O703N146L274J464l93k477m540o228p624r080j0664j2063j2992
58942F90218j3350j3070j2139j0806r536q591p860p210o854o993p217o639m993
58929E74960l198k385k474k304j254m4L62N9k54n14j185k071k219j300k83j81
58913E55715o77o23L91J595K109J830J229P88Q38J571K864M259N383O349P521
$$ plain form
58898 591142 600081 610247 620981 631556 641580 651069 660268 669384 678426 687327 696250 705738 716444
58885 716444 728707 742467 757536 773744 790726 807721 823843 838620 852175 864735 875936
58874 875936 884695 889935 891427 889810 885736 879203 869918 858096 844569 830190 815558 801396 788708
58861 788708 778152 769493 761956 754965 748248 741412 733916 725529 716475 707018 697130 686675 675717
58848 675717 664561 653661 643576 634809 627420 620823 614088 606578 598397 590314 583189 577316 572250
58835 572250 567250 561868 556108 550222 544538 539340 534723 530561 526794 523620 521188 519226 517313 515497
58821 515497 514318 514181 515073 516979 520130 524461 529136 533055 535856 538106 540520 543258 545987 548360 550265
58806 550265 551815 553306 555179 557770 560960 564077 566249 566905 565966 563602 559984 555331 550032 544518 538988
$$ packed form
58898E91142Q939J0166J0734J0575J0024R489R199R116R042Q901Q923R488J0706
58885G16444J2263J3760J5069J6208J6982J6995J6122J4777J3555J2560J1201
58874H75936Q759N240J492j617m074o533r285j1822j3527j4379j4632j4162j2688
58861G88708j0556q659p537o991o717o836p496q387r054r457r888j0455j0958
58848F75717j1156j0900j0085q767p389o597o735p510q181q083p125n873n066
58835E72250n000n382n760n886n684n198m617m162l767l174k432j962j913j816
58821E15497j179j37Q92J906L151M331M675L919K801K250K414K738K729K373J905
58806E50265J550J491J873K591L190L117K172O56r39k364l618m653n299n514n530
$$ plain form
58791 538988 533424 527833 522367 517190 512382 508011 504185 501003 498531 496877 496157 496356 497353 499066 501400
58776 501400 504017 506341 508013 509275 510762 512812 515031 516552 516735 515499 512978 509092 503875 498196
58762 498196 493521 490406 487666 483743 478806 474627 472307 471043 469600 468042 467105 466569 465546 464272 464313
58747 464313 466579 470137 473562 476638 479967 483502 486503 488760 490964 493765 497207 501186 505809 511034
58733 511034 516491 521942 527517 533230 538767 543995 549199 554471 559375 563704 568002 572743 577448 581446
58719 581446 585195 589827 595363 600357 603658 605741 607989 611325 615988 621953 628915 636228 643419 650516
58705 650516 657469 663595 668094 670835 672106 671805 669410 664693 657970 649673 639955 628679 615577 600681
58691 600681 584858 569568 555644 542600 529678 517241 506463 497816 490672 484391 478957 474332
$$ packed form
58791E38988n564n591n466n177m808m371l826l182k472j654p20J99R97J713K334
58776E01400K617K324J672J262J487K050K219J521J83j236k521l886n217n679
58762D98196m675l115k740l923m937m179k320j264j443j558r37n36j023j274M1
58747D64313K266L558L425L076L329L535L001K257K204K801L442L979M623N225
58733E11034N457N451N575N713N537N228N204N272M904M329M298M741M705L998
58719E81446L749M632N536M994L301K083K248L336M663N965O962P313P191P097
58705F50516O953O126M499K741J271l01k395m717o723q297r718j1276j3102j4896
58691F00681j5823j5290j3924j3044j2922j2437j0778q647p144o281n434m625
$$ plain form
58679 474332 469960 465412 460983 457177 453931 450806 447742 445177 443486 442619 442357 442668 443715 445602 448257
58664 448257 451689 456221 462220 469485 477171 484430 490868 496194 499882 501566 501482 500135 497867 495199 493091
58649 493091 492048 491207 489213 486015 482974 481133 480196 479379 478431 477435 476285 474760 472691 469846 466250
58634 466250 462779 460679 460147 460155 460077 460707 463015 466662 470505 474003 477227 479934 481644 482513 483219 483932 484169
58617 484169 483844 483812 485040 487628 490898 494230 497571 501218 505219 509114 512396 515189 518105 521316 524157
58602 524157 525841 526218 525615 524434 523245 522780 523239 523901 523952 523409 522748 521992 520832 519421 518337 517927 518327
58585 518327 519984 523309 527817 532414 536787 541749 547956 554943 561860 568591 575590 582923 590033 596328
58571 596328 601676 606386 610996 616015 621654 627840 634560 642035 650460 659776 669953 681410 694873
$$ packed form
58679D74332m372m548m429l806l246l125l064k565j691q67k62L11J047J887K655
58664D48257L432M532N999P265P686P259O438N326L688J684q4j347k268k668k108
58649D93091j043q41j994l198l041j841r37q17r48r96j150j525k069k845l596
58634D66250l471k100n32Qp8O30K308L647L843L498L224K707J710Q69P06P13K37
58617D84169l25l2J228K588L270L332L341L647M001L895L282K793K916L211K841
58602E24157J684L77o03j181j189m65M59O62N1n43o61p56j160j411j084m10M00
58585E18327J657L325M508M597M373M962O207O987O917O731O999P333P110O295
58571E96328N348M710M610N019N639O186O720P475Q425R316J0177J1457J3463
$$ plain form
58558 694873 710735 728658 747809 767409 786972 806054 823912 839616 852540 862605 869893 874199
58546 874199 875236 873340 869670 865445 861002 855771 849218 841612 833695 825763 817416 808252 798304 787568
58532 787568 775523 761753 746854 732150 718466 705717 693738 682967 674059 667298 662540 659350
58520 659350 657021 654930 653047 651682 650726 649705 648698 648314 648388 647579 644923 641114 637565 634718 632150
58505 632150 629817 628211 627452 627014 626318 624991 622805 620112 618120 617884 619020 620124 620426 620339 620393 620471 620213
58488 620213 619540 618603 617807 617952 619720 622907 626650 630460 634500 638910 643700 649382 656783 665809 675104
58473 675104 683439 690937 698535 706721 715250 723556 730845 736126 738762 739017 737733 735542 732603 728963
58459 728963 724846 720644 716883 714200 713192 714170 716993 721125 725959 731235 737101 743693 750815 758125
$$ packed form
58558F94873J5862J7923J9151J9600J9563J9082J7858J5704J2924J0065P288M306
58546H74199J037j896l670m225m443n231o553p606p917p932q347r164r948j0736
58532G87568j2045j3770j4899j4704j3684j2749j1979j0771q908o761m758l190
58520F59350k329k091j883j365r56j021j007l84P4q09k656l809l549k847k568
58505F32150k333j606p59m38o96j327k186k693j992k36J136J104L02q7N4P8k58
58488F20213o73r37p96J45J768L187L743L810M040M410M790N682P401R026R295
58473F75104Q335P498P598Q186Q529Q306P289N281K636K55j284k191k939l640
58459G28963m117m202l761k683j008R78K823M132M834N276N866O592P122P310
$$ plain form
58445 758125 765338 771922 776865 779196 778722 775970 771594 766221 760677 755768 751788 748546 745842 743572
58431 743572 741596 740055 739721 741465 745253 750071 754860 759234 763402 767896 773338 779959 787331 794869
58417 794869 802470 810230 817758 824357 829714 833808 836331 836834 835416 832653 828950 824516 819747 814868
58403 814868 809486 803353 797376 792850 789806 787205 784668 782751 781454 779957 778316 778018 780041 783440
58389 783440 786669 789359 791957 794501 796746 798813 800779 802149 802623 802904 803897 805560 807364 809486 812640
58374 812640 816936 821811 827006 832853 839572 846907 854544 862452 870751 879520 888714 898090 907387 916708
58360 916708 926506 937039 948144 959620 971437 983446 995447 1007682 1020642 1034089 1046902 1058246
58348 1058246 1068290 1077391 1085346 1092024 1098107 1104462 1111240 1118197 1125500 1133567 1142444 1151949 1162098
$$ packed form
58445G58125P213O584M943K331m74k752m376n373n544m909l980l242k704k270
58431G43572j976j541l34J744L788M818M789M374M168M494N442O621P372P538
58417G94869P601P760P528O599N357M094K523N03j418k763l703m434m769m879
58403H14868n382o133n977m526l044k601k537j917j297j497j641k98K023L399
58389G83440L229K690K598K544K245K067J966J370M74K81R93J663J804K122L154
58374H12640M296M875N195N847O719P335P637P908Q299Q769R194R376R297R321
58360I16708R798J0533J1105J1476J1817J2009J2001J2235J2960J3447J2813J1344
58348A058246J0044R101P955O678O083O355O778O957P303Q067Q877R505J0149
$$ plain form
58335 1162098 1172860 1183838 1194799 1206244 1218873 1232717 1247287 1262323 1277961 1294357 1311511
58324 1311511 1329217 1346900 1363756 1379321 1393546 1406231 1417036 1426349 1435435 1445203 1455397 1465441
58312 1465441 1475420 1485685 1496123 1506521 1517138 1528300 1539901 1551899 1564794 1579015 1594332
58301 1594332 1610496 1627921 1647077 1667667 1689077 1711192 1734114 1757496 1780843 1804134 1827578
58290 1827578 1851160 1874971 1899544 1925353 1952370 1980497 2009798 2039913 2070078 2100347 2132011
58279 2132011 2166110 2202259 2239566 2277822 2317000 2356629 2396741 2438631 2483455 2530661 2578879
58268 2578879 2627824 2678303 2730955 2786095 2844235 2905614 2969610 3035618 3104084 3175748 3250408
58257 3250408 3327409 3406720 3488601 3572808 3659201 3748470 3841216 3936948 4035012 4135752 4239680
$$ packed form
58335A162098J0762J0978J0961J1445J2629J3844J4570J5036J5638J6396J7154
58324A311511J7706J7683J6856J5565J4225J2685J0805R313R086R768J0194J0044
58312A465441R979J0265J0438J0398J0617J1162J1601J1998J2895J4221J5317
58301A594332J6164J7425J9156K0590K1410K2115K2922K3382K3347K3291K3444
58290A827578K3582K3811K4573K5809K7017K8127K9301L0115L0165L0269L1664
58279B132011L4099L6149L7307L8256L9178L9629M0112M1890M4824M7206M8218
58268B578879M8945N0479N2652N5140N8140O1379O3996O6008O8466P1664P4660
58257C250408P7001P9311Q1881Q4207Q6393Q9269R2746R5732R8064J00740J03928
$$ plain form
58246 4239680 4346415 4455780 4569188 4688550 4814459 4946728 5085953 5233163 5388672
58237 5388672 5552736 5726642 5911699 6107920 6315168 6534825 6768802 7017707 7281553
58228 7281553 7561478 7859211 8175774 8512326 8871343 9255288 9665365 10103441 10574031
58219 10574031 11082456 11632431 12227729 12874819 13581373 14353618 15198026 16124549 17145616
58210 17145616 18273435 19521459 20907321 22451452 24174591 26100890 28263473 30705538
58202 30705538 33479897 36653645 40314284 44570556 49553005 55422094 62378213 70665143
58194 70665143 80573281 92449412 106699303 123767365 144100537 168099990 196024513
58187 196024513 227805089 262792399 299514402 335528248 367483137 391572667 404456390
$$ packed form
58246D239680J06735J09365J13408J19362J25909J32269J39225J47210J55509
58237E388672J64064J73906J85057J96221K07248K19657K33977K48905K63846
58228G281553K79925K97733L16563L36552L59017L83945M10077M38076M70590
58219A0574031N08425N49975N95298O47090P06554P72245Q44408R26523J021067
58210A7145616J127819J248024J385862J544131J723139J926299K162583K442065
58202C0705538K774359L173748L660639M256272M982449N869089O956119Q286930
58194G0665143R908138J1876131J4249891J7068062K0333172K3999453K7924523
58187A96024513L1780576L4987310L6722003L6013846L1954889K4089530J2883723
$$ plain form
58180 404456390 404364710 391768970 369149441 340005674 307749117 275036438 243632398
58173 243632398 214558203 188295891 164968947 144486215 126637675 111150276 97731063
58166 97731063 86105023 76032911 67308278 59751702 53209578 47549142 42649515 38399416
58158 38399416 34702040 31476223 28651631 26166446 23969421 22019387 20281412 18725787
58150 18725787 17329735 16075727 14947172 13928053 13005873 12171176 11413959 10723586 10092130
58141 10092130 9514481 8984646 8494777 8038211 7611095 7210921 6836018 6486558 6163309
58132 6163309 5864704 5587138 5328205 5087401 4863575 4654222 4457720 4273905 4101903
58123 4101903 3939707 3786555 3643506 3510734 3386210 3268002 3156102 3050964 2951835 2857632
$$ packed form
58180D04456390r1680j2595740k2619529k9143767l2256557l2712679l1404040
58173B43632398k9074195k6262312k3326944k0482732j7848540j5487399j3419213
58166I7731063j1626040j0072112q724633p556576o542124n660436m899627m250099
58158C8399416l697376l225817k824592k485185k197025j950034j737975j555625
58150A8725787j396052j254008j128555j019119r22180q34697p57217o90373o31456
58141A0092130n77649n29835m89869m56566m27116m00174l74903l49460l23249
58132F163309k98605k77566k58933k40804k23826k09353j96502j83815j72002
58123D101903j62196j53152j43049j32772j24524j18208j11900j05138r9129r4203
$$ plain form
58113 2857632 2768161 2683376 2602441 2524509 2449572 2377836 2309040 2242993 2179929 2119730 2061500
58102 2061500 2004473 1948718 1894644 1842416 1792198 1744224 1698336 1654061 1611381 1570808 1532581
58091 1532581 1496415 1462138 1429831 1399343 1370451 1343576 1319341 1297180 1275275 1252277 1228381
58080 1228381 1204489 1181063 1158241 1136314 1115513 1095590 1075958 1056056 1035567 1014681 994211
58069 994211 975045 957446 941073 925439 909985 894088 877670 861600 846821 833340 820611
58058 820611 808495 796978 785390 773028 760337 748315 736866 724935 712329 700128 689088
58047 689088 678900 669421 661293 654671 648417 641453 634171 627639 622025 616583 610802 604772 598655 592416
58033 592416 586000 579407 572647 565805 558886 551501 543067 533523 523501 513574 503733 493841 484194 475289
$$ packed form
58113B857632q9471q4785q0935p7932p4937p1736o8796o6047o3064o0199n8230
58102B061500n7027n5755n4074n2228n0218m7974m5888m4275m2680m0573l8227
58091A532581l6166l4277l2307l0488k8892k6875k4235k2161k1905k2998k3896
58080A228381k3892k3426k2822k1927k0801j9923j9632j9902k0489k0886k0470
58069I94211j9166j7599j6373j5634j5454j5897j6418j6070j4779j3481j2729
58058H20611j2116j1517j1588j2362j2691j2022j1449j1931j2606j2201j1040
58047F89088j0188r479q128o622o254o964p282o532n614n442n781o030o117o239
58033E92416o416o593o760o842o919p385q434r544j0022r927r841r892r647q905
$$ plain form
58019 475289 467288 459980 453103 446552 440451 435090 430632 426876 423518 420545 418049 415744 413111 409964
58005 409964 406564 403247 400365 398458 397953 398671 399974 401307 402277 402548 402264 402270 403198 404549 405399 405659 405669
57988 405669 404796 401749 396341 389724 382729 375239 367583 361123 356660 353285 349658 345534 341260 336698
57974 336698 331688 326899 323177 320416 317938 315552 313417 311366 309269 307709 307295 307496 307144 306070 305367
57959 305367 305953 307609 309555 311222 312209 312080 310649 308293 305788 303862 302753 302017 300890 299079 297040
57944 297040 295348 294161 293581 294040 295748 298166 300632 303307 306880 311534 316923 323014 330100 337948 345731
57929 345731 353027 360173 367294 373608 378126 380606 381409 380840 379069 376417 373177 369224 364200 358098 351439
57914 351439 344937 339169 334423 330530 326831 322681 318193 314336 312075 311382 311167 310221 308142 305339 302277
$$ packed form
58019D75289q001p308o877o551o101n361m458l756l358k973k496k305k633l147
58005D09964l400l317k882j907n05P18J303J333R70K71k84OR28J351Q50K60J0
57988D05669q73l047n408o617o995p490p656o460m463l375l627m124m274m562
57974C36698n010m789l722k761k478k386k135k051k097j560m14K01l52j074p03
57959C05367N86J656J946J667R87j29j431k356k505j926j109p36j127j811k039
57944B97040j692j187n80M59J708K418K466K675L573M654N389O091P086P848P783
57929C45731P296P146P121O314M518K480Q03n69j771k652l240l953n024o102o659
57914C51439o502n768m746l893l699m150m488l857k261o93k15r46k079k803l062
$$ plain form
57899 302277 298913 294882 290099 284968 280053 275698 272036 269174 267150 265688 264294 262776 261589 261346
57885 261346 262045 263091 264093 265205 266492 267464 267770 267959 268813 270042 270425 269454 268101 267537 267615 267227 265862
57868 265862 264206 263206 263043 263129 262860 262226 261770 262012 262901 263873 264428 264546 264555 264754 265226 265877 266623 267596 269026
57849 269026 270741 271992 272231 271891 271827 271998 271381 269356 266425 263295 260019 256643 253895 252350 251350 249697
57833 249697 247243 244863 242963 240933 238233 235210 232520 230413 228924 228260 228560 229675 231482 234048 237216
57818 237216 240420 243279 246071 249200 252413 254881 255940 255408 253357 249949 245494 240370 234852 229135
57804 229135 223483 218189 213515 209897 207980 208030 209277 210262 210098 209176 208445 208254 208187 207917 207780 208380 209875
57787 209875 211844 213742 215318 216677 218151 220074 222529 225313 228243 231418 234928 238348 240901 242331
$$ packed form
57899C02277l364m031m783n131m915m355l662k862k024j462j394j518j187k43
57885B61346O99J046J002J112J287R72L06J89Q54J229L83r71j353n64P8l88j365
57868B65862j656j000j63Q6k69o34m56K42Q89R72N55J18RJ99M72O51P46R73J430
57849B69026J715J251K39l40o4J71o17k025k931l130l276l376k748j545j000j653
57833B49697k454k380j900k030k700l023k690k107j489o64L00J115J807K566L168
57818B37216L204K859K792L129L213K468J059n32k051l408m455n124n518n717
57804B29135n652n294m674l618j917N0J247R85j64r22p31j91o7k70j37O00J495
57787B09875J969J898J576J359J474J923K455K784K930L175L510L420K553J430
$$ plain form
57773 242331 243323 244773 246815 248809 250173 250840 250957 250523 249470 247811 245479 242232 237976 233115 228364
57758 228364 224157 220403 216881 213776 211619 210698 210636 210724 210613 210570 211055 212223 213904 215839 217783 219555
57742 219555 221233 223174 225592 228120 230101 231313 232154 233015 233756 233960 233493 232578 231506 230496 229713 229176
57726 229176 228676 228029 227362 226966 226905 227004 227186 227506 227829 227817 227354 226658 225763 224292 222056 219551 217333 215101
57708 215101 212005 207894 203692 200325 197697 195016 191766 188093 184560 181851 180489 180453 181131 181862 182403
57693 182403 182747 182781 182416 181844 181275 180614 179711 178770 178111 177681 177276 177120 177734 179267 181512 184652 189372 195985
57675 195985 203960 212752 222904 236012 253696 276695 304777 337379 374474 416753 464406 515127
57663 515127 563286 601427 623188 625705 610226 580916 542887 500767 458419 418976 384252 354180
$$ packed form
57773B42331R92J450K042J994J364O67J17m34j053j659k332l247m256m861m751
57758B28364m207l754l522l105k157r21o2Q8j11m3M85J168J681J935J944J772
57742B19555J678J941K418K528J981J212Q41Q61P41K04m67r15j072j010p83n37
57726B29176n00o47o67l96o1R9J82L20L23j2m63o96q95j471k236k505k218k232
57708B15101l096m111m202l367k628k681l250l673l533k709j362l6O78P31N41
57693A82403L44L4l65n72n69o61r03r41o59m30m05j56O14J533K245L140M720O613
57675A95985P975Q792J0152J3108J7684K2999K8082L2602L7095M2279M7653N0721
57663E15127M8159L8141K1761K517j5479k9310l8029m2120m2348l9443l4724l0072
$$ plain form
57651 354180 327557 303736 283232 266587 253275 242117 232346 223814 216459 210136 204835 200653 197482
57638 197482 194983 192844 191013 189782 189718 191226 193972 196922 199096 200134 200184 199674 199313 199681 200398 200166
57622 200166 198173 195140 192487 190691 189038 186797 184057 181418 179356 177943 176840 175618 174358 173795
57608 173795 174463 175858 176922 177229 177262 177618 178453 179659 180978 181845 181707 180689 179512 178592 177609 176129 174215
57591 174215 172176 170138 168152 166407 164971 163548 161816 159845 157938 156196 154525 152959 151711 150874
57577 150874 150284 149722 149109 148434 147620 146618 145625 144954 144538 143739 142021 139756 137935 136993 136373 135495 134629
57560 134629 134316 134397 134311 134118 134496 135691 137164 138382 139426 140624 142118 143936 145988 147841 148934 149253
57544 149253 149342 149500 149507 149335 149476 150165 150914 151417 152406 154815 158299 161378 163101 163902 164694 165654 166227 165974
$$ packed form
57651C54180k6623k3821k0504j6645j3312j1158r771q532p355o323n301m182l171
57638A97482k499k139j831j231o4J508K746K950K174J038N0n10l61L68P17k32
57622B00166j993l033k653j796j653k241k740k639k062j413j103j222j260n63
57608A73795O68J395J064L07L3L56Q35J206J319Q67j38j018j177r20r83j480j914
57591A74215k039k038j986j745j436j423j732j971j907j742j671j566j248q37
57577A50874n90n62o13o75q14j002r93o71m16p99j718k265j821r42o20q78q66
57560A34629l13Q1q6j93L78J195J473J218J044J198J494J818K052J853J093L19
57544A49253Q9J58Pj72J41O89P49N03R89K409L484L079J723Q01P92R60N73k53
$$ plain form
57526 165974 165100 164298 164251 165152 166571 167825 168602 169193 170145 171762 173871 175938 177368 177865 177601 177019 176475
57509 176475 176103 175923 175928 176012 175972 175689 175255 174840 174434 173838 172931 171834 170672 169267 167329 164999 162920 161522
57491 161522 160360 158558 155885 153083 151067 150072 149759 149814 150133 150558 150831 150962 151462 153005 155777 159128
57475 159128 161936 163467 163906 164035 164382 164810 164906 164562 164002 163424 162883 162557 162859 164039 165752 167206 167838
57458 167838 167779 167605 167781 168455 169588 170977 172149 172604 172338 171960 172097 172885 174136 175727 177572 179439 181136
57441 181136 182787 184606 186475 188069 189371 190773 192593 194731 196774 198301 199107 199449 200037 201501 203742
57426 203742 205945 207306 207698 207745 208340 209945 212134 214032 215388 216916 219232 221815 223612 224452 225133 226166
57410 226166 227217 227964 228788 230246 232418 235122 238250 241468 244082 245677 246650 247719 249186 250986 253058
$$ packed form
57526A65974q74q02m7R01J419J254P77N91R52J617K109K067J430M97k64n82n44
57509A76475l72j80NQ4m0k83m34m15m06n96r07j097j162j405j938k330k079j398
57491A61522j162j802k673k802k016r95l13N5L19M25K73J31N00J543K772L351
57475A59128K808J531M39J29L47M28R6l44n60n78n41l26L02J180J713J454O32
57458A67838n9j74J76O74J133J389J172M55k66l78J37P88J251J591J845J867J697
57441A81136J651J819J869J594J302J402J820K138K043J527Q06L42N88J464K241
57426B03742K203J361L92M7N95J605K189J898J356J528K316K583J797Q40O81J033
57410B26166J051P47Q24J458K172K704L128L218K614J595R73J069J467J800K072
$$ plain form
57395 253058 255231 257124 258638 260283 262528 265143 267749 270727 274818 279773 284176 286914 288406 290118
57381 290118 293151 297535 302535 307331 311494 315109 318609 322456 326915 331863 336652 340317 342289 342982
57367 342982 343509 344751 346840 349467 352311 355040 357238 358729 359978 361889 365050 369235 373650 377575
57353 377575 380775 383523 386480 390425 395708 401783 407527 412218 416100 419852 423786 427792 431836 436046
57339 436046 440373 444584 448657 452894 457607 462936 468818 474848 480262 484635 488596 493329 499232 505494
57325 505494 511088 515668 519340 522269 524903 528068 532326 537472 542929 548310 553339 557754 561700 565812
57311 565812 570482 575393 580170 585027 590265 595659 600969 606593 612924 619406 625175 630392 636028 642380
57297 642380 648838 655174 661953 669299 676237 681965 687028 692422 698048 702889 706569 709935 714036 719022
$$ packed form
57395B53058K173J893J514J645K245K615K606K978M091M955M403K738J492J712
57381B90118L033M384N000M796M163L615L500L847M459M948M789L665J972O93
57367C42982N27J242K089K627K844K729K198J491J249J911L161M185M415L925
57353C77575L200K748K957L945N283O075N744M691L882L752L934M006M044M210
57339D36046M327M211M073M237M713N329N882O030N414M373L961M733N903O262
57325E05494N594M580L672K929K634L165M258N146N457N381N029M415L946M112
57311E65812M670M911M777M857N238N394N310N624O331O482N769N217N636O352
57297F42380O458O336O779P346O938N728N063N394N626M841L680L366M101M986
$$ plain form
57283 719022 724196 728780 732545 735933 739675 744148 749126 754350 760223 767583 776698 786851 797164 807589
57269 807589 818719 830762 843202 855554 868035 881176 895109 909651 924780 940523 956471
57258 956471 972029 987190 1002522 1018289 1034148 1049873 1065675 1081459 1096435 1110038 1122784
57247 1122784 1135618 1148876 1162451 1176539 1191328 1206192 1220058 1232661 1244757 1257064 1269627
57236 1269627 1282275 1295022 1307840 1320577 1333348 1346577 1360535 1375157 1390323 1405869 1421436
57225 1421436 1436908 1452947 1470350 1488782 1506907 1524082 1541114 1558972 1577497 1595979 1614358
57214 1614358 1633150 1652545 1672338 1692508 1713200 1734155 1754714 1774451 1793488 1812216 1831008
57203 1831008 1850114 1869553 1889043 1908240 1926947 1945054 1962513 1979621 1997041 2015255 2034119
$$ packed form
57283G19022N174M584L765L388L742M473M978N224N873P360R115J0153J0313J0425
57269H07589J1130J2043J2440J2352J2481J3141J3933J4542J5129J5743J5948
57258I56471J5558J5161J5332J5767J5859J5725J5802J5784J4976J3603J2746
57247A122784J2834J3258J3575J4088J4789J4864J3866J2603J2096J2307J2563
57236A269627J2648J2747J2818J2737J2771J3229J3958J4622J5166J5546J5567
57225A421436J5472J6039J7403J8432J8125J7175J7032J7858J8525J8482J8379
57214A614358J8792J9395J9793K0170K0692K0955K0559J9737J9037J8728J8792
57203A831008J9106J9439J9490J9197J8707J8107J7459J7108J7420J8214J8864
$$ plain form
57192 2034119 2053252 2072644 2092629 2113488 2135423 2158694 2183291 2208513 2233298 2257068 2279991
57181 2279991 2302446 2324544 2346167 2367079 2386886 2405128 2421648 2436807 2451267 2465561 2479799
57170 2479799 2493700 2506955 2519666 2532351 2545423 2558779 2572063 2585217 2598579 2612483 2626876
57159 2626876 2641296 2655119 2668007 2680293 2692773 2705891 2719184 2731718 2742967 2753064 2762345
57148 2762345 2770997 2779100 2786626 2793263 2798517 2802159 2804481 2806055 2807325 2808443 2809324 2809792 2809865 2810005 2810998
57133 2810998 2813535 2817944 2824256 2832332 2841850 2852378 2863627 2875593 2888445 2902379 2917669 2934720
57121 2934720 2953931 2975531 2999606 3026150 3055121 3086682 3121663 3161673 3208519 3263475 3327219
57110 3327219 3400225 3482774 3574598 3675150 3784728 3905266 4039992 4192847 4368849 4574832
$$ packed form
57192B034119J9133J9392J9985K0859K1935K3271K4597K5222K4785K3770K2923
57181B279991K2455K2098K1623K0912J9807J8242J6520J5159J4460J4294J4238
57170B479799J3901J3255J2711J2685J3072J3356J3284J3154J3362J3904J4393
57159B626876J4420J3823J2888J2286J2480J3118J3293J2534J1249J0097R281
57148B762345Q652Q103P526O637N254L642K322J574J270J118Q81M68P3J40R93
57133B810998K537M409O312Q076R518J0528J1249J1966J2852J3934J5290J7051
57121B934720J9211K1600K4075K6544K8971L1561L4981M0010M6846N4956O3744
57110C327219P3006Q2549R1824J00552J09578J20538J34726J52855J76002K05983
$$ plain form
57100 4574832 4819274 5111575 5462252 5884114 6392866 7006508 7744727 8628936 9681802
57091 9681802 10925334 12378233 14053460 15955717 18078836 20404214 22900687 25524764
57083 25524764 28221480 30928637 33584760 36134998 38528579 40709760 42611974 44162156
57075 44162156 45293018 45956101 46130038 45821876 45061876 43895169 42375268 40561390 38516903
57066 38516903 36306123 33990459 31626082 29262494 26940370 24689835 22531714 20481305
57058 20481305 18551479 16753441 15096199 13585843 12224428 11008908 9931544 8981881
57050 8981881 8148429 7418883 6780020 6218818 5724185 5287537 4901719 4559663 4254380
57041 4254380 3980089 3732980 3510570 3310610 3130978 2970333 2827947 2702711 2593317
$$ packed form
57100D574832K44442K92301L50677M21862N08752O13642P38219Q84209J052866
57091I681802J243532J452899J675227J902257K123119K325378K496473K624077
57083B5524764K696716K707157K656123K550238K393581K181181J902214J550182
57075D4162156J130862O63083J73937l08162p60000j166707j519901j813878k044487
57066C8516903k210780k315664k364377k363588k322124k250535k158121k050409
57058B0481305j929826j798038j657242j510356j361415j215520j077364r49663
57050H981881q33452p29546o38863n61202m94633m36648l85818l42056l05283
57041D254380k74291k47109k22410j99960j79632j60645j42386j25236j09394
$$ plain form
57032 2593317 2500128 2425992 2373941 2344072 2333068 2335552 2343606 2344813 2323782 2269096 2180002 2066000
57020 2066000 1940042 1812303 1688957 1573893 1469588 1376815 1294937 1222980 1160052 1104885
57010 1104885 1055811 1011576 971804 936335 904470 875217 847987 822576 798628 775663 753613
56999 753613 732878 713703 695846 679004 663174 648434 634708 621999 610626 600975 593170 587082
56987 587082 582444 578877 576146 574573 574813 576970 580189 583346 585728 586629 584725 578609 568042 554249
56973 554249 538973 523561 508903 495672 484306 474895 467307 461387 457074 454387 453353 453952 456292
56960 456292 460835 468189 478527 491346 505826 521046 535708 548053 556401 559597 556893 548038 533972
56947 533972 516918 499127 481680 464980 449919 437677 428564 421927 417298 414955 415278 418271 423990
$$ packed form
57032B593317r3189p4136n2051k9869j1004K484Q054J207k1031n4686q9094j14002
57020B066000j25958j27739j23346j15064j04305r2773q1878p1957o2928n5167
57010A104885m9074m4235l9772l5469l1865k9253k7230k5411k3948k2965k2050
56999G53613k0735j9175j7857j6842j5830j4740j3726j2709j1373r651p805o088
56987E87082m638l567k731j573K40K157L219L157K382R01j904o116j0567j3793
56973E54249j5276j5412j4658j3231j1366r411p588n920m313k687j034N99K340
56960D56292M543P354J0338J2819J4480J5220J4662J2345Q348L196k704q855j4066
56947E33972j7054j7791j7447j6700j5061j2242r113o637m629k343L23K993N719
$$ plain form
56934 423990 432771 444788 459820 477600 497843 519599 540940 559481 572949 579376 577558 567794
56922 567794 551787 531599 508939 485380 462448 441105 421624 404318 389809 378205 368621 360059
56910 360059 352331 345659 339941 335050 331395 329370 328512 328026 327994 329262 332111 335892 340114 345177 351671
56895 351671 359533 368305 377881 388570 400673 414342 429660 446542 464563 483046 501226 518199
56883 518199 532840 543996 550717 552297 548285 538712 524287 506304 486338 466044 446911 429907
56871 429907 415357 403353 394303 388925 387852 391478 400236 414656 434967 460939 492398 529596
56859 529596 572514 619645 667660 712269 749177 774514 785383 780900 762844 735043 702017 667919
56847 667919 635929 607842 584255 565559 552730 546833 548050 555832 570072 591630 621664 660984
$$ packed form
56934D23990Q781J2017J5032J7780K0243K1756K1341J8541J3468O427j818r764
56922E67794j6007k0188k2660k3559k2932k1343j9481j7306j4509j1604r584q562
56910C60059p728o672n718m891l655k025q58m86l2J268K849L781M222N063O494
56895C51671P862Q772R576J0689J2103J3669J5318J6882J8021J8483J8180J6973
56883E18199J4641J1156O721J580m012r573j4425j7983j9966k0294j9133j7004
56871D29907j4550j2004r050n378j073L626Q758J4420K0311K5972L1459L7198
56859E29596M2918M7131M8015M4609L6908K5337J0869m483j8056k7801l3026l4098
56847F67919l1990k8087k3587j8696j2829n897J217P782J4240K1558L0034L9320
$$ plain form
56835 660984 710182 769610 838531 914297 992376 1066740 1130028 1174304 1193322 1185145 1152908 1103042
56823 1103042 1042582 977503 912456 851009 795593 747325 706323 672565 646488 628728 619484
56812 619484 618501 625710 641589 666763 701333 744423 793943 846492 897468 941460 972851 986901
56800 986901 981278 957015 917871 868652 814064 758444 705351 656783 613140 574375 540966 513653
56788 513653 492674 477687 468213 463887 464574 470588 482469 500111 522133 546248 569990 590830
56776 590830 605988 612840 609741 596501 574343 545620 513204 479589 446422 414842 385824 359802
56764 359802 336343 314733 294824 276990 261464 248106 236639 226641 217515 208936 201238 194810
56752 194810 189219 183550 177626 172239 167993 164522 161102 157556 154174 151160 148610 146800 146007 146045 146303
$$ packed form
56835F60984M9198N9428O8921P5766P8079P4364O3288M4276J9018q177l2237m9866
56823A103042o0460o5079o5047o1447n5416m8268m1002l3758k6077j7760r244
56812F19484r83P209J5879K5174L4570M3090M9520N2549N0976M3992L1391J4050
56800I86901n623k4263l9144m9219n4588n5620n3093m8568m3643l8765l3409k7313
56788E13653k0979j4987r474m326O87O014J1881J7642K2022K4115K3742K0840
56776E90830J5158O852l099j3240k2158k8723l2416l3615l3167l1580k9018k6022
56764C59802k3459k1610j9909j7834j5526j3358j1467r998r126q579p698o428
56752A94810n591n669n924n387m246l471l420l546l382l014k550j810p93L8K58
$$ plain form
56737 146303 146324 146211 146351 146814 147140 146849 146102 145585 145614 145620 144848 143393 142172 141976 142880 144524 146484 148313
56719 148313 149605 150283 150658 151161 152127 153679 155473 156683 156729 156008 155485 155546 155796 155932 156088 156156 155619 154550
56701 154550 154053 154979 156638 157585 157376 156773 156399 156067 155551 155190 155344 155723 155681 154944 153870 153161 153435 154775
56683 154775 156514 157639 157559 156388 154611 152775 151479 151176 151766 152663 153452 154176 154859 155187 154932 154372 153934
56666 153934 153720 153736 154310 155741 157711 159533 160939 162174 163329 164060 164092 163616 163022 162549 162262 162099 161794
56649 161794 161063 160006 159086 158600 158427 158312 158093 157628 156927 156469 156909 158257 159771 160913 161862 162782 163239
56632 163239 162973 162738 163462 164812 165446 164747 163562 163051 163462 164279 165047 165710 166464 167520 168785 169753 169976
56615 169976 169666 169409 169299 168841 167820 166711 166033 165815 165958 166596 167768 169081 170011 170230 169463 167543 164953
$$ packed form
56737A46303K1j13J40M63L26k91p47n17K9Op72j455j221j96R04J644J960J829
56719A48313J292O78L75N03R66J552J794J210M6p21n23O1K50J36J56O8n37j069
56701A54550m97R26J659R47k09o03l74l32n16l61J54L79m2p37j074p09K74J340
56683A54775J739J125q0j171j777j836j296l03N90Q97P89P24O83L28k55n60m38
56666A53934k14J6N74J431J970J822J406J235J155P31L2m76n94m73k87j63l05
56649A61794p31j057r20m86j73j15k19m65p01m58M40J348J514J142R49R20M57
56632A63239k66k35P24J350O34o99j185n11M11Q17P68O63P54J056J265R68K23
56615A69976l10k57j10m58j021j109o78k18J43O38J172J313R30K19p67j920k590
$$ plain form
56598 164953 162782 161709 161355 161059 160851 161161 161975 162941 164048 165542 167286 168815 169967 170906 171523 171420
56582 171420 170565 169504 168762 168410 168325 168481 168865 169398 170104 171121 172488 174093 175854 177741 179660 181530
56566 181530 183464 185659 188175 191016 194331 198256 202761 207992 214580 223071 233034 243121 252057 259159
56552 259159 264008 266292 266284 265049 263789 263122 263003 262970 262350 260704 258422 256565 255760 255436 254421 252131 248926
56535 248926 245531 242455 239865 237636 235466 233158 230868 228905 227289 225656 223642 221244 218777 216592
56521 216592 214943 213958 213587 213483 213111 212146 210771 209520 208858 208953 209640 210350 210234 208901 207159 206511 207543
56504 207543 209195 210010 209744 209248 209092 209063 208929 208869 208879 208447 207268 205910 205307 205816 207098 208717 210422 211894
56486 211894 212615 212186 210667 208576 206581 205140 204334 203956 203736 203509 203291 203246 203536 204115 204733 205188 205485 205686
$$ packed form
56598A64953k171j073l54k96k08L10Q14R66J107J494J744J529J152R39O17j03
56582A71420q55j061p42l52q5J56L84N33P06J017J367J605J761J887J919J870
56566A81530J934K195K516K841L315L925M505N231O588Q491R963J0087Q936P102
56552B59159M849K284qj235j260o67j19l3o20j646k282j857q05l24j015k290l205
56535B48926l395l076k590k229k170k308k290j963j616j633k014k398k467k185
56521B16592j649r85l71j04l72r65j375j251o62R5O87P10j16j333j742o48J032
56504B07543J652Q15k66m96j56k9j34o0J0m32j179j358o03N09J282J619J705J472
56486B11894P21m29j519k091j995j441q06l78k20k27k18m5K90N79O18M55K97K01
$$ plain form
56468 205686 205790 205902 206340 207322 208669 210032 211328 212719 214204 215497 216285 216531 216559 216923 217904 219017 219320
56451 219320 218497 217320 216687 216556 216309 215853 215704 216089 216666 217122 217489 217823 218188 218948 220457 222328 223633
56434 223633 223989 223918 224019 224406 225092 226200 227478 228247 228279 228165 228392 228581 228092 226975 225861 225303 225587 226698
56416 226698 228012 228450 227551 226089 225159 224993 225153 225449 225929 226290 226105 225611 225605 226465 227782 228976 229789 230187
56398 230187 230268 230330 230586 230835 230772 230604 230875 231689 232665 233690 235157 237235 239481 241494 243536 246086 249081
56381 249081 251966 254297 255940 256806 256850 256357 255894 255852 256222 256880 257846 259018 259839 259609 258241 256482 255210
56364 255210 254703 254797 255470 256853 258709 260469 261884 263216 264538 265317 265138 264551 264652 265852 267496 268778
56348 268778 269686 270887 272856 275356 277696 279416 280679 281971 283465 284791 285450 285313 284619 283717 283012 283069
$$ packed form
56468B05686J04J12M38R82J347J363J296J391J485J293P88K46K8L64R81J113L03
56451B19320q23j177o33j31k47m56j49L85N77M56L67L34L65P60J509J871J305
56434B23633L56p1J01L87O86J108J278P69L2j14K27J89m89j117j114n58K84J111
56416B26698J314M38q99j462r30j66J60K96M80L61j85m94oQ60J317J194Q13L98
56398B30187Q1O2K56K49o3j68K71Q14R76J025J467K078K246K013K042K550K995
56381B49081K885K331J643Q66M4m93m63m2L70O58R66J172Q21k30j368j759j272
56364B55210n07R4O73J383J856J760J415J332J322P79j79n87J01J200J644J282
56348B68778R08J201J969K500K340J720J263J292J494J326O59j37o94r02p05N7
$$ plain form
56332 283069 284376 286857 289741 292144 293914 295818 298730 302627 306575 309789 312488 315434 318858 322155
56318 322155 324569 325815 326056 325668 325099 324699 324620 325005 326114 327907 329731 330971 331920 333368 335359 337094
56302 337094 338220 339436 341583 344823 349050 354283 360089 365347 369299 372385 375429 378559 381586 384898
56288 384898 389052 393806 398447 402875 407547 412516 417345 421917 426536 431274 436086 441532 448431 456623
56274 456623 465013 473165 481991 492375 503861 515404 526888 539154 552813 567775 583876 601327
56262 601327 620354 640822 662529 685710 711063 739376 771300 807453 848444 894617 945970
56251 945970 1002636 1065433 1135529 1213590 1299613 1393715 1496536 1608500 1729048 1856879 1990491
56240 1990491 2128003 2266825 2404103 2537248 2663545 2779473 2881103 2965123 3029040 3070824
$$ packed form
56332B83069J307K481K884K403J770J904K912L897L948L214K699K946L424L297
56318C22155K414J246K41l88n69m00p9L85J109J793J824J240R49J448J991J735
56302C37094J126J216K147L240M227N233N806N258L952L086L044L130L027L312
56288C84898M154M754M641M428M672M969M829M572M619M738M812N446O899Q192
56274D56623Q390Q152Q826J0384J1486J1543J1484J2266J3659J4962J6101J7451
56262F01327J9027K0468K1707K3181K5353K8313L1924L6153M0991M6173N1353
56251I45970N6666O2797P0096P8061Q6023R4102J02821J11964J20548J27831J33612
56240A990491J37512J38822J37278J33145J26297J15928J01630Q4020O3917M1784
$$ plain form
56230 3070824 3089307 3085031 3059909 3015764 2953672 2874855 2781552 2676742 2563522 2445031 2324392
56219 2324392 2204196 2086128 1971256 1860489 1754636 1654342 1560168 1472526 1391426 1316509
56209 1316509 1247390 1183755 1125142 1071043 1021362 976455 936513 901041 869018 839414 811613
56198 811613 785644 762008 741054 722562 706122 691701 679381 668702 658841 649487 641039 633888
56186 633888 627987 623134 619137 615547 611828 608004 604656 602081 599969 598166 597139 597229 597941 598472 598700
56171 598700 599136 600159 601793 604109 607296 611259 615520 619664 623705 627902 632377 637060 641992 647544
56157 647544 654163 661887 670238 678699 687241 696370 706836 719315 734080 750838 769232 789696 813485
56144 813485 841618 874262 911578 954619 1004691 1062084 1126051 1195612 1269367 1344557 1417369
$$ packed form
56230C070824J8483m276k5122m4145o2092p8817r3303j04810j13220j18491j20639
56219B324392j20196j18068j14872j10767j05853j00294r4174q7642q1100p4917
56209A316509o9119o3635n8613n4099m9681m4907l9942l5472l2023k9604k7801
56198H11613k5969k3636k0954j8492j6440j4421j2320j0679r861r354q448p151
56186F33888n901m853l997l590l719l824l348k575k112j803j027R0P12N31K28
56171E98700M36J023J634K316L187L963M261M144M041M197M475M683M932N552
56157F47544O619P724Q351Q461Q542R129J0466J2479J4765J6758J8394K0464K3789
56144H13485K8133L2644L7316M3041N0072N7393O3967O9561P3755P5190P2812
$$ plain form
56133 1417369 1484570 1544526 1596873 1642214 1682326 1719701 1756132 1791802 1825550 1855271 1878182
56122 1878182 1892023 1896893 1895466 1890854 1884413 1875504 1862355 1842604 1813888 1775017 1726667 1670699
56110 1670699 1609230 1544691 1480090 1418247 1360741 1308049 1260515 1218749 1183163 1153564 1129253
56099 1129253 1109324 1092997 1079866 1069825 1062669 1057912 1054937 1053126 1051866 1050934 1050884 1052622 1056386 1061495
56085 1061495 1067204 1073428 1080539 1088882 1098578 1109332 1120344 1130931 1141388 1152714 1165336 1178644
56073 1178644 1191868 1204706 1216964 1228440 1239654 1251943 1266155 1281712 1297454 1312999 1328785
56062 1328785 1345260 1362585 1380841 1400025 1420026 1440934 1463044 1486237 1509737 1532830 1555570
56051 1555570 1578533 1602268 1627227 1653706 1681427 1709501 1737110 1764027 1790405 1816571 1843203
$$ packed form
56133A417369O7201N9956N2347M5341M0112L7375L6431L5670L3748K9721K2911
56122A878182J3841M870j427m612o441q909j3149j9751k8716l8871m8350n5968
56110A670699o1469o4539o4601o1843n7506n2692m7534m1766l5586k9599k4311
56099A129253j9929j6327j3131j0041p156m757k975j811j260r32n0J738L764N109
56085A061495N709O224P111Q343R696J0754J1012J0587J0457J1326J2622J3308
56073A178644J3224J2838J2258J1476J1214J2289J4212J5557J5742J5545J5786
56062A328785J6475J7325J8256J9184K0001K0908K2110K3193K3500K3093K2740
56051A555570K2963K3735K4959K6479K7721K8074K7609K6917K6378K6166K6632
$$ plain form
56040 1843203 1871080 1900336 1930467 1961249 1993100 2026357 2060915 2096933 2135134 2175919 2218733
56029 2218733 2262748 2307701 2353732 2401046 2450034 2501100 2554042 2608274 2663946 2722006 2782786
56018 2782786 2845393 2909065 2974360 3042458 3114058 3189519 3269264 3353344 3441280 3532964 3629113
56007 3629113 3730316 3836274 3946488 4061029 4180267 4304633 4435061 4572701 4717751
55998 4717751 4869553 5028315 5195629 5372711 5559407 5755695 5962967 6182942 6416390
55989 6416390 6663772 6926090 7204353 7499375 7812897 8147680 8505734 8887956 9296334
55980 9296334 9734982 10208048 10718371 11269484 11867251 12518200 13227985 14003067 14852400
55971 14852400 15786143 16814587 17950134 19208933 20609617 22173185 23926619 25905460
$$ packed form
56040A843203K7877K9256L0131L0782L1851L3257L4558L6018L8201M0785M2814
56029B218733M4015M4953M6031M7314M8988N1066N2942N4232N5672N8060O0780
56018B782786O2607O3672O5295O8098P1600P5461P9745Q4080Q7936R1684R6149
56007C629113J01203J05958J10214J14541J19238J24366J30428J37640J45050
55998D717751J51802J58762J67314J77082J86696J96288K07272K19975K33448
55989F416390K47382K62318K78263K95022L13522L34783L58054L82222M08378
55980I296334M38648M73066N10323N51113N97767O50949P09785P75082Q49333
55971A4852400R33743J028444J135547J258799J400684J563568J753434J978841
$$ plain form
55963 25905460 28152312 30716740 33660435 37062109 41018121 45644773 51086512 57523668
55955 57523668 65175663 74306396 85232981 98324097 113979940 132602367 154551204
55948 154551204 180052214 209030652 240893603 274316034 307099626 336230130 358308340
55941 358308340 370393814 370958570 360413158 340866078 315292287 286633995 257249167
55934 257249167 228765819 202170335 177965379 156323726 137211660 120472946 105884497
55927 105884497 93200065 82182360 72617155 64314986 57110979 50863162 45446097 40745284
55919 40745284 36658343 33098085 29990459 27270377 24881426 22777042 20918071 19269300
55911 19269300 17799805 16484844 15304579 14241469 13280332 12409343 11618530 10897829 10238136
$$ packed form
55963B5905460K246852K564428K943695L401674L956012M626652N441739O437156
55955E7523668P651995R130733J0926585J3091116J5655843J8622427K1948837
55948A54551204K5501010K8978438L1862951L3422431L2783592K9130504K2078210
55941C58308340J2085474N64756j0545412j9547080k5573791k8658292k9384828
55934B57249167k8483348k6595484k4204956k1641653j9112066j6738714j4588449
55927A05884497j2684432j1017705r565205q302169p204007o247817n417065m700813
55919D0745284m086941l560258l107626k720082k388951k104384j858971j648771
55911A9269300j469495j314961j180265j063110r61137q70989p90813p20701o59693
$$ plain form
55902 10238136 9633133 9078221 8568417 8098778 7665847 7266868 6898231 6556155 6238261
55893 6238261 5943086 5668735 5413381 5176412 4957722 4756340 4570816 4400198 4243423
55884 4243423 4098257 3961977 3832532 3708208 3587026 3467872 3351695 3240456 3135236
55875 3135236 3036089 2942822 2854622 2769494 2685383 2601586 2518237 2435156 2352426 2271573 2194711
55864 2194711 2122641 2054765 1990654 1930549 1874481 1821928 1772356 1725363 1680382 1637000 1595383
55853 1595383 1555716 1517502 1480175 1444053 1409879 1377637 1346635 1316497 1287197 1258340 1229391
55842 1229391 1200618 1172966 1146831 1121640 1096754 1072229 1048588 1026273 1005342 985405 965915
55831 965915 946849 928854 912452 897445 883467 870674 859275 848747 838146 826954 815068
$$ packed form
55902A0238136o05003n54912n09804m69639m32931l98979l68637l42076l17894
55893F238261k95175k74351k55354k36969k18690k01382j85524j70618j56775
55884D243423j45166j36280j29445j24324j21182j19154j16177j11239j05220
55875C135236r9147r3267q8200q5128q4111q3797q3349q3081q2730q0853p6862
55864B194711p2070o7876o4111o0105n6068n2553m9572m6993m4981m3382m1617
55853A595383l9667l8214l7327l6122l4174l2242l1002l0138k9300k8857k8949
55842A229391k8773k7652k6135k5191k4886k4525k3641k2315k0931j9937j9490
55831I65915j9066j7995j6402j5007j3978j2793j1399j0528j0601j1192j1886
$$ plain form
55820 815068 802273 788426 773996 759784 746152 732973 720094 707343 694359 681054 668097
55809 668097 656386 646162 637082 628900 621542 614775 608410 602656 597738 593432 589587 586757 585542 585467
55795 585467 585353 584741 584218 584329 584918 585614 586279 586862 587465 588686 591256 595133 599450 603427 606647 608186
55779 608186 606269 599471 588139 574238 559966 546741 535331 526494 521222 520305 523673 530183 537933
55766 537933 544598 547587 544611 534871 519792 502258 484999 469566 456402 445404 436424 429550 424883
55753 424883 422008 419959 417948 415774 413235 409516 403779 396171 387763 379528 371809 364725 358571 353622
55739 353622 349826 346812 344105 341419 338827 336488 334133 331111 327152 322758 318576 314716 310930 307072
55725 307072 302950 298104 292267 285818 279347 273056 267023 261735 257798 255292 253888 253371 253571 254144 254999
$$ packed form
55820H15068j2795j3847j4430j4212j3632j3179j2879j2751j2984j3305j2957
55809F68097j1711j0224r080q182p358o767o365n754m918m306l845k830j215p5
55795E85467j14o12n23J11N89O96O65N83O03J221K570L877M317L977L220J539
55779F08186j917o798j1332j3901j4272j3225j1410q837n272r17L368O510P750
55766E37933O665K989k976r740j5079j7534j7259j5433j3164j0998q980o874m667
55753D24883k875k049k011k174k539l719n737p608q408q235p719p084o154m949
55739C53622l796l014k707k686k592k339k355l022l959m394m182l860l786l858
55725C07072m122m846n837o449o471o291o033n288l937k506j404n17K00N73Q55
$$ plain form
55710 254999 256715 259901 264325 269181 273876 277945 280594 281252 280406 279021 277230 274389 270311 265474 259991
55695 259991 253403 245733 237920 230888 224927 220102 216440 213389 210032 206315 203407 202297 202617 203244 203521
55680 203521 203429 203221 203458 204902 207710 210986 213579 215065 215616 215331 214219 212496 210433 208089 205572 203274
55664 203274 201416 199643 197519 195222 193329 192106 191421 191221 191636 192659 194045 195506 196758 197528 197812
55649 197812 198076 198849 200099 201252 201772 201523 200688 199608 198789 198776 199770 201355 202713 203222 202855 201880 200225
55632 200225 197455 193467 188906 184531 180459 176435 172551 169091 165904 162674 159808 158183 157808 157528 156468
55617 156468 155064 154122 153489 152364 150580 148872 147927 147638 147248 145918 143318 139981 136923 134666 132849
55602 132849 130989 129168 127580 125832 123418 120742 118991 118859 119862 120975 121537 121420 120701 119543 118303
$$ packed form
55710B54999J716L186M424M856M695M069K649O58q46j385j791k841m078m837n483
55695B59991o588p670p813p032n961m825l662l051l357l717k908j110L20O27K77
55680B03521r2k08K37J444K808L276K593J486N51k85j112j723k063k344k517k298
55664B03274j858j773k124k297j893j223o85k00M15J023J386J461J252P70K84
55649A97812K64P73J250J153N20k49q35j080q19j3R94J585J358N09l67r75j655
55632B00225k770l988m561m375m072m024l884l460l187l230k866j625l75k80j060
55617A56468j404r42o33j125j784j708r45k89l90j330k600l337l058k257j817
55602A32849j860j821j588j748k414k676j751j32J003J113N62j17p19j158j240
$$ plain form
55587 118303 117492 117432 117860 117975 117144 115587 114143 113319 112916 112653 112737 113509 114917 116635 118448 120220 121790
55570 121790 123268 125160 127810 130892 133710 135753 136728 136469 135319 134190 133671 133272 132148 130289 128351
55555 128351 126493 124167 121082 117627 114226 110946 107984 105856 104737 104047 103094 101789 100443 99237 98209
55540 98209 97558 97543 98089 98685 98732 98064 97243 97161 98112 99374 100073 100292 100804 101865 102924 103601 104153 104680 104665
55521 104665 103840 102964 102979 103724 104151 103696 102773 101976 101354 100602 99509 98049 96296 94399 92489 90652 89102
55504 89102 88216 88107 88345 88440 88462 88751 89145 89019 88068 86546 84708 82638 80732 79598 79130 78360 76763 75210
55486 75210 74918 75858 76927 77429 77552 77505 77171 76821 77274 78876 80865 82207 82578 82220 81381 80451 80112 80694
55468 80694 81706 82579 83490 84755 85805 85758 84844 84275 84550 84862 84472 83747 83329 83164 82976 83023 83519 83812 83076
$$ packed form
55587A18303q11o0M28J15q31j557j444q24m03k63Q4P72J408J718J813J772J570
55570A21790J478J892K650L082K818K043R75k59j150j129n19l99j124j859j938
55555A28351j858k326l085l455l401l280k962k128j119o90r53j305j346j206j028
55540I8209o51j5N46N96M7o68q21q2R51J262O99K19N12J061J059O77N52N27j5
55521A04665q25q76J5P45M27m55r23p97o22p52j093j460j753j897j910j837j550
55504H9102q86j09K38R5K2K89L94j26r51j522j838k070j906j134m68p70j597j553
55486G5210k92R40J069N02J23m7l34l50M53J602J989J342L71l58q39r30l39N82
55468H0694J012Q73R11J265J050m7r14n69K75L12l90p25m18j65j88M7M96K93p36
$$ plain form
55449 83076 81651 80877 81594 83411 85346 86560 86555 85406 83947 83096 82790 82121 80658 79048 78073 77716 77608
55432 77608 77796 78494 79413 79970 80083 80167 80397 80538 80593 81083 82360 83981 85108 85377 85080 84612 84107 83653 83558
55413 83558 84113 85219 86438 87385 87944 88141 87959 87365 86379 85076 83645 82415 81670 81314 80882 80035 78941
55396 78941 78019 77379 76748 75865 74787 73777 73110 73090 73977 75690 77639 79161 80180 81233 82683 84082
55380 84082 84594 83930 82525 80831 78943 77138 76196 76604 77733 78446 78433 78322 78489 78537 78169 77789 77806 77878 77482
55361 77482 76872 76895 77977 79684 81082 81291 80006 77900 76280 75928 76505 77345 78332 79488 80255 80007 78977
55344 78977 77911 77017 76165 75842 76755 78387 79130 78272 76879 76195 76088 75734 75026 74431 74020 73493 72900 72562
55326 72562 72465 72364 72320 72557 72993 73448 74127 75289 76553 77202 77068 76510 75593 74040 72111 70755 70520 70874
$$ packed form
55449H3076j425p74P17J817J935J214nj149j459q51l06o69j463j610r75l57j08
55432G7608J88O98R19N57J13Q4K30J41N5M90J277J621J127K69k97m68n05m54r5
55413H3558N55J106J219R47N59J97j82n94r86j303j431j230p45l56m32q47j094
55396G8941r22o40o31q83j078j010o67k0Q87J713J949J522J019J053J450J399
55380H4082N12o64j405j694j888j805r42M08J129P13j3j11J67M8l68l80J7P2l96
55361G7482o10K3J082J707J398K09j285k106j620l52N77Q40R87J156P67k48j030
55344G8977j066q94q52l23R13J632P43q58j393o84j07l54p08n95m11n27n93l38
55326G2562r7j01m4K37M36M55O79J162J264O49j34n58r17j553j929j356k35L54
$$ plain form
55308 70874 71049 71183 72125 74213 76688 78426 79028 79109 79553 80621 81877 82897 83717 84429 84691 84034 82576
55291 82576 81014 79895 79174 78513 77722 76928 76560 77121 78646 80423 81643 82329 83159 84313 85052 84727 83737
55274 83737 83061 83136 83584 83835 83599 82884 81979 81406 81511 82043 82393 82220 81610 80672 79367 77866 76693 76225
55256 76225 76244 76228 76003 75894 76294 77310 78756 80213 81108 81050 80306 79659 79557 79548 78885 77566 76363 75820 75694
55237 75694 75611 75793 76675 78047 79122 79433 79199 78791 78264 77609 77010 76567 76074 75384 74789 74669 74911 75012 74784
55218 74784 74647 75135 76276 77524 78164 77834 76813 75853 75518 75666 75734 75590 75859 77154 79144 80698 81049
55201 81049 80598 80390 80906 81652 81951 81851 81929 82351 82516 81810 80431 79129 78325 77852 77537 77596 78205 78972 79208
55182 79208 78653 77671 76767 76146 75793 75740 76110 77001 78338 79753 80638 80573 79803 79103 79017 79401 79807 80067 80288
$$ packed form
55308G0874J75J34R42K088K475J738O02Q1M44J068J256J020Q20P12K62o57j458
55291H2576j562j119p21o61p91p94l68N61J525J777J220O86Q30J154P39l25r90
55274H3737o76P5M48K51k36p15r05n73J05N32L50j73o10r38j305j501j173m68
55256G6225J9j6k25j09M00J016J446J457Q95n8p44o47j02ro63j319j203n43j26
55237G5694q3J82Q82J372J075L11k34m08n27o55n99m43m93o90n95j20K42J01k28
55218G4784j37M88J141J248O40l30j021r60l35J48O8j44K69J295J990J554L51
55201H1049m51k08N16P46K99j00P8M22J65p06j379j302q04m73l15N9O09P67K36
55182G9208n55r82r04o21l53n3L70Q91J337J415Q85o5p70p00q6L84M06K60K21
$$ plain form
55163 80288 80525 80805 81346 82303 83283 83568 83019 82413 82638 83789 85289 86647 87747 88524 88809 88589 88139 87754
55145 87754 87458 87044 86330 85310 84193 83334 82986 83019 82987 82590 82048 81892 82379 83238 84042 84690 85363 86077 86571
55126 86571 86687 86605 86529 86400 86196 86224 86703 87190 86983 86107 85389 85385 85774 86035 86182 86434 86613 86409 85899 85381 84933
55105 84933 84651 84934 85903 86805 86757 86031 85795 86591 87839 88964 90106 91386 92306 92553 92790 93895 95658
55088 95658 96862 96612 95178 93642 93012 93472 94197 94102 93017 91864 91425 91333 90800 89914 89573 90249 91463 92474
55070 92474 92926 92810 92344 92060 92512 93662 94814 95296 95022 94405 94034 94411 95623 97212 98649 99929 101307
55053 101307 102521 102831 101970 100516 99097 97652 95823 93703 91866 90828 90726 91310 92081 92667 93185 93996
55037 93996 95013 95628 95466 94800 94058 93346 92749 92539 92701 92717 92351 92204 92876 93953 94592 94840 95533 96917
$$ packed form
55163H0288K37K80N41R57R80K85n49o06K25J151J500J358J100P77K85k20m50l85
55145H7754k96m14p14j020j117q59l48L3l2l97n42j56M87Q59Q04O48O73P14M94
55126H6571J16q2p6j29k04K8M79M87k07q76p18mL89K61J47K52J79k04n10n18m48
55105H4933k82K83R69R02m8p26k36P96J248J125J142J280R20K47K37J105J763
55088I5658J204k50j434j536o30M60P25r5j085j153m39r2n33q86l41O76J214J011
55070I2474M52j16m66k84M52J150J152M82k74o17l71L77J212J589J437J280J378
55053A01307J214L10q61j454j419j445j829k120j837j038j02N84P71N86N18Q11
55037I3996J017O15j62o66p42p12n97k10J62J6l66j47O72J077O39K48O93J384
$$ plain form
55019 96917 98221 98726 98529 98014 97256 96256 95201 94152 92995 92040 92034 93106 94209 94262 93542 93282 94116 95576
55001 95576 96962 97964 98351 97861 96821 96346 97341 99461 101428 102313 102210 101747 101310 100889 100404 99922 99544
54984 99544 99301 99253 99566 100247 100834 100653 99594 98431 98033 98346 98509 98028 97400 97321 97641 97583 96833 95914 95388
54965 95388 95174 94934 94804 95296 96604 98365 100143 101797 103190 103946 103796 103084 102548 102513 102574 102254 101799 102049
54947 102049 103411 105171 106071 105565 104313 103383 103166 103270 103221 102890 102280 101403 100569 100355 100901 101486 101268 100297
54929 100297 99359 98897 98614 98208 97934 98141 98739 99524 100711 102679 105349 108284 111353 114829 118780 122810
54913 122810 126579 130309 134491 139270 144275 148942 152863 155958 158478 160690 162344 162491 160118 155106
54899 155106 148540 141972 136380 131756 127556 123426 119526 116318 114175 113208 113238 113728 113841 112909 111073 109273
$$ packed form
55019I6917J304N05j97n15p58j000j055j049j157r55oJ072J103N3p20k60Q34J460
55001I5576J386J002L87m90j040m75R95K120J967Q85j03m63m37m21m85m82l78
54984I9544k43m8L13O81N87j81j059j163l98L13J63m81o28p9L20n8p50r19n26
54965I5388k14k40j30M92J308J761J778J654J393P56j50p12n36l5O1l20m55K50
54947A02049J362J760R00n06j252r30k17J04m9l31o10q77q34k14N46N85k18r71
54929A00297r38m62k83m06k74K07N98P85J187J968K670K935L069L476L951M030
54913A22810L769L730M182M779N005M667L921L095K520K212J654J47k373n012
54899A55106o566o568n592m624m200m130l900l208k143r67L0M90J13r32j836j800
$$ plain form
54883 109273 108367 108381 108855 109733 111445 113978 116373 117607 117787 118039 119254 121383 124060 127378 131698 136932
54867 136932 142489 147888 153048 157861 161800 164212 164905 164240 162625 160075 156341 151429 145858 140403 135675
54852 135675 131933 129074 126630 123934 120678 117333 114711 112967 111366 109211 106673 104468 103015 102318
54838 102318 102308 102781 103177 103087 102947 103570 104855 105615 104977 103374 101813 100681 99765 98991 98535 98377 98331 98424 98773
54819 98773 99162 99159 98662 97984 97469 97317 97656 98385 99041 99229 99124 99122 99140 98796 98246 98171 98732 99202 98950 98283 97911
54798 97911 98005 98271 98566 98914 99052 98615 97830 97596 98679 100990 103677 105758 106664 106471 105790 105418 105953 107551
54780 107551 109854 112113 113632 114293 114574 114954 115421 115630 115428 115027 114822 115190 116325 118086 120083 122073
54764 122073 124203 126733 129729 133214 137399 142415 147894 153201 158128 162998 168006 172689 176182 177768
$$ packed form
54883A09273r06J4M74Q78J712K533K395J234J80K52J215K129K677L318M320N234
54867A36932N557N399N160M813L939K412O93o65j615k550l734m912n571n455m728
54852A35675l742k859k444k696l256l345k622j744j601k155k538k205j453o97
54838A02318j0M73L96r0j40O23J285P60o38j603j561j132r16p74m56j58m6R3L49
54819I8773L89lm97o78n15j52L39P29O56J88j05kJ8l44n50p5N61M70k52o67l72
54798I7911R4K66K95L48J38m37p85k34J083K311K687K081R06j93o81l72N35J598
54780A07551K303K259J519O61K81L80M67K09k02m01k05L68J135J761J997J990
54764A22073K130K530K996L485M185N016N479N307M927M870N008M683L493J586
$$ plain form
54750 177768 177157 174543 170589 166141 161702 157269 152806 148638 145134 142131 138996 135298 131173 127063
54736 127063 123406 120695 119419 119546 120186 120224 119380 118326 117673 117222 116487 115593 115195 115597 116448 117329 118227 119345
54718 119345 120896 123303 127162 132589 138794 144652 149572 153585 156821 159367 161485 163434 164894 164933 162798
54703 162798 158656 153462 148271 143746 140101 137237 134865 132639 130319 127965 125969 124714 124080 123406 122095
54688 122095 120155 118024 116031 114275 112837 111767 110916 110164 109767 110059 110732 110898 110122 108970 108208 107792
54672 107792 107158 106325 106114 107154 109081 110952 112145 112614 112519 111995 111249 110551 109978 109391 108831 108684 109238 110187
54654 110187 110849 110849 110286 109304 107886 106254 105057 104832 105465 106442 107390 108077 108153 107433 106344 105557 105132 104526
54636 104526 103608 103132 103857 105482 106837 107046 106262 105361 105073 105347 105492 105045 104465 104663 105829 107154 107902
$$ packed form
54750A77768o11k614l954m448m439m433m463m168l504l003l135l698m125m110
54736A27063l657k711j276J27O40L8q44j054o53m51p35q94l98M02Q51Q81Q98J118
54718A19345J551K407L859N427O205N858M920M013L236K546K118J949J460L9k135
54703A62798m142n194n191m525l645k864k372k226k320k354j996j255o34o74j311
54688A22095j940k131j993j756j438j070q51p52l97K92O73J66p76j152p62m16
54672A07792o34q33k11J040J927J871J193M69r5n24p46o98n73n87n60j47N54R49
54654A10187O62%n63r82j418j632j197k25O33R77R48O87P6p20j089p87m25o06
54636A04526r18m76P25J625J355K09p84r01k88K74J45m47n80J98J166J325P48
$$ plain form
54619 107902 108263 108713 108994 108386 106881 105418 104827 105048 105576 106170 106763 107076 106841 106360 106351 107126 108121 108471 107945
54600 107945 107186 107059 107864 109187 110399 111198 111749 112418 113368 114306 114631 113983 112653 111349 110565 110314 110436
54583 110436 110834 111239 111087 109998 108333 106925 106273 106190 106249 106264 106259 106227 106150 106149 106430 107074 107985 108984 109917 110689 111292
54562 111292 111788 112159 112212 111736 110825 109983 109806 110525 111852 113224 114145 114314 113649 112335 110807 109524 108745
54545 108745 108565 109065 110223 111722 113100 114191 115298 116765 118461 119783 120173 119618 118686 118062 118002 118273
54529 118273 118578 118887 119221 119364 119119 118683 118377 118055 117292 116168 115344 115188 115347 115436 115611 116084 116522 116463 115952
54510 115952 115212 114052 112315 110732 110533 112014 114118 115630 116332 116748 117220 117637 117822 117843 117904 118099 118266
54493 118266 118149 117750 117402 117323 117328 117210 117253 117991 119490 121243 122736 123790 124411 124725 125016 125426 125644 125327 124799
$$ packed form
54619A07902L61M50K81o08j505j463n91K21N28N94N93L13k35m81rP75R95L50n26
54600A07945p59j27Q05J323J212P99N51O69R50R38L25o48j330j304p84k51J22
54583A10436L98M05j52j089j665j408o52q3N9J5nl2p7jK81O44R11R99R33P72O03
54562A11292M96L71N3m76r11q42j77P19J327J372R21J69o65j314j528j283p79
54545A08745j80N00J158J499J378J091J107J467J696J322L90n55r32o24o0K71
54529A18273L05L09L34J43k45m36l06l22p63j124q24j56J59Q9J75M73M38n9n11
54510A15952p40j160j737j583j99J481K104J512P02M16M72M17J85K1O1J95J67
54493A18266j17l99l48p9Nj18M3P38J499J753J493J054O21L14K91M10K18l17n28
$$ plain form
54474 124799 124801 125479 126191 126421 126351 126345 126464 126724 127264 127933 128273 128308 128808 130279 132119 133309 133590 133424 133152 132808
54454 132808 132523 132479 132547 132499 132483 132746 132955 132396 130930 129267 128160 127664 127329 126793 126059 125387 125024 124970 125047 125247
54434 125247 125761 126479 126752 126062 124740 123697 123551 124344 125802 127380 128270 128010 127137 126699 127112 127935 128725
54417 128725 129467 130123 130404 130231 129882 129337 128037 125764 123432 122449 123375 125507 127751 129583 131115 132441
54401 132441 133195 132980 132187 132001 133247 135453 137426 138566 139140 139488 139624 139658 139936 140505 140961 141002 140650 139832
54383 139832 138411 136886 136343 137192 138482 139010 138694 138298 138226 138306 138504 139115 140180 141256 141854 141838 141396 140909
54365 140909 140793 141193 141887 142619 143311 143786 143678 143010 142526 142947 144117 145358 146480 147854 149639 151591 153690
54348 153690 156385 159999 164231 168292 171285 172568 172239 171234 170456 169748 168170 165323 161853 158548 155497
$$ packed form
54474A24799KO78P12K30p0oJ19K60N40O69L40L5N00J471J840J190K81j66k72l44
54454A32808k85m4O8m8j6K63K09n59j466j663j107m96l35n36p34o72l63n4P7K00
54434A25247N14P18K73o90j322j043j46P93J458J578Q90k60q73m38M13Q23P90
54417A28725P42O56K81j73l49n45j300k273k332r83R26K132K244J832J532J326
54401A32441P54k15p93j86J246K206J973J140N74L48J36L4K78N69M56M1l52q18
54383A39832j421j525n43Q49J290N28l16l96p2Q0J98O11J065J076N98j6m42m87
54365A40909j16M00O94P32O92M75j08o68m84M21J170J241J122J374J785J952K099
54348A53690K695L614M232M061K993J283l29j005p78p08j578k847l470l305l051
$$ plain form
54333 155497 152367 149038 145676 142566 140116 138655 137922 137133 135871 134598 133965 133957 134073 134018 133742 133089 131985
54316 131985 130924 130682 131387 132283 132542 131958 130674 128695 126129 123763 122775 123574 125142 125884 125145 123736
54300 123736 122997 123552 125013 126528 127419 127528 127321 127584 128667 129974 130461 129739 128517 127876 128256 129207 129981
54283 129981 130250 130302 130602 131197 131714 131968 132353 133393 135043 136739 138069 139080 139894 140336 140011 138669 136536
54266 136536 134453 133467 133957 135198 136152 136578 137005 137771 138653 139458 140397 141677 143147 144565 145793 146606 146743
54249 146743 146340 145869 145446 144672 143371 141944 140741 139703 138956 139057 140036 140764 140131 138510 137250 136891 136678
54232 136678 135794 134315 132833 131785 131335 131376 131461 131184 130769 130871 131639 132468 132885 133267 134285 135909 137331
54215 137331 137824 137432 136790 136410 136149 135438 134014 132299 130950 130203 129862 129800 130146 131010 132276 133678 134849
$$ packed form
54333A55497l130l329l362l110k450j461p33p89j262j273o33qJ16n5k76o53j104
54316A31985j061k42P05Q96K59n84j284j979k566k366r88P99J568P42p39j409
54300A23736p39N55J461J515Q91J09k07K63J083J307M87p22j222o41L80R51P74
54283A29981K69N2L00N95N17K54L85J040J650J696J330J011Q14M42l25j342k133
54266A36536k083r86M90J241R54M26M27P66Q82Q05R39J280J470J418J228Q13J37
54249A46743m03m71m23p74j301j427j203j038p47J01R79P28o33j621j260l59k13
54232A36678q84j479j482j048m50M1Q5k77m15J02P68Q29M17L82J018J624J422
54215A37331M93l92o42l80k61p11j424j715j349p47l41o2L46Q64J266J402J171
$$ plain form
54198 134849 135384 135047 133935 132333 130567 129152 128684 129182 129807 129771 129374 129556 130538 131560 131954 131792 131357
54181 131357 130739 130177 130126 130554 130757 130328 129790 129801 130205 130467 130679 131420 132790 134200 135134 135615 135881 136104 136516
54162 136516 137387 138624 139644 139887 139379 138668 138183 137756 136850 135264 133475 132119 131309 130822 130740 131357 132334
54145 132334 132737 132269 131867 132407 133326 133329 132251 131332 131551 132500 133199 133325 133152 132790 132114 131290 130810 130923 131355
54126 131355 131696 131869 132083 132480 132981 133506 134181 135264 136834 138651 140304 141424 141823 141633 141365 141630 142580
54109 142580 143721 144354 144155 143324 142368 141843 142036 142641 142935 142559 141999 142014 142669 143276 143228 142584 141802 141253 141131
54090 141131 141535 142359 143214 143700 143811 143974 144582 145467 145956 145600 144791 144415 144880 145797 146728 147810 149369 151285
54072 151285 153161 154843 156306 157217 157228 156678 156474 157198 158761 160949 163840 167624 172412 178293 185093 192009
$$ packed form
54198A34849N35l37j112j602j766j415m68M98O25l6l97J82R82J022L94j62m35
54181A31357o18n62n1M28K03m29n38J1M04K62K12P41J370J410R34M81K66K23M12
54162A36516Q71J237J020K43n08p11m85m27r06j586j789j356q10m87q2O17R77
54145A32334M03m68m02N40R19Lj078r19K19R49O99J26j73l62o76q24m80J13M32
54126A31355L41J73K14L97N01N25O75J083J570J817J653J120L99j90k68K65R50
54109A42580J141O33j99q31r56n25J93O05K94l76n60J5O55O07m8o44p82n49j22
54090A41131M04Q24Q55M86J11J63O08Q85M89l56q09l76M65R17R31J082J559J916
54072A51285J876J682J463R11J1n50k04P24J563K188K891L784M788N881O800O916
$$ plain form
54056 192009 198027 202840 206818 209894 211200 210187 207551 204467 201414 198322 195487 193539 192634 192358 192466
54041 192466 193167 194646 196772 199400 202529 206028 209564 212966 216390 220055 224084 228639 233830 239339
54027 239339 244473 248786 252436 255763 258788 261359 263579 265749 267874 269490 270042 269366 267776 265733 263462
54012 263462 260890 257953 254821 251675 248284 244020 238469 231952 225373 219591 214976 211485 209005 207487
53998 207487 206782 206456 205941 204838 203055 200728 198206 196014 194507 193409 192014 190021 187911 186263 185000
53983 185000 183639 182026 180390 178887 177606 176876 176924 177230 176919 175955 175357 175911 177252 178577 179739 181107
53967 181107 182844 184945 187672 191246 195207 198712 201465 203765 205616 206428 205863 204542 203560 203499 204050 204401
53951 204401 203953 202906 202180 202483 203443 204052 203993 204068 205146 207201 209708 212550 215996 220031 224247 228337
$$ packed form
54056A92009O018M813L978L076J306j013k636l084l053l092k835j948r05k76J08
54041A92466P01J479K126K628L129L499L536L402L424L665M029M555N191N509
54027B39339N134M313L650L327L025K571K220K170K125J616N52o76j590k043k271
54012B63462k572k937l132l146l391m264n551o517o579n782m615l491k480j518
53998B07487p05l26n15j103j783k327k522k192j507j098j395j993k110j648j263
53983A85000j361j613j636j503j281p30M8L06l11r64n98N54J341J325J162J368
53967A81107J737K101K727L574L961L505K753K300J851Q12n65j321r82o1N51L51
53951B04401m48j047p26L03R60O09n9P5J078K055K507K842L446M035M216M090
$$ plain form
53935 228337 232298 236201 240110 244237 248744 253326 257290 260259 262689 265571 269669 275009 281034 287285
53921 287285 293986 301901 311546 322713 334902 348021 362461 378538 396042 413989 430488 443148
53909 443148 450308 452065 449823 444907 437999 429760 421236 413273 406032 399371 393302 387743 382328 376997
53895 376997 372399 369022 366047 361760 355266 347311 339253 331635 324069 316155 308079 300312 293099 286427
53881 286427 280389 275328 271452 268349 265112 261062 256331 251630 247549 244134 241008 237769 234352 231103
53867 231103 228417 226277 224310 222356 220688 219448 218143 216132 213506 211081 209436 208307 207025 205335
53853 205335 203676 202757 202881 203563 203844 203131 201623 199838 197915 195757 193625 192150 191675 191952 192486 192815
53837 192815 192537 191566 190447 189896 189884 189710 189134 188807 189164 189557 189140 188195 187814 188438 189473 190334 191157 192260
$$ packed form
53935B28337L961L903L909M127M507M582L964K969K430K882M098N340O025O251
53921B87285O701P915R645J1167J2189J3119J4440J6077J7504J7947J6499J2660
53909D43148P160J757k242m916o908q239q524p963p241o661o069n559n415n331
53895C76997m598l377k975m287o494p955q058p618p566p914q076p767p213o672
53881B86427o038n061l876l103l237m050m731m701m081l415l126l239l417l249
53867B31103k686k140j967j954j668j240j305k011k626k425j645j129j282j690
53853B05335j659r19J24O82K81p13j508j785j923k158k132j475m75K77N34L29
53837A92815k78r71j119n51j2j74n76l27L57L93m17r45l81O24J035Q61Q23J103
$$ plain form
53819 192260 193426 194102 194051 193570 193246 193637 194952 196854 198652 199901 200823 202177 204741 208780 213835 219074
53803 219074 223997 228776 233758 238830 243506 247511 250949 253976 256713 259427 262367 265316 267688 269232
53789 269232 270289 271269 272252 273350 274967 277315 279885 281770 282354 281473 279187 275874 272364 269455 267219
53774 267219 265094 262620 259750 256476 252677 248511 244525 241076 237849 234269 230211 226033 222041 218261
53760 218261 214742 211777 209654 208291 207268 206165 204802 203159 201186 198811 196205 193927 192584 192247
53746 192247 192321 192119 191559 191181 191490 192467 193722 194968 196161 197291 198246 198966 199593 200302 201043 201612 202009 202517
53728 202517 203252 203793 203611 202849 202348 202669 203438 203977 204381 205405 207290 209287 210587 211298 212117 213386 214940
53711 214940 216681 218743 221068 223319 225354 227406 229670 232063 234567 237443 240840 244408 247549 249897
$$ packed form
53819A92260J166O76n1m81l24L91J315J902J798J249R22J354K564M039N055N239
53803B19074M923M779M982N072M676M005L438L027K737K714K940K949K372J544
53789B69232J057R80R83J098J617K348K570J885N84q81k286l313l510k909k236
53774B67219k125k474k870l274l799m166l986l449l227l580m058m178l992l780
53760B18261l519k965k123j363j023j103j363j643j973k375k606k278j343l37
53746A92247P4k02n60l78L09R77J255J246J193J130R55P20O27P09P41N69L97N08
53728B02517P35N41j82p62n01L21P69N39M04J024J885J997J300P11Q19J269J554
53711B14940J741K062K325K251K035K052K264K393K504K876L397L568L141K348
$$ plain form
53697 249897 251435 252416 253339 254762 256863 259359 261978 264750 267668 270436 272838 274973 276713 277336 276323
53682 276323 274285 272456 271356 270577 269783 269120 268580 267727 266455 265373 265074 265461 266114 266808 267322 267251 266446
53665 266446 265285 264071 262639 260932 259491 258766 258387 257745 256913 256297 255767 254982 254316 254458 255167 255419 254902
53648 254902 254372 254271 254035 253269 252676 253120 254459 256067 257885 260129 262401 264021 265057 266210 267729 269201
53632 269201 270403 271669 273270 275035 276742 278417 280127 281889 283896 286399 289339 292480 295897 299786
53618 299786 303823 307352 310360 313592 317436 321346 324801 328236 332454 337581 343141 348786 354278 359107
53604 359107 362896 366140 369799 374066 378077 380945 382566 383253 383118 382133 380484 378592 376878 375571 374515
53589 374515 373197 371258 369005 367054 365401 363302 360259 356706 353394 350457 347436 344052 340576 337586
$$ packed form
53697B49897J538R81R23J423K101K496K619K772K918K768K402K135J740O23j013
53682B76323k038j829j100p79p94o63n40q53j272j082k99L87O53O94N14p1q05
53665B66446j161j214j432j707j441p25l79o42q32o16n30p85o66J42P09K52n17
53648B54902n30j01k36p66n93M44J339J608J818K244K272J620J036J153J519J472
53632B69201J202J266J601J765J707J675J710J762K007K503K940L141L417L889
53618B99786M037L529L008L232L844L910L455L435M218N127N560N645N492M829
53604C59107L789L244L659M267M011K868J621O87j35r85j649j892j714j307j056
53589C74515j318j939k253j951j653k099l043l553l312k937l021l384l476k990
$$ plain form
53575 337586 335647 335092 335747 336871 337646 337762 337401 336735 335685 334170 332415 330896 330000 329695 329591 329485 329827
53558 329827 331341 334046 336946 338976 340039 340856 342028 343585 345308 347093 349066 351623 355259 360018
53544 360018 365252 370315 375369 381002 387104 392744 397327 401330 405674 410806 416724 423376 430647 438296
53530 438296 446375 455461 466079 478096 491073 504924 519683 534765 549193 562736 576317 591005
53518 591005 606977 623786 641306 659984 680177 701678 724083 747442 772240 798629 825839
53507 825839 852615 878261 903002 927294 951138 974406 997508 1021143 1045298 1068996 1091257
53496 1091257 1112041 1131994 1151546 1170614 1189087 1207274 1225766 1244948 1264557 1283699 1301497
53485 1301497 1318003 1334397 1351963 1370813 1389794 1407598 1423697 1438105 1450663 1460888 1468396
$$ packed form
53575C37586j939n55O55J124P75J16l61o66j050j515j755j519q96l05j04j06L42
53558C29827J514K705K900K030J063Q17J172J557J723J785J973K557L636M759
53544C60018N234N063N054N633O102N640M583M003M344N132N918O652P271P649
53530D38296Q079R086J0618J2017J2977J3851J4759J5082J4428J3543J3581J4688
53518E91005J5972J6809J7520J8678K0193K1501K2405K3359K4798K6389K7210
53507H25839K6776K5646K4741K4292K3844K3268K3102K3635K4155K3698K2261
53496A091257K0784J9953J9552J9068J8473J8187J8492J9182J9609J9142J7798
53485A301497J6506J6394J7566J8850J8981J7804J6099J4408J2558J0225P508
$$ plain form
53474 1468396 1473163 1475394 1475412 1473603 1470125 1464574 1456319 1445401 1432815 1419621 1405986 1391487 1376151
53461 1376151 1360565 1344874 1328245 1309715 1289257 1267569 1245064 1221629 1197405 1173293 1150320
53450 1150320 1128709 1107804 1086837 1065625 1044652 1024732 1006654 990947 977782 967059 958602
53439 958602 952269 947824 944744 942340 940173 938367 937395 937617 939143 942050 946503 952581 960168 969116 979376
53424 979376 990891 1003584 1017510 1032847 1049588 1067502 1086570 1107173 1129509 1153098 1177331
53413 1177331 1202446 1229456 1259074 1291119 1325081 1360792 1398333 1437696 1478900 1522169 1567605
53402 1567605 1614808 1663263 1713139 1765382 1820696 1878503 1937074 1994889 2051879 2109211 2167785
53391 2167785 2227122 2285922 2343433 2399796 2455153 2508991 2560602 2609656 2655979 2699146 2738787
$$ packed form
53474A468396M767K231J8j809l478n551q255j0918j2586j3194j3635j4499j5336
53461A376151j5586j5691j6629j8530k0458k1688k2505k3435k4224k4112k2973
53450A150320k1611k0905k0967k1212k0973j9920j8078j5707j3165j0723q457
53439I58602o333m445l080k404k167j806r72K22J526K907M453O078P587Q948J0260
53424I79376J1515J2693J3926J5337J6741J7914J9068K0603K2336K3589K4233
53413A177331K5115K7010K9618L2045L3962L5711L7541L9363M1204M3269M5436
53402A567605M7203M8455M9876N2243N5314N7807N8571N7815N6990N7332N8574
53391B167785N9337N8800N7511N6363N5357N3838N1611M9054M6323M3167L9641
$$ plain form
53380 2738787 2775018 2808029 2837266 2861484 2879739 2892093 2899320 2902142 2900725 2894561 2882631 2863825
53368 2863825 2837399 2803229 2761877 2714562 2662807 2607829 2550300 2490855 2430555 2370517 2311235
53357 2311235 2252710 2195217 2139497 2086072 2034758 1984985 1936322 1888597 1841798 1796077 1751569
53346 1751569 1708086 1665172 1622642 1580897 1540651 1502585 1467231 1434817 1404952 1376808 1349882
53335 1349882 1324458 1301185 1280487 1262535 1247268 1233961 1221046 1207032 1191709 1176129 1161443
53324 1161443 1148048 1135718 1124020 1112492 1100948 1089931 1080549 1073545 1068643 1065026 1062297 1060736
53312 1060736 1060762 1062473 1065722 1070386 1076367 1083462 1091421 1100203 1110123 1121711 1135458 1151673 1170454
53299 1170454 1191660 1214888 1239625 1265500 1292343 1320041 1348476 1377606 1407365 1437355 1466865
$$ packed form
53380B738787L6231L3011K9237K4218J8255J2354P227K822j417o164j1930j8806
53368B863825k6426l4170m1352m7315n1755n4978n7529n9445o0300o0038n9282
53357B311235n8525n7493n5720n3425n1314m9773m8663m7725m6799m5721m4508
53346A751569m3483m2914m2530m1745m0246l8066l5354l2414k9865k8144k6926
53335A349882k5424k3273k0698j7952j5267j3307j2915j4014j5323j5580j4686
53324A161443j3395j2330j1698j1528j1544j1017r382p004m902l617k729j561
53312A060736K6J711L249M664N981P095P959Q782R920J1588J3747J6215J8781
53299A170454K1206K3228K4737K5875K6843K7698K8435K9130K9759K9990K9510
$$ plain form
53288 1466865 1495427 1523134 1550070 1575555 1598360 1617724 1633770 1646883 1657040 1663968 1667624 1668245
53276 1668245 1666073 1661280 1653962 1643986 1631010 1614992 1596611 1576849 1556128 1534056 1510019 1483821
53264 1483821 1455746 1426323 1396151 1365708 1335155 1304437 1273616 1242903 1212324 1181632 1150754
53253 1150754 1120074 1089992 1060429 1031149 1002431 974892 948607 922902 897231 871823 847088
53242 847088 822799 798402 774026 750630 729032 709166 690459 672678 656205 641712 629680
53231 629680 620035 612041 604671 597190 589327 580960 571933 562265 552173 541690 530565 518811 507009
53218 507009 495649 484385 472479 459925 447607 436258 425767 415760 406372 398034 390756 384060
53206 384060 377551 371160 364815 358280 351452 344539 337696 330725 323461 316320 310044 304818 300027 295093
$$ packed form
53288A466865K8562K7707K6936K5485K2805J9364J6046J3113J0157O928L656O21
53276A668245k172m793p318r976j2976j6018j8381j9762k0721k2072k4037k6198
53264A483821k8075k9423l0172l0443l0553l0718l0821l0713l0579l0692l0878
53253A150754l0680l0082k9563k9280k8718k7539k6285k5705k5671k5408k4735
53242H47088k4289k4397k4376k3396k1598j9866j8707j7781j6473j4493j2032
53231F29680r645p994p370p481p863q367r027r668j0092j0483j1125j1754j1802
53218E07009j1360j1264j1906j2554j2318j1349j0491j0007r388q338p278o696
53206C84060o509o391o345o535o828o913o843o971p264p141o276n226m791m934
$$ plain form
53192 295093 290193 285819 281963 278295 274938 272384 270584 268838 266829 265016 263558 261533 258006 253456
53178 253456 249313 246307 244080 242327 241393 241504 242150 242588 242439 241598 240129 238541 237628 237607 237813 237541 236775
53161 236775 235808 234645 233248 231935 230968 230035 228670 227008 225684 225094 225091 225222 224947 223915 222445 221465 221496
53144 221496 221957 221977 221583 221457 221763 222028 222168 222754 223985 225082 225141 224214 223179 222756 222918 223086 222770 222109
53126 222109 221767 222145 222869 223375 223771 224557 225636 226330 226492 226858 227959 229356 230404 231189 232173 233264 233924
53109 233924 233996 233912 234094 234524 234838 234583 233515 231931 230500 229445 228070 225556 222112 218946 217037 216293
53093 216293 215844 214910 213302 211466 210185 210027 210877 212039 212848 213201 213544 214346 215556 216605 217005 216851 216540
53076 216540 216161 215589 215065 215043 215321 215028 213894 212893 212990 213739 213907 213086 211850 210549 208945 207097 205595
$$ packed form
53192B95093m900m374l856l668l357k554j800j746k009j813j458k025l527m550
53178B53456m143l006k227j753r34J11O46M38j49q41j469j588r13k1K06k72p66
53161B36775r67j163j397j313r67r33j365j662j324n90lJ31k75j032j470r80L1
53144B21496M61K0l94j26L06K65J40N86J231J097N9r27j035m23J62J68l16o61
53126B22109l42L78P24N06L96P86J079O94J62L66J101J397J048P85R84J091O60
53109B33924P2q4J82M30L14k55j068j584j431j055j375k514l444l166j909p44
53093B16293m49r34j608j836j281j58Q50J162Q09L53L43Q02J210J049M00j54l11
53076B16540l79n72n24k2K78k93j134j001R7P49J68q21j236j301j604j848j502
$$ plain form
53059 205595 204642 203729 202641 202024 202388 203160 203409 203127 203131 203910 205137 206213 206789 206801 206428 206006 205621 204885 203501
53040 203501 201955 201161 201346 201731 201460 200466 199210 197965 196756 195785 195432 195684 195898 195401 194306 193511 193780
53023 193780 194932 196087 196619 196635 196494 196207 195565 194692 194044 193889 194084 194491 195277 196576 198036 199038 199364
53006 199364 199375 199497 199770 200082 200644 201835 203490 204680 204494 202993 201189 200078 199904 200361 201180 202278 203492
52989 203492 204474 204943 204910 204553 203967 203087 201851 200414 199239 198932 199878 201909 204308 206229 207227 207504 207633
52972 207633 208027 208690 209528 210728 212609 215078 217527 219468 221069 222810 224704 226213 226932 227048 226987 226887
52956 226887 226668 226431 226471 226813 226903 225893 223294 219513 215800 213439 212729 212764 212408 211384 210210 209246 208275
52939 208275 207108 206053 205450 205071 204419 203421 202426 201611 200847 200090 199446 198793 197734 196127 194348 192927 192152
$$ packed form
53059B05595r53r13j088o17L64P72K49k82MP79J227J076N76J2l73m22l85p36j384
53040B03501j546p94J85L85k71r94j256j245j209r71l53K52K14m97j095p95K69
53023A93780J152J155N32J6j41k87o42q73o48j55J95M07P86J299J460J002L26
53006A99364J1J22K73L12N62J191J655J190j86j501j804j111j74M57Q19J098J214
52989B03492R82M69l3l57n86q80j236j437j175l07R46K031K399J921R98K77J29
52972B07633L94O63Q38J200J881K469K449J941J601J741J894J509P19J16o1j00
52956B26887k19k37M0L42R0j010k599l781l713k361p10L5l56j024j174r64r71
52939B08275j167j055o03l79o52r98r95q15p64p57o44o53j059j607j779j421p75
$$ plain form
52922 192152 192072 192473 192730 192202 191085 190480 191242 193076 195087 196825 198313 199439 200026 200329 200744 201055 200619
52905 200619 199384 198085 197235 196575 195757 195018 194730 194789 194853 194837 194731 194288 193426 192662 192621 193280 194171 195167 196539
52886 196539 198294 200031 201482 202652 203297 202869 201293 199400 198226 198090 198597 199298 200041 200930 202213 204086
52870 204086 206273 207944 208446 208027 207492 207168 206693 205920 205462 205910 206874 207409 207326 207426 208235 209091 208961 207866
52852 207866 206841 206610 206905 207182 207359 207414 206774 204801 201755 198688 196295 194357 192420 190574 189256 188614
52836 188614 188414 188336 188069 187259 185781 184041 182683 182019 181989 182632 184148 186315 188258 189131 188906 188210 187553
52819 187553 186999 186497 186092 185732 185176 184334 183522 183216 183610 184528 185715 187111 188881 191183 193856 196369 198267
52802 198267 199605 200705 201403 200939 198836 195653 192505 190025 188192 187005 186748 187435 188421 188930 188764 188267
$$ packed form
52922A92152q0M01K57n28j117o05P62J834K011J738J488J126N87L03M15L11m36
52905B00619j235j299q50o60q18p39k88N9O4j6j06m43q62p64m1O59Q91R96J372
52886A96539J755J737J451J170O45m28j576j893j174j36N07P01P43Q89J283J873
52870B04086K187J671N02m19n35l24m75p73m58M48R64N35q3J00Q09Q56j30j095
52852B07866j025k31K95K77J77N5o40j973l046l067k393j938j937j846j318o42
52836A88614k00p8k67q10j478j740j358o64l0O43J516K167J943Q73k25o96o57
52819A87553n54n02m05l60n56q42q12l06L94R18J187J396J770K302K673K513J898
52802A98267J338J100O98m64k103l183l148k480j833j187k57O87R86N09j66m97
$$ plain form
52786 188267 187789 187440 187307 187605 188433 189489 190186 190213 189927 190028 190753 191587 191994 192150 192613 193409 193950 193900 193558
52767 193558 193241 192774 191917 190877 189988 189179 188193 187105 186189 185382 184343 183044 181910 181346 181397 181910 182698
52750 182698 183508 184112 184519 184972 185707 186849 188428 190236 191754 192544 192751 192986 193720 194983 196563 198172
52734 198172 199484 200434 201489 203250 205672 208058 209867 211156 212152 212893 213492 214192 214799 214537 212960 210743
52718 210743 209037 208216 207731 207015 205983 204647 202835 200506 197974 195664 193858 192779 192610 193236 194136 194765
52702 194765 194911 194667 194265 194079 194568 195901 197658 199075 199639 199415 198872 198483 198442 198637 198805 198737 198419 198075
52684 198075 198094 198774 200051 201494 202679 203510 204089 204359 204118 203384 202550 202040 201941 202017 202003 201762 201259 200515 199565
52665 199565 198472 197427 196841 197132 198317 199933 201496 202933 204423 205968 207380 208677 210205 212242 214666
$$ packed form
52786A88267m78l49j33K98Q28J056O97K7k86J01P25Q34M07J56M63P96N41n0l42
52767A93558l17m67q57j040q89q09r86j088r16q07j039j299j134n64N1N13P88
52750A82698Q10O04M07M53P35J142J579J808J518P90K07K35P34J263J580J609
52734A98172J312R50J055J761K422K386J809J289R96P41N99P00O07k62j577k217
52718B10743j706q21m85p16j032j336j812k329k532k310j806j079j69O26R00O29
52702A94765J46k44m02j86M89J333J757J417N64k24n43l89m1J95J68o8l18l44
52684A98075J9O80J277J443J185Q31N79K70k41p34q34n10r9P6j4k41n03p44r50
52665A99565j093j045n86K91J185J616J563J437J490J545J412J297J528K037K424
$$ plain form
52650 214666 217123 219355 221193 222375 222643 222063 221042 219938 218781 217450 215976 214497 213037 211585 210422
52635 210422 210121 210984 212605 214159 215122 215534 215599 215254 214305 212861 211509 210958 211565 213116 215030 216796 218262
52618 218262 219480 220278 220155 218792 216625 214688 213728 213581 213556 213363 213436 214260 215593 216572 216520 215441 213705
52601 213705 211619 209559 208223 208214 209268 210348 210783 211000 211815 213280 214701 215680 216540 217600 218540 218868 218661
52584 218661 218455 218556 218844 219151 219460 219749 219993 220389 221286 222694 224099 224959 225257 225397 225686 226039 226178 225933
52566 225933 225341 224508 223506 222421 221469 220862 220557 220268 219852 219529 219507 219548 219230 218557 217955 217628 217313 216799 216319
52547 216319 216169 216254 216294 216281 216401 216668 216911 217034 217034 216841 216416 215921 215566 215361 215250 215367 215848 216448 216710 216465
52527 216465 215892 215087 214003 212888 212388 212924 214183 215463 216419 217298 218534 220162 221650 222351 222288 222346 223384
$$ packed form
52650B14666K457K232J838J182K68n80j021j104j157j331j474j479j460j452j163
52635B10422l01Q63J621J554R63M12O5l45r49j444j352n51O07J551J914J766J466
52618B18262J218P98j23j363k167j937r60j47k5j93P3Q24J333R79n2j079j736
52601B13705k086k060j336rJ054J080M35K17Q15J465J421R79Q60J060R40L28k07
52584B18661k06J01K88L07L09K89K44L96Q97J408J405Q60K98J40K89L53J39k45
52566B25933n92q33j002j085r52o07l05k89m16l23k2M1l18o73o02l27l15n14m80
52547B16319j50Q5M0j3J20K67K43J23%j93m25m95l55k05j11J17M81O00K62k45
52527B16465n73q05j084j115n00N36J259J280R56Q79J236J628J488P01o3N8J038
$$ plain form
52510 223384 225202 226833 227901 229155 231422 234505 237566 240228 242719 245081 246803 247321 246493 244524 241812
52495 241812 238964 236569 234736 233050 231194 229464 228498 228603 229449 230296 230410 229420 227534 225453 224002 223727
52479 223727 224688 226438 228229 229459 230142 230841 232035 233615 235082 236059 236434 236188 235471 234861 235140 236527
52463 236527 238379 239950 241336 243293 246141 249208 251527 252747 253145 252989 252290 251115 249732 248293 246585
52448 246585 244277 241413 238576 236543 235666 235492 235096 233951 232388 231032 229954 228747 227346 226282 226011
52433 226011 226358 226860 227263 227402 227012 226054 225062 224682 225012 225770 226949 228803 231201 233495 235122 235957 236003
52416 236003 235296 234346 234190 235519 237989 240789 243713 247273 251901 257505 263881 271154 279561 288930 298496
52401 298496 307057 313313 316331 315974 312894 307998 301959 295245 288411 282071 276528 271631 267119 263081
$$ packed form
52510B23384J818J631J068J254K267L083L061K662K491K362J722N18q28j969k712
52495B41812k848k395j833j686j856j730r66J05Q46Q47J14r90j886k081j451k75
52479B23727R61J750J791J230O83O99J194J580J467R77L75k46p17o10K79J387
52463B36527J852J571J386J957K848L067K319J220L98j56o99j175j383j439j708
52448B46585k308k864k837k033q77j74l96j145j563j356j078j207j401j064k71
52433B26011L47N02M03J39l90r58r92l80L30P58J179J854K398K294J627Q35M6
52416B36003p07r50j56J329K470K800K924L560M628N604O376P273Q407R369R566
52401B98496Q561O256L018l57l080m896o039o714o834o340n543m897m512m038
$$ plain form
52387 263081 259944 258033 257178 256803 256402 255931 255762 256269 257446 258957 260485 261981 263562 265260 266956 268578
52371 268578 270306 272523 275548 279420 283938 288849 293921 298777 302884 305942 308287 310590 312973 314657
52357 314657 314761 313354 311461 310086 309544 309651 310162 310901 311849 313287 315550 318421 321108 323163 325130 327863
52341 327863 331371 334875 338030 341501 346167 352162 359075 366782 375593 385585 396229 406915 417736
52328 417736 429482 442814 457572 473019 488775 505276 523248 542823 563342 583988 604386
52317 604386 624571 644537 664010 682652 700285 716788 731875 745259 757124 768201 779072
52306 779072 789567 799165 807840 815987 823499 829619 834036 837462 840573 842881 843458 842504 841255 840293 838789
52291 838789 835671 830852 824983 818634 812177 805978 800113 794178 787915 781869 777097 774357 773847 775456
$$ packed form
52387B63081l137j911q55l75m01m71j69N07J177J511J528J496J581J698J696J622
52371B68578J728K217L025L872M518M911N072M856M107L058K345K303K383J684
52357C14657J04j407j893j375n42J07N11P39R48J438K263K871K687K055J967K733
52341C27863L508L504L155L471M666N995O913P707Q811R992J0644J0686J0821
52328D17736J1746J3332J4758J5447J5756J6501J7972J9575K0519K0646K0398
52317F04386K0185J9966J9473J8642J7633J6503J5087J3384J1865J1077J0871
52306G79072J0495R598Q675Q147P512O120M417L426L111K308N77r54j249r62j504
52291H38789l118m819n869o349o457o199n865n935o263o046m772k740n10J609
$$ plain form
52277 775456 778854 783486 788987 795565 803713 813550 824707 836757 849494 862840 876781 891332 906267
52264 906267 920927 934478 946377 956491 965038 972650 980166 987904 995196 1001113 1005517 1008960 1011716
52251 1011716 1013534 1014438 1015032 1015683 1015875 1014776 1012108 1008101 1002855 996124 987672 977622 966542 955349
52237 955349 944882 935355 926331 917421 908786 900814 893599 887021 881128 876032 871590 867581 864181 861916
52223 861916 861020 861118 861626 862281 863202 864547 866255 868110 870063 872463 875806 880199 885190 890225 895093 899829
52207 899829 904494 909316 914784 921134 927785 933691 938329 942026 945363 948587 951705 954743 957656 960237
52193 960237 962284 963758 964746 965518 966644 968653 971387 973972 975652 976376 976390 975637 973931 971403 968339 964776
52177 964776 960722 956609 952945 949566 945786 941368 936811 932506 928174 923463 918661 914347 910617 907168
$$ packed form
52277G75456L398M632N501O578Q148R837J1157J2050J2737J3346J3941J4551J4935
52264I06267J4660J3551J1899J0114Q547P612P516P738P292N917M404L443K756
52251A011716J818R04N94O51J92j099k668m007n246o731q452j0050j1080j1193
52237I55349j0467r527r024q910q635p972p215o578n893n096m442m009l400k265
52223H61916q96R8N08O55R21J345J708J855J953K400L343M393M991N035M868M736
52207H99829M665M822N468O350O651N906M638L697L337L224L118L038K913K581
52193I60237K047J474R88P72J126K009K734K585J680P24J4p53j706k528l064l563
52177I64776m054m113l664l379l780m418m557m305m332m711m802m314l730l449
$$ plain form
52163 907168 903980 901480 900007 899497 899758 900723 902317 904306 906473 908807 911381 914026 916243 917538 917929
52148 917929 918113 918913 920412 921788 922166 921555 920810 920802 921871 924033 927321 931759 937115 942762 947850 951865
52132 951865 955285 959558 966077 975100 985933 998057 1011645 1027032 1044295 1063614 1085494 1110041
52120 1110041 1136348 1163142 1189942 1217117 1244915 1272899 1300355 1326688 1351297 1373435 1392546
52109 1392546 1408493 1421257 1430620 1436416 1439010 1439237 1437738 1434396 1428524 1419790 1408989 1397695 1386959
52096 1386959 1376579 1365990 1355619 1346749 1339908 1333973 1327258 1319190 1310535 1302220 1294411 1286621 1278364
52083 1278364 1269600 1260821 1252813 1246241 1241447 1238687 1238392 1240943 1246256 1253751 1262743 1272757 1283536 1295013
52069 1295013 1307242 1320217 1333698 1347288 1360634 1373510 1385834 1397664 1408967 1419253 1427673
$$ packed form
52163I07168l188k500j473n10K61R65J594J989K167K334K574K645K217J295L91
52148I17929J84Q00J499J376L78o11p45qJ069K162L288M438N356N647N088M015
52132I51865L420M273O519R023J0833J2124J3588J5387J7263J9319K1880K4547
52120A110041K6307K6794K6800K7175K7798K7984K7456K6333K4609K2138J9111
52109A392546J5947J2764R363N796K594K27j499l342n872q734j0801j1294j0736
52096A386959j0380j0589j0371q870o841n935o715q068q655q315p809p790q257
52083A278364q764q779q008o572m794k760k95K551N313P495Q992J0014J0779J1477
52069A295013J2229J2975J3481J3590J3346J2876J2324J1830J1303J0286Q420
$$ plain form
52058 1427673 1433710 1437507 1439196 1438246 1434063 1427126 1418907 1410562 1402162 1393284 1383734 1373398 1361947 1349113
$$ packed form
52058A427673O037L797J689r50m183o937q219q345q400q878r550j0336j1451j2834
$$ [...]
##END NTUPLES=NMR SPECTRUM
##END=
