
##TITLE=UV1203_M3_1292-1211_7185511_viriHghTa3
##JCAMPDX= 6.0         $$ Bruker NMR JCAMP-DX V2.0
##DATA TYPE= NMR SPECTRUM
##DATA CLASS= NTUPLES
##ORIGIN= BRUKER
##OWNER= Administrator
$$ 1.72 TOPSPIN		Version 2.1
$$ 2012-12-06 04:14:01.698 -0500  Administrator@X
$$ Compression mode = diff/dup
##.OBSERVE FREQUENCY= 400.02188249412
##.OBSERVE NUCLEUS= ^1H
##.ACQUISITION MODE= SIMULTANEOUS (DQD)
##.ACQUISITION SCHEME= undefined
##.AVERAGES= 8
##.DIGITISER RES= 22
##SPECTROMETER/DATA SYSTEM= spect
##.PULSE SEQUENCE= zg30
##.SOLVENT NAME= COFFEE_meoh
##.SHIFT REFERENCE= INTERNAL, COFFEE_meoh, 1, 14.98509
##AUDIT TRAIL= $$ (NUMBER, WHEN, WHO, WHERE, PROCESS, VERSION, WHAT)
$$ ##TITLE= Audit trail, TOPSPIN		Version 2.1
$$ ##JCAMPDX= 5.01
$$ ##ORIGIN= Bruker BioSpin GmbH
$$ ##OWNER= Administrator
$$ $$ E:\/data/COFFEE/nmr/UV1203_M3_1292-1211_7185511_viriHghTa3/10/pdata/1/auditp.txt
$$ ##AUDIT TRAIL=  $$ (NUMBER, WHEN, WHO, WHERE, PROCESS, VERSION, WHAT)
(   1,<2012-12-06 04:13:53.479 -0500>,<Administrator>,<X>,<go>,<TOPSPIN 2.1>,
      <created by zg
	started at 2012-12-06 04:12:47.151 -0500,
	POWCHK enabled, PULCHK disabled,
       configuration hash MD5:
       86 BA 57 50 F2 9D 5C 9B 26 00 A9 28 5F 66 2E 89
       data hash MD5: 64K
       9C 17 2F 59 2A 47 CC BA 69 D2 4A 08 51 F5 6C 2D>)
(   2,<2012-12-06 04:13:56.588 -0500>,<Administrator>,<X>,<proc1d>,<TOPSPIN 2.1>,
      <Start of raw data processing
       efp LB = 0 FT_mod = 6 PKNL = 1 PHC0 = 0 PHC1 = 0 SI = 32K 
       data hash MD5: 32K
       87 54 FB 27 01 E8 B2 A8 57 72 6F 1F 9A 53 17 CD>)
(   3,<2012-12-06 04:13:57.057 -0500>,<Administrator>,<X>,<proc1d>,<TOPSPIN 2.1>,
      <pk PHC0 = 98.93188 PHC1 = 0 
       data hash MD5: 32K
       9C 79 3A F2 98 98 0B 7F 42 37 E2 7B 1A 0E 43 A6>)
(   4,<2012-12-06 04:13:57.276 -0500>,<Administrator>,<X>,<proc1d>,<TOPSPIN 2.1>,
      <abs ABSG = 1 
       data hash MD5: 32K
       D5 CA F8 A9 F2 75 68 5F 3E 14 92 44 C5 9D 03 13>)
(   5,<2012-12-06 04:13:57.432 -0500>,<Administrator>,<X>,<proc1d>,<TOPSPIN 2.1>,
      <abs ABSG = 2 
       data hash MD5: 32K
       53 B8 4A 4F DE 42 93 CE 37 99 EB C1 BE 56 21 CC>)
(   6,<2012-12-06 04:13:57.573 -0500>,<Administrator>,<X>,<proc1d>,<TOPSPIN 2.1>,
      <abs ABSG = 3 
       data hash MD5: 32K
       83 01 AB 15 2C 6E F0 A7 D5 34 A1 4E 31 63 B2 82>)
(   7,<2012-12-06 04:13:57.713 -0500>,<Administrator>,<X>,<proc1d>,<TOPSPIN 2.1>,
      <abs ABSG = 4 
       data hash MD5: 32K
       DE 51 5B B2 4D FA 5A FA B1 82 0C D0 60 AA AF A1>)
(   8,<2012-12-06 04:13:57.869 -0500>,<Administrator>,<X>,<proc1d>,<TOPSPIN 2.1>,
      <abs ABSG = 5 
       data hash MD5: 32K
       83 D2 36 A6 37 D8 78 68 A9 2A 4B CE A5 CF E7 97>)
$$ ##END=
$$ 
$$ $$ hash MD5
$$ $$ A5 B7 6C 58 04 69 AB 37 72 7C 35 DA E1 52 85 01
##$RELAX= 
##$RELAX= 
##$RELAX= 
##$RELAX= 
##$RELAX= 
##$RELAX= 
##$RELAX= 
$$ Bruker specific parameters
$$ --------------------------
##$DU= <E:\>
##$EXPNO= 10
$$ [...]
150 150 150 150 150 150 150 150
##$TP07= 0
##$TPNAME0= <>
##$TPNAME1= <>
##$TPNAME2= <>
##$TPNAME3= <>
##$TPNAME4= <>
##$TPNAME5= <>
##$TPNAME6= <>
##$TPNAME7= <>
##$TPOAL= (0..7)
0.5 0.5 0.5 0.5 0.5 0.5 0.5 0.5
##$TPOFFS= (0..7)
0 0 0 0 0 0 0 0
##$TUNHIN= 0
##$TUNHOUT= 0
##$TUNXOUT= 0
##$USERA1= <user>
##$USERA2= <user>
##$USERA3= <user>
##$USERA4= <user>
##$USERA5= <user>
##$V9= 5
##$VALIST= <valist>
##$VCLIST= <CCCCCCCCCCCCCCC>
##$VD= 0
##$VDLIST= <DDDDDDDDDDDDDDD>
##$VPLIST= <PPPPPPPPPPPPPPP>
##$VTLIST= <TTTTTTTTTTTTTTT>
##$WBST= 1024
##$WBSW= 4
##$XGAIN= (0..3)
0 0 0 0
##$XL= 0
##$YL= 0
##$YMAX_a= 679709
##$YMIN_a= -580244
##$ZGOPTNS= <>
##$ZL1= 120
##$ZL2= 120
##$ZL3= 120
##$ZL4= 120
##$ABSF1= 14.98509
##$ABSF2= -5.573092
##$ABSG= 5
##$ABSL= 3
##$ALPHA= 0
##$AQORDER= 0
##$ASSFAC= 0
##$ASSFACI= 0
##$ASSFACX= 0
##$ASSWID= 0
##$AUNMP= <proc_prof1d_extract_pilot.lims>
##$AXLEFT= 0
##$AXNAME= <>
##$AXNUC= <1H>
##$AXRIGHT= 0
##$AXTYPE= 0
##$AXUNIT= <>
##$AZFE= 0.1
##$AZFW= 0.1
##$BCFW= 0
##$BC_mod= 0
##$BYTORDP= 0
##$COROFFS= 0
##$CY= 15
##$DATMOD= 1
##$DC= 0
##$DFILT= <>
##$DTYPP= 0
##$F1P= 0
##$F2P= 0
##$FCOR= 0.5
##$FTSIZE= 32768
##$FT_mod= 6
##$GAMMA= 0
##$GB= 0
##$INTBC= 1
##$INTSCL= 1
##$ISEN= 128
##$LB= 0
##$LEV0= 0
##$LPBIN= 0
##$MAXI= 10000
##$MC2= 0
##$MEAN= 0
##$ME_mod= 0
##$MI= 0
##$NCOEF= 0
##$NC_proc= -8
##$NLEV= 6
##$NOISF1= 0
##$NOISF2= 0
##$NSP= 0
##$NTH_PI= 0
##$NZP= 0
##$OFFSET= 14.98509
##$PC= 1
##$PHC0= 98.93188
##$PHC1= 0
##$PH_mod= 1
##$PKNL= yes
##$PPARMOD= 0
##$PPDIAG= 0
##$PPIPTYP= 0
##$PPMPNUM= 2147483647
##$PPRESOL= 1
##$PSCAL= 4
##$PSIGN= 0
##$PYNMP= <proc.py>
##$REVERSE= no
##$SF= 400.02
##$SI= 32768
##$SIGF1= 0
##$SIGF2= 0
##$SINO= 400
##$SIOLD= 32768
##$SPECTYP= <>
##$SREGLST= <1H.CDCl3>
##$SSB= 0
##$STSI= 32768
##$STSR= 0
##$SW_p= 8223.68421052631
##$SYMM= 0
##$S_DEV= 0
##$TDeff= 65536
##$TDoff= 0
##$TI= <>
##$TILT= no
##$TM1= 0
##$TM2= 0
##$TOPLEV= 0
##$USERP1= <user>
##$USERP2= <user>
##$USERP3= <user>
##$USERP4= <user>
##$USERP5= <user>
##$WDW= 1
##$XDIM= 32768
##$YMAX_p= 473411896
##$YMIN_p= -1193970
##$CURPLOT= <Network HP LaserJet P1505>
##$CURPRIN= <$Network HP LaserJet P1505>
##$DFORMAT= <normdp>
##$LAYOUT= <+/1D_H.xwp>
##$LFORMAT= <normlp>
##$PFORMAT= <normpl>
##$SURQMSG= 1
$$ End of Bruker specific parameters
$$ ---------------------------------
##NTUPLES= NMR SPECTRUM
##VAR_NAME=  FREQUENCY,     SPECTRUM/REAL,   SPECTRUM/IMAG
##SYMBOL=    X,             R,               I
##VAR_TYPE=  INDEPENDENT,   DEPENDENT,       DEPENDENT
##VAR_FORM=  AFFN,          ASDF,            ASDF
##VAR_DIM=   32768,         32768,           32768
##UNITS=     HZ,            ARBITRARY UNITS, ARBITRARY UNITS
##FACTOR=    0.250966925370066, 1,           1
##FIRST=     8223.43324360094, 18061,        -187042
##LAST=      0,             -337602,         -264841
##MIN=       0,             -1193970,        0
##MAX=       8223.43324360094, 473411896,    0
$$ Real data points
##PAGE= N=1
##DATA TABLE= (X++(R..R)), XYDATA
$$ [...]
$$ plain form
19534 -329025 73156 64075 -397966 -63752 14522 320448 85984 -27502 -370588 -151983 -233344
19523 -233344 -135335 -25056 192492 77650 -136840 202329 49417 -1431 200267 156889 204665
19512 204665 -35815 68474 -67808 -18941 44475 9693 -179565 -60678 158384 -311420 -308422
19501 -308422 -231713 284974 -138504 11337 137513 251850 82770 -111489 72254 -47587
19490 -293065 4574 -46790 106974 -37030 -359133 -38856 -41342 -37208 -105596 141565 37112
19478 -88900 -122026 -152287 -260510 -187318 -165642 -174470 -268349 -303395 -179888 192102 -111096
19466 -37453 -416608 -17432 -341722 -89541 -33075 -49595 -180843 -215760 -313793 -465732 -387279
19455 -387279 -229457 -4978 254143 -136999 -105592 -301912 7310 170638 208562 -193119 -149685
$$ packed form
19534c29025G3156r081c97966f3752A4522L05926H5984b7502l43086a51983q1361
19523b33344R8009b5056A92492G7650a36840B02329D9417a431B00267m3378M7776
19512B04665c5815F8474f7808a8941D4475I693a79565f0678A58384c11420K998
19501c08422P6709B84974a38504A1337J26176J14337H2770a11489G2254d7587
19490b93065D574d6790A06974c7030l22103c8856k486M134o8388A41565C7112
19478h8900l3126l0261j08223P3192K1676q828r3879l5046J23507A92102a11096
19466c7453l79155a7432l24290h9541c3075j6520j31248l4917r8033j51939P8453
19455c87279J57822d978B54143a36999L1407j96320G310J63328L7924a93119M3434
$$ plain form
19444 -149685 7638 -344214 -276738 -117217 -253247 -187045 21061 300284 4393 -230183 -36716
19432 -150623 -32544 -72978 153347 31736 132940 -178376 9585 -194558 -521810 -310789
19422 -310789 70736 74261 -383215 266709 73256 -130688 -112802 161591 -145594 -384102
19412 -384102 -290167 18510 246775 -121978 105502 186490 -199510 -268378 -158286 -78823
19401 324865 -121380 209588 87631 -24318 330035 197023 -239748 -175418 -51912 367758
19390 -97143 20152 52568 -178911 77367 105399 10486 -250273 136118 15280 -197972 -287357
19379 -287357 -17270 383729 -459366 234696 30947 -211924 4546 -125915 98612 56763 -6177
19367 43383 -324040 -100437 -322192 111027 -53826 23179 -155748 -86262 232860 -209750
$$ packed form
19444a49685G638c44214O7476a17217j36030O6202B1061K79223D393b30183c6716
19432a50623c2544m0434A53347C1736J01204a78376I585a94558l27252K11021
19422c10789G0736L525c83215B66709G3256a30688J7886A61591a45594k38508
19412c84102R3935A8510K28265a21978A05502Q0988a99510o8868J10092g8823
19401C24865a21380B09588H7631b4318C30035j33012b39748O4330e1912C67758
19390i7143B0152L2416a78911G7367K8032A0486b50273A36118A5280a97972q9385
19379b87357a7270C83729d59366B34696C0947b11924D546a25915I8612m1849f177
19367D3383c24040a00437k21755A11027e3826B3179a55748O9486B32860b09750
$$ plain form
19356 -245203 97504 -382688 -322871 23164 -181326 -240106 44611 57407 -220615 -316756 37410
19344 -216006 -66444 34375 -449453 92079 -76837 81027 210446 -343046 2541 297945 38545
19332 96664 -132380 -36499 -43897 142830 978 114199 9278 -69352 192565 13103 170250
19321 170250 13399 172604 264889 114395 330961 -152727 -239641 -71722 237057 163583
19311 163583 -358554 -101474 108637 -87248 3750 -202679 -151282 -400094 -37740 -212520
19301 -212520 -334282 296508 56023 208205 90706 -120849 -200250 11293 47807 64438 37003
19290 37003 244803 -34703 -286808 -7833 -354644 69032 -272433 -148582 37356 -127581 -138816
19279 -138816 84311 -103279 10284 -342300 5390 64817 197156 -250322 -52808 178627 159201
$$ packed form
19356b45203I7504c82688N9817B3164a81326n8780D4611J2796b20615r6141C7410
19344b16006f6444C4375d49453I2079g6837H1027J29419c43046B541K95404C8545
19332I6664a32380c6499p398A42830I78J13221I278f9352A92565A3103J57147
19321A70250A3399J59205R2285A14395K16566a52727q6914g1722B37057p3474
19311A63583c58554a01474A08637h7248C750b02679N1397k48812c7740j74780
19301b12520j21762B96508E6023J52182I0706a20849p9401A1293L6514J6631k7435
19290C7003K07800c4703k52105g833l46811F9032b72433J23851C7356a27581j1235
19279a38816H4311a03279A0284c42300E390N9427J32339b50322e2808A78627j9426
$$ plain form
19268 159201 -19770 -17313 -114835 -197159 -307352 -202754 14854 -211188 -14649 -385215 -178264
19256 -335897 136548 -101351 173703 -82032 -79470 -23830 280441 -140078 80465 -26126 190871
19244 -210322 103637 57231 -137990 12972 255762 24555 24091 -7179 229927 -154227 112246
19232 28294 203371 242345 -416516 320101 200030 -94378 44465 139872 -105704 -155043 -168570
19221 -168570 105138 -136860 40372 212478 -58799 -291222 75565 -85971 -363709 -25917
19210 -129432 -132849 -172267 22133 -78992 -117773 48505 -131507 10254 56179 -6373 150212
19198 -220707 -47263 -84988 -233588 -164735 361716 140356 -100073 -37758 -4331 -34413 -204420
19187 -204420 285231 -308365 145897 109177 -202867 -209713 -64308 167628 -214299 -207705 42435
$$ packed form
19268A59201a9770K457r7522q2324j10193J04598A4854b11188a4649l70566a78264
19256c35897A36548a01351A73703h2032K562b3830B80441a40078H0465b6126A90871
19244b10322A03637m6406a37990A2972K42790B4555m64g179B29927a54227A12246
19232B8294J75077L8974d16516C20101j20071i4378D4465R5407a05704m9339j3527
19221a68570A05138a36860D0372J72106e8799k32423G5565h5971k77738b5917
19210a29432l417l9418B2133g8992l8781D8505a31507A0254M5925f373A50212
19198b20707d7263l7725j48600O8853C61716A40356a00073c7758d331l0082j70007
19187b04420B85231c08365A45897l6720b02867o846f4308A67628b14299O594D2435
$$ plain form
19175 -88056 134833 74372 -157260 -32756 235463 -216171 -87708 28688 -296900 336820
19164 -198481 72206 3633 -234171 -159540 -35504 -153302 -132216 63164 37006 -63152 -327546
19153 -327546 -409192 -187069 162612 54794 15374 -340063 -19213 92298 256038 45128 -133902
19141 56758 -142379 98772 82779 -238249 -140966 177455 104040 -81284 132858 -231357 128257
19129 82707 -253206 -203556 -102355 -12329 -470156 -105159 107729 50389 -56060 285363
19118 -203829 -111685 -67330 28166 46324 -100660 -107194 73536 -97777 16885 118912 -135414
19106 122284 -59860 -191734 -10169 -242255 -146341 133115 -179942 64948 -211304 -95878
19095 -148799 -94518 -365224 -166873 -162769 -444277 260839 136280 433805 186416 55642
$$ packed form
19175h8056A34833o0461a57260c2756B35463b16171h7708B8688b96900C36820
19164a98481G2206C633b34171P4631c5504j17798K1086F3164k6158f3152k64394
19153c27546q1646a87069A62612E4794A5374c40063a9213I2298J63740D5128a33902
19141E6758a42379I8772j5993b38249R7283A77455p3415h1284A32858b31357A28257
19129H2707b53206M9650J01201a2329m57827a05159A07729E0389e6060B85363
19118b03829R2144M4355B8166J8158a00660o534G3536i7777A6885J02027a35414
19106A22284e9860j31874a0169k32086R5914A33115a79942F4948b11304i5878
19095a48799N4281k70706a66873M104k81508B60839j24559K97525A86416E5642
$$ plain form
19084 -247604 -122689 -15991 -375717 -236924 -67919 168839 32963 -7257 -113109 -170724 -36532
19072 -212119 -369675 -306633 135943 -9900 -318401 272879 51512 20094 -104721 -51882 -131546
19061 -131546 -581063 -25037 127001 -34592 -134607 80099 -203767 -214746 -440162 6185 -140518
19049 -125310 -335981 98074 -203227 4526 -15083 134717 -58632 -23678 -283277 1273 11083
19038 11083 141360 -108762 -252966 -193268 -26503 129060 -146633 -34058 49602 182075
19028 182075 192912 45623 -168239 -29042 2918 66953 122976 -263538 16872 -214710 350170
19016 152151 -126448 406053 -18542 157611 -190309 -302433 -311017 -190599 110931 44385
19005 -402168 411459 -320791 -44814 -18769 -61647 2879 -106724 194839 -271902 -208051 121064
$$ packed form
19084b47604a22689a5991l59726J38793f7919A68839C2963g257j05852n7615c6532
19072b12119j57556O3042A35943i900l08501B72879E1512B0094a04721e1882p9664
19061a31546m49517b5037A27001c4592j00015H0099b03767j0979k25416F185a40518
19049a25310k10671I8074b03227D526a5083A34717e8632b3678k59599A273R810
19038A1083J30277a08762j44204N9698b6503A29060a46633c4058D9602J32473
19028A82075J0837D5623a68239b9042B918O4035N6023b63538A6872b14710C50170
19016A52151a26448D06053a8542A57611a90309j12124q584J20418A10931D4385
19005d02168D11459c20791d4814a8769m2878B879a06724A94839b71902O3851A21064
$$ plain form
18993 383729 -195014 146978 -305181 -113481 93678 -174376 -65530 273469 63103 -419596
18982 -55998 -99172 -118382 -53342 -60375 -141372 -158097 -140204 -116891 -136748 -60121 124116 85284
18970 85284 90310 47405 -14657 420942 -190491 203776 10758 -83431 -366785 -247399 -204841
18959 -204841 83995 -106336 -5796 255126 170284 21494 -113256 -29212 -85748 108816 -112399
18947 -280758 -86888 -18113 -192997 363500 164018 -424786 -207696 114774 -52393 -121086
18937 -121086 -285291 -122662 69370 -68528 161209 -149524 -328554 -74858 -250495 -18602
18926 -238973 189453 -344646 -316945 -104194 -89161 75278 35908 -38881 226305 -39773 -170653
18915 -170653 -86695 -93202 41133 -206808 89501 259360 8443 -149583 158208 136768 -36977
$$ packed form
18993C83729a95014A46978c05181a13481I3678a74376f5530B73469F3103d19596
18982e5998m3174j9210e3342p033q0997j6725J7893K3313j9857f0121A24116l8832
18970H5284N026m2905a4657D20942a90491B03776A0758h3431k83354J19386M2558
18959b04841H3995a06336e796B55126q4842B1494a13256b9212n6536A08816a12399
18947b80758h6888a8113j74884C63500A64018d24786b07696A14774e2393o8693
18937a21086j64205a22662F9370f8528A61209a49524j79030g4858j75637a8602
18926b38973A89453c44646K7701a04194J5033G5278C5908c8881B26305c9773j30880
18915a70653Q3958o507D1133b06808H9501J69859H443a49583A58208k1440c6977
$$ plain form
18903 -156014 204797 240652 -216059 118039 90952 14994 -215190 -169550 -52077 205685
18892 -80880 56304 -118617 82337 -139662 -257504 43355 -196829 -51932 -79073 -228552 -158891
18881 -158891 259542 -44656 85368 17328 -218601 -497154 -18084 -7243 -1668 -244485 120286
18869 -22694 193572 -166544 2485 192525 -86305 -196965 -158050 -6020 -142870 203305 -189755
18857 123603 -163289 85495 -183739 -132375 -142502 84905 -181130 173025 -96704 333523
18846 -57709 -350918 -153837 93656 200838 -273758 108404 -74817 -231428 -240901 21679 245595
18835 245595 31006 -146872 -164360 -55414 -282814 -56453 89265 -155164 -92147 -101152 141125
18823 -53349 178072 -88435 52757 24526 168455 -132482 228281 9700 -58993 124967 -211010
$$ packed form
18903a56014B04797L5855b16059A18039k7087A4994b15190M5640e2077B05685
18892h0880E6304a18617H2337a39662j17842D3355a96829e1932k7141j49479O9661
18881a58891B59542d4656H5368A7328b18601k78553a8084g243a668k42817A20286
18869b2694A93572a66544B485J90040h6305j10660L8915f020j36850B03305a89755
18857A23603a63289H5495a83739N1364j0127H4905a81130A73025i6704C33523
18846e7709k93209a53837I3656J07182b73758A08404g4817j56611r473B1679K23916
18835B45595C1006a46872j7488e5414k27400e6453H9265a55164O3017r005A41125
18823e3349A78072h8435E2757B4526J43929a32482B28281I700e8993A24967b11010
$$ plain form
18811 -229180 168755 280116 42702 89490 -16820 64448 124663 310108 328721 153861 5746
18799 -49954 41379 -55328 -4937 -33339 98832 -36192 31163 81133 -25680 21192 -238517 -31294
18786 15377 45352 61453 -435328 62675 -171089 130187 -197629 208850 48991 -299942
18775 -33760 172627 -190950 -333586 -200824 -25513 -185535 -86439 -141437 -181479 112538
18764 194061 30390 -474765 -203606 23058 186717 125397 -110268 26105 108912 -149259
18753 184812 -59247 200182 -249493 -7947 -260629 -153238 241790 -59668 -146411 -228264 -95637
18741 -103486 159342 -233065 -496217 290774 140068 -317268 -144588 -35729 15081 -264924
18730 -323352 -42619 -36962 94409 -82919 -115237 242950 -38338 -91659 16330 153223 -29353
$$ packed form
18811b29180A68755J11361D2702M6788a6820F4448O0215J85445J8613A53861E746
18799d9954D1379e5328d937k8402I8832c6192C1163M9970b5680B1192b38517c1294
18786A5377K9975J6101d35328F2675a71089A30187a97629B08850D8991b99942
18775c3760A72627a90950j42636J32762b5513j60022h6439n4998m0042A12538
18764A94061C0390d74765b03606B3058J63659o1320a10268B6105Q2807a49259
18753A84812e9247B00182b49493g947k52682J07391B41790e9668q6743q1853i5637
18741a03486A59342b33065k63152B90774A40068c17268a44588c5729A5081b64924
18730c23352d2619N657I4409h2919l2318B42950c8338n3321A6330J36893b9353
$$ plain form
18718 -161692 -144212 -98802 146048 24792 -278931 319124 79501 -22396 108322 -293239
18707 -136135 61524 -39863 23521 241485 -12731 -74672 -47349 84632 241298 283999 -121500
18695 -296155 18364 -11776 194063 -45914 -269840 108179 -130131 -231009 338522 78836
18684 38261 -151771 -98152 132240 -315874 135863 -361538 -87550 -106059 242449 80612
18673 124911 -202487 -187578 94950 188851 104483 -76845 -50803 -108649 77235 -108921 420107
18661 54564 -233147 -31154 -242002 -256094 -231965 69003 48281 129278 -532575 287114 58355
18649 31085 -225131 -144115 -339611 116354 -190410 -64073 176200 -110305 62512 82954
18639 82954 19056 -343449 -236354 -239658 23299 -198981 22967 29995 -35695 36358 324928
$$ packed form
18718a61692J7480M5410A46048B4792b78931C19124G9501b2396A08322b93239
18707a36135F1524c9863B3521K17964a2731o1941K7323H4632J56666M2701a21500
18695b96155A8364a1776A94063d5914k23926A08179a30131j00878C38522G8836
18684C8261a51771N3619A32240c15874A35863c61538h7550j8509B42449H0612
18673A24911b02487J4909I4950R3901q4368g6845K6042n7846G7235a08921D20107
18661E4564b33147c1154k10848j4092K4129F9003k0722Q0997e32575B87114E8355
18649C1085b25131Q1016j95496A16354a90410f4073A76200a10305F2512K0442
18639H2954A9056c43449J07095l304B3299a98981B2967P028c5695C6358K88570
$$ plain form
18628 324928 -292824 -324871 -384480 -76985 -34902 -238101 24749 -110997 -119294 -181457 -47443
18616 -378981 144862 -136898 -74867 69960 -263918 57532 -46946 341787 -4578 -384342 -63322
18604 -238038 -368933 -224605 318376 -20850 -192218 -215104 -358027 -63374 -55071 -130614 221842
18592 -130142 -18700 -216917 378419 -135477 -251834 -85956 71479 -321807 -229883 54996
18581 -94716 -18063 -39340 -199432 -70735 -185332 -226854 34317 -172839 249747 -34557 191506
18569 -203984 -39974 129830 11562 44324 -308719 -45239 96960 140772 -204254 103513 -154087
18557 -60972 152834 -56910 -201996 -272369 -477105 -70006 -209009 -142088 -258073 63907 5854
18545 352723 -199387 25485 -131656 -67871 -344069 -166264 -107687 74103 -100331 -78158
$$ packed form
18628C24928b92824l2047n9609g6985c4902k03199B4749a10997q297o2163d7443
18616c78981A44862a36898O2031F9960b63918E7532d6946C41787d578l79764f3322
18604b38038j30895J44328C18376b0850j71368k2886j42923f3374Q303p5543B21842
18592a30142a8700j98217C78419a35477j16357h5956G1479c21807R1924E4996
18581i4716a8063k1277j60092g0735j14597m1522C4317a72839B49747c4557A91506
18569b03984c9974A29830A1562L2762c08719d5239I6960M3812b04254A03513a54087
18557f0972A52834e6910j45086p0373k04736g0006j39003O6921j15985F3907E854
18545C52723a99387B5485a31656O3785k76198a66264N8577G4103a00331K2173
$$ plain form
18535 -78158 -30822 193756 -199153 14212 -40676 42832 -254660 30709 -329921 -155818 -179248
18524 -179248 -182136 -251144 198543 58562 -308364 -98952 -42943 164754 -180047 74345 -2274
18512 202736 -74662 -257504 -60787 -68520 20083 225192 -183493 270272 -256907 -179639 -224690
18501 -224690 -130358 -87893 -149205 107798 102467 35174 132396 -362964 -311155 330115 -105598
18489 104915 128193 -542504 3677 -98626 23554 21534 -198240 -71795 -26575 -172224 131121
18477 25776 -46649 -78315 20133 -135693 1602 17712 -219605 43411 -394724 -8912 -200990
18466 -200990 -240707 -69871 -407685 286044 -86957 -79640 -103964 4405 -273915 214254 -145432
18454 40698 243299 -243885 36961 -265152 53115 37046 122061 -41840 -198836 261636 -331740
$$ packed form
18535g8158c0822A93756a99153A4212d0676D2832b54660C0709c29921a55818k3430
18524a79248k888o9008A98543E8562c08364i8952d2943A64754a80047G4345b274
18512B02736g4662j82842f0787p733B0083K05109a83493B70272b56907P7268m5051
18501b24690R4332M2465o1312A07798n331C5174R7222c62964N1809C30115a05598
18489A04915K3278e42504C677i8626B3554k020a98240g1795b6575j45649A31121
18477B5776d6649l1666B0133a35693A602J6110b19605D3411c94724h912j92078
18466b00990l9717f9871l37814B86044h6957P317k4324D405b73915B14254a45432
18454D0698K02601b43885C6961b65152E3115j6069Q5015d1840j56996B61636c31740
$$ plain form
18442 -155661 148586 39218 -182387 2761 295891 -184691 -349654 1310 -159218 -61363 -61289
18431 -61289 -58591 -314169 -30745 -82296 39249 -294024 -5562 139997 99440 -109463 254943
18419 -371250 -99395 -17490 216919 -205585 -197803 26979 61812 111058 -145497 110057 -298496
18407 74130 1607 -63554 81152 87175 47012 355051 75728 -163281 -45723 2135 204383 -129340
18394 -244764 906 160630 -3770 8535 -312383 302759 -280860 -15240 504052 -84871 -27165
18382 318461 -7564 168669 -63367 309871 -143531 259776 -387841 -329708 59629 223755
18372 223755 86937 -272777 -488319 53516 139599 -496084 -125650 -68797 68542 -38215 -110573
18361 -110573 -40623 -461259 59696 20094 245906 -44195 258398 173519 -302098 25237 -206561
$$ packed form
18442a55661A48586C9218a82387B761K93130a84691j64963A310a59218f1363P4
18431f1289K698k55578c0745n1551C9249b94024e562A39997m0557a09463B54943
18419c71250i9395a7490B16919b05585P782B6979L4833M9246a45497A10057b98496
18407G4130A607f3554H1152O023m0163L08039G5728a63281d5723B135K02248a29340
18394b44764I06J59724c770H535c12383C02759b80860a5240E04052h4871b7165
18382C18461g564A68669f3367C09871a43531B59776c87841N8133E9629J64126
18372B23755H6937b72777k15542E3516Q6083d96084a25650N6853F8542c8215p2358
18361a10573d0623m20636E9696B0094K25812d4195B58398q4879c02098B5237b06561
$$ plain form
18349 -40258 251 184926 -232611 -197244 -33670 20330 192569 -311175 99276 -55725 -38300
18338 -38300 -108686 -137591 -5197 -105185 231072 -70984 -362498 -112609 433502 288281 270626
18327 270626 -123491 63488 -112726 -167295 212539 58735 -53985 -1498 -85714 159837 283612
18316 283612 -182664 -83110 -57870 -143166 -15067 -307005 -85672 -181512 -446346 -317174 6821
18304 -16789 4491 -201784 -432337 208990 152051 -60676 -493821 -79262 16287 221913 -43588
18292 182049 137481 -385824 -271853 -20995 -57679 111057 156899 19208 367842 -436595
18281 -132944 85978 -152305 -351758 69112 -7895 380132 134469 34590 92827 -123101 248468
18269 -83348 3366 -53900 -122230 70514 -23023 -49593 -137029 -16654 -142029 -147664 3684 -346309
$$ packed form
18349d0258B51J84675b32611L5367c3670B0330J72239c11175I9276e5725J7425
18338c8300p0386k8905e197r9988B31072g0984k91514a12609D33502j45221j7655
18327B70626a23491F3488a12726n4569B12539E8735e3985a498q4216A59837J23775
18316B83612a82664h3110K5240q5296a5067k91938h5672r5840k64834J29172F821
18304a6789D491b01784k30553B08990n6939f0676m33145g9262A6287K05626d3588
18292A82049m4568c85824J13971b0995l6684A11057M5842A9208L48634d36595
18281a32944H5978a52305j99453F9112g895C80132A34469C4590N8237a23101B48468
18269h3348C366e3900o8330G0514b3023k6570q7436a6654j25375n635C684c46309
$$ plain form
18256 50388 25399 -378755 55107 -163325 -47305 -189884 -362612 42372 -24930 -3491 -91550
18245 -91550 58943 -81081 121309 225102 -202183 -196840 -342414 -165261 179664 246528 -164757
18233 143773 59393 93107 -118455 40809 148681 -500812 58492 -118018 -88274 -47461 -254078
18222 -254078 114166 -8048 165568 -11886 -74530 -273529 -230439 148914 92448 -14279 138841
18210 72898 -64737 65346 -88241 133016 -106209 -170841 -83177 57385 -264343 -232271 -131904
18199 -131904 -475990 34304 -228820 -134158 -144373 -271480 -2642 -233799 345450 2204 -289812
18187 -145207 -183602 -92911 -152486 211714 -252205 247885 -81018 -162285 27926 -192273 -295966
18176 -295966 32689 -194700 -43722 -88791 99550 8998 -243515 -130865 -311781 -245952 -185258
$$ packed form
18256E0388k4989c78755E5107a63325d7305j42579j72728D2372b4930c491q8059
18245i1550E8943h1081A21309J03793b02183N343j45574a65261A79664O6864a64757
18233A43773E9393L3714a18455D0809J07872e00812E8492a18018K9744M0813k06617
18222b54078A14166h048A65568a1886o2644j98999M3090A48914n6466a4279A38841
18210G2898f4737F5346h8241A33016a06209o4632h3177E7385b64343L2072J00367
18199a31904l44086C4304b28820R4662j0215j27107b642k31157C45450B204b89812
18187a45207l8395R0691n9575B11714b52205B47885h1018q1267B7926a92273j03693
18176b95966C2689a94700d3722m5069I9550H998b43515J12650j80916O5829O0694
$$ plain form
18165 -185258 -113018 173127 -79984 -254503 83550 123348 -51236 -87688 13464 -218530 -107449
18153 -89227 61094 274025 65467 -34055 147605 -191651 -170818 -58492 8944 61432 -144545
18141 231019 55249 131485 94829 -240445 -174250 -41336 120684 -128691 -167739 306864 -134443
18129 -302 -109958 -148725 29259 98127 -396891 -136626 165286 -259311 37895 74541 105174
18118 105174 -84394 -86779 -126757 205344 228148 235395 -108140 205444 37418 44341 170511
18107 170511 -217167 118600 33897 80747 -99130 58831 191139 -124309 129969 -243341
18096 -351518 70094 -301256 -11162 328665 -118523 192510 -9252 233614 -180513 -74696
18085 30970 -117549 -310159 -88555 236651 -137323 131428 27031 21360 14162 -32689 106048
$$ packed form
18165a85258P2240A73127g9984j74519H3550L9798e1236l6452A3464b18530a07449
18153h9227F1094K12931F5467c4055A47605a91651K0833e8492H944N2488a44545
18141B31019E5249P6236l6656b40445O6195d1336A20684a28691l9048C06864a34443
18129c02j09656l8767B9259O8868c96891a36626A65286b59311C7895L6646L0633
18118A05174h4394k385l9978B05344K2804P247a08140B05444C7418O923J26170
18107A70511b17167A18600C3897M6850i9130E8831J32308a24309A29969b43341
18096c51518G0094c01256a1162C28665a18523A92510i252B33614a80513g4696
18085C0970a17549j92610h8555B36651a37323A31428B7031n671p198c2689A06048
$$ plain form
18073 -215438 -349170 -15435 -55033 -284721 -94079 -76459 -49885 -250886 72358 -24643 -7949
18061 317741 -181930 -2072 163905 182971 -110006 -22028 177532 203441 124356 -75700 -229757
18050 -229757 -16036 -152245 79068 155455 -25373 -198860 20454 -347101 -301356 -40487 -355586
18039 -355586 19752 -238202 -18901 287893 -303535 303137 58091 15505 28095 87829 84815
18028 84815 180278 -41390 186136 -147606 256157 -219147 172648 -5850 -112664 -189312 72687
18016 -131905 153023 -160521 94797 6120 -1208 214133 108199 165110 144355 331768 188606
18005 188606 -157842 355330 -26102 160229 -373148 54746 -21132 332619 20583 47647
17995 47647 -172828 -96725 64943 -24307 -368318 128911 -64291 -172471 182434 -405960
$$ packed form
18073b15438j33732a5435l9598k29688i4079J7620K6574k01001G2358b4643g949
18061C17741a81930b072A63905J9066a10006b2028A77532K5909p9085g5700j54057
18050b29757a6036j36209G9068P6387b5373j73487B0454c47101M5745d0487l15099
18039c55586A9752b38202a8901B87893c03535C03137E8091A5505J2590N9734l014
18028H4815R5463d1390A86136a47606B56157b19147A72648e850j06814p6648G2687
18016a31905A53023a60521I4797F120a208B14133j05934N6911k0755J87413j43162
18005A88606a57842C55330b6102A60229c73148E4746b1132C32619B0583K7064
17995D7647a72828P6103F4943b4307l44011A28911f4291j08180A82434d05960
$$ plain form
17984 -56812 -313643 -161491 -52154 138183 302143 -65488 -228944 -207330 -75176 -234387
17974 -234387 -96865 109349 -80243 -309890 -40410 -71615 -69133 313299 106916 -22110 146544
17962 558827 -194617 63622 154024 -145101 -36829 146295 10441 137448 -60311 -31429 193140
17950 -88948 192445 15287 -49427 330463 -5272 -398809 -115339 -90367 41436 -113270 62959
17938 44456 -198645 -249751 -67466 67672 -240750 -124229 -266713 49673 -248891 150277
17927 -196032 -182646 -27043 151381 -51882 -104351 -90644 -40839 259648 46988 -138036 -66527
17915 155972 -33634 -330553 -54491 111050 -148246 -56541 129058 -120961 39143 -137871
17904 129163 -166641 38827 -206335 89209 217206 -23060 -237493 -188748 124563 -65661
$$ packed form
17984e6812k56831J52152e2154A38183J63960f5488j63456K1614g5176j59211
17974b34387i6865A09349h0243k29647d0410l1205K482C13299A06916b2110A46544
17962E58827a94617F3622R0402a45101c6829A46295A0441J27007f0311K8882A93140
17950h8948A92445A5287d9427C30463e272l93537a15339K4972D1436a13270F2959
17938D4456a98645n1106f7466F7672b40750J16521j42484D9673b48891A50277
17927a96032J3386b7043A51381e1882n2469J3707d0839B59648D6988a38036f6527
17915A55972c3634k96919e4491A11050a48246e6541A29058a20961C9143a37871
17904A29163a66641C8827b06335H9209J27997b3060k14433M8745A24563f5661
$$ plain form
17893 -110070 22419 -201774 -47557 392325 -49675 62033 -377638 -75236 154257 306421
17883 306421 -109984 -94868 135799 -55034 -191174 -99739 104967 85716 450513 118694
17872 115014 -62912 133593 10308 -376379 -176896 -60494 123772 -13971 -48039 17504 -61809
17860 -88798 -21911 -113193 -12413 158242 277625 -495035 116337 -139176 84860 74973 -94679
17848 -92826 -302240 242442 108364 -35005 48633 -306805 31302 -164956 65926 -76011 139130
17836 -139898 -31438 113212 50708 126575 94069 276571 -269994 340873 -66147 -116982 28250
17824 -172789 83236 -148651 -138878 229 -28709 215256 102703 -284161 -244750 29943 -365924
17812 60488 -82632 -236549 223245 45385 -94207 33220 -313580 116094 -86803 190274 58554
$$ packed form
17893a10070B2419b01774d7557C92325d9675F2033c77638g5236A54257J52164
17883C06421a09984J5116A35799e5034j36140R1435A04967j9251L64797A18694
17872A15014f2912A33593A0308c76379a76896f0494A23772a3971l4068A7504f1809
17860h8798b1911r1282a2413A58242J19383d95035A16337a39176H4860r887i4679
17848i2826k09414B42442A08364c5005D8633c06805C1302a64956F5926g6011A39130
17836a39898c1438A13212E0708P5867l2506J82502b69994C40873f6147n0835B8250
17824a72789H3236a48651R773B29b8709B15256A02703b84161L9411B9943c65924
17812F0488h2632j53917B23245D5385i4207C3220c13580A16094h6803A90274E8554
$$ plain form
17800 -86966 64140 -177837 -48646 206985 220618 84088 -8448 74577 -10907 -89119 423458
17788 51231 -177182 51031 329256 145508 104617 -235620 177525 262562 -109219 -142550
17778 -142550 4124 -142080 -532787 -17029 -153606 37496 -99648 -141106 -10839 -206767 72070
17766 -199576 -292217 -21068 -57866 28641 -103681 -47267 -22510 15107 -87927 -253355 120300
17754 38847 -159793 -73093 -146050 -425162 -85568 78131 -65191 103320 40789 51230 476932
17743 476932 115423 165123 -55656 -156458 42036 -142511 -257047 89576 -130379 20163
17732 -229855 -96590 -76479 279206 228642 -192448 147605 276879 174749 92557 15203
17721 45354 -151885 -147085 -60887 155517 126387 379413 -88960 -229482 82581 40920 -55851
$$ packed form
17800h6966F4140a77837d8646B06985J3633H4088h448G4577a0907p8212D23458
17788E1231a77182E1031K78225A45508m0891b35620A77525Q5037a09219l3331
17778a42550D124a42080l90707a7029j36577C7496i9648m1458a0839j95928G2070
17766a99576r2641b1068l6798B8641a03681d7267b2510A5107h7927j65428A20300
17754C8847a59793g3093p2957k79112h5568G8131f5191A03320D0789J0441M25702
17743D76932A15423M9700e5656j00802D2036a42511j14536H9576a30379B0163
17732b29855i6590K0111B79206n0564a92448A47605J29274j02130q2192A5203
17721D5354a51885M800f0887A55517k9130K53026h8960j40522H2581D0920e5851
$$ plain form
17709 1803 57978 163299 -73596 -190915 113803 118364 -15154 -213713 1697 -54844 -274615
17698 -274615 -57311 59296 -98975 -173961 32719 -193791 105958 -68147 -239902 69943 69664
17687 69664 -256567 141208 -18703 378084 95267 132550 109192 52241 106379 125215 245519
17676 245519 183777 68047 15013 -306490 317226 35138 206904 347598 180208 -19270
17665 143005 87530 87899 106160 -33603 100366 289168 -142550 17606 -182412 -202765 -132894
17654 -132894 129118 86158 -166952 -175976 58652 109946 -117966 -239728 229934 217335 -8704
17642 -12176 46871 159837 131167 -54084 -59323 184700 -200732 154995 -192670 -201619 71674
17630 70457 -233011 -110230 -36119 188676 50306 156136 386907 -257292 -130862 430774
$$ packed form
17709A803N6175J05321g3596j17319A13803M561a5154j98559A697e4844k19771
17698b74615e7311E9296i8975p4986C2719a93791A05958f8147j71755F9943k79
17687F9664b56567A41208a8703C78084I5267L7283k3358E2241N4138J8836J20304
17676B45519o1742F8047A5013c06490C17226C5138J71766J40694j67390a9270
17665A43005n5475L69J8261c3603A00366J88802a42550A7606a82412k0353O9871
17654a32894A29118m2960a66952r024E8652N1294a17966j21762B29934j2599h704
17642a2176D6871J12966k8670e4084n239A84700b00732A54995a92670q949G1674
17630G0457b33011a10230c6119A88676E0306J05830K30771b57292J26430D30774
$$ plain form
17619 38028 17079 153277 38712 113633 143450 191667 -49419 119710 -44225 40098 30633
17608 30633 -16563 -91210 25120 73492 100012 35459 83023 -43292 -204804 96516 -134232
17596 104990 10052 135116 113419 40571 220523 137312 -30229 84148 27115 -165834 -42670
17584 41706 210631 166337 18852 -49969 42906 -100610 -155481 -264032 169794 167959 58704
17572 328801 306585 -280472 168225 400815 -92820 174770 -74746 195207 357261 -240058
17561 55683 272246 -29569 20968 239348 48233 -63282 368658 -139276 -96988 168911 -19927
17549 113006 258918 -66886 -33298 68313 222261 20226 40960 -196356 256696 173112 124635
17538 124635 -219789 253514 203722 222371 279377 56955 72114 -226823 -126370 146408
$$ packed form
17619C8028A7079J36198C8712P4921K9817M8217d9419A19710d4225D0098r465
17608C0633a6563p4647B5120M8372K6520C5459M7564d3292j61512I6516a34232
17596A04990A0052J25064k1697D0571J79952q3211c0229H4148B7115a65834d2670
17584D1706J68925m4294A8852d9969D2906a00610n4871j08551A69794j835E8704
17572C28801k2216b80472A68225K32590i2820A74770g4746A95207J62054b40058
17561E5683K16563b9569B0968K18380D8233f3282C68658a39276M2288A68911a9927
17549A13006J45912f6886c3298F8313J53948B0226K0734a96356B56696q3584m8477
17538A24635b19789B53514m9792J8649N7006E6955J5159b26823J00453A46408
$$ plain form
17527 263990 -64561 -35695 344478 93363 -267095 419060 -73251 -15556 -98531 296969 -226084
17515 547430 189043 79983 50662 60797 -270176 85743 -19476 105441 -175409 303144
17504 176689 -101331 316947 110416 217973 69405 38464 -85643 100420 -152685 -139278
17494 -139278 261486 238987 228290 72832 289406 79175 -148160 -458274 263660 485513
17484 485513 495146 134158 267398 153641 238766 -84688 -237667 19220 492397 -166364
17473 268447 320736 168741 220347 217154 -354822 117629 443002 100956 139985 -226408
17462 -90363 -102245 94065 -113996 146797 312421 102759 199077 117087 651875 337165
17452 337165 -3348 -177798 240765 204103 436887 469100 485239 196325 523636 11824 -129883
$$ packed form
17527B63990f4561K8866C44478I3363b67095D19060g3251a5556q2975B96969b26084
17515E47430A89043G9983k9321J0135b70176H5743a9476A05441a75409C03144
17504A76689a01331C16947A10416J07557F9405l0941h5643A00420a52685J3407
17494a39278B61486k2499j0697G2832K16574G9175a48160l10114B63660K21853
17484D85513R633A34158J33240j13757Q5125h4688j52979A9220M73177a66364
17473B68447N2289j51995N1606l193c54822A17629L25373A00956L9029b26408
17462i0363j1882I4065a13996A46797J65624A02759R6318q1990N34788l14710
17452C37165c348j74450B40765l6662K32784L2213J6139A96325L27311A1824a29883
$$ plain form
17440 99452 261354 105804 48193 -71912 233392 145204 -53223 585431 295575 -28536 175593
17428 202456 233022 586421 82672 207468 82118 275697 142283 93320 154034 240901 173736
17417 173736 69623 585200 69088 325533 508935 197085 -115388 232147 375767 81560
17406 287714 82421 -67971 -158803 169062 -1931 104749 -85130 202219 -79294 75539 42385
17395 42385 -77465 -129177 56090 220027 12678 221610 237485 171160 -18420 53551 290528
17384 290528 204624 439676 261567 435310 -182745 117963 123052 235061 69905 519735
17374 519735 229376 -106196 -15100 264688 289645 -94292 466693 400122 424953 -8376 -7763
17363 -7763 -127006 -114110 204370 44941 51111 83643 117120 190887 51867 125074 83792 30479
$$ packed form
17440I9452J61902A05804D8193g1912B33392q8188e3223E85431k89856b8536A75593
17428B02456L0566L53399H2672J24796H2118J93579j33414m8963O0714Q6867o7165
17417A73736F9623N15577F9088K56445J83402A97085a15388B32147J43620H1560
17406B87714H2421f7971r0832A69062a931A04749h5130B02219g9294G5539l3154
17395D2385g7465n1712E6090J63937A2678K08932J5875o6325a8420E3551K36977
17384B90528q5904K35052j78109J73743a82745A17963N089J12009F9905M49830
17374E19735B29376a06196a5100B64688K4957i4292D66693o6571K4831h376O13
17363g763j19243J2896B04370D4941O170L2532L3477P3767E1867P3207m1282C0479
$$ plain form
17350 147264 238510 -24936 -66839 244827 88047 231426 204074 -160564 357586 -219532
17339 11978 -90867 -30112 318542 92392 366338 383617 142946 52847 159381 -76991 52815
17327 -123995 -35076 354503 94970 560218 292266 -9117 334999 166259 -227970 254169
17316 222936 261323 95553 254268 16888 264042 -232757 35205 -167384 178902 177808 398046
17305 398046 -140299 12852 25427 205804 -33901 2957 263252 -211013 -42242 409591 298550
17294 298550 59700 417482 153339 330318 283019 407069 75441 43440 473134 -131973
17283 -43885 272062 -77378 65493 -109060 204695 137438 91445 43424 28363 493797 110862
17271 275998 216747 148439 218790 108260 338834 583630 -270349 188957 93271 265857
$$ packed form
17350A47264R1246b4936m1903B44827H8047J43379k7352a60564C57586b19532
17339A1978i0867c0112C18542I2392K73946J7279A42946E2847J06534g6991E2815
17327a23995c5076C54503I4970M65248k67952i117C34999A66259b27970B54169
17316B22936L8387I5553J58715A6888K47154b32757C5205a67384A78902j094K20238
17305C98046a40299A2852J2575J80377c3901B957K60295b11013d2242D09591j11041
17294B98550E9700L57782A53339J76979m7299J24050G5441l2001M29694a31973
17283d3885B72062g7378F5493a09060B04695o7257m5993D3424j5061M65434A10862
17271B75998n9251o8308P0351A08260K30574K44796b70349A88957I3271J72586
$$ plain form
17261 265857 200800 133519 446435 32446 56249 400101 255286 165954 621786 161315
17250 601363 -208173 353835 63507 273735 218099 176956 -23237 170123 68528 21426 63592
17239 63592 148366 -11789 137061 107964 442552 266725 150287 359850 -209918 120274
17228 45020 304216 149639 268817 249448 472726 416763 133511 -28027 319078 194723
17218 194723 393180 127834 577535 232227 497355 180810 270381 472474 200296 129309
17208 129309 300671 329773 48853 116975 208277 -101099 136440 216466 -24274 377404 382941
17197 382941 239743 431471 163282 82267 54287 103519 475275 213188 250981 418417
17187 418417 -41965 426398 134328 58449 63967 153033 97824 168776 367228 317032 431632
$$ packed form
17261B65857o5057o7281L12916C2446K3803L43852j44815q9332M55832A61315
17250F01363b08173C53835F3507K10228n5636m1143b3237A70123F8528B1426M2166
17239F3592Q4774a1789A37061k9097L34588j75827j16438K09563b09918A20274
17228D5020K59196A49639J19178j9369K23278n5963A33511b8027C19078j24355
17218A94723J98457A27834M49701B32227K65128A80810Q9571K02093B00296p0987
17208A29309J71362K9102D8853O8122R1302a01099A36440Q0026b4274C77404N537
17197C82941j43198J91728A63282q1015k7980M9232L71756B13188L7793J67436
17187D18417d1965D26398A34328E8449N518Q9066n5209P0952J98452n0196J14600
$$ plain form
17176 431632 145730 88517 86416 481817 176453 98874 344819 -165339 197747 62207
17165 280087 393726 -148069 339784 368747 -133576 409994 286554 721987 299859 542341
17155 542341 234623 647867 420892 -60447 401061 280023 632932 367822 344578 220635
17145 220635 233003 430360 440559 337216 88081 120469 224852 291911 383725 237760 261184
17134 261184 188227 165044 75213 492721 -52619 157875 292664 35878 432548 260901
17124 260901 -234924 566180 204677 313820 328240 367301 206561 342321 -31880 359667
17113 187590 518542 424132 243967 45236 521041 229164 153710 439393 240817 110600
17102 107790 587233 435823 423257 352333 88379 388907 116180 313818 502697 368265
$$ packed form
17176D31632A45730n7213k101L95401A76453p7579K45945a65339A97747F2207
17165B80087J13639a48069C39784K8963a33576D09994j23440M35433B99859K42482
17155E42341B34623M13244k26975f0447D01061j21038L52909k65110k3244j23943
17145B20635J2368J97357J0199j03343H8081L2388J04383O7059R1814j45965K3424
17134B61184p2957k3183G5213M17508e2619A57875J34789C5878L96670j71647
17124B60901b34924E66180B04677J09143J4420L9061j60740J35760c1880C59667
17113A87590L30952r4410j80165D5236M75805B29164p5454K85683j98576A10600
17102A07790M79443j51410j2566p0924H8379L00528A16180J97638J88879j34432
$$ plain form
17092 368265 277095 407397 599975 442474 460600 381698 376879 265059 344690 395666 381019
17081 381019 295049 363832 432651 642033 421824 731204 579271 620432 468998 390537
17071 390537 855577 512468 550400 311693 416599 296010 409290 427499 242702 483022
17061 483022 314098 519942 489086 310983 624244 519068 491696 579789 428098 243027
17051 243027 352343 332389 571087 526094 473528 594523 822636 347851 521526 292398
17041 292398 233696 559606 634417 368810 456109 766207 437579 818364 610492 355597
17031 355597 389360 515453 683080 198927 673944 656245 364773 366799 618289 529707
17021 529707 632807 491084 709241 733440 581803 495201 662015 400577 475464 532727
$$ packed form
17092C68265r1170J30302J92578j57501J8126p8902m819j11820P9631N0976j4647
17081C81019q5970O8783O8819K09382k20209L09380j51933M1161j51434p8461
17071C90537M65040l43109L7932k38707J04906j20589J13280J8209j84797K40320
17061D83022j68924K05844l0856j78103L13261j05176k7372Q8093j51691j85071
17051B43027J09316j9954K38698m4993n2566J20995K28113C47851J73675k29128
17041B92398n8702L25910P4811k65607Q7299L10098l28628L80785k07872k54895
17031C55597L3763J26093J67627A98927M75017j7699k91472K026K51490q8582
17021E29707J03100j41723K18157K4199j51637q6602J66814k61438P4887N7263
$$ plain form
17011 532727 781415 912260 611348 903643 655895 454428 687497 683572 618984 485007
17001 485007 848053 704777 1043502 734037 453183 641482 662851 1269771 740208 1035204
16991 1035204 606728 572637 1026037 683070 876181 508616 913821 997815 770738 384261
16980 810036 679110 873033 749618 525290 738455 486161 854981 651617 610475 631307
16970 631307 1125657 850875 1121763 730469 824166 914460 708023 757153 740621 935575
16960 935575 829551 650429 1061978 788177 989314 794702 1189940 1077421 1183264 800324
16950 800324 858758 1342507 1353044 1103454 1048501 868209 898435 895807 1325315 992179 1083849
16939 1083849 1383064 1177935 918709 1131120 1296933 1025733 1211582 1063111 1007478 1140284
$$ packed form
17011E32727K48688J30845l00912K92295k47748k01467K33069l925o4588j33977
17001D85007L63046j43276L38725l09465k80854J88299K1369O06920n29563K94996
16991A035204m28476l4091M53400l42967J93111l67565M05205Q3994k27077C84261
16980H10036j30926J93923j23415k24328K13165k52294L68820k03364m1142K0832
16970F31307M94350k74782K70888l91294R3697R0294k06437M9130j6532J94954
16960I35575j06024j79122M11549k73801K01137j94612L95238j12519J05843l82940
16950H00324N8434M83749J0537k49590n4953j80292L0226k628M29508l33136R1670
16939A083849K99215k05129k59226K12411J65813k71200J85849j48471n5633J32806
$$ plain form
16929 1140284 1418579 1177310 1127509 1480657 1178979 1222854 1217256 1319566 1464700 1449803
16919 1449803 1165583 1236812 1517239 1624432 1443522 1303749 1690964 1238790 1636475 1388776
16909 1388776 1266898 1559520 1605766 1561700 1538536 1536615 1373683 1391846 1414190 1559479 1614309
16898 1614309 1597224 1699914 2029489 2020530 1770739 1918671 1861531 1879946 2032192 1872126
16888 1872126 1821775 1685583 2028333 1828229 2142829 1734829 1746923 1894516 2075506 1887964
16878 1887964 2062590 2245884 2248103 2321151 2019327 2208932 2218722 2557869 2586057 2347568
16868 2347568 2012524 2240788 2261796 2201855 2401023 2925246 2830581 2580176 2679481 3028629
16858 3028629 2587295 2509183 3085129 2561105 3179449 3162588 2963946 2827892 3129601 3391439
$$ packed form
16929A140284K78295k41269m9801L53148l01678M3875n598J02310J45134j4897
16919A449803k84220P1229K80427J07193j80910j39773L87215m52174L97685k47699
16909A388776j21878K92622M6246m4066k3164j921j62932J8163K2344J45289N4830
16898A614309j7085J02690L29575q959k49791J47932n7140J8415J52246j60066
16888A872126n0351j36192L42750k00104L14600m08000J2094J47593J80990j87542
16878A887964J74626J83294K219P3048l01824J89605R790L39147K8188k38489
16868B347568l35044K28264K1008n9941J99168N24223r4665k50405R9305L49148
16858C028629m41334p8112N75946n24024O18344j6861j98642j36054L01709K61838
$$ plain form
16848 3391439 3341468 3138726 3427706 3425949 3231811 3810038 3558656 3449092 3870775 3841482
16838 3841482 3745342 4139843 3741655 3958255 4053648 4306943 4341292 3999504 4383611 4181972
16828 4181972 4746124 4323481 4744893 4848259 5154758 4813683 4989807 4855617 5087181
16819 5087181 5438514 5118409 5265395 5247876 5165048 5978808 5869481 5724746 6388421 6369227
16809 6369227 6527883 6525141 6760715 7007541 6997156 7149603 7277180 7481364 7955725 7969214
16799 7969214 8112066 7951321 8355591 8573087 8859127 8844965 9349714 9458454 9543470 9776934
16789 9776934 9891772 10677719 11213218 10902095 11122259 11965966 11699558 12573952 12462194
16780 12462194 12806442 13841586 14288181 14323843 14822606 15119620 15942079 16494425 16808128
$$ packed form
16848C391439m9971k02742K88980j757j94138N78227k51382j09564M21683k9293
16838C841482r6140L94501l98188K16600R5393K53295L4349l41788L84107k01639
16828D181972N64152m22643M21412J03366L06499l41075J76124j34190K31564
16819E087181L51333l20105J46986j7519q2828Q13760j09327j44735O63675j9194
16809F369227J58656k742K35574K46826j0385J52447J27577K04184M74361J3489
16799G969214J42852j60745M04270K17496K86040j4162N04749J08740Q5016K33464
16789I776934J14838P85947N35499l11123K20164Q43707k66408Q74394j11758
16780A2462194L44248J035144M46595L5662M98763K97014Q22459N52346L13703
$$ plain form
16771 16808128 17627269 17928947 18406289 19207319 20122641 20828375 21427688 22281305 23128670
16762 23128670 23838482 24975671 26221170 26942920 27915977 29841444 30575440 32156212 33758175
16753 33758175 35085936 36699644 38995374 40579582 42646221 44448684 46935866 49325301
16745 49325301 52256121 54944481 57889854 61334682 64548595 68058647 72277526 76686948
16737 76686948 81230230 85857107 91046083 96958828 103335794 109406407 116109132 123075677
16729 123075677 130342351 138482511 146382596 154285505 162741038 170838557 178350589 186036449
16721 186036449 192703675 198554339 203452130 206847898 208990968 209486460 208883817 206249757
16713 206249757 202514583 197589539 191133727 184642732 176777674 168929775 160339181 151749205
$$ packed form
16771A6808128Q19141L01678M77342Q01030R15322P05734N99313Q53617Q47365
16762B3128670P09812J137189J245499P21750R73057J925467P33996J580772J601963
16753C3758175J327761J613708K295730J584208K066639J802463K487182K389435
16745D9325301K930820K688360K945373L444828L213913L510052M218879M409422
16737G6686948M543282M626877N188976N912745O376966O070613O702725O966545
16729A23075677P266674Q140160P900085P902909Q455533Q097519P512032P685860
16721A86036449O667226N850664M897791L395768K143070M95492o02643k634060
16713B06249757l735174m925044o455812o490995p865058p847899q590594q589976
$$ plain form
16705 151749205 143229604 135150145 127017466 119785015 112368747 105687210 99234048 92971678
16697 92971678 87733929 82116025 77461961 72865750 68395601 64771473 61111852 57897354
16689 57897354 54521180 51212645 48920257 45983778 43801893 41615196 39564783 37582705
16681 37582705 36057585 34012934 32879329 31521439 30020785 28556069 27161566 26480997
16673 26480997 25123642 24191851 23069271 22397210 21231253 20769354 19726460 18882244 18392915
16664 18392915 17580297 17405326 16335933 16097861 15414088 14840902 14395953 13978524 13425010
16655 13425010 13145353 12748675 12621456 11779598 11479712 11286154 10766662 10867304 10262381
16646 10262381 9981180 9848332 9700294 9293487 8849044 8623240 8540027 8182415 7811397
$$ packed form
16705A51749205q519601q079459q132679p232451p416268o681537o453162o262370
16697I2971678n237749n617904m654064m596211m470149l624128l659621l214498
16689E7897354l376174l308535k292388k936479k181885k186697k050413j982078
16681C7582705j525120k044651j133605j357890j500654j464716j394503o80569
16673B6480997j357355r31791j122580o72061j165957m61899j042894q44216m89329
16664A8392915q12618j74971j069393k38072o83773n73186m44949m17429n53514
16655A3425010k79657l96678j27219q41858k99886j93558n19492J00642o04923
16646A0262381k81201j32848j48038m06807m44443k25804q3213l57612l71018
$$ plain form
16637 7811397 7858110 7939468 7306435 7064668 7104074 7030100 6667422 6695483 6380961 6077743
16627 6077743 6052184 5967991 6259166 5644032 5892370 5083270 5246328 4865105 5251838 4896559
16617 4896559 5126050 4938854 4738179 4881010 4380299 4469907 4191762 4238088 4721629 4351998
16607 4351998 4363765 4003012 3700577 4142362 4004397 3758015 3845101 3434863 3549443 3248141
16597 3248141 3352963 3528926 3256107 3276056 3197443 3418911 3349480 2740073 2974662 2866653
16587 2866653 2585466 3000394 2655769 2298848 2978588 2995482 2429454 2807360 2437388 2525741
16577 2525741 2777587 2556286 2344177 2288191 2233641 2260411 2496889 2228409 2203428 1824943
16567 1824943 2135837 2307253 2429501 2009582 2208373 2115745 1727761 1987523 1965020 1775903
$$ packed form
16637G811397M6713Q1358o33033k41767L9406p3974l62678K8061l14522l03218
16627F077743k5559q4193K91175o15134K48338q09100J63058l81223L86733l55279
16617D896559K29491j87196k00675J42831n00711Q9608k78145M6326M83541l69631
16607D351998J1767l60753l02435M41785j37965k46382Q7086m10238J14580l01302
16597C248141J04822J75963k72819J9949p8613K21468o9431o09407K34589j08009
16587B866653k81187M14928l44625l56921O79740J6894n66028L77906l69972Q8353
16577B525741K51846k21301k12109n5986n4550K6770K36478k68480k4981l78485
16567A824943L10894J71416J22248m19919J98791r2628l87984K59762k2503j89117
$$ plain form
16557 1775903 1982258 1653268 1413144 1678897 1683473 2062456 1650987 1485836 1722911 1808204
16547 1808204 1325395 1754088 1537778 1357733 1691563 1482227 1230870 1305404 1464630 1274901
16537 1274901 1537377 1293153 1613745 1425331 1271509 1490633 1222465 1069327 1194388
16528 1194388 1280045 1418122 750665 1364377 1462639 944646 898833 675693 1203626 1030367
16518 1030367 1256679 916509 1024515 980365 799838 1209418 956257 930862 1308739 1106527
16508 1106527 825815 1273005 1125481 948022 994210 1198563 788480 946740 746713 1107457
16498 1107457 997322 938498 743328 1007702 912164 552245 1331116 873961 1172573 739182
16488 739182 1038649 676065 902956 747266 858068 1091507 844279 753180 965571 1076769
$$ packed form
16557A775903K06355l28990k40124K65753M576L78983m11469j65151K37075Q5293
16547A808204m82809M28693k16310j80045L33830k09336k51357P4534J59226j89729
16537A274901K62476k44224L20592j88414j53822K19124k68168j53138J25061
16528A194388Q5657J38077o67457O13712R8262n17993m5813k23140N27933j73259
16518A030367K26312l40170J08006m4150j80527M09580k53161k5395L77877k02212
16508A106527k80712M47190j47524j77459M6188K04353m10083J58260k00027L60744
16498A107457j10135n8824j95170K64374r5538l59919P78871m57155K98612m33391
16488G39182K99467l62584K26891j55690J10802K33439k47228r1099K12391J11198
$$ plain form
16478 1076769 711255 866254 907073 511802 797362 755938 700891 556264 648831 632298
16468 632298 997860 526623 630327 812567 626015 468825 618299 630118 460624 402256
16458 402256 793507 750487 592560 672718 492858 728301 589098 340994 581865 534495
16448 534495 785978 424883 514670 586948 717066 388788 741238 808400 473168 661857
16438 661857 582982 513897 1023433 468692 506713 354088 656872 353672 517217 523245
16428 523245 758971 455372 413729 580740 643712 608883 396718 151873 546325 413079
16418 413079 677038 653921 429411 463501 611314 479608 564748 311377 565556 690744
16408 690744 388040 247131 462454 584989 378084 440093 492915 247365 82378 436108
$$ packed form
16478A076769l65514J54999M0819l95271K85560m1424n5047j44627R2567j6533
16468F32298L65562m71237J03704J82240j86552j57190J49474J1819j69494n8368
16458D02256L91251m3020j57927Q0158j79860K35443j39203k48104K40871m7370
16448E34495K51483l61095Q9787P2278J30118l28278L52450O7162l35232J88689
16438F61857p8875o9085N09536D68692L8021j52625L02784l03200J63545O028
16428E23245K35726l03599m1643J67011O2972l4829k12165A51873L94452j33246
16418D13079K63959k3117k24510L4090J47813j31706Q5140k53371K54179J25188
16408F90744l02704j40909K15323J22535k06905O2009N2822k45550H2378L53730
$$ plain form
16398 436108 616678 413856 206136 437624 489543 418269 29858 63073 520054 347045
16388 347045 485823 265035 185404 231133 108132 552285 256627 560541 -38346 301951
16377 221310 230627 23761 193667 310309 287134 395549 290763 586360 377140 346337
16367 346337 363392 374354 350163 150862 505086 186303 397315 151371 133631 21822
16356 404892 363435 376089 3537 518066 416240 296575 104741 370140 104155 302992
16346 302992 182117 -15960 617808 70271 33986 355230 383821 676995 97137 164737 208652
16335 208652 326057 -289123 300345 163132 254965 321897 440477 402362 171775 94215
16325 94215 413861 187685 131337 349434 135397 378973 401061 501462 548103 116082
$$ packed form
16398D36108J80570k02822B06136K31488N1919p1274B9858L3215M56981j73009
16388C47045J38778k20788p9631M5729A08132M44153B56627L03914c8346C01951
16377B21310R317B3761J69906J16642k3175J08415j04786K95597k09220l0803
16367C46337J7055J0962k4191A50862L54224A86303K11012A51371j7740B1822
16356D04892m1457J2654C537N14529j01826j19665A04741K65399A04155J98837
16346C02992j20875a5960F17808G0271C3986L21244K8591K93174I7137O7600M3915
16335B08652J17405b89123C00345j37213R1833O6932J18580l8115A71775p7560
16325I4215L19646A87685n6348K18097A35397K43576K2088J00401M6641A16082
$$ plain form
16314 478944 4027 333119 -96240 298682 229277 -54079 319074 287788 107698 167124 179657
16303 179657 350565 -76924 256951 248826 151583 204278 146931 384404 215840 525550 58601
16291 135832 227943 54128 -97558 -15814 311362 76090 257226 296961 179764 287143 88468
16279 545585 86997 182320 2556 83857 480128 45805 711692 1966 81456 286053 21296
16267 241039 152653 458291 142265 254794 25130 183260 324185 473565 172279 161603
16257 161603 116581 -156546 349761 34282 304566 19382 205783 -254718 210422 -82666
16246 353638 93673 136185 190567 216091 -114478 412994 44191 194472 219139 15532 -5663
16234 44603 23534 99488 309294 174725 -45552 99880 82524 326181 33645 -113082 210003
$$ packed form
16314D78944D027L29092i6240B98682o9405e4079C19074l1286A07698N9426J2533
16303A79657J70908g6924B56951q125r7243N2695n7347K37473j68564L09710E8601
16291A35832R2111E4128i7558a5814C11362G6090J81136L9735j17197J07379H8468
16279E45585H6997R5323B556Q1301L96271D5805O65887A966P9490K04597B1296
16267B41039q8386L05638A42265J12529B5130J58130J40925J49380A72279j0676
16257A61603m5022a56546C49761C4282K70284A9382J86401b54718B10422h2666
16246C53638I3673M2512N4382K5524a14478D12994D4191J50281K4667A5532e663
16234D4603k1069P5954K09806j34569d5552I9880j7356K43657C3645a13082B10003
$$ plain form
16222 207088 217870 53487 49918 -100083 -60289 157569 54997 -19378 22977 91351 152985
16211 152985 273273 -122170 279482 270564 101102 -1986 277862 89135 23027 446886 153885
16199 255885 -117378 442116 199214 220245 18582 369252 15302 43315 80644 -266709
16188 121550 -28394 -23530 -111403 -3708 132627 336096 -82104 145338 -59413 137570 37252
16176 -181800 -222665 363478 -235978 -50375 -55974 249615 -123606 -33493 -69734 -109364 29972
16164 197518 -46454 111574 207672 36691 53045 210448 188986 142843 531545 -159698 52858
16152 67077 -15491 -45171 -439819 143936 -26406 91326 174279 -129399 -115778 96129 243392
16141 243392 140860 -116398 259642 -24392 -31972 -243232 207802 -120777 98638 -28601
$$ packed form
16222B07088J0782E3487l569a00083L9794A57569E4997a9378B2977O8374O1634
16211A52985J20288a22170B79482q918A01102a986B77862H9135B3027M23859A53885
16199B55885a17378D42116A99214K1031A8582L50670A5302K8013L7329b66709
16188A21550b8394M864q7873c708A32627K03469h2104A45338e9413A37570C7252
16176a81800m0865C63478b35978e0375n599B49615a23606c3493l6241l9630B9972
16164A97518d6454A11574R6098C6691J6354J57403k1462m6143L88702a59698E2858
16152F7077a5491k9680l94648A43936b6406I1326Q2953a29399J3621I6129J47263
16141B43392j02532a16398B59642b4392p580k11260B07802a20777I8638b8601
$$ plain form
16130 -121199 29410 43555 102811 -117432 -14439 42619 32198 -236708 41222 129815 -170484
16118 69465 46961 -87043 160171 -36140 123831 -284020 90022 76380 -110280 176653 54299
16106 -113928 -484152 -2 78493 -90296 91723 -230105 314078 -4233 -184621 194970 -30853
16094 97934 75045 -184647 -204199 -2551 -134360 -93711 155202 142377 -136734 -36683 -7802
16082 266393 -100686 -261433 413896 -130957 44112 -35155 -197590 431300 -301429 -222509
16072 -222509 85552 -96779 -160816 21355 -30606 273852 4320 52408 113296 -229911 98969
16060 117406 -299041 -325420 -241472 -91453 163531 -163640 56420 226525 110033 81840
16050 81840 489066 44172 55585 -93284 -248168 -13315 314838 -139 141692 39980 182623
$$ packed form
16130a21199B9410J4145N9256a17432a4439D2619j0421b36708D1222Q8593a70484
16118F9465k2504h7043A60171c6140A23831b84020I0022j3642a10280A76653E4299
16106a13928l70224bG8493i0296I1723b30105C14078d233j80388A94970c0853
16094I7934k2889a84647j9552b551j31809M0649A55202j2825a36734c6683g802
16082B66393a00686j60747D13896a30957D4112c5155j62435D31300c01429P8920
16072b22509H5552i6779o4037B1355c0606B73852D320M8088O0888b29911I8969
16060A17406b99041k6379Q3948i1453A63531a63640E6420J70105A10033k8193
16050H1840M07226D4172J1413i3284j54884a3315C14838a39A41692C9980J42643
$$ plain form
16039 182623 -29425 -99710 -217197 -295203 -10874 -63314 35452 178760 -7251 137899 113221
16028 113221 210911 -241174 177332 4641 316633 215318 -77699 18084 142911 123922 211270
16017 211270 220411 -87337 -100943 -64080 -357296 -135691 7131 -30622 170176 -78976 108800
16005 210983 136308 213371 -134384 -21666 -163602 120753 179177 74316 -157024 -191719 57397
15993 -167018 18651 146678 195889 -101109 -424473 -284117 -380974 -133749 -32758 17793
15982 78930 311836 128519 126590 307158 492388 246921 -915 -48775 -105052 271364 -128666
15970 402178 -111080 145445 20602 -397975 -379568 -114338 -118340 -301166 53364 207003
15960 207003 -133469 -20695 -181808 252822 -162406 24544 -148854 -103048 162032 6107
$$ packed form
16039A82623b9425p0285j17487p8006a0874n2440C5452J43308g251A37899k4678
16028A13221R7690b41174A77332D641L11992j01315g7699A8084J24827j8989Q7348
16017B11270R141h7337j3606L6863k93216a35691G131c0622A70176g8976A08800
16005B10983p4675P7063a34384b1666j41936A20753N8424G4316a57024l4695E7397
15993a67018A8651J28027M9211a01109l23364J40356r6857a33749c2758A7793
15982G8930K32906A28519j929J80568J85230k45467i15m7860n6277B71364a28666
15970D02178a11080A45445B0602c97975J8407a14338m002j82826E3364J53639
15960B07003a33469b0695j61113B52822a62406B4544a48854M5806A62032F107
$$ plain form
15949 194362 -100533 -156433 5990 171302 -330223 91907 139335 -73651 74355 -170370 268247
15937 -46383 125818 173042 107208 -187916 163218 -204289 -234183 -195576 228622 194433 35587
15925 132 177041 -140300 18954 354094 -73058 73681 -28242 177677 173164 -177498 91435
15913 99290 -93901 -61672 -315745 -290344 265105 -73536 -37842 -297205 -54904 -267906 -93088
15901 -41898 192941 25185 15137 -264583 290971 52829 149408 -84158 -32458 170862 -58881
15889 30706 214342 -113310 -48381 31635 109282 -298109 333227 23922 -143336 -89185 88921
15877 -24209 -95013 -23209 -135018 -358712 -159353 -66870 -232179 308944 -66349 -95328 41
15865 -100101 104170 -93726 -211813 -128325 326825 -27249 -55335 28375 76548 -88597 -151584
$$ packed form
15949A94362a00533n5900E990J65312c30223I1907M7428g3651G4355a70370B68247
15937d6383A25818M7224o5834a87916A63218b04289k9894L8607B28622l4189C5587
15925A32J76909a40300A8954L35140g3058G3681b8242A77677m513a77498I1435
15913I9290i3901L2229k54073K5401B65105g3536L5694k59363e4904k13002i3088
15901d1898A92941B5185j0048b64583B90971E2829R6579h4158c2458A70862e8881
15889C0706J83636a13310d8381C1635P7647b98109C33227B3922a43336N4151H8921
15877b4209p0804b3209j11809k23694a59353f6870j65309C08944f6349k8979D1
15865a00101A04170i3726j18087Q3488C26825b7249k8086B8375M8173h8597o2987
$$ plain form
15854 -151584 -117103 -332799 -84741 -113862 -162040 75790 -299350 -112332 -103653 -288884 95306
15842 -61797 -54621 -233426 198517 -256314 -307224 19170 319730 141694 -135374 -205178 215158
15830 316924 22861 86589 16624 23163 185718 -172797 -152825 -52995 232883 -99153 -154927
15819 -154927 -85576 -49725 -93920 -181371 -127681 -122533 112750 77324 164896 -257867 -166120
15808 -166120 -16806 -138905 34405 -167049 84813 102802 270856 -173265 -210189 -151411 -8021
15796 -196426 -15254 -87088 30888 5218 -163197 51121 -92353 -179287 42477 -553607 -166120
15784 -52271 167420 202001 336616 -318125 8398 9006 -240081 -90323 290789 73030 1600
15772 -81995 -232231 52060 -127674 90860 -259781 -105987 -154094 -109143 -265624 224233
$$ packed form
15854a51584L4481k15696h4741k9121m8178G5790b99350a12332Q679j85231I5306
15842f1797P176j78805A98517b56314n0910A9170L00560A41694a35374o9804B15158
15830C16924B2861O3728A6624O539J62555a72797J9972e2995B32883i9153n5774
15819a54927O9351L5851m4195q7451N3690N148A12750l5426Q7572b57867R1747
15808a66120a6806j22099C4405a67049H4813J7989J68054a73265l6924N8778h021
15796a96426a5254p1834C0888E218a63197E1121i2353q6934D2477e53607a66120
15784e2271A67420L4581J34615c18125H398O08b40081i0323B90789G3030A600
15772h1995j50236E2060a27674I0860b59781a05987m8107M4951j56481B24233
$$ plain form
15761 35361 153820 -134341 2967 -45759 -119283 16236 -79103 -156134 16628 -2053 -27849 64014
15748 56690 197628 -151142 -168843 220209 -79612 54902 -108032 -187185 149140 -110459
15737 -364301 -167991 -162202 137556 -73907 107635 -58051 -157175 -244038 -223175 -186316 -176333
15726 -176333 139910 -241707 -465824 -144512 -108381 66466 -303635 11123 -110434 -85924
15716 -85924 -77290 -194991 -142228 -366604 -4199 90622 -12140 -61433 4969 133348 -455330
15704 -60526 -79369 -138003 15371 113616 73557 -266523 -18394 -119029 -113832 -64172 246048
15692 96446 -299831 -109242 -86898 296722 216571 -289251 -305498 -96785 127301 -255974
15681 37130 111006 -124013 186891 -37081 93093 -173408 -110659 202193 180034 40157 157598
$$ packed form
15761C5361J18459a34341B967d5759p3524A6236g9103p7031A6628b053k5796F4014
15748E6690J40938a51142j7701B20209g9612E4902a08032p9153A49140a10459
15737c64301a67991N789A37556g3907A07635e8051r9124q6863K0863L6859R983
15726a76333A39910b41707k24117a44512L6131F6466c03635A1123a10434K4510
15716h5924Q634j17701N2763k24376d199I0622a2140m9293D969J28379d55330
15704f0526j8843n8634A5371R8245m0059b66523a8394j00635N197M9660B46048
15692I6446b99831a09242K2344B96722q0151b89251j6247i6785A27301b55974
15681C7130P3876a24013A86891c7081I3093a73408O2749B02193k2159D0157J17441
$$ plain form
15670 157598 158298 139323 119766 -167246 -32272 62567 -66374 -27889 -105024 -73866 27096 42167
15658 42167 105018 -360872 -90453 -60255 -4219 180463 116236 100345 186402 -88842 -177802
15647 -177802 -81769 -149035 -85060 62107 231238 180507 -425494 -34607 134198 -23932 136944
15635 128896 -10431 -240405 100390 -29064 -125742 -22847 237434 -14502 26982 16293 14975
15624 14975 -89269 81270 34573 -310757 80214 222167 -168619 172435 -10259 46477 332324
15613 332324 34941 -74108 -3453 -107905 37645 107420 -88999 172427 -75861 -152836 13943
15601 24401 -86349 -242777 109821 -333381 104031 58544 -197601 141035 102358 75839
15591 75839 -114198 -78918 -227701 24502 -8347 264372 82064 -291538 147410 123435 -427794
$$ packed form
15670A57598P00j8975j9557a67246c2272F2567f6374b7889p7135L1158B7096J5071
15658D2167O2851c60872i0453L0198d219A80463o4227j5891Q6057h8842q8960
15647a77802h1769o7266O3975F2107J69131n0731d25494c4607A34198b3932A36944
15635A28896a0431k29974A00390b9064r6678b2847B37434a4502B6982j0689j318
15624A4975h9269H1270C4573c10757H0214J41953a68619A72435a0259D6477K85847
15613C32324C4941g4108c453j04452C7645O9775h8999A72427g5861p6975A3943
15601B4401h6349j56428A09821c33381A04031m5487a97601A41035l8677k6519
15591G5839a14198L5280j48783B4502h347B64372H2064b91538A47410k3975d27794
$$ plain form
15579 -200270 -58925 209211 -282888 144504 -27245 279392 -14497 85148 97362 -111023
15568 -254781 -97493 -395128 -105180 196077 121303 -323847 75420 189410 57607 -38982
15557 -228088 -333384 130931 -105510 -120780 -115881 358581 -373279 -203812 11984 11536 -4234
15545 75196 -13247 278363 318493 -17277 -169537 26915 55030 -56559 -56404 66639 -47213 -522212
15533 -522212 -202103 142615 335563 -157361 -61496 358367 8324 12237 9737 45201 304692
15522 304692 -268588 -257149 84085 7528 -80113 -69132 -49202 -72890 -56381 91219 276784
15511 276784 -68932 -63746 269014 -39142 -338643 -303676 -53981 205228 54878 118494 -306438
15499 -199905 88994 180294 -47186 -35412 -72595 -119823 94888 -335442 86172 144683 60288
$$ packed form
15579b00270e8925B09211b82888A44504b7245B79392a4497H5148J2214a11023
15568b54781i7493k97635a05180A96077p4774c23847G5420J13990E7607c8982
15557b28088j05296A30931a05510j5270M899C58581c73279J69467A1984m48d234
15545G5196a3247B78363M0130a7277j52260B6915K8115e6559J55F6639d7213m74999
15533e22212b02103A42615J92948a57361f1496C58367H324L913k500L5464K59491
15522C04692b68588J1439H4085G528h0113J0981J9930k3688J6509I1219J85565
15511B76784f8932N186B69014c9142k99501L4967e3981B05228E4878O3616c06438
15499a99905H8994R1300d7186J1774l7183m7228I4888c35442H6172N8511F0288
$$ plain form
15487 -13271 -87277 -148348 73067 24945 -101445 -94545 -67918 -98918 -13911 305998 -80837
15475 24420 -290606 88329 -392384 114218 905 60385 -178109 202668 -93070 -205060 -43562
15463 178921 -59370 168004 215065 316792 76993 -121381 89630 68023 239567 195146 29962
15451 -79798 -32013 219709 102253 212713 52780 293647 123343 -131272 62956 44474
15441 44474 139401 152185 208601 -102219 -30467 -129575 247069 -215307 -166930 13415 53012
15430 53012 323429 -102817 -16880 179292 -49468 -116965 20340 176535 94213 -76434 -40271
15419 -40271 -159195 199265 27759 -63799 -6021 15884 182559 -126384 85139 -17927 160829
15407 -190936 247028 -166895 -189650 -25924 -327138 134516 492929 -283194 -32639 -73597
$$ packed form
15487a3271p4006o1071G3067B4945a01445O900K6627l1000a3911C05998h0837
15475B4420b90606H8329c92384A14218I05N9480a78109B02668i3070j11990d3562
15463A78921e9370A68004M7061J01727G6993a21381H9630k1607J71544m4421B9962
15451g9798c2013B19709A02253J10460E2780K40867A23343a31272F2956j8482
15441D4474R4927J2784N6416a02219c0467r9108B47069b15307M8377A3415L9597
15430E3012K70417a02817a6880A79292d9468o7497B0340J56195q2322g6434L6163
15419d0271j18924A99265B7759f3799f021A5884J66675a26384H5139a7927A60829
15407a90936B47028a66895k2755b5924l01214A34516L58413b83194c2639m0958
$$ plain form
15397 -73597 -11060 -27597 13150 -170477 -390720 -104006 -198763 160715 124367 -243596 352278
15385 14695 -322900 -26734 -101138 91503 -323918 162365 -149543 -85025 7355 258119 385036
15374 385036 210732 -352701 -213128 71384 287699 92309 -124187 -115076 -193929 31681 164590
15363 164590 -58629 -169816 -169950 97568 -184856 96825 -140917 -135608 -133345 117 93545 300962
15351 300962 88143 -251588 -38237 58604 79401 -20424 71819 -28578 -60478 151268 -29643
15339 279403 -144184 -292673 -216201 46115 -85931 -176974 97983 126335 94703 21644 25066
15328 25066 309296 -198213 210200 235326 -212720 212264 331832 82128 -3280 260447
15317 -9436 97407 188424 -166302 160526 94242 201645 -140268 -144581 55990 -250088 -15354
$$ packed form
15397g3597a1060j6537A3150a70477k20243a04006r4757A60715l6348b43596C52278
15385A4695c22900b6734p4404I1503c23918A62365a49543O4518G355K50764J26917
15374C85036j74304c52701J39573G1384K16315I2309a24187R111p8853C1681J32909
15363A64590e8629j11187j34I7568a84856I6825a40917N309K263A17R3428K07417
15351C00962H8143b51588c8237E8604K0797b0424G1819b8578l1900A51268b9643
15339B79403a44184j48489P6472D6115h5931r1043I7983K8352l1632B1644L422
15328B5066K84230a98213B10200K5126b12720B12264J19568H2128c280B60447
15317i436I7407R1017a66302A60526o6284J07403a40268m313E5990b50088a5354
$$ plain form
15305 26924 -388834 168714 -19705 -9023 52212 140309 -164041 -112780 383462 112718 -282496
15293 -40337 -95483 -213355 933 -54487 191554 146938 -15819 28011 -319468 60489 19306
15281 91065 59514 70053 161970 -159651 48191 -94586 432933 60009 -133923 -21296 -16270
15270 -16270 -164600 -68390 134130 -7042 37245 169572 -247560 68162 32709 114864 -49701
15258 -71259 -106597 -84678 433312 298027 398883 159662 53516 277136 426658 1005539
15248 1005539 1553449 1294258 1812493 1405438 585180 201597 481461 -5560 -370600 90850
15237 339946 -18549 81080 -247920 -9082 187018 162853 59143 -197799 -35848 29089 -204612
15225 270144 -81601 -157891 -193662 -128039 -107259 105543 161918 231410 -91006 16875 81264
$$ packed form
15305B6924c88834A68714a9705i023E2212Q8097a64041N1261C83462A12718b82496
15293d0337n5146j17872I33e4487A91554m4616a5819B8011c19468F0489A9306
15281I1065l1551J0539R1917a59651D8191i4586D32933F0009a33923b1296N026
15270a6270j48330f8390A34130g042C7245J32327b47560F8162C2709Q2155d9701
15258g1259l5338K1919D33312j35285J00856A59662E3516K23620J49522N78881
15248A005539N47910k59191N18235m07055E85180B01597K79864e560l65040I0850
15237C39946a8549H1080b47920i082A87018k4165E9143a97799c5848B9089b04612
15225B70144h1601p6290l5771O5623K0780A05543N6375O9492i1006A6875O4389
$$ plain form
15214 81264 61002 199021 104615 88778 220718 404669 171151 140670 175842 -215925 266669
15202 77902 200519 58461 61177 107419 170887 45535 98935 -34808 11884 55007 -192168
15190 299157 484274 23951 156508 304386 351520 286116 51495 275921 265554 -79185 314464
15178 76561 -60905 -179612 -296506 -303375 -88985 3115 137958 -329214 -148850 33459 -67175
15166 309166 104503 -94091 7545 54734 450253 -274108 169974 336218 20264 154248
15156 154248 -91740 191932 173516 -36936 237399 77594 -227836 219927 33681 1099 52161
15145 52161 202653 3523 152745 -182246 128726 208897 76431 67076 155447 -229121 253374
15133 122750 192367 241356 5636 -12683 235017 112639 122562 72171 553123 244397 25928
$$ packed form
15214H1264k0262J38019r4406j5837J31940J83951A71151l0481L5172b15925B66669
15202G7902J22617E8461K716M6242O3468D5535N3400c4808A1884M3123a92168
15190B99157J85117B3951J32557J47878M7134o5404E1495K24426j0367g9185C14464
15178G6561f0905j18707j16894o869h8985C115J34843c29214a48850C3459f7175
15166C09166A04503i4091G545M7189L95519b74108A69974J66244B0264J33984
15156A54248i1740A91932j8416c6936B37399G7594b27836B19927C3681A099N1062
15145E2161J50492C523J49222a82246A28726Q0171G6431r355Q8371b29121B53374
15133A22750O9617M8989E636a2683B35017A12639R923n0391M80952B44397B5928
$$ plain form
15121 -22534 323582 106773 288458 73352 47798 -144974 -176022 -99596 -156174 270157 -66219
15109 -17875 342749 -25891 -223856 105070 62444 545578 21439 57481 125752 87515 208017
15098 208017 -79483 495296 124891 21214 -120223 189789 157251 501795 -75186 -172837
15088 -172837 141938 84880 162680 13833 -41454 -178163 229712 -30314 89850 105994 -76933
15076 254709 284882 102078 31671 -89641 105939 150729 518910 259170 213131 20679 -143094
15064 97388 -33343 101330 31524 225359 336735 435463 187985 -18251 512000 379595
15054 379595 -52203 2867 91929 95629 110355 77035 104568 109819 -101875 416336 323607 -150396
15041 157038 -44590 127338 239319 406235 -97465 41148 -99036 184161 430905 15707
$$ packed form
15121b2534C23582A06773J81685G3352k5554a44974l1048P6426n6578B70157f6219
15109a7875C42749b5891j97965A05070m2626M83134B1439L6042O8271l8237J20502
15098B08017g9483D95296A24891B1214a20223A89789l2538L44544g5186r7651
15088a72837A41938n7058P7800A3833d1454j36709B29712c0314H9850J6144g6933
15076B54709L0173A02078C1671h9641A05939M4790L68181B59170m6039B0679a43094
15064I7388c3343A01330C1524J93835J11376R8728A87985a8251E12000j32405
15054C79595e2203B867Q9062L700J4726l3320K7533N251a01875D16336r2729a50396
15041A57038d4590A27338J11981J66916i7465D1148i9036A84161K46744A5707
$$ plain form
15030 91635 418277 304894 307340 57785 188272 266009 -85366 6475 149562 110870 -46178
15018 428398 84531 457347 104441 41490 273932 191384 113129 349874 -100959 342998
15007 -17595 539807 192414 388937 197450 -24975 -55848 444296 457642 289113 402272
14997 402272 -40857 -68075 304105 68260 103025 52495 425386 188185 353579 501450
14987 501450 259621 138441 373432 108972 601038 610284 290938 420615 -129141 277945
14976 332392 -71630 349301 154004 350204 395819 -3524 -45671 251021 52382 369638 252486
14965 252486 546924 113252 351096 417011 -36360 464091 477583 -18654 478097 168133
14954 117649 374461 512398 128326 323095 188369 321339 200701 400006 -212034 86685
$$ packed form
15030I1635L26642j13383K446E7785J30487P7737h5366F475J43087l8692d6178
15018D28398H4531L72816A04441D1490K32442q2548p8255K36745a00959C42998
15007a7595E39807A92414J96523j91487b4975l0873D44296J3346j68529J13159
14997D02272d0857k7218C04105F8260L4765n0530L72891A88185J65394J47871
14987E01450k41829j21180K34991A08972M92066R246B90938J29677a29141B77945
14976C32392g1630C49301A54004J96200M5615c524m2147B51021E2382L17256j17152
14965B52486K94438A13252K37844O5915c6360D64091J3492a8654D78097A68133
14954A17649K56812J37937A28326J94769j34726J32970j20638J99305b12034H6685
$$ plain form
14943 56261 386498 124940 457210 583566 -7633 115965 449421 174537 540213 507295
14933 507295 14138 258628 208843 490751 142317 15011 433530 170800 219590 416596
14923 416596 183786 459388 208278 182463 354514 390012 225851 193214 165346 200825
14913 200825 535449 228236 262690 320323 283726 223694 448213 443285 255099 276972 366682
14902 366682 177407 103868 268925 433830 527793 170244 446412 250503 60410 208951
14892 208951 172615 46264 152376 532915 260371 323148 673894 320743 507664 209843
14881 365817 601941 208471 152851 454947 297730 536417 249513 416531 262833 371235
14871 371235 300964 424259 856986 638208 369638 222696 366933 308183 413982 422192
$$ packed form
14943E6261L30237A24940L32270J26356g633A15965L33456A74537L65676l2918
14933E07295A4138K44490m9785K81908A42317A5011M18519A70800M8790J97006
14923D16596A83786K75602B08278k5815J72051L5498j64161l2637k7868L5479
14913B00825L34624B28236L4454N7633l6597o0032K24519m928j88186K1873Q9710
14902C66682A77407p3539J65057J64905R3963A70244K76168j95909F0410J48541
14892B08951l6336D6264J06112L80539B60371O2777L50746C20743J86921B09843
14881C65817K36124B08471n5620L02096j57217K38687B49513J67018j53698J08402
14871C71235p0271J23295M32727k18778k68570j46942J44237n8750J05799Q210
$$ plain form
14861 422192 27896 200922 334809 496918 318866 459429 426854 254142 521991 293316
14851 293316 500686 433859 415628 101969 441515 333939 355796 178102 354364 282176
14841 282176 528653 115365 382361 231275 319297 530769 514390 75849 292730 482680
14831 482680 446692 326219 107005 33241 571298 819985 636233 397205 225495 676969
14821 676969 356085 642843 575797 704348 622915 619791 464349 529693 665586 625499 524760
14810 524760 751343 521657 627328 596392 342361 668487 765099 541329 900405 597689
14800 597689 410389 760702 654841 477095 400125 510115 558606 746605 528329 655001
14790 655001 465274 401095 466127 482080 554974 432216 585995 541844 700955 652940 230999
$$ packed form
14861D22192B7896J73026J33887J62109j78052J40563l2575j72712K67849k28675
14851B93316K07370o6827j8231A01969L39546j07576K1857j77694J76262p2188
14841B82176K46477A15365K66996j51086Q8022K11472j6379G5849K16881J89950
14831D82680l5988j20473A07005C3241N38057K48687j83752k39028j71710M51474
14821F76969l20884K86758o7046J28551q1433l124j55442O5344J35893m0087j00739
14810E24760K26583k29686J05671l0936k54031L26126R6612k23770L59076l02716
14800E97689j87300L50313j05861j77746p6970J09990M8491J87999k18276J26672
14790F55001j89727o4179O5032J5953P2894j22758J53779m4151J59111m8015B30999
$$ plain form
14778 410572 558314 495098 480640 759078 476875 910295 566270 386851 785973 417922
14768 417922 523099 624641 734153 413798 776244 858357 740624 835104 744819 769227
14758 769227 698884 902842 703900 491033 781975 622217 514130 717864 896591 724876
14748 724876 695946 501185 795827 555189 713075 724637 811250 1078214 933691 364618
14737 741480 751100 765994 879479 651119 912233 1006123 780935 612102 557352 691947
14727 691947 552102 907219 715910 289389 850523 845046 754104 600091 781312 1025501
14717 1025501 1104927 826567 731810 627658 948283 898417 900099 529358 744798 871795
14707 871795 799958 1009078 1040396 963937 711959 1058525 899176 877166 998068 742389
$$ packed form
14778D10572J47742o3216j4458K78438k82203M33420l44025j79419L99122l68051
14768D17922J05177J01542J09512l20355L62446Q2113j17733R4480r0285K4408
14758G69227p0343K03958j98942k12867K90942j59758j08087K03734J78727j71715
14748G24876k8930j94761K94642k40638J57886J1562Q6613K66964j44523C64618
14737G41480R620J4894J13485k28360K61114R3890k25188j68833n4750J34595
14727F91947j39845L55117j91309B89389N61134n477r0942j54013J81221K44189
14717A025501P9426k78360r4757j04152L20625m9866J682l70741K15440J26997
14707H71795p1837K09120L1318p6459k51978L46566j59349k2010J20902k55679
$$ plain form
14697 742389 975187 594646 987200 1178289 1030467 934505 1206548 1077899 784598 1213907
14687 1213907 1013473 1229156 745991 1148782 890808 810491 1436822 1108469 900721 1252916
14677 1252916 1330579 1019957 1062973 986779 1080098 1025380 1280232 1278401 810374 1037141 796123
14666 796123 1150427 1444513 1146538 985054 1008478 1197929 1089140 945077 1184586 1088253
14656 1088253 1173445 1041912 1317576 1438753 1175608 1127974 775738 1258789 1109914 1143953
14646 1143953 1064720 1273737 1541284 1245856 1125809 1517833 1476453 1265929 1022486 1435050
14636 1435050 1254585 1497933 1163980 1465898 1335061 1467087 1164621 1339507 1177312
14627 1177312 1352889 1405273 1396167 1401887 1049857 1265561 1448551 1532990 1915269 1560098
$$ packed form
14697G42389K32798l80541L92554J91089j47822r5962K72043j28649k93301M29309
14687A213907k00434K15683m83165M02791k57974q0317O26331l28353k07748L52195
14677A252916P7663l10622M3016p6194R3319n4718K54852j831m68027K26767k41018
14666G96123L54304K94086k97975j61484K3424J89451j08789j44063K39509r6333
14656A088253Q5192j31533K75664J21177k63145m7634l52236M83051j48875L4039
14646A143953p9233K09017K67547k95428j20047L92024m1380k10524k43443M12564
14636A435050j80465K43348l33953L01918j30837J32026l02466J74886j62195
14627A177312J75577N2384r106N720l52030K15704J82990Q4439L82279l55171
$$ plain form
14617 1560098 1480520 1704182 1580464 1762823 1587606 1630318 1449236 1872999 1512240 1499388
14607 1499388 1662898 1581928 1447167 1415373 1711501 2006743 1547837 1551413 1940552 1740488
14597 1740488 1664659 1637482 1799969 1654838 1603417 1749836 2244579 1926041 1919597 2101966
14587 2101966 2170441 1956499 1889375 2211985 2172552 2275629 1918481 2168862 1818555 2375886
14577 2375886 2310575 2021748 2349044 2306947 2090235 2110846 2392741 2601200 2055474 2640037
14567 2640037 2281184 2234897 2562041 2430082 2745493 2720887 2725380 2846261 3076344 3120224
14557 3120224 2951280 3854590 3678052 3720646 4243558 4609475 5174919 6198979 8157179
14548 8157179 11838556 21019194 34994586 44084233 27955685 11944201 5933268 3739935
$$ packed form
14617A560098p9578K23662j23718J82359j75217M2712j81082M23763l60759j2852
14607A499388J63510q0970j34761l1794K96128K95242m58906L576L89139k00064
14597A740488p5829k7177J62487j45131n1421J46419M94743l18538o444J82369
14587B101966O8475k13942o7124L22610l9433J03077l57148K50381l50307N57331
14577B375886o5311k88827L27296m2097k16712K0611K81895K08459n45726N84563
14567B640037l58853m6287L27144j31959L15411k4606M493J20881K30083M3880
14557C120224j68944R03310j76538M2594N22912L65917N65444J024060J958200
14548H157179L681377R180638J3975392R089647j6128548A1944201E933268k193333
$$ plain form
14540 3739935 2351428 2272343 1753891 1926795 1946314 2234872 1921537 2044266 2338929 2326511
14530 2326511 2269388 2085733 2324668 2608067 2216281 2726545 2703878 2345347 2430527 2643322
14520 2643322 2862652 2270428 2673082 2605521 2629982 3001669 2633587 2729434 2648625 2919366
14510 2919366 3024652 3028462 3218761 3197026 3033291 3405523 3048566 3226745 3358572 3335337
14500 3335337 3245829 3214929 3340434 3148943 3521188 3624340 3641593 3974803 3754215 3329040
14490 3329040 3563940 3357824 3922844 3792602 3875166 3674448 3732744 4067807 4119353 3975245
14480 3975245 3975815 4295514 4312387 4243066 4421619 4512284 4556644 4007510 4757839 4436741 4735130
14469 4735130 4579863 4539445 4909394 4791571 4968085 5177960 5029359 5364724 5343980 5074344
$$ packed form
14540C739935j388507p9085n18452J72904J9519K88558l13335J22729K94663j2418
14530B326511n7123j83655K38935K83399l91786N10264k2667l58531Q5180K12795
14520B643322K19330n92224M02654o7561K4461L71687l68082R5847q0809K70741
14510B919366J05286L810J90299k1735j63735L72232l56957J78179J31827k3235
14500C335337q9508l0900J25505j91491L72245J03152J7253L33210k20588m25175
14490C329040K34900k06116N65020j30242Q2564k00718N8296L35063N1546j44108
14480C975245N70L19699J6873o9321J78553R0665M4360n49134P50329l21098K98389
14469D735130j55267m0418L69949j17823J76514K09875j48601L35365k0744k69636
$$ plain form
14459 5074344 4915639 5504127 5335002 5179816 5594779 5664759 5645396 5340329 5422533 5296913
14449 5296913 5853628 6036591 5733080 6061024 6156575 6160295 6277507 6393104 6401916 6669032
14439 6669032 6731094 6838106 6516338 6806946 7055628 6802342 7182749 7330292 7298636 7695614
14429 7695614 7683346 7328311 7740577 7953956 7819279 8311929 8697364 8248081 8577960 8479135
14419 8479135 8754671 8462332 9216921 8899907 9031346 9160245 9575700 9484857 9347857 9700284
14409 9700284 9991700 9910334 10313369 9962166 10322285 10644613 10763437 11340036 11073285 11228768
14399 11228768 11366050 11508657 11656114 12348504 12102936 12289451 12461306 13004053 12948191
14390 12948191 12983151 13970018 13786757 13756864 14164070 14549960 14709221 15164623 15325825 15641476
$$ packed form
14459E074344j58705N88488j69125j55186M14963O9980j9363l05067Q2204j25620
14449E296913N56715J82963l03511L27944R5551L720J17212J15597Q812K67116
14439F669032O2062J07012l21768K90608K48682k53286L80407J47543l1656L96978
14429G695614j2268l55035M12266K13379j34677M92650L85435m49283L29879r8825
14419H479135K75536k92339P54589l17014J31439J28899M15455r0843j37000L52427
14409I700284K91416q1366M03035l51203L60119L22328J18824N76599k66751J55483
14399A1228768J37282J42607J47457O92390k45568J86515J71855N42747n5862
14390A2948191L4960R86867j83261k9893M07206L85890J59261M55402J61202L15651
$$ plain form
14380 15641476 15892026 16171986 16432121 16668704 16751349 17360676 17382482 17973676 18302231 18688422
14370 18688422 19049274 19574899 20017389 20217093 20987256 21344041 21488468 22024851 22383139
14361 22383139 22513860 23347294 24054147 24354061 25101864 25696957 26343140 26811960 27515306
14352 27515306 27968942 28704007 29559982 30152285 30699666 31586718 32676804 33542491 34670582
14343 34670582 35201246 35766400 36958281 38066534 39113671 40139060 41456838 42272854
14335 42272854 43554638 45077729 46560031 47365732 49297231 50630402 51741810 53956623
14327 53956623 55717938 57384489 59457853 61318591 63663130 65533804 67980186 70475783
14319 70475783 73043818 75625689 78447083 81373250 84171749 87689907 90746484 94923126
$$ packed form
14380A5641476K50550K79960K60135K36583Q2645O09327K1806N91194L28555L86191
14370A8688422L60852N25625M42490J99704P70163L56785J44427N36383L58288
14361B2383139J30721Q33434P06853K99914P47803N95093O46183M68820P03346
14352B7515306M53636P35065Q55975N92303N47381Q87052J090086Q65687J128091
14343C4670582N30664N65154J191881J108253J047137J025389J317778Q16016
14335D2272854J281784J523091J482302Q05701J931499J333171J111408K214813
14327E3956623J761315J666551K073364J860738K344539J870674K446382K495597
14319G0475783K568035K581871K821394K926167K798499L518158L056577M176642
$$ plain form
14311 94923126 98362265 102235535 106669976 111616334 116033436 121146928 126475654 131803181
14303 131803181 137772077 144011641 150679761 157716177 165384572 172889284 181211154 189971254
14295 189971254 199393816 208855516 218975823 230163870 241230541 252829765 265088885
14288 265088885 277892777 290885372 304528638 318237779 332467866 347392806 362034862
14281 362034862 376909476 391176751 405464070 419234789 432407953 444232123 454967103
14274 454967103 464237927 470664832 473411896 472234226 470317488 470853381 469717825 466375565
14266 466375565 461048063 452460676 441884044 429983203 416167050 401595657 386256073
14259 386256073 370305141 354520303 338726403 323330849 309209999 294790843 280546219
$$ packed form
14311I4923126L439139L873270M434441M946358M417102N113492N328726N327527
14303A31803181N968896O239564O668120P036416P668395P504712Q321870Q760100
14295A89971254R422562R461700J0120307J1188047J1066671J1599224J2259120
14288B65088885J2803892J2992595J3643266J3709141J4230087J4924940J4642056
14281C62034862J4874614J4267275J4287319J3770719J3173164J1824170J0734980
14274D54967103R270824O426905K747064j177670j916738N35893j135556l342260
14266D66375565n327502q587387j0576632j1900841j3816153j4571393j5339584
14259C86256073j5950932j5784838j5793900j5395554j4120850j4419156j4244624
$$ plain form
14252 280546219 266975245 253878170 241631163 230084473 218601469 208229030 198396804
14245 198396804 188904488 180091668 172014242 163631687 156019242 149042437 142463615 136253871
14237 136253871 130816045 125249285 119866591 114593681 109845466 105541568 101668460 97908930
14229 97908930 93383355 89857617 86553478 83294605 80303459 77641186 74470705 72258599
14221 72258599 69539853 67451675 65031502 62639636 60775311 58948831 56895105 55332990
14213 55332990 53904767 52240836 50319491 48723766 47403527 46119383 45354290 44527904
14205 44527904 42715291 41475740 40637850 39017730 38295996 37612538 36373387 35270704
14197 35270704 34656697 33383098 32775752 32083010 31155461 30303274 29549491 28852257 28250898
$$ packed form
14252B80546219j3570974j3097075j2247007j1546690j1483004j0372439r832226
14245A98396804r492316q812820q077426q382555p612445o976805o578822o209744
14237A36253871n437826n566760n382694n272910m748215m303898l873108l759530
14229I7908930m525575l525738l304139l258873k991146k662273l170481k212106
14221G2258599k718746k088178k420173k391866j864325j826480k053726j562115
14213E5332990j428223j663931j921345j595725j320239j284144p65093q26386
14205D4527904j812613j239551q37890j620120p21734o83458j239151j102683
14197C5270704o14007j273599o07346o92742r27549q52187p53783o97234o01359
$$ plain form
14188 28250898 27360336 26701821 26164726 25608278 25149047 24746891 23878226 23467474 23167441
14179 23167441 22328307 22250976 21231026 20943776 20936025 20277696 20018307 19647900 18969409 18765191
14169 18765191 18655936 18344665 17698403 17743833 16831397 16862133 16569468 16327260 16119623 15267631
14159 15267631 15300542 15414287 15072044 14614704 14647596 13842492 13738742 13670716 13440294 13127915
14149 13127915 12982197 12870789 12676462 12544460 12201059 12325327 11806235 11307685 11378411
14140 11378411 11080411 10724741 10821129 10548333 10390009 10488408 10328410 9820707 9861374 9721387
14130 9721387 9738327 9560155 9352469 9185303 8858284 9149052 9208387 9038669 8581663 8578718
14120 8578718 8409869 8409343 8357720 8093807 7849549 7786133 7800211 7603503 7388265 7173468
$$ packed form
14188B8250898q90562o58515n37095n56448m59231m02156q68665m10752l00033
14179B3167441q39134p7331j019950k87250p751o58329k59389l70407o78491k04218
14169A8765191j09255l11271o46262M5430r12436L0736k92665k42208k07637q51992
14159A5267631L2911J13745l42243m57340L2892q05104j03750o8026k30422l12379
14149A3127915j45718j11408j94327j32002l43401J24268n19092m98550P0726
14140A1378411k98000l55670R6388k72796j58324R8399j59998n07703M0667j39987
14130I721387J6940j78172k07686j67166l27019K90768N9335j69718m57006k945
14120H578718j68849n26n1623k63913k44258o3416J4078j96708k15238k14797
$$ plain form
14110 7173468 7444046 7260695 7187451 7049819 6642707 7201269 7174695 6874095 6637536 6613870
14100 6613870 6120903 6501690 6571305 6003572 6121488 6219819 6330187 5917328 6139145 6059267
14090 6059267 5776360 5626472 5455821 5708599 5526720 5385701 5965281 5436793 5328090
14081 5328090 5227873 5566224 4984339 5095988 4790432 4825264 4882147 4858425 4631724 4456493
14071 4456493 4658587 4856843 4456657 4763879 4587190 4365987 4246396 4550441 4474213 4223038
14061 4223038 4059400 4254229 4567201 4122060 4408542 4191804 3990021 4057975 3848215 4101581
14051 4101581 3745580 3775025 3580763 3457511 3745104 3777450 3405752 3550321 3483016 3566721
14041 3566721 3627524 3488444 3424155 3567040 3288680 3182431 3699629 3217099 3310431 3625910
$$ packed form
14110G173468K70578j83351p3244j37632m07112N58562k6574l00600k36559k3666
14100F613870m92967L80787O9615n67733J17916R8331J10368m12859K21817p9878
14090F059267k82907j49888j70651K52778j81879j41019N79580n28488j08703
14081E328090j00217L38351n81885J11649l05556L4832N6883k3722k26701j75231
14071D456493K02094J98256m00186L07222j76689k21203j19591L04045p6228k51175
14061D223038j63638J94829L12972m45141K86482k16738k01783O7954k09760K53366
14051D101581l56001K9445j94262j23252K87593L2346l71698J44569o7305Q3705
14041C566721O0803j39080o4289J42885k78360j06249N17198m82530R3332L15479
$$ plain form
14031 3625910 3457430 3320657 3546207 3167818 3415404 3000814 3370598 3232702 3297704 3053439
14021 3053439 2674252 3002323 2838341 2660431 2600368 2802258 2717185 2652987 2764184 2729251
14011 2729251 2719204 2646393 2928965 2711414 2446385 2603512 2479024 2225841 2708549 2755369
14001 2755369 2512893 2635818 2563971 2379594 2524184 2685211 2473540 2732656 2605958 2451665
13991 2451665 2640196 2950882 4128593 7074358 14198526 28453772 41646589 31370725
13983 31370725 16780541 10102288 7094107 5471965 4837487 4221620 4050361 3533338
13975 3533338 2958909 3537021 2902678 2804366 2916197 2703790 3107227 2780569 2492938 2594667
13965 2594667 2537893 2686689 2487505 2259061 2215265 2549786 2171592 2402392 2201704 2300665
$$ packed form
14031C625910j68480j36773K25550l78389K47586m14590L69784j37896O5002k44265
14021C053439l79187L28071j63982j77910o0063K01890q5073o4198J11197l4933
14011B729251j0047p2811K82572k17551k65029J57127j24488k53183M82708M6820
14001B755369k42476J22925p1847j84377J44590J61027k11671K59116j26698j54293
13991B451665J88531L10686J177711K945765P124168J4255246J3192817j0275864
13983C1370725j4590184o678253l008181j622142o34478o15867j71259n17023
13975C533338n74429N78112o34343r8312J11831k12407M03437l26658k87631J01729
13965B594667n6774J48796j99184k28444m3796L34521l78194K30800k00688R8961
$$ plain form
13955 2300665 2184081 1830491 2208116 2175481 2243455 2154019 2197146 2221431 2186459 2134727 2063017
13944 2063017 2053268 2060413 1779478 1993880 2060262 2122765 2132571 2061122 2048416 1932034 2152757
13933 2152757 2148875 1857656 1850664 2259004 1769835 1831269 1703010 1980486 1836553 1614607
13923 1614607 1929269 1788839 1634161 1655517 1783676 1769331 1937719 1927019 1407620 1513592
13913 1513592 1717994 1441388 1765068 1388680 1596815 1449430 1920456 1502383 1462525 1277681
13903 1277681 1437465 1529587 1738671 1568163 1564839 1139985 1304822 1450669 1568527 1410094
13893 1410094 1226971 1280658 1182754 1456073 1028773 1489302 1323743 1336426 1493436 1290964
13883 1290964 1343077 1086491 1358009 1246062 873612 1163108 1419898 1619360 1014487 1424296
$$ packed form
13955B300665j16584l53590L77625l2635O7974q9436M3127K4285l4972n1732p1710
13944B063017r749P145k80935K14402O6382O2503R806p1449j2706j16382K20723
13933B152757l882k91219o992M08340m89169O1434j28259K77476j43933k21946
13923A614607L14662j40430j54678K1356J28159j4345J68388j0700n19399J05972
13913A513592K04402k76606L23680l76388K08135j47385M71026m18073l9858j84844
13903A277681J59784R2122K09084j70508l324m24854J64837J45847J17858j58433
13893A410094j83123N3687r7904K73319m27300M60529j65559J2683J57010k02472
13883A290964N2113k56586K71518j11947l72450K89496K56790J99462o04873M09809
$$ plain form
13873 1424296 989952 1199790 1195048 1131117 1041236 1278045 1315533 933881 1097124 1442599
13863 1442599 1417311 1175502 1158821 1183701 1328636 1051036 1108854 1137950 1237499 1414705
13853 1414705 1126886 968067 1428723 1141615 1075637 1104263 1002853 1091255 1222512 1288810
13843 1288810 1059603 1024350 1459253 1035142 803399 1166376 993057 1341386 1001982 879493
13833 879493 1143841 1104889 720062 1345482 1212439 927833 882483 1137404 1099971 705020
13823 705020 1178235 901395 827833 940729 897927 987737 536507 1095889 820336 1057726
13813 1057726 658205 1110611 973005 746472 715017 788494 756375 983638 905121 1097748
13803 1097748 928226 1066644 782156 792362 828488 892485 833699 665541 1001892 773586
$$ packed form
13873A424296m34344K09838m742o3931q9881K36809L7488l81652J63243L45475
13863A442599k5288k41809j6681K4880J44935k77600N7818K9096R9549J77206
13853A414705k87819j58819M60656k87108o5978K8626j01410Q8402J31257O6298
13843A288810k29207l5253M34903m24111k31743L62977j73319L48329l39404j22489
13833H79493K64348l8952l84827O25420j33043k84606m5350K54921l7433l94951
13823G05020M73215k76840p3562J12896m2802Q9810m51230N59382k75553K37390
13813A057726l99521M52406j37606k26533l1455P3477l2119K27263p8517J92627
13803A097748j69522J38418k84488J0206L6126O3997n8786j68158L36351k28306
$$ plain form
13793 773586 1003076 894034 1143672 918644 703008 1004602 1047387 1108675 766794 470741
13783 470741 958520 987512 869051 721043 885645 813427 791238 847355 916014 1095632
13773 1095632 687516 938863 823908 607536 677081 426644 946421 447310 765074 856373
13763 856373 720650 552986 723487 615104 728809 499233 536830 350221 737553 717983
13753 717983 720317 712137 745311 413464 1163308 432413 749448 728861 808665 555119 765063
13742 765063 650515 916709 543330 873257 596732 793315 628350 572855 672504 551816
13732 551816 463316 586603 838529 596589 713423 399892 738520 741725 696675 682912
13722 682912 975559 669434 742780 505417 470821 450509 713210 655486 740449 860482
$$ packed form
13793G73586K29490j09042K49638k25028k15636L01594M2785O1288l41881k96053
13783D70741M87779K8992j18461j48008J64602p2218k2189N6117O8659J79618
13773A095632m08116K51347j14955k16372O9545k50437N19777D47310L17764R1299
13763H56373j35723j67664J70501j08383J13705k29576L7597j86609L87332j9570
13753G17983K334q180L3174l31847P49844D32413L17035k0587P9804k53546K09944
13742G65063j14548K66194l73379L29927k76525J96583j64965n5495R9649j20688
13732E51816q8500J23287K51926k41940J16834l13531L38628L205m5050j3763
13722F82912K92647l06125P3346k37363l4596k0312K62701n7724Q4963J20033
$$ plain form
13712 860482 538356 440183 590599 589215 442001 829124 691671 641705 639898 473402 319637
13701 319637 751359 422152 490847 527912 736852 394757 525361 777519 556806 667036
13691 667036 497971 511676 739241 443253 581508 839030 337272 512393 652751 647459
13681 647459 591417 523812 973597 705405 758607 375011 933486 434356 360053 258963
13671 258963 630911 310707 439980 565556 450163 769621 562954 578487 441831 497146
13661 497146 666610 537425 332561 321504 560218 272917 303035 394024 519872 285767
13651 285767 414116 112119 374786 302534 780831 447956 951533 560271 812132 503677
13641 503677 678053 290769 523913 336879 730822 256419 457137 226994 395958 481062
$$ packed form
13712H60482l22126r8173J50416j384j47214L87123j37453m9966j807j66496j53765
13701C19637M31722l29207O8695L7065K08940l42095J30604K52158k20713J10230
13691F67036j69065J3705K27565k95988J38255K57522C37272J75121J40358n292
13681F47459n6042o7605M49785k68192N3202C75011N58475D34356p4303j01090
13671B58963L71948C10707J29273J25576j15393L19458k06667J5533j36656N5315
13661D97146J69464j29185k04864j1057K38714B72917L0118R0989J25848k34105
13651B85767J28349A12119K62667p2252M78297l32875N03577l91262K51861l08455
13641E03677J74376B90769K33144j87034L93943B56419K00718B26994J68964Q5104
$$ plain form
13631 481062 426506 333177 627305 212121 -51384 647334 580194 485030 281274 284766 356440
13620 356440 214047 749041 395898 360215 343260 151232 532424 522830 237099 331930
13610 331930 327045 316424 570926 528605 659552 262813 462462 222579 582387 30887
13599 232891 756987 315142 207355 501149 102208 368704 587851 456778 218323 242671
13589 242671 506572 337258 357168 486590 592799 39952 570683 437547 440342 327962
13579 327962 833056 414705 172768 792140 330796 368455 96600 186598 571128 648380
13569 648380 22574 378046 471244 383666 531255 468835 427432 375178 711209 546419 776116
13558 776116 238283 176922 285035 575023 156689 26312 492300 314487 349529 285474
$$ packed form
13631D81062n4556r3329K94128B12121e1384F47334o7140r5164k03756L492P1674
13620C56440j42393N34994l53143l5683j6955A51232L81192r594B37099R4831
13610C31930m885j0621K54502m2321J30947B62813J99649B22579L59808C0887
13599B32891N24096C15142j07787K93794A02208K66496K19147j31073B18323K4348
13589B42671K63901j69314J9910J29422J06209C9952N30731j33136K795j12380
13579C27962N05094D14705A72768O19372C30796L7659I6600Q9998L84530P7252
13569F48380B2574L55472R3198q7578J47589o2420m1403n2254L36031j64790K29697
13558G76116B38283o1361J08113K89988A56689B6312M65988j77813L5042o4055
$$ plain form
13548 285474 177289 270921 463732 433691 -19553 385456 64256 437916 609949 352249
13538 352249 362842 546080 141058 225407 259238 71829 509148 294888 470840 138096
13527 415362 648623 586954 411107 522567 189375 398399 131686 243888 -99886 236697
13516 188515 98484 476607 346181 450824 201351 216548 615598 406837 586003 216212
13505 159779 410925 111678 129269 249474 211984 414434 290069 -281811 71193 216851
13495 216851 190875 166083 463733 492400 250820 108398 179710 498169 82930 340955
13485 340955 77121 95914 171853 364396 -28099 257322 -6583 211335 446037 -50483 476642
13473 227635 261105 246513 222384 84770 337631 184710 381741 720022 496649 328325
$$ packed form
13548B85474j08185R3632J92811l0041a9553C85456F4256L73660J72033k57700
13538C52249J0593J83238A41058Q4349L3831G1829M37319k14260J75952A38096
13527D15362K33261o1669j75847J11460A89375K09024A31686J12202i9886B36697
13516A88515r0031L78123j30426J04643B01351J5197L99050k08761J79166B16212
13505A59779K51146A11678J7591J20205l7490K02450j24365b81811G1193J45658
13495B16851k5976k4792K97650K8667k41580A08398P1312L18459H2930K58025
13485C40955G7121J8793P5939J92543b8099B57322f583B11335K34702e0483D76642
13473B27635L3470j4592k4129H4770K52861j52921J97031L38281k23373j68324
$$ plain form
13463 328325 416337 139299 15317 342923 -275937 243011 -14176 427454 346952 247286
13453 247286 22321 243014 -64500 217809 441159 144192 371438 329604 580512 387661
13443 387661 181076 319185 129077 251175 223601 561928 178635 407768 52420 115618
13433 115618 96577 350926 444592 150130 362634 35250 247031 436184 6254 -9399 201729
13421 136365 319644 147450 582037 -26680 286084 44103 279131 265925 236574 417010
13411 417010 329165 255506 139738 185385 -101876 230017 34038 -55878 352605 222635
13401 222635 139623 168769 139984 101670 231286 -115936 180396 -96497 360198 134065
13390 84754 276964 90834 20096 73484 -70518 224915 131591 -55527 144874 345523 198954
$$ packed form
13463C28325Q8012A39299A5317L27606b75937B43011a4176D27454q0502r9666
13453B47286B2321K20693f4500B17809K23350A44192K27246m1834K50908j92851
13443C87661A81076J38109A29077J22098k7574L38327A78635K29133E2420O3198
13433A15618j9041K54349R3666A50130K12504C5250K11781J89153F254i399B01729
13421A36365J83279A47450M34587b6680B86084D4103K35028j3206k9351J80436
13411D17010q7845p3659j15768M5647a01876B30017C4038e5878C52605j29970
13401B22635q3012K9146k8785l8314J29616a15936A80396i6497C60198A34065
13390H4754J92210I0834B0096N3388g0518B24915r3324e5527A44874K00649j46569
$$ plain form
13379 198954 213921 325355 96146 476871 79053 109750 284819 245060 495052 313633
13369 313633 260535 376857 408206 145446 312466 304568 206352 369145 108712 337014
13359 337014 55294 118629 351288 -22248 415863 111898 269402 210939 326900 17534
13348 363835 344589 499563 184135 121902 -17456 220288 450431 323711 134676 527338
13338 527338 146209 447372 136882 218140 392937 -18981 -155886 -94504 272630 516856
13328 516856 366677 174065 264287 234144 217938 104192 380252 400461 340664 433782 251111
13317 251111 125917 209142 165548 186396 77722 517000 217714 299750 50873 62665 398689
13306 398689 327372 268894 550555 159525 182260 284040 347071 -39949 16706 16833 98587
$$ packed form
13379A98954J4967J11434I6146L80725G9053L0697J75069l9759K49992j81419
13369C13633n3098J16322L1349A45446J67020p898r8216J62793A08712K28302
13359C37014E5294O3335K32659b2248D15863A11898J57504n8463J15961A7534
13348C63835j9246J54974A84135o2233a7456B20288K30143j26720A34676L92662
13338E27338A46209L01163A36882Q1258J74797a8981j36905O1382B72630K44226
13328E16856j50179A74065R0222l0143j6206A04192K76060K0209n9797R3118j82671
13317B51111j25194Q3225m3594K0848G7722M39278B17714Q2036E0873J1792L36024
13306C98689p1317n8478K81661A59525K2735J01780O3031c9949A6706J27Q1754
$$ plain form
13295 98587 -13778 -27451 -77252 -17756 241635 510610 73634 120092 318 117198 -210746
13283 312183 270594 -268551 364522 -167117 -70102 -85454 388794 280756 84340 436173
13273 436173 136118 35275 473188 445607 18776 136531 288264 -124781 154164 85454
13263 85454 -167356 203800 264731 169018 318636 425109 145886 -140285 248337 26877
13252 -286720 -57659 375667 249327 154676 -145753 286125 67028 103368 -18043 441192
13241 101743 49940 277887 189568 191521 -79255 -58721 -36906 -75968 -34429 350707 -5912
13229 173277 -126064 -257536 54688 348251 -187115 -18145 160723 23501 157697 83104
13219 83104 289956 206762 -27495 49327 151166 109402 139830 259916 39489 -120375 50946
$$ packed form
13295I8587a3778j3673m9801a7756B41635K68975G3634M6458C18J16880b10746
13283C12183m1589b68551C64522a67117g0102j5352C88794j08038H4340L51833
13273D36173A36118C5275M37913k7581A8776J17755J51733a24781A54164o8710
13263H5454a67356B03800O0931r5713J49618J06473A45886a40285B48337B6877
13252b86720e7659C75667j26340r4651a45753B86125F7028L6340a8043D41192
13241A01743D9940K27947q8319J953g9255K0534K1815l9062c4429C50707e912
13229A73277a26064j31472E4688K93563a87115a8145A60723B3501J34196p4593
13219H3104K06852q3194b7495D9327J01839m1764L0428J20086C9489a20375E0946
$$ plain form
13207 148267 124573 -49920 -381910 109915 22408 309424 143927 146837 49059 106676 104222
13196 104222 56585 266577 -82255 478423 232345 127516 -85269 153851 247387 209441
13186 209441 62853 166788 -51164 8171 230809 -248464 225484 -52839 65215 19585 104192
13175 104192 65419 47233 55669 21619 124966 -32261 102739 18190 135011 328861 301044
13164 301044 157159 -943 -140152 262070 89877 30898 372082 8837 413183 -157440 99758
13152 -29365 -105014 243407 371434 160152 298716 -26427 -215529 91556 313472 372207
13142 372207 346925 309296 23895 18387 183596 89345 -94648 65736 306590 203934 -132819
13130 131188 148749 139265 225831 25584 -419409 -26071 392256 138463 218988 158009 77001
$$ packed form
13207A48267k3694d9920l31990A09915B2408K87016A43927K910D9059N7617k454
13196A04222m7637K09992h2255D78423B32345j04829h5269A53851R3536l7946
13186B09441F2853J03935e1164H171K22638b48464B25484e2839F5215A9585Q4607
13175A04192l8773j8186Q436B1619J03347c2261A02739A8190J16821J93850k7817
13164C01044j43885i43j39209B62070H9877C0898L41184H837M04346a57440I9758
13152b9365p5649B43407J28027A60152J38564b6427j89102I1556K21916N8735
13142C72207k5282l7629B3895n508J65209H9345i4648F5736K40854j02656a32819
13130A31188J7561r484Q6566B5584d19409b6071C92256A38463Q0525o0979G7001
$$ plain form
13118 217661 64476 4983 237773 224490 -50124 -54194 -54381 -101052 33039 140787 6363 -82908
13105 -77118 -161573 213431 65052 219717 -17649 -22259 -103567 329678 246495 224539 57828
13093 63408 -140510 216071 81697 -42089 -93953 -20585 -93479 -105305 -225684 344871 67500
13081 103970 122071 59941 -175505 24403 115195 228390 -69348 400434 -121294 -226975
13071 -226975 -226281 27262 216613 158494 207163 343541 295490 -25651 365258 74332 73661 -200922
13058 88522 365369 143318 122437 -11185 266936 297573 -156449 96134 93651 75238 64632
13047 64632 140724 344063 20985 -32633 -17354 75645 196914 58534 32145 199786 -24947
13035 39708 199680 6023 -160490 559022 -207449 12564 223936 -3561 115661 -80097 9410
$$ packed form
13118B17661F4476D983K32790j3283e0124m070j87m6671C3039J07748F363h2908
13105g7118q4455B13431F5052J54665a7649m610q1308C29678q3183k1956E7828
13093F3408a40510B16071H1697d2089n1864b0585p2894j1826j20379C44871F7500
13081A03970J8101E9941a75505B4403R0792J13195f9348D00434a21294j05681
13071b26975O94B7262J89351n8119M8669J36378m8051b5651C65258G4332o71b00922
13058H8522K76847A43318k0881a1185B66936L0637a56449I6134k483j8413j0606
13047F4632P6092K03339B0985c2633J5279G5645J21269E8534k6389J67641b4947
13035C9708J59972F023a60490E59022b07449A2564K11372c561A15661h0097I410
$$ plain form
13023 319576 199464 16930 267471 -326350 -136893 326715 -230888 47564 111288 143093
13013 143093 -43797 294893 345250 -176400 92179 57210 136265 -104762 -41372 217667 223538
13002 223538 -112060 46080 110196 47707 -169502 257009 220940 40546 47386 -63642 232891
12990 326480 -166069 -63472 35885 494214 175811 -9255 35371 -135096 -67117 71036 94628
12979 94628 88315 264328 -115793 71193 68353 151071 -3654 -95074 13350 21244 -48215 277174
12966 -325962 87919 94737 128796 -128202 -171839 252535 -15457 255701 -168444 -107187 -278164
12955 -278164 58490 9819 169028 249572 210008 75367 332526 46335 -171616 -351331 -34930
12943 154717 -64965 429829 -78006 162250 318554 148718 213711 -70312 282976 220163
$$ packed form
13023C19576j20112A6930K50541c26350a36893C26715b30888D7564O3724L1805
13013A43093d3797B94893N0357a76400I2179l4969P9055a04762d1372B17667N871
13002B23538a12060D6080O4116D7707a69502B57009l6069D0546O840f3642B32891
12990C26480a66069f3472C5885M58329A75811i255C5371a35096f7117G1036K3592
12979I4628o313J76013a15793G1193k840Q2718c654r1420A3350P894d8215B77174
12966c25962H7919O818L4059a28202m3637B52535a5457B55701a68444O1257j70977
12955b78164E8490I819J59209Q0544l9564G5367K57159D6335a71616j79715c4930
12943A54717f4965D29829g8006A62250J56304A48718O4993g0312B82976o2813
$$ plain form
12933 220163 -156203 188615 -282811 -58210 55906 219888 147054 56754 300933 259532
12923 259532 102300 -15635 141941 102273 193571 -332739 194905 -57144 291858 314928
12913 314928 291356 25926 196547 158918 -154412 -28319 59167 185648 -197405 -164909 292503
12901 -97609 86225 -392384 -168567 -250053 12816 -9170 329541 55938 21556 292692 25318
12889 -48331 177300 377112 -14176 194627 -16822 34664 -62779 147917 45509 142621 -243896
12877 136261 -23371 -128509 -122606 -80839 73150 45832 110450 98876 -210021 116908 -61209
12865 82092 -14875 -120718 172057 98857 42336 -39110 181311 218557 223368 176207 374602
12854 374602 -253981 -292891 80412 27886 255153 -246397 -209150 -82610 127585 -288250
$$ packed form
12933B20163a56203A88615b82811e8210E5906J63982p2834E6754K44179m1401
12923B59532A02300a5635A41941l9668R1298c32739A94905e7144B91858K3070
12913C14928k3572B5926J70621l7629a54412b8319E9167J26481a97405L2496B92503
12901i7609H6225c92384a68567q1486A2816i170C29541E5938B1556K71136B5318
12889d8331A77300J99812a4176A94627a6822C4664f2779A47917D5509R7112b43896
12877A36261b3371j05138N903M1767G3150k7318O4618j1574b10021A16908f1209
12865H2092a4875j05843A72057p3200D2336c9110A81311L7246M811m7161J98395
12854C74602b53981l8910H0412B7886K27267b46397L7247h2610A27585b88250
$$ plain form
12843 103073 -85297 126570 233685 444659 -68198 -182924 -28371 127390 -251191 126746
12832 238643 10738 111837 -187563 138317 148524 41715 188006 -79488 -221441 -7011 -50090
12821 -50090 187559 -44510 241871 147152 212090 77351 211096 -79261 49759 256027 163634
12810 163634 47208 -86198 45729 409366 -95630 127387 451504 17949 -267896 35251 -66112
12798 -132165 -95588 -91847 -99568 -175370 -209986 336942 -130804 122771 -220152 -74470 137540
12786 29095 -333467 2013 275655 -319074 121550 12539 96375 -35813 -14020 139748 -63053
12774 -242142 218804 -10323 -25263 -79159 112905 -152778 -208871 -35757 -261575 -214292 -215404
12763 -215404 26010 125386 280392 139071 -314123 4456 -41404 -188950 4674 -61786 262105
$$ packed form
12843A03073h5297A26570J07115K10974f8198j14726b8371A27390b51191A26746
12832B38643A0738J01099a87563A38317J0207D1715J46291g9488j41953g011m3079
12821e0090A87559d4510B41871r4719O4938G7351J33745g9261D9759K06268r2393
12810A63634D7208h6198D5729L63637i5630A27387L24117A7949b67896C5251f6112
12798a32165L6577L741p721p5802l4616C36942a30804A22771b20152g4470A37540
12786B9095c33467B013K73642c19074A21550A2539Q3836c5813a4020A39748f3053
12774b42142B18804a0323j4940n3896A12905a52778n6093c5757k25818M7283j112
12763b15404B6010R9376J55006A39071c14123D456d1404j47546D674f1786B62105
$$ plain form
12751 -163280 116531 206304 221824 -195442 -27579 -126376 68285 -109156 -256987 -222536 -8065
12739 -93775 31206 -139495 -82130 96362 -10638 255000 80924 990 389945 46184 -84761
12727 -50574 -26179 176665 -128605 308492 35924 91304 -93525 -10221 375457 287013 -32156
12715 293318 361125 146284 -311236 89857 2947 245275 949 69349 144425 280510 -141268
12703 4106 231930 265052 298227 86781 105214 105025 23735 164 33396 58086 148092 -81693
12690 -513682 249472 549177 -92466 7286 29890 150127 -68113 203490 -39845 32959 -233172
12678 37198 57223 36131 166169 102869 271159 52733 176761 -51419 87198 -191800 -96445
12667 -96445 250046 -155092 -76168 67823 -85133 -88310 -130027 -1283 -38996 43302 238215
$$ packed form
12751a63280A16531Q9773J5520a95442b7579r8797F8285a09156j47831L4451h065
12739i3775C1206a39495N7365I6362a0638B55000H0924I90L88955D6184h4761
12727e0574K4395A76665a28605C08492C5924N5380i3525a0221C75457q8444c2156
12715B93318O7807A46284c11236H9857B947K42328I49O8400P5076J36085a41268
12703D106K27824L3122L3175H6781J8433j89B3735A64L3232K4690R0006h1693
12690e13682B49472K99705i2466G286K2604J20237f8113B03490c9845C2959b33172
12678C7198K0025k1092J30038o3300J68290E2733J24028e1419H7198a91800R5355
12667i6445B50046a55092g6168F7823h5133l177m1717a283l7713D3302J94913
$$ plain form
12656 238215 225005 -3497 4229 147790 315293 343923 143428 -48165 -33348 -28414 -53396
12645 -53396 516248 145484 186235 -192303 47691 19318 -174837 -100268 514135 114629
12634 -13823 350267 -28855 -73877 2764 289049 173806 436770 239408 257146 12386 -7735
12622 253120 341849 -64313 258502 288107 -121800 202977 97896 158592 145700 -237148 127662
12610 24677 -20036 59483 -108893 -294600 -4061 88434 -15340 79546 220424 -84569 -151654
12599 -151654 286333 125760 558627 216593 -279719 -180345 7882 151596 153297 -114497
12588 10690 120576 -1205 -177337 80660 -33189 170103 -109283 -288703 365427 239156
12578 239156 151114 258130 -160596 85225 -11208 197538 212587 1283 231143 68233 -296389
$$ packed form
12656B38215j3210c497D229J43561J67503K8630A43428d8165J4817M934k4982
12645e3396E16248A45484M0751a92303D7691A9318a74837P4569E14135A14629
12634a3823C50267b8855m5022B764K86285j15243K62964j97362J7738A2386g735
12622B53120Q8729f4313B58502K9605a21800B02977I7896O0696j2892b37148A27662
12610B4677b0036E9483a08893j85707d061H8434a5340G9546J40878h4569o7085
12599a51654B86333A25760M32867B16593b79719R9374G882J43714J701a14497
12588A0690J09886a205j76132H0660c3189A70103a09283j79420C65427j26271
12578B39156q8042J07016a60596H5225a1208A97538J5049A283K29860F8233b96389
$$ plain form
12566 -69817 -173244 -52339 347433 -203409 248534 26760 -178000 177540 -40617 109063
12555 -145656 106617 289078 -31778 -8811 297691 103388 -366458 325278 -112558 -75854
12545 -75854 -143587 242902 -52346 -163380 -298360 130253 1431 -31957 21365 164075 325482
12534 325482 -39692 368214 252439 -91778 140376 112882 -154480 92528 55706 -118520
12523 -32274 113274 -102985 209468 -125354 -7474 132815 27959 -126505 -310928 -217313
12513 -217313 150745 -81690 -231537 -50411 -459144 381598 -118780 140499 223349 -193550
12502 53897 268996 111256 -65857 125989 77878 53109 -196335 205009 -51041 -122543 -60960
12490 -135546 -198870 423429 75815 29627 -195907 -204554 -84845 27615 25470 -101398 224578
$$ packed form
12566f9817j03427e2339C47433b03409B48534B6760a78000A77540d0617A09063
12555a45656A06617J82461c1778h811B97691A03388c66458C25278a12558L6704
12545g5854o7733B42902e2346j11034j34980A30253A431c1957B1365J42710J61407
12534C25482c9692C68214j15775i1778A40376k7494a54480I2528l6822a18520
12523c2274A13274a02985B09468a25354g474A32815B7959a26505j84423R3615
12513b17313A50745h1690j49847e0411m08733C81598a18780A40499Q2850a93550
12502E3897K15099A11256f5857A25989m8111k4769a96335B05009e1041p1502f0960
12490a35546o3324D23429G5815B9627a95907q647h4845B7615k145a01398B24578
$$ plain form
12478 -168961 -16725 -322495 10108 -169000 -56360 -173358 148538 83200 207801 1850 -169985
12466 -66128 -54841 -71555 -261678 -270028 449687 -45961 43906 -158131 38148 86027 244525
12455 244525 -334070 -31559 95175 64172 19744 101214 85163 -23649 -149972 -215661 93030
12443 7661 256320 278076 219559 185631 141553 -8333 -21114 245741 176566 87221 352721
12432 352721 93239 -24728 15698 105316 -271094 229210 -15173 34093 224437 45070 -27346
12420 -46768 -257888 -21152 25297 -65911 -198139 -80072 -364508 84633 -237115 207750 12752
12408 -86654 -6332 47412 -80276 19466 -120734 -58708 -121865 58265 -261992 132539 249281
12397 249281 35120 278604 -194476 -304710 -226108 -100936 -128913 321734 -66452 -118860
$$ packed form
12478a68961a6725l05770A0108a69000e6360j16998A48538o5338J24601A850a69985
12466f6128J1287j6714j90123q350D49687d5961D3906a58131C8148M7879J58498
12455B44525c34070c1559I5175l1003A9744Q1470j6051b3649j26323o5689I3030
12443G661K48659K1756n8517l3928m4078h333j2781B45741o9175H7221K65500
12432C52721I3239b4728A5698Q9618b71094B29210a5173C4093J90344D5070b7346
12420d6768k11120b1152B5297f5911j32228h0072k84436H4633b37115B07750A2752
12408h6654f332D7412h0276A9466a20734e8708o3157E8265b61992A32539J16742
12397B49281C5120K43484a94476j10234P8602a00936k7977C21734f6452n2408
$$ plain form
12387 -118860 182050 8396 129968 -108912 -205978 293104 43015 283146 -3969 37368 288139
12376 288139 -164967 171475 183062 -315477 129436 -33658 296494 -425202 -43330 70022
12365 149185 408266 -188285 -230701 -24955 86940 52641 -248384 41242 210454 320917
12355 320917 27364 254871 88669 -5822 -47830 107800 10574 -4611 177928 23100 -183501
12343 272976 -73156 68993 48153 254089 356608 -305499 238518 -376557 44149 -265337
12332 101295 277653 208402 -76722 51158 140113 -208173 -212429 56607 85553 200 -177097
12320 191538 61662 -195536 143993 -51186 194675 186540 194983 205395 248157 48585 331906
12309 331906 -74804 18982 64785 -330544 41075 72194 158041 -270770 -5856 -10494 -37219
$$ packed form
12387a18860A82050H396J21572a08912r7066B93104D3015K40131c969C7368K50771
12376B88139a64967A71475J1587c15477A29436c3658B96494d25202d3330G0022
12365A49185K59081a88285m2416b4955H6940l4299b48384D1242J69212J10463
12355C20917B7364K27507H8669e822m2008A07800A0574d611A77928B3100a83501
12343B72976g3156F8993k0840K05936J02519c05499B38518c76557D4149b65337
12332A01295J76358o9251g6722E1158Q8955b08173m256E6607K8946B00a77097
12320A91538F1662a95536A43993e1186A94675q135Q443J0412M2762D8585K83321
12309C31906g4804A8982M5803c30544D1075L1119Q5847b70770e856m638k6725
$$ plain form
12298 -37219 125396 303926 96930 47808 197275 159369 130426 175803 94900 296394 -204060
12286 20558 7118 99851 -20504 135034 -77800 31654 -324880 377154 12055 584425 -13779
12274 507785 127363 184593 123689 234070 323762 -30084 -211774 9250 303181 249817 -37406
12262 -320129 125838 19475 -160912 136327 28059 306597 -85860 11974 83036 34961 -93340
12250 213252 -181059 51571 -309070 330970 163304 -47300 -51251 99314 -28952 44110 530880
12239 530880 135155 -264761 106491 -44213 -11479 121852 202697 376022 -3966 167540
12228 -17334 478200 17642 131964 -107613 479045 136108 90004 27652 375378 89630
12217 261702 297973 418285 800291 24187 165685 115854 156747 162694 211565 29496 -193964
$$ packed form
12298c7219A25396J78530I6930D7808J49467l7906k8943M5377q0903K01494b04060
12286B0558G118R2733b0504A35034g7800C1654c24880C77154A2055N72370a3779
12274E07785A27363N7230o0904J10381Q9692c0084j81690I250K93931n3364c7406
12262c20129A25838A9475a60912A36327B8059K78538h5860A1974P1062C4961i3340
12250B13252a81059E1571c09070C30970A63304d7300l951I9314b8952D4110M86770
12239E30880A35155b64761A06491d4213a1479A21852Q0845J73325c966A67540
12228a7334D78200A7642J14322a07613D79045A36108m6104B7652L47726H9630
12217B61702L6271J20312L82006B4187J41498m9831M0893N947M8871B9496a93964
$$ plain form
12205 68273 -183673 284620 55377 85325 -88378 -47070 136337 -55564 426167 -22348 -79368
12194 -79368 -147816 365032 84446 216507 260202 516944 78326 -10445 267695 -67966 70005
12182 158203 108481 166441 5172 280186 14654 3430 145602 287864 -55181 101512 11063
12170 64023 81893 176454 247878 -185708 -30917 -64871 119627 137840 55058 359756 200539
12159 200539 36015 61250 35138 -16185 34981 4858 249360 103724 -118312 -23483 18336
12147 409054 15787 -286300 120729 -68967 148847 -58128 1759 -247289 160812 160420 -60212
12135 98700 36804 15844 185527 203439 216229 229807 143377 182085 378734 156261 -71751
12123 195575 -315872 -60362 81740 114220 252360 143447 41621 139597 199321 54812 -92041
$$ packed form
12205F8273a83673B84620E5377K9948h8378M1308A36337e5564D26167b2348n7020
12194g9368o8448C65032H4446J32061M3695K56742G8326a0445B67695f7966G0005
12182A58203m9722N7960E172K75014A4654C430J42172J42262e5181A01512A1063
12170F4023J7870R4561P1424a85708c0917l3954A19627J8213E5058L04698j59217
12159B00539C6015K5235k6112a6185C4981D858K44502A03724a18312b3483A8336
12147D09054A5787b86300A20729f8967A48847e8128A759b47289A60812l92f0212
12135I8700C6804A5844J69683J7912J2790J3578q6430L8708J96649A56261g1751
12123A95575c15872f0362H1740L2480J38140j08913D1621R7976N9724E4812i2041
$$ plain form
12111 -75313 276280 101959 60849 -126510 213292 -273012 -244930 -43942 -119589 111414
12100 -27630 145790 -112478 -131441 11803 41794 -7895 -63102 -333949 193028 -50830 337094
12088 -119763 215066 -74008 -2525 -287071 -56756 -100042 111636 -267973 -213632 -112117 -111616
12077 -111616 146015 -164923 77453 328303 18938 83177 507593 244549 843399 1757344
12067 1757344 523403 485557 36095 490291 175623 147582 259699 188673 113092 -103138
12056 -78319 155110 5404 98984 -10680 -103436 -364668 -101491 -99523 78132 -157505 -25765
12044 -285394 -189085 -44064 -20555 -286056 -20225 -21680 246585 -12580 16298 -10007 47407
12032 -235194 -397835 -252500 -142945 -42530 174180 245806 141180 -104311 -111733 -115916 -24736
$$ packed form
12111g5313B76280A01959m1110a26510B13292b73012K8082d3942p5647A11414
12100b7630A45790a12478j8963A1803K9991g895n5207k70847A93028e0830C37094
12088a19763B15066g4008b525k84546e6756m3286A11636b67973N4341J01515N01
12077a11616A46015a64923G7453K50850A8938O4239M24416B44549N98850R13945
12067A757344E23403l7846C6095M54196A75623k8041J12117p1026p5581a03138
12056g8319A55110E404R3580a0680r2756k61232a01491J968G8132a57505b5765
12044b85394R6309d4064b0555k65501b0225j455B46585a2580A6298a0007D7407
12032b35194j62641J45335J09555d2530A74180P1626j04626a04311p422m183b4736
$$ plain form
12020 127117 152194 -39952 158193 338683 170255 -65134 -48500 48042 210812 -19813 -279017
12009 -279017 9071 -139875 109097 10867 891 -30248 2125 258763 21979 -156262 319701
11997 68343 -64724 -101765 -17331 2317 132392 69165 -65167 -199578 131635 -247467 122195
11985 -52330 35433 -351001 1378 -324 29471 55635 260259 -120014 97453 -145413 72564
11973 -201606 2708 -147094 -296314 118158 177678 52216 98570 -95316 -12805 -249720 -328427
11962 -328427 -9451 77170 92955 -303209 -86740 66843 24920 44598 -16236 -19663 47839 -282416
11949 -98080 169458 -170075 133605 74723 -195999 32517 169271 30747 -16527 137407
11938 -298574 -154994 59846 -104613 -209360 -226486 209019 -185455 263099 2962 23041
$$ packed form
12020A27117K5077c9952A58193J80490j68428f5134J6634D8042J62770a9813k59204
12009b79017I071a39875A09097A0867H91c0248B125K56638B1979a56262C19701
11997F8343f4724l7041a7331B317J30075o3227f5167j34411A31635b47467A22195
11985e2330C5433c51001A378c24B9471K6164K04624a20014I7453a45413G2564
11973b01606B708a47094j49220A18158N9520E2216M6354i5316a2805k36915p8707
11962c28427i451G7170J5785c03209h6740F6843B4920J9678a6236l427D7839b82416
11949i8080A69458a70075A33605n8882a95999C2517J36754C0747a6527A37407
11938b98574J43580E9846a04613j04747j7126B09019a85455B63099B962K0079
$$ plain form
11928 23041 -13074 124413 -50982 -7957 2907 15610 -292057 116710 144062 -384644 -83710
11916 108163 2381 38307 272240 119609 -22896 -107754 -71686 -79223 -37551 100230 11922
11904 57457 24009 -189641 -17919 191802 -218867 152887 -148047 187328 156090 -213340
11893 -417960 210077 -101107 197688 -146446 52055 -64561 141925 125865 -195974 30636
11882 291836 -145704 93541 72896 -30815 52223 90772 -40219 192545 27652 -30164 239940
11870 191093 56128 -138603 81707 -293450 -63364 -6286 385386 108020 160856 50833 -238796
11858 -175191 -127044 -314409 39825 137411 545602 89994 22694 133216 -248523 53820 -4423
11846 130264 -163306 102139 30857 -41641 -181456 -431150 191750 61200 256809 -359322
$$ packed form
11928B3041a3074A24413e0982g957B907J2703b92057A16710K7352c84644h3710
11916A08163B381L5926K33933A19609b2896q4858L6068p537c7551A00230A1922
11904E7457B4009a89641a7919A91802b18867A52887a48047A87328l1238b13340
11893d17960B10077a01107A97688a46446E2055f4561A41925j6060a95974C0636
11882B91836a45704I3541k0645c0815E2223L8549d0219A92545B7652c0164B39940
11870A91093E6128a38603H1707b93450f3364f286C85386A08020N2836E0833b38796
11858a75191M8147j87365C9825R7586M08191H9994B2694J10522b48523E3820d423
11846A30264a63306A02139C0857d1641j39815k49694A91750F1200J95609c59322
$$ plain form
11835 217164 130101 96723 199323 -97329 164862 77925 783 -972 29126 30466 46888 -276672
11822 -143859 -121543 -48192 -104787 -105823 98228 6664 163232 191756 50594 -96863 -71436 -119320
11810 -119320 348816 -71604 -49448 -193616 296786 -54659 -124776 -24431 -235790 -39232 267079
11798 -414894 4950 156655 12117 6681 -216464 113591 -206163 -53808 -183909 -37100 -248526
11787 -248526 450088 226596 61713 -43318 117571 -205247 392299 115100 -31377 52117
11776 -148942 64169 -468630 214817 -60836 -119259 75558 -105002 141097 -99044 114383
11765 -163546 -68327 -38453 -131681 -94234 -177029 -153675 -283364 16746 -330930 -144993 -425534
11754 -425534 -41180 145132 105636 100945 -96305 -142661 -328619 238895 41131 -69211 183277
$$ packed form
11835B17164q7063l3378J02600i7329A64862G7925G83i72B9126J340J6422b76672
11822a43859K2316d8192n6595j036I8228F664J56568K8524E0594i6863K5427m7884
11810a19320C48816g1604K2156j44168B96786e4659p0117b4431k11359c9232B67079
11798d14894D950J51705A2117n436b16464A13591b06163e3808j30101c7100k11426
11787b48526D50088k23492F1713d3318A17571b05247C92299A15100c1377E2117
11776a48942F4169d68630B14817f0836n8423G5558a05002A41097i9044A14383
11765a63546f8327K9874r3228L7447q2795K3354j29689A6746c30930a44993k80541
11754d25534d1180A45132l9496m691i6305m6356j85958B38895D1131f9211A83277
$$ plain form
11742 -46813 123816 71858 70813 188787 -104157 -208681 -110339 -3318 -54798 -209127 129914
11730 159242 115800 220241 -120466 290708 66833 -12957 -162451 447055 139339 -174803
11719 -45331 -67375 31089 -229539 -54610 -123217 -214900 422831 17729 -18974 201572 150456
11708 150456 -113881 -49581 239219 -206440 100924 -119013 127527 -301125 -148794 223598
11697 -12284 88939 57402 -31834 177739 -13768 294655 391462 -158113 -319539 123685 44414
11685 38546 70929 44191 -2458 -148783 -43477 95286 364096 236161 -148336 179524 104708
11674 104708 -33882 112422 -8696 92172 19981 84476 19273 -186792 -67821 303684 -64518
11662 -234179 270660 -197261 24931 -175017 -159808 -162813 -61302 -128052 -257070 121834 170743
$$ packed form
11742d6813A23816n1958j045J17974a04157j04524R8342c318n1480j54329A29914
11730A59242m3442J04441a20466B90708F6833a2957j49494D47055A39339a74803
11719d5331k2044C1089b29539e4610o8607r1683D22831A7729a8974B01572n1116
11708A50456a13881d9581B39219b06440A00924a19013A27527c01125a48794B23598
11697a2284H8939l1537c1834A77739a3768B94655R6807a58113j61426A23685D4414
11685C8546L2383k6738b458j46325d3477I5286K68810j27935a48336A79524p4816
11674A04708c3882A12422h696I2172A9981O4495A9273a86792f7821C03684f4518
11662b34179B70660a97261B4931a75017J5209l005f1302o6750j29018A21834M8909
$$ plain form
11651 170743 -61651 36520 154070 -197699 -23494 -217958 333518 -4379 60547 35230 -40974
11639 8232 -117851 -50118 -250705 215911 -166917 -112747 7706 -2166 -85664 48143 -98786
11627 115965 -951 -119327 320809 351078 -687 341728 45771 125823 -7343 199469 47759 268961
11615 268961 233287 71340 -191361 122811 -101972 66559 -9351 -160751 263531 95162 237183
11604 237183 135667 -91421 -50703 103358 224806 381725 -53336 91309 136772 243766
11594 243766 -127739 77984 118185 -52297 119971 -47628 228439 567523 279037 -273828
11583 -72680 -63545 -76628 248278 10054 42440 15569 -58482 -151426 169055 177902 -40617 138464
11570 173251 -198357 400808 -279472 -118651 -57973 61365 42681 21563 15915 -73345 219295
$$ packed form
11651A70743f1651C6520J17550a97699b3494j94464C33518d379F0547k5317d0974
11639H232a17851e0118k00587B15911a66917N4170G706b166q3498D8143i8786
11627A15965i51j18376C20809L0269f87C41728D5771Q0052g343A99469D7759K21202
11615B68961l5674G1340a91361A22811a01972F6559i351j51400B63531I5162J42021
11604B37183j01516i1421M0718A03358J21448J56919e3336I1309M5463J06994
11594B43766a27739G7984M0201e2297A19971d7628B28439L39084B79037b73828
11583g2680R135j3083B48278A0054L2386A5569e8482r2944A69055Q847d0617A38464
11570A73251a98357D00808b79472a18651e7973F1365j8684k1118n648g3345B19295
$$ plain form
11558 38462 164302 95056 259485 68069 35789 -224770 667613 20079 60030 17827 -15919
11546 -394484 144014 -139604 -89306 -73934 45430 15339 195381 115295 -65758 -87458 -71244
11535 -71244 -74355 260875 100467 151929 223555 4635 10795 73602 -189535 10668 -62259 -28142
11522 138648 298940 -332025 -34251 172695 304261 -33604 -19032 48095 122509 22909 204581
11511 204581 615523 112218 52224 -87033 123006 145911 -41425 1473 347262 -6199 18151
11499 24686 221777 164983 -99996 16167 210941 203260 326543 40731 34730 212424 186714
11488 186714 -262319 95833 161227 185719 349946 -215366 281079 68234 91688 332380
11478 332380 132051 192715 273267 180256 119786 476704 -145129 -39895 -50793 24126 99467
$$ packed form
11558C8462J25840o9246J64429F8069l2280b24770F67613B0079L9951A7827a5919
11546c94484A44014a39604N0298J5372D5430A5339J80042q0086f5758k1700J6214
11535g1244l111B60875A00467N1462P1626D635O160O2807a89535A0668f2259b8142
11522A38648J60292c32025c4251A72695J31566c3604J4572D8095P4414B2909J81672
11511B04581M10942A12218E2224h7033A23006K2905d1425A473L45789f199A8151
11499B4686J97091n6794i9996A6167J94774p681J23283D0731o001J77694k5710
11488A86714b62319I5833O5394K4492J64227b15366B81079F8234K3454K40692
11478C32380A32051O0664Q0552r3011o0470L56918a45129c9895j0898B4126P5341
$$ plain form
11467 99467 94435 3526 -11828 -8058 293530 -134936 179182 540153 -78914 441635 -26634
11455 -265964 -17345 191666 238178 235960 3836 -153607 -50587 35551 70547 -28307 -201581
11444 -201581 28682 103533 189766 220826 -50079 -11428 29789 -37473 178717 261716 139370
11433 139370 135337 239045 324999 -97830 4458 270525 -149860 -30535 -39021 48895 -98589
11421 -78549 73850 -46998 -493199 164242 60665 70305 150915 -194574 381802 -91283 36948
11409 -27899 33336 -145238 -263659 -67025 23267 139664 185643 -98336 -28317 132930 -173927
11397 77421 388320 -71730 -89322 213460 -219521 -405027 91663 35178 -141205 43127 -48421
11385 -20724 -54351 112921 -72440 245344 9288 321795 -111467 240514 -73139 294274 131472
$$ packed form
11467I9467n032C526a1828L770B93530a34936A79182L60971g8914D41635b6634
11455b65964a7345A91666M6512k218C836a53607e0587C5551L4996b8307j73274
11444b01581B8682P4851Q6233L1060e0079a1428B9789c7473A78717Q2999j22346
11433A39370m033J03708Q5954i7830D458K66067a49860c0535q486D8895i8589
11421g8549G3850d6998m46201A64242F0665R640Q0610a94574C81802i1283C6948
11409b7899C3336a45238j18421f7025B3267J16397M5979i8336b8317A32930a73927
11397G7421L10899g1730j7592B13460b19521j85506I1663C5178a41205D3127d8421
11385b0724l3627A12921g2440B45344I288L12507a11467B40514g3139B94274A31472
$$ plain form
11373 154927 81533 -70487 -101618 -78039 120093 245194 -31467 -360377 -137796 40870 -109841
11361 -167065 -150612 159635 -254598 85088 -60207 -305037 79739 213650 -68688 -405189
11351 -405189 79239 -17986 -77457 173881 267548 -2070 -287396 47859 -55189 3130 120096
11340 120096 85750 -92855 -259139 -180031 -71524 -241869 -105160 60112 -144971 101748
11329 41916 -15917 -208305 -140896 -396750 -48577 13113 204895 -10056 97199 -149087 85951
11317 179471 329944 24310 70363 236569 3416 116883 113104 219261 161564 -177009 51414
11305 -472438 112579 -186849 -117593 -236864 -174721 -139880 153319 -57317 242829 -27198
11294 -169894 30463 -80842 -285350 110113 -163029 -175287 181964 52083 -233534 -84302
$$ packed form
11373A54927p3394g0487l1131K3579A20093J25101c1467l28910a37796D0870a09841
11361a67065J6453A59635b54598H5088f0207k44830G9739J33911f8688l36501
11351d05189G9239a7986n9471A73881R3667b070k85326D7859e5189C130J16966
11340A20096l4346i2855j66284P9108g1524j70345a05160F0112a44971A01748
11329D1916a5917j92388O7409k55854d8577A3113J91782a0056I7199a49087H5951
11317A79471J50473B4310M6053J66206C416J13467l779J06157n7697a77009E1414
11305d72438A12579a86849O9256j19271O2143L4841A53319e7317B42829b7198
11294a69894C0463h0842k04508A10113a63029j2258A81964E2083b33534h4302
$$ plain form
11283 -178674 231821 -97015 -40272 -157953 -138384 49289 -33634 66371 231122 -65346 -77523
11272 -77523 88337 130293 -267613 40418 -207931 294861 -18791 -133415 -217788 -321294 100528
11260 194834 -103551 -240962 69114 -306179 -541834 -292012 -26757 113875 -171223 -103518
11250 -103518 99342 7492 -84107 -144609 -109579 71564 -102126 -77629 -124781 187591 -228246
11238 -277142 -140381 -275134 -193711 -59255 21830 -101650 11096 -56810 31040 212203 -315466
11226 -221417 -194080 3654 83416 -149174 -186403 -93768 169354 19381 270057 37141 2937
11214 -33022 236353 177037 -96976 54909 195650 307983 -99240 323149 124034 -275710
11203 -388780 88518 81459 -206454 150061 -16393 62204 -34474 123011 75459 -113647 -1543
$$ packed form
11283a78674B31821i7015d0272j17681J9569D9289c3634F6371J64751f5346j2177
11272g7523H8337M1956b67613D0418b07931B94861a8791j14624q4373j03506A00528
11260A94834a03551j37411F9114c06179k35655K49822b6757A13875a71223O7705
11250a03518I9342G492h4107o0502L5030G1564a02126K4497m7152A87591b28246
11238b77142J36761j34753Q1423e9255B1830a01650A1096e6810C1040J81163c15466
11226b21417K7337C654P9762a49174l7229R2635A69354A9381K50676C7141B937
11214c3022B36353n9316i6976E4909J40741J12333i9240C23149A24034b75710
11203c88780H8518p059b06454A50061a6393F2204c4474A23011m7552a13647a543
$$ plain form
11191 298338 -2820 -22598 -65954 31953 -176009 240992 -273524 -123943 -217273 94299 4154
11179 -169825 62321 22070 -273486 189127 -4413 66184 -17292 2392 -50286 72069 -185244
11167 -5460 -70630 -382111 108616 -212215 211081 -38131 20705 -131883 115926 -100490
11156 435397 -26840 -178607 43390 -131852 35504 46484 -66837 16856 27495 404060 -320889
11144 309958 -21898 -157390 7451 153098 -60989 79276 -75599 -119995 -265698 114788 -100987
11132 -496435 202493 -160072 100422 365153 -18687 252624 -96046 373352 12118 -106557
11121 -492792 253424 175966 -148455 -209097 -53085 -163529 -189788 -9266 410732 -302251 91564
11109 -29328 168700 94341 189832 40391 278703 93282 90249 169468 265367 237516 83394
$$ packed form
11191B98338b820j9778m3356C1953a76009B40992b73524a23943r3330I4299D154
11179a69825F2321B2070b73486A89127d413F6184a7292B392e0286G2069a85244
11167e460o5170l11481A08616b12215B11081c8131B0705a31883A15926a00490
11156D35397b6840j51767D3390a31852C5504J0980f6837A6856J0639L76565c20889
11144C09958b1898j35492G451J45647f0989G9276g5599m4396j45703A14788a00987
11132d96435B02493a60072A00422K64731a8687B52624i6046C73352A2118a06557
11121d92792B53424p7458a48455o0642e3085j10444k6259i266D10732c02251I1564
11109b9328A68700p4359R5491D0391K38312I3282l033P9219R5899k7851H3394
$$ plain form
11097 -43089 54677 -15958 -280982 72892 224407 593286 -318778 589670 253983 296417
11087 296417 224539 186773 -7838 -169311 91805 212169 236845 -5059 280517 246891 67087
11075 -107186 383535 105773 291618 452964 326787 485487 308044 131372 355493 410453
11065 410453 417523 426485 602993 520235 621281 430248 694384 665944 520393 660859 835774
11054 835774 549632 579778 707890 264380 545292 692049 560226 468274 808837 400770
11043 718957 675706 857576 655021 279896 611815 739692 785174 472987 500505 741309
11033 741309 346786 492509 775686 695248 409689 614890 543079 599667 538313 402927
11023 402927 654716 224278 456576 629971 926611 648599 596635 583305 740802 476941
$$ packed form
11097d3089E4677a5958k65024G2892J51515L68879c18778E89670B53983M2434
11087B96417p1878l7766g838j61473I1805J20364K4676e059B80517l3626F7087
11075a07186C83535A05773J85845J61346j26177J58700j77443A31372K24121N4960
11065D10453P070Q962J76508q2758J01046j91033K64136k8440j45551J40466J74915
11054H35774k86142L0146J28112B64380K80912J46757j31823r1952L40563D00770
11043G18957m3251J81870k02555B79896L31919J27877M5482l12187K7518K40804
11033G41309C46786J45723K83177q0438k85559K05201p1811N6588o1354j35386
11023D02927K51789B24278K32298J73395K96640k78012n1964j3330J57497k63861
$$ plain form
11013 476941 579495 403699 737353 448441 325975 634516 600233 543477 779501 676595
11003 676595 319557 412593 928283 587541 583507 510974 694174 475259 526371 547385 924024
10992 924024 747754 648950 749936 670437 1035997 1001587 1064160 972015 851705 815071 1227598
10981 1227598 1018204 788466 1375789 1428937 1294451 1323460 1678632 2527658 2205577 2610208
10971 2610208 2505253 2603808 2356418 2203802 2002221 1972615 1867366 1290653 1285881 1604427
10961 1604427 1388252 1414453 1253411 1882242 1189187 1866852 1533743 935973 622110 944028
10951 944028 651467 356281 672944 283856 257663 -59843 241798 -5862 164446 575136
10941 575136 -67696 -217132 444153 216976 90657 47532 313918 -121408 295281 176423
$$ packed form
11013D76941J02554j75796L33654k88912j22466L08541l4283n6756K36024j02906
11003F76595C19557R3036N15690l40742m034p2533J83200k18915N1112K1014L76639
10992I24024j76270r8804J00986p9499L65560l4410O2573r2145j20310l6634M12527
10981A227598k09394k29738N87323N3148j34486K9009L55172Q49026l22081M04631
10971B610208j04955R8555k47390j52616k01581k9606j05249n76713m772L18546
10961A604427k16175K6201j61042O28831o93055O77665l33109n97770l13863L21918
10951I44028k92561k95186L16663B83856k6193e9843B41798e862A64446M10690
10941E75136f7696j49436D44153B16976I0657m3125K66386a21408B95281j18858
$$ plain form
10931 176423 -122779 198287 -91173 142981 285462 118338 286137 -167491 31164 -35779
10920 129978 -169612 -258489 137887 55898 77551 -104257 462923 -50495 55950 50938 -155689
10908 102208 -66125 68949 278341 173264 16966 4886 -213338 119921 -300535 282475
10897 193369 9304 -87700 155413 -135921 109057 244151 171762 -388771 -10101 -171568
10887 -171568 -134655 91634 -170228 -178037 225473 15797 -40351 7634 -57291 317951 -208466
10875 -244941 -104713 -21565 60267 -106366 28577 -8136 -197981 152028 210402 -156677 92310
10863 114308 269045 -173382 114970 301148 -155449 -271288 -186087 16391 6539 -296594
10852 928 -211666 164814 -261963 203361 63484 257367 148740 -209984 53845 -56643 -71981
$$ packed form
10931A76423a22779A98287i1173A42981J42481A18338J67799a67491C1164c5779
10920A29978a69612q8877A37887E5898K1653a04257D62923e0495E5950n012a55689
10908A02208f6125F8949K09392j05077A6966D886b13338A19921c00535B82475
10897A93369I304h7700A55413a35921A09057J35094p2389c88771a0101j61467
10887a71568L6913I1634a70228p809B25473A5797d0351G634e7291C17951b08466
10875b44941a04713b1565F0267a06366B8577h136j89845A52028N8374a56677I2310
10863A14308J54737a73382A14970J86178a55449j15839Q5201A6391F539b96594
10852I28b11666A64814b61963B03361F3484J93883j08627b09984E3845e6643j5338
$$ plain form
10841 -71981 -303368 60561 -87099 79441 202252 -143441 63165 -17920 -212354 -12576 183433
10829 -251935 -193777 102380 -165517 73826 -39778 -193428 150393 -141088 184806 102396
10819 102396 13718 78854 42986 25370 -110413 -319569 -103191 37705 124709 77235 170284
10808 170284 -323455 -334240 -82389 42910 297824 273108 -86242 -262122 281109 -170562
10797 -8498 -187487 -213534 -168177 126111 -34851 115017 -25463 -125566 100787 -207603 -391586
10786 -391586 -254962 74107 19069 -128158 -47167 -136767 -144661 -62041 -263284 212367 -109943
10774 -106703 -6888 -18426 -365890 141117 71059 158980 -74429 143480 118718 -69451 -89855
10763 -89855 117558 104687 -21465 -79484 -179418 213986 -283558 -135193 314326 385722 50374
$$ packed form
10841g1981k31387F0561h7099G9441J22811a43441F3165a7920j94434a2576A83433
10829b51935N8158A02380a65517G3826c9778j53650A50393a41088A84806q2410
10819A02396A3718O5136l5868j7616a10413k09156a03191C7705Q7004m7474R3049
10808A70284c23455j0785h2389D2910K54914k4716h6242j75880B81109a70562
10797h498j78989k6047M5357A26111c4851A15017b5463j00103A00787b07603j83983
10786c91586J36624G4107A9069a28158d7167q9600p894f2041k01243B12367a09943
10774a06703f888j1538l47464A41117p0058Q7921g4429A43480k4762f9451k0404
10763h9855A17558j2871b1465n8019r9934B13986b83558a35193C14326P1396E0374
$$ plain form
10751 -303689 97547 18415 120334 -350179 -125826 -4799 -138613 -9829 -173255 190651 -101405
10739 -199589 -142890 20189 29311 -418460 -72104 115282 -292141 280166 224292 -35758 271226
10727 -128950 126905 -77380 8424 187071 44199 -107435 49545 6341 -207502 -209727 -13007
10715 -94574 -65521 -270007 202876 144495 -273097 -127690 264279 187670 -235178 -302174
10705 -302174 -52467 -32791 25640 -156348 39370 -63002 -51204 97282 21694 -199668 -56164
10693 108710 -2331 -3213 -246942 221918 168810 -182748 257038 28064 -121263 -295310 -268847
10682 -268847 23879 176708 377427 36000 -59361 -219090 -165398 273621 -185538 -174931
10672 -174931 50574 254056 84656 116949 220372 27890 -148723 144636 23102 -475776
$$ packed form
10751c03689I7547A8415J01919c50179a25826d799j33814i829j63426A90651a01405
10739a99589N6699B0189R122d18460g2104A15282b92141B80166n5874c5758B71226
10727a28950A26905g7380H424J78647D4199a07435D9545F341b07502k225a3007
10715i4574K9053k04486B02876n8381b73097a27690B64279p6609b35178o6996
10705c02174e2467J9676B5640a56348C9370f3002J1798I7282B1694a99668e6164
10693A08710b331q82k43729B21918n3108a82748B57038B8064a21263j74047K6463
10682b68847B3879J52829K00719C6000e9361j59729N3692B73621a85538J0607
10672a74931E0574K03482H4656L2293J03423B7890a48723A44636B3102d75776
$$ plain form
10661 -43476 -487659 76248 393077 96020 -130307 -339843 -141994 304900 -288920 5140
10650 87503 20301 -182418 -173185 -143216 -106855 -274695 -266288 -11572 -326372 -138015 133399
10638 -137025 -294464 -65656 -245841 -131655 -78471 -360936 110438 -262205 -289621 -262047
10628 -262047 9932 -263332 34242 -339583 -494686 -260641 -232176 -229492 -264868 -143533 -43276
10616 74722 -113504 -152065 59769 -171162 -230509 246720 12811 -83675 57486 84902 -192712
10604 -80748 -112421 -29519 -66194 29854 -133742 -162607 -180344 -41352 -45000 -64186 -123753 -27175
10591 116305 194593 -95709 161873 151713 115907 -125502 -236489 17349 -102965 -163479 -1293
10579 -347215 3501 94773 178633 -110921 -111252 63306 -445839 53609 -139688 -33516 176742
$$ packed form
10661d3476m44183G6248L16829I6020a30307k09536a41994C04900b88920E140
10650H7503B0301a82418R233K9969L6361j67840Q407a1572l14800a38015A33399
10638a37025j57439f5656j80185J14186N3184k82465A10438b62205k7416K7574
10628b62047I932b63332C4242c39583j55103K34045K8465K684l5376J21335d3276
10616G4722a13504l8561E9769a71162n9347B46720A2811h3675E7486K7416a92712
10604h0748l1673b9519l6675B9854a33742k8865j7737d1352l648j9186n9567b7175
10591A16305P8288i5709A61873j0160l5806a25502j10987A7349a02965o0514a293
10579c47215C501R1272Q3860a10921l31F3306d45839E3609a39688c3516A76742
$$ plain form
10567 73091 -213050 147637 -13779 198503 206469 -401456 -180275 -172950 252011 -50014 -67122
10556 -67122 77576 174567 245345 -35194 11007 175139 304439 -117731 -181597 -126802 63684
10544 -155110 -41845 41288 324920 120971 30462 113696 70618 -215117 70333 443579 -126722
10532 -217347 -139401 8267 -15277 -326178 603381 -119779 -140066 -494594 284172 -65920 -215452
10521 -215452 -202028 -48425 304307 -385045 -242371 -356620 -244702 79710 -29005 -79884
10511 -79884 80486 -171957 24375 160255 -110805 -183266 182321 98499 38932 -119691 166072
10499 -67033 -193486 -407349 605039 83877 -201594 -34769 -171468 190208 -21418 -177770
10489 -177770 225150 -23482 64326 111976 352931 200606 103562 383628 536275 275437
$$ packed form
10567G3091b13050A47637a3779A98503P966d01456a80275P325B52011e0014j7108
10556f7122G7576R6991P0778c5194A1007J64132J29300a17731o3866N4795F3684
10544a55110d1845D1288K83632A20971C0462Q3234m3078b15117G0333L73246a26722
10532b17347P7946H267a5277l10901F03381a19779k0287l54528B84172f5920j49532
10521b15452J3424d8425C04307c85045J42674j14249J11918G9710b9005n0879
10511g9884H0486a71957B4375J35880a10805p2461A82321q3822C8932a19691A66072
10499f7033j26453k13863F05039H3877b01594c4769j36699A90208b1418j56352
10489a77770B25150b3482F4326M7650K40955j52325r7044K80066J52647k60838
$$ plain form
10479 275437 564425 -113500 379384 282855 353216 -119802 -63779 -45801 -26486 283399
10468 -82464 -61315 69028 41990 -226844 56577 -369971 236233 -381572 -154091 187248
10457 8990 -64774 371879 105746 -153620 103019 79091 -359594 -36029 -109321 -143735 26027
10445 125455 -255404 -98927 165221 -142691 99564 4973 37142 -197886 -57893 262790 -36720
10433 32328 276218 161028 333904 43439 60180 63328 136193 185865 669 -84568 -88126 -33535
10420 -201749 82048 -89598 45352 -236757 -197200 35537 -165040 -152183 -267069 523093 -4165
10408 139416 101613 -92191 -66200 33786 -375589 -217746 116500 165235 -118570 -196310 -100047
10397 -100047 -86637 140955 218795 327953 -93697 -71280 -4645 88424 150492 149829 -78162 -135280
$$ packed form
10479B75437K88988a13500C79384r6529P0361a19802N6023J7978J9315B83399
10468h2464K1149F9028k7038b26844E6577c69971B36233c81572a54091A87248
10457H990f4774C71879A05746a53620A03019k3928c59594c6029p3292l4414B6027
10445A25455b55404i8927A65221a42691I9564D973L2169a97886e7893B62790c6720
10433C2328K43890j15190J72876D3439J6741L148P2865M9672F69h4568l558c3535
10420b01749H2048h9598D5352b36757L9557C5537a65040J2857j14886E23093d165
10408A39416l7803i2191K5991C3786c75589J57843A16500M8735a18570p7740R6263
10397a00047J3410A40955P7840J09158i3697K2417d645H8424O2068o63g8162n7118
$$ plain form
10385 -135280 180875 260247 54572 -82663 40169 24303 271351 105351 155012 327037 397247
10374 397247 79175 123704 252885 455860 -111290 361452 358907 257621 513987 111873
10363 101738 274455 -39617 320579 120346 -10365 85801 -18974 453338 6298 461436 244503
10352 244503 903940 646482 468715 410821 168304 258203 191833 450340 391694 -78826
10341 177012 285825 74747 50044 211983 213882 28962 -82078 -102193 368478 -11448 247306
10329 -380857 62723 191434 -7255 185808 -13297 -378026 229071 -8172 451095 214476 161625
10318 161625 -24286 -101676 189724 -146826 17913 87799 -95049 -47066 -78046 -131629 49835
10306 -472962 289120 293857 -137519 116027 -385394 -129907 -305400 175123 97240 -582130
$$ packed form
10385a35280A80875P9372E4572h2663D0169j5866K47048A05351M9661J72025P0210
10374C97247G9175M4529J29181K02975a11290C61452k545j01286K56366A11873
10363A01738J72717c9617C20579A20346a0365H5801a8974D53338F298M55138k16933
10352B44503O59437k57458j77767n7894A68304Q9899o6370K58507n8646g8826
10341A77012J08813G4747k4703J61939J899B8962h2078k0115C68478a1448B47306
10329c80857F2723J28711g255A85808a3297l64729B29071h172D51095B14476n2851
10318A61625b4286p7390A89724a46826A7913O9886i5049d7066l0980n3583D9835
10306d72962B89120M737a37519A16027c85394a29907j75493A75123p7883e82130
$$ plain form
10295 189147 86426 376138 90857 -207895 141903 128128 -296435 73022 -50896 -119811 -168536
10284 -168536 -258699 -117975 46650 296533 -130981 273822 -196948 -195240 -198818 -116127 -58275
10273 -58275 -269587 -205486 34130 89733 190513 -252774 -33242 255032 9109 -114546 12864
10261 222879 450817 325347 5473 305612 -154694 -3985 57064 -95071 40970 -30347 -158581
10250 -158581 306726 -221830 -239277 32378 513255 -102984 128538 -11664 -214862 -3986
10239 9346 -118504 -30917 -235083 -451816 -158827 67591 196719 -87635 -60010 264053 -162028
10227 -99815 -99475 -274329 128852 21539 -3814 -44838 -178529 231248 -26280 -59511 -325979
10216 -325979 -366390 -21910 16356 -218604 196243 -47442 -63522 -47550 35453 -139554 180734
$$ packed form
10295A89147H6426K89712I0857b07895A41903j3775b96435G3022e0896o8915m8725
10284a68536r0163a17975D6650K49883a30981B73822a96948J708l578Q2691N7852
10273e8275k11312O4101C4130N5603J00780b52774c3242B55032I109a14546A2864
10261B22879K27938j25470E473L00139a54694c985E7064i5071D0970c0347j28234
10250a58581C06726b21830j7447C2378M80877a02984A28538a1664k03198c986
10239I346a18504c0917k04166k16733a58827F7591J29128h7635K7625B64053a62028
10227i9815L40j74854A28852B1539c814m1024j33691B31248b6280l3231k66468
10216c25979m0411b1910A6356b18604A96243d7442j6080J5972C5453a39554A80734
$$ plain form
10204 190000 38281 -55236 113799 -359515 127690 89986 -300563 -342761 -264580 -12232 -207860
10193 -207860 -288463 -64467 -144534 345849 314251 121017 -176499 -48535 72497 -236332 -72890
10181 -38598 -438622 154685 -119617 -85222 -51696 221324 -126971 65009 68305 -45008 -323886
10170 -323886 113511 -33743 -35902 -221410 -200495 -261225 -119055 -29468 -253264 -237423 -43309
10158 -169245 52996 -115002 -215826 271665 -185311 114177 -48565 187933 -152775 -108902
10148 -108902 38231 15911 180507 147104 -278948 970 -210890 -357359 -114099 123762 5852
10136 169801 185579 -329530 -220962 -46945 -84748 -114414 -236554 -142329 73173 -163471 150800
10124 -245093 -33239 -13103 242787 -97807 -10302 -154821 196552 66050 -35075 349980 -15600
$$ packed form
10204A90000C8281e5236A13799c59515A27690l7704c00563m2198P8181a2232j95628
10193b07860q0603f4467q0067C45849l1598A21017a76499d8535G2497b36332g2890
10181c8598m00024A54685a19617L4395L3526B21324a26971F5009L296d5008k78878
10170c23886A13511c3743k159j85508K0915o0730a19055b9468k23796J5841d3309
10158a69245E2996a15002j00824B71665a85311A14177d8565A87933a52775M3873
10148a08902C8231A5911J64596l3403b78948I70b10890j46469a14099A23762E852
10136A69801J5778c29530J08568d6945l7803k9666j22140R4225G3173a63471A50800
10124b45093c3239a3103B42787i7807a0302j44519A96552F6050c5075C49980a5600
$$ plain form
10112 125597 -43535 -98596 114482 -273190 -69295 -395047 110041 -72924 16100 -62965 -160811
10101 -160811 -391621 -136248 202405 -205563 84031 -255326 216332 -26370 70 219567 -127018
10089 95092 82978 115952 112004 -26407 137573 -355023 -98755 -213194 38853 -202502 -64736
10077 2990 -22399 313339 354615 -66631 112546 147825 -62448 -391480 -59313 221631 108103
10065 22801 -55993 -106811 -372888 249126 154044 -168891 89086 140794 -497386 -317941 -36322
10053 -117990 -207838 104087 74738 -169863 -511391 149141 -224171 -347220 -176753 -153459
10043 -153459 -295708 191497 -201529 177307 -43752 -172371 30333 39085 174097 -502576
10032 12282 -182514 -248874 25001 139011 33298 -105793 -262505 -342677 -124271 -102950 -10617
$$ packed form
10112A25597d3535n5061A14482b73190f9295l25752A10041g2924A6100f2965r7846
10101a60811k30810a36248B02405b05563H4031b55326B16332b6370G0K19497a27018
10089I5092j2114L2974l948b6407A37573c55023i8755j14439C8853b02502f4736
10077B990b2399C13339M1276f6631A12546L5279f2448l29032e9313B21631A08103
10065B2801e5993n0818k66077B49126r5082a68891H9086N1708d97386J79445c6322
10053a17990q9848A04087k9349a69863l41528A49141b24171j23049J70467K3294
10043a53459j42249A91497b01529A77307d3752j28619C0333Q752J35012e02576
10032A2282a82514o6360B5001J14010C3298a05793j56712q0172a24271K1321a0617
$$ plain form
10020 -328129 157347 -454187 111301 24696 102768 -450717 -318264 -180136 -227813 -87784
10009 63475 -45624 -146244 -369547 -39692 -177626 -90637 165959 -268200 181761 26979
9998 112102 60436 164071 -45454 70539 -46301 115004 -251601 -30138 257522 -70351 -115869
9987 -115869 79626 333096 -65026 -16143 32964 -69372 -77939 -132663 24249 -44024 -20021 -615580
9975 -615580 -163001 1815 213199 -156699 -21894 -118896 -114352 -156988 16128 -126775 -81014
9964 -81014 -215725 -138032 23321 -63224 107612 -138108 84147 -35063 -69775 66027 -647868
9952 19204 276453 192975 -154739 464428 227277 288671 -376124 74603 -110270 -185838 -203087
9941 -203087 -244524 -227331 -213974 79701 21443 74207 25120 -312039 -35147 342131 -98288
$$ packed form
10020c28129A57347d54187A11301B4696P8072d50717J32453J38128m7677h7784
10009F3475d5624j00620k23303c9692j37934Q6989A65959b68200A81761B6979
9998A12102n1666J03635d5454G0539d6301A15004b51601c0138B57522g0351m5518
9987a15869G9626K53470f5026a6143C2964f9372q567n4724B4249d4024b0021n95559
9975f15580a63001A815K11384a56699b1894r7002M544m2636A6128a26775M5761
9964h1014j34711P7693B3321f3224A07612a38108H4147c5063l4712F6027f47868
9952A9204K57249q3478a54739D64428B27277O1394c76124G4603a10270p5568j7249
9941b03087m1437J7193J3357G9701B1443N2764B5120c12039c5147C42131i8288
$$ plain form
9929 69034 -57280 -562987 184888 -182041 5806 82006 -275123 1917 -83667 14383 -448568
9917 -160584 -153497 -21402 -271754 -83558 207920 -117699 44128 -1398 -296137 291238 -36347
9905 -61586 84400 -199952 106836 124097 -48910 354893 -302377 -304075 -131579 -224287 55106
9893 31817 -93336 141575 -556681 210209 -158992 -161603 -24992 -152323 -148925 9732 -150608
9881 -86011 -263860 -175528 -45007 -131307 -73076 -164233 -227962 -466335 174710 93063 -198248
9869 54457 -79930 0 110523 26950 -132957 129924 -293113 284773 147653 -147283 -252669
9858 -252669 -8630 -325899 -124728 -257395 -492921 -301465 -16484 53833 -84701 -249501 -62655
9846 -193799 -61988 170021 121678 -25190 263251 488106 -276146 -113537 -450620 221576
$$ packed form
9929F9034e7280n05707A84888a82041E806P6200b75123A917h3667A4383d48568
9917a60584P087b1402k50352h3558B07920a17699D4128a398k94739B91238c6347
9905f1586H4400a99952A06836J7261d8910C54893c02377j698a31579r2708E5106
9893C1817i3336A41575e56681B10209a58992k611b4992j27331L398I732a50608
9881h6011j77849Q8332d5007q6300N8231r1157o3729k38373A74710q1647a98248
9869E4457g9930@A10523B6950a32957A29924b93113B84773j37120a47283j05386
9858b52669h630l17269a24728j32667k35526J91456a6484E3833h4701j64800f2655
9846a93799f1988A70021m8343b5190B63251K24855b76146a13537l37083B21576
$$ plain form
9835 10326 -176385 102572 -158487 63888 244167 -108811 -156487 -41530 119628 -85361 -290755
9824 -290755 -72264 -3595 -60649 53963 99237 289750 -485711 -95026 -208469 -28419 -29646
9813 -29646 -210881 58606 -101756 223884 -337046 -150139 -205567 -29492 -220272 -15274 141628
9801 -325630 -202375 67313 -350960 92083 -180670 108640 39141 -47699 -235162 304178
9790 9223 12113 231156 -45542 -48238 318991 17549 -382092 -1408 177116 211502 108295 161601
9778 161601 34991 244563 -75926 265521 -233144 -5462 -156034 123612 141612 1371 -25436
9766 20825 19278 149734 30895 -182868 184874 -100440 -190298 -367091 -74437 -402903 -58787
9754 44078 30250 -372615 10783 152676 154676 -140900 107881 -500917 -73080 -39541 -110864
$$ packed form
9835A0326a76385A02572a58487F3888J80279a08811m7676d1530A19628h5361k05394
9824b90755g2264c595n7054E3963M5274J90513d85711i5026j13443b8419j227
9813b9646j81235E8606a01756B23884c37046a50139n5428b9492j90780a5274A41628
9801c25630J23255F7313c50960I2083a80670A08640C9141d7699j87463C04178
9790I223K890K19043d5542k696C18991A7549c82092a408A77116L4386j03207N3306
9778A61601C4991K09572g5926B65521b33144e462j50572A23612J8000A371b5436
9766B0825j547J30456C0895a82868A84874a00440q9858j76793g4437l28466e8787
9754D4078j3828c72615A0783J41893K000a40900A07881e00917g3080L3539p1323
$$ plain form
9743 -110864 224693 -119261 -251381 -69629 -201511 -363082 -19654 -24938 20925 59435 384731
9732 384731 -16861 289961 -265100 -169819 -182114 -461998 90087 51424 60434 -35649 -254063
9721 -254063 -392966 32381 169487 -244559 -164913 -96959 -217147 -101013 -328923 -184564
9711 -184564 -209306 88037 -132208 -58502 -205558 -350701 174995 -205650 293363 57276
9700 -220843 106734 -290162 -104284 -232557 -118696 -213464 13094 14033 -281495 -163061 -179894
9689 -179894 -95016 -22265 -141282 57913 -121374 50679 -245062 -43252 -322005 -126134 -17199
9677 -196607 84447 -262504 -44197 -250101 -281185 103535 -17780 -126187 50513 -165403 -120392
9666 -120392 -182354 -10095 -320793 -3124 -193727 -303936 -175616 -169413 -41554 -305441 -1208
$$ packed form
9743a10864B24693a19261j32120f9629j31882j61571a9654n284B0925L8510L25296
9732C84731a6861B89961b65100R5281j2295k79884I0087l8663R010c5649k18414
9721b54063j38903C2381J37106b44559P9646O7954j20188a01013k27910J44359
9711a84564k4742H8037a32208e8502j47056j45143A74995b05650B93363E7276
9700b20843A06734b90162a04284j28273J13861r4768A3094R39b81495J18434j6833
9689a79894Q4878b2265j19017E7913a21374E0679b45062d3252k78753a26134a7199
9677a96607H4447b62504d4197k05904l1084A03535a7780j08407E0513a65403M5011
9666a20392o1962a0095l10698c124j90603j10209J28320O203d1554k63887a208
$$ plain form
9654 152478 122939 31576 242900 -139185 39938 -20982 -187859 309029 185047 -246021
9643 13635 274859 -197445 61258 -103426 -83227 -165856 87927 -46841 -41912 -159744 -223785
9632 -223785 -201610 -188562 139209 -90096 -75537 59466 61505 -203719 243940 -91408 51235
9620 -143765 215342 222081 -139242 -70239 -372957 -218146 -285608 -28733 32542 9341 59790
9609 59790 86558 124877 -170881 -43804 171078 318539 -7617 21798 -298867 51964 -87285
9597 -8236 -52114 -19705 -211285 118956 88082 -229825 -91021 37682 -66438 -283830 -187197
9586 -187197 -163527 -197695 158923 -51111 -86146 106768 -206104 149729 -66680 -340566 -112735
9574 -224326 -379499 340200 412379 -215115 -288173 236750 -261829 85603 -31092 -141424
$$ packed form
9654A52478k9539C1576K11324a39185C9938b0982j66877C09029j23982b46021
9643A3635K61224a97445F1258a03426K0199q2629H7927d6841M929j17832o4041
9632b23785K2175J3048A39209i0096J4559E9466K039b03719B43940i1408E1235
9620a43765B15342O739a39242O9003l02718J54811o7462b8733C2542I341N0449
9609E9790K6768L8319a70881d3804A71078J47461g617B1798b98867E1964h7285
9597h236m3878a9705j91580A18956l0874b29825i1021C7682f6438k17392R6633
9586a87197K3670l4168A58923e1111l5035A06768b06104A49729f6680k73886a12735
9574b24326j55173C40200P2179b15115p3058B36750b61829H5603c1092j10332
$$ plain form
9564 -141424 34221 -208329 -399825 43378 17417 -161735 -164446 200844 -30231 -233406 -354817
9553 -354817 170153 10962 -312152 -5044 -217048 -175219 158202 -126538 222050 283846 -110391
9541 216127 73850 222839 -170402 134242 -103521 -18645 -240105 -214211 -231472 154471
9530 169339 -11876 251237 -373954 63806 -85632 -74659 7725 -159101 -34004 -174817 187559
9518 -51139 -215172 128948 97490 -32533 -8982 39337 -207191 -221048 -211640 92269 -5590 179842
9505 23647 -91202 -292325 86230 -16653 54260 -97023 -64477 -88165 -139940 -233601 65648 -199024
9492 -582149 140791 -105555 150742 -140447 -80897 411432 30694 36188 -13315 -56281 -130392
9481 -130392 -125382 136556 213974 71671 -135037 12432 -161685 -307460 4019 304658 -201384
$$ packed form
9564a41424C4221b08329j91496D3378A7417a61735k711B00844c0231k03175j21411
9553c54817A70153A0962c12152e044k12004M1829A58202a26538B22050O1796a10391
9541B16127G3850J48989a70402A34242a03521a8645k21460K5894j7261A54471
9530A69339a1876B51237c73954F3806h5632J0973G725a59101c4004j40813A87559
9518e1139j64033A28948l1458c2533h982C9337b07191j3857R408I2269e590A79842
9505B3647i1202k01123H6230a6653E4260i7023L2546k3688n1775r3661F5648a99024
9492e82149A40791a05555A50742a40447N9550D11432C0694N494a3315m2966p4111
9481a30392N010A36556P7418G1671a35037A2432a61685j45775D019L00639b01384
$$ plain form
9469 -252617 -131396 -205171 204846 -99796 -173207 61145 -234241 4048 93185 -145998 -164834
9458 -164834 -148407 238765 2090 -121513 58530 -48564 -88420 -135494 -129244 -101288 9510 -337256
9445 -261535 -112690 -38019 82377 229075 -290741 -119948 106655 -246959 -56555 -330817
9435 -330817 126582 -164990 72194 110602 -243043 88967 50336 -31322 -254300 193251 7512
9423 -121310 -42541 189143 -289273 -249197 -37078 -43092 -99439 25263 70971 156517 -279769
9411 164027 -87954 134283 -161103 242256 -407421 30374 -406821 215353 -58417 -74807
9401 -74807 -30434 221306 -180894 118462 -207240 -7744 -106746 256578 139083 47372 39196
9390 39196 -48388 -188484 2390 -45988 -178968 -25598 -361870 -300795 -146204 -471 -299368
$$ packed form
9469b52617J21221p3775B04846i9796p3411F1145b34241D048Q9137a45998j8836
9458a64834J6427B38765B090a21513E8530d8564l9856m7074O250K7956I510c37256
9445b61535a12690c8019H2377J46698b90741a19948A06655b46959e6555k74262
9435c30817A26582a64990G2194L8408b43043H8967l8631c1322k22978A93251G512
9423a21310d2541A89143b89273M0076c7078o014n6347B5263M5708Q5546b79769
9411A64027h7954A34283a61103B42256d07421C0374d06821B15353e8417j6390
9401g4807c0434B21306a80894A18462b07240g744r9002B56578j17495D7372q176
9390C9196d8388j40096B390d5988j32980b5598l36272O1075a46204d71k98897
$$ plain form
9379 -299368 56021 -64336 72277 -137379 -243860 70357 -44765 -183578 -19351 -149031 62507
9367 -167767 86807 -370270 -39872 68002 70383 -170917 -61023 -379550 -105003 -325733 -97976
9355 -66650 280294 188053 49086 -56359 -290524 49277 -393370 -181525 -176410 -124851 -127746
9344 -127746 -219115 -6130 -13727 73729 -163123 -341445 9600 378337 -32188 189811 151758
9333 151758 -361426 -66419 187157 -65613 -159691 -261067 -208604 -38579 191807 -133223 42078
9321 -133933 290382 -315984 -14668 -116108 -16985 -239987 124600 50771 169440 -45217
9310 -74798 -310911 -350606 34646 -89580 -94193 -34800 -67976 -165613 -38172 -52143 -285958 -193221
9298 -193221 48984 -196395 -115717 86205 -169848 -197894 177557 94964 171806 -190890 60018
$$ packed form
9379b99368E6021f4336G2277a37379j06481G0357d4765j38813a9351j29680F2507
9367a67767H6807c70270c9872F8002K381a70917f1023l18527a05003k20730i7976
9355f6650B80294r2241D9086e6359k34165D9277c93370a81525N115N1559k895
9344a27746r1369f130p597G3729a63123j78322I600L68737c2188A89811l8053
9333A51758c61426f6419A87157f5613r4078j01376N2463c8579A91807a33223D2078
9321a33933B90382c15984a4668j01440a6985k23002A24600E0771J18669d5217
9310g4798k36113l9695C4646h9580m613c4800l3176r7637c8172j3971k33815R2737
9298a93221D8984a96395Q0678H6205a69848k8046A77557q2593P6842a90890F0018
$$ plain form
9286 -47271 -125093 280629 221376 -307521 41302 -100337 244748 -57374 377851 174789 14028
9274 55745 -121950 -262637 96104 -164428 146642 -61244 18303 -66643 111073 401338 -140565
9262 -142019 -54460 115008 -145913 -198257 -4047 -6461 374141 -363890 -385615 -256071 17803
9250 193625 180712 -108959 6673 -88322 -215799 192208 169438 14622 -192010 -199518 -74385
9238 -65155 -119355 60516 242495 -185199 -101429 -35288 -240149 232462 -69679 -362182 -237914
9227 -237914 21515 243122 -41752 -36878 -159945 -368891 -102559 12109 126949 -210717 105064
9215 -99783 -186606 -429009 -53108 -152052 79648 -295505 105863 -102888 12111 -307109 138371
9203 -294056 -106891 -300990 251454 -16745 162650 49449 187632 -88403 -34835 116916
$$ packed form
9286d7271p7822B80629n9253c07521D1302a00337B44748e7374C77851A74789A4028
9274E5745a21950j40687I6104a64428A46642f1244A8303f6643A11073K90265a40565
9262a42019e4460A15008a45913n2344d047k414C74141c63890k1725J29544A7803
9250A93625j2913a08959F673h8322j27477A92208k2770A4622a92010p508g4385
9238f5155n4200F0516J81979a85199Q3770c5288k04861B32462f9679k92503J24268
9227b37914B1515K21607d1752M874j23067k08946a02559A2109J14840b10717A05064
9215i9783q6823k42403e3108r8944G9648b95505A05863a02888A2111c07109A38371
9203b94056a06891j94099B51454a6745A62650D9449J38183h8403c4835A16916
$$ plain form
9192 -97602 -214641 -131496 -169585 158045 -345332 -93706 -242800 84423 36509 14422 68085
9181 68085 -58632 -67928 136484 -105878 -302284 94981 -83573 29644 -94588 -1110 -92682 47504
9168 -10665 -36477 -114634 -201593 51582 267880 -409243 -163209 131681 -84585 -103826 -51624
9156 -138841 -142105 -23844 -22371 -465379 -41627 -81031 -55217 323111 -143163 -299051 -245851
9145 -245851 -57315 101494 -422750 -12865 -209339 -48252 -304835 -248520 246084 -58688 -341922
9134 -341922 -52321 -79397 -105843 134200 -110103 66598 135451 214556 -223189 183959 143404
9123 143404 -414939 -299721 188185 64811 51967 78647 49772 -25740 -293535 309376 -20660
9111 -81412 55576 30082 -594631 -14631 52695 -158691 -184547 -254722 -389984 -167243 -90112
$$ packed form
9192i7602j17039Q3145l8089A58045c45332i3706j49094H4423C6509A4422N3663
9181F8085e8632r296A36484a05878j96406I4981h3573B9644i4588a110r1572D7504
9168a0665k5812p8157q6959E1582K16298d09243a63209A31681h4585j9241e1624
9156a38841l264b3844J473m43008d1627l9404K5814C23111a43163j55888N3200
9145b45851e7315A01494d22750a2865j96474d8252k56583N6315B46084e8688k83234
9134c41922e2321k7076k6446A34200a10103F6598O8853P9105b23189A83959m0555
9123A43404d14939J15218A88185F4811j2844K6680k8875b5740k67795C09376b0660
9111h1412E5576k5494e94631a4631E2695a58691k5856p0175j35262a67243P7131
$$ plain form
9100 -90112 44392 -27305 -113917 -102299 -284349 -49160 264238 321146 -375058 -47206 -33111
9089 -33111 -169315 -50673 -266801 -22562 26917 -53919 -19688 10073 -215175 114770 92496
9078 92496 -113542 -243835 115698 -178738 -111649 -82278 73333 4190 -23738 38004 81994
9067 81994 -11248 161055 8411 -33094 -272962 -116995 -31321 -25918 -216565 246383 -41138
9055 7730 -4832 -123395 -91360 -67545 -64029 -355455 -148265 -242325 209693 -100272 21406
9043 149470 -34881 -18216 -13626 -2939 23741 210381 56264 -191297 177288 -256638 106761
9031 96420 144905 34262 209533 -144193 -60918 -168672 119162 88868 -316214 35845 -227433
9019 -202143 -19535 45351 -242979 113627 54577 95701 -186003 53551 41202 -102205 43507
$$ packed form
9100i0112D4392b7305q6612J1618j82050d9160B64238N6908c75058d7206J4095
9089c3111j36204e0673k16128b2562B6917e3919a9688A0073b15175A14770k2274
9078I2496a13542j30293A15698a78738O7089K9371G3333D190b3738C8004M3990
9067H1994a1248A61055H411c3094k39868a16995c1321N403j90647B46383d1138
9055G730d832j18563L2035K3815L516k91426a48265r4060B09693a00272B1406
9043A49470c4881J6665M590b939B3741J86640E6264a91297A77288b56638A06761
9031I6420M8485C4262J75271a44193f0918j07754A19162l0294c16214C5845b27433
9019b02143a9535D5351b42979A13627E4577M1124a86003E3551j2349a02205D3507
$$ plain form
9007 975 -549314 -280859 -303812 -113435 -164695 -276303 -76602 -44968 -424889 23366 -337376
8995 -113646 92810 -1398 -275712 -126387 222960 -3128 -103718 -252227 -167681 -46902 117916
8983 20003 164320 -36260 164431 102175 -2221 17292 -5734 -156510 20244 -101828 -210507
8972 -210507 -350877 115349 83466 -144794 -22243 136063 3757 -166000 -170099 267620 -31844
8960 207687 -69513 -343510 75384 -5799 -409603 -399782 90478 -136949 -152028 46063 26223
8949 26223 -150361 -193753 198318 -103352 113006 -174263 58598 98850 183687 -241283 -75447
8937 21589 286916 215970 194346 380386 -67980 -253891 194638 -44239 -111568 60980 -13328
8925 393519 597779 1019971 3776276 9324533 8002218 1883937 693206 547882 377774
$$ packed form
9007I75e49314K68455k2953a13435n1260j11608g6602L1634l79921B3366c37376
8995a13646I2810a398k74314a26387B22960c128j00590j48509Q4546d6902A17916
8983B0003J44317c6260A64431o2256b221A7292e734j50776B0244a01828j08679
8972b10507j40370A15349l1883a44794b2243A36063C757a66000m099B67620c1844
8960B07687f9513k73997G5384e799m03804R821I0478a36949j5079D6063j9840
8949B6223a50361m3392A98318a03352A13006a74263E8598M0252Q4837b41283g5447
8937B1589K65327p0946k1624J86040f7980j85911A94638d4239o7329F0980a3328
8925C93519K04260M22192K756305N548257j322315A883937F93206j45324j70108
$$ plain form
8916 377774 83389 278094 61996 35020 -194562 -232758 -71201 355563 197476 339147 -121189
8904 -103868 -284272 -451883 301229 346999 233365 -16928 -166136 -41286 -93563 -228916
8894 -228916 191160 194629 84048 111222 74843 212526 268740 -100406 226576 -156764 -185444
8883 -185444 142506 84182 276027 254209 184087 -279424 118129 -155196 -217059 -164855 -261805
8872 -261805 -167762 -23979 -313859 221079 -217641 96035 88661 -148369 77230 -163431 174098
8860 -45155 223990 -168641 -93946 -43000 -225092 58337 -182082 125019 -79742 -58033 -136449
$$ packed form
8916C77774H3389J94705F1996k6976a94562l8196g1201C55563j58087J41671a21189
8904a03868j80404j67611C01229M5770j13634a6928j49208d1286n2277j35353
8894b28916A91160L469H4048K7174l6379J37683N6214a00406B26576a56764k8680
8883a85444A42506n8324J91845k1818p0122b79424A18129a55196o1863N2204r6950
8872b61805R4043b3979k89880B21079b17641I6035p374a48369G7230a63431A74098
8860d5155B23990a68641P4695d3000j82092E8337a82082A25019g9742K1709p8416
$$ [...]
##END NTUPLES=NMR SPECTRUM
##END=
