
##TITLE=UV1203_M3_1292-1211_7185511_viriHghTa3
##JCAMPDX= 6.0         $$ Bruker NMR JCAMP-DX V2.0
##DATA TYPE= NMR SPECTRUM
##DATA CLASS= NTUPLES
##ORIGIN= BRUKER
##OWNER= Administrator
$$ 1.72 TOPSPIN		Version 2.1
$$ 2012-12-06 04:27:04.090 -0500  Administrator@X
$$ Compression mode = diff/dup
##.OBSERVE FREQUENCY= 400.02188249412
##.OBSERVE NUCLEUS= ^1H
##.ACQUISITION MODE= SIMULTANEOUS (DQD)
##.ACQUISITION SCHEME= undefined
##.AVERAGES= 64
##.DIGITISER RES= 22
##SPECTROMETER/DATA SYSTEM= spect
##.PULSE SEQUENCE= noesygpps1d.comp
##.SOLVENT NAME= COFFEE_meoh
##.SHIFT REFERENCE= INTERNAL, COFFEE_meoh, 1, 14.96079
##AUDIT TRAIL= $$ (NUMBER, WHEN, WHO, WHERE, PROCESS, VERSION, WHAT)
$$ ##TITLE= Audit trail, TOPSPIN		Version 2.1
$$ ##JCAMPDX= 5.01
$$ ##ORIGIN= Bruker BioSpin GmbH
$$ ##OWNER= Administrator
$$ $$ E:\/data/COFFEE/nmr/UV1203_M3_1292-1211_7185511_viriHghTa3/12/pdata/1/auditp.txt
$$ ##AUDIT TRAIL=  $$ (NUMBER, WHEN, WHO, WHERE, PROCESS, VERSION, WHAT)
(   1,<2012-12-06 04:26:57.996 -0500>,<Administrator>,<X>,<go>,<TOPSPIN 2.1>,
      <created by zg
	started at 2012-12-06 04:15:28.260 -0500,
	POWCHK enabled, PULCHK disabled,
       configuration hash MD5:
       86 BA 57 50 F2 9D 5C 9B 26 00 A9 28 5F 66 2E 89
       data hash MD5: 64K
       46 38 17 DB DF 77 84 0D 92 00 43 C5 5E 5D 29 F7>)
(   2,<2012-12-06 04:27:01.199 -0500>,<Administrator>,<X>,<proc1d>,<TOPSPIN 2.1>,
      <Start of raw data processing
       efp LB = 0.3 FT_mod = 6 PKNL = 1 PHC0 = 0 PHC1 = 0 SI = 128K 
       data hash MD5: 128K
       CD B8 B8 4E AF DD 56 8F 92 13 96 D9 0B 45 B6 1E>)
(   3,<2012-12-06 04:27:02.277 -0500>,<Administrator>,<X>,<proc1d>,<TOPSPIN 2.1>,
      <pk PHC0 = -78.87634 PHC1 = 0 
       data hash MD5: 128K
       FE 77 E0 AE 21 3C 50 8B FA 7E D0 9F 54 96 35 DA>)
(   4,<2012-12-06 04:27:02.981 -0500>,<Administrator>,<X>,<proc1d>,<TOPSPIN 2.1>,
      <abs ABSG = 1 
       data hash MD5: 128K
       36 09 E3 31 5D 76 CD 7F B9 A7 5D A2 ED 99 DF 00>)
(   5,<2012-12-06 04:27:03.199 -0500>,<Administrator>,<X>,<proc1d>,<TOPSPIN 2.1>,
      <abs ABSG = 2 
       data hash MD5: 128K
       57 24 D6 CA 4E CD 0A 80 48 00 B4 C4 02 82 BF BE>)
(   6,<2012-12-06 04:27:03.371 -0500>,<Administrator>,<X>,<proc1d>,<TOPSPIN 2.1>,
      <abs ABSG = 3 
       data hash MD5: 128K
       5E 0A 9F 5E 57 51 E6 9A 64 37 7D CC D0 F2 38 50>)
(   7,<2012-12-06 04:27:03.559 -0500>,<Administrator>,<X>,<proc1d>,<TOPSPIN 2.1>,
      <abs ABSG = 4 
       data hash MD5: 128K
       94 DF 95 B1 1F 7D C8 C2 3E C3 44 F0 11 8D 7E 59>)
(   8,<2012-12-06 04:27:03.746 -0500>,<Administrator>,<X>,<proc1d>,<TOPSPIN 2.1>,
      <abs ABSG = 5 
       data hash MD5: 128K
       C3 97 A5 6B DF DB 2C 97 96 D2 25 C6 2E 64 2B 9A>)
$$ ##END=
$$ 
$$ $$ hash MD5
$$ $$ 06 3C 54 28 4C 42 1A 2C 59 F6 AE 59 2B 7A 2F 75
##$RELAX= 
##$RELAX= 
##$RELAX= 
##$RELAX= 
##$RELAX= 
##$RELAX= 
##$RELAX= 
##$RELAX= 
$$ Bruker specific parameters
$$ --------------------------
##$DU= <E:\>
##$EXPNO= 12
$$ [...]
##$TP07= 0
##$TPNAME0= <>
##$TPNAME1= <>
##$TPNAME2= <>
##$TPNAME3= <>
##$TPNAME4= <>
##$TPNAME5= <>
##$TPNAME6= <>
##$TPNAME7= <>
##$TPOAL= (0..7)
0.5 0.5 0.5 0.5 0.5 0.5 0.5 0.5
##$TPOFFS= (0..7)
0 0 0 0 0 0 0 0
##$TUNHIN= 0
##$TUNHOUT= 0
##$TUNXOUT= 0
##$USERA1= <user>
##$USERA2= <user>
##$USERA3= <user>
##$USERA4= <user>
##$USERA5= <user>
##$V9= 5
##$VALIST= <valist>
##$VCLIST= <CCCCCCCCCCCCCCC>
##$VD= 0
##$VDLIST= <DDDDDDDDDDDDDDD>
##$VPLIST= <PPPPPPPPPPPPPPP>
##$VTLIST= <TTTTTTTTTTTTTTT>
##$WBST= 1024
##$WBSW= 4
##$XGAIN= (0..3)
0 0 0 0
##$XL= 0
##$YL= 0
##$YMAX_a= 6192124
##$YMIN_a= -12127891
##$ZGOPTNS= <>
##$ZL1= 120
##$ZL2= 120
##$ZL3= 120
##$ZL4= 120
##$ABSF1= 14.96079
##$ABSF2= -5.597392
##$ABSG= 5
##$ABSL= 3
##$ALPHA= 0
##$AQORDER= 0
##$ASSFAC= 0
##$ASSFACI= 0
##$ASSFACX= 0
##$ASSWID= 0
##$AUNMP= <proc_prof1d_extract.lims>
##$AXLEFT= 0
##$AXNAME= <>
##$AXNUC= <1H>
##$AXRIGHT= 0
##$AXTYPE= 0
##$AXUNIT= <>
##$AZFE= 0.1
##$AZFW= 0.1
##$BCFW= 0
##$BC_mod= 0
##$BYTORDP= 0
##$COROFFS= 0
##$CY= 15
##$DATMOD= 1
##$DC= 0
##$DFILT= <>
##$DTYPP= 0
##$F1P= 0
##$F2P= 0
##$FCOR= 0.5
##$FTSIZE= 131072
##$FT_mod= 6
##$GAMMA= 0
##$GB= 0
##$INTBC= 1
##$INTSCL= 1
##$ISEN= 128
##$LB= 0.3
##$LEV0= 0
##$LPBIN= 0
##$MAXI= 10000
##$MC2= 0
##$MEAN= 0
##$ME_mod= 0
##$MI= 0
##$NCOEF= 0
##$NC_proc= -2
##$NLEV= 6
##$NOISF1= 0
##$NOISF2= 0
##$NSP= 0
##$NTH_PI= 0
##$NZP= 0
##$OFFSET= 14.96079
##$PC= 1
##$PHC0= -78.87634
##$PHC1= 0
##$PH_mod= 1
##$PKNL= yes
##$PPARMOD= 0
##$PPDIAG= 0
##$PPIPTYP= 0
##$PPMPNUM= 2147483647
##$PPRESOL= 1
##$PSCAL= 4
##$PSIGN= 0
##$PYNMP= <proc.py>
##$REVERSE= no
##$SF= 400.020009721533
##$SI= 131072
##$SIGF1= 0
##$SIGF2= 0
##$SINO= 400
##$SIOLD= 131072
##$SPECTYP= <>
##$SREGLST= <1H.CDCl3>
##$SSB= 0
##$STSI= 131072
##$STSR= 0
##$SW_p= 8223.68421052631
##$SYMM= 0
##$S_DEV= 0
##$TDeff= 65536
##$TDoff= 0
##$TI= <>
##$TILT= no
##$TM1= 0
##$TM2= 0
##$TOPLEV= 0
##$USERP1= <user>
##$USERP2= <user>
##$USERP3= <user>
##$USERP4= <user>
##$USERP5= <user>
##$WDW= 1
##$XDIM= 131072
##$YMAX_p= 428715448
##$YMIN_p= -13000
##$CURPLOT= <Network HP LaserJet P1505>
##$CURPRIN= <$Network HP LaserJet P1505>
##$DFORMAT= <normdp>
##$LAYOUT= <+/1D_H.xwp>
##$LFORMAT= <normlp>
##$PFORMAT= <normpl>
##$SURQMSG= 1
$$ End of Bruker specific parameters
$$ ---------------------------------
##NTUPLES= NMR SPECTRUM
##VAR_NAME=  FREQUENCY,     SPECTRUM/REAL,   SPECTRUM/IMAG
##SYMBOL=    X,             R,               I
##VAR_TYPE=  INDEPENDENT,   DEPENDENT,       DEPENDENT
##VAR_FORM=  AFFN,          ASDF,            ASDF
##VAR_DIM=   131072,        131072,          131072
##UNITS=     HZ,            ARBITRARY UNITS, ARBITRARY UNITS
##FACTOR=    0.0627417313425164, 1,          1
##FIRST=     8223.62146879497, 46,           -52258
##LAST=      0,             133,             -53050
##MIN=       0,             -13000,          0
##MAX=       8223.62146879497, 428715448,    0
$$ Real data points
##PAGE= N=1
##DATA TABLE= (X++(R..R)), XYDATA
$$ [...]
61724D17664J520J736K213K552K403K188K614L525L969L571L086L194L518L377
61710D57130K871K475K101J384M82l03j369l173m925n126l596j916j497k134k910
61695D39494l547m229m798m924m643m108l245k206j669k001k576k629k403k613
61681C93903l117l055k256j508j315j303j095r47j052j011n08j9j76q27j321j449
61665C72944j469j409j004l51J1j80o04r32j225j508j431p50J52P46J084J569
61649C65643K125K204J733J375J561J793J447Q54R32J851K784L042K805K542K273
61634C94964J789J189O80J50n95j340j637j510j530k135l167m090m420l933k800
61619C71615j645j151j372j648j324m98J66K21j73n71p75r54j334j902k498l079
$$ y = [417664, 419184, 420920, 423133, 425685, 428088, 430276, 432890, 436415, 440384, 443955, 447041, 450235, 453753, 457130, 460001, 462476, 464577, 465961, 466443, 466140, 464771, 461598, 456673, 451547, 447951, 446035, 444538, 442404, 439494, 435947, 431718, 426920, 421996, 417353, 413245, 410000, 407794, 406125, 404124, 401548, 398919, 396516, 393903, 390786, 387731, 385475, 383967, 382652, 381349, 380254, 379307, 378255, 377244, 376736, 376717, 376541, 375714, 374393, 372944, 371475, 370066, 369062, 368711, 368722, 368542, 367938, 367006, 365781, 364273, 362842, 362092, 362244, 362990, 364074, 365643, 367768, 369972, 371705, 373080, 374641, 376434, 377881, 378735, 379667, 381518, 384302, 387344, 390149, 392691, 394964, 396753, 397942, 398622, 398772, 398177, 396837, 395200, 393690, 392160, 390025, 386858, 382768, 378348, 374415, 371615, 369970, 368819, 367447, 365799, 364475, 363977, 364143, 364364, 364191, 363620, 362845, 361891, 360557, 358655, 356157, 353078]
61603C53078l804m745n661o182o154n748n172m501l760l133k927l249l751l800
61589B90491l088k088j621j919k335k191j625j254j214j044n14o1j97q68j646
61574B68826k234k440k039j076j28J70j08l45k65j86l12k76K10O87M78k91q04
61557B59867p02m96o49p95k77P96J564J436P19K39N73J605K587K736K014J173
61541B72390Q20O40Q0n33k90Q56J825J844J365J159J168R33M47r3q86j970k518
61524B77237j683k2R71P08k9m90q03j165j259r44o92p71p87n89p41j427j683p38
61506B65093N11N67n21j273r82m93n93q28n18M4J68n6j2L46M55Q5l07k76P3M01
61486B61884O31R01J183J179P12R0q9L89R69Q79Q8n63k98P79J893K404K166J401
$$ y = [353078, 349274, 344529, 338868, 332686, 326532, 320784, 315612, 311111, 307351, 304218, 301291, 298042, 294291, 290491, 287403, 285315, 283694, 281775, 279440, 277249, 275624, 274370, 273156, 272112, 271598, 271537, 271340, 270472, 268826, 266592, 264152, 262113, 261037, 260909, 261079, 260971, 260626, 260361, 260175, 259863, 259587, 259797, 260484, 260962, 260671, 259867, 259165, 258669, 258020, 257225, 256948, 257744, 259308, 260744, 261463, 261702, 262275, 263880, 266467, 269203, 271217, 272390, 273210, 273850, 273930, 273397, 273107, 273963, 275788, 277632, 278997, 280156, 281324, 282257, 282704, 282611, 281725, 279755, 277237, 275554, 275532, 276503, 277211, 277182, 276692, 275889, 274724, 273465, 272521, 271829, 271058, 270271, 269682, 268941, 267514, 265831, 265093, 265604, 266171, 265650, 264377, 263395, 262902, 262309, 261481, 260963, 261007, 261175, 261119, 261107, 261453, 261908, 261993, 261686, 261410, 261483, 261884, 262515, 263416, 264599, 265778, 266490, 266580, 266491, 266880, 267849, 268728, 268816, 268253, 267955, 268734, 270627, 273031, 275197, 276598]
61468B76598N17k6n6J35J52M7J44M13L74k11q80j012o19k62k73l27O2R04J721
61449B77401K059J867J434J100J019J142J311J430J504J530J413J084O78M79O50
61434B96101J096J574J860J810J507J359J865K959L805L515K127O02j91k39l4
61419C19716K26P07J421K001K142J965J823J863J954J928J721J278N57k88q82
61404C38132r43o12l40m13o92q70q91r20r55p02k0O32N06n07j455j193K75J607
61386C30639J514J92r52r18p6N88P30P39Q16O27M2l38J56J278K048J873J059K03
61368C40220m45q18p20k06Q8l87j124r56M42J950K368J845J455J670J976J936
61352C49294J915K443L469M571N526O257O549O376O294O848P591P281N453L332
$$ y = [276598, 277115, 277089, 277033, 277168, 277320, 277367, 277511, 277924, 278298, 278087, 277207, 276195, 275576, 275314, 275041, 274714, 274776, 275680, 277401, 279460, 281327, 282761, 283861, 284880, 286022, 287333, 288763, 290267, 291797, 293210, 294294, 294972, 295451, 296101, 297197, 298771, 300631, 302441, 303948, 305307, 307172, 310131, 313936, 317451, 319578, 320180, 319989, 319750, 319716, 319942, 320649, 322070, 324071, 326213, 328178, 330001, 331864, 333818, 335746, 337467, 338745, 339302, 339014, 338132, 337189, 336577, 336237, 335824, 335132, 334262, 333371, 332451, 331496, 330794, 330774, 331406, 331912, 331405, 329950, 328757, 329032, 330639, 332153, 332345, 331393, 330475, 330399, 330987, 331717, 332456, 333272, 333899, 333941, 333603, 333759, 335037, 337085, 338958, 340017, 340220, 339775, 338957, 338237, 338031, 338119, 337732, 336608, 335652, 336094, 338044, 340412, 342257, 343712, 345382, 347358, 349294, 351209, 353652, 357121, 361692, 367218, 373475, 380024, 386400, 392694, 399542, 407133, 414414, 419867, 423199]
61338D23199K608L499M561M479L503K819K927L196K921K189J563J310J325J456
61324D61555J525J201L18p43j368j478j547j873k140j891j097q7Q30J518K095
61309D56818K975M499O365P740Q250Q465R108J0099J0862J1248J1591J1940J1840
61296E71800J0933R278P039M263J224j495l502m943o170p221p888q078p926p668
61282E49646p527p637p941q139p890p065n859m690l873l268k463j367m53p7J49
61267D81546Q58J935K573K385J918J871K262K676K937L239L814M773O011P114
61253E25912P540P074N987M651L360K516K486K974L058K257J168O43O70O39L70
61238E71305K21K83R4o96j813k598k573j799r13n93p28m58O40J790K135K166L137
$$ y = [423199, 425807, 429306, 433867, 438346, 441849, 444668, 447595, 450791, 453712, 455901, 457464, 458774, 460099, 461555, 463080, 464281, 464599, 463856, 462488, 461010, 459463, 457590, 455450, 453559, 452462, 452375, 453205, 454723, 456818, 459793, 464292, 470657, 478397, 486647, 495112, 504220, 514319, 525181, 536429, 548020, 559960, 571800, 582733, 592011, 599050, 603313, 604537, 603042, 599540, 594597, 588427, 581206, 573318, 565240, 557314, 549646, 542119, 534482, 526541, 518402, 510512, 503447, 497588, 492898, 489025, 485757, 483294, 481927, 481474, 481397, 481546, 482404, 484339, 486912, 489297, 491215, 493086, 495348, 498024, 500961, 504200, 508014, 512787, 518798, 525912, 533452, 540526, 546513, 551164, 554524, 557040, 559526, 562500, 565558, 567815, 568983, 569626, 570296, 570935, 571305, 571526, 571809, 571903, 571207, 569394, 566796, 564223, 562424, 561511, 560918, 560190, 559732, 560372, 562162, 564297, 566463, 569600]
61221E69600N133O797P203O962O989P073O467N246M258M011M344M915N370N171
61207F49539M073K685J912J771J451O28JK24R27J383J635K294L481M651N515O489
61191F88659P965R634J0881J1505J1645J1177R779P557N227L382J937N13q42j629
61177G77390j541r57p75j706l569n236n628m880m216m513n342n789n730n715n941
61162G15852o091o172o695p873r255j0346j1036j1227j0721r816r358r642r796
61149E97824q821o866m894l401k172j127o34q79j582k439l442m506n232n288m879
61134E41662m565m672m925m662l422j501K19J094J378J844K880M231N533O794
61120E41888Q178R602J0798J1712J2664J3988J5585J7037J8187J9379K0863K2200
$$ y = [569600, 574733, 581530, 588733, 595695, 602684, 609757, 616224, 621470, 625728, 629739, 634083, 638998, 644368, 649539, 653612, 656297, 658209, 659980, 661431, 662059, 662060, 662284, 663211, 664594, 666229, 668523, 672004, 676655, 682170, 688659, 696624, 706258, 717139, 728644, 740289, 751466, 761245, 768802, 774029, 777411, 779348, 779861, 779019, 777390, 775849, 774892, 774117, 772411, 768842, 763606, 757978, 753098, 748882, 744369, 739027, 733238, 727508, 721793, 715852, 709761, 703589, 696894, 689021, 679766, 669420, 658384, 647157, 636436, 626620, 617262, 607620, 597824, 589003, 582137, 577243, 573842, 571670, 570543, 569909, 569030, 567448, 565009, 561567, 557061, 551829, 546541, 541662, 537097, 532425, 527500, 522838, 519416, 517915, 518134, 519228, 520606, 522450, 525330, 529561, 535094, 541888, 550066, 559668, 570466, 582178, 594842, 608830, 624415, 641452, 659639, 679018, 699881, 722081]
61108G22081K2725K2420K1839K1191K0263J9321J9135J9625J9429J7570J4895
61097I40494J2807J1164Q552M444r8l954p050r765j2151j4177j5875j7032j7303
61084H80056j7003j7008j7614j8180j8228j8073j7945j7334j5929j4482j3943
61073F94317j4085j3835j2663j0954r189p454n717m088k743j880j603j575j128
61060F07403q6Q96J276J568K708M723O669P830Q365Q771R379J0364J1711J3006
61046F94583J3779J4235J5237J7259J9742K1754K3094K4436K6419K8865L1083
61035I30486L2876L4879L7734M1123M4205M6837M9746N3215N6368N8158N8643
61024A444270N8794N9557O1593O5451P1252P8412Q6259R4748J04171J14625J26403
$$ y = [722081, 744806, 767226, 789065, 810256, 830519, 849840, 868975, 888600, 908029, 925599, 940494, 953301, 964465, 973017, 977461, 977363, 973409, 966359, 956594, 944443, 930266, 914391, 897359, 880056, 863053, 846045, 828431, 810251, 792023, 773950, 756005, 738671, 722742, 708260, 694317, 680232, 666397, 653734, 642780, 633591, 626137, 620420, 616332, 613589, 611709, 610106, 608531, 607403, 607317, 608213, 609489, 611057, 613765, 618488, 625157, 632987, 641352, 650123, 659502, 669866, 681577, 694583, 708362, 722597, 737834, 755093, 774835, 796589, 819683, 844119, 870538, 899403, 930486, 963362, 998241, 1035975, 1077098, 1121303, 1168140, 1217886, 1271101, 1327469, 1385627, 1444270, 1503064, 1562621, 1624214, 1689665, 1760917, 1839329, 1925588, 2020336, 2124507, 2239132, 2365535]
61013B365535J40582J58692J82280K13487K55281L10173L79372M64371N68569
61004E038342O95543Q46201J019601J215868J434660J668250J895817K081671
60996A5895953K174294K110251J837749J360526P68723K15456j57975k92202k22468
60987B3690307m0117J47770K33785J23413k27230p69705j367856j863045k152835
60978A7774487k223470k124632j923978j678625j428531j197743r96378q25116
60970E376014o81343n62290m64625l84434l18813k66355k25590j94016j69006
60961B109542j48785j32103j17814j05204r4060q3991p4228o4458n5302m7532
60951A186065m1266l6367l3111l1752l1649l1394l0024k7730k5285k3120k1032
$$ y = [2365535, 2506117, 2664809, 2847089, 3060576, 3315857, 3626030, 4005402, 4469773, 5038342, 5733885, 6580086, 7599687, 8815555, 10250215, 11918465, 13814282, 15895953, 18070247, 20180498, 22018247, 23378773, 24147496, 24362952, 24204977, 23912775, 23690307, 23650190, 23797960, 24031745, 24155158, 23927928, 23158223, 21790367, 19927322, 17774487, 15551017, 13426385, 11502407, 9823782, 8395251, 7197508, 6201130, 5376014, 4694671, 4132381, 3667756, 3283322, 2964509, 2698154, 2472564, 2278548, 2109542, 1960757, 1828654, 1710840, 1605636, 1511576, 1427585, 1353357, 1288899, 1233597, 1186065, 1144799, 1108432, 1075321, 1043569, 1011920, 980526, 950502, 922772, 897487, 874367, 853335]
60940H53335j8684j6108j3724j1984j0987j0408r783q938q256q352r387j0742
60928G15982j1568j1569j1045j0312r484q761q440q471q416q034p538p091o510
60915E98743n766n251n150m940m037k644j378l65O96J754K433K746L151L865M707
60900E88564N678P084Q850J0302J0985J1361J2346J4305J6678J8497J9155J8902
60888G42707J8680J9250K0409K1202K0917J9682J8221J7216J6916J6924J6418
60877I48542J4857J2533J0163P969N546K643m77l502o482r462j2170j4327j6026
60864I39807j7450j8463j8803j8603j8378j8516j8950j9327j9350j8944j8237
60853G34786j7451j6822j6427j6052j5246j3869j2589j2367j3243j4028j3639
$$ y = [853335, 834651, 818543, 804819, 792835, 781848, 771440, 761657, 752719, 744463, 736111, 726724, 715982, 704414, 692845, 681800, 671488, 662004, 653243, 644803, 636332, 627916, 619882, 612344, 605253, 598743, 592977, 587726, 582576, 577636, 573599, 570955, 569577, 569212, 569908, 571662, 574095, 576841, 579992, 583857, 588564, 594242, 601326, 610176, 620478, 631463, 642824, 655170, 669475, 686153, 704650, 723805, 742707, 761387, 780637, 801046, 822248, 843165, 862847, 881068, 898284, 915200, 932124, 948542, 963399, 975932, 986095, 994064, 999610, 1002253, 1001776, 998274, 991792, 982330, 970160, 955833, 939807, 922357, 903894, 885091, 866488, 848110, 829594, 810644, 791317, 771967, 753023, 734786, 717335, 700513, 684086, 668034, 652788, 638919, 626330, 613963, 600720, 586692, 573053]
60842E73053j2356j1223j0564r857q944q428q719r497j0318j1086j1520j0950
60830D49591r231p285o177n959n930n649n166m510l634k698j978j513j233j253
60816C87375j611j894j628r03k02K50N92Q53R77J230J965K875L019J980N62l0
60800C95410N70J710K577K851K623K118J601J323J287J143M96o13j713k426k788
60785D06169k890k459j303o7L9j344l038l533k726j960k393l795n018n263m636
60770C65783l730k988k482k086j731j494j521j854k272k349j819r56l97m08n51
60755C39145m05l21r02j801j835n85Q83J397J227J596K950M483N291N276M859
60740C61258M324L674K802J698O32P9J23J39n32j714k624k916k911k915k934l141
$$ y = [573053, 560697, 549474, 538910, 529053, 520109, 511681, 502962, 493465, 483147, 472061, 460541, 449591, 440360, 433075, 426898, 420939, 415009, 409360, 404194, 399684, 396050, 393352, 391374, 389861, 388628, 387375, 385764, 383870, 382242, 381339, 381137, 381387, 381979, 382832, 383809, 385039, 387004, 389879, 392898, 394878, 395440, 395410, 395980, 397690, 400267, 403118, 405741, 407859, 409460, 410783, 412070, 413213, 413709, 413096, 411383, 408957, 406169, 403279, 400820, 399517, 399450, 399489, 398145, 395107, 391574, 388848, 386888, 384495, 380700, 375682, 370419, 365783, 362053, 359065, 356583, 354497, 352766, 351272, 349751, 347897, 345625, 343276, 341457, 340501, 340104, 339696, 339145, 338740, 338419, 337517, 335716, 333881, 333296, 334179, 335576, 336803, 338399, 341349, 345832, 351123, 356399, 361258, 365582, 369256, 372058, 373756, 374388, 374467, 374590, 374729, 374197, 372483, 369859, 366943, 364032, 361117, 358183, 355042]
60724C55042l931n171n998n766m774l747l017k595k558k874l146l045k833k924
60710C02663l132k890k163j568j460j426r33j46K09l09j368k163k107j226k4R79
60694B82936J547J698J553J307J124R49N64Ok90MO30J080J302J713K492L293L775
60677C05683M053M407M785M865M515L990L766M168N058N736N493M457L592L509
60663C68077L526K478L91j292j351k03P83R39O79M87K47j73l35K76J398K155K016
60646C80098J282N45N1k88n92r34j447k177k897l319l458l616l961m328m505m506
60630C45948m417m151l504k510j541j035j133j518j603j032n9O52P44N49N63P94
60614C26747Q58O39M10L43K91J77J97M34O37O45O82R04R98O57J95K45Q76J518
$$ y = [355042, 351111, 345940, 339942, 334176, 329402, 325655, 322638, 320043, 317485, 314611, 311465, 308420, 305587, 302663, 299531, 296641, 294478, 292910, 291450, 290024, 289091, 288945, 289154, 288845, 287477, 285314, 283207, 281981, 281957, 282936, 284483, 286181, 287734, 289041, 290165, 291114, 291678, 291684, 291394, 291398, 292028, 293108, 294410, 296123, 298615, 301908, 305683, 309736, 314143, 318928, 323793, 328308, 332298, 336064, 340232, 345290, 351026, 356519, 360976, 364568, 368077, 371603, 374081, 374472, 373180, 371829, 371626, 372409, 373348, 374027, 374514, 374761, 374588, 374253, 374529, 375927, 378082, 380098, 381380, 381925, 381976, 381688, 381096, 380162, 378715, 376538, 373641, 370322, 366864, 363248, 359287, 354959, 350454, 345948, 341531, 337380, 333876, 331366, 329825, 328790, 327657, 326139, 324536, 323504, 323445, 324097, 324841, 325390, 325953, 326747, 327605, 328244, 328654, 328997, 329288, 329465, 329662, 330096, 330733, 331378, 332060, 332964, 333962, 334619, 334814, 335059, 335935, 337453]
60596C37453J726J611J512J592J813J964J660O97n38j380j651j683j594j062n9
60581C42061P94J010R78J408K314L076L367L500L893M623N573O736Q184R942J1902
60566D09361J3710J4880J5149J4711J3867J2566J0545P883N042K305n07l609o654
60553E09249q814r497q913p835o735n269k854L23L286N360O921Q712J0835J2886
60539E07655J4770J6779J8896K0656K1760K2228K1827J9919J6263J1572O812K298
60527G01435k138o338r637j1501j1976j1542j0776j0120r681r248q662q071p566
60514E84179o751n156l132j750j433j181L85L366O596R141J1268J3723J6693J9826
60500F45774K3001K6578L1007L6409M2394M8047N2274N4573N5361N5200N3887
$$ y = [337453, 339179, 340790, 342302, 343894, 345707, 347671, 349331, 350028, 349490, 348110, 346459, 344776, 343182, 342120, 342061, 342855, 343865, 344843, 346251, 348565, 351641, 355008, 358508, 362401, 367024, 372597, 379333, 387517, 397459, 409361, 423071, 437951, 453100, 467811, 481678, 494244, 504789, 512672, 517714, 520019, 519512, 515903, 509249, 500435, 490938, 482025, 474190, 467455, 462186, 459332, 459655, 462941, 468301, 475222, 483934, 494769, 507655, 522425, 539204, 558100, 578756, 600516, 622744, 644571, 664490, 680753, 692325, 699137, 701435, 699297, 692959, 683322, 671821, 659845, 648303, 637527, 627407, 617726, 608478, 599816, 591745, 584179, 577428, 572272, 569140, 567390, 565957, 564776, 565161, 568527, 575123, 584264, 595532, 609255, 625948, 645774, 668775, 695353, 726360, 762769, 805163, 853210, 905484, 960057, 1015418, 1070618, 1124505]
60489A124505N0677M5293L8161K9672J9868Q980k261j3219k3859l4256m3903n1858
60477A147800n7426o0517o1491o0863n8908n5472n0484m4679l9301l4829l0608
60466E93222k6095k1828j8629j6340j4208j2155j0784j0226r796q927p786o829
60454D29619o263o017n817n238m193l301l242l730l815l130k177j321m05M56N79
60439C82005k37j129j253q06m52k93q7k3m39j083j388j346j445j787j990j909
60423C66338j823j837j699j294q07k51N60J396J531P05l11n46N8Q01J254J601
60407C65676J935J866J125J66k38M5L93L36J98N93J491K208K253J834J473J465
60391C82819J854K523L072K909J906P95M90J059J754K026K012J983J785J237O62
$$ y = [1124505, 1175182, 1220475, 1258636, 1288308, 1308176, 1317156, 1314895, 1301676, 1277817, 1243561, 1199658, 1147800, 1090374, 1029857, 968366, 907503, 848595, 793123, 742639, 697960, 658659, 623830, 593222, 567127, 545299, 526670, 510330, 496122, 483967, 473183, 462957, 453161, 444234, 436448, 429619, 423356, 417339, 411522, 406284, 402091, 398790, 395548, 391818, 388003, 384873, 382696, 381375, 380970, 381426, 382005, 381768, 380639, 379386, 378580, 378128, 377835, 377748, 377725, 377286, 376203, 374815, 373469, 372024, 370237, 368247, 366338, 364515, 362678, 360979, 359685, 358878, 358627, 359187, 360583, 362114, 362819, 362508, 361962, 362020, 362821, 364075, 365676, 367611, 369477, 370602, 370768, 370530, 370575, 370968, 371304, 371502, 372095, 373586, 375794, 378047, 379881, 381354, 382819, 384673, 387196, 390268, 393177, 395083, 395878, 396368, 397427, 399181, 401207, 403219, 405202, 406987, 408224, 408886]
60376D08886N59R19J341J704K245K915L251L117L025L296L376K532R98k67p74
60361D37123p89m97K98J429K163K162K015K369L137M033N233O813Q162Q765R061
60346D91477R577R701Q454O171M175K803J028j690m446o232p112p485p251o420
60332D92750n681n462n163m143k872k262k370k599k738k919k990k783k639k839
60318D45290k873k168j125m30K91J839L707M439L897L761N259P691R945J2255
60304D91778J5457J9293K2660K5026K6530K6803K4880K0471J4513Q062J215o431
60292F90257j4546k1709k6349k7876k6929k4632k1789j8747j5776j3191j1085
60281D67628r224p428n842m660l756k847j907j196r13j017j332j728k099k294
$$ y = [408886, 409445, 410364, 411705, 413409, 415654, 418569, 421820, 424937, 427962, 431258, 434634, 437166, 438164, 437897, 437123, 436334, 435837, 436135, 437564, 439727, 441889, 443904, 446273, 449410, 453443, 458676, 465489, 473651, 482416, 491477, 501054, 510755, 519209, 525380, 529555, 532358, 533386, 531696, 527250, 521018, 513906, 506421, 499170, 492750, 487069, 481607, 476444, 472301, 469429, 467167, 464797, 462198, 459460, 456541, 453551, 450768, 448129, 445290, 442417, 440249, 439124, 438694, 438985, 440824, 444531, 448970, 452867, 456628, 461887, 469578, 479523, 491778, 507235, 526528, 549188, 574214, 600744, 627547, 652427, 672898, 687411, 695473, 696688, 690257, 675711, 654002, 627653, 599777, 572848, 548216, 526427, 507680, 491904, 478713, 467628, 458404, 450976, 445134, 440474, 436718, 433871, 431964, 430768, 429855, 428838, 427506, 425778, 423679, 421385]
60267D21385k158j694j192j049j357j720j709j424j343j591j695j269o81o07j100
60252D00796j458j158n12j57j58K4O70J382J702J683J596J336O99O4J49R03J380
60235D08941J044O42J183K438L163K671J503N85L12O05J238J848J987J571R93
60220D30724O66O37P56R90J344J721K054K367K617K683K652K862L445M035M195
60205D63748L968L778L832L931L856L722L757L955M083M034L946L910L753L340
60191E17613K966L090L602L704K796J185k93j077j073m43K87J93j232l228m373
60176E23717m148l389l051l132l184l223l539l944l900l324k751k566k513k176
60162D78877j614j244j171j026n91k13l48p59p52j00O56J079J410J957K413K342
$$ y = [421385, 419227, 417533, 416341, 415292, 413935, 412215, 410506, 409082, 407739, 406148, 404453, 403184, 402503, 401896, 400796, 399338, 398180, 397668, 397511, 397353, 397377, 398047, 399429, 401131, 402814, 404410, 405746, 406445, 406509, 406658, 407561, 408941, 409985, 410627, 411810, 414248, 417411, 420082, 421585, 422170, 422482, 423087, 424325, 426173, 428160, 429731, 430724, 431390, 432027, 432783, 433773, 435117, 436838, 438892, 441259, 443876, 446559, 449211, 452073, 455518, 459553, 463748, 467716, 471494, 475326, 479257, 483113, 486835, 490592, 494547, 498630, 502664, 506610, 510520, 514273, 517613, 520579, 523669, 527271, 530975, 533771, 534956, 534663, 533586, 532513, 532070, 532357, 532550, 531318, 528090, 523717, 519569, 516180, 513129, 509997, 506813, 503590, 500051, 496107, 492207, 488883, 486132, 483566, 481053, 478877, 477263, 476019, 474848, 473822, 473231, 473018, 472670, 471911, 471159, 471059, 471715, 472794, 474204, 476161, 478574, 480916]
60146D80916J962J788J765J573J467J986K881L352L396L863M851N249M468L628
60132E23145M074N417O078N327L776K163O84n03j064j000p49n90m36k25m0K35
60116E46292Q39J633K179K405K696L270L847M087L903L307K346J286M35l38j401
60101E76786k582l150k829k256k127k312k328k202k343k712k823k401j670r12
60087E44139j40O97J544K284K776K815K376J838J626J572R99l77j938k833k913
60072E54465k747k839l177l508l771m154m887n987p118p764p688p176o703o328
60058D80618n763m958m329m207m402m519m410m116l575k751j856j116m36L88J200
60043D35768J676J855K056K279K184J792J754K538L711M381M174L504K905K428
$$ y = [480916, 482878, 484666, 486431, 488004, 489471, 491457, 494338, 497690, 501086, 504949, 509800, 515049, 519517, 523145, 527219, 532636, 538714, 544041, 547817, 549980, 550664, 550161, 549097, 548097, 547348, 546758, 546322, 546097, 546057, 546292, 547131, 548764, 550943, 553348, 556044, 559314, 563161, 567248, 571151, 574458, 576804, 578090, 578525, 578187, 576786, 574204, 571054, 568225, 565969, 563842, 561530, 559202, 557000, 554657, 551945, 549122, 546721, 545051, 544139, 543999, 544696, 546240, 548524, 551300, 554115, 556491, 558329, 559955, 561527, 562526, 562149, 560211, 557378, 554465, 551718, 548879, 545702, 542194, 538423, 534269, 529382, 523395, 516277, 508513, 500825, 493649, 486946, 480618, 474855, 469897, 465568, 461361, 456959, 452440, 448030, 443914, 440339, 437588, 435732, 434616, 434180, 434568, 435768, 437444, 439299, 441355, 443634, 445818, 447610, 449364, 451902, 455613, 459994, 464168, 467672, 470577, 473005]
60029D73005J790R57M14O62J419J624N07j513l361m550n443o292o769o582o007
60014D39861n414m763m004l520l678m142m175l516k568j822j487j520j744j865
60000C95643j738j569j638j893k033j906j601j223q16l65J87Q31J283J222Q62
59985C85246Q94J582K302K402K132K216K757L211L236K993K602J904Q66k12r79
59970D13152j242r76m37j65m47r07j004p61n32k42M54J388J886J709J338J189
59954D14403J106P86K32l55o72l34P29J808K011J344O32K91l7m67m20M55J619
59937D23131K415K807K878K334J142N9k32KJ32J80M43O72M36L0R5N50Q26R00J244
59918D40044J743J746J237R94J371J798J912K288L465M895N530N042L914K686
$$ y = [473005, 474795, 475752, 476166, 476828, 478247, 479871, 480378, 478865, 475504, 470954, 465511, 459219, 452450, 445868, 439861, 434447, 429684, 425680, 422160, 418482, 414340, 410165, 406649, 404081, 402259, 400772, 399252, 397508, 395643, 393905, 392336, 390698, 388805, 386772, 384866, 383265, 382042, 381226, 380861, 381048, 381879, 383162, 384384, 385246, 386140, 387722, 390024, 392426, 394558, 396774, 399531, 402742, 405978, 408971, 411573, 413477, 414343, 414131, 413152, 411910, 410934, 410497, 410332, 409885, 408978, 407974, 407213, 406681, 406439, 406893, 408281, 410167, 411876, 413214, 414403, 415509, 416295, 416527, 416172, 415500, 415166, 415895, 417703, 419714, 421058, 421690, 421981, 421944, 421477, 421057, 421512, 423131, 425546, 428353, 431231, 433565, 434707, 434766, 434534, 434536, 434668, 434848, 435291, 435963, 436399, 436429, 436524, 437074, 437900, 438800, 440044, 441787, 443533, 444770, 445764, 447135, 448933, 450845, 453133, 456598, 461493, 467023, 472065, 475979, 478665]
59904D78665J632R16N13M7q11j809k371k342k115j964j613o67O99J745J945J719
59888D74189K080L445M978N497M953M450M724N255N182M567M154M211M335M299
59874E36319M288M215L501J921J28j156k063l099m156m633m502m486n000n545
59860E15732n529n078m539l626j849M26K135K855L312M317N791P209Q441R581
59846E39178J0295R941Q290N762L045Q38l29m52j53K3K19O53O62p69l428n742
59830E68033o637o707o973p247o670n418m744n232n947n730m620l518k946k692
59816D92952k461k362k608l107l376k849j402L23J264Q84k75j230j631j897k404
59801D69821k970l263l308l280l105k653k128j795j482q51j46o8p32j317j101
$$ y = [478665, 480297, 481213, 481726, 481773, 480962, 479153, 476782, 474440, 472325, 470361, 468748, 468081, 468780, 470525, 472470, 474189, 476269, 479714, 484692, 490189, 495142, 499592, 504316, 509571, 514753, 519320, 523474, 527685, 532020, 536319, 540607, 544822, 548323, 550244, 550372, 549216, 547153, 544054, 539898, 535265, 530763, 526277, 521277, 515732, 510203, 505125, 500586, 496960, 495111, 495537, 497672, 500527, 503839, 508156, 513947, 521156, 529597, 539178, 549473, 559414, 567704, 573466, 576511, 577349, 577020, 576568, 576415, 576438, 576657, 577310, 577972, 577203, 573775, 568033, 561396, 554689, 547716, 540469, 533799, 528381, 523637, 518405, 512458, 506728, 502108, 498590, 495644, 492952, 490491, 488129, 485521, 482414, 479038, 476189, 474787, 475110, 476374, 477258, 476983, 475753, 474122, 472225, 469821, 466851, 463588, 460280, 457000, 453895, 451242, 449114, 447319, 445837, 444986, 444840, 444772, 444040, 442723, 441622]
59786D41622m06pn6j46k03n51j118j312q44q9M86P44N35l59j601k306k130j746
59768D30513j659j255J14J672J975R85J12J33L04q3m69j42M35M56K63Q26K005
59751D36185K600K113J458J619K465L259L631L606L252K817K822L459M118M026
59737D77430L153K158J587J501J699J866J633R38K94K44O03O82L45K75R63J838
59721D97209J904R09m73j485j886j787j393r51o36k93L10R28R10P4q60j143r92
59704D90345j137j562j427m03O84R81Q25J179K239L287L838M143M437M439L939
59689E15807L313K953K556J552Lj390k138k279j918j015J62Q76O19k43r21j186
59673E16751j513k271l172l743m009m342m774m913m543l930l381k875k427k362
$$ y = [441622, 441216, 441209, 441153, 441007, 440804, 440253, 439135, 437823, 436979, 436890, 437376, 438120, 438655, 438296, 436695, 434389, 432259, 430513, 428854, 427599, 427713, 429385, 431360, 432345, 432457, 432590, 432894, 432811, 432342, 432200, 432635, 433091, 433354, 434180, 436185, 438785, 440898, 442356, 443975, 446440, 449699, 453330, 456936, 460188, 463005, 465827, 469286, 473404, 477430, 480583, 482741, 484328, 485829, 487528, 489394, 491027, 491965, 492259, 492503, 493106, 493788, 494133, 494408, 495371, 497209, 499113, 500022, 499549, 498064, 496178, 494391, 492998, 492047, 491411, 491118, 491428, 492356, 493266, 493340, 492480, 491337, 490345, 489208, 487646, 486219, 485816, 486500, 487481, 488306, 489485, 491724, 495011, 498849, 502992, 507429, 511868, 515807, 519120, 522073, 524629, 526181, 526184, 524794, 522656, 520377, 518459, 517444, 517606, 518482, 519101, 518858, 517937, 516751, 515238, 512967, 509795, 506052, 502043, 497701, 492927, 488014, 483471, 479541, 476160, 473285, 470858, 468496]
59659D68496k774k983k198p16K37N2m80k59P98K002K979L855M552M644L977K900
59643D85082J778O71k98p88o55k74j51m83j227k319l492m118l698k476j240m73
59627D65839j3M30P65P44M22P7k12o04j149j641j918k043k122k203k469l190m190
59610D46523m679m016k589j431j016q71l72N35J530K313K580K083J087L68L33
59595D42378N33M42L46P73J386J273L44l89j99M09N66K78J46J92k19j291k241
59578D44727k301j776j682k348k992k736j759r83r64j455j961k200k048j506r34
59563D17082q22j073r42j0J206J895J833J228K28q59j282n10R57K088K541K743
59547D26303K878K640K020J629J991L020M418O034P720R366J1237J3719J6563
$$ y = [468496, 465722, 462739, 460541, 459825, 460062, 460114, 459634, 459375, 460173, 462175, 465154, 469009, 473561, 478205, 482182, 485082, 486860, 487531, 487233, 486445, 485790, 485516, 485365, 484882, 483655, 481336, 477844, 473726, 470028, 467552, 466312, 465839, 465826, 466256, 467021, 467765, 468187, 468264, 468052, 467448, 466299, 464658, 462740, 460697, 458575, 456372, 453903, 450713, 446523, 441844, 437828, 435239, 433808, 432792, 431921, 431549, 432084, 433614, 435927, 438507, 440590, 441677, 442045, 442378, 442911, 443353, 443699, 444472, 445858, 447131, 447475, 447086, 446887, 447296, 447862, 448140, 448286, 448478, 448259, 446968, 444727, 442426, 440650, 438968, 436620, 433628, 430892, 429133, 428150, 427186, 425731, 423770, 421570, 419522, 418016, 417082, 416260, 415187, 414245, 414235, 415441, 417336, 419169, 420397, 420625, 419766, 418484, 417974, 418931, 421019, 423560, 426303, 429181, 431821, 433841, 435470, 437461, 440481, 444899, 450933, 458653, 468019, 479256, 492975, 509538]
59534E09538J8858J9835J9063J5848R508Q54p442j2804j4787j4568j3056j0350
59522E20497o774l320q02Q25J965K694K818K404J890J671J620J185J9j537k839
59507E22316l755m725n926o868p043o608o075n700n469n380n307m885l939k879
59493D47757k201j832j291m42L43O72M86K8k86j36L05M35O5j07P46K498M203N199
59475D56442N654O011O434O780O864O575N952N082L910K290L95j232k201k562
59461E06394k375j472j1J213J675J958L044M967O821P904Q215P976P462P237P752
59446E68760Q644R070Q862Q600Q449P682N588K359j241m477o792p908q157q261
59432E91178q570q849q939r005q988q468p341o095n061l927k328m60J375L352
$$ y = [509538, 528396, 548231, 567294, 583142, 592650, 593504, 586062, 573258, 558471, 543903, 530847, 520497, 513723, 510403, 509601, 510426, 512391, 515085, 517903, 520307, 522197, 523868, 525488, 526673, 526692, 525155, 522316, 518561, 513836, 507910, 501042, 493999, 487391, 481316, 475616, 470147, 464767, 459460, 454575, 450636, 447757, 445556, 443724, 442433, 441991, 442334, 443006, 443492, 443520, 443234, 443098, 443403, 443838, 443903, 443796, 444542, 447040, 451243, 456442, 462096, 468107, 474541, 481321, 488185, 494760, 500712, 505794, 509704, 511994, 512389, 511157, 508956, 506394, 504019, 502547, 502536, 503749, 505424, 507382, 510426, 515393, 522214, 530118, 538333, 546309, 553771, 561008, 568760, 577404, 586474, 595336, 603936, 612385, 620067, 625655, 628014, 626773, 622296, 615504, 607596, 599439, 591178, 582608, 573759, 564820, 555815, 546827, 538359, 531018, 524923, 519862, 515935, 513607, 513147, 514522, 517874]
59418E17874N856Q855J1870J4396J6190J7501J9118K1732K5058K7948K9341K8491
59406G44230K4401J6260N117n761j3153j6145j5750j3096q832l716J314N408P369
59393G27646N405j465j1642k1514k8042l0396k9366k6215k2291j8736j5867j3164
59381E14353j0136o940m074j900n64K0K78P19J408J981K263K475K823L219L477
59366E09402L489L160K530K017K146K904L737M225M479M804N319N904O319O370
59352E66805O252O635P934R627J0763J1136J1377J1891J2394J2676J3131J4130
59340F94751J5286J5730J4880J2805J0173P925O557N573L989J513j257l765n980
59327G78180p835q993r539j0210j1368j2379j2587j2286j2110j1913j1096r734
$$ y = [517874, 523730, 532585, 544455, 558851, 575041, 592542, 611660, 633392, 658450, 686398, 715739, 744230, 768631, 784891, 790008, 784247, 771094, 754949, 739199, 726103, 717271, 713555, 714869, 720277, 727646, 733051, 731586, 719944, 698430, 670388, 639992, 610626, 584411, 562120, 543384, 527517, 514353, 504217, 497277, 493203, 491303, 490739, 490759, 491037, 491756, 493164, 495145, 497408, 499883, 502706, 505925, 509402, 512891, 516051, 518581, 520598, 522744, 525648, 529385, 533610, 538089, 542893, 548212, 554116, 560435, 566805, 573057, 579692, 587626, 597253, 608016, 619152, 630529, 642420, 654814, 667490, 680621, 694751, 710037, 725767, 740647, 753452, 763625, 771550, 778107, 783680, 787669, 789182, 787925, 784160, 778180, 770345, 761352, 751813, 741603, 730235, 717856, 705269, 692983, 680873, 668960, 657864, 648130]
59315F48130q576p982p557o762n403l610j750k89O85J625K922M454O158Q506J1739
59300F42290J4971J6880J7050J5739J2652P086m84p963j3267j5891j6672j6686
59288F55705j6578j6282j5084j2527r396p176o299n757m670l405k604k048j244
59275E52635m56j68PR27K590M069M767N060N595O521P522Q244Q509Q410Q178P786
59259F30196O808M955K549J97j836l625n234o733q301r831j0623j0038q428o888
59245E73168o090n723n149m158l004k054j441r15p7J118K176K654K622K391K098
59230E57616J927K215K868L044K182R94O21J055J275P17l23j660l400m973n164
59215E58994l706j958j389k018k886l332l254k674j751q40j34M73Q71O53m5l44
$$ y = [648130, 639554, 631572, 624015, 617253, 611850, 608240, 606490, 606201, 606886, 608511, 611433, 615887, 622045, 630551, 642290, 657261, 674141, 691191, 706930, 719582, 726668, 726184, 718221, 704954, 689063, 672391, 655705, 639127, 622845, 607761, 595234, 585838, 578662, 572363, 566606, 561936, 558531, 555927, 553879, 552635, 552179, 552011, 552018, 552945, 555535, 559604, 564371, 569431, 575026, 581547, 589069, 597313, 605822, 614232, 622410, 630196, 637004, 641959, 644508, 644705, 642869, 639244, 634010, 627277, 618976, 609145, 598522, 588484, 580056, 573168, 567078, 561355, 556206, 552048, 549044, 546990, 545549, 544634, 544557, 545675, 547851, 550505, 553127, 555518, 557616, 559543, 561758, 564626, 567670, 569852, 570846, 571467, 572522, 573797, 574514, 574191, 572531, 569131, 564158, 558994, 555288, 553330, 551941, 549923, 547037, 543705, 540451, 537777, 536026, 535186, 535052, 535525, 536396, 537049, 537004, 536660]
59199E36660K68J137J379J026O40M34M15Q79J951L000L302K928K326J521N22k4
59183E58364M09J108R07r0o55k50L87N79M88L78J16j66J61J294K590L468M040
59166E73128M412M219L418K916L624N272O720P195O788O023N361M934M425L405
59152F41840J983P88M7p66k104l593m592n099n535n891n734n007m254m021m272
59137E93790m555m539m340m373m833n355n380m889m471m595n063n296m868l704
59123E27529k114p13R8O39J558K876L932M410M738N280N840O330P144Q296Q912
59108E84755Q347P203O460O105N506M738M463M654M537L796K939K325J670P53
59094F48251j57q15j300j641j756j835k171k505k275j620j319j506j449r79j069
$$ y = [536660, 536928, 538065, 539444, 540470, 541110, 541544, 541959, 542838, 544789, 547789, 551091, 554019, 556345, 557866, 558388, 558364, 558773, 559881, 560788, 560698, 560043, 559793, 560180, 560759, 561247, 561625, 561741, 561575, 561736, 563030, 565620, 569088, 573128, 577540, 581759, 585177, 588093, 591717, 596989, 603709, 610904, 617692, 623715, 629076, 634010, 638435, 641840, 643823, 644611, 644658, 643892, 641788, 638195, 633603, 628504, 622969, 617078, 611344, 606337, 602083, 598062, 593790, 589235, 584696, 580356, 575983, 571150, 565795, 560415, 555526, 551055, 546460, 541397, 536101, 531233, 527529, 525415, 524702, 524800, 525439, 526997, 529873, 533805, 538215, 542953, 548233, 554073, 560403, 567547, 575843, 584755, 593102, 600305, 606765, 612870, 618376, 623114, 627577, 632231, 636768, 640564, 643503, 645828, 647498, 648251, 648094, 647279, 645979, 644338, 642582, 640747, 638576, 636071, 633796, 632176, 630857, 629351, 627902, 626923, 625854]
59079F25854k337l884m625m926n874p343q124p744o949o368n792n142m979n560
59065E46207o133n907n099m444m120l815l454l130k612j642o61m78j164j899k087
59050D99562j959j880j662j021k47J70K23K52L16K19J3r3j98n02o98j99Q20J315
59032D94431O52n25j111q16j84L67R10J629K617L961N574O961P647P821Q148Q823
59016E46905R340R292Q946Q722Q526P940O887N672M457L107J573J31q87j481j907
59001F17223k242k104j013R07K731L524L300K971L286M032M411M010L142K349
58987F46527J841J373N84n56j557j826j431j200j798k810l134k328j059o2Q55
58972F33419K358M451O343P422P866Q211Q743R490J0364J1058J1156J0722J0462
$$ y = [625854, 623517, 619633, 615008, 610082, 604208, 596865, 588741, 580997, 574048, 567680, 561888, 556746, 551767, 546207, 540074, 534167, 529068, 524624, 520504, 516689, 513235, 510105, 507493, 505851, 505190, 504712, 503548, 501649, 499562, 497603, 495723, 494061, 493040, 492793, 492963, 493186, 493438, 493754, 493973, 493986, 493893, 493695, 493193, 492495, 492296, 493116, 494431, 495083, 494558, 493447, 492631, 492447, 492814, 493724, 495353, 497970, 501931, 507505, 514466, 522113, 529934, 538082, 546905, 556245, 565537, 574483, 583205, 591731, 599671, 606558, 612230, 616687, 619794, 621367, 621498, 620611, 619130, 617223, 614981, 612877, 611864, 612771, 615502, 619026, 622326, 625297, 628583, 632615, 637026, 641036, 644178, 646527, 648368, 649741, 650325, 649769, 648212, 646386, 644955, 643755, 641957, 639147, 636013, 633685, 632626, 632564, 633419, 635777, 640228, 646571, 653993, 661859, 670070, 678813, 688303, 698667, 709725, 720881, 731603, 742065]
58959G42065J0848J1291J0699Q832O531M563K773O71j689l836n644p462r549j1709
58945G58384j3533j4685j4922j4144j2604j0936r761r251r066q786q325p911p665
58932F16795p353o665n647m628l757k897j960j140o17l09m1K19M20O11Q09Q73
58916E84713O35J33m10p70p99m83L6O06J318K324L420M116M284M375M791N435
58900F13724O226P593R797J2094J3310J3186J2526J1882J0974R614Q506Q489R458
58887G47379J0660J1790J3146J4814J6326J7242J7556J7330J6412J4802J2897
58876I10354J0980Q758N850K501o64l531o466r374j1516j2596j3345j4443j5363
58863H51145j5079j3633j2060j0908r773q454p618p741q273q486q574r136r997
$$ y = [742065, 752913, 764204, 774903, 783735, 790266, 794829, 797602, 798273, 796584, 792748, 787104, 779642, 770093, 758384, 744851, 730166, 715244, 701100, 688496, 677560, 667799, 658548, 649482, 640696, 632371, 624460, 616795, 609442, 602777, 597130, 592502, 588745, 585848, 583888, 582748, 582131, 581822, 581781, 582000, 582420, 583031, 583840, 584713, 585348, 585481, 585071, 584301, 583502, 583019, 583055, 583661, 584979, 587303, 590723, 594839, 599123, 603498, 608289, 613724, 619950, 627543, 637340, 649434, 662744, 675930, 688456, 700338, 711312, 720926, 729432, 737921, 747379, 758039, 769829, 782975, 797789, 814115, 831357, 848913, 866243, 882655, 897457, 910354, 921334, 930092, 935942, 938443, 937779, 934248, 927782, 918408, 906892, 894296, 880951, 866508, 851145, 836066, 822433, 810373, 799465, 789692, 781238, 773620, 765879, 757606, 749120, 740546, 731410, 721413]
58850G21413j0402j0187r956j0078j0247j0110r771r414q910q091p177o665o805
58837F03600p302p465o860n847n265n379n500m898l750k737k126j817j968k717
58823E39969l456l265k151j045l83M95K096L745M460M319M271M818N476N534M875
58808E69758L997L440L192K723J695N99K85P56R23j25k054l755m561m609m322
58793E67942m027l951m154m443m575m507m276l856l337k978k753k141p16J155
58779E23383K588L082K853K431K253K470K784K524J312l73j660k280k731l468
58765E35168m366n056n362n259m718l871l089k664k476k186j677j228j241j786
58751D90189k364k213j012P76K322L176L398L233K960K958L493M356N039N336
$$ y = [721413, 711011, 700824, 690868, 680790, 670543, 660433, 650662, 641248, 632338, 624247, 617070, 610405, 603600, 596298, 588833, 581973, 576126, 570861, 565482, 559982, 555084, 551334, 548597, 546471, 544654, 542686, 539969, 536513, 533248, 531097, 530052, 529669, 530164, 532260, 536005, 540465, 544784, 549055, 553873, 559349, 564883, 569758, 573755, 577195, 580387, 583110, 584805, 585404, 585689, 586445, 587368, 587243, 585189, 581434, 576873, 572264, 567942, 563915, 559964, 555810, 551367, 546792, 542285, 538009, 534153, 530816, 527838, 525085, 522944, 522228, 523383, 525971, 529053, 531906, 534337, 536590, 539060, 541844, 544368, 545680, 545307, 543647, 541367, 538636, 535168, 530802, 525746, 520384, 515125, 510407, 506536, 503447, 500783, 498307, 496121, 494444, 493216, 491975, 490189, 487825, 485612, 484600, 485376, 487698, 490874, 494272, 497505, 500465, 503423, 506916, 511272, 516311, 521647]
58737E21647N457N546N489N354N532O160O796O998O916O890O831O404N723N261
58723F07004N186N177M953M524L946L197K473K158K407L039L893M923N845O245
58709F64970O197O324O826P001O119M436K786J428j18k241m814p502j0035j2098
58695F69279j3529j4603j5687j6601j6746j5920j4521j2991j1543j0439r835r263
58683E07601q013o246n019m796m731l939k804k237k265k239k012j961k020j648
58669D57671p57J75J073K507M672O743P725P556P030O867P130P296O703N075K758
58654E30224M14j521k943l864m320m459m383l969l162k301j825j777j878j974
58640D92262j970j612q22j77l20r50j074l13P28J520K262L151L777L705L156K550
$$ y = [521647, 527104, 532650, 538139, 543493, 549025, 555185, 561981, 568979, 575895, 582785, 589616, 596020, 601743, 607004, 612190, 617367, 622320, 626844, 630790, 633987, 636460, 638618, 641025, 644064, 647957, 652880, 658725, 664970, 671167, 677491, 684317, 691318, 697437, 701873, 704659, 706087, 705969, 703728, 698914, 691412, 681377, 669279, 655750, 641147, 625460, 608859, 592113, 576193, 561672, 548681, 537138, 526699, 516864, 507601, 499588, 493342, 488323, 483527, 478796, 474857, 472053, 469816, 467551, 465312, 463300, 461339, 459319, 457671, 456914, 457089, 458162, 460669, 465341, 472084, 479809, 487365, 494395, 501262, 508392, 515688, 522391, 527466, 530224, 530638, 529117, 526174, 522310, 517990, 513531, 509148, 505179, 502017, 499716, 497891, 496114, 494236, 492262, 490292, 488680, 487858, 487681, 487361, 486411, 485337, 485024, 485752, 487272, 489534, 492685, 496462, 500167, 503323, 505873]
58624E05873J882R98J91q5J34M14N43O09P16R20J418K362L510M366M641M443M040
58607E36975L563K977K239J465Q96N79K62j21j63L99R56O09n55j522j844k170
58591E44545k947l417k678j082K55R76J636K567L485M225N105O330P548Q318Q634
58576E83500Q784Q892Q787Q249P309O377N921N946N965N731N684O390P730R111
58562F84376J0310J1681J3502J5601J7651J9410K0566K0797K0133J8944J7351
58551H70322J5013J1799Q382N627L486J019k294n618p598p878p429p318p745q436
58537H61332r402j0763j2156j3072j3656j4525j5641j6060j5088j3203j1450j0309
58525G06007r496q598p434n967m215k346o77M57Q45N98J83N1J65K11J33Q5j13
$$ y = [505873, 507755, 508753, 508944, 508859, 508993, 509407, 509950, 510559, 511275, 512195, 513613, 515975, 519485, 523851, 528492, 532935, 536975, 540538, 543515, 545754, 547219, 548115, 548694, 548956, 548835, 548672, 549071, 550027, 550636, 550081, 548559, 546715, 544545, 541598, 538181, 535503, 534421, 534676, 535652, 537288, 539855, 543340, 547565, 552670, 559000, 566548, 574866, 583500, 592284, 601176, 609963, 618212, 625521, 631898, 637819, 643765, 649730, 655461, 661145, 667535, 675265, 684376, 694686, 706367, 719869, 735470, 753121, 772531, 793097, 813894, 834027, 852971, 870322, 885335, 897134, 905516, 911143, 914629, 915648, 913354, 907736, 900138, 892260, 884831, 877513, 869768, 861332, 851930, 841167, 829011, 815939, 802283, 787758, 772117, 756057, 740969, 727766, 716316, 706007, 696511, 687913, 680479, 674512, 670297, 667951, 667274, 667731, 668576, 669174, 669357, 669408, 669573, 669784, 669917, 670002, 669889]
58508F69889q84k071k807k553j859j662k155k701k682k041j260j010j585k448
58494F42171k562j454K72J632K091J665O67l17o75l11L69J158K221L373L990M095
58478F58385M719O452Q352R229R489J0541J2556J4023J3596J1505Q828O239L837
58465G77751J549p34l042n043o161o225n673m979m174l097j747k46J300K720L852
58450G46051M873O250Q029R343R112P261M918L145J784o2k557m737n735n730n327
58435G76618m637l558k502j905j360j60J435K502K966L713N133O723Q268J0088
58421H03324J1749J1964J0509Q862Q050P234N468L539K573J988M89j624k978l402
58407H67745l905m653m786m248m048m513m803m542m341m272l307j019J377K622
$$ y = [669889, 669005, 666934, 664127, 661574, 659715, 658053, 655898, 653197, 650515, 648474, 647214, 646204, 644619, 642171, 639609, 638155, 638427, 640059, 642150, 643815, 644482, 644165, 643490, 643179, 643548, 644706, 646927, 650300, 654290, 658385, 663104, 669556, 677908, 687137, 696626, 707167, 719723, 733746, 747342, 758847, 767675, 773914, 777751, 779300, 778566, 775524, 770481, 764320, 758095, 752422, 747443, 743269, 740172, 738425, 738179, 739479, 742199, 746051, 750924, 757174, 765203, 774546, 783658, 790919, 795837, 798982, 800766, 800704, 798147, 793410, 787675, 781945, 776618, 771981, 768423, 765921, 764016, 762656, 762496, 763931, 766433, 769399, 773112, 778245, 784968, 793236, 803324, 815073, 827037, 837546, 846408, 854458, 861692, 867160, 870699, 873272, 875260, 875749, 874125, 871147, 867745, 863840, 859187, 854401, 850153, 846105, 841592, 836789, 832247, 827906, 823634, 820327, 819308, 820685, 823307]
58393H23307L049L798N106O223O543O085N145M055L100K278J346K40q19j726k593
58378H65137l352l604l114k094r98k04K02O54J861L898N865O967P590Q549R650
58363H97007J0023R691R650J0325J1038J1313J1706J2841J4391J5478J5553J4557
58351A043573J2810J1054J0017R613R080Q073P087O565O280N932N821O408P497
58338A149810Q367Q671Q936J0056J2208J4396J5409J5282J5278J6299J7898J9179
58326A311789J9823J9726J8548J6524J4858J4314J4097J3207J2027J1361J0780
58315A477054R562Q503Q914J0237J0716J0212J0322J1576J2753J3337J4423J6479
58303A614088J8225J8751J9078K0353K2033K3020K3438K4065K4881K5309K5264
$$ y = [823307, 826356, 830154, 835260, 841483, 848026, 854111, 859256, 863311, 866411, 868689, 870035, 870275, 869456, 867730, 865137, 861785, 858181, 855067, 852973, 851975, 851771, 851973, 852627, 854488, 858386, 864251, 871218, 878808, 887357, 897007, 907030, 916721, 926371, 936696, 947734, 959047, 970753, 983594, 997985, 1013463, 1029016, 1043573, 1056383, 1067437, 1077454, 1087067, 1096147, 1104220, 1111307, 1117872, 1124152, 1130084, 1135905, 1142313, 1149810, 1158177, 1166848, 1175784, 1185840, 1198048, 1212444, 1227853, 1243135, 1258413, 1274712, 1292610, 1311789, 1331612, 1351338, 1369886, 1386410, 1401268, 1415582, 1429679, 1442886, 1454913, 1466274, 1477054, 1486616, 1495119, 1504033, 1514270, 1524986, 1535198, 1545520, 1557096, 1569849, 1583186, 1597609, 1614088, 1632313, 1651064, 1670142, 1690495, 1712528, 1735548, 1758986, 1783051, 1807932, 1833241, 1858505]
58292A858505K5176K5443K6387K8012K9517K9891K9336K9181L0081L1343L2305
58281B175177L3240L4546L6174L8258M1074M4042M6027M7020M8219N0063N1692
58270B645532N2790N4356N6938N9610O1603O3492O6021O8990P2103P5485P8734
58259C355654Q0894Q2245Q4567Q8792R3688R7782J01085J04077J06574J08618
58249D303976J11088J14441J18091J21895J26789J33113J39889J46620J54213
58240E470115J63171J72573J81721J91233K01622K12525K24162K37575K52577
58231G307274K67560K82293K98689L17792L38441L60039L84070M11414M40858
58222A0408430M71809N05884N44181N85784O30708O81409P39497Q03951Q74625
$$ y = [1858505, 1883681, 1909124, 1935511, 1963523, 1993040, 2022931, 2052267, 2081448, 2111529, 2142872, 2175177, 2208417, 2242963, 2279137, 2317395, 2358469, 2402511, 2448538, 2495558, 2543777, 2593840, 2645532, 2698322, 2752678, 2809616, 2869226, 2930829, 2994321, 3060342, 3129332, 3201435, 3276920, 3355654, 3436548, 3518793, 3603360, 3692152, 3785840, 3883622, 3984707, 4088784, 4195358, 4303976, 4415064, 4529505, 4647596, 4769491, 4896280, 5029393, 5169282, 5315902, 5470115, 5633286, 5805859, 5987580, 6178813, 6380435, 6592960, 6817122, 7054697, 7307274, 7574834, 7857127, 8155816, 8473608, 8812049, 9172088, 9556158, 9967572, 10408430, 10880239, 11386123, 11930304, 12516088, 13146796, 13828205, 14567702, 15371653, 16246278]
58213A6246278R54369J045523J147809J262200J393433J546211J722667J926458
58205B7244948K165489K447938K780376L173815L647766M225775M933007N802188
58197E6421302O874947Q191723R786733J1696904J3963054J6608155J9616790
58190A43159608K2936805K6474065L0044449L3308045L5740108L6648046L5228405
58183C63539531L0725330K2756293J1694294j188094j4018560k4942689l2699261
58176C55866844l6874347l7808491l6300727l3274639k9528127k5625249k1908570
58169A34546694j8558156j5642868j3159963j1071979r332104p891033o697948
58162E2192643n707085m883030m197425l624695l144053k741200k404015k119231
$$ y = [16246278, 17200647, 18246170, 19393979, 20656179, 22049612, 23595823, 25318490, 27244948, 29410437, 31858375, 34638751, 37812566, 41460332, 45686107, 50619114, 56421302, 63296249, 71487972, 81274705, 92971609, 106934663, 123542818, 143159608, 166096413, 192570478, 222614927, 255922972, 291663080, 328311126, 363539531, 394264861, 417021154, 428715448, 427527354, 413508794, 388566105, 355866844, 318992497, 281184006, 244883279, 211608640, 182080513, 156455264, 134546694, 115988538, 100345670, 87185707, 76113728, 66781624, 58890591, 52192643, 46485558, 41602528, 37405103, 33780408, 30636355, 27895155, 25491140, 23371909]
58154B3371909j875803j668029j491956j341210j208976j091507r87027q93250
58146A2814151q08257p31826o63748o02582n47563m99644m59023m23796l92684
58137G685028l66725l46484l29544l12812k95591k78644k61958k45196k28885
58128E019189k13476j98549j84281j72146j62698j54270j45327j36580j29224
58119C522638j22679j15759j08792j02799r7616r2480q7502q3133p9064p4983
58109B557831p1535o9133o6805o3581o0165n7830n6458n4985n3118n1298m9484
58098A903439m7280m4857m2739m0957l9267l7729l6324l4598l2389l0355k9093
58087A487851k8336k7645k7120k6803k6221k5254k4692k5100k5799k5744k4758
$$ y = [23371909, 21496106, 19828077, 18336121, 16994911, 15785935, 14694428, 13707401, 12814151, 12005894, 11274068, 10610320, 10007738, 9460175, 8960531, 8501508, 8077712, 7685028, 7318303, 6971819, 6642275, 6329463, 6033872, 5755228, 5493270, 5248074, 5019189, 4805713, 4607164, 4422883, 4250737, 4088039, 3933769, 3788442, 3651862, 3522638, 3399959, 3284200, 3175408, 3072609, 2974993, 2882513, 2795011, 2711878, 2632814, 2557831, 2486296, 2417163, 2350358, 2286777, 2226612, 2168782, 2112324, 2057339, 2004221, 1952923, 1903439, 1856159, 1811302, 1768563, 1727606, 1688339, 1650610, 1614286, 1579688, 1547299, 1516944, 1487851, 1459515, 1431870, 1404750, 1377947, 1351726, 1326472, 1301780, 1276680, 1250881, 1225137, 1200379]
58076A200379k3378k2127k1449k1471k1410k0209j8278j7361j8023j8689j8111
58065I79873j7226j7267j7448j6277j4144j2683j2231j1783j1128j1145j2042
58054H26499j2890j3107j3054j2921j2275j1040r906r389r233q976q483p774o971
58041F90480o477o623p054p057o517o059o223o910p656q039p909p614p790q619
58027E89933r502r911j0185j0946j1977j2360j1601j0123q679p734p338p142o703
58014D65732n985n405n151m798l953k901k189j961k073k465k910k834j941p37
58000D20429J09N42P85O79N1n82m97K46Q78R01M51j10m39k46L30N98O4q99j638
57981D21652k149k818l584m066m288m516m552l997l112k656k794k964k870k861
$$ y = [1200379, 1177001, 1154874, 1133425, 1111954, 1090544, 1070335, 1052057, 1034696, 1016673, 997984, 979873, 962647, 945380, 927932, 911655, 897511, 884828, 872597, 860814, 849686, 838541, 826499, 813609, 800502, 787448, 774527, 762252, 751212, 741306, 731917, 722684, 713708, 705225, 697451, 690480, 684003, 677380, 670326, 663269, 656752, 650693, 644470, 637560, 629904, 621865, 613956, 606342, 598552, 589933, 580431, 570520, 560335, 549389, 537412, 525052, 513451, 503328, 494649, 486915, 479577, 472435, 465732, 459747, 454342, 449191, 444393, 440440, 437539, 435350, 433389, 431316, 428851, 425941, 423107, 421166, 420429, 420538, 421080, 421865, 422544, 422595, 422013, 421516, 421762, 422640, 423541, 423992, 423882, 423443, 423197, 423527, 424125, 424189, 423290, 421652, 419503, 416685, 413101, 409035, 404747, 400231, 395679, 391682, 388570, 385914, 383120, 380156, 377286, 374425]
57967C74425l124l242k866k263j833j553j198p66l27K36R64J516J409N68n23j300
57951C60123j699k171l002l735l582k514j464j187j340j053n6J283K690M108N286
57936C51687N918O272O967Q069Q948R217R237R395R383Q674P341N900M457K597
57922D54062J86k213l958n093o084p076p813q279q770r232r115q283p542p612
57908C63178p979p512n995m337l309k896k925l446m233m662m468m059l756l359
57894C00242k700k072j692j309p47l06k54l60k69R6P28J601K352K517K298K419
57878C02544K920K978K251J484J215R18J15o05o87q16j883l420m247m187l974
57863B94606l871l562l157l084l131k660j746j037o11lP61J218J519K261L252
$$ y = [374425, 371301, 368059, 365193, 362930, 361097, 359544, 358346, 357580, 357253, 357489, 358453, 359969, 361378, 361946, 361423, 360123, 358424, 356253, 353251, 349516, 345934, 343420, 341956, 340769, 339429, 338376, 338320, 339603, 342293, 346401, 351687, 357605, 363877, 370844, 378913, 387861, 397078, 406315, 415710, 425093, 433767, 441108, 447008, 451465, 454062, 454248, 452035, 448077, 442984, 436900, 429824, 422011, 413732, 404962, 395730, 386615, 378332, 370790, 363178, 355199, 347687, 341692, 337355, 334046, 331150, 328225, 324779, 320546, 315884, 311416, 307357, 303601, 300242, 297542, 295470, 293778, 292469, 291722, 291416, 291162, 290802, 290533, 290629, 291357, 292958, 295310, 297827, 300125, 302544, 305464, 308442, 310693, 312177, 313392, 314310, 314425, 313820, 313133, 312317, 310434, 307014, 302767, 298580, 294606, 290735, 287173, 284016, 280932, 277801, 275141, 273395, 272358, 271747, 271744, 272505, 273723, 275242, 277503, 280755]
57848B80755L587L109K630K496K112J215M97L44P2r31k153k819l050l389l715
57833B80760l529k891k350k126k020j986k143k239j705m21R63J712J812J889K397
57818B68123L075L416L440L622M072M227L525K012L2k161m114n061m727l875l427
57803B72179l404l312l193l416l743l522k732j922j257m69K34K12m78r87q99p06
57787B42585q18r35p67n78o08o71o35o38m76M75K250L853M361L874L036K215J661
57770B58184J775K586L375L411K739J808P58m02j308j557j340j248j571k092k491
57755B62627k612k392j797p53O98K072K514J692M73M2M08N64Q4l88l87l59o60
57738B61826q31n07j98m64r29r04m06O5K36qp76j602j456j26J099R60j03q15q51
$$ y = [280755, 284342, 287451, 290081, 292577, 294689, 295904, 296401, 296745, 296817, 295886, 293733, 290914, 287864, 284475, 280760, 277231, 274340, 271990, 269864, 267844, 265858, 263715, 261476, 259771, 259350, 260313, 262025, 263837, 265726, 268123, 271198, 274614, 278054, 281676, 285748, 289975, 293500, 295512, 295544, 293383, 289269, 284208, 279481, 275606, 272179, 268775, 265463, 262270, 258854, 255111, 251589, 248857, 246935, 245678, 245209, 245443, 245655, 245177, 244190, 243291, 242585, 241767, 240832, 240065, 239487, 238879, 238208, 237573, 236935, 236459, 236934, 239184, 243037, 247398, 251272, 254308, 256523, 258184, 259959, 262545, 265920, 269331, 272070, 273878, 274636, 274234, 272926, 271369, 270029, 268781, 267210, 265118, 262627, 260015, 257623, 255826, 255073, 255771, 257843, 260357, 262049, 262522, 262564, 262972, 263536, 263620, 263232, 262845, 262486, 261826, 260995, 260488, 260290, 259826, 258897, 257993, 257587, 257652, 257888, 257880, 257104, 255502, 254046, 253920, 255019, 255979, 255876, 255061, 254210]
57719B54210p10m00L96J123Q32k02o70j70K74p3o91r90j315k076k829k924k434
57702B41351j780j019j25N80R29J388K361L354L565L010K393J912R87p40k730
57687B55436m172m887n294n643n656m922l453j691o1J416L010M949P272R874J2669
57672B58847J5760J9537K4469L0618L7466M4258N0342N4941N6777N4210M5793
57661F93018L0937J0663j1831l1966m6145n3619n5815n4216m9568m2866l5829
57650C52763k9765k4668j9979j5766j2552j0429q995p879o829n506l794k210j377
57637B03014j143p46J03Q58J006P58O51Q54J152J279J002J50j088k136k509k293
57621B00912j835j258n80j16k95j077j913k351k372k127j746j441j400j432j063
$$ y = [254210, 253500, 253100, 253496, 254619, 255451, 255249, 254579, 254409, 254683, 254610, 253919, 252929, 251614, 249538, 246709, 243785, 241351, 239571, 238552, 238427, 239007, 239936, 241324, 243685, 247039, 250604, 253614, 256007, 257919, 258906, 258166, 255436, 251264, 246377, 241083, 235440, 229784, 224862, 221409, 219718, 219657, 221073, 224083, 229032, 236304, 246178, 258847, 274607, 294144, 318613, 349231, 386697, 430955, 481297, 536238, 593015, 647225, 693018, 723955, 734618, 722787, 690821, 644676, 591057, 535242, 481026, 431458, 388592, 352763, 322998, 298330, 278351, 262585, 250033, 239604, 230609, 222730, 215901, 210395, 206601, 204391, 203014, 201871, 201125, 201228, 202086, 203092, 203850, 204501, 205355, 206507, 207786, 208788, 208938, 207850, 205714, 203205, 200912, 199077, 197819, 197239, 197123, 196828, 195751, 193838, 191487, 189115, 186988, 185242, 183801, 182401, 180969, 179906]
57606A79906k29N42Q35Q04O35O0j043j961j878j118q69j628k615k952k679k262
57590A63548j783j189q95j335k150k409j707n94Q7o7r17j999k750k815k307j637
57574A39081j078o80n00o40r52j006n70K2J30n28j518k040j646o64J36L00ml91
57556A27452p69j276j835k106j806r71J34J186J903K125J875J338O97N5n25r53
57540A26524j094q82m60j32NK34P58J137O28p49j968k153j612j270j354j324r72
57523A15316q77j546k560l020k519j375j26Q82J511J782J911K179K645L055L058
57508A20316K564J928J664J866J946J243q9j096j136o12l68n55o56m91n50j090
57492A24884j547j299o98o34j228j623j195l75O5O5J46N10Q41Q83P82P82R33J108
$$ y = [179906, 179677, 180219, 181054, 181858, 182493, 182553, 181510, 179549, 177671, 176553, 175684, 174056, 171441, 168489, 165810, 163548, 161765, 160576, 159681, 158346, 156196, 153787, 152080, 151486, 151573, 151506, 150589, 148590, 145840, 143025, 140718, 139081, 138003, 137323, 136823, 136183, 135231, 134225, 133655, 133677, 133807, 133279, 131761, 129721, 128075, 127411, 127547, 127847, 127843, 127452, 126683, 125407, 123572, 121466, 119660, 118689, 118823, 120009, 121912, 124037, 125912, 127250, 127947, 128002, 127477, 126524, 125430, 124548, 124088, 123956, 123961, 124195, 124953, 126090, 126718, 125969, 124001, 121848, 120236, 118966, 117612, 116288, 115316, 114439, 112893, 110333, 107313, 104794, 103419, 103293, 104175, 105686, 107468, 109379, 111558, 114203, 117258, 120316, 122880, 124808, 126472, 128338, 130284, 131527, 131438, 130342, 129206, 128594, 128226, 127671, 127015, 126524, 125974, 124884, 123337, 122038, 121340, 120706, 119478, 117855, 116660, 116285, 116350, 116415, 116561, 117071, 117912, 118795, 119577, 120359, 121292, 122400]
57474A22400J078N74m33j455j802j301m65P2Q4k53o48q25o42j70L83Q70J171J142
57456A19780Q16N95Q03J037N00q93k157k220j017O03J718J867J115o2j048j479
57440A19958j311n77O19J803K339K195K037K292K528K182J491J101J082R33N12
57425A39184K52L53M43K19J4K85Q76J125O96m3m95m23J7O37J276J575J104K3p48
57406A46370m51N43J167R25K89j41k10O5O27J067Q36R4k84J52R05J487K126K979
57388A58546L363K640J306M01K05L38P52J685K816L437L383L045K566J860J274
57373A87617J298J666J614J054O49O39O26O28J241K432L218L082K720K773K700
57358B13957J828P28O11J612K613K631J765Q54O68J395K538L374L686L856M082
$$ y = [122400, 123478, 124052, 123619, 122164, 120362, 119061, 118596, 118668, 118752, 118499, 117851, 117026, 116384, 116214, 116597, 117467, 118638, 119780, 120596, 121191, 121994, 123031, 123531, 122638, 120481, 118261, 117244, 117847, 119565, 121432, 122547, 122485, 121437, 119958, 118647, 118070, 118689, 120492, 122831, 125026, 127063, 129355, 131883, 134065, 135556, 136657, 137739, 138672, 139184, 139436, 139789, 140232, 140451, 140465, 140750, 141626, 142751, 143447, 143404, 142909, 142486, 142503, 143140, 144416, 145991, 147095, 147118, 146370, 145919, 146462, 147629, 148554, 148843, 148702, 148492, 148557, 149184, 150251, 151087, 151181, 150897, 151049, 151954, 153441, 155567, 158546, 161909, 164549, 165855, 166256, 166461, 166799, 167551, 169236, 172052, 175489, 178872, 181917, 184483, 186343, 187617, 188915, 190581, 192195, 193249, 193898, 194537, 195163, 195791, 197032, 199464, 202682, 205764, 208484, 211257, 213957, 215785, 216513, 217124, 218736, 221349, 223980, 225745, 226599, 227267, 228662, 231200, 234574, 238260, 242116, 246198]
57343B46198L986L296K431J915J592J093O74R90K082L225L740L591L182K987L274
57328B84256L821L990L494K885K873L291L385L058L136M096N139N084L932K955
57314C35395L220M375N180M956M261M105M844N994O926P403P592P752Q057Q439
57300D18499Q744Q978R284R532R322Q737Q620R504J0657J1072J1014J1635J3065
57287E48663J4183J4393J4400J4650J4453J3397J2439J2457J2754J2219J1236
57276F95244J0929J1193J0994J0250R887J0086J0087R798R984J0660J0750R948
57264H19810R396R837J0394J0097R485R609J0386J1097J1755J2785J3879J4450
57252I52980J4827J5865J7418J8441J8638J8937K0055K1501K2453K2920K3463
$$ y = [246198, 250184, 253480, 255911, 257826, 259418, 260511, 261185, 262175, 264257, 267482, 271222, 274813, 277995, 280982, 284256, 288077, 292067, 295561, 298446, 301319, 304610, 307995, 311053, 314189, 318285, 323424, 328508, 332440, 335395, 338615, 342990, 348170, 353126, 357387, 361492, 366336, 372330, 379256, 386659, 394251, 402003, 410060, 418499, 427243, 436221, 445505, 455037, 464359, 473096, 481716, 491220, 501877, 512949, 523963, 535598, 548663, 562846, 577239, 591639, 606289, 620742, 634139, 646578, 659035, 671789, 684008, 695244, 706173, 717366, 728360, 738610, 748497, 758583, 768670, 778468, 788452, 799112, 809862, 819810, 829206, 839043, 849437, 859534, 869019, 878628, 889014, 900111, 911866, 924651, 938530, 952980, 967807, 983672, 1001090, 1019531, 1038169, 1057106, 1077161, 1098662, 1121115, 1144035, 1167498]
57241A167498K4219K4777K4850K4748K5127K6423K8443L0465L1844L2497L2847
57230A473738L3405L4442L5795L6839L6981L6417L6099L6609L7366L7438L6750
57219A871879L5986L5485L4981L4310L3702L3286L2948L2826L3338L4483L5685
57208B248909L6533L7221L8002L8815L9729M1181M3252M5167M6015M5749M5033
57197B705606M4455M4248M4430M4666M4243M2858M1244M0393M0163L9413L7649
57186C169368L5835L5215L5770L6339L5980L4823L3661L3109L3190L3501L3605
57175C550396L3362L2958L2644L2473L2243L1634L0472K8948K7549K6627K5941
57164C885247K4814K2843K0357J8094J6439J5175J3971J2895J2286J2126J1853
$$ y = [1167498, 1191717, 1216494, 1241344, 1266092, 1291219, 1317642, 1346085, 1376550, 1408394, 1440891, 1473738, 1507143, 1541585, 1577380, 1614219, 1651200, 1687617, 1723716, 1760325, 1797691, 1835129, 1871879, 1907865, 1943350, 1978331, 2012641, 2046343, 2079629, 2112577, 2145403, 2178741, 2213224, 2248909, 2285442, 2322663, 2360665, 2399480, 2439209, 2480390, 2523642, 2568809, 2614824, 2660573, 2705606, 2750061, 2794309, 2838739, 2883405, 2927648, 2970506, 3011750, 3052143, 3092306, 3131719, 3169368, 3205203, 3240418, 3276188, 3312527, 3348507, 3383330, 3416991, 3450100, 3483290, 3516791, 3550396, 3583758, 3616716, 3649360, 3681833, 3714076, 3745710, 3776182, 3805130, 3832679, 3859306, 3885247, 3910061, 3932904, 3953261, 3971355, 3987794, 4002969, 4016940, 4029835, 4042121, 4054247, 4066100]
57153D066100J0918R320P355N078K373n10l048n139p147r034j0008r456p808n896
57139D043098l891j557P19J899J342p94m173q505j3034j6638j8838k0084k0585
57126C938959j9533j6190j1281o587l309j547j233k808o638j2233j8452k4265
57114C814883k9119l2680l4550l4412l2367k8899k4320j8345j0431m34J1380K4911
57102C605617M0413N8191P8768J03713J35672J76988K28516K90204L62512M46469
57092E527063N42133O47427P58615Q71458R81330J082213J166605J228332J267119
57083A4072295J289978J305824J316489J312398J277092J196029J062124Q75981
57075B3708210O43950L76446Q6430k11876n03349p72356j005004j192345j331283
$$ y = [4066100, 4077018, 4086338, 4093693, 4098771, 4101144, 4100634, 4097586, 4092447, 4085300, 4076266, 4066258, 4056802, 4048994, 4043098, 4039207, 4037650, 4038369, 4040268, 4041610, 4040816, 4036643, 4028138, 4015104, 3998466, 3979628, 3959544, 3938959, 3919426, 3903236, 3891955, 3885368, 3882059, 3880512, 3879279, 3876471, 3869833, 3857600, 3839148, 3814883, 3785764, 3753084, 3718534, 3684122, 3651755, 3622856, 3598536, 3580191, 3569760, 3569326, 3580706, 3605617, 3646030, 3704221, 3782989, 3886702, 4022374, 4199362, 4427878, 4718082, 5080594, 5527063, 6069196, 6716623, 7475238, 8346696, 9328026, 10410239, 11576844, 12805176, 14072295, 15362273, 16668097, 17984586, 19296984, 20574076, 21770105, 22832229, 23708210, 24352160, 24728606, 24815036, 24603160, 24099811, 23327455, 22322451, 21130106, 19798823]
57066A9798823j422406j467674j470237j435278j369886j282138j180259j071842
57058I099103r62974q57990p59914o70752n91189n20731m58462m03512l54851
57049C518728l11514k73267k40411k12568j88400j66887j48161j32469j19063
57040A725988j06827r5388q4798p4633o4332n4133m4646l5614k5924j4966l334
57029A121393P775J7277K4446K8958L0628K8344J9641K647k0938m5485o4780p5692
57017A074214p8813p6555p1278o4617n7454n0089m2706l5852l0322k6511k4015
57006E16002k1961j9742j7486j5757j4854j4440j3929j3022j1784j0360q894p562
56994C46211o455n467m470l475k468j298N2J290K233L196M529N944O800O913O517
$$ y = [19798823, 18376417, 16908743, 15438506, 14003228, 12633342, 11351204, 10170945, 9099103, 8136129, 7278139, 6518225, 5847473, 5256284, 4735553, 4277091, 3873579, 3518728, 3207214, 2933947, 2693536, 2480968, 2292568, 2125681, 1977520, 1845051, 1725988, 1619161, 1523773, 1438975, 1364342, 1300010, 1245877, 1201231, 1165617, 1139693, 1124727, 1121393, 1129168, 1146445, 1170891, 1199849, 1230477, 1258821, 1278462, 1281109, 1260171, 1214686, 1149906, 1074214, 995401, 918846, 847568, 782951, 725497, 675408, 632702, 596850, 566528, 540017, 516002, 494041, 474299, 456813, 441056, 426202, 411762, 397833, 384811, 373027, 362667, 353773, 346211, 339756, 334289, 329819, 326344, 323876, 322578, 322630, 323920, 326153, 329349, 333878, 339822, 346622, 353535, 360052]
56979C60052N414K939r77n226q415j0045j0496j0255r573q706p910p170o196m815
56965B78621l166j515R1J831L851N988P839R190J0293J1516J2660J2806J0989
56952C60994P042J776l601q184j1579j3658j4318j3736j2587j1641j0915r562
56940B60031o881l206M35L371N678P737R860J2284J5019J7590J9278J9681J8766
56927C79643J6316J1791M991l332j1622j8231k2067k3049k2132k0604j9156j7718
56915B54830j6130j4573j3212j1804j0083q314p090o622o470o020n032l735k542
56902A43203j761j497j709k141k284j620j70J375K322K735L293M528O479Q997
56888A61750J1934J4934J7462J9191K0087K0010J8623J5823J1988P604L059j018
$$ y = [360052, 365466, 368405, 367428, 362202, 353787, 343742, 333246, 322991, 313418, 304712, 296802, 289632, 283436, 278621, 275455, 273940, 274031, 275862, 279713, 285701, 293540, 302730, 313023, 324539, 337199, 350005, 360994, 368036, 369812, 366211, 358027, 346448, 332790, 318472, 304736, 292149, 280508, 269593, 260031, 253150, 249944, 250379, 253750, 259428, 267165, 277025, 289309, 304328, 321918, 341196, 360877, 379643, 395959, 407750, 412741, 409409, 397787, 379556, 357489, 334440, 312308, 291704, 272548, 254830, 238700, 224127, 210915, 199111, 189028, 180714, 173624, 167002, 160532, 154512, 149480, 145745, 143203, 141442, 139945, 138236, 136095, 133811, 132191, 132021, 133396, 135718, 138453, 141746, 146274, 152753, 161750, 173684, 188618, 206080, 225271, 245358, 265368, 283991, 299814, 311802, 319406, 322465, 321447]
56876C21447l671m406l786k867k036p88J445M640Q255J1725J4753J7428K0212
56863C82351K3648K7963L2881L7686M1446M3193M2176L7915L0171J9048N412q867
56851G15023k1334k9936l3851l3615l0554k5998k0805j5357r767l923K454R488
56839E01825J6955K4618L2742M1771N1385O0178O6541O9548O8667O2902N0933
56828A048065L2487R453j4536l5747n1795o1919o6309o5499o0446n2752m4221
56817F36781l5917k7829j9541j1036k670N340J3072K0590K7761L4406M0383M5211
56805G26551M7732M6296L9552K7243J0460q639k7242m2445n2174n6095n5549n2327
56793F03363m7535m1649l5150k8559k2023j5486r248l810Q73N450J0267J4920
$$ y = [321447, 317776, 313370, 309584, 306717, 304681, 303893, 305338, 309978, 318233, 329958, 344711, 362139, 382351, 405999, 433962, 466843, 504529, 545975, 589168, 631344, 669259, 699430, 718478, 723890, 715023, 693689, 663753, 629902, 596287, 565733, 539735, 518930, 503573, 493806, 489883, 492337, 501825, 518780, 543398, 576140, 617911, 669296, 729474, 796015, 865563, 934230, 997132, 1048065, 1080552, 1090005, 1075469, 1039722, 987927, 926008, 859699, 794200, 733754, 681002, 636781, 600864, 573035, 553494, 542458, 539788, 545128, 558200, 578790, 606551, 640957, 681340, 726551, 774283, 820579, 860131, 887374, 897834, 889195, 861953, 819508, 767334, 711239, 655690, 603363, 555828, 514179, 479029, 450470, 428447, 412961, 403713, 399903, 400776, 406226, 416493, 431413]
56781D31413J8827K1734K3373K3044K0039J4221O023l789j4011k3015k9417l2765
56769D55677l3460l2281l0085k7567k4918k1929j8690j5846j3857j2403j0910
56758B13731r370q144p227o292n330m664m376m163l811l326k722k035j512j353
56744A49406j315j041p28r03j524j923j818j760k247k833k662j570k27O54R15
56729A30424Q24O73O29O91P52P39O92O84P16P69Q57R97J114J109J002R48J062
56712A44682J243J217Q45K96j17l21m50m66o4Q38J724J919J378P36N42O88P21
56695A55411N33M53O70Q62O49K34J50L30j7j165k031j394K75J122K77j009j136
56678A54214k33L22j17r20j382j524j518j160k79P09J086N96j98l70M34J393J243
$$ y = [431413, 450240, 471974, 495347, 518391, 538430, 552651, 558674, 554885, 540874, 517859, 488442, 455677, 422217, 389936, 359851, 332284, 307366, 285437, 266747, 250901, 237044, 224641, 213731, 204361, 196217, 188990, 182698, 177368, 172704, 168328, 164165, 160354, 157028, 154306, 152271, 150759, 149406, 148091, 147050, 146322, 145419, 143895, 141972, 140154, 138394, 136147, 133314, 130652, 129082, 128855, 129509, 130424, 131248, 131921, 132550, 133241, 133993, 134732, 135424, 136108, 136824, 137593, 138450, 139447, 140561, 141670, 142672, 143620, 144682, 145925, 147142, 147987, 148283, 148166, 147845, 147395, 146929, 146865, 147703, 149427, 151346, 152724, 153460, 154002, 154690, 155411, 155944, 156397, 157067, 157929, 158578, 158812, 158962, 159292, 159275, 158110, 156079, 154685, 154960, 156082, 156359, 155350, 154214, 153981, 154303, 154186, 153266, 151884, 150360, 148842, 147682, 147403, 148112, 149198, 149794, 149596, 149226, 149660, 151053, 152296]
56661A52296r6j075k10K081M017M634M605M862N366N543N293M970M722M405L955
56646B05368L490L074K612J946J036J24l26j05L85N40L06J14J23m8o67j403j745
56629B14824j613j314j110j087j267j736k592l771m807m952l922k397j425j341
56615A81490j661j878j808j251q3J067J037m50k140k630k007j462j589j785j331
56600A63519m43P7j17o13q39o96m90m16m44o30j163j863k041j319k33M54P88J296
56582A54827J829J654Q01L10Q15J611J711J163P61R25J509K285L004L245K812
56567A79262K153J859J989K258K651L315M073M587M988N761P016Q155Q421P504
56553B43992N683L558J658J18j134j880j678o31L83O11L02J96L96K57p15k294
$$ y = [152296, 152200, 151125, 150915, 152996, 157013, 161647, 166252, 171114, 176480, 182023, 187316, 192286, 197008, 201413, 205368, 208858, 211932, 214544, 216490, 217526, 217650, 217324, 217219, 217604, 218144, 218450, 218564, 218687, 218639, 217972, 216569, 214824, 213211, 211897, 210787, 209700, 208433, 206697, 204105, 200334, 195527, 190575, 186653, 184256, 182831, 181490, 179829, 177951, 176143, 174892, 174809, 175876, 176913, 176463, 174323, 171693, 169686, 168224, 166635, 164850, 163519, 163076, 163153, 163036, 162423, 161584, 160888, 160398, 159982, 159538, 158908, 157745, 155882, 153841, 152522, 152289, 152743, 153531, 154827, 156656, 158310, 159111, 159421, 160236, 161847, 163558, 164721, 165482, 166407, 167916, 170201, 173205, 176450, 179262, 181415, 183274, 185263, 187521, 190172, 193487, 197560, 202147, 207135, 212896, 219912, 228067, 236488, 243992, 249675, 253233, 254891, 255009, 253875, 251995, 250317, 249686, 250069, 250680, 250982, 251178, 251574, 251831, 251116, 248822]
56537B48822l742m293l655k393j617j848k413k357j728j363j601j898j737j251
56523B16926p48j72N62J025N13j082k812l364k393j087r81k170l184k835j585
56508A96613o77m85m18j0O22J221J621J578J020L60N1Ml5J73Q79J502J209K35
56490B05463k88mK28k34q67r21m66mL22N35M39K3k64j15P6j54n57n45n5N27J032
56469B04171J545J887J665Q99K11J95Q06J429J470R09L18K30N22N65N6o10q45
56452B15423n08P3M30K71k77o09k07O88J327J463J558J828J738Q98q6l72q0m2
56434B23516m37n42Q3Q83J119Q92Q56J172J315R01K86M6K04L22K24J83L26L33
56416B31682J2k86j99L9L9j7K86P42P43L32K04N59P37L21j69j01L47O35O28N10
$$ y = [248822, 245080, 240787, 237132, 234739, 233122, 231274, 228861, 226504, 224776, 223413, 221812, 219914, 218177, 216926, 216178, 216006, 216568, 217593, 218106, 217024, 214212, 210848, 208455, 207368, 206387, 204217, 201033, 198198, 196613, 195936, 195451, 195033, 195023, 195645, 196866, 198487, 200065, 201085, 201445, 201496, 201500, 201465, 201638, 202517, 204019, 205228, 205463, 205175, 205171, 205399, 205165, 204298, 203377, 202911, 202907, 203229, 203764, 204203, 204226, 203962, 203847, 203923, 203769, 203212, 202667, 202612, 203139, 204171, 205716, 207603, 209268, 210167, 210378, 210573, 211379, 212808, 214278, 215187, 215505, 215735, 216257, 216822, 216878, 216268, 215423, 214915, 214988, 215418, 215689, 215412, 214803, 214596, 215284, 216611, 218074, 219632, 221460, 223198, 224096, 224010, 223638, 223558, 223516, 223079, 222537, 222620, 223503, 224622, 225514, 226370, 227542, 228857, 229758, 230044, 230090, 230294, 230616, 230840, 231023, 231349, 231682, 231694, 231408, 231209, 231248, 231287, 231270, 231556, 232298, 233041, 233373, 233577, 234136, 234873, 235194, 235025, 234924, 235271, 235906, 236534, 237044]
56396B37044L16J83N68J614K604K777K343K083K084J706P42j92o48j058j975l025
56380B47166l148j836J61J520J619J043P71J055J287R68M19L19Q19J455J760J649
56364B57027J257O80K3m76m74J54R93J289Q31L98R29K195K884K222R08J29J46
56347B71115L46L41L50O12R58J064Q82P51J100J967K759K825K302K029K428K999
56331B94828L142K906K559J966J030K66K76R07J557K051K546K859K649K148J949
56316C23639K042J787R79K26J33O00J135J371J190P27M38P27J426J998K272K593
56300C43283L213L960M576M948M922M399L686L300L304L276K997K718K592K436
56286C93610K259K491L327M291M834N051N443O214P171Q050Q664Q882Q769Q668
$$ y = [237044, 237360, 237543, 238111, 239725, 242329, 245106, 247449, 249532, 251616, 253322, 254064, 253872, 253224, 252166, 250191, 247166, 244018, 242182, 242343, 243863, 245482, 246525, 247296, 248351, 249638, 250606, 251025, 251344, 252163, 253618, 255378, 257027, 258284, 258964, 258987, 258511, 258037, 258191, 259184, 260473, 261304, 261702, 262631, 264826, 267710, 269932, 270840, 270969, 271115, 271461, 271802, 272152, 272764, 273722, 274786, 275668, 276419, 277519, 279486, 282245, 285070, 287372, 289401, 291829, 294828, 297970, 300876, 303435, 305401, 306431, 306697, 306973, 307880, 309437, 311488, 314034, 316893, 319542, 321690, 323639, 325681, 327468, 328447, 328673, 328806, 329406, 330541, 331912, 333102, 333829, 334267, 334994, 336420, 338418, 340690, 343283, 346496, 350456, 355032, 359980, 364902, 369301, 372987, 376287, 379591, 382867, 385864, 388582, 391174, 393610, 395869, 398360, 401687, 405978, 410812, 415863, 421306, 427520, 434691, 442741, 451405, 460287, 469056, 477724]
56272D77724Q860R317R911J0693J1701J2725J3502J4114J4914J6090J7472J8828
56260F35851K0260K2166K4809K7893L0769L3193L5844L9791M5400N1989N8624
56249A026589O5028P1621P8905Q6981R5477J03776J11375J18096J23889J28376
56239B010113J30734J30221J26709J20521J11773J00008Q4665O5893M4801K2878
56229B948316J159j9941m0192n9052p5703q9446j00121j08130j13907j17272j17653
56218B108058j15202j11296j07364j03417r8467r2267q5674p9272p2679o5705
56208A176715n9195n3989m9733m5543m1297l7450l4021l0593k7067k3678k0570
56197G53579j7989j6420j5800j4988j3049j0662r271r009q619p344n777m665l943
$$ y = [477724, 486584, 495901, 505812, 516505, 528206, 540931, 554433, 568547, 583461, 599551, 617023, 635851, 656111, 678277, 703086, 730979, 761748, 794941, 830785, 870576, 915976, 967965, 1026589, 1091617, 1163238, 1242143, 1329124, 1424601, 1528377, 1639752, 1757848, 1881737, 2010113, 2140847, 2271068, 2397777, 2518298, 2630071, 2730079, 2814744, 2880637, 2925438, 2948316, 2949475, 2929534, 2889342, 2830290, 2754587, 2665141, 2565020, 2456890, 2342983, 2225711, 2108058, 1992856, 1881560, 1774196, 1670779, 1572312, 1480045, 1394371, 1315099, 1242420, 1176715, 1117520, 1063531, 1013798, 968255, 926958, 889508, 855487, 824894, 797827, 774149, 753579, 735590, 719170, 703370, 688382, 675333, 664671, 655400, 646391, 637772, 630428, 624651, 619986, 616043]
56184F16043l252k565j900j185o53p51j371j769j437o06K05O48O04L87P38J925
56168F05061L071L234K875L154L948M003L147K796L758N058N727O405P977R699
56154F69913J0135R339Q861R731J1533J3424J5139J6907J8987K1492K4404K7683
56142H57548L1505L6185M1817M8160N4934O1898O8566P4293P8611Q0985Q0434
56131A514936P6168O8808O0237N2133M5353M0597L8371L7747L6297L2145K5445
56120B028237J7319Q313j257j0285j7437k2633k7200l2663l9759m8252n7137o5136
56108A732110p1318p5096p5787p2892o6984n9531n1593m3427l5536k8917k3820
56097A127209j9289j4650j0544p736n793l835j845l10Q42K052L358M539N588O505
$$ y = [616043, 612791, 610226, 608326, 607141, 606488, 605737, 604366, 602597, 601160, 600554, 600759, 601407, 602011, 602398, 603136, 605061, 608132, 611366, 614241, 617395, 621343, 625346, 628493, 631289, 635047, 640105, 645832, 652237, 660214, 669913, 680048, 689387, 698248, 707979, 719512, 732936, 748075, 764982, 783969, 805461, 829865, 857548, 889053, 925238, 967055, 1015215, 1070149, 1132047, 1200613, 1274906, 1353517, 1434502, 1514936, 1591104, 1659912, 1720149, 1772282, 1817635, 1858232, 1896603, 1934350, 1970647, 2002792, 2028237, 2045556, 2053869, 2052612, 2042327, 2024890, 2002257, 1975057, 1942394, 1902635, 1854383, 1797246, 1732110, 1660792, 1585696, 1509909, 1437017, 1370033, 1310502, 1258909, 1215482, 1179946, 1151029, 1127209, 1107920, 1093270, 1082726, 1074990, 1069197, 1065362, 1063517, 1063207, 1064049, 1066101, 1069459, 1073998, 1079586, 1086091]
56083A086091P132P695Q778J0322J1407J1597J1598J2033J2548J2830J3364J4327
56071A219722J4862J4429J3906J4244J5032J5507J5946J6841J7663J7800J7925
56060A393877J8981K0596K1845K2837K4101K5218K5594K5879K6989K8271K8369
56049A662557K7409K6634K6256K5482K4454K4358K5536K7089K8389K9693L1115
56038A958972L2362L3544L5138L7186L9487M2245M5464M8169M9506N0246N1783
56027B424102N4080N6047N7541N9400O1774O3948O5687O7350O8918P0242P1964
56016C121053P4804P8322Q1760Q5525R0309R5335R9344J02788J07158J12572J17944
56005D166914J23072J28630J34393J39644J45021J51866J59987J68168J76593
$$ y = [1086091, 1093223, 1100918, 1109696, 1120018, 1131425, 1143022, 1154620, 1166653, 1179201, 1192031, 1205395, 1219722, 1234584, 1249013, 1262919, 1277163, 1292195, 1307702, 1323648, 1340489, 1358152, 1375952, 1393877, 1412858, 1433454, 1455299, 1478136, 1502237, 1527455, 1553049, 1578928, 1605917, 1634188, 1662557, 1689966, 1716600, 1742856, 1768338, 1792792, 1817150, 1842686, 1869775, 1898164, 1927857, 1958972, 1991334, 2024878, 2060016, 2097202, 2136689, 2178934, 2224398, 2272567, 2322073, 2372319, 2424102, 2478182, 2534229, 2591770, 2651170, 2712944, 2776892, 2842579, 2909929, 2978847, 3049089, 3121053, 3195857, 3274179, 3355939, 3441464, 3531773, 3627108, 3726452, 3829240, 3936398, 4048970, 4166914, 4289986, 4418616, 4553009, 4692653, 4837674, 4989540, 5149527, 5317695, 5494288]
55996E494288J86485J97620K08525K19089K30634K43431K56521K69993K85195
55987G591781L02641L21884L43276L67592L94249M22248M52563M87034N25414
55978A1208682N66237O10173O59636P15590P77790Q47569R27154J016853J116437
55969A8446121J228821J359010J510567J687043J895615K145201K442787K797034
55961C3512199L224159L745273M380814N154591O100506P256562Q654751J0325834
55953H2354689J2307584J4629042J7280791K0207643K3316091K6446547K9305995
55946B25848382L1424142L2172884L0831741K6719966J9474527R429531k189586
55939C73711587j3549188k2891009k9167052l2231655l2597482l1050696k8366782
$$ y = [5494288, 5680773, 5878393, 6086918, 6306007, 6536641, 6780072, 7036593, 7306586, 7591781, 7894422, 8216306, 8559582, 8927174, 9321423, 9743671, 10196234, 10683268, 11208682, 11774919, 12385092, 13044728, 13760318, 14538108, 15385677, 16312831, 17329684, 18446121, 19674942, 21033952, 22544519, 24231562, 26127177, 28272378, 30715165, 33512199, 36736358, 40481631, 44862445, 50017036, 56117542, 63374104, 72028855, 82354689, 94662273, 109291315, 126572106, 146779749, 170095840, 196542387, 225848382, 257272524, 289445408, 320277149, 346997115, 366471642, 375901173, 373711587, 360162399, 337271390, 308104338, 275872683, 243275201, 212224505, 183857723]
55932A83857723k5170800k1893724j8789987j5988424j3539829j1444575r672921
55925F7357463q185752o945558n915126n057224m340503l741883l241727k821048
55917B7108642k464470k161463j903160j681069j489345j324633j182821j058814
55909A3842867r49594q54411p71684o98643o33927n77587n28515m84681m45636
55900G898189m11951l82444l54888l29207l06880k87406k68485k49659k32581
55891E074688k17464k02378j86533j71355j57722j44823j32350j21290j11921
55882C628852j03444r6229r1957r0795r0550q9450q7777q6146q4279q2141q0489
55871B645595p9518p8647p8031p8474p9410p8929p6411p3212p0136o6238o0964
$$ y = [183857723, 158686923, 136793199, 118003212, 102014788, 88474959, 77030384, 67357463, 59171711, 52226153, 46311027, 41253803, 36913300, 33171417, 29929690, 27108642, 24644172, 22482709, 20579549, 18898480, 17409135, 16084502, 14901681, 13842867, 12893273, 12038862, 11267178, 10568535, 9934608, 9357021, 8828506, 8343825, 7898189, 7486238, 7103794, 6748906, 6419699, 6112819, 5825413, 5556928, 5307269, 5074688, 4857224, 4654846, 4468313, 4296958, 4139236, 3994413, 3862063, 3740773, 3628852, 3525408, 3429179, 3337222, 3246427, 3155877, 3066427, 2978650, 2892504, 2808225, 2726084, 2645595, 2566077, 2487430, 2409399, 2330925, 2251515, 2172586, 2096175, 2022963, 1952827, 1886589, 1825625]
55860A825625n5604n1486m8310m5293m2602m0587l8863l7102l5692l4735l3458
55849A361893l1403k9347k8320k8465k9242k9998l0067k9231k8270k8073k8130
55838A041347k7096k4911k2908k1580j9882j7289j4985j4109j4127j3877j3192
55827H37391j2549j2013j1365j0718j0290j0087j0175j0770j1723j2636j3448
55816G11617j4226j4436j3523j2177j1712j2010j1559r849q242p852p984p507
55804E80540o448n317l982k276p58J08P78J732K452K196J178K06k83k14M53J440
55788E71805K116K318K626L304L681L118J823R6k335n572q889j1534j3470j4630
55774E34457j4276j1987q500m663k76M935R756J2069J0831O618O06o011j1844
$$ y = [1825625, 1770021, 1718535, 1670225, 1624932, 1582330, 1541743, 1502880, 1465778, 1430086, 1395351, 1361893, 1330490, 1301143, 1272823, 1244358, 1215116, 1185118, 1155051, 1125820, 1097550, 1069477, 1041347, 1014251, 989340, 966432, 944852, 924970, 907681, 892696, 878587, 864460, 850583, 837391, 824842, 812829, 801464, 790746, 780456, 770369, 760194, 749424, 737701, 725065, 711617, 697391, 682955, 669432, 657255, 645543, 633533, 621974, 612125, 603883, 596031, 588047, 580540, 574092, 568775, 564793, 562517, 561759, 561867, 562645, 564377, 566829, 569025, 570203, 570409, 570126, 569912, 570365, 571805, 573921, 576239, 578865, 582169, 585850, 588968, 590791, 590887, 588552, 582980, 574091, 562557, 549087, 534457, 520181, 508194, 499694, 495031, 494755, 499690, 509446, 521515, 532346, 538964, 539570, 533559, 521715]
55761E21715j5667j7223j7101j5843j3699j1086q675o974o189o320p006p618p984
55748C80330q735j0388j2336j3368j3022j1824j0279q245n492k435n7Q09K46p06
55734B84498r44l91j6o29j978l125l504l341l286l781m622n202n270n267n479
55719B37663n268l945k091j018q53l55J152K829L776M302N008N650N754N445M768
55704B62817L034k1l094m544m406m123m568n395o128o775p274p308o851o224n506
55689A93634m474l207k199j755j702j652j244l32P01J102P66O96J773L350L859
55674A89316K755J014k38q00j069j367j861k502k803k198q81J41J07p11j444j527
55658A75932j022l51J10L00M75Q52J283J467J342J132J075J279J659J862J455
$$ y = [521715, 506048, 488825, 471724, 455881, 442182, 431096, 422421, 415447, 409258, 402938, 395932, 388314, 380330, 371595, 361207, 348871, 335503, 322481, 310657, 300378, 292133, 286641, 284206, 284149, 284958, 285204, 284498, 283554, 283163, 283147, 282518, 280540, 277415, 273911, 270570, 267284, 263503, 258881, 253679, 248409, 243142, 237663, 232395, 228450, 226359, 225341, 224488, 224133, 225285, 228114, 231890, 236192, 241200, 246850, 252604, 258049, 262817, 265851, 265830, 262736, 258192, 253786, 249663, 245095, 239700, 233572, 226797, 219523, 212215, 205364, 199140, 193634, 189160, 185953, 183754, 181999, 180297, 178645, 177401, 177069, 177770, 178872, 179638, 180334, 182107, 185457, 189316, 192071, 193085, 192847, 192047, 190978, 189611, 187750, 185248, 182445, 180247, 179366, 179507, 179614, 178903, 177459, 175932, 174910, 174559, 174669, 174969, 175444, 176296, 177579, 179046, 180388, 181520, 182595, 183874, 185533, 187395, 188850]
55643A88850N07k43j38O39J398J706J495P03o95k407m019n334o180o144n104l804
55627A61230l222l420l539k967j974j153p71p66r36r85p35l52m2K75O30N39n21
55610A41291k160l313l437k928k238j383n13j97o46j244j357j146j104j204j105
55595A17316q66p73o97k98K11J83m66r88p41L4O93J026J270J574J876K176K478
55578A24008K619K551K786L981N943P580Q134Q079Q355R099R666R638R174Q348
55564B19961O801M263J029k274n115p188q504r437j0329j0979j0869r997q977
55551A48385q215p455o425n368m650m169l587k800j924j088n36n79j080j359r80
55536I8170l30m4j75k92j61J15L80M85K58k57p10p81l95M51J564K121J120j252
$$ y = [188850, 189357, 189114, 188976, 189615, 191013, 192719, 194214, 194917, 194222, 191815, 187796, 182462, 176282, 170138, 165034, 161230, 158008, 154588, 151049, 148082, 146108, 144955, 144184, 143418, 142482, 141497, 140762, 140410, 140368, 140643, 141273, 141812, 141291, 139131, 135818, 132381, 129453, 127215, 125832, 125319, 125122, 124476, 123232, 121875, 120729, 119625, 118421, 117316, 116450, 115677, 114980, 114682, 114893, 115076, 114610, 113622, 112881, 112915, 113608, 114634, 115904, 117478, 119354, 121530, 124008, 126627, 129178, 131964, 135945, 141888, 149468, 157602, 165681, 174036, 183135, 192801, 202439, 211613, 219961, 226762, 231025, 232054, 229780, 224665, 217477, 208973, 199536, 189207, 178228, 167359, 157362, 148385, 140170, 132715, 126290, 120922, 116272, 112103, 108516, 105716, 103792, 102704, 102168, 101589, 100509, 99150, 98170, 97840, 97796, 97621, 97329, 97168, 97283, 97663, 98148, 98406, 98149, 97439, 96658, 96263, 96714, 98278, 100399, 101519, 100267]
55518A00267l327l704k730j613p86m1K74m17j638k111j505q98j191j999k431k183
55502G3967j440m59L68N70K09n4J59M69M85N02R26J451J381N69m07r69j017q06
55484G5904o14n32m18j7P20J505J887J552N48o04j146p23J20M29r7q23j023p23
55466G5945m70n61p64p35m73k33j43OM39R68J099O63Q8j51r3o5j43j62p5K5J38
55445G5303K17M8l43l80L97J513J997J622J106R73Q78L25n37j190j436j420j209
55428G7864p61k08J25Km38o65j58R49J749J490N52P0N83J595K442K989L229K798
55410I4207J497j04j074j157r42j118j780k474k668k198j397p72n15m36l54l53
55394G8362n03n82l39J44N60P50P82P09M96K27J35L50P09R30Q61N32L2m54o07
$$ y = [100267, 96940, 93236, 90506, 88893, 88107, 88066, 88340, 87923, 86285, 84174, 82669, 81771, 80580, 78581, 76150, 73967, 72527, 72068, 72436, 73006, 73215, 73161, 73320, 73789, 74274, 74776, 75702, 77153, 78534, 79103, 78696, 77727, 76710, 75904, 75290, 74758, 74340, 74323, 75043, 76548, 78435, 79987, 80535, 79931, 78785, 78062, 78182, 78611, 78514, 77691, 76668, 75945, 75475, 74914, 74150, 73415, 72942, 72709, 72566, 72572, 73011, 73979, 75078, 75741, 75829, 75678, 75585, 75520, 75377, 75215, 75140, 75165, 75303, 75520, 75568, 75225, 74845, 75242, 76755, 78752, 80374, 81480, 82453, 83331, 83656, 83119, 81929, 80493, 79073, 77864, 77103, 76895, 77020, 77022, 76584, 75919, 75761, 76710, 78459, 79949, 80501, 80571, 81154, 82749, 85191, 88180, 91409, 94207, 95704, 95600, 94526, 93369, 92427, 91309, 89529, 87055, 84387, 82189, 80792, 80020, 79505, 79069, 78715, 78362, 77859, 77277, 76938, 77082, 77642, 78392, 79174, 79883, 80379, 80606, 80741, 81091, 81800, 82730, 83591, 84123, 84155, 83701, 83094]
55375H3094k86O6l00j434k316j995r01l27o60r31l56M98O42J10k90k57k67o79
55357G3411j287j666j514p53K56P71M22k31l49J40P32J200J593J581P67l93q32
55340G3848k58M73O27M89O20Q92P43Kr99j855k249j961j036J20R43J050M74k51
55322G1672m32K3L99R0n53p59m44j00J66O47J208J331J032Q64R09O12j35o74o31
55303G5225m47m46k90K39O80O72N23M84K76j09N7J112K086J820N43n53q97r24
55285H0051j105j382j477j136k62P67J160N75l38p45o70n78m58mN18M77j42o66
55267G4585p22o46q05j080j140q40k47L86O80M66N0j19L5K98N44P03N79J12l15
55248G2524k87O0K59J94J89M22O51N58R9m30n72o6P64J219R81L80j98p18j083
$$ y = [83094, 82808, 82874, 82574, 81140, 78824, 76829, 75928, 75601, 74941, 74010, 73654, 74152, 74794, 74904, 74614, 74357, 74090, 73411, 72124, 70458, 68944, 68191, 68447, 69218, 69640, 69409, 69060, 69200, 69932, 71132, 72725, 74306, 75073, 74680, 73848, 73590, 74063, 74690, 75179, 75799, 76691, 77434, 77436, 76437, 74582, 72333, 70372, 69336, 69456, 70399, 71449, 71923, 71672, 71240, 71263, 71662, 71752, 71199, 70440, 69996, 69896, 70062, 70709, 71917, 73248, 74280, 75144, 76053, 76665, 76530, 75856, 75225, 74778, 74332, 74042, 74281, 74961, 75633, 76156, 76640, 76916, 76807, 76864, 77976, 80062, 81882, 82425, 81872, 80975, 80051, 78946, 77564, 76087, 74951, 74689, 75456, 76616, 77191, 76853, 76108, 75438, 74860, 74402, 74398, 74916, 75393, 75251, 74585, 73863, 73217, 72412, 71332, 70192, 69352, 69105, 69491, 70171, 70637, 70687, 70568, 70603, 70901, 71445, 72148, 72727, 72839, 72524, 72237, 72297, 72556, 72750, 72939, 73361, 74012, 74570, 74669, 74239, 73667, 73601, 74365, 75584, 76565, 76945, 76747, 76029, 74946]
55229G4946r55m10k06p14j150o31L66N65k69j014p58J43Q25J018J048J169J263
55212G5236J021L26m48o82k49K05J16k71m37m53o53p77k80N81Q92M23n9k4P6l42
55192G4201j006j128l57Q82J788J724P57k57m97j08R2k02m80m06l45n82p02k51
55174G3123M26O27K82m5nJ18o1m25m35K52J293J865J419K27q93j317r69k40K67
55155G5509J34l35k44P48J688J385L8r25p00N7M30M21M32L70Jk93J12J063J721
55136H1612J621J148Q37O76L30k24n86m97k49l32p60j043r54r78j549k147j773
55119G5132l05J179J621J016J29l51j26P03J592J846J247K30p60j603k105j818
55103G7627p21M21R02R78J334J939K145J754J364J438J680J547J037O00N47P81
$$ y = [74946, 73991, 73581, 73375, 72661, 71511, 70880, 71246, 71811, 71542, 70528, 69770, 69913, 70738, 71756, 72804, 73973, 75236, 76257, 76583, 76135, 75453, 75204, 75409, 75525, 75254, 74817, 74364, 73711, 72934, 72654, 73235, 74127, 74550, 74491, 74467, 74543, 74201, 73195, 72067, 71710, 72592, 74380, 76104, 76861, 76604, 76107, 75999, 76091, 75889, 75409, 75003, 74658, 74076, 73374, 73123, 73549, 74176, 74458, 74413, 74408, 74526, 74465, 74040, 73605, 73857, 75150, 77015, 78434, 78661, 77768, 76451, 75482, 75242, 75509, 75643, 75308, 75064, 75812, 77500, 78885, 78923, 77998, 77298, 77355, 77785, 78206, 78638, 79008, 79009, 78716, 78828, 79891, 81612, 83233, 84381, 85218, 85894, 86224, 86000, 85414, 84917, 84668, 84336, 83576, 82533, 81579, 80601, 79052, 76905, 75132, 74827, 76006, 77627, 78643, 78772, 78421, 78295, 78998, 80590, 82436, 83683, 83913, 83153, 81550, 79445, 77627, 76906, 77327, 78229, 79207, 80541, 82480, 84625, 86379, 87743, 89181, 90861, 92408, 93445, 94045, 94592, 95373]
55087I5373J012J064R58Q12O84M81J23k83n46o47p14p67o54l55j50l18p31r84
55069I4358r53j021j535k197k271j461l39K87K65J92O07J380J897J701R07K9m60
55052I1386m43q5L80O90N27k36j193j650j320o07pM02P37Q42N53J05q9q5l42r75
55032H8590j444j108N4J346J893J378L54l01k53Q9L22N07O55L21o86j590j384
55015H8743j80R01J086O64K68K11N30J099J505J343P59K24j99q24j583j973j878
54998I0696j677j385n36P59J493J053J53j34K73P18R12J028J029O56l0n57n45
54981I3906M9R68J659J576P80l1m11o72j122j372r81l13QJ14N08R28O13k92o72
54962I5243MR19J176J020J132J349Q98k68j272j456j148r64q35k43P72J376R74
$$ y = [95373, 96385, 97449, 98407, 99219, 99903, 100384, 100507, 100224, 99678, 99031, 98317, 97550, 96896, 96541, 96391, 96073, 95342, 94358, 93405, 92384, 90849, 88652, 86381, 84920, 84581, 84868, 85133, 85325, 85932, 87312, 89209, 90910, 91817, 91846, 91386, 90943, 90858, 91238, 91928, 92455, 92219, 91026, 89376, 88056, 87449, 87442, 87844, 88581, 89423, 89976, 90081, 89992, 89907, 89565, 88590, 87146, 86038, 86092, 87438, 89331, 90709, 91063, 90762, 90509, 90598, 90920, 91427, 92082, 92403, 91717, 90127, 88743, 88563, 89464, 90550, 91214, 91482, 91693, 92223, 93322, 94827, 96170, 96929, 97153, 96954, 96130, 94547, 92574, 90696, 89019, 87634, 87098, 87857, 89350, 90403, 90556, 90422, 90695, 91413, 92325, 93353, 94382, 95038, 95008, 94451, 93906, 93955, 94923, 96582, 98158, 98938, 98907, 98496, 97824, 96702, 95330, 94349, 94036, 94044, 94158, 94666, 95594, 96207, 95915, 95243, 95247, 96166, 97342, 98362, 99494, 100843, 101741, 101473, 100201, 98745, 97597, 96633, 95798, 95555, 96327, 97703, 98677]
54945I8677Q1k59K15O61L00n42q84l15N69R44O06nl53k23K67Q72J363J583J491
54926A05048J212R12N91J49k26m6Q38J776K037J876K303L648M995N353M864M398
54910A39728M391M600M728M612L931K303q4k393l877m489m704m916n139n203n045
54895A28443m867m858m800m139k609p66L56K04p97j684j762r92K23J409K118J937
54879A07416Q75k57k98J039K744L606L556L415L714M322N048N801O163N644M544
54864A57332L773L500K829J180p70k114k967l947n000n504n281m775m428m396
54850A29432m648m791m170k710j369j107j647j939j607j170j075j217j442j735
54836I8805j905j688j275j144j355j534j523j386q51M62K146L104K843K007J341
$$ y = [98677, 98758, 98499, 98714, 99375, 99675, 99133, 98249, 97934, 98503, 99447, 100053, 100048, 99695, 99472, 99739, 100611, 101974, 103557, 105048, 106260, 107172, 107763, 107912, 107686, 107640, 108478, 110254, 112291, 114167, 116470, 120118, 125113, 130466, 135330, 139728, 144119, 148719, 153447, 158059, 161990, 164293, 164209, 161816, 157939, 153450, 148746, 143830, 138691, 133488, 128443, 123576, 118718, 113918, 109779, 107170, 106404, 106760, 106964, 106167, 104483, 102721, 101729, 101952, 103361, 105479, 107416, 108291, 108034, 107736, 108775, 111519, 115125, 118681, 122096, 125810, 130132, 135180, 140981, 147144, 152788, 157332, 161105, 164605, 167434, 168614, 167844, 165730, 162763, 158816, 153816, 148312, 143031, 138256, 133828, 129432, 124784, 119993, 115823, 113113, 111744, 110637, 108990, 107051, 105444, 104274, 103199, 101982, 100540, 98805, 96900, 95212, 93937, 92793, 91438, 89904, 88381, 86995, 86144, 86606, 88752, 91856, 94699, 96706, 98047]
54821I8047P72Oo10m61L28R12O60k23j057j342j029l38M89J224J555J250N05p2
54803A00616r1J83K67O5k09m60o35n03j1L62K31Q3O77J707J915P46q27j568j397
54784A01151j060q59m00N46J528J942J754J541J724J993J657O65l0N06K053L451
54768A18162L884L503K952K730L054L774M350M373M182M564N673O710O757N662
54754A80330L948K189O44p70k199l520m398m911n639o736p319o530m888l670l157
54739A33374k605j850j702k395k936k609k123k379k935k688j483j66O78J210J707
54724A11098K142K318K080J533J230J752K899L856M387N112O216O817O260N180
54710A62880M315L188J141j054k057k124k833m631o115o091n063m200l764l320
$$ y = [98047, 98819, 98825, 98215, 97754, 98082, 98994, 99654, 99431, 98374, 97032, 96003, 95665, 96154, 97378, 98933, 100183, 100688, 100616, 100525, 100708, 100975, 101040, 100831, 100371, 99736, 99233, 99222, 99584, 99815, 99898, 100575, 102282, 104197, 104943, 104116, 102548, 101151, 100091, 99232, 98832, 99378, 100906, 102848, 104602, 106143, 107867, 109860, 111517, 112182, 112152, 112658, 114711, 118162, 122046, 125549, 128501, 131231, 134285, 138059, 142409, 146782, 150964, 155528, 161201, 167911, 174668, 180330, 184278, 186467, 187111, 186341, 184142, 180622, 176224, 171313, 165674, 158938, 151619, 145089, 140201, 136531, 133374, 130769, 128919, 127217, 124822, 121886, 119277, 117154, 114775, 111840, 109152, 107669, 107503, 108181, 109391, 111098, 113240, 115558, 117638, 119171, 120401, 122153, 125052, 128908, 133295, 138407, 144623, 151440, 157700, 162880, 167195, 170383, 171524, 170470, 168413, 166289, 163456, 158825, 152710, 146619, 141556, 137356, 133592, 130272]
54696A30272k657j902j270j063j475k029j816o73M54P08L06j24n10j116j778k129
54680A13198k237k409k522k169j387o72l18j56m1j07m35q08r52q18n17j46K23
54663I7727N00O08N44M04L47M92P54Q30M41l82j232j556j039Q4J129J501J173
54646A02325N91K10K13N49R97J181Q38J46l85m23r3K83N28O43O99P55P70O19L02
54627A10748O8O6J3m55j125j384j076p17o94p31m93j70p9j00jJ8l58q70r50n38
54607A01172r1K46Q16J606J890J114k16r51m75P35J649J579P06j49k98J47N20
54590A10000M95L95N38O41K85l06m69n8L01Q4m57p62p51p67q74p37k46K04K77
54571A07793K60O45J251J238J64j287j928j337k14N06O42P16J119J530J267J38
$$ y = [130272, 127615, 125713, 124443, 123380, 121905, 119876, 118060, 117387, 117841, 118549, 118855, 118731, 118221, 117105, 115327, 113198, 110961, 108552, 106030, 103861, 102474, 101802, 101484, 101328, 101287, 101180, 100745, 99937, 98985, 98167, 97650, 97504, 97727, 98227, 98835, 99379, 99783, 100130, 100622, 101376, 102206, 102647, 102265, 101033, 99477, 98438, 98522, 99651, 101152, 102325, 102916, 103126, 103339, 103888, 104885, 106066, 106904, 107050, 106665, 106242, 106149, 106432, 106960, 107603, 108302, 109057, 109827, 110446, 110748, 110816, 110882, 110895, 110440, 109315, 107931, 106855, 106138, 105444, 104713, 104220, 104050, 103971, 103871, 103870, 103888, 103530, 102660, 101710, 101172, 101081, 101327, 102143, 103749, 105639, 106753, 106537, 105586, 105111, 105846, 107495, 109074, 109780, 109631, 109333, 109480, 110000, 110495, 110890, 111428, 112069, 112354, 112048, 111579, 111521, 111822, 111906, 111449, 110687, 109936, 109169, 108295, 107558, 107312, 107516, 107793, 108053, 108698, 109949, 111187, 111351, 110064, 108136, 106799, 106585, 107091, 107733, 108449, 109568, 111098, 112365, 112503]
54555A12503j159j578p84M26R68O26J68K57O40O61K63Q0N15J216J553J288O08
54538A18251k25q88q77J40J704K660K144M96j046j527j129p43q61j045o40K54
54522A16668P83M00m07p17l32J8k67q51r06k19N82Q39O03M00N18P39O87K07m81
54503A18264r22p32o6L78O6p16j211j177j010q68k91Q99J917J904J150O70P47
54486A19002P49L77J97N53Q38M07l52n38J0O52Q52N96R0l86m57l2L76K09k95m04
54466A22444OL43L18M40J113J867J881J012p5n29M9J364K467K421J200k28r94
54449A35099j177j346j558j429r55o27o26n18l6L30J1p14j019o98m25o81j022
54432A22609p43J9M99L57k9l12n01m85Q9J135J881J806J334J096R55M27k99n62
$$ y = [112503, 111344, 109766, 108982, 109408, 110376, 111002, 111170, 111427, 112067, 112728, 112991, 113071, 113586, 114802, 116355, 117643, 118251, 118026, 117138, 116261, 116401, 118105, 120765, 122909, 123405, 122359, 120832, 119703, 118960, 118099, 117054, 116414, 116668, 117451, 117851, 117444, 116727, 116395, 116413, 116146, 115295, 114389, 114170, 114752, 115591, 116194, 116594, 117112, 117851, 118538, 118745, 118264, 117342, 116610, 116544, 116922, 116988, 116272, 115061, 113884, 112874, 112006, 111715, 112614, 114531, 116435, 117585, 118255, 119002, 119751, 120128, 120325, 120878, 121716, 122123, 121771, 121233, 121243, 121895, 122747, 123343, 123433, 123047, 122590, 122558, 122934, 123143, 122848, 122444, 122450, 122793, 123111, 123551, 124664, 126531, 128412, 129424, 129349, 128820, 128869, 130233, 132700, 135121, 136321, 136093, 135099, 133922, 132576, 131018, 129589, 128634, 128007, 127381, 126863, 126827, 127157, 127168, 126454, 125435, 124737, 124312, 123631, 122609, 121866, 121885, 122384, 122741, 122712, 122400, 121899, 121414, 121503, 122638, 124519, 126325, 127659, 128755, 129710, 130137, 129838, 129276]
54414A29276k47J37L29N63Q61Q64M88P6k63p37j117p15M64J345J127M24L19Q48
54396A34042J188J011Q02R36J166J184J046Q65N75K28J32L95N88J74p47j403j161
54379A41021k67L78J97m69q93q26n57k93M4M30O54P45J041J634K103K047J521
54362A48510P68p3p46q48l72P4Kl24l20J27P18J230J584J680J604J710K128K470
54344A59922K384K095J982J933J607R88J98q94k280l408l831l896m037l761k415
54329A46587p30l25j459k464j914m38L45j25j077j677j718j254l41P42J452J355
54313A36959M49q20j743j773r25K45J087J170L78r95k189k477j863r90l83r1p6
54296A25963m08r08j095p92m15l45m35l19J23Q08J535J844J328L86R0P80J404
$$ y = [129276, 129029, 129166, 129495, 130058, 130919, 131783, 132271, 132347, 132084, 131347, 130230, 129515, 129979, 131324, 132451, 132875, 133194, 134042, 135230, 136241, 137043, 137979, 139145, 140329, 141375, 142240, 142815, 143043, 143175, 143570, 144158, 144332, 143585, 142182, 141021, 140754, 141132, 141329, 140860, 139967, 139141, 138584, 138291, 138335, 138765, 139419, 140164, 141205, 142839, 144942, 146989, 148510, 149278, 149205, 148459, 147611, 147239, 147313, 147315, 146991, 146671, 146798, 147516, 148746, 150330, 152010, 153614, 155324, 157452, 159922, 162306, 164401, 166383, 168316, 169923, 170911, 171109, 170215, 167935, 164527, 160696, 156800, 152763, 149002, 146587, 145857, 145532, 144073, 141609, 139695, 139257, 139602, 139477, 138400, 136723, 135005, 133751, 133410, 134152, 135604, 136959, 137408, 136588, 134845, 133072, 132147, 132392, 133479, 134649, 135027, 134032, 131843, 129366, 127503, 126513, 126130, 126039, 125963, 125555, 124647, 123552, 122760, 122345, 122000, 121565, 121246, 121369, 122177, 123712, 125556, 126884, 127270, 127360, 128140, 129544]
54279A29544Q90k72o76M1Q40Q15K36j68j94n3J21K23O7k55k14N08J386J535P72
54260A35146j67m83q2N75J090J377J451J276R04N55L81K07k44q45j041n21K67
54243A39846N36O8n51o36j00N87Q83N36l34j290j876j999j932j791j307l63M67
54226A30744M47k40n89j14M03M0q67j125l30O05P04M4o04p64m49K37J137J874
54208A31153K041J584Q06J0o36j034j194j223j156q83m14K6L63Q49J570K046J761
54191A35669Q92P5m63j008j590j710j085k05J39k47p99q69l94O2n7o38r68n05
54173A26299N29J443J719J286M27l02l56K22P05M84k33q68j266j536j501r86m28
54156A25638m07o35l06N59R97N65j9p0J15nk14l8L37L68O7n1K41P11J145J505
$$ y = [129544, 130434, 130162, 129486, 129527, 130367, 131182, 131418, 131250, 131056, 131003, 131124, 131347, 131414, 131159, 130945, 131453, 132839, 134374, 135146, 134979, 134496, 134414, 134989, 136079, 137456, 138907, 140183, 141087, 141642, 142023, 142230, 141986, 141141, 140100, 139579, 139846, 140382, 140450, 139899, 139263, 139163, 139750, 140633, 141169, 140835, 139545, 137669, 135670, 133738, 131947, 130640, 130277, 130744, 131191, 130951, 130362, 130248, 130651, 130691, 129824, 128699, 128369, 128974, 129678, 129722, 129118, 128354, 127905, 128142, 129279, 131153, 133194, 134778, 135584, 135594, 134958, 133924, 132730, 131507, 130351, 129468, 129054, 129080, 129443, 130292, 131862, 133908, 135669, 136561, 136636, 136173, 135165, 133575, 131865, 130780, 130575, 130714, 130467, 129668, 128799, 128405, 128467, 128410, 127772, 126804, 126299, 126828, 128271, 129990, 131276, 131703, 131401, 131045, 131267, 131972, 132456, 132223, 131355, 130089, 128553, 127052, 126066, 125638, 125231, 124596, 124290, 124849, 125846, 126411, 126392, 126322, 126437, 126432, 126218, 126180, 126517, 126885, 126952, 126901, 127142, 127853, 128998, 130503]
54136A30503J696J598J274Q53L08l38q22r04p37o45o50m65R6R40J814K418K531
54119A39470K088J138j91j455j874j070J73O43K60J31P97J327P51m24r52n62k0
54102A40230J63J55J26J0j22q4k0k11n54p34p80q37o14K36J316J804J576J304
54084A42964J384J499J326R72N86J56j22P5O00R03Q40Q10R55R12N49K53J94P2
54066A54928j17J86J111J915K088K180K787L348K939J894J506K228L113L252K959
54051A86317L074L795M650N278N741O104O121N469M125K422P84n55j533k074k042
54036B27676j375j89J203K308K680K406K248K820L705L873L142K546K894L582
54022B59519L419K292J199Q01P27M02j48o28j065j659k297k663k697k735l151
$$ y = [130503, 132199, 133797, 135071, 135924, 136232, 135894, 135072, 134168, 133431, 132786, 132136, 131671, 131767, 132707, 134521, 136939, 139470, 141558, 142696, 142505, 141050, 139176, 138106, 138279, 138922, 139182, 139313, 140110, 141437, 142188, 141764, 140812, 140250, 140230, 140393, 140548, 140674, 140684, 140562, 140478, 140458, 140247, 139693, 138959, 138179, 137342, 136728, 136964, 138280, 140084, 141660, 142964, 144348, 145847, 147173, 148145, 148731, 148887, 148765, 148840, 149440, 150343, 151183, 151993, 152948, 153860, 154409, 154662, 154856, 154928, 154811, 154997, 156108, 158023, 160111, 162291, 165078, 168426, 171365, 173259, 174765, 176993, 180106, 183358, 186317, 189391, 193186, 197836, 203114, 208855, 214959, 221080, 226549, 230674, 233096, 233880, 233325, 231792, 229718, 227676, 226301, 226112, 227315, 229623, 232303, 234709, 236957, 239777, 243482, 247355, 250497, 253043, 255937, 259519, 262938, 265230, 266429, 267230, 267957, 268359, 268211, 267583, 266518, 264859, 262562, 259899, 257202, 254467, 251316]
54007B51316l970m759m911m192l065k331k347k731k919k780k593k581k649k547
53993B06941k173j784j825k439l091k989j979p52n3N2j27n09j102j515j264n50
53977A84841j31k84m95l73k74n71q93p48m62o58j016n48P92J676J115j80p68k61
53959A80762O08J277J807K121J807R71N71J332K713L504L218K451K018K216K888
53944B10264L768M539M936M987N039N307N561N400M715L700K566J490P25M70O07
53929B64074Q78J283J970K712K991K759K641L051L575L726L821M454N419N979
53915C09333O128O677P953R211R677R472R119Q774Q457Q457Q918R382R381R112
53901D30051R024Q946Q160O156K862j530o433j0747j3510j4699j4937j4625j3784
$$ y = [251316, 247346, 242587, 237676, 233484, 230419, 228088, 225741, 223010, 220091, 217311, 214718, 212137, 209488, 206941, 204768, 202984, 201159, 198720, 195629, 192640, 190661, 189909, 189856, 189908, 189781, 189272, 188170, 186655, 185391, 184841, 184710, 184426, 183931, 183558, 183284, 182713, 181820, 181072, 180610, 179952, 178936, 178388, 179180, 180856, 181971, 181791, 181023, 180762, 181370, 182647, 184454, 186575, 188382, 189353, 189924, 191256, 193969, 197473, 200691, 203142, 205160, 207376, 210264, 214032, 218571, 223507, 228494, 233533, 238840, 244401, 249801, 254516, 258216, 260782, 262272, 262997, 263467, 264074, 264952, 266235, 268205, 270917, 273908, 276667, 279308, 282359, 285934, 289660, 293481, 297935, 303354, 309333, 315461, 322138, 330091, 339302, 348979, 358451, 367570, 376344, 384801, 393258, 402176, 411558, 420939, 430051, 439075, 448021, 456181, 462337, 465199, 463669, 457236, 446489, 432979, 418280, 403343, 388718, 374934]
53888C74934j2633j1651j1115j0897j0704j0181r029p433o168n724n663n300m725
53875B63711m416m216l629k916k896l540l825l204k348k078k422k964l347l154
53861B18756k208j255j422k527l001k078r69j062j948k342k100k009k117j718
53847A92000q35l73o93j063q28j75M20P17N83K5m69l42J46K05j70j09O69J182
53829A90890N59o94j484j580j486j273n45N68J229R75L92L43Q44J155Q24K80K74
53812A91271R92J977K789L452M097M533M483M078L774L772L860L886M061M620
53798B41645N370N763N399M452L598L347L456L202K349J555J464J730J510P52
53784B85592K28L04L31l49j457k285k734l282m055m565m385l753l326l417l651
$$ y = [374934, 362301, 350650, 339535, 328638, 317934, 307753, 298724, 291291, 285123, 279399, 273736, 268436, 263711, 259295, 255079, 251450, 248534, 245638, 242098, 238273, 235069, 232721, 230643, 228221, 225257, 221910, 218756, 216548, 215293, 213871, 211344, 208343, 206265, 205296, 204234, 202286, 199944, 197844, 195835, 193718, 192000, 191165, 190792, 190099, 189036, 188208, 188033, 188453, 189170, 189753, 189778, 189309, 188967, 189113, 189318, 189148, 189039, 189708, 190890, 191449, 190755, 189271, 187691, 186205, 184932, 184387, 184955, 186184, 187159, 187551, 187894, 188738, 189893, 190717, 190997, 191271, 192263, 194240, 197029, 200481, 204578, 209111, 213594, 217672, 221446, 225218, 229078, 232964, 237025, 241645, 247015, 252778, 258177, 262629, 266227, 269574, 273030, 276232, 278581, 280136, 281600, 283330, 284840, 285592, 285820, 286124, 286455, 286106, 284649, 282364, 279630, 276348, 272293, 267728, 263343, 259590, 256264, 252847, 249196]
53769B49196l433k781k494l229m528n259n007m486m357m234l369j868o14j83m08
53754B02946r15j466j799j686j308j097j081q83m88m84j164j827j592n80K58M56
53738A87290N16R30J390J324Q66O72Q95R56M41k41m34r5K92M43N07O05O64P08
53720A97729R50J379J633J514J347J528J950K181K064J838J734J778J899J970
53706B21494J752J147N20M68J152K114K839L284L666L958L877L304K520J956J770
53691B55821J722J491J078Q69J145J675J927J632R57J10q84j922k604k560j855
53676B58602r70m06m30r94j699j947j459n96NJ19L7K7p8n67j329j839j684j033
53658B43759m62l22m11k88J12M57N26M78M61K84j92n70k78O14J348J367Q96M90
$$ y = [249196, 245763, 242982, 240488, 237259, 232731, 227472, 222465, 217979, 213622, 209388, 206019, 204151, 203537, 203354, 202946, 202031, 200565, 198766, 197080, 195772, 194675, 193594, 192711, 192223, 191739, 190575, 188748, 187156, 186576, 186834, 187290, 187806, 188736, 190126, 191450, 192316, 192988, 193883, 194839, 195280, 195039, 194605, 194510, 194802, 195245, 195752, 196357, 197021, 197729, 198679, 200058, 201691, 203205, 204552, 206080, 208030, 210211, 212275, 214113, 215847, 217625, 219524, 221494, 223246, 224393, 224913, 225381, 226533, 228647, 231486, 234770, 238436, 242394, 246271, 249575, 252095, 254051, 255821, 257543, 259034, 260112, 260981, 262126, 263801, 265728, 267360, 268317, 268427, 267543, 265621, 263017, 260457, 258602, 257632, 257226, 256796, 255802, 254103, 252156, 250697, 250101, 250106, 250225, 250262, 250289, 250211, 249644, 248315, 246476, 244792, 243759, 243297, 242975, 242564, 242276, 242388, 242845, 243371, 243849, 244310, 244594, 244402, 243832, 243554, 244168, 245516, 246883, 247779, 248269]
53640B48269L46L68N82J098J709J973J790J577J625J631J182N68N72J331J972
53625B66593J774J317J764L161M223M022L087K472K452K801L629M999O115O030
53611C14439N025M265M041L577K677K317K947L491K929J929J776K364K625K397
53597C56799K531L226L622L211K514J965J222K1j146j826k349l140l881l997l560
53582C55212l100k840k684k672k883l084k965k626k347k076j575r85p47r61j260
53567C22407j317j141p73j62O48J354J633J401P76jo11q19o60l07K24J113K353
53550C26118L491L914L419K506K023K447L493M445M795M536L960L462L508M394
53536C76511N910P371Q201Q342Q139Q069Q587R855J1421J2507J2896J3166J3782
$$ y = [248269, 248615, 248983, 249565, 250663, 252372, 254345, 256135, 257712, 259337, 260968, 262150, 262718, 263290, 264621, 266593, 268367, 269684, 271448, 274609, 278832, 282854, 285941, 288413, 290865, 293666, 297295, 302294, 308409, 314439, 319464, 323729, 327770, 331347, 334024, 336341, 339288, 342779, 345708, 347637, 349413, 351777, 354402, 356799, 359330, 362556, 366178, 369389, 371903, 373868, 375090, 375111, 373965, 372139, 369790, 366650, 362769, 358772, 355212, 352112, 349272, 346588, 343916, 341033, 337949, 334984, 332358, 330011, 327935, 326360, 325375, 324628, 323667, 322407, 321090, 319949, 319176, 319014, 319662, 321016, 322649, 324050, 324826, 324825, 324214, 323395, 322735, 322428, 322652, 323765, 326118, 329609, 333523, 336942, 339448, 341471, 343918, 347411, 351856, 356651, 361187, 365147, 368609, 372117, 376511, 382421, 389792, 397993, 406335, 414474, 422543, 431130, 440985, 452406, 464913, 477809, 490975, 504757]
53523E04757J4343J4217J3645J3586J4468J5744J6747J7504J8422J9555K0608
53512F83596K1404K2108K2939K3901K4791K5340K5355K4877K4229K3840K3878
53501I46258K4047K3847K3094K2112K1338K0829K0338J9747J9169J8635J8011
53490A177425J7345J6938J6908J6950J6750J6459J6496J6999J7647J7899J7335
53479A365151J5962J4295J2825J1349R193O298L557J622j08k649n881q643j0295
53466A412676j1448j2909j4604j5900j6552j6855j7144j7558j8178j9097k0248
53455A232183k1372k2224k2744k3007k2952k2331k1092j9801j9268j9571j9751
53444I98070j8795j6687j4227j2075j0420r219q154o593m244j813l10L07J011
$$ y = [504757, 519100, 533317, 546962, 560548, 575016, 590760, 607507, 625011, 643433, 662988, 683596, 705000, 727108, 750047, 773948, 798739, 824079, 849434, 874311, 898540, 922380, 946258, 970305, 994152, 1017246, 1039358, 1060696, 1081525, 1101863, 1121610, 1140779, 1159414, 1177425, 1194770, 1211708, 1228616, 1245566, 1262316, 1278775, 1295271, 1312270, 1329917, 1347816, 1365151, 1381113, 1395408, 1408233, 1419582, 1428775, 1435073, 1438630, 1440252, 1440144, 1437495, 1431614, 1422971, 1412676, 1401228, 1388319, 1373715, 1357815, 1341263, 1324408, 1307264, 1289706, 1271528, 1252431, 1232183, 1210811, 1188587, 1165843, 1142836, 1119884, 1097553, 1076461, 1056660, 1037392, 1017821, 998070, 979275, 962588, 948361, 936286, 925866, 916647, 908493, 901900, 897656, 895843, 895533, 895840, 896851]
53431H96851K198L181L502L827M933O544P944R165J0777J2758J4567J6123J7916
53418A010286K0043K1897K3061K3906K5036K6603K8368L0023L1221L1821L2369
53407A304634L3905L6800M0116M2621M4200M5743M7805N0020N1861N3265N4325
53396A805295N4916N5081N5332N6070N6916N7117N6494N5547N4728N3991N3057
53385B414544N1588M9176M5740M2003L8900L6302L2915K7927K2112J6799J2257
53374B790263P869L470n01m211q787j5061k2537k9990l6688m2629m7917n2428
53362B540853n5978n8467n9828o0095n9499n8412n7104n5600n3744n1490m9132
53351A921504m7224m6099m5524m5006m4341m3706m3233m2770m2057m0955l9388
$$ y = [896851, 899049, 902230, 905732, 909559, 914492, 921036, 928980, 938145, 948922, 961680, 976247, 992370, 1010286, 1030329, 1052226, 1075287, 1099193, 1124229, 1150832, 1179200, 1209223, 1240444, 1272265, 1304634, 1338539, 1375339, 1415455, 1458076, 1502276, 1548019, 1595824, 1645844, 1697705, 1750970, 1805295, 1860211, 1915292, 1970624, 2026694, 2083610, 2140727, 2197221, 2252768, 2307496, 2361487, 2414544, 2466132, 2515308, 2561048, 2603051, 2641951, 2678253, 2711168, 2739095, 2761207, 2778006, 2790263, 2798132, 2801602, 2801101, 2796890, 2788103, 2773042, 2750505, 2720515, 2683827, 2641198, 2593281, 2540853, 2484875, 2426408, 2366580, 2306485, 2246986, 2188574, 2131470, 2075870, 2022126, 1970636, 1921504, 1874280, 1828181, 1782657, 1737651, 1693310, 1649604, 1606371, 1563601, 1521544, 1480589, 1441201]
53340A441201l7323l4862l2274k9830k7634k5572k3377k0889j8328j6132j4409
53329A160571j2869j1526j0997j1676j2850j3339j2846j2046j1393j0576r311
53318A031142p931o807n775m491k942j282M54K167L582M628N616O769P959R165
53304A042254J0729J2786J4864J6535J8054J9768K1306K2109K2535K3658K5802
53293A250400K8017K9231K9430K9309K9187K8743K7673K6110K4275K2122J9538
53282A544035J6778J4300J2188R985P257L994L63l564p511j0774j2924j4512j6463
53269A543152j8877k0996k2397k3477k4639k5761k6731k7771k8855k9510k9630
53258A264508k9870l0671l1519l1689l1243l0619k9787k8555k7284k6539k6292
$$ y = [1441201, 1403878, 1369016, 1336742, 1306912, 1279278, 1253706, 1230329, 1209440, 1191112, 1174980, 1160571, 1147702, 1136176, 1125179, 1113503, 1100653, 1087314, 1074468, 1062422, 1051029, 1040453, 1031142, 1023211, 1016404, 1010629, 1006138, 1003196, 1001914, 1002368, 1004535, 1008117, 1012745, 1018361, 1025130, 1033089, 1042254, 1052983, 1065769, 1080633, 1097168, 1115222, 1134990, 1156296, 1178405, 1200940, 1224598, 1250400, 1278417, 1307648, 1337078, 1366387, 1395574, 1424317, 1451990, 1478100, 1502375, 1524497, 1544035, 1560813, 1575113, 1587301, 1597286, 1604543, 1608537, 1608900, 1605336, 1597825, 1587051, 1574127, 1559615, 1543152, 1524275, 1503279, 1480882, 1457405, 1432766, 1407005, 1380274, 1352503, 1323648, 1294138, 1264508, 1234638, 1203967, 1172448, 1140759, 1109516, 1078897, 1049110, 1020555, 993271, 966732, 940440]
53247I40440k6168k6157k6325k6189k5278k4061k3345k2898k1747j9844j8264
53236F80164j7498j6686j5054j3182j2002j1356j0395r019q033p931q327q721
53224E41960r222j0153j1307j1968j1755j1114j0812j1003j1174j0932j0517j0276
53212D11727j0115r762r192q413p236n840n110n585o395o208n133m628n310o083
53198C16717n821m946m525m620m505m023l765m066m602m962m997m598l692k599
53184B54996j928j937k219k164j564p48k33k63o18r01r60r63j019j096j266j706
53168B35411k301k580k204j331l56L34L83k81j052j075l69P5l42r72r49m47j94
53151B21750k33q4K42L06J59K21K95k50j204j418m04Q54J154M85k92n74l29J83
$$ y = [940440, 914272, 888115, 861790, 835601, 810323, 786262, 762917, 740019, 718272, 698428, 680164, 662666, 645980, 630926, 617744, 605742, 594386, 583991, 574972, 566939, 559008, 550681, 541960, 532738, 522585, 511278, 499310, 487555, 476441, 465629, 454626, 443452, 432520, 422003, 411727, 401612, 391850, 382658, 374245, 367009, 361169, 356059, 350474, 344079, 337871, 332738, 328110, 322800, 316717, 310896, 305950, 301425, 296805, 292300, 288277, 284512, 280446, 275844, 270882, 265885, 261287, 257595, 254996, 253068, 251131, 248912, 246748, 245184, 244436, 244203, 243940, 243322, 242421, 241461, 240498, 239479, 238383, 237117, 235411, 233110, 230530, 228326, 226995, 226639, 226973, 227356, 227075, 226023, 224948, 224579, 224654, 224312, 223340, 222391, 221944, 221750, 221517, 221433, 221675, 221981, 222140, 222361, 222656, 222406, 221202, 219784, 219380, 220234, 221388, 221873, 221581, 221007, 220678, 220861]
53133B20861M44n6j079j588j056k63j50l86K9J011J447R18K54P5j06p58j287r20
53115B17390KN45O06Q44J400J619J232Q30Q74R46N03k67q37j210j684k100j993
53098B18700j438j067j151j226q78l99l89r18j442j397p08K42R03R52N48J54O9
53081B10555J75K18J16o8l11o25r60j244j449j490j183m58L99Q91P16K9o86j016
53063B03609j036j243j890k445k050o94N39P33K73K50R19J447J224O48L38J73
53047B00795l17r90j234r13n43m33l10QJ70j06m27k99N2L5l41n27m09m66p83p33
53027A92229m1N78M32j7J00O39O80Q1k49K22Q36Q08L83L18P58J151J047M36m23
53008A99968j075j035k69N85Q90P00M54K24k13p43r37o72k81n1j5k11o49r56o08
$$ y = [220861, 221305, 221249, 220170, 218582, 217526, 217263, 217113, 216727, 216756, 217767, 219214, 220132, 220386, 220461, 220355, 219597, 218310, 217390, 217392, 217937, 218543, 219387, 220787, 222406, 223638, 224468, 225342, 226288, 226791, 226524, 225687, 224477, 222793, 220693, 218700, 217262, 216195, 215044, 213818, 212940, 212541, 212152, 211234, 209792, 208395, 207687, 207929, 208832, 209784, 210332, 210486, 210555, 210730, 210948, 211064, 210996, 210685, 210060, 209100, 207856, 206407, 204917, 203734, 203276, 203675, 204566, 205282, 205311, 204625, 203609, 202573, 201330, 199440, 196995, 194945, 194251, 194790, 195523, 195796, 196046, 196965, 198412, 199636, 200284, 200622, 200795, 200478, 199488, 198254, 197341, 196798, 196365, 196055, 196063, 196233, 196127, 195700, 195401, 195453, 195488, 195147, 194620, 194211, 193745, 192962, 192229, 192188, 192766, 193198, 193181, 193281, 193920, 194600, 194681, 194432, 194654, 195490, 196298, 196681, 196999, 197757, 198908, 199955, 200391, 199968, 198893, 197858, 197589, 198174, 199064, 199764, 200218, 200442, 200229, 199486, 198549, 197877, 197596, 197545, 197530, 197319, 196670, 195714, 195106]
52989A95106K56P72L56n37j000o38K48J141J603J371N96j18k63M1L40N11Q16J295
52971B01896J546J236O06L03P89J866K777K796J966J142J107J672J926J400N86
52956B23614J61J02j14o76j287j709j986k081j737j008n35q89j796k350k066j376
52940B04267r83r70q04j38O29P29j37j410k159j909r07J90P65M84m74j343j338
52923A94492o05j88o74j222o42P55J324K56j293j702q18L22J078J561J712J121
52907A95477p4r55r29m10q2qO1l2n64j251j454j034n06k94k83k01j5J84L81N12
52887A88523M37K34K85P85J281J087J65o16l33R71K212K296J185j08n45k9P30
52870A98560J068R37P23P64J087J450J517J157O39L33K40O8j44J23J039J867J682
$$ y = [195106, 195362, 196134, 196490, 195953, 194953, 194315, 194563, 195704, 197307, 198678, 199274, 199156, 198893, 198934, 199274, 199785, 200601, 201896, 203442, 204678, 205284, 205587, 206376, 208242, 211019, 213815, 215781, 216923, 218030, 219702, 221628, 223028, 223614, 223775, 223877, 223763, 223087, 221800, 220091, 218105, 216024, 214287, 213279, 212744, 211855, 210059, 207709, 205643, 204267, 203284, 202314, 201510, 201372, 202001, 202730, 202593, 201183, 199024, 197115, 196208, 196398, 197163, 197647, 197173, 195830, 194492, 193887, 193699, 193025, 191803, 191161, 191916, 193240, 193496, 192203, 190501, 189683, 190005, 191083, 192644, 194356, 195477, 195403, 194448, 193519, 193109, 193027, 193019, 193080, 193048, 192484, 191233, 189779, 188745, 188239, 187945, 187662, 187461, 187446, 187630, 188011, 188523, 188960, 189194, 189479, 190264, 191545, 192632, 192797, 192181, 191848, 192819, 195031, 197327, 198512, 198404, 197859, 197830, 198560, 199628, 200565, 201288, 202052, 203139, 204589, 206106, 207263, 207902, 208235, 208475, 208543, 208399, 208522, 209561, 211428, 213110]
52853B13110O06k98l87j84n40j517k454k829k690k324j933j673j689j975k340
52838A90883k542k499k318k165j982j413j90J302K157J885R99M42N89J064J401
52823A87613J525J535J354P82k15j319j979j829j052k46J84K94K43%l40l59J54
52806A86345P90J135J474K198K794K289P71m92p24n81r72j730k143k159k260k496
52790A84239k433j975j435q66pR52J288O91j49l11L08J021J257J091R20Q83Q20
52773A86294O61N71N78L21n09j547k008j622r00l74j9K90L36k5l41r0M71O01J11
52754A82799l74k30N76J593K225J980R43l0j14M44N98o1o61j66J319K652K860
52737A96353J952P85L07P73J488J614J180J053J703K507K537J704P20J00k88p58
$$ y = [213110, 213716, 213418, 213031, 212847, 212307, 210790, 208336, 205507, 202817, 200493, 198560, 196887, 195198, 193223, 190883, 188341, 185842, 183524, 181359, 179377, 177964, 177774, 179076, 181233, 183118, 184117, 184559, 185148, 186212, 187613, 189138, 190673, 192027, 192809, 192594, 191275, 189296, 187467, 186415, 186169, 186353, 186647, 186890, 186890, 186550, 186191, 186345, 187135, 188270, 189744, 191942, 194736, 197025, 197796, 197304, 196580, 195999, 195027, 193297, 191154, 188995, 186735, 184239, 181806, 179831, 178396, 177530, 177523, 178475, 179763, 180454, 180305, 179994, 180302, 181323, 182580, 183671, 184591, 185474, 186294, 186955, 187526, 188104, 188425, 187916, 186369, 184361, 182739, 181839, 181465, 181446, 181736, 182072, 182047, 181706, 181616, 182087, 182688, 182799, 182425, 182195, 182771, 184364, 186589, 188569, 189512, 189482, 189368, 189812, 190410, 190349, 189688, 189522, 190841, 193493, 196353, 198305, 199090, 199397, 200170, 201658, 203272, 204452, 205505, 207208, 209715, 212252, 213956, 214676, 214776, 214488, 213730]
52721B13730j260j468j223p71o10j020j781k350k400k050j582j124p24n45o84
52706A94138q73o49P3P11N44m76j513j622o90M93J129J095P02Q9o86j199q37L85
52688A90814J558J781J116M05K58N04O46N43M50M89M09Nm92o68n13l77l99l99
52670A96130l35l93m27O5J082J797J656J215J289J646J424N18l29o48n77j17Q75
52653B04871J865J934J183Q52J581K434K246J074k93j474k387k696k237j532j197
52638B06224j138j037j025j180r15K32J550J867J113K86L5J69M66J020J690K030
52622B11387J878J457Q43J2o75p92n90o88r98q57k45M2l43p75o50k19P9K76N36
52603B09678P60R20J188J426J180N11J00K11K14l10q23p01k17M3R1K10K61Q4O3
$$ y = [213730, 212470, 211002, 209779, 209008, 208398, 207378, 205597, 203247, 200847, 198797, 197215, 196091, 195367, 194822, 194138, 193265, 192616, 192689, 193400, 193944, 193468, 191955, 190333, 189643, 190136, 191265, 192360, 193062, 193151, 192465, 191266, 190429, 190814, 192372, 194153, 195269, 195674, 195932, 196436, 197082, 197625, 198075, 198564, 198973, 198978, 198486, 197818, 197305, 196928, 196529, 196130, 195795, 195402, 194975, 195040, 196122, 197919, 199575, 200790, 202079, 203725, 205149, 205667, 205338, 204690, 204113, 203996, 204871, 206736, 208670, 209853, 210705, 212286, 214720, 216966, 218040, 217747, 216273, 213886, 211190, 208953, 207421, 206224, 205086, 204049, 203024, 201844, 200929, 201161, 202711, 204578, 205691, 205977, 206012, 206181, 206647, 207667, 209357, 211387, 213265, 214722, 215565, 215577, 214902, 214110, 213520, 212832, 211834, 210977, 210732, 210774, 210431, 209656, 209006, 208787, 208866, 209142, 209678, 210438, 211358, 212546, 213972, 215152, 215663, 215763, 215974, 216188, 215878, 215055, 214354, 214137, 214180, 214271, 214481, 214742, 214826, 214889]
52584B14889M67P08J52o79p20L4N56L85J71M92J008J141Q55L90j84q54j384j532
52566B15895j248n77L19R88R50K81l92o06m80m05n96j029j471j553j129n34j46
52549B08267K23R70J848K067J404N79K60K30n0n78r13q42m99o2K99L89K48K30
52531B14070N45Q91Q63N25K99L98O56Q05N88j40j110j603j131j83J98l64j141
52514B14166j232o13Q7M99Q16J203J429J375J518K392L631M162L492K281J317
52499B36523M96o08j639j837j334j147j677k137j830j201j048j267j145n00J74
52484B19823N08N75M77J52l12n93m91n5N71J253J809K079K013J673J237J032J288
52467B33039J735J780J294Q05O84O89O45R37J725K233J702O44K02M91M91l08j215
$$ y = [214889, 215356, 216064, 216216, 215537, 214817, 214851, 215407, 215792, 215963, 216455, 217463, 218604, 219459, 219849, 219665, 218811, 217427, 215895, 214647, 214070, 214389, 215377, 216327, 216608, 216216, 215610, 215130, 214725, 214129, 213100, 211629, 210076, 208947, 208413, 208267, 208490, 209460, 211308, 213375, 214779, 215358, 215618, 215848, 215798, 215220, 214307, 213465, 212966, 212904, 213203, 213592, 213840, 214070, 214615, 215506, 216369, 216894, 217193, 217591, 218247, 219052, 219640, 219500, 218390, 216787, 215656, 215473, 215671, 215307, 214166, 212934, 212321, 212408, 212907, 213723, 214926, 216355, 217730, 219248, 221640, 225271, 229433, 232925, 235206, 236523, 237019, 236411, 234772, 232935, 231601, 230454, 228777, 226640, 224810, 223609, 222561, 221294, 220149, 219649, 219823, 220331, 220906, 221383, 221535, 221223, 220630, 220139, 220084, 220655, 221908, 223717, 225796, 227809, 229482, 230719, 231751, 233039, 234774, 236554, 237848, 238653, 239337, 240026, 240671, 241608, 243333, 245566, 247268, 247912, 248114, 248605, 249096, 248788, 247573]
52450B47573j466j185r13r16j284k074k983l417l225k839k520k052j389r20p39
52435B19651l86K86O13J02p19j046q84p10n28k6P13J369K025K851L391K971J788
52418B31461P98M62L19k5k13K58J249K180K732L045L435M106N020N986O884P756
52402B75453Q486Q570P434N006J724j808m956p036p666p152o165n115m075l187
52388B59513k612k202j645r47m04r9J14K36K43M84J284K152K113J101K70N84J676
52371B61861K586L045L381L620L494L141L122L620M177M299L914L112J858K87
52357C05517j024j444j007m79n94j239j545q43O07J903K424K267J894J672J763
52342C09872K218K899L527L917M180M562N178N908O510O879P252Q090R553J1167
$$ y = [247573, 246107, 244922, 244009, 243093, 241809, 239735, 236752, 233335, 230110, 227271, 224751, 222699, 221310, 220390, 219651, 219265, 219551, 220164, 220266, 219547, 218501, 217617, 216907, 216379, 216353, 217066, 218435, 220460, 223311, 226702, 229673, 231461, 232259, 232721, 233040, 233015, 232802, 233060, 234309, 236489, 239221, 242266, 245701, 249807, 254827, 260813, 267697, 275453, 283939, 292509, 299943, 304949, 306673, 304865, 299909, 292873, 285207, 278055, 271890, 266775, 262700, 259513, 256901, 254699, 253054, 252107, 251703, 251604, 251718, 251954, 252197, 252681, 253965, 256117, 258230, 259331, 259601, 260185, 261861, 264447, 267492, 270873, 274493, 277987, 281128, 284250, 287870, 292047, 296346, 300260, 303372, 305230, 305517, 304493, 303049, 302042, 301563, 300969, 299730, 298185, 297342, 297949, 299852, 302276, 304543, 306437, 308109, 309872, 312090, 314989, 318516, 322433, 326613, 331175, 336353, 342261, 348771, 355650, 362902, 370992, 380545, 391712]
52328C91712J2178J2283J1870J1721J2511J4294J6210J6996J6328J5404J5602
52317E47109J6732J7399J6982J6377J6465J6748J6152J4492J2510J0840R660R050
52305G20516R028R231R054Q105O367M183K288J469J736K150J893J178O35K60l95
52290G77698j332k187l057m395o042p138p150o399n382m173k757j387k99O10J546
52275G28156K571L801N466P543R542J0880J1321J1053J0574J0527J1211J2191
52263H34836J2628J2182J1264J0384R636Q938Q325P786P152O375N633M947M079
52250I44165L024K214J918J722J007l08j850l396n002o611p907q603q672q330
52236I03371p950p824p881p749p290o836o665o447n701m578l768l497l140k108
$$ y = [391712, 403890, 416173, 428043, 439764, 452275, 466569, 482779, 499775, 516103, 531507, 547109, 563841, 581240, 598222, 614599, 631064, 647812, 663964, 678456, 690966, 701806, 711466, 720516, 729544, 738775, 747829, 755934, 762301, 766484, 768772, 770241, 771977, 774127, 776020, 777198, 777833, 778093, 777698, 776366, 774179, 771122, 766727, 760685, 753547, 746397, 739998, 734616, 730443, 727686, 726299, 726000, 726610, 728156, 730727, 734528, 739994, 747537, 757079, 767959, 779280, 790333, 800907, 811434, 822645, 834836, 847464, 859646, 870910, 881294, 890930, 899868, 908193, 915979, 923131, 929506, 935139, 940086, 944165, 947189, 949403, 951321, 953043, 954050, 953742, 951892, 948496, 943494, 936883, 928976, 920373, 911701, 903371, 895421, 887597, 879716, 871967, 864677, 857841, 851176, 844729, 839028, 834450, 830682, 827185, 824045, 821937]
52222H21937p37R4J25J08Q63K241L292L427L093L212M098N199N810N794N585N667
52206H69808O150O681O738O098N064M105L375K757K301K305K809L366L447K970
52192I27974K305J877J847J918J535N52l21j40J004J909J641N45n85j739l386
52177I36936n222o212n993n440n516o096o415o241o010n983n770m826l109j165
52163H62938L15R68R67Q29R62J407J999K674L424M029M103L504K557J682R37J38
52147H93433o22r11n91j79k75p10o89J83J360K017K006J838J884J944J726J456
52131I03870J770L035M989P132R310J1694J4277J6740J8900K0924K2821K4090
52119A059552K4375K4260K4760K5957K6800K6423K5027K3191K0936J8073J5034
$$ y = [821937, 821200, 821294, 821419, 821527, 822390, 824631, 827923, 831350, 834443, 837655, 841753, 846952, 852762, 858556, 864141, 869808, 875958, 882639, 889377, 895475, 900539, 904644, 908019, 910776, 913077, 915382, 918191, 921557, 925004, 927974, 930279, 932156, 934003, 935921, 937456, 938008, 937687, 937547, 938551, 940460, 942101, 942646, 942061, 940322, 936936, 931714, 925502, 919509, 914069, 908553, 902457, 896042, 889801, 883791, 877808, 872038, 867212, 864103, 862938, 863253, 864221, 865188, 866017, 866979, 868386, 870385, 873059, 876483, 880512, 884615, 888119, 890676, 892358, 893295, 893433, 892811, 891900, 891309, 891130, 890855, 890145, 889456, 889639, 890999, 893016, 895022, 896860, 898744, 900688, 902414, 903870, 905640, 908675, 913664, 920796, 930106, 941800, 956077, 972817, 991717, 1012641, 1035462, 1059552, 1083927, 1108187, 1132947, 1158904, 1185704, 1212127, 1237154, 1260345, 1281281, 1299354, 1314388]
52108A314388J2526J0571Q535O098L521R84j651m253o268p502q506r731j0659
52095A308053j0385q896p217o269o058o063o075o304o909p687q254q378q097p665
52081A203796p366p240o913n795l585n75K558N190O959P830Q178Q659R680J0996
52067A232372J2049J2638J2856J2554J1444R884Q836Q637Q341O879M463K197N70
52054A343720q29k302l618m766o219q112r732j0380j0355j0545j1400j2660j3901
52041A238901j4922j5730j6482j7349j8148j8250j7226j5463j3818j2674j1638
52030A067201j0198q381o678n516m954m764m733m807n028n362n706o020o332o591
52016I82131o746p018p807r128j0341j0708j0145r251q747r053j0223j1957j3628
$$ y = [1314388, 1326914, 1337485, 1346020, 1352118, 1355639, 1356623, 1354972, 1350719, 1344451, 1336949, 1328443, 1318712, 1308053, 1297668, 1288772, 1281555, 1275286, 1269228, 1263165, 1257090, 1250786, 1243877, 1236190, 1227936, 1219558, 1211461, 1203796, 1196430, 1189190, 1182277, 1176482, 1172897, 1172322, 1174880, 1180070, 1187029, 1194859, 1203037, 1211696, 1221376, 1232372, 1244421, 1257059, 1269915, 1282469, 1293913, 1303797, 1312633, 1321270, 1329611, 1336490, 1340953, 1343150, 1343720, 1342891, 1340589, 1336971, 1332205, 1325986, 1317874, 1308142, 1297762, 1287407, 1276862, 1265462, 1252802, 1238901, 1223979, 1208249, 1191767, 1174418, 1156270, 1138020, 1120794, 1105331, 1091513, 1078839, 1067201, 1057003, 1048622, 1041944, 1036428, 1031474, 1026710, 1021977, 1017170, 1012142, 1006780, 1001074, 995054, 988722, 982131, 975385, 968367, 960560, 951432, 941091, 930383, 920238, 910987, 902240, 893187, 882964, 871007, 857379]
52003H57379j4641j4875j4769j4866j5363j5976j6195j5765j5022j4658j4977
51992F90272j5474j5276j3981j1953r890q317p361o805o305n677n013m559m602
51979E75059n400o851q141q226p057n986o402q104r594r812q999p894o805n705
51965D70083m617l483k108o01N53J244K122L728N603O888P523Q118Q613Q023N860
51950E17549L082J045j26j329k901m034l985l131k317j643n22J283L360N368P395
51935E19094R458J1186J2324J3004J3201J2466J0665Q484O562M497J485k317n937
51922F14172q909j1518j3702j4808j4770j4539j4837j5202j4872j3847j2437j0499
51910D54232q006n717m331l331j646Q21L317N700Q561J1850J4530J5976J6688
$$ y = [857379, 842738, 827863, 813094, 798228, 782865, 766889, 750694, 734929, 719907, 705249, 690272, 674798, 659522, 645541, 633588, 623698, 615381, 608020, 601215, 594910, 589233, 584220, 579661, 575059, 569659, 562808, 554667, 546441, 539384, 533398, 526996, 518892, 509298, 499486, 490487, 482593, 475788, 470083, 465466, 461983, 459875, 459274, 459827, 461071, 463193, 466921, 472524, 479412, 486935, 495053, 503666, 511689, 517549, 520631, 521676, 521550, 520221, 517320, 513286, 509301, 506170, 503853, 502210, 501688, 502971, 506331, 511699, 519094, 528552, 539738, 552062, 565066, 578267, 590733, 601398, 609882, 616444, 620941, 622426, 620109, 614172, 605263, 593745, 580043, 565235, 550465, 535926, 521089, 505887, 491015, 477168, 464731, 454232, 446226, 440509, 436178, 432847, 431201, 432022, 435339, 441039, 449600, 461450, 475980, 491956, 508644]
51897E08644J7133J6745J4699J1039O410J288l883q326j1515j3880j6191j8379
51885E03784j9509j8896j6719j3643j0382p636n844m764l691k280q81J00Q74K011
51871D02524L681N380O427O584O142N474M691L779K813J863P37q15k707m596o327
51856D35650p831q567p769n580l331k046j176M22K503L473K497O66m29o01q65
51841D07016j815k875l266l017k769k872l069l026k824k752k799k664k213j586
51827C69469q15K23J268J591R07M5lN20L82r37k521l318l363l267l055k306j149
51810C53671k81O7M37J236K034K216J914J793K040K126J556N08n36j408k176k658
51794C62539k535j931j474j579j998k323k514k663k487j658n54j55r96k501l512
$$ y = [508644, 525777, 542522, 557221, 568260, 574670, 575958, 572075, 563749, 552234, 538354, 522163, 503784, 484275, 465379, 448660, 435017, 424635, 416999, 411155, 406391, 402700, 400420, 399539, 399639, 400513, 402524, 406205, 411585, 418012, 424596, 430738, 436212, 440903, 444682, 447495, 449358, 450095, 449280, 446573, 441977, 435650, 427819, 419252, 411483, 405903, 402572, 400526, 399350, 399772, 402275, 405748, 408245, 408911, 408482, 407881, 407016, 405201, 402326, 399060, 396043, 393274, 390402, 387333, 384307, 381483, 378731, 375932, 373268, 371055, 369469, 368654, 368877, 370145, 371736, 372643, 372688, 372685, 373205, 373587, 372650, 370129, 366811, 363448, 360181, 357126, 354820, 353671, 353390, 353457, 353894, 355130, 357164, 359380, 361294, 363087, 365127, 367253, 368809, 369317, 368781, 367373, 365197, 362539, 360004, 358073, 356599, 355020, 353022, 350699, 348185, 345522, 343035, 341377, 340823, 340668, 339672, 337171, 333659]
51779C33659l300k040n24M55O57M28K00K6j94k14L75J477K477L022L421M115N095
51762C49135O079O918P559P890P893P676P116N842L828J676j74k061m443o779
51748C98155p847p211n836m972m872m858m255l040j650m99L73J216K226L376M656
51733C64962O245Q103R528R647Q424O797N626M891M151L387K955K889K743K144
51719D42492J094l60k361m861p172q295p760o054m161k849k407k823l857m920
51705C85706n287m650l433k281j334j90J417L062L912L485K103N93l82p36o73
51690C81312k45N93J520J809J066k83j512k474l521m645n236m903m060l349k784
51675C53288j818k52J437K701L547M398N454O457P099P510Q103Q969R635R542
$$ y = [333659, 330359, 328319, 327795, 328250, 328907, 329335, 329535, 329561, 329367, 329153, 329528, 331005, 333482, 336504, 339925, 344040, 349135, 355214, 362132, 369691, 377581, 385474, 393150, 400266, 406108, 409936, 411612, 411438, 409377, 404934, 398155, 390308, 383097, 377261, 372289, 367417, 362559, 358304, 355264, 353614, 353115, 353488, 354704, 356930, 360306, 364962, 371207, 379310, 388838, 398485, 406909, 413706, 419332, 424223, 428374, 431761, 434716, 437605, 440348, 442492, 443586, 443226, 440865, 436004, 428832, 420537, 412777, 406723, 402562, 399713, 397306, 394483, 390626, 385706, 380419, 375769, 372336, 370055, 368721, 368531, 369948, 373010, 376922, 380407, 382510, 383103, 382721, 381985, 381312, 381067, 381660, 383180, 384989, 386055, 385772, 384260, 381786, 378265, 373620, 368384, 363481, 359421, 356072, 353288, 351470, 351218, 352655, 355356, 358903, 363301, 368755, 375212, 382311, 389821, 397924, 406893, 416528, 426070]
51661D26070Q676P443N912L517j64m480p867r106q333o683n072l448j310J290
51647D06445L523M573M393L446J934l14l205o035q006q853q789q060o953n987
51633C68112n652n797n664m733l324k161j588j481j715k223k660k518j753r57
51619C25886o14n57m53m80r71j574j504o70N4K8l24l16j28m40j237j715j403n99
51601C12983L98J796L683N503O691P443Q243Q964R045Q529Q081P807O799M328
51587D00293J043j669l321m610o054p075o802n266l277j365N66K622M518O058
51573C75661P548R421J1581J3400J4301J4242J3753J3562J4005J4637J4647J3770
51561E30528J2634J2048J2309J3475J5923K0032K5282L0292L3871L5671L5624
$$ y = [426070, 434746, 442189, 448101, 451618, 451454, 446974, 439107, 430001, 421668, 414985, 409913, 406465, 405155, 406445, 409968, 414541, 418934, 422380, 424314, 424000, 420795, 414760, 406754, 397901, 389112, 381052, 374099, 368112, 362460, 356663, 350999, 346266, 342942, 340781, 339193, 337712, 335997, 333774, 331114, 328596, 326843, 325886, 325272, 324715, 324262, 323782, 322811, 321237, 319733, 319063, 319117, 319145, 318821, 318505, 318377, 317937, 316700, 314985, 313582, 312983, 313381, 315177, 318860, 324363, 331054, 338497, 346740, 355704, 364749, 373278, 381359, 389166, 395965, 400293, 401336, 399667, 396346, 391736, 385682, 378607, 371805, 366539, 363262, 361897, 362463, 365085, 369603, 375661, 383209, 392630, 404211, 417611, 431912, 446154, 459907, 473469, 487474, 502111, 516758, 530528, 543162, 555210, 567519, 580994, 596917, 616949, 642231, 672523, 706394, 742065, 777689]
51550G77689L3303K8315K1142J3135N558j259p815j4641k1578k7755l2266l4872
51538G38956l5960l5897l4669l2278k9152k5945k3010k0350j7888j5611j3514
51527D54682j1666j0295r494q844p738o192m997m768n080m938m022l068k935l601
51513C67044m258m189l326k103j067n71n41n15o6O89J200J179J015J314K156K963
51497C60924L093K447J464N94j08q44j581j876j410n89k70q07j577j706j053l52
51481C56349m18j431k876m049m651m923n162n172m496l279k451k750l804m583
51467C06304m507l761k741j709r10n20m17l36k85m15n66l92L1K56K78O96J865
51450B92871L328M421N042N546O110O631O985P145P254P695Q835J0407J1478J1334
$$ y = [777689, 810992, 839307, 860449, 873584, 879142, 877883, 870068, 855427, 833849, 806094, 773828, 738956, 702996, 667099, 632430, 600152, 571000, 545055, 522045, 501695, 483807, 468196, 454682, 443016, 432721, 423227, 414383, 406645, 400453, 395456, 390688, 385608, 380670, 376648, 373580, 370645, 367044, 362786, 358597, 355271, 353168, 352101, 351530, 350989, 350474, 350408, 351097, 352297, 353476, 354491, 355805, 357961, 360924, 364017, 366464, 367928, 368522, 368414, 367570, 365989, 364113, 362703, 362114, 361844, 361037, 359460, 357754, 356701, 356349, 355931, 354500, 351624, 347575, 342924, 338001, 332839, 327667, 323171, 319892, 317441, 314691, 310887, 306304, 301797, 298036, 295295, 293586, 292676, 292156, 291739, 291403, 291118, 290703, 290137, 289745, 289776, 290032, 290310, 291006, 292871, 296199, 300620, 305662, 311208, 317318, 323949, 330934, 338079, 345333, 353028, 361863, 372270, 383748, 395082]
51436C95082J0131Q332N990L012m5k165k878k652k293k340l099m710o890q796
51422C86679r528q848p433o335o005n810m756k860j355j152j552j117M28J942
51408C32298K591K824L319L780L504K625J925J715J652J642K074K938L484L199
51394C69570K608K589L221L913M398M936N543N780N486N210N546O570Q312J1241
51380D44923J5591K0488K4559K7511L0390L4186L8730M3185M6861M9084M8797
51369H24305M5133L8361K9783K0694J1701K944n537j3666k1267k7984l3535l7948
51357H32984m1388m3748m4698m4157m2377l9643l6132l2051k7677k3196j8858
51346D39059j5244j2941j1783j0820r352p674o505n941n465m806m256m051l926
$$ y = [395082, 405213, 413545, 419535, 422547, 422502, 420337, 417459, 414807, 412514, 410174, 407075, 402365, 395475, 386679, 377151, 368303, 360870, 354535, 348530, 342720, 337964, 335104, 333749, 332597, 331045, 329928, 330356, 332298, 334889, 337713, 341032, 344812, 348316, 350941, 352866, 354581, 356233, 357875, 359949, 362887, 366371, 369570, 372178, 374767, 377988, 381901, 386299, 391235, 396778, 402558, 408044, 413254, 418800, 425370, 433682, 444923, 460514, 481002, 505561, 533072, 563462, 597648, 636378, 679563, 726424, 775508, 824305, 869438, 907799, 937582, 958276, 969977, 972921, 967384, 953718, 932451, 904467, 870932, 832984, 791596, 747848, 703150, 658993, 616616, 576973, 540841, 508790, 481113, 457917, 439059, 423815, 410874, 399091, 388271, 378919, 371245, 364740, 358799, 353334, 348528, 344272, 340221, 336295]
51333C36295l508k825k158j625j219j084j341j749j897j815j946k422k757k509
51319C07440j898j406j144r81j012j323j493j043l50l33j085j525q10N15J319
51304B94871J327J164J345J824K344K706K740K470K210K116J910J423J113J432
51290C20995J902J570L39q67j332j233r77o06j66%j40K3R71K276L069L063K650
51273C31537K167J502M25r43k066k323j601n63n5r6J49J189K440K883K195Q56
51257C37696n60j646k081j805j305j182j426j482j099o49n93r68j472j773j631
51242C18024j100o41o97j035r53k22N18N94J79m0K03N54O28M15M7l89p13o69l04
51223C14399p0l59r60j265r44l10N8j08n74r26r19n63J5P25J461K017K215K175
$$ y = [336295, 332787, 329962, 327804, 326179, 324960, 323876, 322535, 320786, 318889, 317074, 315128, 312706, 309949, 307440, 305542, 304136, 302992, 302011, 300999, 299676, 298183, 297140, 296790, 296457, 295372, 293847, 293037, 293552, 294871, 296198, 297362, 298707, 300531, 302875, 305581, 308321, 310791, 313001, 315117, 317027, 318450, 319563, 320995, 322897, 324467, 324806, 323939, 322607, 321374, 320397, 319791, 319625, 319625, 319485, 319508, 320479, 322755, 325824, 328887, 331537, 333704, 335206, 335631, 334688, 332622, 330299, 328698, 328135, 328080, 327984, 328133, 329322, 331762, 334645, 336840, 337696, 337136, 335490, 333409, 331604, 330299, 329117, 327691, 326209, 325110, 324461, 323868, 322900, 321428, 319655, 318024, 316924, 316283, 315586, 314551, 313598, 313376, 313894, 314488, 314667, 314627, 314830, 315384, 316012, 316427, 316474, 316085, 315372, 314703, 314399, 314329, 313970, 313010, 311745, 310801, 310491, 310549, 310441, 309867, 308941, 308022, 307459, 307474, 308199, 309660, 311677, 313892, 316067]
51205C16067K290K765L249L154K382J504J089J155J369J645K184K975L549L338
51191C48715K156L57j396k465k614k134j563j233j089r76r00r91j274j526j407
51176C31660p78R3O97P04J63o57j376j488o20Q75J917J767Q91L64N77J065J478
51159C37332K016K814L539L893L853L261J762l82k071k531k258k210k514k609
51145C43895k327j986j684j256q96r23j000m27P01J455J494J466J695J422O5j523
51129C40171k086j663j358j649j968j806j334p96j66M43P52Q98J288J682J282
51114C33690J66k95Q88K811L761L290K412J977J875J780J787K076K568L148L668
51099C65602L726L047K173K055K731L180K767J979J365N85p22j911k113j621j437
$$ y = [316067, 318357, 321122, 324371, 327525, 329907, 331411, 332500, 333655, 335024, 336669, 338853, 341828, 345377, 348715, 350871, 351228, 349832, 347367, 344753, 342619, 341056, 339823, 338734, 337758, 336858, 335867, 334593, 333067, 331660, 330882, 330975, 331672, 332376, 332539, 331882, 330506, 329018, 328398, 329273, 331190, 332957, 333848, 334212, 334789, 335854, 337332, 339348, 342162, 345701, 349594, 353447, 356708, 358470, 358088, 356017, 353486, 351228, 349018, 346504, 343895, 341568, 339582, 337898, 336642, 335746, 334823, 333823, 333396, 334097, 335552, 337046, 338512, 340207, 341629, 341694, 340171, 338085, 336422, 335064, 333415, 331447, 329641, 328307, 327511, 327345, 327788, 328540, 329438, 330726, 332408, 333690, 333856, 333561, 334449, 337260, 341021, 344311, 346723, 348700, 350575, 352355, 354142, 356218, 358786, 361934, 365602, 369328, 372375, 374548, 376603, 379334, 382514, 385281, 387260, 388625, 389210, 388488, 386577, 384464, 382843, 381406]
51084C81406j710j613p81Q6J83n87j793k803k841j594J02R39P76P55J605K687
51068C74817L252L609M306M953M883M481M759N892P186Q392R990J2050J3704J4124
51054D76398J3291J1527R042O428M980N796Q604J1849J3855J3862J2271J0231
51042E98134Q695P578N954L299K42k237l979n496o931p851q223q966j1016j4182
51028E55021j7227j8964j8932j7255j4385j1094q319o629n776m916l294q45J738
51015D29123L534M199M296M677N556O430O924P259P744Q188Q274Q197Q446R057
51001E21904R555R621R374Q995Q539Q217Q376Q960R417R325Q856Q470Q398Q594
50987F46601Q808Q653P900O811N900N289M788M554M991N795N865M763L504L253
$$ y = [381406, 379696, 378083, 377302, 377388, 377571, 376984, 375191, 372388, 369547, 367953, 368055, 368994, 369770, 370525, 372130, 374817, 378069, 381678, 385984, 390937, 395820, 400301, 405060, 410952, 418138, 426530, 436520, 448570, 462274, 476398, 489689, 501216, 510258, 516686, 521666, 527462, 536066, 547915, 561770, 575632, 587903, 598134, 606829, 614407, 620361, 623660, 623902, 621665, 617686, 612190, 605259, 597408, 589185, 580219, 569203, 555021, 537794, 518830, 499898, 482643, 468258, 457164, 448845, 442216, 436440, 431524, 428230, 427385, 429123, 432657, 436856, 441152, 445829, 451385, 457815, 464739, 471998, 479742, 487930, 496204, 504401, 512847, 521904, 531459, 541080, 550454, 559449, 567988, 576205, 584581, 593541, 602958, 612283, 621139, 629609, 638007, 646601, 655409, 664062, 671962, 678773, 684673, 689962, 694750, 699304, 704295, 710090, 715955, 720718, 724222, 727475]
50973G27475L775M136M503O182R822J4570J9196K3313K7144L0753L4042L7133
50961I42044M0269M3448M6399M8921N0997N2549N3170N2281M9758M6355M3057
50950A469248L9974L6289L1553K6541K2312J8970J6006J3436J1774J1072J0760
50939A707935J0422R893Q712O395L378P46j203l353o357r750j2827j5630j8519
50926A679842k1481k4515k8005l2065l5984l9047m1492m3880m5979m7062m7074
50915A273258m6617m5850m4253m1590l8370l5155l1998k8814k5781k3060k0489
50904H91281j7906j5567j3952j3170j2705j1856j0334q521p102o392o175o085
50892G61516n966n729n131m013k614j494j060j178j180l18J463L232L896L416
$$ y = [727475, 731250, 735386, 739889, 746071, 755893, 770463, 789659, 812972, 840116, 870869, 904911, 942044, 982313, 1025761, 1072160, 1121081, 1172078, 1224627, 1277797, 1330078, 1379836, 1426191, 1469248, 1509222, 1545511, 1577064, 1603605, 1625917, 1644887, 1660893, 1674329, 1686103, 1697175, 1707935, 1718357, 1728250, 1736962, 1743357, 1746735, 1747481, 1746278, 1742925, 1736568, 1726818, 1713991, 1698361, 1679842, 1658361, 1633846, 1605841, 1573776, 1537792, 1498745, 1457253, 1413373, 1367394, 1320332, 1273258, 1226641, 1180791, 1136538, 1094948, 1056578, 1021423, 989425, 960611, 934830, 911770, 891281, 873375, 857808, 843856, 830686, 817981, 806125, 795791, 787270, 780168, 773776, 767601, 761516, 755550, 749821, 744690, 740677, 738063, 736569, 735509, 734331, 733151, 732833, 734296, 737528, 741424, 744840]
50878G44840K811K861L290L510L547L800M316M857N463O325P394Q534R823J1235
50864H22606J2334J2912J3714J5759J9002K2322K4898K7000K9390L2515L6361
50853A068813M0634M4933M9233N4182O0444O7716P4929Q1440Q7477R3355R8935
50842A822091J04014J08614J12537J15160J15921J14588J10875J04442R5537Q5057
50832B888836P3602O1033M7374L3572K0838R688J97p305j2453j5354j6195j4573
50820C069260j0044l332L762R725J4005J6258J5717J1730M454n466j7598l1618
50808C076853m6636o1189p4180q5564r5838j04988j12271j16950j18792j17733
50798B142712j13581j06563r7840q8781p9809p0533o1002n1976m3849l6139k8507
$$ y = [744840, 747651, 750512, 753802, 757312, 760859, 764659, 768975, 773832, 779295, 785620, 793014, 801548, 811371, 822606, 834940, 847852, 861566, 877325, 896327, 918649, 943547, 970547, 999937, 1032452, 1068813, 1109447, 1154380, 1203613, 1257795, 1318239, 1385955, 1460884, 1542324, 1629801, 1723156, 1822091, 1926105, 2034719, 2147256, 2262416, 2378337, 2492925, 2603800, 2708242, 2803779, 2888836, 2962438, 3023471, 3070845, 3104417, 3125255, 3134943, 3135140, 3127835, 3115382, 3100028, 3083833, 3069260, 3059216, 3055884, 3059646, 3069371, 3083376, 3099634, 3115351, 3127081, 3131535, 3126069, 3108471, 3076853, 3030217, 2969028, 2894848, 2809284, 2713446, 2608458, 2496187, 2379237, 2260445, 2142712, 2029131, 1922568, 1824728, 1735947, 1656138, 1585605, 1524603, 1472627, 1428778, 1392639, 1364132]
50787A364132k1561j6069j1822q054m591j956n47k57p50j581k253k666l329m581
50773A284115n938o751p305q461j0340j2184j3527j4653j5838j6946j8058j9616
50761A134498k1519k2717k2373k0968j9690j9006j8301j6780j4271j1247q400
50750I39226o084m032j750P03K655L789M826O847J0068J3696J6949J9881K3190
50737A029964K7365L2158L6821M0866M4490M8123N1703N4740N7049N8912O0381
50726A542572O0916O0108N8396N6605N4936N2851M9861M6099M1988L7554L2185
50715B094071K5112J6227O417l026j1327j8337k3872k7406k8538k7325k3983j8752
50703A959261j2270n630L37N519R911J2980J3992J2669R077L302m321j3006k2100
$$ y = [1364132, 1342571, 1326502, 1314680, 1306626, 1302035, 1300079, 1299532, 1299275, 1298525, 1296944, 1294691, 1292025, 1288696, 1284115, 1278177, 1271426, 1264121, 1255660, 1245320, 1233136, 1219609, 1204956, 1189118, 1172172, 1154114, 1134498, 1112979, 1090262, 1067889, 1046921, 1027231, 1008225, 989924, 973144, 958873, 947626, 939226, 933142, 929110, 927360, 928063, 930718, 934507, 939333, 946180, 956248, 969944, 986893, 1006774, 1029964, 1057329, 1089487, 1126308, 1167174, 1211664, 1259787, 1311490, 1366230, 1423279, 1482191, 1542572, 1603488, 1663596, 1721992, 1778597, 1833533, 1886384, 1936245, 1982344, 2024332, 2061886, 2094071, 2119183, 2135410, 2141827, 2138801, 2127474, 2109137, 2085265, 2057859, 2029321, 2001996, 1978013, 1959261, 1946991, 1941361, 1941698, 1947217, 1957128, 1970108, 1984100, 1996769, 2005846, 2009148, 2004827, 1991821, 1969721]
50690A969721l1565m1238m9974n6262n9645o0813o0414n8482n4977n0146m4176
50679A402029l7167k9650k2463j5930r645l230L162R215J4797J9778K3999K7510
50667A382405L0357L2058L1951L0235K7956K5715K3124J9928J6888J4927J4028
50656A649572J3581J3407J3709J4381J5110J5943J7120J8444J9465K0220K1298
50645A832250K3154K5761K8890L2331L5880L9393M2781M5720M7660M8443M8642
50634B250905M8781M8467M6830M3677L9656L5482L1534K8103K5373K3015K0222
50623B642045J6076R466r40j5567l2392m7310n6628n9193n6123m9237m0040k9676
50611B280481j9155r501j689L725O893Q191P398L832k621j1142k0835l1343m2290
$$ y = [1969721, 1938156, 1896918, 1846944, 1790682, 1731037, 1670224, 1609810, 1551328, 1496351, 1446205, 1402029, 1364862, 1335212, 1312749, 1296819, 1287174, 1283944, 1287106, 1296321, 1311118, 1330896, 1354895, 1382405, 1412762, 1444820, 1476771, 1507006, 1534962, 1560677, 1583801, 1603729, 1620617, 1635544, 1649572, 1663153, 1676560, 1690269, 1704650, 1719760, 1735703, 1752823, 1771267, 1790732, 1810952, 1832250, 1855404, 1881165, 1910055, 1942386, 1978266, 2017659, 2060440, 2106160, 2153820, 2202263, 2250905, 2299686, 2348153, 2394983, 2438660, 2478316, 2513798, 2545332, 2573435, 2598808, 2621823, 2642045, 2658121, 2667587, 2666647, 2651080, 2618688, 2571378, 2514750, 2455557, 2399434, 2350197, 2310157, 2280481, 2261326, 2251825, 2250136, 2253861, 2260754, 2268945, 2276343, 2280175, 2277554, 2266412, 2245577, 2214234, 2171944]
50598B171944n2698o1528o8411p3407p6349p7055p5894p3520p0126o5523n9850
50587A417583n3744m7749m2052l6787l2095k7886k3868k0023j6649j3978j1938
50576A090814j0408r268q202o841n238l820k693j403L80K373M252O323Q996J1843
50562A077108J3788J4456J4766J5986J8416K1293K3766K5641K7263K9027L1143
50551A312653L3626L6278L8590L9804L9252L6904L3604L0553K8443K7185K6542
50540A683434K6844K8772L2497L7417M2825M8615N5123O2454P0196P7797Q5099
50529B251073R2450J00279J08513J16426J23199J28587J32884J36255J38316J38402
50519C466384J35918J30410J21644J09905R5910Q0049O2009M1449J8904m360k7228
$$ y = [2171944, 2119246, 2057718, 1989307, 1915900, 1839551, 1762496, 1686602, 1613082, 1542956, 1477433, 1417583, 1363839, 1316090, 1274038, 1237251, 1205156, 1177270, 1153402, 1133379, 1116730, 1102752, 1090814, 1080406, 1071138, 1062936, 1056095, 1050857, 1047037, 1044344, 1042941, 1043321, 1045694, 1049946, 1056269, 1065265, 1077108, 1090896, 1105352, 1120118, 1136104, 1154520, 1175813, 1199579, 1225220, 1252483, 1281510, 1312653, 1346279, 1382557, 1421147, 1460951, 1500203, 1537107, 1570711, 1601264, 1629707, 1656892, 1683434, 1710278, 1739050, 1771547, 1808964, 1851789, 1900404, 1955527, 2017981, 2088177, 2165974, 2251073, 2343523, 2443802, 2552315, 2668741, 2791940, 2920527, 3053411, 3189666, 3327982, 3466384, 3602302, 3732712, 3854356, 3964261, 4060171, 4140220, 4202229, 4243678, 4262582, 4258222, 4230994]
50508D230994m9080o9402q7475j02554j13971j21167j23877j22307j16712j06933
50498C217516r2814p5138n5596l5676j6008K984K0354L4881M5712N2286N3823
50487C152324M9295L8067K0434k276k8050n4722q0254j02594j19722j30485j35542
50476B606475j36893j36097j33220j27724j19868j10779j01427r2071q2702p3563
50466A492131o5150n7792n1335m5264l9302l3823k9379k5840k2460j8812j5180
50455A087794j1787q334m653j261J336L410N506P571R223J0550J1841J2737J2613
50442A136546J1712J1130J1387J1833J1575J0417Q597O330L936K055J274J769
50430A228561L327N385P074P827Q194R373J1712J4238J6010J7342J9174K1882
$$ y = [4230994, 4181914, 4112512, 4025037, 3922483, 3808512, 3687345, 3563468, 3441161, 3324449, 3217516, 3124702, 3049564, 2993968, 2958292, 2942284, 2945268, 2965622, 3000503, 3046215, 3098501, 3152324, 3201619, 3239686, 3260120, 3257844, 3229794, 3175072, 3094818, 2992224, 2872502, 2742017, 2606475, 2469582, 2333485, 2200265, 2072541, 1952673, 1841894, 1740467, 1648396, 1565694, 1492131, 1426981, 1369189, 1317854, 1272590, 1233288, 1199465, 1170086, 1144246, 1121786, 1102974, 1087794, 1076007, 1067673, 1063020, 1061759, 1063095, 1066505, 1072011, 1079582, 1088805, 1099355, 1111196, 1123933, 1136546, 1148258, 1159388, 1170775, 1182608, 1194183, 1204600, 1213197, 1219527, 1223463, 1225518, 1226792, 1228561, 1231888, 1237273, 1244347, 1252174, 1260368, 1269741, 1281453, 1295691, 1311701, 1329043, 1348217, 1370099]
50418A370099K5332K9592L4726M0075M4635M8281N1942N6426O1524O6360P0125
50407A899117P2301P2634P1289O8832O5821O2362N8098N2513M5281L6652K7388
50396B532288J8017Q076l433j6698l0526m3439n4934o5225p4002q0128q2619q1532
50384B025845p7621p1591o3921n5021m5132l4226k2447j0611J19R105J6335K1693
50372A692527K4620K4699K2050J6760Q501k650j5290k7355l7709m6523n4032n9651
50360A545947o2653o3162o2009n9891n7016n3398m9181m4812m0978l8145l5972
50349I78730l3558l0522k7441k4906k2593j9793j6561j3584j1047q395n328k357
50337G62645q9J569L168N071P303R689J1849J3385J4334J5156J6033J6565J6425
$$ y = [1370099, 1395431, 1425023, 1459749, 1499824, 1544459, 1592740, 1644682, 1701108, 1762632, 1828992, 1899117, 1971418, 2044052, 2115341, 2184173, 2249994, 2312356, 2370454, 2422967, 2468248, 2504900, 2532288, 2550305, 2558381, 2554948, 2538250, 2507724, 2464285, 2409351, 2344126, 2270124, 2189996, 2107377, 2025845, 1948224, 1876633, 1812712, 1757691, 1712559, 1678333, 1655886, 1645275, 1645394, 1654499, 1670834, 1692527, 1717147, 1741846, 1763896, 1780656, 1789157, 1786507, 1771217, 1743862, 1706153, 1659630, 1605598, 1545947, 1483294, 1420132, 1358123, 1298232, 1241216, 1187818, 1138637, 1093825, 1052847, 1014702, 978730, 945172, 914650, 887209, 862303, 839710, 819917, 803356, 789772, 778725, 770330, 765002, 762645, 762556, 764125, 767293, 772364, 779667, 789356, 801205, 814590, 828924, 844080, 860113, 876678, 893103]
50324H93103J5860J4960J2898Q784L167k042n350o849p454p712p759p741p722
50311H96143p416o594n514m558l668k637j660j004l14R96K669L688L641L279L353
50296H80404L643L684L835M801O404P614P890P750P880Q237Q290P807P140O968
50282I72347P880R978J2726J5304J7231J8339J8144J5623R940J401q340j6976
50270A073597k2600k4586k3814k1809j9486j6783j3542j0326q047o990o610o170
50258H92834n317m085k722j535o79nO43J078J049R12J540L318N554P293Q477R843
50242I18198J1787J3835J5432J6738J8294K0158K1801K2774K3106K2988K2384
50231A127495K1042J8812J5775J2289Q919O241M523L608L048K241N33k501o758
$$ y = [893103, 908963, 923923, 936821, 945605, 948772, 946730, 941380, 934531, 927077, 919365, 911606, 903865, 896143, 888727, 882133, 876619, 872061, 868393, 865756, 864096, 863092, 862778, 863774, 866443, 870131, 873772, 877051, 880404, 884047, 887731, 891566, 896367, 902771, 910385, 918275, 926025, 933905, 942142, 950432, 958239, 965379, 972347, 980227, 990205, 1002931, 1018235, 1035466, 1053805, 1071949, 1087572, 1097512, 1098913, 1090573, 1073597, 1050997, 1026411, 1002597, 980788, 961302, 944519, 930977, 920651, 912604, 905614, 899004, 892834, 887517, 883432, 880710, 879175, 878496, 878491, 879134, 880212, 881261, 882173, 883713, 887031, 892585, 899878, 908355, 918198, 929985, 943820, 959252, 975990, 994284, 1014442, 1036243, 1059017, 1082123, 1105111, 1127495, 1148537, 1167349, 1183124, 1195413, 1204332, 1210573, 1215096, 1218704, 1221752, 1223993, 1224526, 1222025, 1215267]
50218A215267j1746j7032k2397k7488l1662l4339l5329l4675l2391k8642k3953
50207I15613j9016j4303j0068o658m609m460o410r982j3949j6950j8425j8743
50195G72040j8363j7296j5588j3794j2518j1755j1188j0802j0623j0205r106p724
50183F23078o940o926p009o701o228n884n585n220m840m285l296k165j654j950
50169E54395k348k256j903j614j170l33N19J002J439K390L736M865N442N515N224
50154E74903N016N682P527R723J1226J1995J2545J2610J1333Q836O492N248M460
50141F87596K964P43j121j811j545r89l53P10K455M571O528Q310J0412J3025J5632
50126G47127J7830K0091K3211K7123L0964L4170L6937L9600M2173M4508M6388
$$ y = [1215267, 1203521, 1186489, 1164092, 1136604, 1104942, 1070603, 1035274, 1000599, 968208, 939566, 915613, 896597, 882294, 872226, 865568, 860959, 856499, 850089, 840107, 826158, 809208, 790783, 772040, 753677, 736381, 720793, 706999, 694481, 682726, 671538, 660736, 650113, 639908, 630802, 623078, 616138, 609212, 602203, 595502, 589274, 583390, 577805, 572585, 567745, 563460, 560164, 557999, 556345, 554395, 552047, 549791, 547888, 546274, 545104, 544771, 545290, 546292, 547731, 550121, 553857, 558722, 564164, 569679, 574903, 579919, 585601, 593128, 602851, 614077, 626072, 638617, 651227, 662560, 671396, 677888, 683136, 687596, 690560, 691303, 690182, 688371, 686826, 685837, 685484, 686194, 688649, 693220, 699748, 708058, 718470, 731495, 747127, 764957, 785048, 808259, 835382, 866346, 900516, 937453, 977053, 1019226, 1063734, 1110122]
50115A110122M7270M6625M4734M2614M0912L9353L7645L6283L5878L5946L4953
50104A552335L1496K5142J6283N668n804j7157k7403l5771m1976m6330m9362n1176
50092A355945n1424m9881m6884m2991l8505l3537k8384k3552j9405j5927j2838
50081I92617r967p627o514p008q448r537r546q930q599q835r235r377r204q854
50067H70936q531q540r032r655r750r171q618q867r678r886q702o624m816l735
50053G55331k864j712n16L30R86J924L176M341N089N328N033M444M249M976O260
50038G96375P225P549P535P262O421N158M218L909L530K363O83o77j317j339r00
50023H47995k94j21p62j804k551k928l400m085m556m494m109l794l705l744l641
$$ y = [1110122, 1157392, 1204017, 1248751, 1291365, 1332277, 1371630, 1409275, 1445558, 1481436, 1517382, 1552335, 1583831, 1608973, 1625256, 1630924, 1625120, 1607963, 1580560, 1544789, 1502813, 1456483, 1407121, 1355945, 1304521, 1254640, 1207756, 1164765, 1126260, 1092723, 1064339, 1040787, 1021382, 1005455, 992617, 982650, 975023, 968509, 961501, 953053, 943516, 933970, 925040, 916441, 907606, 898371, 888994, 879790, 870936, 862405, 853865, 844833, 835178, 825428, 816257, 807639, 798772, 789094, 779208, 770506, 763882, 759066, 755331, 752467, 750755, 750239, 750569, 751555, 753479, 756655, 760996, 766085, 771413, 776446, 780890, 785139, 790115, 796375, 803600, 811149, 818684, 825946, 832367, 837525, 841743, 845652, 849182, 851545, 852228, 851551, 850234, 848895, 847995, 847701, 847580, 846818, 845014, 842463, 839535, 836135, 832050, 827494, 823000, 818891, 815097, 811392, 807648, 804007]
50008H04007l067j864j48J932M315O752Q782J0465J2809J6735K1730K6194K9225
49995I37867L1303L2987L3779L2919L0753K8519K6844K5198K2930K0156J7235
49984A240490J3860R243L052m335j2535k1447l0586l8737m4745m8428n0198n0119
49972I65515m8023m4383m0258l6187l1902k7317k3141k0068j7933j6124j4328
49961F45851j2542j0848r587r163r193q434o224l389j095O45K434M142N235O104
49947E93936P624R566J0745J0892J0979J1383J1133R612P729O503N532L983K187
49934G01804R76jj949n094q442j1344j4122j6816j8381j7881j5826j3586j1817
49921E67521j0042p763n350l663l000k748k103r36K43R97J332J393J230J024J151
$$ y = [804007, 800940, 799076, 798928, 800860, 805175, 811927, 820709, 831174, 843983, 860718, 882448, 908642, 937867, 969170, 1002157, 1035936, 1068855, 1099608, 1128127, 1154971, 1180169, 1203099, 1223255, 1240490, 1254350, 1263593, 1266645, 1262310, 1249775, 1228328, 1197742, 1159005, 1114260, 1065832, 1015634, 965515, 917492, 873109, 832851, 796664, 764762, 737445, 714304, 694236, 676303, 660179, 645851, 633309, 622461, 612874, 603711, 594518, 586084, 579860, 576471, 575376, 576021, 578455, 582597, 587832, 593936, 601560, 611126, 621871, 632763, 643742, 655125, 666258, 675870, 683599, 690102, 695634, 699617, 701804, 702780, 702779, 700830, 695736, 687294, 675950, 661828, 645012, 626631, 608750, 592924, 579338, 567521, 557479, 549716, 544366, 540703, 537703, 534955, 532852, 531916, 532159, 533156, 534488, 535881, 537111, 538135, 539286]
49906E39286J755K547L304M260N592O870P531P725Q197R335J0802J2051J2778
49893F32033J2815J2028J0486Q462O233M024K068L46j521l771n927p272p886q600
49879F53518r857j1281j2507j3748j5040j5618j4724j2716j0665r078p659o125
49867E14500m599l171j764n35J86N56J233K395L352L500L242L465M400N656P033
49852E39449Q700J0470J1647J1827J1403J1012J0862J0785J0538R735P858M897
49840F59183J779l34j204j606k329l495m870o393q048r551j0489j0630r996q752
49826E83265p264o012n154m277k867j081L67J140J822L150M959O330O867P309
$$ y = [539286, 541041, 543588, 546892, 551152, 556744, 563614, 571145, 578870, 587067, 596402, 607204, 619255, 632033, 644848, 656876, 667362, 675824, 682057, 686081, 688149, 688495, 686974, 683203, 677276, 670004, 662118, 653518, 643661, 632380, 619873, 606125, 591085, 575467, 560743, 548027, 537362, 528284, 520625, 514500, 509901, 506730, 504966, 504431, 504617, 505173, 506406, 508801, 512153, 515653, 518895, 522360, 526760, 532416, 539449, 548149, 558619, 570266, 582093, 593496, 604508, 615370, 626155, 636693, 646428, 654286, 659183, 660962, 660628, 659424, 657818, 655489, 651994, 647124, 640731, 632683, 623132, 612643, 602013, 592017, 583265, 576001, 569989, 564835, 560558, 557691, 556610, 556977, 558117, 559939, 563089, 568048, 574378, 581245, 588554]
$$ [...]
##END NTUPLES=NMR SPECTRUM
##END=
