
##TITLE=UV1204_M3_1292-1211_7185246_wvG09XVc7x
##JCAMPDX= 6.0         $$ Bruker NMR JCAMP-DX V2.0
##DATA TYPE= NMR SPECTRUM
##DATA CLASS= NTUPLES
##ORIGIN= BRUKER
##OWNER= Administrator
$$ 1.72 TOPSPIN		Version 2.1
$$ 2012-12-05 23:19:22.578 -0500  Administrator@X
$$ Compression mode = diff/dup
##.OBSERVE FREQUENCY= 400.02188249412
##.OBSERVE NUCLEUS= ^1H
##.ACQUISITION MODE= SIMULTANEOUS (DQD)
##.ACQUISITION SCHEME= undefined
##.AVERAGES= 8
##.DIGITISER RES= 22
##SPECTROMETER/DATA SYSTEM= spect
##.PULSE SEQUENCE= zg30
##.SOLVENT NAME= COFFEE_meoh
##.SHIFT REFERENCE= INTERNAL, COFFEE_meoh, 1, 14.98509
##AUDIT TRAIL= $$ (NUMBER, WHEN, WHO, WHERE, PROCESS, VERSION, WHAT)
$$ ##TITLE= Audit trail, TOPSPIN		Version 2.1
$$ ##JCAMPDX= 5.01
$$ ##ORIGIN= Bruker BioSpin GmbH
$$ ##OWNER= Administrator
$$ $$ E:\/data/COFFEE/nmr/UV1204_M3_1292-1211_7185246_wvG09XVc7x/10/pdata/1/auditp.txt
$$ ##AUDIT TRAIL=  $$ (NUMBER, WHEN, WHO, WHERE, PROCESS, VERSION, WHAT)
(   1,<2012-12-05 23:19:14.375 -0500>,<Administrator>,<X>,<go>,<TOPSPIN 2.1>,
      <created by zg
	started at 2012-12-05 23:18:08.281 -0500,
	POWCHK enabled, PULCHK disabled,
       configuration hash MD5:
       86 BA 57 50 F2 9D 5C 9B 26 00 A9 28 5F 66 2E 89
       data hash MD5: 64K
       B2 A3 43 6C AB 73 30 B4 30 BB E9 83 E8 0A 6A E9>)
(   2,<2012-12-05 23:19:17.531 -0500>,<Administrator>,<X>,<proc1d>,<TOPSPIN 2.1>,
      <Start of raw data processing
       efp LB = 0 FT_mod = 6 PKNL = 1 PHC0 = 0 PHC1 = 0 SI = 32K 
       data hash MD5: 32K
       8A 7D AB C2 0E A9 39 1F 10 54 C9 29 23 A6 8F 74>)
(   3,<2012-12-05 23:19:18.000 -0500>,<Administrator>,<X>,<proc1d>,<TOPSPIN 2.1>,
      <pk PHC0 = 96.31165 PHC1 = 0 
       data hash MD5: 32K
       CD CC 86 9F 17 CD 1E 48 72 A9 D9 61 EC F3 58 9C>)
(   4,<2012-12-05 23:19:18.234 -0500>,<Administrator>,<X>,<proc1d>,<TOPSPIN 2.1>,
      <abs ABSG = 1 
       data hash MD5: 32K
       EE F9 2C F5 C4 91 12 39 56 16 6D 53 1D 88 3F CB>)
(   5,<2012-12-05 23:19:18.390 -0500>,<Administrator>,<X>,<proc1d>,<TOPSPIN 2.1>,
      <abs ABSG = 2 
       data hash MD5: 32K
       86 03 E8 1F E2 F9 B3 45 04 61 8C 24 A1 DF AD 40>)
(   6,<2012-12-05 23:19:18.531 -0500>,<Administrator>,<X>,<proc1d>,<TOPSPIN 2.1>,
      <abs ABSG = 3 
       data hash MD5: 32K
       99 43 63 27 DD 37 8A 2E D5 F7 85 6E F7 0C F4 64>)
(   7,<2012-12-05 23:19:18.687 -0500>,<Administrator>,<X>,<proc1d>,<TOPSPIN 2.1>,
      <abs ABSG = 4 
       data hash MD5: 32K
       04 95 5C E1 F0 4F FC 06 58 32 43 51 75 EF E9 5D>)
(   8,<2012-12-05 23:19:18.843 -0500>,<Administrator>,<X>,<proc1d>,<TOPSPIN 2.1>,
      <abs ABSG = 5 
       data hash MD5: 32K
       55 EB 67 EC A4 18 58 17 91 E8 6E 1E 6D BD 5A 20>)
$$ ##END=
$$ 
$$ $$ hash MD5
$$ $$ DE 19 F0 E3 AD D0 CA 4F 5B AE D1 BC 20 D5 2E 96
##$RELAX= 
##$RELAX= 
##$RELAX= 
##$RELAX= 
##$RELAX= 
##$RELAX= 
##$RELAX= 
$$ Bruker specific parameters
$$ --------------------------
##$DU= <E:\>
##$EXPNO= 10
$$ [...]
##$TP= (0..7)
150 150 150 150 150 150 150 150
##$TP07= 0
##$TPNAME0= <>
##$TPNAME1= <>
##$TPNAME2= <>
##$TPNAME3= <>
##$TPNAME4= <>
##$TPNAME5= <>
##$TPNAME6= <>
##$TPNAME7= <>
##$TPOAL= (0..7)
0.5 0.5 0.5 0.5 0.5 0.5 0.5 0.5
##$TPOFFS= (0..7)
0 0 0 0 0 0 0 0
##$TUNHIN= 0
##$TUNHOUT= 0
##$TUNXOUT= 0
##$USERA1= <user>
##$USERA2= <user>
##$USERA3= <user>
##$USERA4= <user>
##$USERA5= <user>
##$V9= 5
##$VALIST= <valist>
##$VCLIST= <CCCCCCCCCCCCCCC>
##$VD= 0
##$VDLIST= <DDDDDDDDDDDDDDD>
##$VPLIST= <PPPPPPPPPPPPPPP>
##$VTLIST= <TTTTTTTTTTTTTTT>
##$WBST= 1024
##$WBSW= 4
##$XGAIN= (0..3)
0 0 0 0
##$XL= 0
##$YL= 0
##$YMAX_a= 687782
##$YMIN_a= -585538
##$ZGOPTNS= <>
##$ZL1= 120
##$ZL2= 120
##$ZL3= 120
##$ZL4= 120
##$ABSF1= 14.98509
##$ABSF2= -5.573092
##$ABSG= 5
##$ABSL= 3
##$ALPHA= 0
##$AQORDER= 0
##$ASSFAC= 0
##$ASSFACI= 0
##$ASSFACX= 0
##$ASSWID= 0
##$AUNMP= <proc_prof1d_extract_pilot.lims>
##$AXLEFT= 0
##$AXNAME= <>
##$AXNUC= <1H>
##$AXRIGHT= 0
##$AXTYPE= 0
##$AXUNIT= <>
##$AZFE= 0.1
##$AZFW= 0.1
##$BCFW= 0
##$BC_mod= 0
##$BYTORDP= 0
##$COROFFS= 0
##$CY= 15
##$DATMOD= 1
##$DC= 0
##$DFILT= <>
##$DTYPP= 0
##$F1P= 0
##$F2P= 0
##$FCOR= 0.5
##$FTSIZE= 32768
##$FT_mod= 6
##$GAMMA= 0
##$GB= 0
##$INTBC= 1
##$INTSCL= 1
##$ISEN= 128
##$LB= 0
##$LEV0= 0
##$LPBIN= 0
##$MAXI= 10000
##$MC2= 0
##$MEAN= 0
##$ME_mod= 0
##$MI= 0
##$NCOEF= 0
##$NC_proc= -8
##$NLEV= 6
##$NOISF1= 0
##$NOISF2= 0
##$NSP= 0
##$NTH_PI= 0
##$NZP= 0
##$OFFSET= 14.98509
##$PC= 1
##$PHC0= 96.31165
##$PHC1= 0
##$PH_mod= 1
##$PKNL= yes
##$PPARMOD= 0
##$PPDIAG= 0
##$PPIPTYP= 0
##$PPMPNUM= 2147483647
##$PPRESOL= 1
##$PSCAL= 4
##$PSIGN= 0
##$PYNMP= <proc.py>
##$REVERSE= no
##$SF= 400.02
##$SI= 32768
##$SIGF1= 0
##$SIGF2= 0
##$SINO= 400
##$SIOLD= 32768
##$SPECTYP= <>
##$SREGLST= <1H.CDCl3>
##$SSB= 0
##$STSI= 32768
##$STSR= 0
##$SW_p= 8223.68421052631
##$SYMM= 0
##$S_DEV= 0
##$TDeff= 65536
##$TDoff= 0
##$TI= <>
##$TILT= no
##$TM1= 0
##$TM2= 0
##$TOPLEV= 0
##$USERP1= <user>
##$USERP2= <user>
##$USERP3= <user>
##$USERP4= <user>
##$USERP5= <user>
##$WDW= 1
##$XDIM= 32768
##$YMAX_p= 482426500
##$YMIN_p= -708525
##$CURPLOT= <Network HP LaserJet P1505>
##$CURPRIN= <$Network HP LaserJet P1505>
##$DFORMAT= <normdp>
##$LAYOUT= <+/1D_H.xwp>
##$LFORMAT= <normlp>
##$PFORMAT= <normpl>
##$SURQMSG= 1
$$ End of Bruker specific parameters
$$ ---------------------------------
##NTUPLES= NMR SPECTRUM
##VAR_NAME=  FREQUENCY,     SPECTRUM/REAL,   SPECTRUM/IMAG
##SYMBOL=    X,             R,               I
##VAR_TYPE=  INDEPENDENT,   DEPENDENT,       DEPENDENT
##VAR_FORM=  AFFN,          ASDF,            ASDF
##VAR_DIM=   32768,         32768,           32768
##UNITS=     HZ,            ARBITRARY UNITS, ARBITRARY UNITS
##FACTOR=    0.250966925370066, 1,           1
##FIRST=     8223.43324360094, 20353,        98336
##LAST=      0,             -201937,         -111574
##MIN=       0,             -708525,         0
##MAX=       8223.43324360094, 482426500,    0
$$ Real data points
##PAGE= N=1
##DATA TABLE= (X++(R..R)), XYDATA
$$ [...]
19541b45253A7138a1772l7396o9079d1032j02877j70146A69584h7952h475B9271
19529f3260j62769r2633a21660o0090l3882g4083p4968A10030h4310j13235C3936
19517f9884C9515A0276J55393m01d0460q8545k06655A50522c21426a03080C0886
19505B85724a993q8031K332r8325g9960c9258A8760c3163r9993B72705E1785K6739
19493G8524K25582a81016j6956H38b64901i8118h378m526D2608g838j95988N0010
19481a53816j62007P9176R001I0300C4007O0510a72267e2128l37557a3442q6114
19470i9556o9o2565A26288N7027H0979a56080d6403B0816c56755a38036I1155
19458c05612C11674a183j63119k2787A7878O6640j813J25254b72703P3580C36428
$$ y = [-245253, 17138, -11772, -49168, -118247, -41032, -143909, -314055, 169584, -87952, -8475, 29271, -63260, -226029, -318662, -121660, -181750, -215632, -74083, -149051, 110030, -84310, -197545, 33936, -69884, 39515, 10276, 165669, 165268, -40460, -129005, -335660, 150522, -321426, -103080, 30886, 285724, -1993, -90024, -87692, -186017, -79960, -39258, 18760, -33163, -133156, 272705, 51785, 78524, 304106, -181016, -197972, 838, -264901, -98118, -8378, -12904, 42608, -7838, -203826, -153816, -315823, -236647, -227646, 90300, 34007, 94517, -172267, -52128, -389685, -13442, -99556, -99625, -162190, 126288, 183315, 80979, -156080, -46403, 20816, -356755, -138036, 91155, -305612, 311674, -1183, -164302, -187089, 17878, 84518, 82705, 207959, -272703, -199123, 336428]
19446A5891f4611G416a00609L8397p8754j720L5183j14613g110B46150d859C972
19433F728P4124i1376k96466a27869l3259H0541j9020J76831I3686N8530a69342
19421d86728B30708f5476j25742d7217k29750A58962b45186Q1478M2487e9270
19410a55791G9231f5624B47266g9915B37200c4412r1780A1359i1756A28793h3447
19398b62120B79328b8005k14578I0918l0684K14792b75169I5540H08a07622A29515
19386H4005f6025A27331P411a26598G3383k1856a86050A55044A7813J85655K8552
19375B32020H5067b37648l3635c7995n1540j35014L055R9577A0066M54920c86849
19363e03869I9299b4292j15260G5248N0741b98781h4753c1418r6919c1567A65939
$$ y = [15891, -64611, 7416, -100609, -62212, -140966, -142686, -107503, -222116, -7110, 246150, -4859, 3972, 6728, 80852, -91376, -387842, -127869, -161128, 80541, 61521, 238352, 93686, 152216, -169342, -486728, 230708, -65476, -191218, -47217, -276967, 158962, -245186, -163708, -121221, -59270, -155791, 79231, -65624, 247266, -79915, 237200, -34412, -126192, 11359, -91756, 128793, -83447, -262120, 279328, -28005, -242583, 90918, 60234, 275026, -275169, 95540, 808, -107622, 129515, 84005, -66025, 127331, 134742, -126598, 73383, 51527, -186050, 155044, 17813, 203468, 232020, 85067, -237648, -271283, -37995, -89535, -224549, -221494, -121917, 10066, 464986, -386849, -503869, 99299, -24292, -139552, 75248, 125989, -298781, -84753, -31418, -128337, -31567, 165939]
19351C09793f7692F2695c42133G2699h5394j05158H7684B3647a55815k966K5986
19340a32795j709j16916A21570h0462p3766n1422C9829a4543m56956b06605k011
19329b08616a5689j7033Q082j11029K8997e2971I6696a81673e851A36267a96186
19317A84901q7799c35687a15014A85563E017O4254b79896a24091C2976Q7846c35595
19305i1120j58428c9739o7696A32663d29262K08454a03682A26698e0152r0692
19295a40844B05199I0317b72449b1876k25315a422j6496A66085a5513n38732F7210
19283a95703A97605d63287A55555a85041A92017q8044a12107j2934A49989b85198
19272B71812c67912C8493c95492G8444a68906k70723e3840b3821B2773c79141
$$ y = [309793, -67692, 62695, -342133, 72699, -85394, -190552, 87684, 23647, -155815, -158781, -132795, -134504, -251420, 121570, -80462, -154228, -205650, 39829, -14543, -471499, -206605, -208616, -15689, -32722, -24640, -135669, -106672, -52971, 96696, -181673, -5851, 136267, -196186, 184901, 97102, -335687, -115014, 185563, 5017, 69271, -279896, -124091, 32976, 120822, -335595, -91120, -249548, -39739, -107435, 132663, -429262, -220808, -103682, 126698, -50152, -140844, 205199, 90317, -272449, -21876, -247191, -1422, -17918, 166085, -15513, -554245, 67210, -195703, 197605, -463287, 155555, -185041, 192017, 103973, -112107, -125041, 149989, -285198, 271812, -367912, 38493, -395492, 78444, -168906, -439629, -53840, -23821, 22773, -379141]
19261E7009d08613h9606B41610c59359b4528j65557G7402b13425C7209J43220
19251A80429a21200a1982j25607K0675o3050B36824h8191O48A53926b31172L0959
19240b00213g9666j08567a3048o6566B24589i617m4208J6449j34347A95062a52670
19228A76409n7591k3898N101B0709b14008o1705F8102a50524B80685d22345J79841
19217b42504K8867d400k7929j74089B37171B6049b60706A67063B0815J70543a94201
19205G244e1524B94249A46456F1729j176j4856b37523A58764m3362b04108n0464
19194b54572A5778J8773a35336j38533P9028d9403l4485A457a33877p8677j90761
19183d03315a26056p0967A72936C2003a36324O7284A9346b71720a6483A16391
$$ y = [57009, -408613, -89606, 241610, -359359, -24528, -190085, 77402, -213425, 37209, 180429, -121200, -11982, -137589, -116914, -179964, 236824, -88191, -87543, 153926, -231172, -200213, -79666, -188233, -13048, -79614, 224589, -9617, -53825, -37376, -171723, 195062, -152670, 176409, 118818, 94920, 100021, 20709, -214008, -275713, 68102, -150524, 280685, -422345, -242504, -213637, -4400, -32329, -206418, 237171, 26049, -260706, 167063, 20815, 191358, -194201, 7244, -51524, 294249, 146456, 61729, 60553, 45697, -237523, 158764, 115402, -204108, -254572, 15778, 34551, -135336, -273869, -194841, -49403, -83888, 1457, -133877, -212554, -403315, -126056, -197023, 172936, 32003, -136324, -69040, 19346, -271720, -16483, 116391]
19172b30285A8604e6431j13411M5739j07292a5124k50331K2232c3397k52844g0688
19160G0388a52729G2772K32705A52118A3283b9042j20509A23755e1808j2822j13244
19149a77874A27996a08722p1797G6336J11247c87262H4290a53092O7143B61414
19138c4576A15417b40146C6301d5620j83512B85678A1011b74050e4517A61292
19127d24484A13209i1958b933D5810a75155A31064b11402a04438b9032q9198e5940
19115B088J415d71030C1395M8951a53778A90214d50682J61237J12225E4097a92101
19103c51674a04953A30250a48195j35519a00435B13070G4668R1104n7473f100
19092b49968f8346F2320A8379f8677j77813e1227l1857q4682g1672A87573C6680
$$ y = [-230285, 18604, -56431, -169842, -124103, -231395, -15124, -265455, -243223, -33397, -286241, -70688, 70388, -152729, 72772, 305477, 152118, 13283, -29042, -149551, 123755, -51808, -64630, -177874, 127996, -108722, -180519, 76336, 187583, -387262, 84290, -153092, -85949, 261414, -34576, 115417, -240146, 36301, -45620, -229132, 285678, 11011, -274050, -54517, 161292, -424484, 113209, -91958, -2933, 45810, -175155, 131064, -211402, -104438, -29032, -118230, -55940, 2088, 3503, -471030, 31395, 80346, -153778, 190214, -450682, -289445, -177220, 54097, -192101, -351674, -104953, 130250, -148195, -283714, -100435, 213070, 74668, 165772, 108299, -6100, -249968, -68346, 62320, 18379, -68677, -246490, -51227, -83084, -167766, -71672, 187573, 36680]
19080B62949b39041d1886j26752I5674a45965a4907j22458A3898J50235g2119
19069a51216b2202j6058l49378e2056o0643C8065i1434A80429e6644E4422c02888
19057I7017Q7906e7007A9439a54467A11496a51090e334A78007E423b95371M1011
19046b54360j8554a7555A30838b3687r3590l123B2465M5944K12843b24374A66028
19034B6466K44257a18904l4725j02701N1470p3870i904A24143l1605N22948c2964
19022F1091c18729A2682B147L78715n7686b0255i473C461g3399J4461j81889P3554
19010a67273c5029B66915A00923C6785q337a68383F7640b1646I9248b1482H7738
18998f9420F4694a00739M8022p3986p1841q3032C22541H3983L8776N7583b34698
$$ y = [262949, -239041, -41886, -168638, 95674, -145965, -14907, -137365, 13898, 164133, -72119, -151216, -22202, -38260, -387638, -52056, -112699, 38065, -91434, 180429, -56644, 54422, -302888, 97017, 184923, -57007, 19439, -154467, 111496, -151090, -5334, 178007, 5423, -295371, -254360, -272914, -17555, 130838, -23687, -117277, -120400, 22465, 68409, 281252, -224374, 166028, 26466, 270723, -118904, -153629, -256330, -204860, -278730, -9904, 124143, 92538, 615486, -32964, 61091, -318729, 12682, 2147, 380862, 323176, -20255, -9473, 3461, -73399, -58938, -240827, -167273, -35029, 266915, 100923, 36785, 28448, -168383, 67640, -21646, 99248, -21482, 87738, -69420, 64694, -100739, -52717, -126703, -198544, -281576, 322541, 83983, 122759, 180342, -234698]
18986C4091J60590D3774K6988a36279A80373B2000a22143j99356A66285G2150
18975A4361a08522k65818a32614B3670a86958B09678d147l833j19577I1813f282
18963a39528j88345c7492F5933J43154h0161l36k84316A0433a08334j05600P8897
18952a35037B2299e2539D2019b71491j74903A72973I397f0508E2779a17094e4611
18940i7709A57173b98479i8475m3461B73815A28268J72851a30872k70869J18574
18930b83167a33255A04376J11725I0380Q9263b82453e3999j15176m8780h2349
18919a45010j83795g8842A64811L9535C9182J55537J85953d3301B72046h0372
18908c73308B51014G9387J5150a47980O1082q3591M4085A96483J71843H3356a7636
$$ y = [34091, 194681, 43774, 70762, -136279, 180373, 22000, -122143, -321499, 166285, 72150, 14361, -108522, -374340, -132614, 23670, -186958, 209678, -4147, -7980, -127557, 91813, -6282, -139528, -327873, -37492, 65933, 209087, -80161, -80497, -364813, 10433, -108334, -213934, -135037, 22299, -52539, 42019, -271491, -446394, 172973, 9397, -60508, 52779, -117094, -54611, -97709, 157173, -298479, -98475, -141936, 273815, 128268, 301119, -130872, -401741, -283167, -133255, 104376, 216101, 90380, 179643, -282453, -53999, -169175, -217955, -82349, -145010, -328805, -78842, 164811, 204346, 39182, 194719, 380672, -43301, 272046, -80372, -373308, 251014, 79387, 94537, -147980, -86898, -170489, -126404, 196483, 368326, 83356, -17636]
18896b84317c5006C50436a84780O4540A56370c38258J12826a0121k2817k66471
18886b99409G3997J89282R9568G3346a17702n1170k26161A44867K1412G8626l3786
18875D4840i487j95296A151a34115j02194b6398j72118I4444b06720P724B92081
18863a02592j93214N4213d9856k78712N5410J08277K3577c4324j958l6939k41027
18852c14248A34818a26118c4166m6060A19963b34596e8990p2576j22411P7045
18842a76932a4294l1619k0635p124j75352a16298L8170L3541A10466a49674j79101
18831c28775J44926L3237G6553a55313A32036K97045F6384b30865B24829a92877
18820b04104A51094M7916A873J15834J3647r363b6832j93369C8803i4287D89559
$$ y = [-284317, -35006, 350436, -184780, -120240, 156370, -338258, -225432, -10121, -32938, -299409, 73997, 263279, 362847, 73346, -117702, -168872, -395033, 144867, 166279, 78626, 44840, -9487, -204783, 1151, -134115, -236309, -26398, -198516, 94444, -206720, -198996, 292081, -102592, -295806, -241593, -49856, -328568, -273158, -164881, -141304, -34324, -36282, -73221, -314248, 134818, -126118, -34166, -80226, 119963, -234596, -58990, -131566, -253977, -176932, -14294, -45913, -66548, -73672, -249024, -116298, -78128, -44587, 110466, -149674, -328775, -183849, -150612, 76553, -155313, 132036, 429081, 66384, -230865, 224829, -192877, -204104, 151094, 199010, 1873, 117707, 131354, 121991, -26832, -220201, 38803, -94287, 489559]
18808B15249b6397A78126F3605h8612C1332b65175B43704j15054c57687a03799
18797E6495b62189p4084a7438A05615P9653d9921j43479O50K4782b0331l42405
18786c62736e0691C06090b82821j9357B7417P9052I342L0695b48825l5122k5015
18775c08962B68341i5424b0744A60064O1689b83919Q1906g4909A53117a02110
18764a865j33548o2242E0831a39087j11919f7102k06821A77570K6808o1680f1911
18752g8075A07276R3018b06789i271B77780j23602a51859o6271L108E6323j9710
18741C6613c79066a59053o0624H1165h6960b8277n2260I4998J30635b32099e0058
18729b38465E9008i8200q619K1132A8101b78250d390C61719f9108A30570a06821
$$ y = [215249, -26397, 178126, 63605, -88612, 31332, -265175, 243704, 128650, -357687, -103799, 56495, -262189, -336273, -17438, 105615, 185268, -49921, -193400, -192750, -167968, -20331, -362736, -50691, 306090, -282821, -302178, 27417, 106469, 9342, 40037, -248825, -283947, -308962, 268341, -95424, -20744, 160064, 221753, -283919, -202013, -74909, 153117, -102110, -1865, -135413, -197655, 50831, -139087, -251006, -67102, -273923, 177570, 204378, 142698, -61911, -78075, 107276, 200294, -206789, -9271, 277780, 154178, -151859, -218130, -215022, 56323, 36613, -379066, -159053, -219677, 81165, -86960, -28277, -80537, 94998, 225633, -232099, -50058, -238465, 59008, -98200, -106819, -85687, 18101, -278250, -4390, 361719, -69108, 130570, -106821]
18717b5231k58847A25174p659c1104A39872h9555D1961d0874j05235d5058m69441
18706e14499i1647o4929j35282B3170h0067d74j72637A30807c54990h1289k74374
18695c55663M6267A87658a44168n4182F5697K81044F558b1549k5377D106K3808
18684B7914R307A3200E062O3483c21760K9431b3593A55375J20357i1279K0537
18673g0742k73297K5776E940e6792k39798A4883J87285F4748B0056h6738C08558
18661G4868J06730a29755a4282O694k00797A25452c05898A07896a47647P1653
18651g5994A61439H0484b55025i8364B38151a54977j2749k46261B83693j25403
18641A58290b91725B01140b31147P8788A24517m2916a89212k29932J85771J3080
$$ y = [-25231, -284078, 125174, 117515, -31104, 139872, -89555, 41961, -40874, -146109, -45058, -514499, -91647, -156576, -291858, 23170, -80067, -474, -173111, 130807, -354990, -81289, -355663, -309396, 187658, -144168, -198350, 65697, 346741, 6558, -21549, -46926, 4106, 27914, 37221, 13200, 5062, 68545, -321760, -292329, -23593, 155375, 275732, -91279, -70742, -344039, -318263, 5940, -56792, -296590, 14883, 202168, 64748, 20056, -86738, 308558, 74868, 181598, -129755, -14282, -7588, -208385, 125452, -305898, 107896, -147647, -75994, 161439, 80484, -255025, -98364, 238151, -154977, -167726, -413987, 283693, 158290, -291725, 201140, -231147, -152359, 124517, 81601, -189212, -419144, -233373, -220293]
18631b20293E6807J9928a81881f6067L2333j5581o9410D6653j9795a02819A24128
18619a9131j81932o3464r7571A55523D2424N7742b85808d6477A30830D6847a31055
18607B9177L8661c50832B5669c0615C7151a78902G5997a82359K1135o7739M4889
18596a84074L5157B09495o5944k5924a4821D6865b32581L3582Q0581C8890f2821
18584a45936b0345j78181N7542g735D7098b29960j32380A16283b31246A4943c5049
18572H3738a15049j72205N084A51667b21204r7111B64191d5516j24839A58189
18561d0935o71j1194A5781J0673b03823R3943l12917B14801b39173Q8105B2580
18549A16888B1857J36217a96950C7589K41270A8102L86676A79950a575A61655
$$ y = [-220293, 56807, 76735, -181881, -66067, -33734, -49315, -118725, 46653, 26858, -102819, 124128, -19131, -201063, -264527, -362098, 155523, 42424, 100166, -285808, -46477, 130830, 46847, -131055, 29177, 67838, -350832, 25669, -30615, 37151, -178902, 75997, -182359, -161224, -228963, -184074, -148917, 209495, 143551, 117627, -14821, 46865, -232581, -198999, -118418, 38890, -62821, -145936, -20345, -198526, -140984, -7735, 47098, -229960, -362340, 116283, -231246, 14943, -35049, 83738, -115049, -287254, -282170, 151667, -221204, -318315, 264191, -45516, -170355, 158189, -40935, -41606, -52800, 15781, 26454, -203823, -109880, -422797, 214801, -239173, -151068, 22580, 116888, 21857, 158074, -196950, 37589, 278859, 18102, 404778, 179950, -1575, 161655]
18538e7216r2340g706j35764K2068c3228k0920A18117b0844F4868e7579K1195
18527c6384G2963c00993c0271k31621J15097E8939b4433j46010A56117C8121f4698
18515D0323M5756b13675A3971a00009n998L1899k21132a39425C65994c67469B32907
18503b75947F9858b2499A42660d480A59288a99008j4320A81837b16970i873C6280
18491a16776L9900D6488L9524a77111Q0813b5642h656A36697a80207p0880o7543
18480c18630O2068d4600C27023A2912a01064A89543E1068a03010B8215J6614K1322
18469F6151K10069F5190h8109k523I8483a6789k31628d1540k37365g8616A5203
18457a88846F7084K810g5217B23776g0798B72115a5420j4271q3057j49639A30448
$$ y = [-57216, -149556, -7706, -143470, -121402, -33228, -54148, 118117, -20844, 64868, -57579, -36384, 72963, -300993, -30271, -261892, -146795, 58939, -24433, -170443, 156117, 38121, -64698, 40323, 86079, -213675, 13971, -100009, -106007, -74108, -295240, -139425, 365994, -367469, 232907, -275947, 69858, -22499, 142660, -4480, 159288, -199008, -213328, 181837, -216970, -9873, 36280, -116776, -76876, 46488, 86012, -177111, -96298, -25642, -8656, 136697, -180207, -251087, -318630, -256562, -44600, 327023, 12912, -101064, 189543, 51068, -103010, 28215, 44829, 66151, 276220, 65190, -88109, -90632, 98483, -16789, -248417, -41540, -278905, -78616, 15203, -188846, 67084, 69894, -75217, 223776, -70798, 272115, -15420, -29691, -112748, -262387, 130448]
18445I9664h4151A68324A3986f7267E9834L3371a84209r2953h5415j49014b5917
18433a62663C22320a65413A40396a01979A24718b73466a30866A40783m8237P6319
18423A68865d05686a7376k74I2272a03651l22812J11949J49736A21651J3424C6154
18411c10393Q5465N2651N3737I0190b27262A65683a59141P5279A68764h0180c4887
18399A33906d1378k93608a29865N3605L7781j71181k13068O7526a13358A06693
18388G963c99683J84217B60751j29212a67284B6160c8008j57825L1814A19385
18377a49074d7957j8950l2812D3281a61782l3605K9375b8045H1475c213l7686
18366d0899d530C96381g7036C28867o8141e8916j7288G7414b59541A33249D0926
$$ y = [99664, -84151, 168324, 13986, -67267, 59834, 93205, -184209, -277162, -85415, -234429, -25917, -162663, 322320, -165413, 140396, -101979, 124718, -273466, -130866, 140783, 92546, 168865, -405686, -17376, -17650, 92272, -103651, -426463, -314514, -164778, 121651, 135075, 36154, -310393, -224928, -172277, -118540, 90190, -227262, 165683, -159141, -83862, 168764, -80180, -34887, 133906, -41378, -334986, -129865, -76260, -38479, -209660, -422728, -355202, -113358, 106693, 7963, -399683, -215466, 260751, 131539, -167284, 26160, -38008, -195833, -164019, 119385, -149074, -47957, -66907, -99719, 43281, -161782, -195387, -166012, -28045, 81475, -3213, -40899, -4530, 396381, -77036, 328867, 260726, -58916, -76204, 77414, -259541, 133249, 40926]
18354A650b78026H5324a42837A72522b26880g2457C45613h158m01662h8256j13996
18343b02252A64941E9600f9804j48961O1346B3036a02482J4629o8310B53641d17390
18331B02119F5491a15428C66088a14658L3254K6580A69795Q3958b40810f4186
18320I391K39483F1427B517P0842b34996A46170f4663A37507g8955K3648l38977
18309c94284J91838J2001B61661d902D3258a17525J2857A23724l0801c15813J06224
18298b09589A42448e1252D21688e12007B6943b67706A47394d6894l5833G6133
18287a96573N1110H467J25718l4450a30647B3997a44176e8357D8746P0409l445
18276A15710a78695B28032D9187k1580b21395E8934J14608B7304J09409a0621
$$ y = [1650, -278026, 85324, -142837, 172522, -226880, -72457, 345613, -8158, -409820, -88256, -202252, 164941, 59600, -69804, -218765, -157419, 23036, -102482, -87853, -156163, 253641, -417390, 202119, 65491, -115428, 366088, -114658, -81404, -54824, 169795, 253753, -240810, -64186, 9391, 248874, 61427, 2517, 73359, -234996, 146170, -64663, 137507, -78955, -55307, -394284, -202446, -190445, 261661, -4902, 43258, -117525, -104668, 123724, 92923, -315813, -209589, 142448, -51252, 421688, -512007, 26943, -267706, 147394, -46894, -82727, 76133, -196573, -145463, 8467, 134185, 99735, -130647, 23997, -144176, -58357, 48746, 119155, 115710, -178695, 228032, 49187, 27607, -221395, 58934, 173542, 27304, 136713, -10621]
18265a98409f1327j56401B86743a03566o0571a5032p8170q5164j33989h5724q1284
18254a67008g4035B00503E7024b67694A59079a47866g2027C64258D174J37133
18244A41307a26883l3504A67490a02621j64632a10521j65276i9279B26596I3377
18233C20226a6766k2186j8913J8044a6281j28854l9640A59521a0158m9450j77852
18222b37460l01620a49024A05831m40A7447K2014h9693m5663K2654H1778B1134
18210C4075J58215d37675E5455a26245e4618l45322a23756q4719i8647D0971J1153
18199E2124Q9064b34173A89989b37254B43905c72628A68538a06410A4278c8275
18188h0150a3220m7091A5503b4880A22109F41a15864M973F6100c2419j13141B9982
$$ y = [-198409, -61327, -217728, 286743, -103566, -164137, -15032, -93202, -178366, -312355, -85724, -167008, -74035, 200503, 57024, -267694, 159079, -147866, -72027, 364258, 4174, 141307, -126883, -160387, 167490, -102621, -267253, -110521, -275797, -99279, 226596, 93377, 320226, -16766, -38952, -57865, -39821, -16281, -145135, -184775, 159521, -10158, -59608, -237460, -539080, -149024, 105831, 105391, 17447, 39461, -89693, -135356, -112702, 81778, 21134, 34075, 192290, -437675, 55455, -126245, -54618, -399940, -123756, -208475, -98647, 40971, 52124, 141188, -234173, 189989, -237254, 243905, -372628, 168538, -106410, 14278, -38275, -80150, -13220, -60311, 15503, -24880, 122109, 641, -115864, -110891, 66100, -32419, -145560, 29982]
18175A8066c21580a1627l9911N687G4156F293f8425k1842B7415d14297I2001g4454
18162F6557R5637e9500p4707n936B04579C3507A0603d7714l06338A69694a48224
18150D9432L30178b21000L4522A31240P6421Q6682A19628l2436b6723l2769j25877
18139a85369K4490K204c8539A85954a96071A0828b91327L2072i7980j79796J16918
18128a60858I9411f4738G2827j1431a67931B42322d4433A76288P8184A270a13684
18116A44570b68373J11570G0529f5208q1424D3901K2490a15751A98614l3339d20672
18104c75861B39235e1644A15532f4614k91859J62288M4074M4921k0795B77805
18093I0467c24819A05188b868o2554B43134d41058a0196k30365j6004b5875n9736
$$ y = [18066, -321580, -11627, -51538, -45851, 74156, 6293, -68425, -90267, 27415, -414297, 92001, -74454, 66557, 162194, -59500, -134207, -140143, 204579, 33507, 10603, -47714, -354052, 169694, -148224, 49432, 379610, -221000, -186478, 131240, 207661, 294343, 119628, 87192, -26723, -59492, -185369, -160879, -158675, -38539, 185954, -196071, 10828, -291327, -259255, -97980, -277776, -160858, 99411, -64738, 72827, 61396, -167931, 242322, -44433, 176288, 254472, 1270, -113684, 144570, -268373, -156803, 70529, -65208, -146632, 43901, 66391, -115751, 198614, 165275, -420672, -375861, 239235, -51644, 115532, -64614, -356473, -194185, -150111, -105190, -125985, 277805, 90467, -324819, 105188, -2868, -65422, 243134, -441058, -10196, -240561, -256565, -25875, -85611]
18082h5611F0582b1357R481k42453F354i8309A2474a92550K8725f6769B62311
18070a30476p5303D783a9973r3221B82900d72691d1064q0631c0595n1515n1938
18059a34048k83458A10151L5028E4694e0858K0348A03944b00919k1292g7033l620
18048h0653C1165J00487B0401a47155L6843B44080h5784J5087A4031i7018l2901
18037a29919B84325l9372c13714J20602B6601J38849M04309e7563A97527r2486
18027A05041j6235P534e8855B92174a39337A14703a10096j94756f1412C60014
18016a77274Q0761B7397Q9977k5434c3543A22467R0337k8686E2375d7630j78780
18005b26410E7810L6335b01356J0697e4932j60432A31296P998F9062N2726b3963
$$ y = [-85611, 60582, -21357, -11876, -254329, 6354, -98309, 12474, -192550, -163825, -66769, 262311, -130476, -205779, 4783, -19973, -113194, 282900, -472691, -41064, -121695, -30595, -82110, -134048, -417506, 110151, 145179, 54694, -50858, -30510, 103944, -200919, -222211, -77033, -80653, 31165, 131652, 20401, -147155, -110312, 244080, -85784, -70697, 14031, -97018, -129919, 284325, 244953, -313714, -193112, 26601, 165450, 569759, -57563, 197527, 105041, 88806, 96340, -58855, 292174, -139337, 114703, -110096, -304852, -61412, 360014, -177274, -96513, 27397, 117374, 91940, -33543, 122467, 212804, 184118, 52375, -47630, -226410, 57810, 94145, -201356, -190659, -54932, -215364, 131296, 139294, 69062, 121788, -23963]
17993A85013C1842J0324e31565d2910A74465A2046h1900B3128c17885B01795q0093
17982A21702c16954g6793L0671j4738E8472P5058C6682j896d20114i4316A67439
17970b1840p0495g595j15127b8210j32050A21512a10414C93562b83513b3537j34643
17959a58180A4415a02374a3167A55024o5782k043A6589a3134C4384b10612l7759
17948b48371A78574b38171B89508g0300A59841M7583b675k0718A89416i9396M8508
17937e0888o4211m738A53928m212a58725n0767B2573L09259a90534c8028k97912
17926c35940i1131I7601c8671J7371j20103j57317F4182f3863B6815O3693B4879
17914a28963r5811P3284k07922J78182a2296j83436F7740a05793j20796C44384
$$ y = [185013, 31842, 42166, -531565, -42910, 174465, 12046, -81900, 23128, -317885, 201795, 121702, -316954, -76793, -46122, -60860, 58472, 133530, 36682, 34786, -420114, -94316, 167439, -21840, -92335, -7595, -122722, -28210, -160260, 121512, -110414, 393562, -283513, -23537, -158180, 14415, -102374, -13167, 155024, 89242, 87199, 16589, -13134, 34384, -210612, -248371, 178574, -238171, 289508, -70300, 159841, 207424, -2675, -23393, 189416, -99396, -50888, -115099, -119837, 153928, 149716, -158725, -209492, 22573, 331832, -190534, -38028, -335940, -91131, 97601, -38671, -21300, -141403, -298720, 64182, -63863, 26815, 90508, 24879, -128963, -224774, -151490, -359412, -181230, -12296, -195732, 67740, -105793, -226589, 344384]
17903F6930a99611g5120k65214A17388b54701d9162A5900c0169A62046b67066
17892b55529a6216j44887B5312Q2107B7358a16868A03209K2277d1864B85275a530
17880F6951a31044b7664A27616O7439a33976A35245b2002j83003g6166F4827M9548
17869A14375k5766a18426A12723K87151a96400E9571d4969A37611a2382A27961
17858g6396B48567b82870D4707a31357I9231J14350a34346B1390b20254A8747
17847A09991l7110K45507d6172k62062l9400B72017d863k64604P6927d5535B16667
17835a98835F1293i9335A10634n2269J70181a15990e1618I015P8591b03604R2380
17824a11224F9728i8950A69828L0220M4848a48380f5825F5003K49392D5041a14930
$$ y = [66930, -199611, -75120, -340334, 117388, -254701, -49162, 15900, -30169, 162046, -267066, -255529, -16216, -161103, 25312, 107419, 27358, -116868, 103209, 125486, -41864, 285275, -1530, 66951, -131044, -27664, 127616, 195055, -133976, 135245, -22002, -205005, -76166, 64827, 114375, 88609, -118426, 112723, 399874, -196400, 59571, -44969, 137611, -12382, 127961, -76396, 248567, -282870, 44707, -131357, 99231, 213581, -134346, 21390, -220254, 18747, 109991, 72881, 318388, -46172, -308234, -347634, 272017, -4863, -269467, -192540, -45535, 216667, -198835, 61293, -99335, 110634, 58365, 228546, -115990, -51618, 9015, 87606, -203604, -111224, 69728, -98950, 169828, 200048, 244896, -148380, -65825, 65003, 314395, 45041, -114930]
17812e2843p549q747B66892G5670i7490J3714o0812H3230h5926B4731c3001B8799
17799A11765f9432k3289A307a9546B4323O11Q5823A4181O4888R5950a81860A02931
17786a64129O5232B60393a12457A80728D137a14379A8622J38782E2000b13615
17775B18290o3688B0872a19812D9021e4059M473A9853R3753N7546a39557B09803
17763I1558k9897J43482A02369K9506o1701a22752J7180o3143C1083a53441B53403
17751A971a37145A72249a66459k1079B63533a38711j3792D0008b8784j40167D0737
17739A50116n1426a90051l2162A43807R1768h9167B43969j12339b04287B87994
17728F890e22741e6529H2138a46021A00153b1971j00860e881B87923i1550e364
$$ y = [-52843, -60392, -69139, 266892, 75670, -97490, -83776, -144588, 83230, -85926, 24731, -33001, 28799, 111765, -69432, -92721, 1307, -19546, 24323, 24934, 110757, 14181, 79069, 175019, -181860, 102931, -164129, -98897, 260393, -112457, 180728, 4137, -114379, 18622, 157404, 52000, -213615, 218290, 154602, 20872, -119812, 49021, -54059, -49586, 19853, 113606, 171152, -139557, 209803, 91558, 61661, 205143, 102369, 131875, 70174, -122752, -105572, -168715, 31083, -153441, 253403, 1971, -137145, 172249, -166459, -187538, 263533, -138711, -152503, 40008, -28784, -168951, 40737, 150116, 98690, -190051, -222213, 143807, 235575, -89167, 243969, 131630, -204287, 287994, 6890, -522741, -56529, 82138, -146021, 100153, -21971, -122831, -5881, 287923, -91550, -5364]
17716A05238l0997a05714M4389j78704B14611a52188A21190e5616E2689c22154
17705d8020j31896j8836B8558i2264H4053J39279c2586m9549F1904a36083H5597
17693D9803c2320F9110a56779O5166A84687n2757a2998n9355A22298a992l28950
17682c30942c4991H831l075f7646C4944J17947a54676K1218A88788f1638q3863
17671a45501A14034A1952d0044B17837h6006j44727B17778j00019R3053c0304
17660B88569K420L5475r6253c904A28705L9794c02748i2517j67107B51288L6777
17649B88065I3251g5674a9502A7094N8151c8775D4050J61547M8495I2839P1966
17638A64805B7027i9861j49712b7711E0821l537L22652E9284a88577l3404B22319
$$ y = [105238, 74241, -105714, -61325, -240029, 214611, -152188, 121190, -55616, 52689, -322154, -48020, -179916, -198752, 28558, -92264, 84053, 223332, -32586, -82135, 61904, -136083, 85597, 49803, -32320, 69110, -156779, -91613, 184687, 131930, -12998, -72353, 122298, -1992, -330942, -34991, 8831, 5756, -67646, 34944, 152891, -154676, -133458, 188788, -61638, -145501, 114034, 11952, -40044, 217837, -86006, -230733, 217778, 117759, 210812, -30304, 288569, 290989, 326464, 230211, -3904, 128705, 168499, -302748, -92517, -259624, 251288, 288065, 93251, -75674, -19502, 17094, 75245, -38775, 44050, 205597, 254092, 92839, 164805, 27027, -99861, -249573, -27711, 50821, 47284, 369936, 59284, -188577, -221981, 222319]
17626A64605O673c7593n2398L4381C47934g3527k64335i94m2956j5068A06671
17614b89387C3122h4521A82125a77889A04201a42176k49592C0810p1c5282C3082
17602a9515H2874k0967h8012K1538c1589F45a63118j627B41603o464C2711g2957
17589E4256K29j4136A4599c58902F4692C833Q3623N6634E9128J75a76682M9787
17577a26895A11905N0842j3431d9062o9809J5575p1913A54520m8233a16874B78673
17565b3189j18517A49521H821K37728Q9297a8894A6542O3343a15088B58550n2418
17554B06132H6291P1031a91515B43813G647L74J80982f4194E85646a57111r9381
17543b56492B9523m066b18762a07586B74955a04774l2611n4113m7323B3499Q4368
$$ y = [164605, 171278, -37593, -89991, -55610, 347934, -73527, -337862, -994, -43950, -59018, 106671, -289387, 33122, -84521, 182125, -177889, 104201, -142176, -391768, 30810, 30739, -35282, 33082, -19515, 82874, 61907, -88012, -66474, -31589, 645, -163118, -164745, 241603, 235139, 32711, -72957, 54256, 54485, 40349, 14599, -358902, 64692, 3833, 87456, 144090, 59128, 59303, -176682, -126895, 111905, 162747, 149316, -49062, -118871, -103296, -175209, 154520, 106287, -116874, 278673, -23189, -141706, 149521, 8821, 246549, 335846, -18894, 16542, 79885, -115088, 258550, 206132, 86291, 157322, -191515, 243813, 7647, 8021, 189003, -64194, 585646, -157111, -256492, 29523, 25457, -218762, -107586, 274955, -104774, -137385, -191498, -238821, 23499, 107867]
17532A07867J11698J0294a00158B22791l796a60237A71511k6535A2687K25234
17522B37921n6144G5592P5446Q9221l5260d47025A84269O1166d4462J0833D6827
17510a46854C3877a17219E4903J32562n2474K49824f6844q4291C10521h4298b399
17498C01724p354H4057K52698A41311a13753A0580K04877J456L0112J85669A44078
17486B53915b06922A00969J51958q7582n2769a7896A08630K27546m4823g0736
17475C12416a21883A49140C5584L08312A30751R2176I6106K82409k3007I2496
17464c2734E6878N338K02265n6236Q3858D4477A6073h6702E6076M37779k33780
17453B60075K43776G6583M55080A58779i9421B94577N1327o7107J98792j33738
$$ y = [107867, 219565, 229859, -100158, 222791, 218995, -160237, 171511, 144976, 12687, 237921, 181777, 75592, 151038, 240259, 204999, -447025, 184269, 245435, -44462, -33629, 46827, -146854, 33877, -117219, 54903, 187465, 134991, 384815, -66844, -151135, 310521, -84298, -2399, 301724, 294370, 84057, 336755, 141311, -113753, 10580, 215457, 216913, 247025, 432694, 144078, 253915, -206922, 100969, 252927, 165345, 112576, -17896, 108630, 336176, 291353, -70736, 312416, -121883, 149140, 35584, 343896, 130751, 222927, 96106, 378515, 355508, 92496, -32734, 56878, 62216, 264481, 208245, 292103, 44477, 16073, -86702, 56076, 493855, 260075, 503851, 76583, 531663, 158779, -99421, 294577, 345904, 278797, 477589, 343851]
17443C43851H1783J90216q7279a00439E31151B6271R055J33202K6729f5409C18287
17431A04003N42137B79232J0169j41930E8933J70297O1714M0607K22793A72880
17420A06786E1786a12843D96311j39270A54272C2462R4304J10113J16813H2979
17409a1768E13105A79572R0062E7919J51373j03041j5193Q7255b77759c4291B93983
17397B25520J25818F2740N3016R1894r3454N400d4190e571n241C18199A31636
17385A01967Q0261b19432A14594n7158L65590h6268G6617M60867A62561c09434
17374b56146A38777B7125J48541P5066j09923k8264K10375j43204G9989a4806
17363A1735K46664p3417b59396a18202E11258E0268a3484B14733a00249c6501
$$ y = [343851, 81783, 271999, 184720, -100439, 531151, 26271, 35326, 168528, 195257, -65409, 318287, 104003, 646140, 279232, 289401, 147471, 58933, 229230, 290944, 331551, 554344, 172880, 106786, 51786, -112843, 496311, 357041, 154272, 32462, 126766, 236879, 353692, 82979, -11768, 513105, 179572, 269634, 57919, 209292, 106251, 91058, 178313, -277759, -34291, 293983, 225520, 351338, 62740, 115756, 207650, 114196, 119596, -44190, -5571, -10812, 318199, 131636, 101967, 182228, -219432, 114594, 57436, 423026, -86268, 76617, 537484, 162561, -309434, -256146, 138777, 27125, 175666, 250732, 140809, 112545, 322920, 179716, 79989, -14806, 11735, 258399, 184982, -259396, -118202, 511258, 50268, -13484, 214733, -100249, -36501]
17352a40521e3462n3596r6079A50548M78584B05823c09351B26295J05104G1092
17341D20141F0986K84313A25090e282A01295a14616L483B42609A11286K29703
17331C40989f2073B22589D6278M07652A57926j0920P5217A7647K24988J67321
17321D09956j88530K6101q4518h872A48721a09732B54435J61212H2402J17187
17311A99589P6523J85371B08698N9736C3533L752K77120f2150m1972C97443A26649
17299B57104k6327H0383k9905J28795l8743G0254J25238p4347n8532K6192O0262
17288A49067i8571k7839A28214K48614a07310c9069C27948a42422C17838J19258
17278D37096B08373r3566K15226I2690P505J88190c8483A51075L7927D3301J28408
$$ y = [-140521, -53462, -107058, -203137, 150548, 629132, 205823, -309351, 226295, 331399, 71092, 420141, 60986, 345299, 125090, -5282, 101295, -114616, -111133, 242609, 111286, 340989, -62073, 222589, 46278, 453930, 157926, 147006, 222223, 17647, 242635, 409956, 221426, 247527, 163009, -8872, 148721, -109732, 254435, 415647, 82402, 199589, 276112, 461483, 208698, 268434, 33533, 37285, 314405, -62150, -104122, 397443, 126649, 257104, 230777, 80383, 50478, 179273, 140530, 70254, 195492, 121145, 62613, 88805, 149067, -98571, -126410, 128214, 376828, -107310, -39069, 327948, -142422, 317838, 437096, 208373, 114807, 330033, 92690, 100195, 288385, -38483, 151075, 189002, 43301, 171709]
17267A71709m4612O9985a49923O6496A37605J56974L79243D1781J94366q5358
17257A50789K2739M58984E8461J51288H7850d2200D5409B24K59673l0232q2949
17246A46716J94122H3433K3968B580J11461K30085A6093J49807J13199j33095
17236A46004E5517d1640B63453a35770E75975b42109B41910K29951A1304K70919
17226B82223L18141B84403j11234M998p9083l2771K83347j1201R698m6197q6420
17215B15540d006D41436A03599M7920Q0542j10411m7388M5950J87589A32650K4461
17204A57111G6304N940R5876m9368L50270N1633P1909j32115I2109J96391j6675
17193B71825l6563b40764A27810J11545B9286a44100B11959L3801H5107c5940
$$ y = [171709, 127097, 197082, -149923, -83427, 137605, 294579, 673822, 41781, 236147, 150789, 173528, 632512, 58461, 209749, 87850, -42200, 45409, 224, 259897, 229665, 146716, 340838, 83433, 107401, 2580, 114041, 344126, 16093, 165900, 279099, 146004, 55517, -41640, 263453, -135770, 575975, -242109, 241910, 471861, 11304, 282223, 600364, 284403, 173169, 178167, 99084, 66313, 349660, 338459, 348157, 301960, 215540, -4006, 441436, 103599, 151519, 232061, 121650, 74262, 120212, 307801, 132650, 157111, 76304, 82244, 178120, 128752, 479022, 530655, 602564, 470449, 92109, 288500, 271825, 235262, -240764, 127810, 239355, 29286, -144100, 211959, 245760, 85107, -35940]
17182b3930C62179j76060j2129G287M69669j31417E2303O5912J39404M07597l04596
17171C60620J4887K14805k46901K04152k51508n4504L17665E6035K58113A12710
17160B1134K80231J24590A12966L77694j40475j38680o7206D9448M99661b81583
17149A11507N11835B91974J40422k5214j3131J74471m0622o2985j99662I0128
17138B37631E5678L41647L35843B23140R4146l0628J54912P253j44221c7952C60482
17126I0576N38611B80102J45371o1002j37412k8688r6025M16295B56355K34781
17116D91136k09233J6695m5108J09531k5230K11514E368M27694j43577L23482
17106F12967j79718j8000j77980R1779L27102A35217K85233p6108l3281j17977
$$ y = [-23930, 362179, 186119, 173990, 7287, 476956, 345539, 52303, 118215, 257619, 665216, 360620, 375507, 590312, 343411, 547563, 296055, 241551, 559216, 56035, 314148, 112710, 21134, 301365, 425955, 112966, 490660, 350185, 211505, 144299, 49448, 549109, -281583, 111507, 623342, 291974, 432396, 407182, 394051, 568522, 527900, 464915, 265253, 90128, 237631, 55678, 397325, 733168, 223140, 317286, 286658, 441570, 448823, 304602, -37952, 360482, 90576, 629187, 280102, 425473, 364471, 227059, 198371, 102346, 518641, 256355, 491136, 281903, 298598, 253490, 363021, 337791, 549305, 5368, 433062, 289485, 612967, 433249, 415249, 237269, 329048, 656150, 135217, 420450, 344342, 311061, 193084]
17096A93084L96075b7250C66070J19412j32258J05037m0041O6100k6522N6925
17086E14723j65565j30638M47693l06723J7914Q8751L66199D04477R4540m7599
17076D51418A64206L26258J73427j87514p5727L19745A67044L93613k41875k6056
17066B92726J18671r5866J12122k01750L28597K96818j72909o0957B40438M26677
17056F67115q9266k61954m4120M30228j77504J60769A86887B8173N19908J19766
17046F67847J27787A12571M09783j28702R1298J64873B83828Q7465J59222r9435
17036D31080K25490j03553c291F38893M5431k18222j8367J04460j14757Q8683
17026E26121k7255O3194j43699L56160C62550R4448N88663D31014K92650k77606
$$ y = [193084, 589159, -27250, 366070, 485482, 353224, 458261, 418220, 484320, 457798, 514723, 349158, 218520, 666213, 359490, 377404, 466155, 832354, 404477, 499017, 451418, 164206, 490464, 663891, 476377, 400650, 720395, 167044, 560657, 318782, 292726, 411397, 315531, 427653, 225903, 554500, 851318, 678409, 617452, 240438, 667115, 577849, 315895, 271775, 702003, 524499, 685268, 186887, 28173, 548081, 667847, 795634, 112571, 522354, 393652, 484950, 649823, 283828, 371293, 530515, 431080, 656570, 553017, -3291, 638893, 684324, 466102, 447735, 552195, 437438, 526121, 498866, 562060, 418361, 774521, 362550, 456998, 1045661, 431014, 723664, 446058]
17016D46058L96249m00094L15907B31259K26805K95159J37397l83626L71293o2524
17006H15763J14609j577l28429r4357J06119K90783l94514O4741k4831M23736
16996I72043q3760O0881k80409k0340K53176k13486J17652j80767j60566K30988
16986F95412l12964L18251J91381R8651j66182Q4150D48127N40314j03796J56446
16976A041091l70370J53725K30254k23858J05523j03314o5366j23060k70498N94130
16966I68257k53810J21154j03514L10282k43396K26085l0764K1346j96992M10842
16956A229490l78933q2961K64570j90021P1905J20594O9045Q5254l51101J15741
16946I53583M7724O2525J04147n4007J37758k29565K40471J15729j83484P6017
$$ y = [446058, 842307, 442213, 758120, 231259, 458064, 753223, 890620, 506994, 878287, 815763, 930372, 928795, 600366, 506009, 612128, 902911, 508397, 573138, 548307, 972043, 888283, 949164, 668755, 648415, 901591, 688105, 805757, 624990, 464424, 695412, 382448, 700699, 892080, 990731, 824549, 908699, 448127, 988441, 884645, 1041091, 670721, 824446, 1054700, 830842, 936365, 833051, 767685, 644625, 374127, 968257, 714447, 835601, 732087, 1042369, 798973, 1025058, 994294, 1015640, 818648, 1229490, 850557, 767596, 1032166, 842145, 914050, 1034644, 1103689, 1188943, 837842, 953583, 1001307, 1063832, 1167979, 1113972, 1251730, 1022165, 1262636, 1378365, 1194881, 1270898]
16936A270898k32370l6311K10466J00167K9367l00907R8089K70893k25969J14686
16926A299009K54618l11406J75990j40314J86745k95166Q9963j82315L61777P8747
16916A517648l83435K40024q3404K6705J43111J16631J24861j05310r168L56909
16906A944572l17429O8210j51691L23437k28268K98314l06510j92665M12099j02478
16896A747591k46697J32136L44528j35754K07605k90658R914J13791P7207j9385
16886A940278j22663K0708L72133k07311J1030j67716L25351K680j93369J61939
16876B143060K03404k03398O002L19790k99184J95092o0055O014o0846L68930
16866B618809L14400l44711J02785R2492n6110M55132n03316M84788n41377O58934
$$ y = [1270898, 1038528, 1002217, 1212683, 1312850, 1342217, 1041310, 1139399, 1410292, 1184323, 1299009, 1553627, 1242221, 1418211, 1277897, 1464642, 1169476, 1259439, 1077124, 1438901, 1517648, 1134213, 1374237, 1290833, 1317538, 1460649, 1577280, 1702141, 1596831, 1587663, 1944572, 1627143, 1695353, 1543662, 1867099, 1638831, 1937145, 1630635, 1437970, 1850069, 1747591, 1500894, 1633030, 1977558, 1841804, 2049409, 1758751, 1768665, 1882456, 1959663, 1940278, 1817615, 1838323, 2210456, 2003145, 2014175, 1846459, 2171810, 2174490, 1981121, 2143060, 2346464, 2143066, 2149068, 2468858, 2169674, 2364766, 2304711, 2310725, 2249879, 2618809, 2933209, 2588498, 2691283, 2783775, 2727665, 3182797, 2679481, 3164269, 2622892, 3281826]
16856C281826j18572K22041j70792r6968r4368K76645Q8086p9741k24733M90077
16846C573501J18716r585j62730L41492j32690J0106q7517L01403k32763N111
16836C725044L63834k39825M08222J25872K0592N9520L40386r7844M10907l9361
16826E077347l15782Q7767K24869r6326Q6689Q0536j18905J85156J51162L07029
16816E669542q1236L94054L15206J5342l75201M60252L88591l56315L02968K34883
16806F968086J18460J12022R6383J29448N05103Q6926j74093J57091Q45193l34014
16796H510605O47187J78065l2984M61440O6160L35160M39947m7581N57045N02061
16786A1617105q5151O40905J03552N24536P96892n9746P30319M2089M58390K18422
$$ y = [3281826, 3163254, 3385295, 3214503, 3117535, 3023167, 3299812, 3387898, 3308157, 3083424, 3573501, 3692217, 3682632, 3519902, 3861394, 3728704, 3738810, 3651293, 3952696, 3719933, 3725044, 4088878, 3849053, 4257275, 4383147, 4403739, 4463259, 4803645, 4705801, 5116708, 5077347, 4761565, 4849332, 5074201, 4977875, 5064564, 5145100, 5026195, 5211351, 5362513, 5669542, 5588306, 5982360, 6297566, 6312908, 5937707, 6397959, 6786550, 6430235, 6733203, 6968086, 7086546, 7198568, 7294951, 7424399, 7929502, 8016428, 7842335, 7999426, 8844619, 8510605, 9157792, 9335857, 9302873, 9764313, 9830473, 10165633, 10605580, 10557999, 11115044, 11617105, 11531954, 12172859, 12276411, 12800947, 13597839, 13538093, 14268412, 14310501, 14768891, 14987313]
16776A4987313M90161J172565j2111N39934O43339O96966Q40721N23930Q14557
16767B0697375J055686N16389J007512Q71989J171111Q47198J138379Q39113J391667
16758B9536419J331065J480050J502519J753845J186980J574753K112771J916664
16750D2395066K176481K471937K468367K179036L101366K718252L433125L635800
16742F4579430L594954M122359M125818M574725M771105N419663N496692O132940
16734A02817686O557873O506738P438496P348848P866301Q263650Q014241Q436209
16726A63250042Q252331Q043370P608424O304178O292682M964722L848035K264671
16718B10828455Q40263q60913j879024l463589m792936n764054o551545p711536
$$ y = [14987313, 15477474, 16650039, 16637928, 17177862, 17821201, 18518167, 19358888, 19882818, 20697375, 21753061, 22269450, 23276962, 24148951, 25320062, 26167260, 27305639, 28144752, 29536419, 30867484, 32347534, 33850053, 35603898, 36790878, 38365631, 40478402, 42395066, 44571547, 47043484, 49511851, 51690887, 54792253, 57510505, 60943630, 64579430, 68174384, 72296743, 76422561, 80997286, 85768391, 91188054, 96684746, 102817686, 109375559, 115882297, 123320793, 130669641, 138535942, 146799592, 154813833, 163250042, 171502373, 179545743, 187154167, 193458345, 199751027, 204715749, 208563784, 210828455, 211668718, 210807805, 208928781, 205465192, 200672256, 194908202, 188356657, 180645121]
16710A80645121p805312q092238q491665q555304q111484p938654p590581p515624
16702A16544259p002229o516746n995882o085491n424831m599798m692007m849028
16694G1378247l756626m003152l409857l257867k964819l232604k406050k554516
16686D5792756k071094k361457k052009j749643j851790j261039j879586j300800
16678C1265338j184015j505190j108243q91780j003128j271189r90759j063449
16670B2247585p15108o89159p21498o96026p88891o32843l53544q88552o70962
16661A6091002l39065q56764k59593l54722o28576j81084o90201k27507l60133
16652A2193357l42365k93137m07238k94717l61399l28595r8039k76194n02364
$$ y = [180645121, 172839809, 164747571, 156255906, 147700602, 139589118, 131650464, 124059883, 116544259, 109542030, 103025284, 97029402, 90943911, 85519080, 80919282, 76227275, 71378247, 67621621, 63618469, 60208612, 56950745, 53985926, 50753322, 48347272, 45792756, 43721662, 41360205, 39308196, 37558553, 35706763, 34445724, 32566138, 31265338, 30081323, 28576133, 27467890, 26576110, 25572982, 24301793, 23311034, 22247585, 21532477, 20843318, 20121820, 19425794, 18636903, 18004060, 17650516, 16761964, 16091002, 15751937, 14895173, 14635580, 14280858, 13652282, 13471198, 12780997, 12553490, 12193357, 11850992, 11557855, 11150617, 10855900, 10494501, 10165906, 10067867, 9791673, 9289309]
16643I289309l52976j27517l49081m07717K26413j66509l10774P4825l21875j00464
16633G453634q5623k02880m09763P3480l65778l54040K67875j16800l60870j4544
16623E884691K6132j61702j22401m74641M12400o15533K02707j03095m52216K66930
16613D863272J65055n02342j81689L96245j04574o4727o83254Q8469M3219j3815
16603D005859j05883J68607n73026L06000k96534p7278j58788K87678j2353P4776
16593C619058j81963m53355J77382L10145o57658M7110j8297J43753l63390L59612
16583B982397l97436l3467L8788J47574j65473l06965M6816K08016n49062J57842
16573B129030K90418k52493o3398K17496k77959j14409J63101l39837K97713j67486
$$ y = [9289309, 8936333, 8808816, 8459735, 8052018, 8278431, 8111922, 7801148, 7875973, 7554098, 7453634, 7368011, 7165131, 6755368, 6828848, 6463070, 6109030, 6376905, 6260105, 5899235, 5884691, 5910823, 5749121, 5626720, 5152079, 5564479, 4948946, 5151653, 5048558, 4596342, 4863272, 5028327, 4525985, 4344296, 4740541, 4635967, 4571240, 3887986, 3976455, 4019674, 4005859, 3899976, 4068583, 3495557, 3801557, 3505023, 3427745, 3268957, 3556635, 3544282, 3619058, 3437095, 2983740, 3161122, 3471267, 2813609, 2860719, 2842422, 2986175, 2622785, 2982397, 2584961, 2551494, 2590282, 2737856, 2572383, 2265418, 2312234, 2520250, 1971188, 2129030, 2419448, 2166955, 2103557, 2321053, 2043094, 1928685, 2091786, 1751949, 2049662, 1882176]
16563A882176M19002k42396m7877m47681M13388O4133l3477j48240q6663P0466
16553A842831j27445j20738N8236J69836j06943j22930o0528P7001K9665K07140
16543A846125k62806q9791j00559J74059M7088n43587J86805K84527J50239k04629
16533A487471j85508j36120K09539k35182r9782K49565J12324j49277k1132M90758
16523A722656m93849o0411K72130k69212k12661J30587j187J01591j11235M12230
16513A490639m86106J28593k56499L87398J68226m51554L50549l14483p0749K05759
16503A151773j10546L7487j16001k043K25261l73379K82084j13393J05339j69913
16493I16669k12709N511K69810P2881C48133K52502M52433k95766p4602J64065
$$ y = [1882176, 2301178, 2058782, 2010905, 1563224, 1976612, 2040745, 2007268, 1859028, 1772365, 1842831, 1715386, 1594648, 1652884, 1822720, 1715777, 1592847, 1532319, 1609320, 1638985, 1846125, 1583319, 1493528, 1392969, 1567028, 1614116, 1070529, 1257334, 1541861, 1692100, 1487471, 1301963, 1165843, 1375382, 1140200, 1040418, 1289983, 1402307, 1253030, 1231898, 1722656, 1228807, 1168396, 1440526, 1171314, 958653, 1089240, 1088053, 1189644, 1078409, 1490639, 1004533, 1133126, 876627, 1264025, 1432251, 980697, 1331246, 1016763, 946014, 1151773, 1041227, 1078714, 962713, 960670, 1185931, 812552, 1094636, 981243, 1086582, 916669, 703960, 709471, 979281, 1052162, 348133, 600635, 1053068, 757302, 682700, 846765]
16483H46765K62392l14107l3214q0678L15709m04285J5683J4203K35262Q8930
16473I46660j39837L97417j63657l28344P0684k19639J04652K44971l25401K09653
16463G97159L4036j35149j1020k51241j8205J48370J26591L78860C20012J17054
16453D37066K00188P174R2348J10955k09245K3291J86877k64903p5744o8542j4252
16442D25213K40409p1612l1527J08476k57818J39591B67281L48912Q4360m1832
16432F58721j55289A18700M71794o935k68744L01200K08063A30901M39702K85139
16422H55742m25967J08256j14325K73925M2776C65443J5681N6227K83896j73092
16412E48155J57906j45475l9789M0326B20831G4943L58548P4486B17646J80431
$$ y = [846765, 1109157, 795050, 761836, 681158, 996867, 592582, 608265, 622468, 857730, 946660, 806823, 1204240, 1040583, 712239, 782923, 563284, 667936, 912907, 587506, 797159, 831195, 696046, 685026, 433785, 415580, 563950, 690541, 1069401, 320012, 437066, 637254, 644428, 736776, 847731, 638486, 661777, 848654, 583751, 508007, 439465, 425213, 665622, 594010, 562483, 670959, 413141, 552732, 267281, 616193, 700553, 658721, 503432, 118700, 590494, 583559, 314815, 616015, 824078, 130901, 570603, 855742, 429775, 538031, 423706, 697631, 740407, 365443, 381124, 437351, 721247, 548155, 706061, 560586, 520797, 561123, 220831, 74943, 433491, 507977, 217646, 398077]
16402C98077J83659k56459K17803p8539m3193j51958M9708R0281K25653R3335
16392G28367j74849j33240P8001H2639J78030L27005j52776A82801K92322A760
16381E79603B66274j05195O89162C48284L4825K7165O4689j52178J60208k23542
16371B59451J17922l5228A57922p0786K42660K22364q0808p3794j83590K2090
16361B36058n7106r76N22721C27890A52498J49209J17486P2938k4316k2151M776
16350D50440E3335M96022B69735j6269L13428B08757M26340B28761n985O4170
16340B86946j38769N51207I7798O20935l53731A53755J78407O6786J89322e5044
16329D95178A54441K44473j59714j02860C1156J43925n046o055M34255B59527
$$ y = [398077, 581736, 325277, 543080, 464541, 421348, 269390, 319098, 409379, 635032, 728367, 553518, 420278, 498279, 82639, 260669, 587674, 434898, 182801, 475123, 1760, 579603, 266274, 161079, 850241, 348284, 383109, 410274, 474963, 322785, 482993, 259451, 377373, 342145, 157922, 87136, 329796, 552160, 471352, 397558, 213968, 236058, 178952, 177976, 700697, 327890, 152498, 301707, 419193, 492131, 467815, 445664, 450440, 53335, 549357, 269735, 253466, 566894, 208757, 635097, 228761, 222776, 286946, 148177, 699384, 97798, 718733, 365002, 153755, 332162, 398948, 588270, -55044, 495178, 154441, 398914, 239200, 136340, 31156, 175081, 170035, 163980, 598235, 259527]
16318C68488A03032J20788q1750J50565A40252J80416J970K13502k59715A03742
16307E6880M00019j16331q5527J46572j46838j25446J75243j15545L0830E2677
16296D20088k07489a3123B75558M18688l38178j09663K7784q7176l2364J65091
16286C19740K2973G4537c304B0269K97070a01626C40505j28741M5700l0338k5692
16275B01434q086N05534b81168A70749J48701j57882p5614O8560J75818I5888
16264i1798B367J90900d4040k7767n900N350B19614k6372J82924j22622A12275
16252C13832a19894D8039L83659j12022A38016a994E70084B28597b9611Q5C38089
16240A58519B7105a53650B01448L0136R3284A43645J50571l9608P8494d5804B6946
$$ y = [368488, 103032, 223820, 142070, 292635, 140252, 320668, 322638, 536140, 276425, 103742, 56880, 456899, 340568, 255041, 401613, 254775, 129329, 304572, 189027, 219857, 52677, 420088, 212599, -13123, 275558, 694246, 356068, 246405, 274189, 187013, 154649, 319740, 342713, 74537, -3304, 20269, 317339, -101626, 340505, 211764, 257464, 227126, 201434, 193348, 698882, -281168, 170749, 319450, 161568, 85954, 154514, 330332, 95888, -91798, 2367, 193267, -44040, -71807, -77707, -72357, 219614, 193242, 376166, 253544, 112275, 313832, -119894, 48039, 431698, 319676, 138016, -1994, 570084, 228597, -29611, -29526, 338089, 158519, 27105, -153650, 201448, 231584, 324868, 143645, 294216, 254608, 333102, -45804, 26946]
16228c0981B27686j1490p5959F4493K01347F8256M804J83593F2276d16796C38940
16216A46450n8949K49237A67103c79981J46336H5302K39160j31019h0806A68136
16205C05101j36041D0154a7459B49971b43981a9603A55882g9602A97275H272K11465
16194B19737C8293P179b8268B65045A20379J56976i2674d0008m4902B02198p2175
16183A30023D084J27173K82937k00563o1732k5550J74961J25268E0523j1205a17411
16171A29268a63071e0340k6079B44534i4499f473B40825I7356l0409J5240b02
16159I0229J06233a52769B07180o0120L39285b94001A49839a47185C9556g2959
16148A02137J77873e5056E4028c471k05714a2145n0496j30201A71460H0035L16158
$$ y = [-30981, 227686, 216196, 140237, 64493, 265840, 68256, 73060, 256653, 62276, -416796, 338940, 146450, 87501, 336738, 167103, -379981, -233645, 85302, 324462, 193443, -80806, 168136, 305101, 169060, 40154, -17459, 249971, -243981, -19603, 155882, -79602, 197275, 8272, 219737, 38293, 45472, -28268, 265045, 120379, 277355, -92674, -40008, -84910, 202198, 130023, 4084, 131257, 414194, 213631, 151899, 126349, 301310, 426578, 50523, 39318, -117411, 129268, -163071, -50340, -76419, 244534, -94499, -6473, 240825, 97356, 66947, 82187, -202, 90229, 196462, -152769, 207180, 147060, 486345, -294001, 149839, -147185, 39556, -72959, 102137, 280010, -55056, 54028, -3471, -209185, -12145, -62641, -192842, 171460, 80035, 396193]
16137C96193c74668g7272j12237H5190a23805I6545D1551J04016k6609b30619
16126A63349l1659a16568C52927j30641i8319A10142J14735a52057E4088J19567
16116A73655a04447D1002b31869C3377a5475B53574g2267C05049e21j36232k5211
16105a61964A76994c9755r2422h591I348L03626F265g9789A02616g3900k07587
16094b81487A99984D7885f879l36721A40212d8883j70883D5527b24865o9628B65850
16082a56036B36023A15239I581a09813B52100k6910A3027K8545C777J02118G598
16070C60608a28205l09479C4847M1415a28704j23698A34159a3212j56871B3736
16059B5122c1953j42690B83842F4807K7551c4270k53191e5060E11142a06091k41968
$$ y = [396193, -374668, -77272, -189509, 85190, -123805, 96545, 41551, 145567, 118958, -230619, 163349, 131690, -116568, 352927, 222286, -98319, 110142, 224877, -152057, 54088, 173655, -104447, 41002, -231869, 33377, -15475, 253574, -72267, 305049, -521, -136753, -161964, 176994, -39755, -132177, -8591, 9348, 312974, 6265, -79789, 102616, -73900, -281487, 199984, 47885, -6879, -343600, 140212, -48883, -219766, 45527, -224865, -294493, 265850, -156036, 236023, 115239, 9581, -109813, 252100, 225190, 13027, 41572, 3777, 105895, 7598, 360608, -128205, -437684, 34847, 76262, -128704, -252402, 134159, -13212, -170083, 23736, 25122, -31953, -174643, 283842, 64807, 92358, -34270, -287461, -55060, 511142, -106091, -348059]
16048c48059A73110O6316a67450N8541L97b7933k79894J18172A26256a04668B779
16036b77838B12396p3787a5207A31452p741a88818n7473C7173J27052M6732c27824
16024a08516j87492D2553J50085a02568j71833A74283J68242F2277h5239H8117
16013h6256o2481l3682j67096a44005r9233C8615K31839r6381a74250c8218B2931
16001g8899C5243c14268C01567d02549h8322A2164L35762A37057J4862J06380
15991B58299r1549p7426i9207F0722M3491a27770A97481q5623A4679K26973e3783
15979D61444C4786J17597i74k5589j05517K3710m4660A13706B6709H746a92379
15967I3108a9848E6707J27169B2899H536J19422h6361M0838n2587m0754b7269
$$ y = [-348059, 173110, 239426, -167450, -108909, -108512, -27933, -307827, -189655, 126256, -104668, 2779, -277838, 212396, 138609, -15207, 131452, 123711, -188818, -246291, 37173, 164225, 210957, -327824, -108516, -296008, 42553, 192638, -102568, -274401, 174283, 342525, 62277, -85239, 88117, -86256, -148737, -182419, -349515, -144005, -243238, 38615, 270454, 174073, -174250, -38218, 22931, -78899, 35243, -314268, 301567, -402549, -88322, 12164, 347926, 137057, 151919, 258299, 166750, 89324, -99207, 60722, 104213, -127770, 197481, 111858, 14679, 241652, -53783, 461444, 34786, 152383, -974, -26563, -132080, -108370, -153030, 113706, 26709, 8746, -192379, 93108, -19848, 56707, 183876, 22899, 8536, 127958, -86361, -45523, -98110, -138864, -27269]
15955a07227d3997E8492M235K6033b78422F3643a19102A54061J01621a00940A94
15943C4388L1706d12495E2054J35290P6661e7123M367D504j830K20714g9315D149
15930A00428m5114L36885b58698a4088C35248b52371b3331B39334a43607A1020
15919b35809g4517j2614E3785i0789l6899L1802d0859b779A63142c41947D4498
15907A33711a9643A54060d36038a91365k00129h8026o9387E22c25058A95112A160
15895A24129a80348b3487A50852b31402P6673m837k35867A71980q1112b01598
15884c26993C8506O2697d4695A91272B4945M7122b28471B3284I918c57953J69294
15873a88659p0015r6223G7521d97832a37237A11530M2811m3890C1919L0361a18626
$$ y = [-107227, -43997, 58492, 62727, 88760, -278422, 63643, -119102, 154061, 255682, -100940, 194, 34388, 66094, -412495, 52054, 187344, 264005, -57123, -52756, 4504, 2674, 223388, -79315, 4149, 100428, 55314, 392199, -258698, -14088, 335248, -252371, -23331, 239334, -143607, 11020, -235809, -74517, -87131, 53785, -90789, -127688, -95886, -40859, -2779, 163142, -341947, 44498, 133711, -19643, 154060, -436038, -191365, -391494, -88026, -157413, 522, -325058, 195112, 1160, 124129, -180348, -23487, 150852, -231402, -154729, -159566, -395433, 171980, 90868, -201598, -326993, 38506, 101203, -44695, 191272, 24945, 72067, -228471, 23284, 9918, -357953, -188659, -258674, -354897, 77521, -497832, -137237, 111530, 154341, 110451, 31919, 62280, -118626]
15861a53053k1578A9002L775i1965o697F8867e9316K2912A46079O795b4315k63529
15849b87844d2256A93462a9078C81920A86512g2960A43527f7593j45219B97137
15838D5578h7371C0673a30599K1081a9431A24835J25239D7470a29428k9282p3253
15827b31963B2394b60570k41494I2187b73108I3619a67158j60201a28146A59045
15816h2614D8154i7316A24068a18837m5638P2859d4394G1680J39045e6789j52882
15805b09671B10936a25371p9437g24E2787b11200b3715F4104f2389A69123o9876
15794I9247a24784B91814d7858A76193c47284J59795O7825B64445b8843m16088
15784d44931B47274n7119n2694E7709b7861k77188n6990F9655b1193j1378k5037
$$ y = [-153053, -174631, 19002, 22777, -91965, -98662, 68867, -59316, -36404, 146079, 152874, -24315, -287844, -42256, 193462, -19078, 381920, 186512, -72960, 143527, -67593, -212812, 297137, 45578, -87371, 30673, -130599, -109518, -19431, 124835, 250074, 47470, -129428, -158710, -231963, 22394, -260570, -502064, 92187, -273108, 93619, -167158, -327359, -128146, 159045, -82614, 48154, -97316, 124068, -118837, -164475, -91616, -44394, 71680, 210725, -56789, -209671, 210936, -125371, -204808, -724, 52787, -211200, -23715, 64104, -62389, 169123, 99247, -124784, 291814, -47858, 176193, -347284, -187489, -119664, 264445, -28843, -444931, 247274, 190155, 137461, 57709, -27861, -305049, -362039, 69655, -21193, -32571, -57608]
15773e7608E9701M693b79987Q3876B74746h7052q1873j08809a06045n6056P5845
15762h6256k2509r5054N1989J474n1152d7081C07284a39858F8767b21229e4347
15750f8245j4747A1004J12816J02152d7261k6287l66506A59887R9613Q7083b19726
15738A10620j2904a46169A20257C8469J60845j6631A6484a91311B60418i0660
15727B33661G4587J85203h8920L9416A5006J29583g3305p6059d4312H1286P9498
15716A60784a01371k28729d8213G692a40414A88911a75027G5157a06561q388p3845
15705a88794D0271J10180a62469A30937b19427K3766j73109a0425j37869C73479
15694A06986E81Q8193a04017B07432h2523j28114e563H1685A4305J47781b46135
$$ y = [-57608, 59701, 64394, -279987, -196111, 274746, -87052, -168925, -277734, -106045, -162101, -86256, -108765, -203819, -151830, -150356, -201508, -47081, 307284, -139858, 68767, -221229, -54347, -68245, -82992, 11004, 123820, 225972, -47261, -73548, -440054, 159887, 259500, 346583, -219726, 110620, 97716, -146169, 120257, 38469, 199314, 182683, 16484, -191311, 260418, -90660, 233661, 74587, 259790, -88920, -49504, 15006, 144589, -73305, -149364, -44312, 81286, 160784, -101371, -330100, -48213, 7692, -140414, 188911, -175027, 75157, -106561, -114949, -188794, 40271, 150451, -162469, 130937, -219427, -195661, -368770, -10425, -148294, 373479, 106986, 581, 88774, -104017, 207432, -82523, -210637, -5563, 81685, 14305, 162086, -246135]
15682a57884d9124j48053A2266a59253r5634i2811m3040G4009L2164a30021C26409
15670i7102k19181E1409L87969a09850q551B8853F53b14815R9408e4016P471q0764
15658a27309A82111a19047M0693k15129N8032k51077J86663Q8324e4726j38014
15648a92740B77081h6070j1980a4458k17195J3318E2378a27685e5844l008m6663
15637a05515B21473p7797a72471G4180h2158a7132k23612j57400A24434b11635
15626F1830b73314Q8187A8125a84075O6527H5701K07118a31273p1577A0868c913
15614a78938g028k31247h6971j7085A00476c37443J04385J05758j81354B8644
15603g7155P615B27066a8502A31532c2708C73852q6853b49160C3173O6640r680
$$ y = [-157884, -49124, -197177, 12266, -159253, -254887, -92811, -135851, 74009, 106173, -130021, 326409, -97102, -316283, 51409, 439378, -109850, -118401, 28853, 653, -214815, -115407, -54016, -46545, -127309, 182111, -119047, -78354, -293483, -235451, -486528, -299865, -211541, -54726, -192740, 277081, -86070, -98050, -14458, -231653, -218335, 52378, -127685, -55844, -58852, -105515, 221473, 143676, -172471, 74180, -82158, -17132, -240744, -398144, 124434, -211635, 61830, -273314, -185127, 18125, -184075, -117548, 85701, 292819, -131273, -202850, 10868, -3913, -178938, -7028, -238275, -86971, -104056, 100476, -337443, -233058, -127300, -308654, 28644, -77155, -69540, 227066, -18502, 131532, -32708, 373852, 286999, -249160, 33173, 99813, 90133]
15592I0133l1588J13195b24915A29896e2023r8748I8835a12989q5278b7463k29175
15581b56638d3633F3880N2640M4661b30369f5207l7846b7j27840j49118M7493
15570b29492a2n3063k67500a13746k6786C791b71062E7744a28432O1391K1117
15559d5924C6751J55742b20123f7553A91792e0428k38243A12575j9296a63383
15548i2178I217d6598F4304f5046I9277d8766r1867C65113b26316Q8363B16846
15536E660a10188p8182E55220c7963B11987c37621A44378k0936b82484A1228a64447
15524B97016j23774H4713R106J6666O8995a33652I0673J60869A04900L12491C3644
15512I1779h6071F0316A7511K24269r2690O0425K33307B16157R6329g4530m0702
$$ y = [90133, 58545, 171740, -224915, 129896, -52023, -150771, 98835, -112989, -198267, -27463, -256638, -43633, 63880, 116520, 161181, -230369, -65207, -103053, -27, -127867, -276985, -229492, -12, -53075, -320575, -113746, -140532, 3791, -271062, 57744, -128432, -67041, -45924, 36751, 192493, -220123, -67553, 191792, -50428, -288671, 112575, 93279, -163383, -92178, 9217, -46598, 64304, -65046, 99277, -48766, -140633, 365113, -226316, -137953, 216846, 5660, -110188, -188370, 555220, -37963, 211987, -337621, 144378, 123442, -282484, 11228, -164447, 297016, 173242, 84713, 93819, 110485, 179480, -133652, 90673, 251542, 104900, 417391, 33644, 91779, -86071, 60316, 17511, 241780, 149090, 209515, 442822, 216157, 312486, -74530, -115232]
15501a15232j85122H8102K1117l4735a73702r7224A46335o786o4156a54818E9092
15489a24942b6272m6083k12519M9965Q5629R094N0264j4725k83563a31895B08018
15477g2312A3850P7165a08908A9086b975o6025C48092M7403q932F6472b46704
15465e3711C10084A14668b11953K2701F1343J14283n3082b12325h7104f874j8975
15454b5849m796B9928L50034g9257a0800G1499K39392m4335o0025N8272a77076
15442a58683j66291g4622C05096b19913I6837a87188A51053a17989D4654K1549
15432F6203f8342p5059D5151d9378C27885b8898j31802C75722e2531J2925k18420
15421b58026P1142Q4171C7260K34317b08922A7827J60188b41899K7793A12924
$$ y = [-115232, -300354, 88102, 109219, 74484, -173702, -270926, 146335, 139549, 75393, -154818, 59092, -124942, -26272, -72355, -284874, -234909, -149280, -140186, -89922, -104647, -388210, -131895, 208018, -72312, 13850, 91015, -108908, 19086, -2975, -69000, 348092, 395495, 386563, 66472, -246704, -53711, 310084, 114668, -211953, -189252, 61343, 175626, 122544, -212325, -87104, -6874, -25849, -30645, 29928, 379962, -79257, -10800, 71499, 310891, 266556, 206531, 264803, -177076, -158683, -324974, -74622, 305096, -219913, 96837, -187188, 151053, -117989, 44654, 66203, -68342, -143401, 45151, -49378, 327885, -28898, -160700, 375722, -52531, -39606, -258026, -186884, -102713, 37260, 271577, -208922, 17827, 178015, -241899, -214106, 112924]
15410c10008G3596O1994P3094a29892l9393A73779h8678I3222J28207n1244a65409
15398B1369a74582G5391J3508e3626a3151j13307A65575b8482A63640j6034d1011
15386g2962E66922a46348c6436B94774D5309c5429j81595A9422J19693g7665K6280
15375e1385k8678j29504b7893B80059F1423L0776l0302a43362A88869i0682M1449
15364d9233j74982G7077R7025M558g753l3577A46382a87339D6879c76283B46502
15352A39148e0417H3369a48507B16900p5656a74559B53259j05066L5394a73650
15341d7182j6509k37941B12516f8693A11823K98396a74616B38307j8973b45044
15330A4015n894d4513m1814A70532f5914A00806b0865C0256H455Q794K2642a7098
$$ y = [-310008, 73596, 135590, 208684, -129892, -169285, 173779, -88678, 93222, 221429, 170185, -165409, 21369, -174582, 75391, 88899, -53626, -13151, -126458, 165575, -28482, 163640, 147606, -41011, -72962, 566922, -146348, -36436, 294774, 45309, -35429, -217024, 19422, 139115, -77665, -51385, -80063, -209567, -27893, 280059, 61423, 92199, 61897, -143362, 188869, -90682, -49233, -224215, 77077, 174102, 178660, -7753, -41330, 146382, -187339, 46879, -376283, 246502, 139148, -50417, 83369, -148507, 216900, 141244, -174559, 253259, 148193, 183587, -173650, -47182, -63691, -301632, 212516, -68693, 111823, 410219, -174616, 238307, 219334, -245044, 14015, 8121, -44513, -86327, 170532, -65914, 100806, -20865, 30256, 8455, 17249, 39891, -17098]
15317d2542C48398A30166e4465B99478j40962J65142D113a82175q8471A24655
15306I7603a13672E8410a69307k6852o3858C69221B1454f7256A45044K6914n6212
15295A15746J07695H1269f2771j95392I6633h8120H6984a7210C34378a72315B22372
15283E3867J24298f5138H3756J1579J12847n7193J6383n7096O756c4766A78314
15271A60096K9052J26282C219c24774b3924j03162A05885b10508E5837j6013a07888
15259a767l33558B07918c9106B4490J83856r9583J65755M6292A16567L70257L22031
15248H08855P25839O3750p49266P28695E98277k84528g7747I8077P3629C0112
15237A46842a21327k75080B86195n5250E0010N6640b15528d8232D9884R508a47658
$$ y = [-42542, 348398, 130166, -54465, 299478, 158516, 323658, 4113, -182175, -270646, 124655, 97603, -113672, 58410, -169307, -196159, -260017, 369221, 21454, -67256, 145044, 171958, 115746, 223441, 81269, -62771, -258163, 96633, -88120, 86984, -17210, 334378, -172315, 222372, 53867, 178165, -65138, 83756, 95335, 208182, 150989, 167372, 110276, 117032, -34766, 178314, 160096, 189148, 315430, 3219, -324774, -23924, -127086, 105885, -210508, 55837, 39824, -107888, -1767, -335325, 207918, -39106, 24490, 208346, 108763, 274518, 320810, 116567, 486824, 808855, 1534694, 1598444, 849178, 1577873, 598277, 313749, -77747, 98077, 171706, 30112, 146842, -121327, -396407, 286195, 230945, 50010, 106650, -215528, -48232, 49884, 59392, -147658]
15225c9281D2351K7974h6727A48149a55251C19885j18031R1683N1636H8784b01266
15213e0838j0372j40001o5099A46080J37680j12965l8540M41554B31982n1365
15203A80617m5704K58420d0184A04582J6267q749J06235J4101c1497j1060B50598
15191I8258P0430l9206m5995K06267j34602l8045A4071f7064A88222b15606E2062
15179C7261d29477A17583H235J0271g6820A4366b17276A29110C3585J24423o1541
15168I6467N9806J17370A10719n205O6841a9484A88958k87b13592q4561e8586
15156E14796b8179c886j84354A69346c33291a56540B75103a21071B22147n7856
15146A64291J2808J08897p4447K24309B07564f8006C76100A15755g5201b2714
$$ y = [-39281, 42351, 70325, -86727, 148149, -155251, 319885, 201854, 293537, 345173, 88784, -201266, -50838, -61210, -201211, -266310, 146080, 283760, 170795, 132255, 573809, 231982, 180617, 134913, 393333, -40184, 104582, 120849, 112100, 218335, 232436, -31497, -42557, 250598, 98258, 168688, 129482, 83487, 289754, 155152, 117107, 14071, -67064, 188222, -215606, 52062, 37261, -429477, 117583, 8235, 18506, -76820, 14366, -217276, 129110, 33585, 158008, 96467, 156273, 273643, 110719, 105514, 172355, -19484, 188958, 188671, -213592, -298153, -58586, 514796, -28179, -3886, -188240, 169346, -333291, -156540, 275103, -121071, 222147, 164291, 177099, 285996, 211549, 435858, 207564, -68006, 376100, 115755, -75201, -22714]
15135f1239B23633L79L7409J04734e5612E4502Q2021m1952J42233o3600Q1874
15124B55078N0590A23242c7660B20342J319R8749E8154a07894a072k2274A69309
15112G5589R012N5009J371P7324e8404c899F0667J66946h4181D6952a38140A01098
15099A76596k9313J52116A6143Q2407L01524Q7930k28080b30694d6417C38873
15088B51067d4606h838D3183J38406I367J56811J1204M7075K1102J23717r7960
15077B71316f2120H7863L3863k5689J0373J37845J97624I1929J09608J13661j57020
15066A58178F043K88621O1814o3302d9429B04755K40176j96625J23409G5284M65137
15055E40421j81014i7011E01980r7517a32161a1509l38834C10224A06566j0158
$$ y = [-61239, 223633, 224012, 261421, 366155, -55612, 54502, 136523, 94571, 236804, 173204, 255078, 305668, 123242, -37660, 220342, 221661, 320410, 58154, -107894, -1072, -23346, 169309, 75589, 84601, 139610, 140981, 218305, -58404, -3899, 60667, 227613, -84181, 46952, -138140, 101098, 176596, 147283, 299399, 16143, 98550, 400074, 488004, 259924, -230694, -46417, 338873, 251067, -44606, -8838, 43183, 181589, 9367, 166178, 177382, 224457, 245559, 369276, 271316, -62120, 87863, 121726, 96037, 106410, 244255, 441879, 91929, 201537, 315198, 158178, 6043, 294664, 356478, 293176, -49429, 204755, 444931, 248306, 371715, 75284, 540421, 359407, -97011, 501980, 404463, -132161, -11509, -350343, 310224, 106566, 96408]
15045I6408K69930G3316M50542g0038j9762C26116E3236J82182r7682K50917j66669
15034B21984m0891R9610J01497K8773i7609A4148L23640G4862b80588A34700N1828
15023A86528M33335B3899J25923J00765L1573J0476o6550L32536g4473C65932
15012B60637F5868J5878B8515c00954a27429J3402D14794A55099m3524b86C02265
15000C13192G1470L1905J43025J61945a29589d3666C57419n6288R0645O2106E7961
14988C01814K47975B59151N3507m0781k4298E4530K80433r1976p5303K88942F5908
14976i2192C91178N8987f2715D02171a755D26794j79690J58265M0210p0138E1192
14964D74428j00506r6619M78061I7660f7260k8811b366l48328C72260I274J02151
$$ y = [96408, 366338, 73316, 523858, -70038, -89800, 326116, 53236, 235418, 137736, 388653, 221984, 181093, 280703, 382200, 410973, -97609, 14148, 337788, 74862, -280588, 134700, 186528, 619863, 23899, 149822, 250587, 282160, 292636, 226086, 558622, -74473, 365932, 260637, 65868, 81746, 28515, -300954, -127429, -114027, 414794, 155099, 111575, -286, 302265, 313192, 71470, 103375, 246400, 408345, -129589, -43666, 357419, 301131, 391776, 453882, 57961, 301814, 549789, 259151, 312658, 271877, 247579, 54530, 334963, 242987, 167684, 456626, 65908, -92192, 391178, 450165, -62715, 402171, -1755, 426794, 247104, 405369, 445579, 375441, 51192, 474428, 373922, 277303, 755364, 97660, -67260, -96071, -2366, -350694, 372260, 9274, 111425]
14953A11425L20551A74179Q0929L13243k47477j4200M4678A16260J46895J79686
14943D42841q3583q4757Q5425j69347J0862J78249A79209H9131R418K38076o2423
14932B74202K38883j80057j0802A58811J44230J97290K5650n9450j82791I7913
14921F02857k4066J96914C10729R3822j42882j15493K31064J04701K64324C13440
14910C43950j15259K60338A82729L46822j42004A82395P0403j8739n6484J42354
14900C19929m676r0041M5586o1516R3666K80163a15243D50323k21134k9073h1846
14888C79558a62605C68542J70303q2954J90592A88983J76969O9062L7055j55239
14878C16830o3340J54154P4882A66296N92009k43268P8976N2555A87314M39845
$$ y = [111425, 431976, 174179, 255108, 568351, 320874, 306674, 351352, 116260, 263155, 442841, 359258, 274501, 359926, 190579, 201441, 379690, 179209, 89131, 98549, 336625, 274202, 513085, 333028, 322226, 158811, 303041, 500331, 525981, 466531, 283740, 97913, 602857, 578791, 775705, 310729, 404551, 261669, 146176, 377240, 481941, 746265, 313440, 343950, 228691, 489029, 182729, 529551, 387547, 182395, 252798, 234059, 177575, 319929, 315253, 225212, 270798, 209282, 302948, 583111, -115243, 450323, 229189, 200116, -81846, 379558, -162605, 368542, 538845, 455891, 646483, 188983, 365952, 435014, 472069, 316830, 253490, 407644, 482526, 166296, 758305, 515037, 594013, 646568, 187314, 627159]
14868F27159B54920L79695j60053L300B38009q7155M18916A17113K33009P3994
14858D24116n5642K4326J14492N2099j09320N9696Q5513a01864D66969J09160
14848E76129j55449m4594j10135K51334B58636J75316o9303Q2658j91371K59646
14838E15582o0266r6188J51113j40169j03424J95478J13960R114n6449k1355J95898
14827G03294k07967j37602K34797B83880K03600L64439j96195j3936P9911r1783
14817F29916j30907Q4809j14031J271J67305k46545A80321M28425J542k0183R9545
14806F89650k24298k21455K38215J48638R9877k15615j71083J93411K62993C37946
14795E70410Q9762K1484K2229A32404K27708O01725m29869J67497k71023N60224
$$ y = [627159, 254920, 634615, 474562, 477862, 238009, 150854, 569770, 117113, 350122, 424116, 368474, 392800, 507292, 559391, 450071, 509767, 595280, -101864, 466969, 576129, 420680, 376086, 265951, 517285, 258636, 433952, 364649, 447307, 255936, 515582, 455316, 359128, 510241, 370072, 266648, 462126, 576086, 585200, 528751, 507396, 703294, 495327, 357725, 592522, 283880, 487480, 851919, 655724, 641788, 721699, 629916, 499009, 583818, 469787, 471058, 638363, 391818, 180321, 608746, 610288, 590105, 689650, 465352, 243897, 482112, 630750, 730627, 515012, 343929, 537340, 800333, 337946, 570410, 660172, 681656, 703885, 132404, 360112, 961837, 531968, 699465, 428442, 988666]
14785I88666D42080J73757j05647O70429m00353l2852j06790L55316k73279r2354
14775F30307k05070L61701q0986p2246p0010q0162o1758M26359k66066q3974R2490
14764E90585J52115k27962J10772j82592K01376r3115J90420l50802L28152j30403
14754E88546K05329K5184p1581l24775O58498C86371J26600K4305L10633k67583
14744E80326J17780J37383n8874K20268j04538l44357k0110K18104j15730R4778
14734G25030j52222L8447K85956k45359J46619j58481j58673L26073J09355K7239
14724I43984j21253j67287K79867j12103j89004J68579l2861j4052Q862k492M92999
14713A255239k78480k01319n7347J98373M54870l47592k99994M18449N7242l97280
$$ y = [988666, 442080, 615837, 510190, 1180619, 780266, 747414, 640624, 995940, 722661, 630307, 425237, 786938, 705952, 633706, 563696, 483534, 421776, 848135, 582069, 498095, 590585, 742700, 514738, 625510, 442918, 644294, 551179, 741599, 390797, 718949, 588546, 793875, 819059, 747478, 422703, 1081201, 386371, 512971, 537276, 847909, 580326, 698106, 835489, 776615, 996883, 892345, 547988, 527878, 745982, 630252, 725030, 572808, 611255, 897211, 651852, 798471, 639990, 481317, 807390, 916745, 943984, 822731, 655444, 935311, 823208, 634204, 802783, 769922, 755870, 764732, 762240, 1255239, 976759, 775440, 718093, 916466, 1371336, 1023744, 723750, 1142199, 1199441, 802161]
14703H02161K5665l6075J90521k1246M8976j56501p6725L62574D88553K63409
14693G51962J84373k06062L50905q2786j9115j31223L37174k38656J53754M3969
14683A144295j45998J09503j56425J94426j26279Q8748Q8555m92749K19987J29080
14673A053143J54495k23979M49530j75703k17360l2666m434j20996K71650L91879
14663A545559m17670N5722K53119l79408j02410K3575o945N15836m61047J16462
14653A142793K83948k50730J88099Q2236m9813j24860r8907K72263k86179O3989
14643A222839M36449l11226k01859L37713K77098m96702M81640m46373L8546J35191
14633A473316k64044M15802n47793L74436l4952j94136M16977P7391k96939m1864
$$ y = [802161, 827826, 791751, 982272, 961026, 1010002, 853501, 776776, 1139350, 488553, 751962, 936335, 730273, 1081178, 998392, 979277, 848054, 1185228, 946572, 1100326, 1144295, 998297, 1107800, 951375, 1145801, 1019522, 1108270, 1196825, 704076, 924063, 1053143, 1207638, 983659, 1433189, 1257486, 1040126, 1007460, 1003026, 882030, 1153680, 1545559, 1127889, 1183611, 1436730, 1057322, 954912, 978487, 971542, 1487378, 1026331, 1142793, 1426741, 1176011, 1364110, 1446346, 1396533, 1271673, 1172766, 1445029, 1158850, 1222839, 1659288, 1348062, 1146203, 1483916, 1761014, 1264312, 1745952, 1299579, 1338125, 1473316, 1209272, 1625074, 1077281, 1451717, 1416765, 1222629, 1639606, 1716997, 1420058, 1378194]
14623A378194K49266J73644m33301K28382j07511j60087Q7440L64702k61788o382
14613A512559K99573l07209K83106k69304K20658j46741k60800L37452J95762
14604A865056j73471M0841j36030l38K66261k54742L57819j62995k17253L77528
14594A962676k15865R643J24183J03847q1845J42333p0668K42511r6023l85710
14584A735082N50672j92324O2321M7502o8659q7023j20054K41543j12505J34942
14574B191497M0626R1258J36421q1806J01590l41156L17813K88954k80733J58299
14564B622763M60175l74439J66160p2243K0661L29238J33281O962L16692K47985
14554C857235J80068J06170P68400K70646J480962J993959M201139Q767334J5172100
$$ y = [1378194, 1627460, 1801104, 1367803, 1596185, 1488674, 1328587, 1416027, 1780729, 1518941, 1512559, 1812132, 1504923, 1788029, 1518725, 1739383, 1592642, 1331842, 1669294, 1865056, 1691585, 1732426, 1596396, 1596058, 1862319, 1607577, 1965396, 1802401, 1585148, 1962676, 1746811, 1756454, 1880637, 1984484, 1902639, 2044972, 1974304, 2216815, 2120792, 1735082, 2285754, 2093430, 2155751, 2203253, 2134594, 2047571, 1927517, 2169060, 2056555, 2191497, 2232123, 2323381, 2459802, 2377996, 2479586, 2138430, 2456243, 2745197, 2464464, 2622763, 3082938, 2708499, 2874659, 2802416, 2823077, 3152315, 3285596, 3292558, 3609250, 3857235, 4037303, 4143473, 4911873, 5182519, 6663481, 8657440, 12858579, 21625913, 36798013]
14545C6798013Q402835j7769019A2072444n945136k320650p07539j39456j73855
14537B785808r2248m30868K10572o3655l8353N3086K20497K908m35021L97201
14527B609927k20742O288L0584K58603J59329Q3619k74487J04439l01466L60367
14517B816461q1830K81323j06653j10969J49992k5770K57671j17459J14132n1706
14507C125192J64142K15573l83592J07939L11391k85758k75321L32278J64156
14498C476000K83189n52057J45048L8999M70024k3595K34691k38337o844J82358
14488D009476k31698K89734k26035K97250J4606k19L3780q8222J92629M2968o7940
14477D266329J78648k359p4845J495N32571j44724k14480J7969L90254j68031
$$ y = [36798013, 45200848, 27431829, 12072444, 6127308, 3806658, 3099119, 2959663, 2785808, 2693560, 2262692, 2473264, 2409609, 2371256, 2424342, 2644839, 2647747, 2212726, 2609927, 2389185, 2395473, 2426057, 2684660, 2843989, 2927608, 2653121, 2757560, 2456094, 2816461, 2734631, 3015954, 2909301, 2798332, 2948324, 2922554, 3180225, 3062766, 3176898, 3125192, 3289334, 3504907, 3121315, 3229254, 3540645, 3254887, 2979566, 3311844, 3476000, 3759189, 3207132, 3352180, 3391179, 3861203, 3837608, 4072299, 3833962, 3827118, 4009476, 3777778, 4067512, 3841477, 4138727, 4153333, 4153114, 4186894, 4098672, 4291301, 4334269, 4266329, 4444977, 4442618, 4367773, 4369268, 4901839, 4757115, 4542635, 4560604, 4950858, 4782827]
14467D782827M33134j56747j39973L0434J49508k13940L44097K09143l86352K89976
14457E342107j31052j3673K69257L56052j81826L85494k80472J3606j16850K61943
14447E904586M69040j55867k16896L18057K23257n6059K39358P6848J6539M09802
14437G228665n575j27252J38276K03591p5359k36248L50364J59663k34870M99348
14427G900603P9928N6070j2198M35290N5772j71404K61637L8876l70298Q27282
14417I101558J86085L4911J39502K75956R6360m99302L67804R5445M93480R9890
14407A0391689l36436N58932L28368r7512K76344J26619K66759N6860N2557L60923
14397A1985103J03293M37023p4853J46330M73292j37280M49116L01040O6073L43816
$$ y = [4782827, 5215961, 5059214, 4919241, 4949675, 5099183, 4885243, 5229340, 5438483, 5052131, 5342107, 5211055, 5197382, 5466639, 5822691, 5640865, 6026359, 5745887, 5759493, 5642643, 5904586, 6373626, 6217759, 6000863, 6318920, 6542177, 6486118, 6725476, 6802324, 6818863, 7228665, 7223090, 7095838, 7234114, 7437705, 7362346, 7126098, 7476462, 7636125, 7401255, 7900603, 7980531, 8036601, 8024403, 8459693, 8515465, 8344061, 8605698, 8644574, 8274276, 9101558, 9287643, 9322554, 9462056, 9738012, 9834372, 9335070, 9702874, 9798319, 10291799, 10391689, 10055253, 10614185, 10942553, 10845041, 11121385, 11248004, 11514763, 11571623, 11624180, 11985103, 12088396, 12525419, 12450566, 12596896, 13070188, 12932908, 13382024, 13683064, 13749137, 14092953]
14387A4092953j41526M77966K19205L36551L91069O277P20110j65927K82005K86675
14377A6505358L12472L47848L92677L97612L92655N12260K01252N03915L92747
14368A9958796N34862Q3536M52052N19113M25224N99244O31206M14743M37393
14359B4056169N50206Q19000L9950P04784J151999L99087O47233J14046J051573
14350B9534047Q20426Q06436P39343J27325J364755Q16713R59724J172668O09373
14341C6950810J011865J000675R42289J225759J573509Q16067J508279J163640
14333D6192893J451332J258565J050701K005963J791452J692970J936405J567330
14325E8947611K203931K011052K133755K446406K511680K360513K374989K612308
$$ y = [14092953, 13951427, 14429393, 14648598, 14985149, 15376218, 15382495, 16102605, 15936678, 16218683, 16505358, 16817830, 17165678, 17558355, 17955967, 18348622, 18860882, 19062134, 19566049, 19958796, 20493658, 20577194, 21029246, 21548359, 21973583, 22572827, 23204033, 23618776, 24056169, 24606375, 25425375, 25465325, 26170109, 27322108, 27721195, 28368428, 28482474, 29534047, 30354473, 31160909, 31900252, 32027577, 33392332, 34209045, 35168769, 36341437, 36950810, 37962675, 38963350, 39905639, 41131398, 42704907, 43520974, 45029253, 46192893, 47644225, 48902790, 49953491, 51959454, 53750906, 55443876, 57380281, 58947611, 61151542, 63162594, 65296349, 67742755, 70254435, 72614948, 74989937, 77602245]
14317G7602245L335323K803686K802369L546452L592757L944885M069701M043350
14309A05740768M231696M770343M976178N275928N611137N829475N985009O828432
14301A49248966P179344O998530P658132Q416258Q453382R251018R671299J0360540
14293B17237469J0947939J1373783J1738866J2754876J3005142J3596145J4481419
14286C05135639J4774531J4906968J5065985J5474330J5621174J4993489J4997708
14279D10969824J4313343J3271651J2197320J0591015R025261O815663M259156
14272D81443233R83267j931735k091976k014211l344200n295157p897782j0178244
14264D49673195j1298877j2806695j3455557j4756640j4925802j6020894j5719589
$$ y = [77602245, 80937568, 83741254, 86543623, 90090075, 93682832, 97627717, 101697418, 105740768, 109972464, 114742807, 119718985, 124994913, 130606050, 136435525, 142420534, 149248966, 156428310, 163426840, 171084972, 179501230, 187954612, 197205630, 206876929, 217237469, 228185408, 239559191, 251298057, 264052933, 277058075, 290654220, 305135639, 319910170, 334817138, 349883123, 365357453, 380978627, 395972116, 410969824, 425283167, 438554818, 450752138, 461343153, 470368414, 477184077, 481443233, 482426500, 480494765, 478402789, 476388578, 473044378, 467749221, 459851439, 449673195, 438374318, 425567623, 412112066, 397355426, 382429624, 366408730, 350689141]
14257C50689141j5745219j5161060j4361169j3853035j4032871j3574420j2836845
14250B51124522j2167437j1525198j0826941j0474363r755687r306998q348074
14243A78719824q135721p804128p746468o573355o857545n683028n988617n184194
14235A24746768n344154m882267m744827m883040l461482l397325m441603l815348
14227H9776722k934796l276166k987082k958982l080908k185522k478766k134588
14219F7739912k369629k086531k384128j627149j870896j558455j714358j411297
14211E2717469j790570j565306j613759j105763p88376j196525j349070j473759
14203D1834341j240986q84390j135722o68646j156743q50809j202176p03030p84198
$$ y = [350689141, 334943922, 319782862, 305421693, 291568658, 277535787, 263961367, 251124522, 238957085, 227431887, 216604946, 206130583, 196374896, 187067898, 178719824, 170584103, 162779975, 155033507, 148460152, 141602607, 135919579, 129930962, 124746768, 119402614, 114520347, 109775520, 104892480, 101430998, 98033673, 93592070, 89776722, 86841926, 83565760, 80578678, 77619696, 74538788, 72353266, 69874500, 67739912, 65370283, 63283752, 60899624, 59272475, 57401579, 55843124, 54128766, 52717469, 50926899, 49361593, 47747834, 46642071, 45853695, 44657170, 43308100, 41834341, 40593355, 39708965, 38573243, 37904597, 36747854, 35897045, 34694869, 33991839, 33207641]
14194C3207641q32071q18544p43871o35274p01502j224628k75720n36301p10642
14185B6729088n81669o91970o32059m33406o35466m06142n65215K8427r87702
14176B1823886J58098m52121q97815l58907m28142m78856k26113m18054l64303
14167A8357673n23099k06019n61566J9656m02835J10378n90154m59026j86260
14158A5558748L7408l02713o43956m01728L33554j03793m74058j78582m21066
14149A3403814j61854k1140n76520l17889K6815j52117l52647k74629Q1494k37633
14139A1417694Q4597m98095J83623o11736K02918j48005k88794l23620l27733
14130I690849K48837k04664n62287L75811J24750n42230r7905k5197j24545l67443
$$ y = [33207641, 32375570, 31557026, 30813155, 30177881, 29476379, 28251751, 27976031, 27439730, 26729088, 26147419, 25455449, 24823390, 24389984, 23754518, 23348376, 22783161, 22811588, 21823886, 21981984, 21529863, 20632048, 20273141, 19844999, 19366143, 19140030, 18721976, 18357673, 17834574, 17628555, 17066989, 17086645, 16683810, 16794188, 16204034, 15745008, 15558748, 15596156, 15293443, 14649487, 14247759, 14581313, 14477520, 14003462, 13824880, 13403814, 13241960, 13220820, 12644300, 12326411, 12353226, 12201109, 11848462, 11573833, 11655327, 11417694, 11502291, 11004196, 11187819, 10576083, 10779001, 10630996, 10342202, 10018582, 9690849, 9939686, 9735022, 9172735, 9548546, 9673296, 9131066, 9033161, 9007964, 8883419, 8515976]
14120H515976R2330l11775J66029m06192J36285k17295j18652j20585k84209J4245
14110G466157k6367K03922j42593l55653j27961Q7303J9540l25957J15090o1252
14100F852229j11491j90715j62156M81959m88988o0915l08422K0277K0905J79664
14090F232347l22402K34121n19900K35138j90872n0477L9589l52957K72628l82587
14080E194628q6032R9220l5519j38797m0761J81425k80131M2842J20680m26380
14070D631175N3524j07858n9008K66262k99861L32394l41534K44530m38025K9406
14060D311005P2809j27293M3786K80921l97570j01100k25776K87440j0504k40361
14050C893357j02250J91886k77213P5931L59051j57822m96179K93586j20054L42614
$$ y = [8515976, 8608306, 8296531, 8462560, 8056368, 8192653, 7975358, 7856706, 7736121, 7451912, 7466157, 7439790, 7643712, 7501119, 7145466, 7017505, 7104808, 7124348, 6798391, 6913481, 6852229, 6740738, 6550023, 6387867, 6869826, 6380838, 6319923, 6011501, 6031778, 6052683, 6232347, 5909945, 6144066, 5624166, 5859304, 5668432, 5617955, 5657544, 5304587, 5577215, 5194628, 5108596, 5207816, 5172297, 5033500, 4992739, 5174164, 4894033, 4936875, 5057555, 4631175, 4684699, 4576841, 4517833, 4784095, 4484234, 4816628, 4475094, 4719624, 4281599, 4311005, 4383814, 4256521, 4300307, 4581228, 4183658, 4082558, 3856782, 4144222, 4133718, 3893357, 3791107, 3982993, 3705780, 3781711, 4140762, 3982940, 3486761, 3780347, 3660293, 4002907]
14040D002907l32872L09K52825o31629J96399O4680l54947K90822m1752j61052
14030C285690j12751L7371J25085j50159O3226j48516j19582K62906m3962k90823
14020B908485k16749K79460k39233L89999l60494k5545N3030r746q4775j941Q6247
14009B778738K5002j62473l0675j17703p6080K71305j12826J06535k16244n0783
13999B414796J3805l7851k57971O33726n75072N69701j92877j6845L02995M13079
13989C267486J168712L090358P163461J4688625J4815776j4397022j3132440o526365
13981A0138591l241476j024306j135933o81399o0094l63865l66795m0722l36918
13972B887083j22145K6734n022k86118J68244n9832j38232J75438l270l64719
$$ y = [4002907, 3670035, 3670344, 3923169, 3291540, 3487939, 3552619, 3197672, 3488494, 3446742, 3285690, 3172939, 3210310, 3335395, 3185236, 3248462, 3099946, 2980364, 3243270, 3199308, 2908485, 2691736, 2971196, 2731963, 3121962, 2761468, 2735923, 2788953, 2779207, 2694432, 2692491, 2778738, 2803740, 2641267, 2610592, 2492889, 2416809, 2688114, 2575288, 2681823, 2465579, 2414796, 2428601, 2390750, 2132779, 2766505, 2191433, 2761134, 2568257, 2551412, 2854407, 3267486, 4436198, 7526556, 14690017, 29378642, 44194418, 29797396, 16664956, 10138591, 6897115, 5872809, 4736876, 4055477, 3995383, 3631518, 3264723, 3224001, 2887083, 2764938, 2791672, 2786650, 2500532, 2668776, 2608944, 2470712, 2646150, 2642880, 2278161]
13962B278161N0874j11449Q5032n7178k4315J73773J06246l09688Q5863J59520
13952B436839l60197K30284p8470r3355m1494q066j4890K85818k27336j0108L017
13941B122042n2659N3190m71886K32214J98378j04928j53996J79324r4949j13886
13931A792844p3337r2503L51701k10330L0324J7977L39224l65877O1362n3895
13921A797490j65929l5676K7019j96925M51964k54074J30207n0929P4617k96193
13911A481571O8177N9669k06289M10120j76674J27669j82416K8012J2814n764
13901A616889r5179J6460M0644j81362J16898m5986J50127l88148M43098J04637
13891A778078k96716l62686M78735j87294j29461K9742J50825k76826J99442J54293
$$ y = [2278161, 2329035, 2217586, 2302618, 2245440, 2221125, 2394898, 2501144, 2191456, 2277319, 2436839, 2076642, 2306926, 2228456, 2135101, 2093607, 2085541, 2070651, 2356469, 2129133, 2119025, 2122042, 2069383, 2122573, 1650687, 1882901, 2081279, 1976351, 1822355, 2001679, 1906730, 1792844, 1719507, 1627004, 1978705, 1768375, 1798699, 1816676, 2155900, 1790023, 1851385, 1797490, 1631561, 1595885, 1622904, 1425979, 1877943, 1623869, 1754076, 1703147, 1777764, 1481571, 1549748, 1609417, 1403128, 1813248, 1636574, 1764243, 1581827, 1609839, 1622653, 1616889, 1521710, 1538170, 1578814, 1397452, 1514350, 1468364, 1618491, 1230343, 1673441, 1778078, 1481362, 1118676, 1597411, 1410117, 1280656, 1310398, 1461223, 1184397, 1383839, 1538132]
13881A538132J28380K32145l87707j67158J46930n3534r7951j12861K64323l27877
13871A162822k33609J82939J50597N8620J74735k41564j11224J68433n736K57455
13861A563468k38998l09674K46427n0345k46241K16031P852J39027l6578j7638
13851A273331M02820l71199m90433K19983j09641K06826k62356K71881J78811
13842A320023k39667l0813J02105o9679J90728l08348k89532M36109k59722Q1647
13832I32851q1963J49457K82851n48228J06167k7477L04720k04062j41717L16678
13822A089277Q5787L2272l2095j96797K19072n34857N66789l29680J04374j51688
13812H52454k06947L40405J53381l03821J1273J11620L9635J02581k19164J6004
$$ y = [1538132, 1666512, 1898657, 1510950, 1343792, 1490722, 1437188, 1339237, 1226376, 1490699, 1162822, 929213, 1112152, 1262749, 1321369, 1496104, 1254540, 1143316, 1311749, 1306013, 1563468, 1324470, 1014796, 1261223, 1210878, 964637, 1180668, 1188520, 1327547, 1290969, 1273331, 1676151, 1304952, 814519, 1034502, 924861, 1131687, 869331, 1141212, 1320023, 1080356, 1049543, 1151648, 1081969, 1272697, 964349, 674817, 1110926, 851204, 932851, 850888, 1000345, 1283196, 734968, 841135, 813658, 1118378, 914316, 772599, 1089277, 1175064, 1207336, 1175241, 978444, 1197516, 662659, 1229448, 899768, 1004142, 852454, 645507, 985912, 1139293, 835472, 846745, 958365, 998000, 1100581, 881417, 897421]
13802H97421Q4959n2448P0073k95964K17192J16002j23852J93919m08913J05202
13792H03591J26694r4277k89824L31947J2498O3909j53480j00603M99914n25355
13782F75014N05483r0715k62061J23943k98100J73017J41943j22134k47643K77135
13772H75882K3169r7352j19697O4417J99041k09681j11606K54149k68662L19636
13762I29296o0167j59538J6227K00433k46998j13320J61593l02367M98509l25591
13752E98077m0567J27475k3711K98519j84919J61221o9392k05966O1212J32606
13742H54555l40040J79422j11014K78175C00529L96225K5952m7712M4998N7210
13732G77202l02551N55056k85407J58375j71825J52177j27927j22070M24669l65997
$$ y = [897421, 982380, 929932, 1000005, 704041, 921233, 1037235, 913383, 1107302, 698389, 803591, 930285, 836008, 546184, 878131, 890629, 954538, 801058, 700455, 1200369, 675014, 1180497, 1089782, 827721, 951664, 653564, 826581, 968524, 846390, 598747, 875882, 899051, 801699, 682002, 746419, 945460, 735779, 624173, 878322, 609660, 929296, 869129, 709591, 725818, 926251, 679253, 565933, 727526, 425159, 923668, 598077, 557510, 684985, 661274, 959793, 774874, 936095, 866703, 660737, 721949, 854555, 514515, 693937, 582923, 861098, 300529, 696754, 722706, 674994, 719992, 777202, 474651, 1029707, 744300, 902675, 730850, 883027, 755100, 633030, 1057699, 691702]
13722F91702L7006o5047N2045j63376O3937B10422L45004l0261j63923J95094
13712E56336P5071n3979L9663r2822J06657l7628K03473D7426M40926J47014j89661
13701D45705j57371O57897k96057J11386k94373R4194m6253J71575k81098J68396
13691E74001j66583R7105K29277R5405k15390q4883p1821L5873L08619C62950
13680F54474n6118M07765l97036J26630P513M5128l41629M8904K750J62334j53134
13669E07581q8754J19632K51152J74557j88823B99701K12079J36356L08462m63272
13659D93326G9590K49943M29496l02747j58310M9308K42447k81041J05084J32376
13649E46146k59218R0598J25175J203l0826J53609A50515N9796r186J90668J16367
$$ y = [691702, 728708, 663661, 715706, 552330, 616267, 210422, 555426, 525165, 361242, 556336, 631407, 577428, 617091, 524269, 630926, 593298, 796771, 47426, 488352, 635366, 445705, 288334, 946231, 650174, 761560, 467187, 561381, 515128, 686703, 405605, 574001, 407418, 504523, 733800, 829205, 613815, 528932, 457111, 492984, 801603, 362950, 654474, 598356, 1006121, 609085, 735715, 743228, 788356, 446727, 495631, 498381, 660715, 507581, 418827, 538459, 789611, 964168, 775345, 299701, 511780, 648136, 956598, 493326, 79590, 329533, 759029, 456282, 297972, 347280, 589727, 308686, 413770, 546146, 286928, 377526, 502701, 503904, 473078, 626687, 150515, 210311, 201125, 391793, 508160]
13638E08160J87834j37516K5730l8838k17873J95826K40225C37273J92458r3832
13628D35899j50716N8017j35794K26542J45888k50066J45520k04505K45510H7575
13617B07412K30866l4701n4936N8878J04710k21359J39959m4167J28768k46259
13607B69171K27889j1510J14269m9903j56692J35382j11939R5948J41229l08622
13597C45222J61203J38241j44681J8910k20475L6119R1295J99182k03511J14710
13587E36215B07180K46094E7573L12855K5759j45615Q3492K69103j71822A12964
13576B37708c7070B99763K43647k59901K6840J82756J17928j10752j75316p4183
13566B50782P1131N9477K62381Q6489k82197E3774N78869A08167J01460J00421
$$ y = [508160, 695994, 558478, 584208, 545370, 327497, 523323, 763548, 337273, 529731, 435899, 285183, 343200, 207406, 433948, 579836, 329770, 475290, 270785, 516295, 87575, 207412, 438278, 403577, 348641, 407519, 512229, 290870, 430829, 386662, 515430, 269171, 497060, 485550, 599819, 549916, 393224, 528606, 416667, 512615, 653844, 345222, 506425, 644666, 499985, 518895, 298420, 334539, 425834, 625016, 421505, 536215, 207180, 453274, 57573, 370428, 396187, 250572, 334064, 603167, 431345, 112964, 237708, -37070, 299763, 543410, 283509, 310349, 493105, 611033, 500281, 324965, 250782, 321913, 381390, 643771, 730260, 448063, 53774, 632643, 108167, 209627, 310048]
13556C10048O1667l9461J4723J04286j18221R9845J09633B10118A1117J964J31248
13545A44329j731M75403j39010j97682A32634J21707L43726j19212n4052j30675
13535B94128L13755k78886A13724K56574A85083J02202M7406J88074O257j16980
13525D12042I1380K11447R1629p3791L7893l7253m3547P7707J37575k12424K17347
13514D97963J08089k82032L8897r9146Q8072o6151K45083g1536A96528K99013
13504D95541C1345K74954J48850B10120J10827k5105L32342j78879j07067A70469
13493D01519j25562A13445L53910k8372A59460j9360J64869j46143L17474j36527
13483C39773J30478j19850A24270L96201n7753a23379D2365L41511A32697J9899
$$ y = [310048, 371715, 332254, 346977, 451263, 333042, 432887, 542520, 210118, 11117, 13081, 144329, 142598, 618001, 478991, 281309, 132634, 254341, 598067, 478855, 424803, 294128, 607883, 328997, 113724, 370298, 185083, 287285, 334691, 522765, 529022, 412042, 91380, 302827, 394456, 320665, 358558, 321305, 277758, 355465, 493040, 280616, 497963, 606052, 324020, 362917, 263771, 351843, 285692, 530775, -71536, 196528, 495541, 31345, 306299, 455149, 210120, 320947, 295842, 628184, 449305, 342238, 170469, 401519, 275957, 113445, 467355, 438983, 159460, 140100, 304969, 158826, 476300, 339773, 470251, 350401, 124270, 520471, 462718, -123379, 42365, 383876, 132697, 152596]
13473A52596K06337l8797A17563j7849J84361K83017A72913J82290A00536K96933
13463C97469A69334p7963J69864Q1828J39140E7591J30093K60904j47216l015
13453B98357R6450O0655B9654N29617B76613D3018L93543A27267J00702r6509
13443A31460J04983j3927q2784K93408N8383k8709J64702A81407O4396J28990
13433C74793j59030O5892J51413M6505A85022M39757k35150m2145B8183L25844
13423C54027j47671l3696K83082Q9536j92532j49488g7162B2356J77549J65314
13413C65219c6180B77192A15330K8167J50742a13025A84729c09253a05183A70357
13402E19604B8297K89952D0813a6261A44985Q0510J03578q9176q3241J0188M4863
$$ y = [152596, 358933, 320136, 117563, 99714, 284075, 567092, 172913, 355203, 100536, 397469, 169334, 91371, 261235, 343063, 482203, 57591, 187684, 448588, 301372, 298357, 394807, 455462, 29654, 559271, 276613, 43018, 436561, 127267, 227969, 131460, 236443, 222516, 139732, 433140, 491523, 462814, 627516, 181407, 245803, 374793, 215763, 281655, 433068, 479573, 185022, 624779, 389629, 347484, 28183, 354027, 206356, 172660, 455742, 545278, 352746, 203258, -77162, 22356, 199905, 365219, -36180, 277192, 115330, 143497, 294239, -113025, 184729, -309253, -105183, 170357, 519604, 28297, 318249, 40813, -16261, 144985, 225495, 329073, 239897, 156656, 166844, 211707]
13391B11707J4803G5214L4455h6957B8208e8549E35540a11853D43409N7823J39943
13380F41175f8549C11563n2562p4009J04861B1510L27383A70439p3551m7563J69212
13369B18537K38393j98854J24839H6509J55561j1787K78655A02460J82186F5581
13358B81051A10839c1236F3481K19992a1847C39565A16826O6852J0889N5280P9535
13347C29382K54644A31959K94843r3317J53697c6813C50747A28399K64355A77547
13336C16148q2542J07441l6075A35595J74569A27690j101N2523J33264o3830E1299
13324a7978B32402K91378A01335K02204J3562o6005K91399E7658H026L21527o911
13313C22642A52309g8788B84590A5979J80574I0462J60978r3153I212N1003J57369
$$ y = [211707, 226510, 75214, 109669, -86957, 28208, -58549, 535540, -111853, 443409, 501232, 641175, -68549, 311563, 259001, 184992, 289853, 21510, 348893, 170439, 96888, 49325, 218537, 456930, 258076, 382915, 86509, 242070, 230283, 508938, 102460, 284646, 65581, 281051, 110839, -31236, 63481, 283473, -11847, 339565, 116826, 183678, 194567, 249847, 329382, 584026, 131959, 426802, 333485, 487182, -36813, 350747, 128399, 392754, 177547, 316148, 233606, 341047, 304972, 135595, 310164, 127690, 126589, 179112, 312376, 248546, 51299, -17978, 232402, 523780, 101335, 303539, 317101, 251096, 542495, 57658, 8026, 329553, 322642, 152309, -78788, 284590, 15979, 196553, 90462, 251440, 158287, 9212, 60215, 217584]
13302B17584o1757K33071A4849J82400C9035c6460J7216D55361C3525a4975D24931
13290D32937B07879L4544G2570K6490L46601H5291O894D0300a12492A40327l7665
13279A02662D8274J80818e6358C06392a9680j35076F3709N4875A0049R3307J36619
13268B39975H2879a44572E2645J36556I2456b46748E8103L13192q0148J90720
13258D81867G0795M26048b42762Q6566D26422A34521i8388A34444K11228F4908
13247c2397D97580A50657a57015A5462O8247L63629G8254K7451L01563j37921
13237B69347J06688p0315A27838e3344j756j57903D88559r5157A46945c884B35723
13225A36613h8783F9327J44741a1095j47427A84181j1646o5499j7298N00826j40654
$$ y = [217584, 155827, 388898, 14849, 197249, 39035, -36460, -19244, 455361, 33525, -14975, 424931, 432937, 207879, 242423, 72570, 99060, 445661, 85291, 92185, 40300, -112492, 140327, 102662, 48274, 229092, -56358, 306392, -19680, -154756, 63709, 118584, 10049, 103356, 239975, 82879, -144572, 52645, 189201, 92456, -246748, 58103, 371295, 291147, 481867, 70795, 496843, -242762, -156196, 426422, 134521, -98388, 134444, 345672, 64908, -32397, 497580, 150657, -157015, 15462, 83709, 447338, 78254, 105705, 407268, 269347, 376035, 305720, 127838, -53344, -55100, -213003, 488559, 393402, 146945, -3884, 235723, 136613, -88783, 69327, 214068, -11095, -158522, 184181, 172535, 107036, 89738, 590564, 449910]
13214D49910O3685B35413r0867K37830o0712f7467C17570j53114a88051C1970
13203A60657d4098A67119M08921a39704o5895a6817b650n6246B68052j23287d9205
13191C53225j50222J48463A02507a94390A12578L14424c6242C2137L13793G3604
13180C1720J64610o5805m5246f2344j7122H0465K54268j03100J69154Q378p38
13169D08427a98389b9944C24323e2557H0342J62640o5459a12736k0432p8122D40384
13157a34051E69301I7354f3770A94973B9476J19136L7568d537A33432j0524J91506
13146C14414r8571J56025p4777a73084c3638A19846B2411J50478J4771J87945
13136C75605o7367F8800N0756a2196r919E8285P3771J47840j1122K436m723I9109
$$ y = [449910, 513595, 235413, 144546, 382376, 321664, -67467, 317570, 164456, -188051, 31970, 160657, -44098, 167119, 576040, -139704, -205599, -16817, -2650, -58896, 268052, 144765, -49205, 353225, 203003, 351466, 102507, -194390, 112578, 427002, -36242, 32137, 345930, 73604, 31720, 196330, 130525, 85279, -62344, -79466, 80465, 334733, 231633, 400787, 409165, 408427, -198389, -29944, 324323, -52557, 80342, 242982, 177523, -112736, -133168, -211290, 440384, -134051, 569301, 97354, -63770, 194973, 29476, 148612, 186180, -4537, 133432, 122908, 314414, 215843, 371868, 297091, -173084, -33638, 119846, 22411, 172889, 187660, 375605, 308238, 68800, 119556, -12196, -22115, 58285, 132056, 279896, 268774, 271210, 266487, 99109]
13123E168K18032o2431R6816g1845b8134A11738a53536D0183q193i7486A85398
13111C06171d0201p5403A21602B7030P7153J00232C131i3824B72026j27400E9854
13099A03086J3501N3215R5849a0026k22887g6167B19389I0022N21425k93168g5897
13087a89228K451B16350H9349b28257i0525A00334g8898L1484B18305c34704f0054
13075H0689a42742j0489H2537L00198C4316a44510C02333I3556I420J52719m8901
13064A13238K1579a02260H4194K47752F6494J17004J09613E8187J74326J51452
13054C83965A81003g0142I3768J90191r8702Q8864i7535C05367E7297N0159K71657
13043C79113D4218J32645P1799a15356j7742F6949J66728D0270J74701l6789E7118
$$ y = [5168, 223200, 160769, 257585, -71845, -28134, 111738, -153536, 40183, 31990, -97486, 185398, 306171, -40201, -115604, 121602, 27030, 104183, 204415, 3131, -93824, 272026, 144626, 59854, 103086, 116587, 169802, 265651, -10026, -232913, -76167, 219389, 90022, 611447, 318279, -75897, -189228, -186777, 216350, 89349, -228257, -90525, 100334, -78898, -47414, 218305, -334704, -60054, 80689, -142742, -153231, 82537, 382735, 34316, -144510, 302333, 93556, 9420, 162139, 113238, 134817, -102260, 84194, 331946, 66494, 183498, 293111, 58187, 232513, 383965, 181003, -70142, 93768, 283959, 185257, 274121, -97535, 305367, 57297, 107456, 379113, 44218, 176863, 248662, -115356, -133098, 66949, 233677, 40270, 214971, 178182, 57118]
13031D05518g9546A6424i1071a7858A91216L83535e71912A41513L9651D2288K97452
13020C39740n0306A23532M6176b45370F0811J4269J81748a20357L9569D3290J85105
13009B28395I8352M1337K13663B2307J28739R5258a05870E21143A27942E8291
12998a14684A14145I917J53916f0660m05A7287b11345B23666j08585J39118b0457
12986a0519B66313c32860c5903B16662K06803j04029a5253A60940E6909b4887
12975b59408H0730J84671O8837C2986K49916J28550a23301C17275H7257g3140
12964C11880m6926H5184a57042k01826F4714L15583a6773B06323j3543n7060c2845
12952a66391A01342D2853f2211B9046i0712d5144F7290J46819b10958K0449e2313
$$ y = [405518, -79546, 16424, -91071, -17858, 191216, 574751, -571912, 141513, 181164, 42288, 339740, 289434, 123532, 169708, -245370, 60811, 75080, 256828, -120357, -80788, 43290, 228395, 98352, 139689, 353352, 22307, 151046, 246304, -105870, 521143, 127942, 58291, -114684, 114145, 9917, 163833, -60660, -61065, 17287, -211345, 223666, 115081, 254199, -20457, -10519, 266313, -332860, -35903, 216662, 423465, 319436, -15253, 160940, 56909, -24887, -259408, 80730, 265401, 334238, 32986, 282902, 411452, -123301, 317275, 87257, -73140, 311880, 264954, 85184, -157042, -358868, 64714, 380297, -16773, 206323, 192780, 135720, -32845, -166391, 101342, 42853, -62211, 29046, -90712, -45144, 67290, 214109, -210958, -190509, -52313]
12940a38702D332J45013a91691D2519O3987K06105l4833f8514j24583A34999J14377
12929B49376I748b63403A77937a1622F873M79375E0204a08252D31811H6638c4007
12917D4842N6289e5288C12055j52298J38359E9111f237C69776f657j80704h5656
12905B3121r463M1467b1753C00931A15457d8903j8141D5739J04355g1719a5445
12893A43963e9924K8081D30877D6857J17783F1403b4222C68079E262f4845D31205
12881A66194D3934a0774j20868A12924K33035j221a17045D66563a68329I4348
12870a14421r7761A45478m7400a36254B65034A20835J15372m8384I770O1337c15631
12858C1390L24631a65137A16395J08878a06104a8362B20089b70616I8181i0617
$$ y = [-138702, 4332, 149345, -191691, 42519, 106506, 312611, 277778, -68514, -193097, 134999, 249376, 9748, -263403, 177937, -11622, 6873, 486248, 50204, -108252, 431811, 86638, -34007, 44842, 101131, -55288, 312055, 159757, 298116, 59111, -6237, 369776, -6657, -187361, -85656, 23121, 13658, 55125, -21753, 300931, 115457, -48903, -67044, 45739, 150094, -71719, -15445, 143963, -59924, -31843, 430877, 46857, 164640, 61403, -24222, 368079, 5262, -64845, 431205, 166194, 43934, -10774, -131642, 112924, 345959, 344738, -117045, 466563, -168329, 94348, -114421, -212182, 145478, 98078, -136254, 265034, 120835, 236207, 187823, 9770, 71107, -315631, 31390, 356021, -165137, 116395, 225273, -106104, -18362, 220089, -270616, 98181, -90617]
12847C64220F4404J7624N5734E4825c5990j01650I5398j495g6419A38455J00766
12836B39221i4934A53302o2024D3389K69527a35961C29129b91288A46700j8060
12826A28640m2354J10225h0838E0542F725a7539B57893b43737R9356C78996a49344
12814E48203I9372m1034N0601J20316l5396F1085b98919b4525A16700B2163J57178
12803A79341C4628m313b81201r92b7146j72984E9953L5536c7788H2156J48658
12792B30814J1373a50611c093k77126C2601g5833H0366J4356e9468B72731j15387
12781A57344b49686L1110D11873j53840G5113L06330C9530K73579A18001B6004
12770B99355a4734k29645B10344J8270a80969B97353j28065E715J14932m3609
$$ y = [364220, 64404, 82028, 137762, 54825, -35990, -137640, 95398, 93903, -76419, 138455, 239221, -94934, 153302, 91278, 43389, 312916, -135961, 329129, -291288, 146700, 128640, 86286, 196511, -80838, 50542, 6725, -17539, 257893, -243737, -144381, 378996, -149344, 548203, 99372, 58338, 108939, 229255, 193859, 61085, -298919, -24525, 116700, 22163, 179341, 34628, 30315, -281201, -282193, -27146, -200130, 59953, 95489, -37788, 82156, 230814, 242187, -150611, -3093, -280219, 32601, -75833, 80366, 94722, -59468, 272731, 157344, -249686, -218576, 411873, 258033, 75113, 381443, 39530, 313109, 118001, 26004, 299355, -14734, -244379, 210344, 228614, -180969, 297353, 169288, 5715, 120647, 77038]
12760G7038a47724F5597J32927H2280f873A58762b5453j86502P7221b241j5242
12749a7483n1026o0731d5045n9950A47910c39225h3994B01582r1111J2328h4360
12737I0076B9056K02130o325e9477m2283C26733F0983J33040A4639K35555d03089
12725F4986d70681F7891b55725J00263P1829o3881I3377Q4573a38887B03634G7407
12713E8500d9315A97154G6100j0688K46697E600L92289I9777K19850I9987a6698
12701B92669A20452J54865H6351L8877L25524b33222a9034A6113K6330L4578K68569
12690C45590m7237l5769f6935B68017e940j63937c9517D2627A0768K20659G7658
12678d42C54845H851J40246K8133J41813J13605i924l1210k7855p7868R404O8330
$$ y = [77038, -147724, 65597, 198524, 82280, -6873, 158762, -25453, -211955, -134734, -2241, -17483, -68509, -129240, -45045, -104995, 147910, -339225, -83994, 201582, 110471, 122799, -84360, 90076, 29056, 231186, 224861, -59477, -101760, 326733, 60983, 194023, 14639, 250194, -403089, 64986, -470681, 67891, -255725, -155462, -83633, -147514, 93377, 177950, -138887, 203634, 77407, 58500, -49315, 197154, 76100, 65412, 312109, 5600, 397889, 99777, 319627, 99987, -16698, 292669, 120452, 275317, 86351, 125228, 450752, -233222, -19034, 16113, 42443, 77021, 345590, 298353, 262584, -66935, 268017, -5940, -169877, -39517, 42627, 10768, 231427, 77658, -442, 354845, 8851, 149097, 177230, 319043, 432648, -9924, -41134, -68989, -146857, -137453, -69123]
12666f9123d411B48571G5743C0461a96286A0079L58324A59450a8769E32158B2472
12654E17222A17314j1651M08071j89198e8396A2381M8887J39430J0097b57419
12643A50868P133g2534A82504a16674A39164a13275C63649a09308B0040K74436
12633B94476j25848e2845A76681b7153D20374j05350c24703A34676j4274K81068
12623D01470J98921F2284i8399A72324b4233A66516a00156A53959H527K53645
12613B62172b54764f9607B789a00228j20737a2100B170b4721n0831L1902D9363
12601C6010J4852a06129C44003j4775q1615j08098d03838A56039F5666L14585
12591C80251a2044j02406A17117J18764r8991M0971q0422J98903A14609k6050
$$ y = [-69123, -4411, 248571, 75743, 30461, -196286, 10079, 368403, 159450, -18769, 532158, 22472, 517222, 117314, 105663, 513734, 324536, -58396, 12381, 61268, 200698, 210795, -257419, 150868, 158001, -72534, 182504, -116674, 139164, -113275, 363649, -109308, 20040, 294476, 168628, -52845, 176681, -27153, 420374, 315024, -324703, 134676, 120402, 401470, 600391, 62284, -98399, 172324, -24233, 166516, -100156, 153959, 8527, 262172, -254764, -69607, 2789, -100228, -220965, -12100, 2170, -24721, -75552, -43650, 49363, 36010, 50862, -106129, 344003, 329228, 247613, 139515, -403838, 156039, 65666, 380251, -12044, -114450, 117117, 235881, 136890, 177861, 97439, 296342, 114609, 88559]
12581H8559N7807m7373c21492e1030B46996k1499J37385H6992j7629b06265C44889
12569a47786K7229C35713F5857J1585b03455e5004b4734A7261b07164I775R7047
12558A06822J29085A8091f314j22018B35268r1973m3867K01969i4330B69232k0453
12547B48779F5077b62904G12a50479H9660c6332o2059p968k61620a9839G8281
12535i8435p4207j61206d1269D2941J82905H2550J6804j6554R7544J04919f2030
12523A5506f147D11249b38617i2367j9506A29573i3138A24524J46487F8645C1141
12511C6736a267A59138a57973P8010k0660q1265B09907a46433A08185L7986A5162
12499B28416a78836D33642J65386f7933B1954L58711M1362b92535A37025a13291
$$ y = [88559, 146366, 98993, -321492, -51030, 246996, 225497, 362882, 86992, 69363, -206265, 344889, -147786, -120557, 335713, 65857, 77442, -203455, -55004, -24734, 17261, -207164, 9775, 106822, 235907, 18091, -6314, -128332, 235268, 143295, 99428, 301397, -94330, 269232, 248779, 65077, -262904, 712, -150479, 89660, -36332, -98391, -106359, -367979, -19839, 78281, -98435, -172642, -333848, -41269, 42941, 225846, 82550, 99354, 82800, 180344, 285263, -62030, 15506, -6147, 411249, -238617, -92367, -111873, 129573, -93138, 124524, 271011, 68645, 31141, 36736, -1267, 159138, -157973, -79963, -100623, -181888, 209907, -146433, 108185, 146171, 15162, 228416, -178836, 433642, 599028, -67933, 21954, 380665, 422027, -292535, 137025, -113291]
12488b3247B31587e7969A95218F100d5083o2727I9025j1018a13390L7107j53408
12477b29691o8667A72162f8534G9011E309i7281k32485C1729a9601l3192j38672
12466a91465A83459b55518A14821M4593h8115j47934B3756a3164n1425A51658
12455a16222m4637A21717b07079F9884a8921B7288K05085R7385b08588A558J81452
12444A83010c10688c8564n5086A11920A5567O7887g8281A12238l5935b04736f1387
12432b14105q4518D36552c24862B02073C0500O325O8221f9212J1413K8664A25253
12420c819m6256H6128a84161A59285b0955E7133a03549L6693C83674j73034a67675
12408b75455A07591a09954D02749A49316g7803r4575a2043k02237C38817a47366
$$ y = [-23247, 231587, -57969, 195218, 6100, -45083, -107810, 99025, 88007, -113390, -76283, -229691, -298358, 172162, -68534, 79011, 5309, -97281, -329766, 31729, -19601, -52793, -191465, 183459, -255518, 114821, 159414, -88115, -236049, 23756, -13164, -64589, 151658, -116222, -160859, 121717, -207079, 69884, -18921, 27288, 232373, 329758, -208588, 1558, 183010, -310688, -38564, -93650, 111920, 15567, 83454, -78281, 112238, 76303, -204736, -61387, -214105, -298623, 436552, -324862, 202073, 30500, 36825, 105046, -69212, -57799, -29135, 125253, -3819, -50075, 86128, -184161, 159285, -20955, 57133, -103549, -66856, 383674, 210640, -167675, -275455, 107591, -109954, 402749, 149316, -77803, -172378, -12043, -214280, 338817, -147366]
12397a39762b8782j96401f9211k10599C1389J15460m5678B0510a01147b9597I2606
12385E0506c3177B9348d8917I8644a9650B99015c36485a29577J2113a7769A48726
12373B32553b66441c2923j41413C5449e743G489N6497a08267E9276f7428F0736
12361E3546K5395M1012a67571J1068C944a20632k40232c9438k4033B3350J707
12350B5057M2388K45471H306K22089D7288b22206B87757A6270d7994j10675A66558
12338C15750b2394r3635C8788K23888q8260i7263M4693m0535A82695P3076C9265
12326H5666L4831b31237A99957Q4006G8657a6689j35072a5409C9997J61304d44215
12314A64797L3617q0359h2299A56957G5882B7948d6677A05559a13927h357k16294
$$ y = [-139762, -28782, -225183, -69211, -279810, 31389, 146849, 101171, 20510, -101147, -29597, 92606, 50506, -33177, 29348, -48917, 98644, -19650, 299015, -336485, -129577, -117464, -17769, 148726, 232553, -266441, -32923, -174336, 35449, -5743, 7489, 63986, -108267, 59276, -67428, 60736, 53546, 78941, 119953, -167571, -156503, 3944, -120632, -360864, -39438, -63471, 23350, 25057, 67445, 312916, 8306, 230395, 47288, -222206, 287757, 16270, -47994, -158669, 166558, 315750, -22394, -116029, 38788, 262676, 174416, -97263, -52570, -93105, 182695, 255771, 39265, 85666, 120497, -231237, 199957, 283963, 78657, -16689, -151761, -15409, 39997, 201301, -444215, 164797, 198414, 118055, -82299, 156957, 75882, 27948, -46677, 105559, -113927, -8357, -224651]
12303b24651C8228R3698j1541L4303b78233J29744F9143J9921K64758A35301a02310
12291D51596A22575b84886B08343c3593B89560j39793d650k71395a5727A05365
12280a0031A15620b1169B50069D0623J24856d8269A86145L48116B02670a53600
12269C03040j21272K25854C080J46185g0122l64297H0793a6256r0372A43642L4811
12258A78453b89786a0767j687j04166D5503P4022h8888I8410K06972A31665m0087
12247I1578l3597J22801b99743K0253B50512p8460N1375a21160j319A3067R1585
12236A04652R4395G6359a99283D26660j15851l8644A31520L47910A03553D9180
12225B08223L45482A50554B4091J21132K03163J38359f9676p8905L0002j24090
$$ y = [-224651, 38228, 131926, 120385, 154688, -278233, -148489, 69143, 89064, 353822, 135301, -102310, 451596, 122575, -284886, 208343, -33593, 289560, 149767, -4650, -276045, -15727, 105365, -10031, 115620, -21169, 250069, 40623, 165479, -48269, 186145, 534261, 202670, -153600, 303040, 181768, 407622, 3080, 149265, -70122, -434419, 80793, -16256, -106628, 143642, 178453, -289786, -10767, -12454, -116620, 45503, 119525, -88888, 98410, 305382, 131665, 91578, 57981, 180782, -299743, -279490, 250512, 172052, 223427, -121160, -122479, 13067, 104652, 199047, 76359, -199283, 426660, 310809, 272165, 131520, 479430, 103553, 49180, 208223, 553705, 150554, 24091, 145223, 348386, 486745, -69676, -148581, -118579, -242669]
12215b42669C1258J30729o1242K0292K5617k6587P0451B5034b28887g9498B36401
12203B72385K29089A42722f8629A06305a95360H0133J59650c16209D40930j77357
12193B63573K3358n2343H046J31213k2574L74832a18505C43037E2296R8557C5524
12181B3231M1637k563L87374j97386N2211m6868G6251K69426A17680l4567K35071
12170C18184G9716J33413b5799j80419C47919A13668K0588a26159F6010J69931
12160B35941J43435A16347F093c3021j12473A45567h8015m5388b267H7118J48086
12149B35204G421b43581q6163H7378a05163L8606B32276A08432j8706d7943B4567
12137d4424B82206E3230a49487q1596B06295i722o8201L2998m45227A03742d0558
$$ y = [-242669, 31258, 161987, 100745, 121037, 146654, 120067, 190518, 25034, -228887, -79498, 236401, 272385, 501474, 142722, -68629, 106305, -195360, 80133, 239783, -316209, 440930, 263573, 286931, 234588, 8046, 139259, 116685, 491517, -118505, 343037, 52296, 150853, 35524, 23231, 64868, 62305, 449679, 252293, 304504, 257636, 76251, 345677, 117680, 83113, 318184, 79716, 213129, -25799, -206218, 347919, 113668, 134256, -126159, 66010, 235941, 379376, 116347, 6093, -33021, -145494, 145567, -88015, -133403, -2267, 87118, 235204, 7421, -243581, -329744, 87378, -105163, -66557, 232276, 108432, 89726, -47943, 24567, -44424, 282206, 53230, -149487, -231083, 206295, -9722, -77923, -44925, -490152, 103742, -40558]
12125B80087b47990A88686H8391m1897b8852j07614D6897b446I7714B6358d7758
12113E2413a472D4504M57310A88522J37643e430C53829B1224b36436O1280O0438
12102a14718M5119J3005q7495I4034b57419E4946A9019g4154A28341b29033c134
12090B03638H7741c00982a05840A35074e6915A89020a35809d8307j87314B55950
12079e2182l40049a27362A62828d0775A26670m1035L0437a20442E6424c4320A60458
12067A3643M68894M5131O17256E14092b17236B51192F8216c9430k8816k03203
12057b71449c8187A63619j9260J04906b03181A92703b6463I5578d8179q5924K1739
12046a12364j13406C6492a52746H0393a61875I7843c369I0033e864l3988j81492
$$ y = [280087, -247990, 188686, 88391, 46494, -28852, -136466, 46897, -2446, 97714, 26358, -47758, 52413, -1472, 44504, 501814, 188522, 326165, -5430, 353829, 21224, -236436, -175156, -114718, -69599, -56594, -144089, 94034, -257419, 54946, 19019, -74154, 128341, -229033, -3134, 203638, 87741, -300982, -105840, 135074, -56915, 189020, -135809, -48307, -235621, 255950, -52182, -392231, -127362, 162828, -40775, 126670, 85635, 116072, -120442, 56424, -34320, 160458, 13643, 482537, 527668, 1144924, 514092, -217236, 251192, 68216, -39430, -68246, -271449, -38187, 163619, 144359, 249265, -203181, 192703, -26463, 95578, -48179, -134103, -112364, -225770, 36492, -152746, 80393, -161875, 97843, -3369, 90033, -5864, -39852, -221344]
12035b21344B38573c9728D6503J15614n9943c20390i5321B02210b21664j61971
12025c83635D1907b14306C7254c87173A49420a92010e7799l4727k88402B4493
12014b25455p429M2341M4991B4788K91706B7656e5192j0970B12156E8239M1256
12003I9495a6646k13001e7496k04835A69823a34093j11640j4564H3064h9284k57862
11992c47146A85028M346C248J71158b75974P3684A28862h1804b8083j37737H1508
11980B83178I3822b08751R7742a0162r8785C26751l9987a38346Q055O1659o8007
11969a36639c2269A80260K3140b68974f7586A70836K19433b1319G5787a06004
11958a44607A08419a59158B1593g8928B71798r0796F2898L833L15106F5480b70935
$$ y = [-221344, 238573, -39728, 46503, 162117, 102174, -320390, -95321, 202210, -221664, -383635, 41907, -214306, 37254, -387173, 149420, -192010, -57799, -92526, -380928, 24493, -225455, -232884, -190543, -145552, 24788, 316494, 27656, -55192, -66162, 212156, 58239, 99495, -16646, -229647, -57496, -262331, 169823, -134093, -245733, -260297, 83064, -89284, -347146, 185028, 189374, 3248, 174406, -275974, -202290, 128862, -81804, -28083, -165820, 81508, 283178, 93822, -208751, -111009, -10162, -108947, 326751, 286764, -138346, -130291, -68632, -136639, -32269, 180260, 203400, -268974, -67586, 170836, 390269, -21319, 75787, -106004, -144607, 108419, -159158, 21593, -78928, 271798, 181002, 62898, 66731, 381837, 65480, -270935]
11946D44275C8413a59938E621L08048A524L06201E9194k689P0278g6079I4637
11934b71771B00258a52804A87349q8986a14146L2741C97057I2497K0499a5836
11923A04706K32210f6435O11A11002b6950a1339l9627B46355C8293N9317g7787
11911D7057K91040A09127J36648b40107J00753B89059j13885a01590b1553l5164
11901e6717j63401A36954c9492B00658k4819b36919A06951h7510L5293k9514A99459
11889A15384C0326c68831E7499K3450j5959J03882D515P6392A3177f1661j90052
11878b51713E7763a42637k49395B5155J13366a61353j27777a31563o4B89895d8743
11866a04803C98298b24324h2870j30837C2701K07062b56288I8638b64218d0233
$$ y = [444275, 38413, -159938, 5621, 313669, 1524, 307725, 59194, 56505, 126783, -76079, 94637, -271771, 200258, -152804, 187349, 98363, -114146, -81405, 397057, 92497, 112996, -15836, 104706, 336916, -66435, -65824, 111002, -26950, -11339, -50966, 246355, 38293, 97610, -77787, 47057, 338097, 109127, 245775, -240107, -139354, 289059, 175174, -101590, -21553, -56717, -220118, 136954, -39492, 200658, 175839, -236919, 106951, -87510, -52217, -81731, 199459, 115384, 30326, -368831, 57499, 80949, 64990, 168872, 4515, 80907, 13177, -61661, -251713, 57763, -142637, -392032, 25155, 138521, -161353, -289130, -131563, -131627, 289895, -48743, -104803, 398298, -224324, -82870, -213707, 32701, 239763, -256288, 98638, -264218, -40233]
11855a30023c3341G2289k0523f3821j93572E7773a41030r4486m2801A11048m7160
11844F3888a47280k07806A2410a2690j760B76754a66737H7804c20318C331J11594
11833A14925c61840C06221I1707d83688B20071b35845D8916d7445j83045A3663
11822c853j88967E4575b3497A02221C5749j2676a46365e4800a6590A97753c62285
11810e6285K1975k84267G2753c8060j42465B4867a82584A11126b36525d8780B74241
11798c12807i4524k87718P7928a2806H7176a81896m8967C31616k1396b0522C5011
11786a32471F6263L01825j1174j73372l5024f2196B10740c6493c442B42801h3770
11774a62414H5558N0153a72339q9787B93109a71635E0467Q3752B4321a10698l645
$$ y = [-130023, -33341, 72289, 51766, -63821, -257393, 57773, -141030, -235516, -278317, 111048, 63888, -147280, -355086, 12410, -12690, -14450, 276754, -166737, 87804, -320318, 3331, 114925, -361840, 306221, 91707, -483688, 220071, -235845, 48916, -47445, -230490, 13663, -3853, -192820, 54575, -23497, 102221, 35749, 23073, -146365, -54800, -16590, 197753, -362285, -56285, -34310, -318577, 72753, -38060, -180525, 24867, -182584, 111126, -236525, -48780, 274241, -312807, -94524, -382242, -304314, -12806, 87176, -181896, -230863, 331616, 310220, -20522, 35011, -132471, 66263, 368088, 356914, 183542, 148518, -62196, 210740, -36493, -3442, 242801, -83770, -162414, 85558, 135711, -172339, -262126, 293109, -171635, 50467, 134219, 24321, -110698, -114343]
11763a14343A03084B1096j078a00015q083G0901a84859g8938D28488a41978j47626
11752b89604h5568k83571K5485a847D4453a01917H7980l5752b12585c4611H658
11740I2771L0752A6296L79348a91384i4078A85072D4901M2941a58132C9932J00293
11729A40225e3679j30903J1624b2331R56A4330a98375I750R463m336J17847a05099
11716A50670a63775A34724e6981I5662K06920D5463J2139a26741C4272L50413
11706C84685F6270i9659A73052d84124J60293A88767b4700k1265j792B46583n3476
11695A93107m9148N7453e2562j45074P6256A76899K8383o6517a75067A56727a1879
11683d7247q0219a9470o784E4261a86678d1736D16787B5333R4549J8186E9085
$$ y = [-114343, 103084, 21096, 20018, -100015, -108098, 70901, -184859, -78938, 428488, -141978, -289604, -85568, -369139, -343654, -1847, 44453, -101917, 87980, 52228, -212585, -34611, 8658, 92771, 123523, 16296, 395644, -191384, -94078, 185072, 44901, 87842, -158132, 39932, 140225, -53679, -184582, -172958, -22331, -21375, 14330, -198375, 9750, 19213, 14877, 132724, -105099, 150670, -163775, 134724, -56981, 95662, 302582, 45463, 57602, -126741, 34272, 384685, 66270, -99659, 173052, -484124, -323831, 188767, -24700, -45965, -47757, 246583, 193107, 143959, 201412, -52562, -197636, -121380, 176899, 205282, 138765, -175067, 156727, -11879, -47247, -127466, -19470, -26254, 54261, -186678, -41736, 416787, 25333, 119882, 138068, 59085]
11671E6897i533j44960r832D3128h7615j11967C27658a93460I43J12515f5084
11659C06085L5447b2215r9374C5263R2791a52227a1333j62298B23014b00332F4835
11647B42592a80168c8425k22738C8695a43719H46a75217Q0743A30518J22166a2149
11635a62275J9910A51a29862A26612a99962A74572e366B25930F3591L27096a01932
11623a62236B4814M65324h3097D15643B8536J36787l3333i166A14838A0531J97
11612A0728K88391B4009J4186e8515k53667A83819G7295B5743i9223q0059E43494
11600A79995a21839A44288e17225i670n1612F0521J86819g3079p0971b4127H3136
11588B13044L2627I1079b3986C2322O3530C8507a14970D7898K313c6661J0594
$$ y = [56897, -9533, -154493, -164325, 43128, -87615, -199582, 327658, -193460, 943, 113458, -65084, 306085, 341532, -22215, -121589, 35263, 128054, -152227, -11333, -173631, 223014, -200332, 64835, 242592, -180168, -38425, -261163, 38695, -143719, 846, -175217, -94474, 130518, 252684, -12149, -162275, -142365, 151, -129862, 126612, -199962, 174572, -5366, 225930, 63591, 390687, -101932, -162236, 24814, 490138, -83097, 415643, 28536, 165323, 131990, -9166, 114838, 10531, 10728, 299119, 24009, 38195, -58515, -312182, 183819, 77295, 25743, -99223, -179282, 543494, 179995, -121839, 144288, -517225, -9670, -61282, 60521, 247340, -73079, -144050, -24127, 83136, 213044, 245671, 91079, -23986, 32322, 95852, 38507, -114970, 47898, 50211, -36661, -26067]
11577b6067C4113g9220A02709K12982A11835J67027g7225B64296C2316J91948
11567B24264B3154J08780Q3920C6642R8418b02777A59815A9961J99761B6989J76856
11556B03845a52568C34748a77201c2748l4757n2405B26678a65815A74573o3744
11546A10829J27086d32404A9730b91234B299L0733k096J03396c4742n6404j51657
11535b42803A90039a78004l4050C3901J71031K5549L05735g9337E03927j60505
11525C43422c03862C5774N64988B4072g729B34019j09769J7427d3421m467D23960
11513C71381g6168L6740k09119H0891m0378L0678e9693G270J29500m6939B6885
11501H2648L5110E6104J34844E1474K41553H2846Q5559A507J03939b6941C12581
$$ y = [-26067, 34113, -79220, 102709, 315691, 111835, 278862, -77225, 264296, 32316, 224264, 23154, 131934, 215854, 36642, 135060, -202777, 159815, 19961, 219722, 26989, 203845, -152568, 334748, -177201, -32748, -67505, -119910, 226678, -165815, 174573, 110829, 237915, -432404, 19730, -291234, 2299, 33032, 30936, 134332, -34742, -91146, -242803, 190039, -178004, -212054, 33901, 204932, 230481, 536216, -79337, 503927, 343422, -303862, 35774, 600762, 24072, -7729, 234019, 124250, 141677, -43421, -47888, 423960, 371381, -76168, -39428, -248547, 80891, 40513, 71191, -59693, 7270, 136770, 89831, 26885, 82648, 117758, 56104, 190948, 51474, 293027, 82846, 168405, 1507, 105446, -26941, 312581]
11489B5507J60784B2520a05418B68649a01556H5331O7160B8281K6659a13206O292
11478a06914B97518A48524D2016b8374D15538j39891A021L52054q8805k765h0448
11466B7828c1838b482A3667a12593N3331B68301D8356K33077a06356K2436n4959
11455a38879c4667A66826j0753c5765B12646P0132f6860j17124A28573b8969I9731
11443H2407J9882a64079A29850i0917b8268B7839b6454e609j13852b2167n5244
11432g7411C90157j29846j23530E0940J25864o0122h2059k9865A01116J91234
11422B92350f5280E8840B4291J74583b58865h4446A93668B7131J64556F803J07296
11411A14099j5728Q5947m2860a4215D55526F0085O9602h7777D1960e176A74400
$$ y = [25507, 186291, 22520, -105418, 268649, -101556, 85331, 152491, 28281, 54940, -113206, -106914, 297518, 148524, 42016, -28374, 415538, 275647, 1021, 353075, 264270, 261505, -80448, 27828, -31838, -2482, 13667, -112593, -59262, 268301, 48356, 281433, -106356, -83920, -138879, -34667, 166826, 156073, -35765, 212646, 282778, -66860, -183984, 128573, -28969, 99731, 82407, 102289, -164079, 129850, -90917, -28268, 27839, -26454, -5609, -119461, -22167, -77411, 390157, 260311, 136781, 50940, 176804, 116682, -82059, -111924, 101116, 292350, -65280, 58840, 24291, 198874, -258865, -84446, 193668, 27131, 191687, 6803, 114099, 98371, 184318, 141458, -14215, 455526, 60085, 129687, -87777, 41960, -5176, 174400]
11399B89549a08646H067d2799C8615A4286P6125b8668P757A46190a97688M9686
11388a48002d189A3942a46720b8471C60904h0533j52139p2193B34728G252J88015
11377A95267q1622J38821r7494a04918n1390B02605B0043b62485D2408a30815
11366d6442A10195A3776R1217Q9506c57731g6016a4378I8987a08475D0498b11687
11354c19502g880j97016B20341e0134A08109Q8049c65436a64571A29917h67r3229
11343i4096C31236A9892f3508B15091f3656F5087b34435A43040N5201p4799M0632
11332A64074J17535a77476L8219A37861F7168g5659k28759J16132K282C25064
11321b26187A22859c16063b6282B55485A821d08730G4642A7319a87504d6290N240
$$ y = [289549, -108646, 8067, -42799, 38615, 14286, 90411, -28668, -20911, 146190, -197688, -148002, -4189, 13942, -146720, -28471, 360904, -80533, -232672, -304865, 234728, 7252, 195267, 113645, 252466, 154972, -104918, -156308, 202605, 20043, -262485, 42408, -130815, -46442, 110195, 13776, 104993, 194499, -357731, -76016, -14378, 98987, -108475, 40498, -211687, -319502, -7880, -204896, 220341, -50134, 108109, 196158, -365436, -164571, 129917, -867, -94096, 331236, 19892, -63508, 215091, -63656, 65087, -234435, 143040, 198241, 123442, 164074, 281609, -177476, -139257, 137861, 67168, -75659, -304418, -188286, -186004, 325064, -226187, 122859, -316063, -26282, 255485, 1821, -408730, 74642, 17319, -187504, -46290, -41050]
11310d1050a4951E1707b79990Q624j10582a51309k6098L8292j44749a16256C1495
11298c50116J40868g9805m00514C9140c70368E9384f9715G6957a5681j18578b5759
11286h2145j71679h3763C5487a68882j50278c9097o5398C1350J93509h2139A9653
11274a90000B087d01455D5125O0936K2860b43925A80239F851M3887J01753l7845
11263A14646c47979C0730J1264a03707F5523K97652b1917j53387q3383i5375A11497
11251a26465D8466A7852e6029G2073d0458K914l86930A10408i2204a1376j71959
11240a83335B1377J12749j9488b8821r4983a6453B26039p2974e59583A28120A9591
11228H2470l3303K79280E616a26177A97108I5259K7711l2141J28173f9418j75146
$$ y = [-41050, -14951, 51707, -279990, -271366, -381948, -151309, -177407, -139115, -283864, -116256, 31495, -350116, -209248, -79805, -480319, 39140, -370368, 59384, -69715, 76957, -15681, -134259, -25759, -82145, -253824, -83763, 35487, -168882, -319160, -39097, -104495, 31350, 224859, -82139, 19653, -190000, 2087, -401455, 45125, 106061, 128921, -243925, 180239, 6851, 50738, 152491, 114646, -347979, 30730, 41994, -103707, 65523, 363175, -21917, -175304, -258687, -95375, 111497, -126465, 48466, 17852, -56029, 72073, -40458, -37544, -424474, 110408, -92204, -11376, -183335, 21377, 134126, 114638, -28821, -123804, -16453, 226039, 153065, -559583, 128120, 19591, 82470, 49167, 328447, 5616, -126177, 197108, 95259, 122970, 90829, 219002, -69418, -244564]
11217b44564E00782i1233A1246c20193J24844d9317n8961a566B17607g7607C7376
11205b06531E7496N4767b16853A32686a98833A10839K60841A44784a52201n5280
11195b07481I6829b40484A6070N00033A99422a38972M5381k41396A08655b78573
11184a28234A47630b15466j0504N162P6253f1997A45192J60124h2428m4717e2776
11172a17678l37770B72480I6897a07558d2342j58103B12617a89137j57331e2991
11161A98055a03299c8533A89125o6430c90612a59084J8307j49554A45g5871D0051
11149h9369B6607A371M41700F7994b32113q166J05236j98406J22646l5949i4246
11137a95660F6468K57340b05307A24084l7924M3472a50176j51427A1086J40339
$$ y = [-244564, 500782, -91233, 11246, -320193, -195349, -49317, -108278, -1566, 217607, -77607, 37376, -206531, 57496, 112263, -216853, 132686, -198833, 110839, 371680, 144784, -152201, -207481, 96829, -240484, 16070, 516103, 199422, -138972, -93591, -334987, 108655, -278573, -128234, 147630, -215466, -225970, -220808, -144555, -61997, 145192, 305316, -82428, -127145, -52776, -117678, -455448, 272480, 96897, -107558, -42342, -200445, 212617, -189137, -346468, -52991, 198055, -103299, -38533, 189125, 122695, -390612, -159084, -140777, -290331, 145, -75871, 40051, -89369, 26607, 1371, 443071, 67994, -232113, -240279, -135043, -333449, -210803, -246752, -94246, -195660, 66468, 323808, -205307, 124084, 86160, 129632, -150176, -301603, 11086, 151425]
11127A51425p236K38429D201i8945c7395A97187b24559D31914M1829d2511A73665
11115B8421M4017J55828f5618B97480q4286h5701B63988I0016n166R1725p1978
11104A04597Q530J91676a57890D43400E87Q7055i8348B46714o657G3399K82398
11093C55797A59534l8952P5634L2185j04537C0792J18238E4324N3384m1525b84178
11081H0933K94199j36073g6741C75509K07634F932L56728A44815K33330j85847
11071A92298a11985C14760A11241K83259o0824P1098r7585A17264M97489B28881
11060D98507M7559J96313q0526k34221J79249k04906L55196C02547N50073j41906
11050G10714k00075m7489K54997M1359j35345r9860l2214q2165R3268J53569J37760
$$ y = [151425, 144189, 382618, 4201, -98945, -37395, 197187, -224559, 431914, 473743, -42511, 173665, 28421, 72438, 228266, -65618, 297480, 213194, -85701, 263988, 90016, 84850, 176575, 104597, 113127, 304803, -157890, 443400, 587, 87642, -98348, 246714, 240057, 73399, 355797, 159534, 120582, 196216, 228401, 123864, 30792, 149030, 54324, 107708, 66183, -284178, 80933, 375132, 239059, -76741, 375509, 583143, 6932, 363660, 144815, 378145, 192298, -111985, 314760, 111241, 394500, 333676, 404774, 307189, 117264, 614753, 228881, 498507, 546066, 742379, 661853, 427632, 606881, 401975, 757171, 302547, 852620, 710714, 510639, 463150, 718147, 759506, 624161, 524301, 492087, 409922, 503190, 656759, 794519]
11039G94519k16422M7915K18529m8737j07329O7835j76439N34206m25639k64115
11029D24323L0457K76929k33317K29574k5743K3399J56100C67767L74735k98039
11019D44463K15872k7432L8077o2465L1315B52912J74528J30962j05136j695O4128
11008E15699Q7460K96827m08484j02032J24684r105Q4559m0180j60763J7610L02394
10997G08669p072j04098n5421R8454j67263L98241m9537Q941j43862K22483r2665
10986H16870J24110l9908m12102N67991M3829J2530R0162K66491j03284K53861
10976A620550L23424k06642M83180L99434N7351j4062o8589j05965m58111m8387
10966A982183l94024J1615K71344p29374J19689K4044L34273j05044O992m01k48532
$$ y = [794519, 578097, 626012, 844541, 795804, 688475, 756310, 579871, 1114077, 688438, 424323, 454780, 731709, 498392, 727966, 702223, 725622, 881722, 367767, 742502, 444463, 660335, 632903, 670980, 608515, 639830, 252912, 427440, 558402, 453266, 451571, 515699, 603159, 899986, 491502, 389470, 514154, 505049, 589608, 549428, 388665, 406275, 708669, 701597, 597499, 542078, 640532, 473269, 871510, 821973, 830914, 687052, 909535, 816870, 940980, 901072, 488970, 1056961, 1100790, 1113320, 1203482, 1469973, 1366689, 1620550, 1943974, 1737332, 2220512, 2619946, 2677297, 2663235, 2594646, 2488681, 2030570, 1982183, 1588159, 1599774, 1871118, 1141744, 1261433, 1285477, 1619750, 1514706, 1521698, 1521297, 1272765]
10955A272765k75789K80803F29077J67682o4757j64548j05199j77815J86071A66559
10944B90043d47498a53022A1140N3877a008F5724J41831a8199G3139g4277D38893
10932F2952N9586E0750f9889j8433H8709g8F0821f0580A00495e252j23016A13412
10919A42358J18642m5411h6183G1652K44085A57240J14752a09501B84496e0482
10908E0797J8348L4069i5028G4093e0998B15385E7572d02422f8508H4289b40379
10896A5469K67428b7869A62942J91273B2362M46147E5689j2658d4604k01048I390
10884D2254a6299H8940a77793A6938L7671c21620G5681J3439a79754h3500p9409
10873a62909p3362D704J2904c9346k53627C65845F3761d9487A21619a32332C03904
$$ y = [1272765, 996976, 1277779, 629077, 796759, 732002, 567454, 462255, 284440, 470511, 166559, 290043, -447498, -153022, 11140, 65017, -1008, 65724, 207555, -18199, 73139, -74277, 438893, 62952, 122538, 50750, -69889, -88322, 88709, -78, 60821, -60580, 100495, -5252, -128268, 113412, 142358, 261000, 215589, -86183, 71652, 315737, 157240, 271992, -109501, 284496, -50482, 50797, 69145, 103214, -95028, 74093, -50998, 215385, 57572, -402422, -68508, 84289, -240379, 15469, 282897, -27869, 162942, 354215, 22362, 468509, 55689, 43031, -44604, -245652, 9390, 42254, -16299, 88940, -177793, 16938, 54609, -321620, 75681, 89120, -179754, -83500, -162909, -236271, 4704, 17608, -39346, -292973, 365845, 63761, -49487, 121619, -132332, 303904]
10861B24783D16J17326b20223f3687r0126d9606G3430L5248j5727N3398a87077
10849a71336B46188m1537J9074h6353B27877m3919G9747l0135c3695k19730B97248
10837C4574R9083K0716E452f7946A89164a46991g0442k4492J1767E1474c57878
10825d42139A32032d5937k84604H1739p101b49666g2343k52362Q0092e8260j03366
10814a61626O6648A79637E5440a28562k20136A63615j7711b12753J04605G8406
10803C08834d6818j12188b4106k9966l31118B36651M533e61802R9482a68524j86744
10792c55268D1386a16194B6842L89050k06101k4516a02616A86764K61385a5407
10781A05213c76815B86256H2548k6517d4294j44203q6445D7891j2661a69988A38974
$$ y = [224783, 416, 117742, -220223, -63687, -153813, -49606, 73430, 108678, 92951, 146349, -187077, -171336, 246188, 204651, 223725, -86353, 227877, 183958, 79747, 49612, -33695, -253425, 297248, 34574, 133657, 154373, 5452, -67946, 189164, -146991, -70442, -94934, -83167, 51474, -357878, -442139, 132032, -45937, -330541, 81739, 74638, -249666, -72343, -324705, -244613, -58260, -161626, -94978, 179637, 55440, -128562, -348698, 163615, 145904, -212753, -108148, 78406, 308834, -46818, -159006, -24106, -54072, -385190, 236651, 241184, -561802, -462320, -168524, -355268, 41386, -116194, 26842, 415892, 209791, 185275, -102616, 186764, 448149, -15407, 105213, -376815, 286256, 82548, 56031, -44294, -188497, -274942, 47891, 35230, -169988, 138974]
10769I8608c8569F6182b99154C15701g7271j46451J052D1379b02993A11511a67411
10757C9706f8051j50439e3793a7351A56837b51308B07682M6487j17683A2735a38790
10745e0963n1065l18377J96036N9604E1323Q0213f6924A1474Q1319a53444D7161
10733a41404L8724C2943J24043c56595D9472i3226E0349K34524a04558J1819D1069
10721f7775k40274J50710B6888a30742J6207q1449Q702h5518A29112b58568n8121
10710c16689A12895b09461j1304K4210P391O7561j70736D3700f1619n5624A412
10698c7988A97194a77629n0019n1243D0073r693h2965n0096A17944j5942D4530
10686B50567f5762A52143a11081n4644k42916B97722h5615r6299g1304A66400
$$ y = [98608, -38569, 66182, -299154, 315701, -77271, -223722, -222670, 41379, -202993, 111511, -167411, 39706, -68051, -218490, -53793, -17351, 156837, -251308, 207682, 254169, 136486, 12735, -138790, -50963, -102028, -420405, -224369, -164765, 51323, 131536, -66924, 11474, 92793, -153444, 47161, -141404, -102680, 32943, 156986, -356595, 49472, -93226, 50349, 284873, -104558, -92739, 41069, -67775, -308049, -157339, 26888, -130742, -114535, -195984, -187282, -85518, 129112, -258568, -316689, 112895, -209461, -220765, -196555, -189164, -121603, -292339, 43700, -61619, -117243, 1412, -37988, 197194, -177629, -227648, -278891, 40073, 30380, -82965, -133061, 117944, 102002, 44530, 250567, -65762, 152143, -111081, -165725, -408641, 297722, -85615, -181914, -71304, 166400]
10675g8275l496G6028b6819j00587C0876K90497J15212A50794B2256K56713b12035
10663a4184k2597E341b09293k19426J75767J12383o0003B2463b43147B31533g2410
10651G5739J7808c02397a41109J9781L1347J7659b3081k31151C2686a56800J1417
10640a45383j52610k3201j76672h4109G5156c01336E5689O5786a9967j19357N9153
10629h0171p2623B41236d4706m8537K0735B4602J98711P555a47888M1808j37199
10618b43279E920J82232G785c48568g5493C26401d35085c0419B4351d47118c7176
10606c9796j51539A82629b86321J24592A46303j8033b97683B88842a68675H0206
10595A57277a5006l0109o1500C47269c0396A20489K176A4668a65788H0240c40565
$$ y = [-78275, -81771, 76028, -26819, -127406, 30876, 321373, 436585, 150794, 22256, 278969, -212035, -14184, -36781, 5341, -209293, -428719, -252952, -140569, -200572, 22463, -243147, 231533, -72410, 75739, 93547, -302397, -141109, -121328, -89981, -72322, -23081, -254232, 32686, -156800, -145383, -297993, -321194, -497866, -84109, 75156, -301336, 55689, 121475, -19967, -139324, -80171, -152794, 241236, -44706, -93243, -72508, 24602, 223313, 230868, -147888, -106080, -243279, 5920, 188152, 7785, -348568, -75493, 326401, -435085, -30419, 24351, -447118, -37176, -39796, -191335, 182629, -286321, -161729, 146303, 128270, -297683, 288842, -168675, 80206, 157277, -15006, -45115, -106615, 347269, -30396, 120489, 122665, 14668, -165788, 80240, -340565]
10583a88138j64906G6949f0204A22805D4781c48490A11348l954D7296a07868l26079
10572d33947a60982G7576A9812b05079m136K3983a3321k26947k8053A78413b89041
10560e2524q7990A5160b33842F9108a23288A20039J49416F1504a28786m5824d4575
10548i361j40090o0641h0833b9740j98734b1607H8691a24235a6232k00052d7143
10536a36726A55289C5750b91907e0210B8009a69826H3830i9064l2971j50712c075
10524a10166r4808A89887d10564I0864a72347C65191b3841j69879I6953B5312
10513A68664a90171A01107c0984j16004k1574A91601A4775J61065p6543c18459
10502F4772g9492C9742E850i4271m9020d9113j23513L2155A44030a59399A00726
$$ y = [-188138, -353044, 76949, -60204, 122805, 44781, -348490, 111348, 107394, 47296, -107868, -433947, -160982, 77576, 19812, -205079, -209215, -185232, -13321, -240268, -268321, 178413, -289041, -52524, -140514, 15160, -233842, 69108, -123288, 120039, 269455, 61504, -128786, -174610, -44575, -9361, -149451, -210092, -80833, -29740, -228474, -21607, 88691, -124235, -16232, -216284, -47143, -136726, 155289, 35750, -291907, -50210, 28009, -169826, 83830, -99064, -132035, -282747, -3075, -110166, -204974, 189887, -410564, 90864, -172347, 365191, -23841, -193720, 96953, 25312, 168664, -190171, 101107, -30984, -146988, -168562, 191601, 14775, 175840, 99297, -318459, 64772, -79492, 39742, 5850, -94271, -143291, -49113, -172626, -140471, 144030, -159399, 100726]
10490g2323r7853b110C6057c66816A53441a54850A77143l8925n0892M37095b2776
10478A53023k3937b34B542M35645a05612j30841C05214R5771b00959A68361a63342
10466B54525i0493k10668a25883e4665G3396a40776j37611a4372o2820p8238A01768
10454H5871a54242k08128O7487i2261k26508a46094d4997A11457b73434J12287
10444a61147A1416O0097d9850A43605M6707d43699A20286b47282h300j55526j17829
10433b81655C47299a39787O9826A19781L0408a90568c3039j1674A88863a06705
10422e244E1441f6148k5827A59369d14937I3215B1669J97434g0150o4977p4289
10411b09416f8394E7829c05756Q7527R712e1548B16614E223L6440J67606C2346
$$ y = [-72323, -170176, -2110, 36057, -366816, 153441, -154850, 177143, 138218, 87326, 524421, -22776, 153023, 129086, -234, 2542, 438187, -105612, -236453, 305214, 400985, -200959, 168361, -163342, 254525, -90493, -301161, -125883, -54665, 73396, -140776, -278387, -14372, -77192, -155430, 101768, 85871, -154242, -362370, -294883, -92261, -318769, -146094, -44997, 111457, -273434, -161147, 11416, 71513, -49850, 143605, 190312, -443699, 120286, -247282, -8300, -163826, -281655, 347299, -139787, -69961, 119781, 150189, -190568, -33039, -44713, 188863, -106705, -5244, 51441, -66148, -91975, 159369, -414937, 93215, 21669, 219103, -70150, -135127, -209416, -68394, 57829, -305756, -218229, -208517, -51548, 216614, 5223, 41663, 209269, 32346]
10399B0461a28448B6590J81430A2371J04467k0789L84101B8700e9469C34828a35903
10387B5032N65456c7134B10106h9363k7950A81734A603J41779O5965H1674J0304
10376I1978J50235l9860H1358K95379j20184K75680k36038q7714O7537J15690
10366C91708K98033j71860q3433J0640A50864n5021K4926D3553q492G517K00784
10355B08301q7726J203J94413M6360L3055A78277o3696M32760D9030M6560J15233
10344B10823O7583O3969c3687A97262J96685L5098C1017K12876L6956O8908j25144
10333B24613L25089n6336c08102h9932B28484a46281C82422a13914N3541B04751
10322B98385K27833B12568J51475F491J11896a38663B53296K05779a89739f8697
$$ y = [20461, -128448, 26590, 208020, 12371, 116838, 96049, 480150, 28700, -59469, 334828, -135903, 25032, 590488, -37134, 210106, -89363, -117313, 181734, 1603, 143382, 209347, 81674, 91978, 242213, 202353, 81358, 376737, 256553, 532233, 296195, 208481, 276018, 391708, 689741, 517881, 434448, 445088, 150864, 95843, 120769, 43553, 35061, 7517, 208301, 120575, 121778, 316191, 362551, 395606, 178277, 114581, 547341, 49030, 95590, 210823, 278406, 342375, -33687, 197262, 393947, 429045, 31017, 243893, 280849, 349757, 224613, 549702, 493366, -308102, -89932, 228484, -146281, 382422, -113914, -60373, 204751, 298385, 526218, 212568, 364043, 6491, 118387, -138663, 253296, 459075, -189739, -68697]
10311A58363A6625K28510j8130a56006P1573F175J28091K5762k4398k5179J80824
10300B91275A28006i6916M3275F369c06178J47494I1746O3485c1384B11365H587
10288C7924i5468A53876i244m29371F410a96825e7302K5056A15873b04090O9464
10277a34626C08705h228l9656J5077G3454O6414N8795e9063C24889A02806a35562
10265A44667i9759E8828J149M74002f4866B37037J57159b4051A47317J86478c20541
10253A67953F7387i3018r8973A10813N0044d07717A16714k5375f9107k45323B74991
10241D84868b27779A70438d5832n2446e298k27430j40830A42858J45700a40549
10230i8453k12305J37819A05218e3805D15569j0542A33893l9666a33839j67208
$$ y = [158363, 16625, 245135, 227005, -156006, -84433, 6175, 134266, 160028, 135630, 110451, 291275, 128006, -96916, -53641, 6369, -306178, -158684, 91746, 155231, -31384, 211365, 8587, 37924, -95468, 153876, -9244, -438615, 6410, -196825, -57302, -32246, 115873, -204090, -134626, 308705, -8228, -47884, -32807, 73454, 139868, 198663, -59063, 324889, 102806, -135562, 144667, -99759, 58828, 59977, 533979, -64866, 237037, 394196, -24051, 147317, 333795, -320541, 167953, 67387, -93018, -191991, 110813, 160857, -407717, 116714, 91339, -69107, -314430, 274991, 484868, -227779, 170438, -45832, -98278, -5298, -232728, -373558, 142858, 288558, -140549, -98453, -310758, -172939, 105218, -53805, 415569, 405027, 133893, 94227, -133839, -301047]
10220c01047C3237G99a33003A5446c03521g6698j13922i775I0347A4715J61752
10209A76467c31733a34105k2112j90872j55229i5634L9024f499A1491d77610A30612
10197c27366A60694b62039a18798B93782h8755c6393m48055b20888A8624b48591
10186a02512r5826c591p9700j54628G7489a35951l6890F7071f32463a7912j20095
10175a38007j32357B72326a35996G9643b65541R6996J1881N0333k8446c9691C4568
10163g4850A77328D6543a9763j19097A39675i4933I4875D1083b75479G9456f0554
10151b0322r048K815n7118H1748a99341f2815k95005B9176g8574I3121c66114
10139d01121k53393b31660k74228E4726a91754A54957b92163A26824b89224a09994
$$ y = [-301047, 33237, 799, -133003, 15446, -303521, -76698, -190620, -9775, 90347, 14715, 176467, -331733, -134105, -156217, -347089, -502318, -95634, -56610, -6499, 11491, -477610, 130612, -327366, 160694, -262039, -118798, 293782, -88755, -36393, -484448, -220888, 18624, -248591, -102512, -198338, -3591, -83291, -237919, 77489, -135951, -172841, 67071, -632463, -17912, -138007, -270364, 272326, -135996, 79643, -265541, -168545, -156664, -106331, -134777, -39691, 34568, -74850, 177328, 46543, -19763, -138860, 139675, -94933, 94875, 41083, -275479, 79456, -60554, -20322, -29370, -26555, -83673, 81748, -199341, -62815, -357820, 29176, -78574, 93121, -366114, -401121, -654514, -231660, -505888, 54726, -191754, 154957, -292163, 126824, -289224, -109994]
10128E773h3347A469J44721J24726b4985p4198c5326j16233B04067i2459B70152
10116b33448c8539k53527G7054B4266a5333k01746F11349a96016H7773f9973D490
10104A22359b83071A86606m4843b19804c0116j73846A18873a02484A50151D2430
10093E4899A3147c59344A46767d4055j49544I2362P7272p188F5218a7052j12348
10082a29400a1325C72834a43016r4987e7104o3937f0386A2184d6933j95078b8658
10070A09922A6421i6769A87249b07877A32016g0903j46986M4372G8031b77248
10059c29792a52108A48824b67074D1961N3109J7589C4902a72B121J18560j2740
10048A07941k7893f03059b8074k07944A02139h2125L978H6386e4092j38160b8466
$$ y = [5773, -83347, 1469, 146190, 270916, -24985, -99183, -35326, -151559, 204067, -92459, 270152, -233448, -38539, -292066, 77054, 24266, -15333, -217079, 611349, -196016, 87773, -69973, 4490, 122359, -283071, 186606, 141763, -219804, -30116, -203962, 118873, -102484, 150151, 42430, 54899, 13147, -359344, 146767, -44055, -193599, 92362, 169634, 162446, 65218, -17052, -129400, -11325, 372834, -143016, -238003, -57104, -121041, -60386, 12184, -46933, -242011, -28658, 109922, 16421, -96769, 187249, -207877, 132016, -70903, -217889, -173517, 78031, -277248, -329792, -152108, 148824, -267074, 41961, 95070, 112659, 34902, -172, 2121, 120681, 107941, 80048, -603059, -28074, -236018, 102139, -82125, -78147, 86386, -54092, -192252, -28466]
10036G2505J29291a57735A2387K0434a13393L5382o3733c5286A48262a27034j71785
10025b98819m0006q424J04647C4779L42596b40450k8404G6731g8711B40927A3753
10013d73j98425j00965a46545P1f7022I1466d12232J05237a26647D8397B2716
10001b75790Q7033I8369B9741J77256g8781A16352K9026e692I0991c8470j72j11351
9989a49993O3001J3815A26124j1308K54321a08486D8643R3820j7277a71562f6359
9977a16360A67670A0875J33859b50777D1572b8271A03934b09321k35130P9228
9967c65223a25429B31762a76805e4074j01105B72500c11654A31378f8668l05278
9957c73946A907b0648k36911h1872A36822d46761c092I9767b09546A73221E5170
$$ y = [72505, 201796, -157735, 12387, 32821, -113393, -78011, -141744, -35286, 148262, -127034, -298819, -338825, -347249, -242602, 34779, 377375, -240450, -268854, 76731, -78711, 240927, 13753, -473, -198898, -299863, -146545, -146474, -67022, 91466, -412232, -306995, -126647, 48397, 22716, -275790, -188757, 98369, 29741, 206997, -78781, 116352, 145378, -5692, 90991, -38470, -38642, -149993, -86992, -73177, 126124, 114816, 369137, -108486, 48643, 142463, 125186, -171562, -66359, -116360, 167670, 10875, 144734, -250777, 41572, -28271, 103934, -209321, -444451, -365223, -125429, 231762, -176805, -54074, -155179, 272500, -311654, 131378, -68668, -373946, 1907, -20648, -257559, -81872, 136822, -446761, -3092, 99767, -209546, 173221, 55170]
9945a14706b7367A49874c75291H6523e2553p577l7259A5650O9519R4489a23905
9933F7154k7921J33165n8539B4256a60622A35601c97211A47931a07048N3381j67653
9922b21320F0663a65088d8628G3468m723a70810p2676E8366B1179c6005B18688
9910B31603o9828b37238B76166H9940c89176a4455L566I0285a54778C3028c089
9898b72609Q640B2912b14408o4378a22294r0253d1917C31247A60279b43658R9628
9887a44030A19274b09234R3315e2244G7164d9176o5615B648c58287a53185L4754
9876a18431c6709j11650b1486j04551i478j54432f0356k16636a4120B27328a63744
9864c2603k77825J26924m4595l3174C5995b42148p3556F2861c83541d9152B01011
$$ y = [-114706, -27367, 149874, -375291, 86523, -52553, -60130, -97389, 15650, 85169, 179658, -123905, 67154, 39233, 172398, 113859, 24256, -160622, 135601, -397211, 147931, -107048, -53667, -221320, 60663, -165088, -48628, 73468, 68745, -170810, -243486, 58366, 21179, -36005, 218688, 231603, 161775, -237238, 276166, 89940, -389176, -14455, -10889, 90285, -154778, 33028, -3089, -272609, -263969, 22912, -214408, -278786, -122294, -212547, -41917, 331247, 160279, -243658, -144030, 119274, -209234, -115919, -52244, 77164, -49176, -114791, 2648, -358287, -153185, -118431, -36709, -148359, -21486, -126037, -9478, -163910, -60356, -276992, -14120, 227328, -163744, -32603, -310428, -183504, -228099, -261273, 35995, -242148, -315704, 62861, -383541, -49152, 201011]
9852B3418K03815e4859n7081J588G463b54382F774J38603m4822a17712N8595j44012
9840b03129o1874h5801k9479A88280I0406J75875D7881J22148d14842a64436l24229
9829d88665g711C37983i3934A70671b64063n1639o4908a53748q7995J06456j03591
9818b38878B7606b55761O3467D9557R6039b3524B27106A06566D3676g892l14533
9807c22425A45252b21517H3499J559c0665h274p2200A1343b64366j93143a1775
9795c59933a71305C0073P7A3529Q7633a36818e6053j25524A05790l9113d07760
9783a02712q4613k4638A52987A4956J519c10437a25879J3592D8983b91852J26155
9772a65697A26717C2219h3269k86015C06765i2870n1042B4052a59836C4361f5150
$$ y = [23418, 227233, -54859, -111940, -110352, 7463, -254382, 6774, 145377, 100555, -117712, -59117, -203129, -265003, -85801, -115280, 188280, 90406, 266281, 47881, 170029, -414842, -164436, -488665, -7711, 337983, -93934, 170671, -264063, -315702, -380610, -153748, -241743, -135287, -238878, 27606, -255761, -192294, 49557, 145596, -23524, 227106, 106566, 43676, -7892, -322425, 145252, -221517, 83499, 85058, -30665, -8274, -80474, 11343, -264366, -457509, -11775, -359933, -171305, 30073, 30150, 13529, 101162, -136818, -56053, -181577, 105790, 66677, -407760, -102712, -187325, -211963, 152987, 14956, 16475, -310437, -125879, -112287, 48983, -291852, -165697, 126717, 32219, -83269, -369284, 306765, -92870, -143912, 24052, -159836, 34361, -65150]
9760a18466C18397a58717N2949A91844a75262O138d4359q0083A42103F6918a03416
9748b84578g0866A81710b01654C59542A33379c8586A73412D7082a92671O991e2929
9736a53628p2834h5086j45190P4379e4458F4848J65808a24234A80342C9939L0253
9725G0192N7956b03440i7638A03590I285a26918q2181E9713e4717D2905a42696
9713d3008C3678O6107b7697j78056A31163d71252a58n13787a05698k63366a24438
9701d8765K374J9505l71446h0846k54327J56948b2595D5645J765b4512k03004
9690b27516I3274i0187j08900B57718c66931A85174A2487g4971j85599Q9276e801
9678f1985B27251g2711k07454i2648k11949A16054N7929b5670k00013A23435C7927
$$ y = [-118466, 318397, -158717, -105768, 191844, -175262, -169124, -44359, -124442, 142103, 66918, -103416, -284578, -70866, 181710, -201654, 359542, 133379, -38586, 173412, 47082, -192671, -185680, -52929, -153628, -226462, -85086, -230276, -155897, -54458, 64848, 230656, -124234, 180342, 39939, 70192, 128148, -203440, -97638, 103590, 9285, -126918, -209099, 59713, -54717, 42905, -142696, -43008, 33678, 99785, -27697, -205753, 131163, -471252, -158, -513945, -105698, -369064, -124438, -48765, -46391, -26886, -398332, -80846, -335173, -178225, -22595, 45645, 47410, -24512, -227516, 93274, -90187, -199087, 257718, -366931, 185174, 12487, -74971, -260570, -171294, -5801, -61985, 227251, -72711, -280165, -92648, -304597, 116054, 173983, -25670, -225683, 123435, 37927]
9666b5846k65233P7459M4250A58379a15784H6825L19817b24859B39916b98723
9655c25563a43768p8812H7893d66958A11522e1824j84054b662j76251A71519E1950
9643b93795g8292L3776H965a65599B01547b44733J20770C1003a05907A89144c10578
9631c6964A48887d03476J31161a26487M6243j60465e689D4944a77999K5141L2613
9620a20245o1172b7453m6816L2679a7245H8525a29252c7822p0534p7321b8851
9608A55936b33805A14951a7384k51963c9656k25385k55513O3986b07850B43765
9597b79997A45908d3406C3245a11129C55319h7174n1261F0556b30177C2756P307
9586D0063b02966c0333j31630l25443E7941b18823J6292R4392D9558a86183g1809
$$ y = [-25846, -291079, -213620, -169370, 158379, -115784, 86825, 406642, -224859, 239916, -298723, -325563, -143768, -222580, 87893, -466958, 111522, -51824, -235878, -2662, -178913, 171519, 51950, -293795, -78292, -44516, 8965, -165599, 201547, -244733, -123963, 31003, -105907, 189144, -310578, -36964, 148887, -403476, -272315, -126487, -80244, -240709, -5689, 44944, -177999, -152858, -120245, -181417, -27453, -74269, -41590, -17245, 88525, -129252, -37822, -108356, -185677, -28851, 155936, -233805, 114951, -17384, -269347, -39656, -265041, -520554, -456568, -207850, 243765, -279997, 145908, -43406, 33245, -111129, 355319, -87174, -138435, 60556, -230177, 32756, 40063, -202966, -30333, -161963, -487406, 57941, -218823, -202531, -108139, 49558, -186183, -71809]
9574c4144B06389f6363E1956H627b56318E1675c8786k04232F4361L3137b41203
9562a9624A23938M2076h3934k5311A07038d0680j46706i1710B10365f6155j33911
9551b00066g5150b3395l2809B4713J91300a99318A50097B9475d7058F7340a37559
9539a5950r7375j86689a08167c4567B19833f6747C440a09825M3204A64360D6751
9527a03095E4477a89445B2859a5791B41738f6475C82991a05704A24301d11875
9516g9325A58225L5311B6018O0290N6351a03051B27349A6374b96927n6484a9047
9504a82023j52154A7911a6526n60200J84399D1853j203b37842Q2675b4793A02036
9492a70449A64450F7593M9854R6995a40230A7258d1469j08612B19349C8245d69406
$$ y = [-34144, 206389, -66363, 51956, 8627, -256318, 51675, -38786, -243018, 64361, 97498, -241203, -19624, 123938, 166014, -83934, -109245, 107038, -40680, -187386, -91710, 210365, -66155, -200066, -75150, -23395, -56204, 24713, 216013, -199318, 150097, 29475, -47058, 67340, -137559, -15950, -113325, -300014, -108167, -34567, 219833, -66747, 3440, -109825, -66621, 164360, 46751, -103095, 54477, -189445, 22859, -15791, 241738, -66475, 382991, -105704, 124301, -411875, -79325, 158225, 193536, 26018, 86308, 142659, -103051, 227349, 16374, -296927, -353411, -19047, -182023, -334177, 17911, -16526, -576726, -392327, 41853, 40650, -237842, -155167, -24793, 102036, -170449, 164450, 67593, 117447, 214442, -140230, 17258, -41469, -150081, 219349, 38245, -469406]
9480B39502A13775C0493c66975c1384l03404J02495g0298B44766c64452m6641
9470d11093e6038D8413K73516b89169i2683F9717b73788h148C49651i1747k19562
9459c11309P1904h640B27191d87821K33069E7958b66673B3975J7105a7230k11534
9448b28764a11645A13998O9141H774a07725C144d8138A35668A5003a57255j67056
9437c24311A08983d4152a7567j23820B16433a19485n6846B5759L6562i8385I7192
9425A98189l3368f3156l50912h8441A28282g469k2474F376J07031e13707a66286
9413h4036k82074d2263A2723i5109j33289k17291G0961a5140H9607a68347f7813
9401a91635A33123c764D182J34654l8469c0731j21303N6823g278A46138i2782
$$ y = [239502, 113775, 30493, -366975, -31384, -334788, -232293, -70298, 244766, -364452, -411093, -56038, 48413, 321929, -289169, -92683, 69717, -273788, -8148, 349651, -91747, -311309, -239405, -8640, 227191, -487821, -254752, 57958, -266673, 23975, 41080, -17230, -228764, -111645, 113998, 183139, 8774, -107725, 3144, -48138, 135668, 15003, -157255, -324311, 108983, -44152, -17567, -141387, 216433, -119485, -176331, 25759, 62321, -98385, 97192, 198189, 164821, -63156, -414068, -88441, 128282, -7469, -29943, 6376, 113407, -513707, -166286, -84036, -366110, -42263, 12723, -95109, -228398, -445689, 70961, -15140, 89607, -168347, -67813, -191635, 133123, -3764, 4182, 138836, 100367, -30731, -152034, -95211, -7278, 146138, -92782]
9389a30649q5142B0996J2894e5806j13721N006C13766i610p1527E3971H015a89879
9376d07885a61145A42707b05381E104J52668b44337b6846p1628k56497F2434c35779
9364a10823j45414D50710a7866C8288b37659g5408B45281K60830D2719d3204k46335
9353b89539E9381L02439f0347l92008A4689a63033B13834I397b86583C50875b6369
9341g6618k96322q8546J90750B10693c64390B4588a53824j36373B32465A10028
9330H8224a37464B3157c25336a21802D04670e1871j95241A22753a30296k55079
9320c85375I384J28743E821K54578J67401A70338b55656a17993K870d5234j80350
9309b25584Q806F3217b2940I1183B4542a66572C6384b73031B61236i490q8089
$$ y = [-130649, -215791, 20996, 33890, -55806, -169527, -164521, 313766, -9610, -81137, 53971, 8015, -189879, -407885, -161145, 142707, -205381, 5104, 157772, -244337, -26846, -98474, -354971, 62434, -335779, -110823, -256237, 450710, -17866, 38288, -237659, -75408, 245281, 506111, 42719, -43204, -289539, 59381, 361820, -60347, -452355, 14689, -163033, 213834, 9397, -286583, 350875, -26369, -76618, -372940, -461486, -270736, 210693, -364390, 24588, -153824, -290197, 232465, 110028, 88224, -137464, 23157, -325336, -121802, 404670, -51871, -247112, 122753, -130296, -385375, 9384, 138127, 5821, 260399, 427800, 170338, -255656, -117993, -115123, -45234, -225584, -216778, 63217, -22940, 91183, 24542, -166572, 36384, -273031, 261236, -9490, -97579]
9298i7579B10045c3364q4416m863G8957B717c36119B13801d55540A60832f8644
9286a71099a5791l67605L7835k6898A29321h088A24199b22833h3149k1991I5155
9274c3738j54560g5094b8579j59463O0149n9314b7689j09574A06370O7740J39189
9263C13299c20200a17094C65298A81879a6919j14493M1569E059J25469A1248c27836
9251H1525b3434r3304M3781l29104F6163d6139A52791b68505H7382a95264l7327
9240b32591D45005a20747a6895k41499a213C828b28983C04275c57623J8971i3126
9228a09811I0968J84877a62943n953k94448c7084j17733J375p7759A18528J19644
9217B38172g4426p0221K6434j80828h8833G4411d0040k46405p5775E0041b83178
$$ y = [-97579, 210045, -33364, -117780, -122643, 78957, 2717, -336119, 213801, -455540, 160832, -68644, -171099, -15791, -383396, -345561, -372459, 129321, -8088, 124199, -222833, -83149, -105140, 95155, -33738, -188298, -75094, -28579, -188042, -127893, -187207, -27689, -137263, 106370, 174110, 313299, -320200, -117094, 365298, 181879, -16919, -131412, -89843, 5059, 130528, 11248, -327836, 81525, -23434, -116738, -72957, -402061, 66163, -46139, 152791, -268505, 87382, -195264, -232591, 445005, -120747, -16895, -258394, -1213, 3828, -228983, 304275, -357623, -338652, -93126, -109811, 90968, 275845, -162943, -168896, -463344, -37084, -154817, -153442, -231201, 118528, 238172, -74426, -144647, -118213, -299041, -88833, 74411, -40040, -286445, -362220, 50041, -283178]
9205b83955d6920B05550b67792E9052K09606h8317B05255e26841A31341b53013
9194h1502j57068L6726i885l36937A53140c3172l16601D8298b8659I379a5410
9182A99498K05893a64160d7545a4683A75487q4239e55776C4608b40820G453b27899
9170b06558B52224c38991I0250a35723O6433m89618a39391H0094a80292P6450
9160a03842C31666A39966g3654k15428a05159B37205a91732C31385A03444Q0575
9150A84019a68682L3230C75082j65495b43721p4553i350G2121b23702A35488D7617
9138a45693p2813B98802b04816B65484B2075J36818a03232I7894b48068N0908
9128a97160J1917A87363m2688D3897b6106C4532d1924G391L076h2287A99007b81545
$$ y = [-283955, -46920, 205550, -267792, 59052, 268658, -88317, 205255, -526841, 131341, -253013, -81502, -238570, -201844, -9885, -346822, 153140, -33172, -349773, 48298, -28659, 9379, -15410, 199498, 405391, -164160, -47545, -14683, 175487, 91248, -555776, 34608, -240820, 7453, -227899, -206558, 252224, -338991, 90250, -135723, -69290, -558908, -139391, 80094, -180292, -103842, 331666, 139966, -73654, -289082, -105159, 237205, -191732, 331385, 103444, 184019, -168682, -135452, 375082, 209587, -243721, -318274, -9350, 72121, -223702, 135488, 47617, -145693, -218506, 298802, -204816, 265484, 22075, 158893, -103232, 97894, -248068, -197160, -185243, 187363, 144675, 43897, -26106, 34532, -41924, 7391, 10467, -82287, 199007, -281545]
9115c08817E4256c56588A41656c1944j7048E5696a32289C74130f019j352j65732
9104a73103F3327j7639L86424A89026a91148A66b61866a25300l07809C2703P7951
9093A10654Q0795B0884a21805K1451n5885d6869k89849i7138A15451B1914b59048
9081I6247b49654B9313e1864l795m69879J75871J518b1152B25692M0851b0584
9069A85221C919J64714h102A83683a40133e1801o687l42l06110a00944A21712
9057A48557E3379O3327a24418k84470R5301R4195O4364p5695C994c02747Q8338
9046b14409A53889D0231i5110k6892j71439a01088A4884N6558a52951j76361e3881
9034d9220j17437D1529g4692b7213F1017d09899F1038j3534J1746b2294l6022
$$ y = [-308817, 54256, -356588, 141656, -31944, -48992, 55696, -132289, 374130, -6019, -7371, -173103, 63327, 45688, 432112, 189026, -191148, 166, -261866, -125300, -433109, 32703, 110654, 191449, 20884, -121805, -100354, -156239, -46869, -336718, -97138, 115451, 21914, -259048, 96247, -249654, 29313, -51864, -55659, -525538, -349667, -348149, -21152, 225692, 266543, -20584, 185221, 3919, 168633, -8102, 183683, -140133, -51801, -58488, -58830, -364940, -100944, 121712, 148557, 53379, 116706, -124418, -408888, -313587, -219392, -155028, -230723, 3994, -302747, -214409, 153889, 40231, -95110, -122002, -293441, -101088, 14884, 71442, -152951, -329312, -53881, -49220, -166657, 41529, -74692, -27213, 61017, -409899, 61038, 47504, 59250, -22294, -58316]
9023e8316B87006H4501l5767H215e4124C7135a64344j3284P1591j19579P8161
9012a47455K2535A52667A0870b94949A17328b52005a0454j5117H2427c55790a4835
9000C5757a98135N2148d3831B87145c47336B1017R339c36037c7525l04498A61657
8988b82589k12963b41856A87560J2019a28893n3821c9264H6231l1293J62463G0263
8976F862b12313F8856J50470B9139M425a38263A36920D7602N0315J42561e35378
8964f1485n0648j09454j02635J46260c01l22361q649R4915A84616F4383j3354
8953E1029a29728m3254A14235h2606B26966J5856a61421L0917D8913e4096j13752
8942a67848M6108j58746Q0581G8111K4481a4486C14326R9236A62415C0043f3955
$$ y = [-58316, 287006, 84501, 48734, 8215, -54124, 37135, -164344, -177628, -106037, -225616, -147455, -124920, 152667, 10870, -294949, 117328, -252005, -10454, -25571, 82427, -355790, -14835, 35757, -198135, -145987, -43831, 287145, -347336, 21017, 30356, -336037, -37525, -342023, 161657, -282589, -495552, -241856, 187560, 199579, -128893, -182714, -39264, 86231, 54938, 217401, 70263, 6862, -212313, 68856, 219326, 29139, 33564, -138263, 136920, 47602, 97917, 240478, -535378, -61485, -112133, -221587, -324222, -177962, -301, -322662, -331311, -236396, 184616, 64383, 51029, -129728, -172982, 114235, -82606, 226966, 242822, -161421, -130504, 48913, -54096, -167848, -121740, -280486, -199905, 78111, 102592, -14486, 314326, 413562, 162415, 30043, -63955]
8930B15882D5334K12549A05229b33435C59741J68490M37271J840178O393343j381455
8920G817568B080876E52208k28877j17857Q7119d8200C41873d15663h2878E9283
8909a88549A40872K34058a94117N8731B45153q5809L3530a99383A30682g4206
8898C6715a25052a742C0398e6379E0842a63272n3138A39808J29983A0688J62700
8887A73388d26147J12335g0165E4362J00308K1955a41650j27327K6461F0550K89180
8876C49730j63985o4379J43726l6217e9876n4916B55151E8672f2585j97303J06028
$$ y = [215882, 45334, 257883, 105229, -233435, 359741, 528231, 965502, 2805680, 9199023, 7817568, 2080876, 552208, 323331, 205474, 292593, -48200, 341873, -415663, -82878, 59283, -188549, 140872, 374930, -194117, -135386, 245153, 159344, 192874, -199383, 130682, -74206, 36715, -125052, -1742, 30398, -56379, 50842, -163272, -216410, 139808, 269791, 10688, 173388, -426147, -313812, -70165, 54362, 154670, 176625, -141650, -268977, -242516, 60550, 349730, 185745, 121366, 265092, 228875, -59876, -114792, 255151, 58672, -62585, -259888, -153860]
$$ [...]
##END NTUPLES=NMR SPECTRUM
##END=
