
##TITLE=UV1204_M3_1292-1211_7185246_wvG09XVc7x
##JCAMPDX= 6.0         $$ Bruker NMR JCAMP-DX V2.0
##DATA TYPE= NMR SPECTRUM
##DATA CLASS= NTUPLES
##ORIGIN= BRUKER
##OWNER= Administrator
$$ 1.72 TOPSPIN		Version 2.1
$$ 2012-12-17 18:36:37.561 -0500  Administrator@X
$$ Compression mode = diff/dup
##.OBSERVE FREQUENCY= 400.02188249412
##.OBSERVE NUCLEUS= ^1H
##.ACQUISITION MODE= SIMULTANEOUS (DQD)
##.ACQUISITION SCHEME= undefined
##.AVERAGES= 8
##.DIGITISER RES= 22
##SPECTROMETER/DATA SYSTEM= spect
##.PULSE SEQUENCE= zg30
##.SOLVENT NAME= COFFEE_meoh
##.SHIFT REFERENCE= INTERNAL, COFFEE_meoh, 1, 14.98509
##AUDIT TRAIL= $$ (NUMBER, WHEN, WHO, WHERE, PROCESS, VERSION, WHAT)
$$ ##TITLE= Audit trail, TOPSPIN		Version 2.1
$$ ##JCAMPDX= 5.01
$$ ##ORIGIN= Bruker BioSpin GmbH
$$ ##OWNER= Administrator
$$ $$ E:\/data/COFFEE/nmr/UV1204_M3_1292-1211_7185246_wvG09XVc7x/30/pdata/1/auditp.txt
$$ ##AUDIT TRAIL=  $$ (NUMBER, WHEN, WHO, WHERE, PROCESS, VERSION, WHAT)
(   1,<2012-12-17 18:36:27.673 -0500>,<Administrator>,<X>,<go>,<TOPSPIN 2.1>,
      <created by zg
	started at 2012-12-17 18:35:10.891 -0500,
	POWCHK enabled, PULCHK disabled,
       configuration hash MD5:
       86 BA 57 50 F2 9D 5C 9B 26 00 A9 28 5F 66 2E 89
       data hash MD5: 64K
       6C F2 F5 C5 3E 7F 94 A8 F4 32 52 E1 01 8C 15 33>)
(   2,<2012-12-17 18:36:30.526 -0500>,<Administrator>,<X>,<proc1d>,<TOPSPIN 2.1>,
      <Start of raw data processing
       efp LB = 0 FT_mod = 6 PKNL = 1 PHC0 = 0 PHC1 = 0 SI = 32K 
       data hash MD5: 32K
       35 39 36 DD 69 A5 70 9C 76 06 E6 13 3C 3F 2F 85>)
(   3,<2012-12-17 18:36:31.021 -0500>,<Administrator>,<X>,<proc1d>,<TOPSPIN 2.1>,
      <pk PHC0 = 96.22925 PHC1 = 0 
       data hash MD5: 32K
       C5 F7 BA 9B 2D CF C7 34 37 35 68 A2 5A EB 61 0F>)
(   4,<2012-12-17 18:36:33.023 -0500>,<Administrator>,<X>,<proc1d>,<TOPSPIN 2.1>,
      <abs ABSG = 1 
       data hash MD5: 32K
       D9 DC 0A 72 3C A6 2A 6E 3B B0 68 EC 03 17 7D 10>)
(   5,<2012-12-17 18:36:33.747 -0500>,<Administrator>,<X>,<proc1d>,<TOPSPIN 2.1>,
      <abs ABSG = 2 
       data hash MD5: 32K
       B1 54 22 05 DF 7C 47 54 EA 01 46 BA EC A0 64 21>)
(   6,<2012-12-17 18:36:34.243 -0500>,<Administrator>,<X>,<proc1d>,<TOPSPIN 2.1>,
      <abs ABSG = 3 
       data hash MD5: 32K
       1C D6 87 CB 23 3A 16 62 D9 98 AC 83 6E BB 67 FD>)
(   7,<2012-12-17 18:36:34.357 -0500>,<Administrator>,<X>,<proc1d>,<TOPSPIN 2.1>,
      <abs ABSG = 4 
       data hash MD5: 32K
       83 78 F0 36 32 E0 05 48 20 5F 89 AF 74 70 04 AF>)
(   8,<2012-12-17 18:36:34.510 -0500>,<Administrator>,<X>,<proc1d>,<TOPSPIN 2.1>,
      <abs ABSG = 5 
       data hash MD5: 32K
       73 40 88 53 68 84 F5 68 29 A1 71 29 B3 94 CA A0>)
$$ ##END=
$$ 
$$ $$ hash MD5
$$ $$ 6D 39 BB 2E 71 82 B9 65 7D 6B 62 2C 48 00 66 C7
##$RELAX= 
##$RELAX= 
##$RELAX= 
##$RELAX= 
##$RELAX= 
##$RELAX= 
##$RELAX= 
$$ Bruker specific parameters
$$ --------------------------
##$DU= <E:\>
##$EXPNO= 30
$$ [...]
150 150 150 150 150 150 150 150
##$TP07= 0
##$TPNAME0= <>
##$TPNAME1= <>
##$TPNAME2= <>
##$TPNAME3= <>
##$TPNAME4= <>
##$TPNAME5= <>
##$TPNAME6= <>
##$TPNAME7= <>
##$TPOAL= (0..7)
0.5 0.5 0.5 0.5 0.5 0.5 0.5 0.5
##$TPOFFS= (0..7)
0 0 0 0 0 0 0 0
##$TUNHIN= 0
##$TUNHOUT= 0
##$TUNXOUT= 0
##$USERA1= <user>
##$USERA2= <user>
##$USERA3= <user>
##$USERA4= <user>
##$USERA5= <user>
##$V9= 5
##$VALIST= <valist>
##$VCLIST= <CCCCCCCCCCCCCCC>
##$VD= 0
##$VDLIST= <DDDDDDDDDDDDDDD>
##$VPLIST= <PPPPPPPPPPPPPPP>
##$VTLIST= <TTTTTTTTTTTTTTT>
##$WBST= 2048
##$WBSW= 25
##$XGAIN= (0..3)
0 0 0 0
##$XL= 0
##$YL= 0
##$YMAX_a= 675207
##$YMIN_a= -572227
##$ZGOPTNS= <>
##$ZL1= 120
##$ZL2= 120
##$ZL3= 120
##$ZL4= 120
##$ABSF1= 14.98509
##$ABSF2= -5.573092
##$ABSG= 5
##$ABSL= 3
##$ALPHA= 0
##$AQORDER= 0
##$ASSFAC= 0
##$ASSFACI= 0
##$ASSFACX= 0
##$ASSWID= 0
##$AUNMP= <proc_prof1d_extract_pilot.lims>
##$AXLEFT= 0
##$AXNAME= <>
##$AXNUC= <1H>
##$AXRIGHT= 0
##$AXTYPE= 0
##$AXUNIT= <>
##$AZFE= 0.1
##$AZFW= 0.1
##$BCFW= 0
##$BC_mod= 0
##$BYTORDP= 0
##$COROFFS= 0
##$CY= 15
##$DATMOD= 1
##$DC= 0
##$DFILT= <>
##$DTYPP= 0
##$F1P= 0
##$F2P= 0
##$FCOR= 0.5
##$FTSIZE= 32768
##$FT_mod= 6
##$GAMMA= 0
##$GB= 0
##$INTBC= 1
##$INTSCL= 1
##$ISEN= 128
##$LB= 0
##$LEV0= 0
##$LPBIN= 0
##$MAXI= 10000
##$MC2= 0
##$MEAN= 0
##$ME_mod= 0
##$MI= 0
##$NCOEF= 0
##$NC_proc= -8
##$NLEV= 6
##$NOISF1= 0
##$NOISF2= 0
##$NSP= 0
##$NTH_PI= 0
##$NZP= 0
##$OFFSET= 14.98509
##$PC= 1
##$PHC0= 96.22925
##$PHC1= 0
##$PH_mod= 1
##$PKNL= yes
##$PPARMOD= 0
##$PPDIAG= 0
##$PPIPTYP= 0
##$PPMPNUM= 2147483647
##$PPRESOL= 1
##$PSCAL= 4
##$PSIGN= 0
##$PYNMP= <proc.py>
##$REVERSE= no
##$SF= 400.02
##$SI= 32768
##$SIGF1= 0
##$SIGF2= 0
##$SINO= 400
##$SIOLD= 32768
##$SPECTYP= <>
##$SREGLST= <1H.CDCl3>
##$SSB= 0
##$STSI= 32768
##$STSR= 0
##$SW_p= 8223.68421052631
##$SYMM= 0
##$S_DEV= 0
##$TDeff= 65536
##$TDoff= 0
##$TI= <>
##$TILT= no
##$TM1= 0
##$TM2= 0
##$TOPLEV= 0
##$USERP1= <user>
##$USERP2= <user>
##$USERP3= <user>
##$USERP4= <user>
##$USERP5= <user>
##$WDW= 1
##$XDIM= 32768
##$YMAX_p= 482426673
##$YMIN_p= -914499
##$CURPLOT= <Network HP LaserJet P1505>
##$CURPRIN= <$Network HP LaserJet P1505>
##$DFORMAT= <normdp>
##$LAYOUT= <+/1D_H.xwp>
##$LFORMAT= <normlp>
##$PFORMAT= <normpl>
##$SURQMSG= 1
$$ End of Bruker specific parameters
$$ ---------------------------------
##NTUPLES= NMR SPECTRUM
##VAR_NAME=  FREQUENCY,     SPECTRUM/REAL,   SPECTRUM/IMAG
##SYMBOL=    X,             R,               I
##VAR_TYPE=  INDEPENDENT,   DEPENDENT,       DEPENDENT
##VAR_FORM=  AFFN,          ASDF,            ASDF
##VAR_DIM=   32768,         32768,           32768
##UNITS=     HZ,            ARBITRARY UNITS, ARBITRARY UNITS
##FACTOR=    0.250966925370066, 1,           1
##FIRST=     8223.43324360094, -287341,      -126138
##LAST=      0,             -28727,          -162965
##MIN=       0,             -914499,         0
##MAX=       8223.43324360094, 482426673,    0
$$ Real data points
##PAGE= N=1
##DATA TABLE= (X++(R..R)), XYDATA
$$ [...]
19531a66583A1171N9144k6837j1937A2282a83500B2888J10682A7073a45069A43811
$$ -166583 11171 70315 43478 31541 12282 -183500 22888 133570 17073 -145069 143811
19519b84763C6557c4045a0070p3605C1123d5434B47229a95486i2537G0162b59853
$$ -284763 36557 -34045 -10070 -83675 31123 -45434 247229 -195486 -92537 70162 -259853
19507a1994k31396A96910F9468g5107B69307b53540K2327I2284K55724a73335
$$ -11994 -243390 196910 69468 -75107 269307 -253540 -231213 92284 348008 -173335
19496H388a19165j06895a8717p9561q2589C06320c07981G2579h1187a1002j54450
$$ 8388 -119165 -226060 -18717 -98278 -180867 306320 -307981 72579 -81187 -11002 -165452
19485a65452m1805R3576D64680b22632h3910B9373f2987j2253L674A59575a38287
$$ -165452 -207257 -113681 464680 -222632 -83910 29373 -62987 -75240 -71566 159575 -138287
19473a4910l87169a1991l76724J39316a04564L0080J0018k73620A4001b24418
$$ -14910 -402079 -11991 -388715 -249399 -104564 -74484 -64466 -338086 14001 -224418
19462B11918b20657A22965b442m6025A44965b02483l1401A3881b0080k11339D7328
$$ 211918 -220657 122965 -2442 -48467 144965 -202483 -233884 13881 -20080 -231419 47328
19450a30883A67672b40888A45022q866Q0684f4828j28905A7878c0836k986B31991
$$ -130883 167672 -240888 145022 136156 216840 -64828 -193733 17878 -30836 -33822 231991
19438h5521d1423j09153A16347a34662m13263b005F8151J39443q6320i0370o8427
$$ -85521 -41423 -150576 116347 -134662 -547925 -2005 68151 207594 121274 -90370 -158797
19427a58797N0501j45222J11471B8422h353j89326e6491m6883E960g1984c0822
$$ -158797 -108296 -253518 -142047 28422 -8353 -197679 -56491 -103374 5960 -71984 -30822
19415H3107a46797j78353a04200e0053j03567A43236l8489i0621C77562i9792
$$ 83107 -146797 -325150 -104200 -50053 -153620 143236 104747 -90621 377562 -99792
19404A81036E4509j3192b16020l3616B71819F2592A6904a19528r7399A27878B0822
$$ 181036 54509 41317 -216020 -249636 271819 62592 16904 -119528 -216927 127878 20822
19392c56730D63043G9468f6138j03614h2391j48617j52262J44296h2697l7939
$$ -356730 463043 79468 -66138 -169752 -82391 -231008 -383270 -238974 -82697 -120636
19382a20636A90645f9595q6571D149h0568k19514G6834i2698m3518M8571m9870
$$ -120636 190645 -69595 -156166 4149 -80568 -300082 76834 -92698 -136216 -87645 -137515
19371a37515r6608D5223b6983j9024J9881j74415A39114a8327n68991a6258p281
$$ -137515 -234123 45223 -26983 -46007 -26126 -200541 139114 -18327 -587318 -16258 -23539
19360b3539J0911A10814O9898g8641A44289a60425j97820d4091o4709E6778b41270
$$ -23539 -12628 110814 180712 -78641 144289 -160425 -358245 -44091 -108800 56778 -241270
19348D4740Q9945I668a95512o7586P9235A49047E9213k499A3081L78102j86375
$$ 44740 134685 9668 -195512 -263098 -183863 149047 59213 56714 13081 391183 204808
19337B04808b6019F332c94326i7842k99462J95395h504B5502J21430a40959o1232
$$ 204808 -26019 6332 -394326 -97842 -397304 -201909 -8504 25502 146932 -140959 -202191
19326b02191A91965b86D6999a5868j02068A48731N697a00935L1810A91546N6223
$$ -202191 191965 -286 46999 -15868 -117936 148731 154428 -100935 -69125 191546 247769
19315B47769H4356C351b05277I8386C6174a24258d6287b0830l9466B20938A5071
$$ 247769 84356 3351 -205277 98386 36174 -124258 -46287 -20830 -60296 220938 15071
19303e8377h308k72862B2602e5866k75603r5792i7736E9823J4668b79934G7329
$$ -58377 -8308 -281170 22602 -55866 -331469 -427261 -97736 59823 74491 -279934 77329
19291c19j7860E1988c92645a37607A20435e1181r4906f0508I1018b22590B27075
$$ -319 -18179 51988 -392645 -137607 120435 -51181 -146087 -60508 91018 -222590 227075
19279a70455A23920O3991E5554a16736P48l7904k669B72442a96040B28943b40746
$$ -170455 123920 187911 55554 -116736 -115988 -153892 -156561 272442 -196040 228943 -240746
19267D5415J1741a29611O4302h180j75055k6474j00875J16773B9234M5538K32796
$$ 45415 57156 -129611 -65309 -8180 -183235 -209709 -310584 -193811 29234 74772 307568
19256C07568c1377l60656A64997A9890c14001I5817c45146G1850a1295k56339
$$ 307568 -31377 -392033 164997 19890 -314001 95817 -345146 71850 -11295 -267634
19246b67634Q5211I7953a01715p8101Q2154d8004C9319R9188b28916J06585l31855
$$ -267634 -182423 97953 -101715 -179816 -97662 -48004 39319 138507 -228916 -122331 -454186
19235d54186a71633j6807R4159j88192G3312C4828a97208Q1987A16955m0373b14094
$$ -454186 -171633 -188440 -94281 -282473 73312 34828 -197208 -115221 116955 76582 -214094
19223d6095J1905j82498B50361E1467J9854d20294f5002a7058j6730m5664k7011
$$ -46095 -34190 -216688 250361 51467 71321 -420294 -65002 -17058 -33788 -79452 -106463
19212a06463k9415j48000g0123k50768e3620B0349h7098k9089b9956F0777i7830
$$ -106463 -135878 -283878 -70123 -320891 -53620 20349 -87098 -116187 -29956 60777 -97830
19200a11632k09734K7076C6532a01297j01597B904d8798j62926P7447j44388b8155
$$ -111632 -321366 -294290 36532 -101297 -202894 2904 -48798 -211724 -134277 -278665 -28155
19188a89536B27957A789d8383j40624j00499d4309j7165B83J78079b90910A71562
$$ -189536 227957 1789 -48383 -189007 -289506 -44309 -61474 283 178362 -290910 171562
19176b6096A31515e00559g4171a8004A28091b46756c883j49696F2904c9117A70653
$$ -26096 131515 -500559 -74171 -18004 128091 -246756 -3883 -153579 62904 -39117 170653
19164c15585A46545i4584A4548L01137a7364j09756J4058A0846J09267N3027P1837
$$ -315585 146545 -94584 14548 315685 -17364 -127120 -113062 10846 120113 173140 244977
19153B44977b31490Q9360b8399l04251G2328a55671A44865e03314C9223c32472
$$ 244977 -231490 -142130 -28399 -332650 72328 -155671 144865 -503314 39223 -332472
19142b14689j7387B374O3917a29408m830j20080k14046A15171J4843m4507e3617
$$ -214689 -232076 2374 66291 -129408 -134238 -254318 -468364 115171 130014 85507 -53617
19130f4952l1552A60358b9391m08835E9605p75d3200m5900B21312a85554h4383
$$ -64952 -96504 160358 -29391 -438226 59605 58830 -43200 -89100 221312 -185554 -84383
19118A36208K01509a67511j90057a13354I2591J2537D6085c5530I8830a47782
$$ 136208 337717 -167511 -357568 -113354 92591 105128 46085 -35530 98830 -147782
19107A41000e3170k1552B1876b46988J07003H6787g8594A50872e2183A4774a6647
$$ 141000 -53170 -74722 21876 -246988 -139985 86787 -78594 150872 -52183 14774 -16647
19095d73905D0477c09638b8740m8359k22674J18436c5753E2703J26487b32696
$$ -473905 40477 -309638 -28740 -77099 -299773 -181337 -35753 52703 179190 -232696
19084a26976B43579a51641o1090h0932C62788b06240A04381C168a24283G1923
$$ -126976 243579 -151641 -212731 -80932 362788 -206240 104381 3168 -124283 71923
19073c10793G4002a30406j86604A19968m4278b23032A55650b23587P8077j22273
$$ -310793 74002 -130406 -317010 119968 75690 -223032 155650 -223587 -145510 -267783
19063b67783a16576n8006o2189g2709A84471a37998j11704B64750p7053b14478
$$ -267783 -116576 -174582 -236771 -72709 184471 -137998 -249702 264750 187697 -214478
19052b38977N2815B74821a63634j80129a17890D35304j95342L5291a13709j5407
$$ -238977 -186162 274821 -163634 -343763 -117890 435304 239962 275253 -113709 -129116
19042a29116b3917m21995J08294C27023b09807h3831j02119n6774B33376A3517
$$ -129116 -23917 -445912 -337618 327023 -209807 -83831 -185950 -242724 233376 13517
19031c01669R8699A27460J16359j13904b16924B12151q6653L20485A75948K3204
$$ -301669 -202970 127460 243819 129915 -216924 212151 125498 445983 175948 199152
19021A99152a61013L1765r7903C1771J58192f7887B00283e5389p5198E4096f2101
$$ 199152 -161013 -129248 -227151 31771 189963 -67887 200283 -55389 -130587 54096 -62101
19009a55638B06000G3862b1606k5596l8394F1504h5743B98771e36084E746c2145
$$ -155638 206000 73862 -21606 -47202 -85596 61504 -85743 298771 -536084 5746 -32145
18997H1082a39468D35124i5780A36253l8957k4607a28950k39723R157g5249C643
$$ 81082 -139468 435124 -95780 136253 97296 72689 -128950 -368673 -359516 -75249 3643
18985B07883C4991a39124G6573J41290L0929b97491A58575C7621c36956l015H3765
$$ 207883 34991 -139124 76573 217863 248792 -297491 158575 37621 -336956 -339971 83765
18973b97521A62269K6305C7235a88315b9871B8814b07293d9670E8850d96333B9060
$$ -297521 162269 188574 37235 -188315 -29871 28814 -207293 -49670 58850 -496333 29060
18961B4009c61672B61867A1313o72a97156n772A90185f7647m8720c0103q7949
$$ 24009 -361672 261867 11313 10641 -197156 -202928 190185 -67647 -116367 -30103 -118052
18950a18052q0141m383I1043O7850b15176I2461j2927J68355b99159b0083k11926
$$ -118052 -198193 -202576 91043 158893 -215176 92461 79534 247889 -299159 -20083 -232009
18939b32009D2587g588A1863h4504I9751b981F5823d44493F8357b08157p375b1002
$$ -232009 42587 -7588 11863 -84504 99751 -2981 65823 -444493 68357 -208157 -215532 -21002
18926I9783b82524i1789j71155R9099G832a66200E6520J1671b02717N9060K1862
$$ 99783 -282524 -91789 -262944 -163845 7832 -166200 56520 68191 -202717 -143657 -121795
18915a21795E4435c37350E1181c63999a8594A25090a46382J0089k79273J48223
$$ -121795 54435 -337350 51181 -363999 -18594 125090 -146382 -136293 -415566 -267343
18905b67343b0509G0345f8813C34849A16784B3434e1966M565j6193A84231a73532
$$ -267343 -20509 70345 -68813 334849 116784 23434 -51966 -47401 -63594 184231 -173532
18893b71426A5446b57743C6439h6738D6225a93355B96366I275L0128a46870n2746
$$ -271426 15446 -257743 36439 -86738 46225 -193355 296366 9275 39403 -146870 -199616
18882a99616B30801a06811B55864c1975j71543R1269A60633d8562E933c10079
$$ -199616 230801 -106811 255864 -31975 -203518 -112249 160633 -48562 5933 -310079
18871A52224F10d85228J25653E5562b03078e6089k09992B24758c7339k8522B7811
$$ 152224 610 -485228 -359575 55562 -203078 -56089 -266081 224758 -37339 -65861 27811
18859A78205H3608e9093D8428g52r027j78857m0192b3116k66333A43632b19262
$$ 178205 83608 -59093 48428 -752 -9779 -188636 -228828 -23116 -289449 143632 -219262
18847c84438A91919m9263a46313n2415a6892G4142c37458Q9017j7424g6844k87826
$$ -384438 191919 142656 -146313 -198728 -16892 74142 -337458 -248441 -265865 -76844 -364670
18836c64670A07420L0466a02277c086j43565f5902a3476j55096C03640B8903f5023
$$ -364670 107420 137886 -102277 -3086 -146651 -65902 -13476 -168572 303640 28903 -65023
18824A4193c63036J43350M3364o7572G9094A4335a73083A20040b43375D2359J46286
$$ 14193 -363036 -219686 -176322 -243894 79094 14335 -173083 120040 -243375 42359 188645
18813A88645J58746B1444R209a14719G5935b3441k1184E0822b80324h0514j80329
$$ 188645 347391 21444 30653 -114719 75935 -23441 -44625 50822 -280324 -80514 -260843
18802b60843J03466C5107a39689k7404d2939b725a117j08088K5131A75049G1522
$$ -260843 -157377 35107 -139689 -167093 -42939 -2725 -1117 -109205 -84074 175049 71522
18790B03167n2749a79240h5484G2494a35518L8522k43968A05741b26775N0300
$$ 203167 150418 -179240 -85484 72494 -135518 -96996 -340964 105741 -226775 -176475
18780a76475m5302l5152c5090B33278E9515b78560g2612C16822a09708p8106D710
$$ -176475 -221777 -256929 -35090 233278 59515 -278560 -72612 316822 -109708 -187814 4710
18768f2502A97068p9974B1535h4435A71856b09018Q2695o1599h0931G2096B5950
$$ -62502 197068 117094 21535 -84435 171856 -209018 -126323 -187922 -80931 72096 25950
18756d422r2341c7738j95466i1493j94859g4048C7764A524Q1444g4201e964B03111
$$ -4422 -96763 -37738 -233204 -91493 -286352 -74048 37764 1524 82968 -74201 -5964 203111
18743A83151a549D7269a37150M0727H971d8097A31729b53577h4170A14382a3718
$$ 183151 -1549 47269 -137150 -96423 8971 -48097 131729 -253577 -84170 114382 -13718
18731A15607e8408k5377j37896E8617D546a00015f595j9042l9136H6838c4106
$$ 115607 -58408 -83785 -221681 58617 4546 -100015 -6595 -25637 -64773 86838 -34106
18719C18262a43055d3716k33593c6954A49189h7643j20216I6434N8916a80375
$$ 318262 -143055 -43716 -277309 -36954 149189 -87643 -207859 96434 155350 -180375
18708B3034P531j2790b30260j93958E6905K56471H1583a10589q0239g6427j14064
$$ 23034 30565 17775 -230260 -424218 56905 313376 81583 -110589 -190828 -76427 -190491
18697a90491I3412d26530C99178H7449M5661c19515k4119A81933e7699B28397
$$ -190491 93412 -426530 399178 87449 133110 -319515 -343634 181933 -57699 228397
18686I1319l7830b83431C2735L4775h0988j09217A23000a52767J939L0222d8954
$$ 91319 53489 -283431 32735 67510 -80988 -190205 123000 -152767 -150828 -120606 -48954
18674c6594l11229H0901a83355J0472P4157A07372i4699B3437a04069l05425A01866
$$ -36594 -347823 80901 -183355 -172883 -98726 107372 -94699 23437 -104069 -409494 101866
18662A42149N017a09146k29170g353H1990M1901d5288a3091p7077k82185a65367
$$ 142149 147166 -109146 -338316 -7353 81990 123891 -45288 -13091 -90168 -372353 -165367
18650a20093A24788B88N7808b27846j59932b5223B48356a14963k852d2513q7786
$$ -120093 124788 288 58096 -227846 -387778 -25223 248356 -114963 -117815 -42513 -130299
18639a30299D7357J55513I1233c84889C01360a98142P6722m2709a6859m8320l79751
$$ -130299 47357 202870 91233 -384889 301360 -198142 -121420 -164129 -16859 -65179 -444930
18628d44930I107K43711a98881A47907c6932D3846J91330A7651J7219K21749a13210
$$ -444930 9107 252818 -198881 147907 -36932 43846 235176 17651 34870 256619 -113210
18616A26906a13345A76800a90155b4231a0925k56031j55161J09014a21464A32548
$$ 126906 -113345 176800 -190155 -24231 -10925 -266956 -422117 -313103 -121464 132548
18605B73796f8428n3873K674B32311c9156j36064k05843B23905b38758H9232C3034
$$ 273796 -68428 -122301 -119627 232311 -39156 -175220 -381063 223905 -238758 89232 33034
18593b27026n6112c4541j95628J6934B38906b64511b6488k85334a16296L7251
$$ -227026 -283138 -34541 -230169 -213235 238906 -264511 -26488 -311822 -116296 -79045
18583g9045C6181b47032A60077a29599j91646g0460A25379Q8531O272b74274C1035
$$ -79045 36181 -247032 160077 -129599 -321245 -70460 125379 213910 220182 -274274 31035
18571A15558e1289A45293b01415f7996n9200e0413k3691b3369j17148d6552q2665
$$ 115558 -51289 145293 -201415 -67996 -127196 -50413 -74104 -23369 -140517 -46552 -129217
18560a29217Q468A97734b71062a2434B71786b17856J04866r8213D9815N2884a63787
$$ -129217 -120749 197734 -271062 -12434 271786 -217856 -112990 -211203 49815 102699 -163787
18548A37002K4659b13447B42807d7263l24301f4981K5730l95909K15958A60229
$$ 137002 161661 -213447 242807 -47263 -371564 -64981 -39251 -435160 -219202 160229
18537g3096a2336l59137J74292r3372b0593j1234m5913n6858j30967a4000j55452
$$ -73096 -12336 -371473 -197181 -290553 -20593 -31827 -77740 -134598 -265565 -14000 -169452
18526a69452p0624M1109b4676j50613A47862b06252E3982b93805f9151F1361a86753
$$ -169452 -240076 -198967 -24676 -175289 147862 -206252 53982 -293805 -69151 61361 -186753
18514g4155a1000A06824D6340J78123F0006g6330k68877a3456j62883M8272j02183
$$ -74155 -11000 106824 46340 224463 60006 -76330 -345207 -13456 -176339 -128067 -230250
18503b30250C81787d62025a11672k81124J10072d5883l4891j89253d1991L73D081
$$ -230250 381787 -462025 -111672 -392796 -282724 -45883 -80774 -270027 -41991 -41618 4081
18491b2022A77796a24886b8011k95360J02526K4189A59342a49776k56354a88048
$$ -22022 177796 -124886 -28011 -323371 -220845 -196656 159342 -149776 -406130 -188048
18480d2753C96267c21966J53337B6149d3718k20606M9927h894j45588N8830j75980
$$ -42753 396267 -321966 -168629 26149 -43718 -264324 -214397 -8894 -154482 -95652 -271632
18469b71632J15297G2171b06816C00212b68077a6812j54282H779c35864B69315
$$ -271632 -156335 72171 -206816 300212 -268077 -16812 -171094 8779 -335864 269315
18458b05887f9076b2472j4702l41628J68586C32796f2070A20705b11577i4065
$$ -205887 -69076 -22472 -37174 -378802 -210216 332796 -62070 120705 -211577 -94065
18447a96100m0847q8719h7240j05618j32936e7939j50828f6322D9146M4872a18493
$$ -196100 -236947 -325666 -87240 -192858 -325794 -57939 -208767 -66322 49146 94018 -118493
18435a81424d696k57593j38672D5277b35797K6754B8468Q6438N1502m1327k0005
$$ -181424 -4696 -262289 -400961 45277 -235797 -209043 28468 114906 166408 125081 105076
18424A05076K2646o3048P4047c11073e2516C4210d2378G28K16145A4260i3436
$$ 105076 127722 64674 138721 -311073 -52516 34210 -42378 728 216873 14260 -93436
18412g3329A39596l0504b38837J08511e9356B47850A07603a38852F8345a65955
$$ -73329 139596 109092 -238837 -130326 -59356 247850 107603 -138852 68345 -165955
18401B02819p753a06621n2928j30765f8335K9711b144n3224l5462r8349g9664
$$ 202819 195066 -106621 -159549 -290314 -68335 -38624 -2144 -55368 -90830 -189179 -79664
18389b67395Q1043Q4666B02877F4774i060A71824a60692K0547B9162i7870A69822
$$ -267395 -186352 -101686 202877 64774 -9060 171824 -160692 -140145 29162 -97870 169822
18377b04306P9591A35226l3331a86753A03947e49539a66411g9712H0089d0226
$$ -204306 -124715 135226 101895 -186753 103947 -549539 -166411 -79712 80089 -40226
18366B77506D1793J3929K38457b71035h4343J0301j09719A05903a39476B27240
$$ 277506 41793 55722 294179 -271035 -84343 -74042 -183761 105903 -139476 227240
18355h9146j04026b7368k41241J1756C4975L19798J00046A653a435I2647b3341
$$ -89146 -193172 -27368 -268609 -256853 34975 354773 454819 1653 -1435 92647 -23341
18343b86667B65911D2474a2858j77629H1804M3238K1975d0459g128A12822j0778
$$ -286667 265911 42474 -12858 -190487 81804 125042 147017 -40459 -7128 112822 102044
18332A02044c26764J30006o9154a27047A94390a24077H006J89555j4165b44546
$$ 102044 -326764 -196758 -265912 -127047 194390 -124077 8006 197561 183396 -244546
18321b18718E0054a20406G6732a77480L8381A74150j2154a11606j5472F6873O4690
$$ -218718 50054 -120406 76732 -177480 -139099 174150 161996 -111606 -127078 66873 131563
18310A31563b46909Q4500j48733L7720J02836G2651J95885a38578M5735j65037
$$ 131563 -246909 -162409 -311142 -273422 -170586 72651 268536 -138578 -92843 -257880
18300b57880K8600f998A37233c68810a39799r4568o8388M1987A40365J25825c14213
$$ -257880 -229280 -6998 137233 -368810 -139799 -234367 -302755 -260768 140365 266190 -314213
18288A68450b01435B29976j5058B7789i2345k31940H5080q356e4817m6847j27033
$$ 168450 -201435 229976 214918 27789 -92345 -324285 85080 76724 -54817 -101664 -228697
18277b28697A15658B5248J16692a5423D8721O9053a26538C43347c66602A56919
$$ -228697 115658 25248 141940 -15423 48721 117774 -126538 343347 -366602 156919
18266c62888a09754O861j67326B24901a6070p6740k48165G4186c1125C38818C5189
$$ -362888 -109754 -102893 -270219 224901 -16070 -92810 -340975 74186 -31125 338818 35189
18254H2256A4716d24353A80345J43941C8949c99850B8637P3101a9854A85913q6232
$$ 82256 14716 -424353 180345 324286 38949 -399850 28637 101738 -19854 185913 99681
18243I9681O5960e276j96607g5621l7678H130a08149j91047D5090i657m6976n5824
$$ 99681 165641 -5276 -201883 -75621 -113299 8130 -108149 -299196 45090 -9657 -56633 -112457
18231a12457k23622A8177b0609k29777C14782I8700b48468A68278Q441B7441O2230
$$ -112457 -336079 18177 -20609 -250386 314782 98700 -248468 168278 176719 27441 89671
18220H9671c75147A70646b80478G2594J29846a45336A83696P1602h1845B9347
$$ 89671 -375147 170646 -280478 72594 202440 -145336 183696 255298 -81845 29347
18209A07697h803k62670A31860g1656d849A44384E8860P990a79361k24984h4201
$$ 107697 -8803 -271473 131860 -71656 -4849 144384 58860 66850 -179361 -404345 -84201
18197a02905A62090c86366C4620L32213h3919k67340f8580D7863Q437b36340D1716
$$ -102905 162090 -386366 34620 366833 -83919 -351259 -68580 47863 56300 -236340 41716
18185d75515a15568b3498A511M40003C8727i109n2890I0243O6097d55760A8983
$$ -475515 -115568 -23498 1511 441514 38727 -9109 -61999 90243 156340 -455760 18983
18173a57689N0557j62073H2721Q8120b54302A80359a71084M5715k20894B11169
$$ -157689 -107132 -269205 82721 170841 -254302 180359 -171084 -125369 -346263 211169
18162a6833A88119c02695B10235b16547B06603a9646j54117c708G1294a58989
$$ -16833 188119 -302695 210235 -216547 206603 -19646 -173763 -3708 71294 -158989
18151A20485a02028j21504J11539L9976A73881F5722g34577b3561p3910d2998
$$ 120485 -102028 -223532 -111993 -72017 173881 65722 -734577 -23561 -97471 -42998
18140c57255A30200b99071A44953j7518b58243e4118A03571D7135b10380h5635
$$ -357255 130200 -299071 144953 127435 -258243 -54118 103571 47135 -210380 -85635
18129g9170A22166b62159g7507I5878b48626a00098j63036B22675c4773B4523
$$ -79170 122166 -262159 -77507 95878 -248626 -100098 -263134 222675 -34773 24523
18118B4346A1638a03682n7757N1867j47388C57586j12683d6544I9225a446B45227
$$ 24346 11638 -103682 -161439 -109572 -256960 357586 244903 -46544 99225 -1446 245227
18106a83540B28410b68637K5138F5972a30990A24428k3813J48566j06940a205
$$ -183540 228410 -268637 -243499 65972 -130990 124428 100615 249181 142241 -1205
18095a00254B2908b7277j89916I1978a93038g974A52420J47584a23936A48703
$$ -100254 22908 -27277 -217193 91978 -193038 -7974 152420 300004 -123936 148703
18084b54985B75390A36952n8594a10349r1071A76443i6269K8841D40582i9156
$$ -254985 275390 136952 78358 -110349 -201420 176443 -96269 -67428 440582 -99156
18073B1755R9646c19662A337a26627i378j1660A49548P050o6913N9954a91666
$$ 21755 121401 -319662 1337 -126627 -9378 -21038 149548 156598 89685 149639 -191666
18061a42368M6796A04085m3796c43826A96485a09187l45122J94371c1989A77075
$$ -142368 -95572 104085 60289 -343826 196485 -109187 -454309 -259938 -31989 177075
18050a67708p3332L2035h5433k57127h5746k24942G0970K49035B0494o65K55669
$$ -167708 -241040 -209005 -85433 -342560 -85746 -310688 70970 320005 20494 19829 275498
18039B75498a53571D51302c9511k59982a49196D4179J25986A8167O6796L2641
$$ 275498 -153571 451302 -39511 -299493 -149196 44179 170165 18167 84963 117604
18029A17604O4475H1366B6711R5820g7009I6356B0468K7514Q0834c10602C2462
$$ 117604 182079 81366 26711 122531 -77009 96356 20468 47982 128816 -310602 32462
18017h5486B04229p263f3973b2088j45335j26443K9660A8555K02123I1730a14122
$$ -85486 204229 196966 -63973 -22088 -167423 -293866 -264206 18555 220678 91730 -114122
18005E8063a68379o2393C99285j95015h5764C69226b8240r3047A82313D144a83117
$$ 58063 -168379 -230772 399285 204270 -85764 369226 -28240 -121287 182313 4144 -183117
17993C03939A3786b03527E7274a33526D0746a25873C13219E5414f0440j40175
$$ 303939 13786 -203527 57274 -133526 40746 -125873 313219 55414 -60440 -200615
17983b00615a1315A3222b444A17070J60484c14654a53323g1432j09177A21746
$$ -200615 -11315 13222 -2444 117070 277554 -314654 -153323 -71432 -180609 121746
17972C32903a37256f0332l56049B94623r2984F0912b9275A54890K03817I6719
$$ 332903 -137256 -60332 -416381 294623 201639 60912 -29275 154890 358707 96719
17961b80449l826J19650P4246A4728J31279a14041j85451A00606a69557e2826
$$ -280449 -284275 -164625 -90379 14728 146007 -114041 -299492 100606 -169557 -52826
17950I2119b01349J8312k8174C9521c4332A36066F5844J31095e8797j64555D0077
$$ 92119 -201349 -183037 -211211 39521 -34332 136066 65844 196939 -58797 -223352 40077
17938a88179j25223A23613a60676q1711l514L5016B16726h2335A28513b22296
$$ -188179 -313402 123613 -160676 -242387 -245901 -210885 216726 -82335 128513 -222296
17927C9299M9887a00854J2731a5453E4721d4067F321a63458k16770A11163r734
$$ 39299 89186 -100854 -88123 -15453 54721 -44067 6321 -163458 -380228 111163 101429
17916A01429c8827E248J10039c41566q8575C39683a45895j29014B7112a69032
$$ 101429 -38827 5248 115287 -341566 -430141 339683 -145895 -274909 27112 -169032
17905F22577a02653j12232a5289B23543b70670g3826I862a98276G2511J37381
$$ 622577 -102653 -214885 -15289 223543 -270670 -73826 9862 -198276 72511 209892
17895B09892D3754J91105a67251m3695F8542c5886A18268a72479P0687r2859G113
$$ 209892 43754 234859 -167251 -210946 68542 -35886 118268 -172479 -101792 -194651 7113
17883A68341d70938b20822G7864J4029a6677C21664c7494l68190A70063a29628
$$ 168341 -470938 -220822 77864 91893 -16677 321664 -37494 -405684 170063 -129628
17872a11730l06672R6309B64989d25239A2856b9898E5005c32894D7074a26534
$$ -111730 -418402 -322093 264989 -425239 12856 -29898 55005 -332894 47074 -126534
17861G5884a65037o0733B19737c00057B84488l8282D0628K37523a04983K3897
$$ 75884 -165037 -225770 219737 -300057 284488 246206 40628 278151 -104983 -81086
17851h1086j17433P9533A04219D0389J36660a10467C77452G4625c0617j90104
$$ -81086 -198519 -118986 104219 40389 177049 -110467 377452 74625 -30617 -220721
17841b20721A73795A1198a05341A22723c57073a37775r6434C14165a3518c167
$$ -220721 173795 11198 -105341 122723 -357073 -137775 -234209 314165 -13518 -3167
17830B7900a28134M4433G7843c02255a15047J2723A39417a41883A946b24286B81305
$$ 27900 -128134 -83701 77843 -302255 -115047 -102324 139417 -141883 1946 -224286 281305
17818a27666c0991r097k25910Q3670C14598D3557K74823a8439A11252E1823p561
$$ -127666 -30991 -40088 -265998 -182328 314598 43557 318380 -18439 111252 51823 44262
17807D4262b13461R0003B72607g8558r602m17222A45439b39412h1250b2310l1642
$$ 44262 -213461 -123458 272607 -78558 -88160 -505382 145439 -239412 -81250 -22310 -53952
17796e3952B65996a00600E9467A6398L60184A3214b04682f2151j93817i1779E737
$$ -53952 265996 -100600 59467 16398 376582 13214 -204682 -62151 -255968 -91779 5737
17784A00925a31873n7277A07625C8016a99460A9119J00326J80574D1678Q9383
$$ 100925 -131873 -189150 107625 38016 -199460 19119 119445 300019 41678 131061
17774A31061b37994J18283A14921Q3657j4481o0428a70C16399b58203F2160a93134
$$ 131061 -237994 -119711 114921 198578 184097 123669 -170 316399 -258203 62160 -193134
17762a96314G7678M3923b78762A39781A9139R2016Q2895M2795B7497J71522a67020
$$ -196314 77678 121601 -278762 139781 19139 111155 194050 236845 27497 199019 -167020
17750H705K87707A733a29110n6932r964P1060B79178h7867B28021c20574B182
$$ 8705 296412 1733 -129110 -186042 -196006 -124946 279178 -87867 228021 -320574 2182
17738B41621M509A10820J37332B5283b525l01556e678E7661a9620m9187l79958
$$ 241621 246130 110820 248152 25283 -2525 -304081 -5678 57661 -19620 -68807 -448765
17727d48765J85010h653j57384B15642a0744A0765a28169K4948A39525O6994J54582
$$ -448765 -263755 -8653 -166037 215642 -10744 10765 -128169 -103221 139525 206519 361101
17716C61101f4291l471B8213a74473j3755c2509D3781a23459K0577I0795L6812
$$ 361101 -64291 -67762 28213 -174473 -188228 -32509 43781 -123459 -102882 90795 127607
17705A27607a32022K8184l30013a58448k8995B70141A06393b20523D0648a69440
$$ 127607 -132022 -103838 -433851 -158448 -187443 270141 106393 -220523 40648 -169440
17694e9190k0519B30265E8465b38506G6306A85b64042C44617d00845E93849A44953
$$ -59190 -79709 230265 58465 -238506 76306 185 -264042 344617 -400845 593849 144953
17682g7663A05416J7812c2707C67361b96068e7876B72916c02110c0413B04436
$$ -77663 105416 123228 -32707 367361 -296068 -57876 272916 -302110 -30413 204436
17671B10611K65015I668J01431b2138C4006a77944G539O2926h0129J2997A39437
$$ 210611 475626 9668 111099 -22138 34006 -177944 7539 70465 -80129 -67132 139437
17659a50053F1642L6753J25104N1840n667C5068P3845N3954p5146L4478a23066
$$ -150053 61642 98395 223499 275339 269672 35068 108913 162867 87721 122199 -123066
17647C570K8149D357K45646N5520A50438j820R4964b7300p226A11636a27055j25205
$$ 3570 31719 4357 250003 305523 150438 148618 243582 -27300 -34526 111636 -127055 -252260
17635b52260J25522k0877F3331D795g4575c5847I6631J92455A42180C0385a96474
$$ -252260 -126738 -147615 63331 4795 -74575 -35847 96631 289086 142180 30385 -196474
17623A45020R9470E028L371e0769q2404A17066a83243A08838l9893f240C66139
$$ 145020 244490 5028 8399 -50769 -133173 117066 -183243 108838 68945 -6240 366139
17611A81015J71075a78500B28169N4499a51507D12851G9521J35817q5239b43864
$$ 181015 352090 -178500 228169 282668 -151507 412851 79521 215338 130099 -243864
17600D7323d8346B80245A20820a67996C76299a85230l2020H5358N1834h7257A59877
$$ 47323 -48346 280245 120820 -167996 376299 -185230 -217250 85358 137192 -87257 159877
17588b93351B00088a62947j33345A57250j1939c51350f7299B59811A15413J16367
$$ -293351 200088 -162947 -296292 157250 145311 -351350 -67299 259811 115413 231780
17578B31780E4926h824k65189c5438j18683A95159g4675A89854l5189a25741B21530
$$ 231780 54926 -8824 -274013 -35438 -154121 195159 -74675 189854 154665 -125741 221530
17566a06992B16405c07281g6602n8488d6066K0961H5659C7150J86285J17434D4791
$$ -106992 216405 -307281 -76602 -135090 -46066 -25105 85659 37150 223435 340869 44791
17554B9527r244J62935d1686q6011E4189L29914A30614b52133B81967K68980b05456
$$ 29527 20283 183218 -41686 -127697 54189 384103 130614 -252133 281967 550947 -205456
17542b25276b5978F4195A6457Q7583h860C43214j37055k1859m9130J22950G7002
$$ -225276 -25978 64195 16457 104040 -8860 343214 206159 184300 135170 258120 77002
17530A81534b42644B20656o7899D1837b4730j01898I8461g6982I2634J69613b38692
$$ 181534 -242644 220656 152757 41837 -24730 -126628 98461 -76982 92634 262247 -238692
17518A63997f6814J6557n1123n7089D3035N9448J2539C4070J57201a46482l3977
$$ 163997 -66814 -50257 -101380 -158469 43035 102483 115022 34070 191271 -146482 -180459
17507a80459j5416A66299J03267J21163A20922J2799d0057B90876b59823B85295
$$ -180459 -195875 166299 269566 390729 120922 133721 -40057 290876 -259823 285295
17496a24503A27302J39510J2910F0107J14814d1960f408G9867J08106a07711M8142
$$ -124503 127302 266812 279722 60107 174921 -41960 -6408 79867 187973 -107711 -59569
17485e9569m3265d9415A18424J38766p2049c623m0317B9533K07618a39141A95704
$$ -59569 -102834 -49415 118424 257190 185141 -3623 -43940 29533 237151 -139141 195704
17473a46978B40980d1454A85902k2011g0082A9280K09626m5410J93686I1592h2373
$$ -146978 240980 -41454 185902 163891 -70082 19280 228906 183496 377182 91592 -82373
17461a83810D08766j33740m8937n1405A8157M3505K4312B1547L13950l4702b9369
$$ -183810 408766 275026 226089 174684 18157 61662 85974 21547 335497 300795 -29369
17449B31105J61897h9228A66933J72010p5476K86687o4607h2963B47052P7591
$$ 231105 393002 -89228 166933 338943 263467 550154 485547 -82963 247052 324643
17439C24643C3631K13065J50257E1822N26907N9312C01445A41076J59394D40K52293
$$ 324643 33631 246696 396953 51822 578729 638041 301445 141076 300470 440 252733
17428B52733o5010k8990J92922b4743A67912J00470r0108J85106E3946N2333K24504
$$ 252733 187723 158733 351655 -24743 167912 268382 178274 363380 53946 106279 330783
17417C30783r2756B0710K9916J56758J2576n71L3697G1240J27542o1632D9224
$$ 330783 238027 20710 50626 207384 219960 219389 253086 71240 198782 137150 49224
17405A51709J19047B0657P2989g3351B04749M3345J05870m0869b1370m7638B4761
$$ 151709 270756 20657 93646 -73351 204749 248094 353964 313095 -21370 -69008 24761
17393B02012K2022H8221J90237A07218d7877j84921D20850B09406m8312M09124
$$ 202012 224034 88221 278458 107218 -47877 -232798 420850 209406 161094 570218
17383E70218k73162l5205e205I4765J92712a91551C3590K51136o8176B2635J15141
$$ 570218 297056 261851 -5205 94765 287477 -191551 33590 284726 216550 22635 137776
17372A37776K00521A02930N4766M5613D7582K92754A56536p6534a9900C59749
$$ 137776 338297 102930 157696 203309 47582 340336 156536 80002 -19900 359749
17361C25691A62368D6682N7860b38807B27917d69669e9259o1363A78647B6648
$$ 325691 162368 46682 104542 -238807 227917 -469669 -59259 -120622 178647 26648
17350I031L85064G8716K53718p9380A0761L39816j30019I2130A7097O7453J04018
$$ 9031 394095 78716 332434 253054 10761 350577 220558 92130 17097 84550 188568
17339A88568E7280P4325n3319K972K37614e5742a5697B6165a34461l9905C08528
$$ 188568 57280 131605 78286 81258 318872 -55742 -15697 26165 -134461 -174366 308528
17327A51005J1087M6666K67952b52782B17837G7537J91491q8081J7874F9410k2943
$$ 151005 162092 208758 476710 -252782 217837 77537 269028 180947 198821 69410 46467
17316D6467K65371n9245P1126E6515K44865F1029R2819a06072I5997J05814R0649
$$ 46467 311838 252593 323719 56515 301380 61029 153848 -106072 95997 201811 292460
17305B92460K9654A37944M95518B74613o3789J34497B0856K60878I3603K68362
$$ 292460 322114 137944 633462 274613 210824 345321 20856 281734 93603 361965
17295C61965A12913K4203h6611B43992q8903K09225A59034L8617p4181B2595P5752
$$ 361965 112913 137116 -86611 243992 155089 364314 159034 197651 123470 22595 98347
17284I8347J12309j4864o8731E0450a43840D74693G2507K959L53357j51677J08186
$$ 98347 210656 195792 127061 50450 -143840 474693 72507 75466 428823 277146 385332
17273C85332j62068G2665a38392A44876a05172A49593M7455N2748J38259A81686
$$ 385332 223264 72665 -138392 144876 -105172 149593 197048 249796 388055 181686
17262B63837a5834B96664I1827J25831F3165e5762G4805k0761j4474K95803a96920
$$ 263837 -15834 296664 91827 217658 63165 -55762 74805 54044 39570 335373 -196920
17250B75644Q6000j30107q8842J0853P7648b2068B48747D6754L92141j2914A08853
$$ 275644 361644 231537 142695 153548 231196 -22068 248747 46754 438895 425981 108853
17238B16066a64842C04722J65835p8681j87801o5880K35121f7689A13429J43797
$$ 216066 -164842 304722 470557 391876 204075 138195 373316 -67689 113429 257226
17228B57226q6453l8935B3871a24564D3997M6496K03099O4069F675f1102C71355
$$ 257226 170773 131838 23871 -124564 43997 90493 293592 357661 6675 -61102 371355
17216B28258R5731K1226A50741c7311C15009l6025j33271k2413P1577P2696j12503
$$ 228258 323989 345215 150741 -37311 315009 278984 145713 123300 194877 267573 155070
17205A55070J12987A20491L82772G860J49715J98939q4356j27525d159D07509
$$ 155070 268057 120491 503263 7860 157575 356514 272158 144633 -4159 407509
17194B93514C5183K55310A32839L2953K58610n8203C5278K79979A22369M03402
$$ 293514 35183 290493 132839 165792 424402 366199 35278 315257 122369 525771
17184E25771B25301L23084B66897J27459G0769B0368J07348K2568R7954J38034
$$ 525771 225301 548385 266897 394356 70769 20368 127716 150284 248238 386272
17174C86272j87478J22533p1654J6550J33423M0439A27548K38938j28863J2317
$$ 386272 198794 321327 249673 266223 399646 440085 127548 366486 237623 249940
17164B49940J02738j36037K43667b1749E10937H7467L60046j76859J01941o9107
$$ 249940 352678 216641 460308 -21749 510937 87467 447513 270654 372595 303488
17154C03488K37996j47103A10159L30682R1031j15274j34603J4841D6633J59511
$$ 303488 541484 394381 110159 440841 531872 416598 281995 296836 46633 206144
17144B06144q1220K48062n2283L10703k72892j21461L56345A22634Q1601P8307
$$ 206144 124924 372986 320703 631406 358514 237053 593398 122634 204235 282542
17134B82542R229K18028J22272k58980G4611L25571N3698K6841r4762A91736J26635
$$ 282542 291771 509799 632071 373091 74611 400182 453880 480721 385959 191736 318371
17123C18371J29913N5073k50645Q1970R434O5236J31947p0146j77912J74246J42939
$$ 318371 448284 503357 252712 334682 344116 409352 541299 471153 293241 467487 610426
17112F10426I9532K69061j5362r7119J86590K4807k09558M0822k842R291K08362
$$ 610426 99532 368593 353231 256112 442702 467509 257951 298773 295931 305222 513584
17101E13584j37693j51378J16083H5758K67462M2239j07548k2430L34352k60011
$$ 513584 375891 224513 340596 85758 353220 395459 287911 265481 599833 339822
17091C39822K22984k9416j47467O7836L1483J92916B76649L46708j94320R4313
$$ 339822 562806 533390 385923 453759 485242 678158 276649 623357 429037 523350
17081E23350I3583M74538K24297l58306B12860K82563q1637L51606o5628C10712
$$ 523350 93583 568121 792418 434112 212860 495423 413786 765392 699764 310712
17070E08441K36953J21973k13859J54434l73943J23913r7776l9391L16318k01677
$$ 508441 745394 867367 653508 807942 433999 557912 460136 420745 737063 535386
17060E35386j09111N1826Q7635R0360j70225k9860j15767O020M52694l76602K61270
$$ 535386 426275 478101 565736 656096 485871 456011 340244 346264 798958 422356 683626
17049F83626k77879j07650L52235j31826Q5353K11124k30718R104M5236p1155
$$ 683626 405747 298097 650332 518506 603859 814983 584265 593369 638605 567450
17039E67450R5792m0667J06485o2343M6666l15827J97151k10516L24629L7875
$$ 567450 663242 622575 729060 666717 713383 397556 594707 384191 708820 746695
17029G46695n8465J97274l68546q2427R7500L00892J38536j67584J64630j21420
$$ 746695 688230 885504 516958 434531 532031 832923 971459 803875 968505 847085
17019H47085j11437m0985q7122M45532D53924O05579N5433l16565l57805L08736
$$ 847085 735648 694663 607541 1053073 453924 1059503 1114936 798371 440566 749302
17009G49302k9890R6886j0745R8001J07155k17367l3691n2065J39730K54593k34337
$$ 749302 719412 816298 805553 903554 1010709 793342 759651 707586 847316 1101909 867572
16998H67572N0118k99520M62119D99990O81826k50932j88791J68381k3662L1451
$$ 867572 917690 618170 1080289 499990 1181816 930884 742093 910474 886812 918263
16988I18263j61470L19339j58810M84963n65353K57038k83465J60906J03059m5627
$$ 918263 756793 1076132 917322 1402285 836932 1093970 810505 971411 1074470 1028843
16978A028843m34837M03686j78336k49060M07703J17309k62535M64100k74317
$$ 1028843 594006 997692 819356 570296 977999 1095308 832773 1296873 1022556
16969A022556l21099k46061M26961M7841K05296r7536J26446M1426k46415K21582
$$ 1022556 701457 455396 882357 930198 1135494 1037958 1164404 1205830 959415 1180997
16959A180997j26438J27810L83848m68705R4395O8545j76630J87316l37842M42109
$$ 1180997 1054559 1182369 1566217 1097512 1191907 1260452 1083822 1271138 933296 1375405
16949A375405K12531m24557j85115J17193o7934M9962K91855k78461J10906O19734
$$ 1375405 1587936 1163379 978264 1095457 1027523 1077485 1369340 1090879 1201785 1821519
16939A821519k94231k35328N88724l71512l792j77167K30479j29977R0395j64493
$$ 1821519 1527288 1291960 1880684 1509172 1505380 1328213 1558692 1428715 1519110 1354617
16929A354617M99550k88083k03475L51505l17434L66798k10820O1628j79856j40190
$$ 1354617 1854167 1566084 1362609 1714114 1396680 1763478 1552658 1614286 1434430 1294240
16919A294240K12869P2853J82872j64180J04898o0082L31336k37978j85461K69509
$$ 1294240 1507109 1579962 1762834 1598654 1703552 1643470 1974806 1736828 1551367 1820876
16909A820876L1566j45207j41199M57103J36009n10322j35271K96407O4027o6153
$$ 1820876 1852442 1707235 1566036 2023139 2159148 1648826 1513555 1809962 1873989 1807836
16899A807836M97969k26972l11435N65442k68145K72378p1428J89468k7075k75859
$$ 1807836 2305805 2078833 1767398 2332840 2064695 2337073 2265645 2455113 2428038 2152179
16889B152179J4963L61634l69758L48434n26740M04808K89506k02046O5020K6003
$$ 2152179 2167142 2528776 2159018 2507452 1980712 2385520 2675026 2472980 2538000 2564003
16879B564003k8096K19463o1690J70544l99473J63112L94469k75627J03464J23826
$$ 2564003 2535907 2755370 2693680 2864224 2464751 2627863 3022332 2746705 2850169 2973995
16869B973995J77867k6157k51873J85229L5926J23961K02882k06447J44605l4163
$$ 2973995 3151862 3125705 2873832 3059061 3094987 3218948 3421830 3215383 3359988 3325825
16859C325825k04459L91228P5059J61773p9471k61439K40018N61308p53761M38882
$$ 3325825 3121366 3512594 3587653 3749426 3669955 3408516 3648534 4209842 3456081 3894963
16849C894963k9122K18311J74876j03171k92882P045L21828J07679J66489p0089
$$ 3894963 3865841 4084152 4259028 4155857 3862975 3870020 4191848 4299527 4466016 4395927
16839D395927L32452l50251M15171n4171N40382k82236R3147k32897L73630Q246
$$ 4395927 4728379 4378128 4793299 4739128 5279510 4997274 5090421 4857524 5231154 5239400
16829E239400K74767j02917J66376j60469N49941Q2605l35274Q38986j80519N6351
$$ 5239400 5514167 5411250 5577626 5417157 5967098 6049703 5714429 6553415 6372896 6429247
16819F429247J4861l9993K98265J12151P8360M02410K23574J25637p5345K80569
$$ 6429247 6444108 6404115 6702380 6814531 6892891 7295301 7518875 7644512 7569167 7849736
16809G849736l7161M28458q6271R355N60177p5183M45738k23325O57801N9093
$$ 7849736 7812575 8241033 8154762 8164117 8724294 8649111 9094849 8871524 9529325 9588418
16799I588418K44159Q9394Q21668J2375k09939M57453M72322N99075J06512L1822
$$ 9588418 9832577 9921971 10743639 10756014 10546075 11003528 11475850 12074925 12181437 12213259
16789A2213259K46439M77453L29072M69667r1672N46162L05621Q45256N52924
$$ 12213259 12459698 12937151 13266223 13735890 13644218 14190380 14496001 15341257 15894181
16780A5894181M46526L71709J077299R3813N78689Q45516L24749R48032K10011
$$ 15894181 16340707 16712416 17789715 17883528 18462217 19307733 19632482 20580514 20790525
16771B0790525P15727P09445R41067R90028Q05480J023479N73745J109121J049941
$$ 20790525 21506252 22215697 23156764 24146792 24952272 25975751 26549496 27658617 28708558
16762B8708558J030623J364049J193363J002604J386941J845353J192489J825620
$$ 28708558 29739181 31103230 32296593 33299197 34686138 36531491 37723980 39549600
16754C9549600J762692J725132J708929K142866K303672K195353K050541K537882
$$ 39549600 41312292 43037424 44746353 46889219 49192891 51388244 53438785 55976667
16746E5976667L182800K699600K988414L382524L590391L504228L802330M233495
$$ 55976667 59159467 61859067 64847481 68230005 71820396 75324624 79126954 83360449
16738H3360449M080704M894766M466437M978204M818766N606530N380990N433435
$$ 83360449 87441153 92335919 96802356 101780560 106599326 112205856 117586846 123020281
16730A23020281N540670N466855N532710N548684N337977M862263M616113M095774
$$ 123020281 128560951 134027806 139560516 145109200 150447177 155309440 159925553 164021327
16722A64021327L370227K441588J974849J189662L62876p55312j450154k041102
$$ 164021327 167391554 169833142 171807991 172997653 173360529 172605217 171155063 169113961
16714A69113961k798952l388740m454485m668515m872818n551361n426920n798921
$$ 169113961 166315009 162926269 158471784 153803269 148930451 143379090 137952170 132153249
16706A32153249n667667n599205n585395n171825n220976n415977m897414m454894
$$ 132153249 126485582 120886377 115300982 110129157 104908181 99492204 94594790 90139896
16698I0139896l996902m811462l923081m198160l125003l543553l496638k565983
$$ 90139896 86142994 81331532 77408451 73210291 70085288 66541735 63045097 60479114
16690F0479114l154827k410625k741583k323434k243047k015316j880820j900707
$$ 60479114 57324287 54913662 52172079 49848645 47605598 45590282 43709462 41808755
16682D1808755j737399j468692k193612j067470j361290j226395j104182j635195
$$ 41808755 40071356 38602664 36409052 35341582 33980292 32753897 31649715 30014520
16674C0014520q74824j357818j375915o13944r34452o09180j075660m67895q33097
$$ 30014520 29139696 27781878 26405963 25792019 24857567 24248387 23172727 22704832 21871735
16665B1871735r71887o92988n96281p50559k97887q68990o55609k7011o57053
$$ 21871735 20899848 20206860 19610579 18860020 18562133 17693143 17037534 17010523 16353470
16656A6353470n51225l91940n11102n57642l96020k27156k57068m3903o80552
$$ 16353470 15802245 15410305 14899203 14341561 13945541 13718385 13461317 13417414 12736862
16647A2736862k88898k69810n93088j45431n73114J12225j2163o74709k76989
$$ 12736862 12447964 12178154 11585066 11439635 10866521 10978746 10966583 10291874 10014885
16638A0014885k34463q0742j86817l15410m96958O9737k48795r3264p8157k33214
$$ 10014885 9780422 9699680 9512863 9197453 8700495 8770232 8521437 8428173 8350016 8116802
16628H116802k27771l92922J76576l12268k70158J06034k34276o8811j88556K07684
$$ 8116802 7889031 7496109 7672685 7360417 7090259 7196293 6962017 6893206 6704650 6912334
16618F912334n83749L61573l92475j77351k35918j08381j08108J16718l38335
$$ 6912334 6328585 6690158 6297683 6120332 5884414 5776033 5667925 5784643 5446308
16609E446308j08254m9763j90387J98170n98673M05938P831l68592l06335j14246
$$ 5446308 5338054 5288291 5097904 5296074 4697401 5103339 5111170 4742578 4436243 4321997
16599D321997P1686n220J2218k35554M48341o67831K02952k97675j50116M11587
$$ 4321997 4393683 4388463 4400681 4165127 4613468 3945637 4148589 3850914 3700798 4112385
16589D112385k26344k7891M2868k97820K94726o01245N66133j70603k48652n7330
$$ 4112385 3886041 3858150 3901018 3603198 3897924 3296679 3862812 3692209 3443557 3386227
16579C386227J2906p470K89349n03073j72261O5982j08902j1840J9213Q2616m51181
$$ 3386227 3399133 3391663 3681012 3177939 3005678 3071660 2962758 2950918 2970131 3052747 2601566
16568B601566K84539n2217M4265k48816M7373k469l9321J78934j30425j19611
$$ 2601566 2886105 2833888 2878153 2629337 2676710 2674241 2634920 2813854 2683429 2563818
16558B563818J96708j06989Q9295m86942K82044j72834n3373l107p2223j6151
$$ 2563818 2760526 2653537 2742832 2255890 2537934 2365100 2311727 2308620 2236397 2220246
16548B220246J78296K88457p40398J62548l31435N51255o09041K76030j0735j90037
$$ 2220246 2398542 2686999 1946601 2109149 1777714 2328969 1719928 1995958 1985223 1795186
16538A795186K45048r4674K8000j20083l25755J84001K69145p4221j37729L7961
$$ 1795186 2040234 1945560 1973560 1853477 1527722 1711723 1980868 1906647 1768918 1806879
16528A806879m9245j61796J12570K07353l4066m84570K59373J16666k63110N0070
$$ 1806879 1757634 1595838 1708408 1915761 1881695 1397125 1656498 1773164 1510054 1560124
16518A560124K51683l35110j55227L48985Q6816l54293K74341J77544n95061L45427
$$ 1560124 1811807 1476697 1321470 1670455 1757271 1402978 1677319 1854863 1259802 1605229
16508A605229l35901j9373J38090J21843k77546J22247K95411k60064k65489J38022
$$ 1605229 1269328 1249955 1388045 1509888 1232342 1354589 1650000 1389936 1124447 1262469
16498A262469j17821K81538q9513j75241m2999J04652R9562L52528o07744o6360
$$ 1262469 1144648 1426186 1336673 1161432 1118433 1223085 1322647 1675175 1067431 1001071
16488A001071M41381j7796n36750J24217L04706k06787p3416K36075q9489k04239
$$ 1001071 1442452 1424656 887906 1012123 1316829 1110042 1036626 1272701 1183212 978973
16478I78973O0948q0831K62024m9016k77096O1637N6230J93843j81055o7338J34977
$$ 978973 1039921 959090 1221114 1172098 895002 956639 1012869 1206712 1025657 958319 1093296
16467A093296r3071j01038k061K37758n07077K64057K94304m68524K79563K66603
$$ 1093296 1000225 899187 897126 1134884 627807 891864 1186168 717644 997207 1263810
16457A263810j5804k86814K1534k88044K41607o172r15k55455J75891K51189l39258
$$ 1263810 1248006 961192 982726 694682 936289 930117 929202 673747 849638 1100827 761569
16446G61569j15197j18276M18521k9615O978J31337j99272k02402M54444n5024
$$ 761569 646372 528096 946617 917002 923980 1055317 856045 653643 1108087 1053063
16436A053063m7375j21605j56441K93544l26508j47915L37765l82484L3816J09695
$$ 1053063 1005688 884083 727642 1021186 694678 546763 884528 502044 535860 645555
16426F45555K6696J8930j25806K18776j35833K7139J58005p7733j29944J69531
$$ 645555 672251 691181 565375 784151 648318 675457 833462 755729 625785 795316
16416G95316J1153n9932R7541D00261n8171M99160k78591J63574j28297k5120
$$ 795316 806469 746537 844078 400261 342090 841250 562659 726233 597936 572816
16406E72816K41117j27999k62406J61203K99396D24261K7414J17330Q5314J50486
$$ 572816 813933 685934 423528 584731 884127 424261 451675 569005 654319 804805
16396H04805k85826L42195k94427j071N10827C21252J60066K9265k39473M73510
$$ 804805 518979 861174 566747 565676 1076503 321252 481318 510583 271110 744620
16386G44620k73482P4430k23501M03030k10454B15488K38836j68874J06520R7180
$$ 744620 471138 545568 322067 725097 514643 215488 454324 285450 391970 489150
16376D89150R2504B50388I6461Q63904m50398B23966K55954j7462N4593A01899
$$ 489150 581654 250388 96461 960365 509967 223966 479920 462458 517051 101899
16365F23930A86164K54043J93124k47171P9233j563J42862B89022L22810n7048
$$ 623930 186164 440207 633331 386160 465393 463830 606692 289022 611832 554784
16355E54784j66558K41701A80909K87409J520A89863K13013q5471J78348K60969
$$ 554784 388226 629927 180909 468318 469838 189863 402876 317405 495753 756722
16345G56722J48565k62627j82708k27198L80748M5972k50838J93178j92713B03734
$$ 756722 905287 642660 459952 232754 613502 659474 408636 601814 409101 203734
16334E2726N04125j61104J39456k35526L2523A18583L96588A51111R4112J52303
$$ 52726 556851 395747 535203 299677 332200 118583 515171 151111 245223 397526
16324C97526J09482A63580J06534K46934J95618B46846L3506K19047k6985n9973
$$ 397526 507008 163580 270114 517048 712666 246846 280352 499399 472414 412441
16314D12441A08428J14662J91061j70363K26887A83876K91896P1531j31692l8929
$$ 412441 108428 223090 414151 243788 470675 183876 475772 547303 415611 376682
16304C76682j61030o0744k6761L68341A88058J99794j02924q9066J90272R6887
$$ 376682 215652 154908 128147 496488 188058 387852 284928 195862 386134 483021
16294D83021j91249L29224k91872N3345L1369J64475k82601A41647K71686A28315
$$ 483021 291772 620996 329124 382469 413838 578313 295712 141647 413333 128315
16283D49742o2519n8641c6112A92314G9659j4491L42485K1979A59064m7217K69115
$$ 449742 387223 328582 -36112 192314 79659 65168 407653 429632 159064 111847 380962
16272C80962j32425I5501K49108J19297B13098K5685K26776A38116K00838l0528
$$ 380962 248537 95501 344609 463906 213098 238783 465559 138116 338954 308426
16262C08426j11751P837J61189R3957k7180H4516e6130A00543a63751D59747j71391
$$ 308426 196675 204512 365701 459658 432478 84516 -56130 100543 -163751 459747 288356
16251B88356J47236b00293P8006D37171p1527j56541a40628H1602K16444K19730
$$ 288356 435592 -200293 -122287 437171 365644 209103 -140628 81602 298046 517776
16241E17776A62718F1172L47385M5682L2447j80852J4977i6300C01528C0266L26636
$$ 517776 162718 61172 408557 454239 486686 305834 320811 -96300 301528 30266 356902
16230C56902c7155D63946B05998J76109A65170K80168J728o2046j75677l3781
$$ 356902 -37155 463946 205998 382107 165170 445338 447066 385020 209343 175562
16220A75562E7993J32099i179B71065P5622k4309p2338K01177a50220b3517I0369
$$ 175562 57993 190092 -9179 271065 346687 322378 250040 451217 -150220 -23517 90369
16208b6141H8545J42248B1153Q3753K36100d5751H456J24843A7909J34810e7253
$$ -26141 88545 230793 21153 104906 341006 -45751 8456 133299 17909 152719 -57253
16196A68928E2303L0347J16590H407O5356K0354M4647d8511A93020r1859D0908
$$ 168928 52303 82650 199240 8407 73763 94117 138764 -48511 193020 101161 40908
16184E96417B52604K6934A19409e7779E6184K018J04145D5371b837B50216g0706
$$ 596417 252604 279538 119409 -57779 56184 58202 162347 45371 -2837 250216 -70706
16172a90160g557D60191k25290H9287B5758A2226Q2043a30660A95443b62636A0189
$$ -190160 -7557 460191 234901 89287 25758 12226 94269 -130660 195443 -262636 10189
16160A71577L25099e989C57540E5931a08852C41928O6471A47438m2754J77834
$$ 171577 496676 -5989 357540 55931 -108852 341928 408399 147438 104684 282518
16150B82518k0608J4783a27222F3075B1533J45726C8254f1896j3651H5429K28525
$$ 282518 261910 276693 -127222 63075 21533 167259 38254 -61896 -75547 85429 313954
16139C13954a03780r3587C96241A88830o7857J32464A15579a31436A83662c19224
$$ 313954 -103780 -197367 396241 188830 120973 253437 115579 -131436 183662 -319224
16128i0432B57122N4045k5017n5968i1880A04673P7030b3934A23307c9494I8866
$$ -90432 257122 311167 286150 230182 -91880 104673 181703 -23934 123307 -39494 98866
16116B22517a04602B77535j04184R8848a68702B70657a32829A09936a41085j45908
$$ 222517 -104602 277535 173351 272199 -168702 270657 -132829 109936 -141085 -286993
16106b86993P5243F5242J94711B4845a61125A86803k2586K41675b7419B4177e8507
$$ -286993 -211750 65242 259953 24845 -161125 186803 164217 405892 -27419 24177 -58507
16094h4436A59020a131B37470O0014j10576d0718F3007a5119A12454j5336A8256
$$ -84436 159020 -1131 237470 297484 186908 -40718 63007 -15119 112454 97118 18256
16082A06323M5830a0766C89580J27546B09982f788A76488P3385o2011P5175b26779
$$ 106323 152153 -10766 389580 517126 209982 -6788 176488 249873 187862 263037 -226779
16070f6091C52892c22483G0472l3812L72967p0988b41737B02975H1880L3907e9902
$$ -66091 352892 -322483 70472 36660 409627 338639 -241737 202975 81880 115787 -59902
16058d4949j98288A14820J16487b29617K0963m4928D0986c73633B42621r5672
$$ -44949 -243237 114820 231307 -229617 -208654 -253582 40986 -373633 242621 146949
16048A46949p2395f4356a7089A00571m5109d64464A07418O9787J26787a03928
$$ 146949 74554 -64356 -17089 100571 55462 -464464 107418 177205 303992 -103928
16037b13619d0686A38244j5714a30597A16612J35263E3738a7945j84744J2131
$$ -213619 -40686 138244 122530 -130597 116612 251875 53738 -17945 -202689 -190558
16027a90558B38280A11608K16107g6722j09583e9495A54876J32204b9671j54631
$$ -190558 238280 111608 327715 -76722 -186305 -59495 154876 287080 -29671 -184302
16017a84302a6628k7638j18418H3244C5431G333K85683a01878j00220B2726n143
$$ -184302 -16628 -44266 -162684 83244 35431 7333 293016 -101878 -202098 22726 17583
16006A7583P8544i6102D17010e7583n4659A18837b60275A25632C9457h9159B10125
$$ 17583 96127 -96102 417010 -57583 -112242 118837 -260275 125632 39457 -89159 210125
15994f8813A27748n0360g9997C74224a26479B83803b0082D2027J8168O3518J11117
$$ -68813 127748 77388 -79997 374224 -126479 283803 -20082 42027 60195 123713 234830
15983B34830G5673K80088p5846J14017o0641A40232L2000J53732H4040C2298J51883
$$ 234830 75673 355761 279915 393932 333291 140232 172232 325964 84040 32298 184181
15972A84181a48226f26q0350A47634J13018a92151A3264J54647a24526g315B06218
$$ 184181 -148226 -626 -80976 147634 260652 -192151 13264 167911 -124526 -7315 206218
15960d2134A46056e96158E2368a63779j02722J2116j20445A7056c1618p0741q9920
$$ -42134 146056 -596158 52368 -163779 -266501 -254385 -374830 17056 -31618 -102359 -192279
15949a92279d4476C00764A0973a63421b9944A35954j842b65895P0532A6741b52184
$$ -192279 -44476 300764 10973 -163421 -29944 135954 134112 -265895 -195363 16741 -252184
15937a5261B3564P009c6180j24433j15092N342e6430C17312a32381K5484M4912
$$ -15261 23564 30573 -36180 -160613 -275705 -270363 -56430 317312 -132381 -106897 -61985
15926f1985B60649b40292h4741F7630a88586f3161k22758A2871P2756a74200b8705
$$ -61985 260649 -240292 -84741 67630 -188586 -63161 -285919 12871 85627 -174200 -28705
15914B83427F2270B1209b11460A7113J826N902E508d9296H5813d6201j34555d5127
$$ 283427 62270 21209 -211460 17113 18939 24841 5508 -49296 85813 -46201 -180756 -45127
15901c3547H0393J29625b74564e4701a5854B3445l115b5772A99702c51531D1954
$$ -33547 80393 210018 -274564 -54701 -15854 23445 20330 -25772 199702 -351531 41954
15889B0153K7103J02019J74317B8536J21731a21427b496m8809A83416b25053c9304
$$ 20153 47256 149275 323592 28536 150267 -121427 -2496 -51305 183416 -225053 -39304
15877F1144R870K650g3712n0291C85810c29637A04229n401N9787h959j43495i119
$$ 61144 71014 73664 -73712 -124003 385810 -329637 104229 98828 158615 -8959 -152454 -9119
15864B25759i8494c9153A913c19547N0011B80970j32143M3204a87233P0878j51403
$$ 225759 -98494 -39153 1913 -319547 -269536 280970 148827 192031 -187233 -116355 -267758
15853b67758A54742d2497q2565A88083a67128B8814a15423j32862A931a70478
$$ -267758 154742 -42497 -125062 188083 -167128 28814 -115423 -248285 1931 -170478
15842a71946d6584l0166B97874f6140A94680q8428Q6660f553j16581N8471A56243
$$ -171946 -46584 -76750 297874 -66140 194680 106252 192912 -6553 -123134 -64663 156243
15830f6613o2885B17163a50732A45777O627B7430J7570K19354A13950K03154a92471
$$ -66613 -129498 217163 -150732 145777 152404 27430 45000 264354 113950 317104 -192471
15818a35942A4660a17617I5064a219k23738a02317d4811k37138F8481J85219r4301
$$ -135942 14660 -117617 95064 -1219 -224957 -102317 -44811 -281949 68481 253700 159399
15807A59399J0470a51954G6365J03095K09695E49i6829k398Q677B51716b60640
$$ 159399 169869 -151954 76365 179460 389155 549 -96829 -99227 -90550 251716 -260640
15795A24644e2584A71078e9276b0718j4543A9826b00775j087B48250r4785G6544
$$ 124644 -52584 171078 -59276 -20718 -35261 19826 -200775 -201862 248250 153465 76544
15783G5680g7807p2033j06082P211P2849A47218F6352a94322M1240B47638j5150
$$ 75680 -77807 -149840 -255922 -248711 -175862 147218 66352 -194322 -153082 247638 232488
15772B32488a30337N1317r4439c8535D3784L9901a37189l60902B28519b8476j36871
$$ 232488 -130337 -79020 -173459 -38535 43784 83685 -137189 -498091 228519 -28476 -165347
15761a65347b7380j28717F9971M16849a72469L7690e0280j2582A94515F4182f7343
$$ -165347 -27380 -156097 69971 486820 -172469 -134779 -50280 -62862 194515 64182 -67343
15749A93984E2169b16484j9978B04055l8830a55186f5933j42066p1389l5062j3077
$$ 193984 52169 -216484 -236462 204055 165225 -155186 -65933 -207999 -279388 -314450 -327527
15738c27527B5644a98260L0035E4605a58990I0314b3723l51624J03759E0233N4599
$$ -327527 25644 -198260 -168225 54605 -158990 90314 -23723 -375347 -271588 50233 104832
15727A04832i0321l70163a56995K5926A05178k5167b74159d8039k60128b5868
$$ 104832 -90321 -460484 -156995 -131069 105178 80011 -274159 -48039 -308167 -25868
15716a02222E0801j9313b29604B25529b09893M4973e23j82495B0687L36188B1347
$$ -102222 50801 31488 -229604 225529 -209893 -164920 -523 -183018 20687 356875 21347
15704A18916B1045R0651K2548a63580E2593R4036P8138F3431a09965B37076E7675
$$ 118916 21045 111696 134244 -163580 52593 146629 224767 63431 -109965 237076 57675
15692b66053L8595P8297M9802m0219d5922r3533D8266J325a43413E47463a48028
$$ -266053 -227458 -149161 -99359 -139578 -45922 -139455 48266 49591 -143413 547463 -148028
15680D8664c25807B93787h1206l1742B49208B5291b9806A23655M2979G0250a33806
$$ 48664 -325807 293787 -81206 -112948 249208 25291 -29806 123655 166634 70250 -133806
15668B15516a81649A00518b17386P5115H1952b3377j94950I9014a79869k7250
$$ 215516 -181649 100518 -217386 -142271 81952 -23377 -218327 99014 -179869 -207119
15658b07119B91357q2970B3267M164J15806a21116k6946E6838K94816F557O9294
$$ -207119 291357 208387 23267 27431 143237 -121116 -148062 56838 351654 6557 75851
15647G5851K38619c0399r5765k7880j36642a340q2485j05192d3608D2223K1019
$$ 75851 314470 -30399 -126164 -154044 -290686 -1340 -83825 -189017 -43608 42223 63242
15636F3242N5812g4256A80532a42771B1524e73429h5263L2334A00664R0581c22118
$$ 63242 119054 -74256 180532 -142771 21524 -573429 -85263 -52929 100664 191245 -322118
15624a57838G2695a39081C76405i3494c6843A2063g5431D2401a89995H8285m1295
$$ -157838 72695 -139081 376405 -93494 -36843 12063 -75431 42401 -189995 88285 46990
15613D6990f680j6650I3437A8729J04625a01722M8504j16479O5443q2019A07646
$$ 46990 -6680 -23330 93437 18729 123354 -101722 -53218 -169697 -104254 -186273 107646
15601A99051c86931b6667r7196D41639g8432A41962b16373Q9908A19112b15092
$$ 199051 -386931 -26667 -123863 441639 -78432 141962 -216373 -126465 119112 -215092
15590H884a44086b3276B82068j25861D1303a04540F9705b9599A73436F424c94710
$$ 8884 -144086 -23276 282068 156207 41303 -104540 69705 -29599 173436 6424 -394710
15578D24510H4055d1667C58301c1777j6049j86671I372b98027O3891A392a52247
$$ 424510 84055 -41667 358301 -31777 -47826 -234497 9372 -298027 -234136 1392 -152247
15566A52465N6255o6699c8152D26133A54637d209j72591b3446k26887A65294b28936
$$ 152465 208720 142021 -38152 426133 154637 -4209 -176800 -23446 -250333 165294 -228936
15554C4718L9202R5836a01724A12325d9859B07654J52059j14279a59193l4475
$$ 34718 73920 169756 -101724 112325 -49859 207654 359713 245434 -159193 -193668
15544a93668a9655j49031A35150J63067J41350h700B1921M3986b42591A95919
$$ -193668 -19655 -168686 135150 298217 439567 -8700 21921 65907 -242591 195919
15533H9831c34172Q7076B68599A07861J28936a97184E7943J79005L3954b808m8326
$$ 89831 -334172 -247096 268599 107861 236797 -197184 57943 236948 270902 -2808 -51134
15522e1134A15301m0418A9413c58397L0671O8326M705e4961A06799J11124E2710
$$ -51134 115301 74883 19413 -358397 -327726 -259400 -254695 -54961 106799 217923 52710
15510D85529a9429j61095P5576I125J16248l6308O1698K0240c0056B8801b43008
$$ 485529 -19429 -180524 -104948 9125 125373 89065 150763 171003 -30056 28801 -243008
15498A62885b15087A50663j965h724r4670B67142E4718j9796L9590J85261h1749
$$ 162885 -215087 150663 148698 -8724 -103394 267142 54718 34922 74512 259773 -81749
15486b30688B67574l9345a74133A10092C2540a2077m8690A89774l0330b33427
$$ -230688 267574 228229 -174133 110092 32540 -12077 -60767 189774 159444 -233427
15475B78503p4901h0256A47568k9111m7336a51987I7093a3124l7267H4746O1895
$$ 278503 203602 -80256 147568 118457 71121 -151987 97093 -13124 -50391 84746 146641
15464A46641a73089j8768B01619b82553A57014h4550B09824a61202Q0159B60430
$$ 146641 -173089 -191857 201619 -282553 157014 -84550 209824 -161202 -81043 260430
15453A57684C9470d5050B13440j05161N8615d26545e388j38024A05527b26874
$$ 157684 39470 -45050 213440 108279 166894 -426545 -5388 -143412 105527 -226874
15442b52092H8073h6173j31651A280J13714J15780d2959r5184f1720a8000q786
$$ -252092 88073 -86173 -217824 1280 114994 230774 -42959 -138143 -61720 -18000 -26786
15431b6786B4130c1605m12887a62968B00516R0235a48110j54913a23389o7322
$$ -26786 24130 -31605 -444492 -162968 200516 290751 -148110 -303023 -123389 -190711
15421a90711k43022A13079a98302e9917j82528A39238J5453G3578J58696a2839
$$ -190711 -433733 113079 -198302 -59917 -242445 139238 154691 73578 232274 -12839
15410a2067k68582B6343c23272d2694C45015c91439M6713B73936B8546c20258
$$ -12067 -280649 26343 -323272 -42694 345015 -391439 -344726 273936 28546 -320258
15399A41855A9083a0890n5256A14070b23524R8842N8106J2554k6895B87974j10366
$$ 141855 19083 -10890 -66146 114070 -223524 -124682 -66576 -54022 -80917 287974 177608
15388A77608J45273c32344J42921M646c5752L100j23487C2034a23348n1747b8917
$$ 177608 322881 -332344 -189423 -184777 -35752 -32652 -156139 32034 -123348 -175095 -28917
15376e5421J8442B372a26475K9046d5108A44904b43859B27406c27053l275A58133
$$ -55421 -36979 2372 -126475 -97429 -45108 144904 -243859 227406 -327053 -330328 158133
15364a04284A56170k447a47864e1632o7448H5349f1825n0377o3936M1161k05743
$$ -104284 156170 153723 -147864 -51632 -119080 85349 -61825 -112202 -176138 -134977 -340720
15353c40720B42595n704H6721K51147E2795c88640a49932j39661f307k02681A37945
$$ -340720 242595 236891 86721 337868 52795 -388640 -149932 -289593 -6307 -208988 137945
15341B86590b51472B57669a56464k24030F0746J41223H7518c947D06606h0805
$$ 286590 -251472 257669 -156464 -380494 60746 201969 87518 -3947 406606 -80805
15330D0261K5816K09508A32369J12030a32304a693B44550F8166a57887A4301d51327
$$ 40261 66077 275585 132369 244399 -132304 -1693 244550 68166 -157887 14301 -451327
15318A91483a28252c0178D04555A35365a24040j76774B72339a18380A13861g6418
$$ 191483 -128252 -30178 404555 135365 -124040 -300814 272339 -118380 113861 -76418
15307a55177m4365B54280H8787a90087e3331l4814j16422a01481B03410P2785
$$ -155177 -199542 254280 88787 -190087 -53331 -88145 -204567 -101481 203410 276195
15297B76195E7520M63902A20886a27528E3503J41357e0052q9760h472n0953C1293
$$ 276195 57520 521422 120886 -127528 53503 194860 -50052 -139812 -8472 -59425 31293
15285b66342k3789H2763Q409J71881a42911A01093j0462h0420A64304K2931n2619
$$ -266342 -290131 82763 91172 263053 -142911 101093 90631 -80420 164304 187235 134616
15274A34616a47312A21127J51709J32625a21488m06208B81510a26309F4034a71672
$$ 134616 -147312 121127 272836 405461 -121488 -527696 281510 -126309 64034 -171672
15263C61039a84889N3043B81728j21142o4655i8945B78578h481k7418C2945L44695
$$ 361039 -184889 -131846 281728 160586 95931 -98945 278578 -8481 -35899 32945 377640
15252C77640A01105j2383K73850L39544M70828J210364o34588K77145l37267D27243
$$ 377640 101105 88722 362572 702116 1172944 2383308 1748720 2025865 1688598 427243
15241A06365d9553D58419E8626a78762K5799C5844R0388N2828C3807K26470j03970
$$ 106365 -49553 458419 58626 -178762 -152963 35844 126232 179060 33807 260277 156307
15230A56307R4933b2731D6531M54838b7517n2513C1192A0840a21386j72613A41805
$$ 156307 251240 -22731 46531 501369 -27517 -80030 31192 10840 -121386 -293999 141805
15218C54826g4034b7275g896D9658R8836A2947M20915a5804E2528J818f1499d417
$$ 354826 -74034 -27275 -7896 49658 148494 12947 433862 -15804 52528 54346 -61499 -4417
15205c20048e2445A32671c680H1428K06854j38397c1902A81403P4207D0832A0203
$$ -320048 -52445 132671 -3680 81428 288282 149885 -31902 181403 255610 40832 10203
15193B18319c0034B3733a29251k00926A50039i3716B72610a63822k05561B28617
$$ 218319 -30034 23733 -129251 -330177 150039 -93716 272610 -163822 -369383 228617
15182G0639c6741D82611j77268d6902B57511j3357C9017a31758j6758m3663E0942
$$ 70639 -36741 482611 305343 -46902 257511 244154 39017 -131758 -148516 -192179 50942
15170a33181k31675A5860K33919J93081k17236k8961a64728A7727b06314B98511
$$ -133181 -364856 15860 249779 442860 225624 196663 -164728 17727 -206314 298511
15159C80867a28970A77040i0357K6695E8324a8766B0546J02492a96714k3687A73004
$$ 380867 -128970 177040 -90357 -63662 58324 -18766 20546 123038 -196714 -220401 173004
15147F6439A0227M059E923a86538M6127A15123J97301c9027B11755H3789m0153
$$ 66439 10227 14286 5923 -186538 -140411 115123 312424 -39027 211755 83789 43636
15136D3636L48302b31056A39339N5007P2217J32742h3387A78128e0579a3808k762
$$ 43636 391938 -231056 139339 194346 266563 399305 -83387 178128 -50579 -13808 -16570
15125a6570B88419j11315N8611b7285B80868M931J62625j89649o1080c5744B05449
$$ -16570 288419 177104 235715 -27285 280868 285799 448424 258775 197695 -35744 205449
15113a60698D64756d9059H9011K55620r8865J04209A04691Q2792F3310J52580
$$ -160698 464756 -49059 89011 344631 245766 349975 104691 187483 63310 215890
15103B15890a25512A63180K02239d671A45100m544J1659a5744C7898K76447j03775
$$ 215890 -125512 163180 365419 -4671 145100 140556 152215 -15744 37898 314345 210570
15092B10570p5426n0946C1088K12169C3296N1939o741b75749B14694J1251L1083
$$ 210570 135144 84198 31088 243257 33296 85235 78494 -275749 214694 225945 257028
15081B57028C5348J62935J16161K3626a61853d8541B34676q4976l6349J47448
$$ 257028 35348 198283 314444 338070 -161853 -48541 234676 149700 113351 260799
15071B60799d6229E64522A41089F6497K97409c4852D356i3633b5280C31930C2890
$$ 260799 -46229 564522 141089 66497 363906 -34852 4356 -93633 -25280 331930 32890
15059A21638K54155q2621p6184Q7940A6113A748g6951D1081L83015A47298D4389
$$ 121638 375793 293172 216988 304928 16113 1748 -76951 41081 424096 147298 44389
15047h928B88000F6792B8086J35776L3718J08340j21881a26463J0861B99034E8159
$$ -8928 288000 66792 28086 163862 197580 305920 184039 -126463 -115602 299034 58159
15035C50892A15626J51177F6792L9469P1264j3101F5562a43998A64244A7182K42286
$$ 350892 115626 266803 66792 106261 177525 164424 65562 -143998 164244 17182 259468
15024B59468i6916l2326A93608E134J64975J00463K36821j98847f1295B31712
$$ 259468 -96916 -129242 193608 5134 170109 270572 507393 308546 -61295 231712
15013A88276r822q4868K69768j79206K80146A3079J51678L20885a82550O9431
$$ 188276 178454 93586 363354 184148 464294 13079 164757 485642 -182550 -113119
15003a13119B27869K1810F1239Q1355K7306P9284k2241C4564M56724j55701A61479
$$ -113119 227869 249679 61239 142594 169900 249184 226943 34564 491288 335587 161479
14991A31098J12313H119K97828b62808E8086L11681D5877L19117j9589G8967L75055
$$ 131098 243411 8119 305947 -262808 58086 369767 45877 364994 345405 78967 454022
14980D54022r9070j73200H2243r115a3135C61783j46328c646q3430B58888o3310
$$ 454022 354952 181752 82243 73128 -13135 361783 215455 -3646 -87076 258888 195578
14969A95578j7261J12164p0910H3350K24489d738A59878L56328A87382J01061
$$ 195578 178317 290481 219571 83350 307839 -4738 159878 516206 187382 288443
14959B88443M8410K82491k10460a34009B77622a42901D22370l8925J3963K1579
$$ 288443 336853 619344 408884 -134009 277622 -142901 422370 383445 397408 418987
14949D18987j91753K93881k59530q2557p6880J5304J98809k3347k1146m5o3024
$$ 418987 227234 521115 261585 179028 102148 117452 316261 292914 271768 271723 208699
14938B08699J7859c3299B50574L57939k72737A54180K75893j23631j27607J14469
$$ 208699 226558 -33299 250574 608513 335776 154180 430073 306442 178835 293304
14928B93304j12497p5546A9585J78978K07334j39870j29068K48084R078J96313
$$ 293304 180807 105261 19585 198563 405897 266027 136959 385043 394121 590434
14918E90434B13717J38649J80567Q121k63996r785n9730L13205j42092J60547
$$ 590434 213717 352366 532933 541054 277058 267273 207543 520748 378656 539203
14908E39203A70562K38943M0675k08033K26478a40986B53879j21514C1726K00496
$$ 539203 170562 409505 450180 242147 468625 -140986 253879 132365 31726 232222
14898B32222J93180G435O25447A91111r1303n225K29111J56955K844J78501C00484
$$ 232222 425402 7435 632882 191111 99808 94583 323694 480649 483493 661994 300484
14886B36150L68029j86244R8080I0864M89240j62865K84913B32770K11779j17561
$$ 236150 604179 417935 516015 90864 580104 417239 702152 232770 444549 326988
14876C26988F6948J91551A25535J42179J1464O3702J50611j43732m3048M9737
$$ 326988 66948 258499 125535 267714 279178 342880 493491 349759 306711 356448
14866C56448P1426J1746J34323k10844K50669j19423j91571K14881j33302A87648
$$ 356448 427874 439620 573943 363099 613768 494345 302774 517655 384353 187648
14855D39041j85620L11363R380k48957O1756A06026R542L73985K7154m7808K39105
$$ 439041 253421 564784 574164 325207 386963 106026 115568 489553 516707 468899 708004
14844G08004l29174K06397B88679L7307K43588j52809j7556r2177M18130l56015
$$ 708004 378830 585227 288679 325986 569574 416765 399209 307032 725162 369147
14834C69147R2055J3924Q5098J00070R4038I7047M79329B70313D9739L12548j496
$$ 369147 461202 475126 560224 660294 754332 97047 576376 270313 49739 362287 360791
14823C60791R2851L5814k2049L03231k94355r8715j19628j9840M31994r2301j45954
$$ 360791 453642 489456 467407 770638 476283 377568 257940 238100 670094 577793 431839
14812D31839L55919C00991M86485P6590l97800P1013J26403k40424K60963j28952
$$ 431839 787758 300991 787476 864066 466266 537279 663682 423258 684221 555269
14802E55269M9381L39214B86041L36861A69425n4146O00911k13275K28735j8297
$$ 555269 604650 943864 286041 622902 169425 115279 716190 502915 731650 713353
14792G13353q8587M9538o9016k891j6405k61291j11896L62183B73050J46587L41497
$$ 713353 624766 674304 605288 602397 585992 324701 212805 574988 273050 419637 761134
14781G61134j60829K8957J3509j79573J10401j77601j03161K17481O3774J72244
$$ 761134 600305 629262 642771 463198 573599 395998 292837 510318 574092 746336
14771G46336l09107J20703k10424m6182L02876P1447j0286k45862P5606O77511
$$ 746336 437229 557932 347508 301326 604202 675649 665363 419501 495107 1172618
14761A172618E12480N81264k90909k17741K13415j12490J7192k3101Q511R8010
$$ 1172618 512480 1093744 802835 585094 798509 686019 703211 680110 688621 786631
14751G86631J71343l20555l414k59040K53341K72526m30287J28331L97195k99342
$$ 786631 957974 637419 634005 374965 628306 900832 470545 598876 996071 696729
14741F96729K4489Q4252j45240L69297k52968k518P2918L6210j49484P7030k9615
$$ 696729 721218 805470 660230 1029527 776559 774041 846959 883169 733685 810715 781100
14730G81100l9798Q349L32241j34759l39381K91239k13677K41384k31502J913
$$ 781100 741302 749651 1081892 947133 607752 898991 685314 926698 695196 697109
14720F97109M9093Q9995j31256J01173k02703L8246K12579M74469l00109L4972
$$ 697109 746202 836197 704941 806114 603411 641657 854236 1328705 1028596 1063568
14710A063568p6520l24869Q231K00470l548O1354p4428K01872k5746m74273O02510
$$ 1063568 987048 662179 670410 870880 867332 928686 854258 1056130 1030384 556111 1158621
14699A158621k65256O8800k35741K12098l47686J74596j44258L37466l27279K75585
$$ 1158621 893365 962165 726424 938522 590836 765432 621174 958640 631361 906946
14689I06946q9944J2677j45872L40022o4377j45092Q5950L0705l89521N71827
$$ 906946 817002 829679 683807 1023829 959452 814360 900310 931015 541494 1113321
14679A113321n50598N15395j78797J99588M1589k56125J81677j72821l2796m1822
$$ 1113321 562723 1078118 899321 1098909 1140498 884373 1066050 893229 860433 818611
14669H18611O5913J54023J90822l47025q832n9861N25474n58332M43903k1001
$$ 818611 884524 1038547 1229369 882344 873512 813651 1339125 780793 1224696 1203695
14659A203695k8186m1394j38154Q9612K17006k86945J81350n1017k54892K68530
$$ 1203695 1175509 1134115 995961 1085573 1302579 1015634 1196984 1145967 891075 1159605
14649A159605K21635j08324l9627J64607m7194j6462R1904k49924j39604J21860
$$ 1159605 1381240 1272916 1233289 1397896 1350702 1334240 1426144 1176220 1036616 1158476
14639A158476O1308J43173l76643M31318K77051p0197m46572O4169R607o5152
$$ 1158476 1219784 1362957 986314 1417632 1694683 1624486 1177914 1242083 1251690 1186538
14629A186538K35402K40597k85506j93991K74703k24638J30142m8326N7810J6143
$$ 1186538 1421940 1662537 1377031 1183040 1457743 1233105 1363247 1314921 1372731 1388874
14619A388874L33638j92620j06737K42458l6330r4498N7637K058J31255k99991
$$ 1388874 1722512 1529892 1423155 1665613 1629283 1534785 1592422 1594480 1725735 1425744
14609A425744K67045O526j35658j05304K82801r3017J00361l39296K06133k8895
$$ 1425744 1692789 1699315 1563657 1458353 1741154 1648137 1748498 1409202 1615335 1586440
14599A586440R815J99450j81391l4669K15527p2990j20185J0779L81723M938k3887
$$ 1586440 1596255 1795705 1614314 1579645 1795172 1722182 1601997 1612776 1994499 1999437 1975550
14588A975550q7345J42211K96517m74145k18952N16948l51999j9415J24342K30532
$$ 1975550 1888205 2030416 2326933 1852788 1633836 2150784 1798785 1779370 1903712 2134244
14578B134244r0907J98643j9055K41408P8075m97416J06740J43764l06402M27035
$$ 2134244 2043337 2241980 2222925 2464333 2542408 2044992 2151732 2295496 1989094 2416129
14568B416129K0569M8153M2624J15850k2958j10840j04494J17433K75018L75430
$$ 2416129 2436698 2484851 2527475 2643325 2620367 2509527 2405033 2522466 2797484 3172914
14558C172914j35851J97870l5518L87267J17302r2726M47516R31399Q44585J748997
$$ 3172914 3037063 3234933 3199415 3586682 3703984 3611258 4058774 4990173 5834758 7583755
14548G583755L198968R510939J8712542R964934B2127826q543543F427659k337247
$$ 7583755 10782723 20293662 39006204 48971138 22127826 13584283 6427659 4090412
14540D090412p97284q45794o48M3229k51031M17554l64264P1689l00451K93629
$$ 4090412 3293128 2447334 2446686 2489915 2238884 2656438 2292174 2363863 2063412 2357041
14530B357041k28676J38594N2446l20804M55413P7531R7184m35379K83750K35660
$$ 2357041 2128365 2266959 2319405 1998601 2454014 2531545 2628729 2193350 2477100 2712760
14520B712760P6936k11134O3368L78497l87814P0321K53768k66040M73763k07968
$$ 2712760 2789696 2578562 2641930 3020427 2632613 2702934 2956702 2690662 3164425 2956457
14510B956457J03439k64664J93137q6223m9722N02454l48200K75532K6083J14490
$$ 2956457 3059896 2795232 2988369 2902146 2852424 3354878 3006678 3282210 3308293 3422783
14500C422783k92316M03534k76793L41250m19262K58193J4467K90000l10484J51047
$$ 3422783 3130467 3534001 3257208 3598458 3179196 3437389 3451856 3741856 3431372 3582419
14490C582419k31579N68116l19036L33868l77648L46275o2925K72989R069j8872
$$ 3582419 3350840 3918956 3599920 3933788 3556140 3902415 3839490 4112479 4121548 4102676
14480D102676r205K86633l20850J97731Q5602j22430r5644j60385M09861j0109
$$ 4102676 4093471 4380104 4059254 4256985 4342587 4220157 4124513 3964128 4373989 4363880
14470D363880m4174M16586j31215L45187m59460N14708l91764N47552j61239K0008
$$ 4363880 4319706 4736292 4605077 4950264 4490804 5005512 4613748 5161300 5000061 5020069
14460E020069K94708k48142k0329J83196j49395J84911J34467k9025p5359o7592
$$ 5020069 5314777 5066635 5046306 5229502 5080107 5265018 5399485 5370460 5295101 5227509
14450E227509J73840O87863l09693K20454Q0954j2971L17723n19415O21218O724
$$ 5227509 5401349 6089212 5779519 5999973 6080927 6067956 6385679 5866264 6487482 6494206
14440F494206k5574J61259J5027j35855r0339O26333n3932l88435L47426K36340
$$ 6494206 6468632 6629891 6644918 6509063 6418724 7045057 6991125 6602690 6950116 7186456
14430G186456m4725R8325K85359J31010L21049l89712L96856q5158J92166J41845
$$ 7186456 7141731 7240056 7525415 7656425 7977474 7587762 7984618 7899460 8091626 8233471
14420H233471j40674Q1928L22896L9933L29023j25882L20502j00659K51261R1433
$$ 8233471 8092797 8174725 8497621 8537554 8866577 8740695 9061197 8960538 9211799 9303232
14410I303232M77376R1623j8205o456M70561j735J26255K77985m2610K29720O9994
$$ 9303232 9780608 9872231 9854026 9847570 10318131 10316396 10442651 10720636 10678026 10907746 10977740
14399A0977740M10851l30328N34759J62207K13678L36402R3077R9946M34460J51066
$$ 10977740 11388591 11058263 11593022 11755229 11968907 12305309 12398386 12498332 12932792 13083858
14389A3083858M30778m8705R8250Q16807k24915J11512M58038L60814M4525O20007
$$ 13083858 13514636 13465931 13564181 14380988 14156073 14267585 14725623 15086437 15130962 15750969
14379A5750969K145M09886J84918K13276O89487M9193J28348N06541N97708N65297
$$ 15750969 15753114 16163000 16347918 16561194 17250681 17299874 17428222 17934763 18532471 19097768
14369A9097768J38115K81308N9703Q10944N86039K8099N38410Q44948K06796J66282
$$ 19097768 19235883 19517191 19576894 20387838 20973877 21001976 21540386 22385334 22592130 22758412
14359B2758412O28000O92258P27362M04701L72178Q90321N85477M42082J080994
$$ 22758412 23386412 24078670 24806032 25210733 25582911 26473232 27058709 27500791 28581785
14350B8581785O83903M16511O68090P68555J112081M79663Q64078Q66187J518899
$$ 28581785 29265688 29682199 30350289 31118844 32230925 32710588 33574666 34440853 35959752
14341C5959752O91490O66272J192614J253642Q03427J625901R70774J216889J234919
$$ 35959752 36651242 37317514 38510128 39763770 40567197 42193098 43163872 44380761 45615680
14332D5615680J269095J634289J673594J556592R28812K169518J811334K207374
$$ 45615680 46884775 48519064 50192658 51749250 52678062 54847580 56658914 58866288
14324E8866288K059881J917818J876237K614745J864117L059731K119792L340129
$$ 58866288 60926169 62843987 64720224 67334969 69199086 72258817 74378609 77718738
14316G7718738K807147L309124K779008L812041L200491L652349M628761M073149
$$ 77718738 80525885 83835009 86614017 90426058 93626549 97278898 101907659 105980808
14308A05980808M561089M845666N205415N089336N996412N637256O123552P149807
$$ 105980808 110541897 115387563 120592978 125682314 131678726 137315982 143439534 150589341
14300A50589341O918455P838358P723042Q754513Q745519R668092R741297J0909912
$$ 150589341 157507796 165346154 173069196 181823709 190569228 200237320 209978617 220888529
14292B20888529J1036211J1825658J2481973J2864638J3586184J3751864J4807752
$$ 220888529 231924740 243750398 256232371 269097009 282683193 296435057 311242809
14285C11242809J4947786J5155791J5451956J5837120J5404507J5234463J4680544
$$ 311242809 326190595 341346386 356798342 372635462 388039969 403274432 417954976
14278D17954976J3598986J2985746J1436412J0290395P913821N797529K448808
$$ 417954976 431553962 444539708 455976120 466266515 474180336 479977865 482426673
14271D82426673j149299j491595k668510n993525p847889q415831q592041j1234984
$$ 482426673 481277374 479785779 477117269 471123744 463275855 454860024 446267983 435032999
14263D35032999j2606316j3593057j4534725j4899468j5705267j5795625j5747547
$$ 435032999 422426683 408833626 394298901 379399433 363694166 347898541 332150994
14256C32150994j5759655j5447109j3746592j3200455j3454275j3245425j1748899
$$ 332150994 316391339 300944230 287197638 273997183 260542908 247297483 235548584
14249B35548584j1904530j0901225j0739643r766743r029283q273970q195242
$$ 235548584 223644054 212742829 202003186 192236443 183207160 174933190 166737948
14242A66737948q154320p203582o715344o555101n766404n767869n653251n061731
$$ 166737948 158583628 151380046 144664702 138109601 132343197 126575328 120922077 115860346
14234A15860346n107918m578022l921977l496044m188969l712797l716882l218541
$$ 115860346 110752428 106174406 102252429 98756385 94567416 90854619 87137737 83919196
14226H3919196l290454k678935k985176k742952k570075k171028j923001k493770
$$ 83919196 80628742 77949807 74964631 72221679 69651604 67480576 65557575 63063805
14218F3063805k131405k069113k015446j783165j465224j286246j481441j789559
$$ 63063805 60932400 58863287 56847841 55064676 53599452 52313206 50831765 49042206
14210D9042206j524896j378775r19549r72655j108412j517941j171794j420398
$$ 49042206 47517310 46138535 45218986 44246331 43137919 41619978 40448184 39027786
14202C9027786j062318q81336l47703j162335j121817j068308o31388p64949p49115
$$ 39027786 37965468 37084132 36736429 35574094 34452277 33383969 32752581 31987632 31238517
14193C1238517p75106r36553n84364q68089m46980r38990l45023q22855k30425
$$ 31238517 30463411 29526858 28942494 28074405 27627425 26688435 26343412 25520557 25290132
14184B5290132o98969n66899o70263o11413n65551k47395k70261p33830k60344
$$ 25290132 24591163 24024264 23354001 22742588 22177037 21929642 21659381 20925551 20665207
14175B0665207n56997k73400m14472n51255j50983j21715n14088n11043m67873
$$ 20665207 20108210 19834810 19420338 18869083 18718100 18596385 18082297 17571254 17103381
14166A7103381j81222k51066l39033n38376N6513o11895O7920l34984l16478j18342
$$ 17103381 16922159 16671093 16332060 15793684 15850197 15238302 15306222 14971238 14654760 14536418
14156A4536418l18023l53164R2414j79836m15821m35763j77629J26454o44251
$$ 14536418 14218395 13865231 13957645 13777809 13361988 12926225 12748596 12875050 12230799
14147A2230799j97478K10207p18047O0175K06444n50302K24172n24224l22074
$$ 12230799 12033321 12243528 11525481 11585656 11792100 11241798 11465970 10941746 10619672
14138A0619672J11107k30985M5189m03570k97529J57966n76691j0862r5120l83569
$$ 10619672 10730779 10499794 10544983 10141413 9843884 10001850 9425159 9414297 9319177 8935608
14128H935608R0434P2917p0791m03870K64728k32773l30725L5858j12276l49575
$$ 8935608 9026042 9098959 9028168 8624298 8889026 8656253 8325528 8361386 8249110 7899535
14118G899535K76893l45520j13266J35239j03904n92872L35187j38813k0883k59696
$$ 7899535 8176428 7830908 7717642 7852881 7748977 7156105 7491292 7352479 7331596 7071900
14108G071900Q5453l53784q699k3339L56124k91118P0099l29694k07465J8818
$$ 7071900 7157353 6803569 6794870 6771531 7127655 6836537 6906636 6576942 6369477 6388295
14098F388295j36067J07162l70719M043K01471o9700K65712m44126k59882j48677
$$ 6388295 6252228 6359390 5988671 5992714 6194185 6124485 6390197 5946071 5686189 5537512
14088E537512J56677J79990l26960l60418j23011N28496l13292p1629O491k16421
$$ 5537512 5694189 5874179 5547219 5186801 5063790 5592286 5278994 5207365 5213856 4997435
14078D997435Q0744k49269J24827J19243j60840j23208m74983L01243j3940p026
$$ 4997435 5078179 4828910 4953737 5072980 4912140 4788932 4313949 4615192 4601252 4594226
14068D594226k46647j12375K19062j3229j42370R902j36292J27157O4628j02217
$$ 4594226 4347579 4235204 4454266 4441037 4298667 4308569 4172277 4299434 4364062 4261845
14058D261845L3275k64962L93496n40533Q5463N1033k10309J96544j19949J586
$$ 4261845 4295120 4030158 4423654 3883121 3968584 4019617 3809308 4005852 3885903 3887489
14048C887489l01304J04704J82217l97989J21558l27744M38218j50896k58284
$$ 3887489 3586185 3690889 3873106 3475117 3596675 3268931 3707149 3556253 3297969
14039C297969K53927r6655k78280j33358L58039l91461J99428k71663J7310N38937
$$ 3297969 3551896 3455241 3176961 3043603 3401642 3010181 3209609 2937946 2955256 3494193
14029C494193q2027k41455p8691J73067L4262j27017m51948R5717J29766k42995
$$ 3494193 3412166 3170711 3092020 3265087 3299349 3172332 2720384 2816101 2945867 2702872
14019B702872L46566j95458k34188L93095m78121L69819l66582j81496L63434
$$ 2702872 3049438 2853980 2619792 3012887 2534766 2904585 2538003 2356507 2719941
14010B719941k65982q5142K72581p46078P48791j45962k63967J47672j20958J5815
$$ 2719941 2453959 2368817 2641398 1895320 2644111 2498149 2234182 2381854 2260896 2276711
14000B276711M50288o77227K83081Q241j98633j37263L39323K9229j78871O06737
$$ 2276711 2726999 2049772 2332853 2341094 2142461 2005198 2344521 2373750 2194879 2801616
13990B801616k67130R06999K417662P080656J7307762K0487673k3342950j2863685
$$ 2801616 2534486 3441485 5859147 12939803 30247565 50735238 27392288 14528603
13982A4528603m914604k773122j125693r93958n88225k78857k97360m78941J0546
$$ 14528603 9613999 6840877 5715184 4721226 4133001 3854144 3556784 3077843 3088389
13973C088389m43857m970N28392j66738o74759N35058j51791j34294r9839J726
$$ 3088389 2644532 2639562 3167954 3001216 2326457 2861515 2709724 2575430 2475591 2477317
13963B477317l91449M14717N6074l95712J18897k47798J61694Q3420k53102j88238
$$ 2477317 2085868 2500585 2556659 2160947 2279844 2032046 2193740 2277160 2024058 1835820
13953A835820L79563l37018J90467j9346m3274l4351J91280m28580L46122k75951
$$ 1835820 2215383 1878365 2068832 2049486 2006212 1971861 2163141 1734561 2080683 1804732
13943A804732J21984m2379L22187l12718k31450M20129j6964m58690J61290J0220
$$ 1804732 1926716 1884337 2206524 1893806 1662356 2082485 2065521 1606831 1768121 1778341
13933A778341k25662M12238m01845N86111n69379j04078L31865j39835O4851K95910
$$ 1778341 1552679 1964917 1563072 2149183 1579804 1475726 1807591 1667756 1732607 2028517
13923B028517l39966n9643J42329n7370l69076K31394M77878O3203o41662P7221
$$ 2028517 1688551 1628908 1771237 1713867 1344791 1576185 2054063 2117266 1475604 1552825
13913A552825J63900m05689N45079k14435j44608n5268j66507j00837N35711J64676
$$ 1552825 1716725 1311036 1856115 1641680 1497072 1441804 1275297 1174460 1710171 1874847
13903A874847l98539K36011l66450K87360k97m29132L78628k3947N0941r782n25738
$$ 1874847 1476308 1712319 1345869 1633229 1632932 1203800 1582428 1558481 1609422 1599640 1073902
13892A073902K45892J03490J18661m11986L33227j52366P3918O0165l81764J47394
$$ 1073902 1319794 1423284 1541945 1129959 1463186 1310820 1384738 1444903 1063139 1210533
13882A210533M12596l66925K76074n8113l13444J10787m1596l0357l26186L96473
$$ 1210533 1623129 1256204 1532278 1474165 1160721 1271508 1229912 1199555 873369 1269842
13872A269842j03469J07666k74637L12075l26192N74086k59674n6622J07681j34317
$$ 1269842 1166373 1274039 999402 1311477 985285 1559371 1299697 1243075 1350756 1216439
13862A216439j41690O36m9268K52504n3899L5043j10513j47625L9382J51341Q3481
$$ 1216439 1074749 1075385 1026117 1278621 1224722 1259765 1149252 1001627 1041009 1192350 1275831
13851A275831j29440j18025M4965j13049K83766L7088k56286O898P5887l27458
$$ 1275831 1146391 1028366 1073331 960282 1244048 1281136 1024850 1031748 1107635 780177
13841G80177L45421M5493k96079N0807L08491m1537L38734n52666m2803k01772
$$ 780177 1125598 1171091 875012 925819 1234310 1192773 1531507 978841 936038 734266
13831G34266K95147j66773j20516J49274L42120l29405M9122j16987J16309k63103
$$ 734266 1029413 862640 742124 891398 1233518 904113 953235 836248 952557 689454
13821F89454L44963j22507k25863J10166q0856M34279j23904K0573k22214K56410
$$ 689454 1034417 911910 686047 796213 715357 1149636 1025732 1046305 824091 1080501
13811A080501k22086J21164q1616j08545J49699K22163l16638l05463J80213o8558
$$ 1080501 858415 979579 897963 789418 939117 1161280 844642 539179 719392 650834
13801F50834K58342n81k4499P4016j35734Q9538R1165k95063K55087k77984L41764
$$ 650834 909176 908595 884096 958112 822378 911916 1003081 708018 963105 685121 1026885
13790A026885j60287J86933j46932K5559J67856C88053O73778n908j04085k62308
$$ 1026885 866598 1053531 906599 932158 1100014 388053 1061831 1055923 951838 689530
13780F89530K19977j12935J26130l13556m1665K83907j65167K29971k7155n2915
$$ 689530 909507 796572 922702 609146 567481 851388 686221 916192 889037 836122
13770H36122k17249j21225j40769L95197J90735O4210p0365j23317k04047R4059
$$ 836122 618873 497648 356879 752076 942811 1007021 936656 813339 609292 703351
13760G03351K08704j51238k65816L90154k37812m5115L9789Q2624J29771n645
$$ 703351 912055 760817 495001 885155 647343 602228 642017 724641 854412 848767
13750H48767k89645K5998J01618k70976M23156o3719o1637J79088l54909N550
$$ 848767 559122 585120 686738 415762 838918 775199 713562 892650 537741 543291
13740E43291L62296n4672j62856q8450J37966k81123O6224K03070M0361j81021
$$ 543291 905587 850915 688059 599609 737575 456452 522676 725746 766107 585086
13730E85086J36043k71596J87386N9458j66557K49284j15548Q3339J20706r7829
$$ 585086 721129 449533 636919 696377 529820 779104 663556 746895 867601 769772
13720G69772C70438L77605K3993J69511k96597k76341R6473J10751J93900l53652
$$ 769772 370438 748043 772036 941547 644950 368609 465082 575833 769733 416081
13710D16081M36023j94809Q4657j56038K22035K21561B08348N9632J46276M05269
$$ 416081 852104 657295 741952 585914 807949 1029510 208348 267980 414256 819525
13700H19525K9581j50456j32256k06999M21469l70377K28299B50819K36931K01855
$$ 819525 849106 698650 566394 359395 780864 410487 638786 250819 487750 689605
13690F89605k30655J68038O2152k36089j06309J96961j64452L10517C00168L72773
$$ 689605 458950 626988 689140 453051 346742 543703 379251 689768 300168 672941
13680F72941j39475k03401J84740r370J15753K3902B50835J85658J10182k08500
$$ 672941 533466 330065 514805 505435 621188 645090 250835 436493 546675 338175
13670C38175R7766j2476j50956K10834K12076C40976J86744A28687J79944M6241
$$ 338175 435941 423465 272509 483343 695419 340976 527720 128687 308631 354872
13660C54872L57438l53195O2057K17407k43443N09978C57590J90861r4099M4141
$$ 354872 712310 359115 421172 638579 395136 905114 357590 548451 454352 498493
13650D98493p1336K99864k74415A92949L93383j74683J20529K36908l6156O2739
$$ 498493 427157 727021 452606 192949 586332 411649 532178 769086 732930 795669
13640G95669j14502l14886l6900Q3142J82373N4594k83860R3013K18427k22400
$$ 795669 681167 366281 329381 412523 594896 649490 365630 458643 677070 454670
13630D54670J54462j99110J90459J01004J4619k38606n7459r5772Q7722j58J29335
$$ 454670 609132 410022 600481 701485 716104 477498 420039 324267 411989 411831 541166
13619E41166j29947N6895j7669J35293j73151L38058k68806N9409j72755J03208
$$ 541166 411219 468114 450445 585738 412587 750645 481839 541248 368493 471701
13609D71701r3360A15550L70596R438j38538o3526j22112l8866b4825D81087J76217
$$ 471701 378341 115550 486146 495584 357046 293520 171408 132542 -24825 481087 657304
13598F57304k91180O3945k928q7368r4941A15030K95838j40960Q784A00474J78386
$$ 657304 366124 430069 427141 339773 244832 115030 410868 269908 278692 100474 278860
13587B78860L42080r4781k01630J52534H059K79924B7469L78983p3903j08797
$$ 278860 620940 526159 324529 477063 8059 287983 27469 406452 332549 223752
13577B23752K01322J34669k54392M38931C22823J79772k15539P763B835P31231
$$ 223752 425074 559743 305351 744282 322823 502595 287056 294819 2835 734066
13567G34066k43058A17144K12230K05473R6885F2811O09932k83864A71457K79140
$$ 734066 491008 117144 329374 534847 631732 62811 672743 388879 171457 450597
13557D50597R6212B72889J28237q0205j55614O38924B39276J72868L7404n3219
$$ 450597 546809 272889 401126 320921 165307 804231 239276 412144 449548 396329
13547C96329J51645A64108L00402j14985Q0032J4223j28983j0742q5233K58741
$$ 396329 547974 164108 464510 349525 429557 443780 314797 304055 218822 477563
13537D77563k11930J78290K21311l5598B92603K501A29810P5329j0059K13060
$$ 477563 265633 443923 665234 629636 292603 295104 129810 205139 195080 408140
13527D08140k03422M46299I7053K06548I5957J16872k8243M32588j25121p653
$$ 408140 204718 651017 97053 303601 95957 212829 184586 617174 492053 484400
13517D84400h5247A75079P6053L46290j59155r4838N6419A29584J67381K20810
$$ 484400 -85247 175079 251132 597422 438267 343429 399848 129584 296965 517775
13507E17775j05852n8087J0881G1898K79218A44404N01856l02723L8147q2359
$$ 517775 411923 353836 364717 71898 351116 144404 646260 343537 381684 299325
13497B99325J8313L0268G0617M1096M15973r5484A84817n8579J03458n877J4710
$$ 299325 317638 347906 70617 111713 527686 432202 184817 126238 229696 223819 238529
13486B38529Q5903A60031K28849m7318j13377M1948K78603n164B50392D5935J52664
$$ 238529 324432 160031 388880 341562 228185 270133 548736 543572 250392 45935 198599
13475A98599q3282J13957K41348j37753A14318J74194J00185C4170M53303B28666
$$ 198599 115317 229274 470622 332869 114318 288512 388697 34170 487473 228666
13464A30873k341K36415b6365C69209A28677J93577l0769K13052j90687A05368
$$ 130873 128532 364947 -26365 369209 128677 322254 291485 504537 313850 105368
13453A08863k596K77276k1388A48495R0212K69510g4057E93550d806A86857e5113
$$ 108863 106267 383543 362155 148495 238707 508217 -74057 593550 -4806 186857 -55113
13441B70225F3933a6495F07288B70651A21759N5526g337j6366A56148m5740N68041
$$ 270225 63933 -16495 607288 270651 121759 177285 -7337 -23703 156148 110408 678449
13430F78449j96160h1575C17278m3477J7898A30361l6367J09637L69943A57130
$$ 678449 482289 -81575 317278 273801 291699 130361 93994 203631 573574 157130
13419B08216m8738L17167B31295a87363C03554j42843N6603O436a5309B9513K18770
$$ 208216 159478 476645 231295 -187363 303554 160711 217314 223750 -15309 29513 248283
13408B48283O2695k6197k8821F3691K45567j11586p4851J8351B3336N06304c8860
$$ 248283 310978 284781 255960 63691 309258 197672 122821 141172 23336 529640 -38860
13396D26749L8715A08710a12302C47350h0584F9299J78052J12565a33650C92815
$$ 426749 465464 108710 -112302 347350 -80584 69299 247351 359916 -133650 392815
13385H3084a3103H0269Q785k2440b32177C29775p6566J30144J07342j21874L54284
$$ 83084 -13103 80269 89054 66614 -232177 329775 253209 383353 490695 368821 723105
13374G23105F5972M04924c9794D48159B14497A8465L01479J49232j79093k8712
$$ 723105 65972 470896 -39794 448159 214497 18465 319944 469176 290083 261371
13364B61371M3046R1720H8319Q2170K26810j56421O431K47195r8489B3735J90043
$$ 261371 304417 396137 88319 170489 397299 240878 247309 494504 396015 23735 213778
13353B13778a8958C75252j23711K16440A84865J31343j03854E5012L94083a5757
$$ 213778 -18958 375252 251541 467981 184865 316208 212354 55012 449095 -15757
13342A95001J54408M2040b6119B67022j17652M08299B54090j4695j15293O2420
$$ 195001 349409 391449 -26119 267022 149370 557669 254090 239395 124102 186522
13332A86522J75586j53285J97688H2190K2145K12169J38101l8132J84779B47548
$$ 186522 362108 208823 406511 82190 104335 316504 454605 416473 601252 247548
13321B2632M23131A09779P2248O036R0403K86372A72239Q9474j2871K63166A56871
$$ 22632 445763 109779 182027 188063 278466 564838 172239 261713 248842 512008 156871
13309D96087a01876C25541R6751A39455L3330M3041B1513J98834r4903M5267J96867
$$ 496087 -101876 325541 422292 139455 172785 215826 21513 220347 125444 170711 367578
13298C67578A80480K17622j05940C2831M40049h0257A60463R1305F236O1116D23
$$ 367578 180480 398102 292162 32831 472880 -80257 160463 251768 6236 67352 423
13286D52299A42969R5665J0520q4175K68026c0115p5439B54319A01082a33497
$$ 452299 142969 238634 249154 164979 433005 -30115 -105554 254319 101082 -133497
13275d7347A70797B6068J33164J31235F1548M95054A62334b61087B99876o9685
$$ -47347 170797 26068 159232 290467 61548 556602 162334 -261087 299876 230191
13265B30191a27320B41935o8186d582A9418R7074b00275A55471J37518D8061L17251
$$ 230191 -127320 241935 173749 -4582 19418 116492 -200275 155471 292989 48061 365312
13254C65312C0275N1253K1660b20801B00236N4559g2541B05195J36779r932d2455
$$ 365312 30275 81528 103188 -220801 200236 254795 -72541 205195 341974 332042 -42455
13242c0135A45880m7879k733h2777D956L41419A4911J54292a4299D7933J66069
$$ -30135 145880 98001 95268 -82777 4956 346375 14911 169203 -14299 47933 214002
13231B14002A00682a31923B95391j38811J84166g1378A70686E3792K25132f1508
$$ 214002 100682 -131923 295391 156580 340746 -71378 170686 53792 278924 -61508
13220E40524B39505l9096B2666a81945B73243J4565D2210a77547E26124A98739
$$ 540524 239505 200409 22666 -181945 273243 287808 42210 -177547 526124 198739
13209A04366K4561K9125n8181m5746J93784m2121J105b77978C05853e9781A41386
$$ 104366 128927 158052 99871 54125 247909 205788 206893 -277978 305853 -59781 141386
13197A29172B1807O7361L36910C0967J97119E1398M09584a74639B18610P8850
$$ 129172 21807 89168 426078 30967 228086 51398 460982 -174639 218610 297460
13187B97460o8207C9180J36936a00478E28354b59001A4589L4464f5816A59898
$$ 297460 229253 39180 176116 -100478 528354 -259001 14589 49053 -65816 159898
13176B81598j10437b6224C21441B100K70170c04684A48084k9061K99727j16696
$$ 281598 171161 -26224 321441 2100 272270 -304684 148084 119023 418750 302054
13166C02054o9887i3220d5340D90231j88226f0729H3251b10182C93143e4505A22580
$$ 302054 232167 -93220 -45340 490231 302005 -60729 83251 -210182 393143 -54505 122580
13154A95140L7901K39647e105A55390b54856C3906b6557A06550a4393m2862H4649
$$ 195140 233041 472688 -5105 155390 -254856 33906 -26557 106550 -14393 -57255 84649
13142I103K64553r2842g364B50845H1785E943J53140D8461a2277j83978n6259
$$ 9103 273656 180814 -7364 250845 81785 5943 159083 48461 -12277 -196255 -252514
13131b52514B12973F9409g4307K2476j42684D52093C9515f5675j74783C21014
$$ -252514 212973 69409 -74307 -51831 -194515 452093 39515 -65675 -240458 321014
13120b17360A57764c67975D9618K66479B9282d4458A61080J18211R0206K39303
$$ -217360 157764 -367975 49618 316097 29282 -44458 161080 279291 369497 608800
13110F08800D3077Q3606a44085E8268J12135j7748l7508a43046A4867L3720b4398
$$ 608800 43077 126683 -144085 58268 170403 152655 115147 -143046 14867 48587 -24398
13098B1042a89058A01553C9110J68646q4017K55327D7725j7357a15716b9457B75638
$$ 21042 -189058 101553 39110 207756 123739 379066 47725 30368 -115716 -29457 275638
13086c2765B03348F2168P4926f5467A72865j5533A6575P0832a6968D9427f2123
$$ -32765 203348 62168 137094 -65467 172865 157332 16575 87407 -16968 49427 -62123
13074A56770h2794D19436b3111B26084D7582K44278j34527R7233H7613b7764B30953
$$ 156770 -82794 419436 -23111 226084 47582 291860 157333 254566 87613 -27764 230953
13062A49406l8648K58347D5804k88a65629A44443m8220P0462D0032f3866A72346
$$ 149406 110758 369105 45804 45516 -165629 144443 96223 166685 40032 -63866 172346
13050D51962D6026J59648b14214A22789K8261K56667a66807A28088a79606G3968
$$ 451962 46026 205674 -214214 122789 151050 407717 -166807 128088 -179606 73968
13039B13407J42622r518b67060A69527e5720A05423a19855c4068l44813I3988
$$ 213407 356029 346511 -267060 169527 -55720 105423 -119855 -34068 -378881 93988
13028D29919A49006J03525C3375K4962K03771o7388j8752G5246K2361B0571J65043
$$ 429919 149006 252531 33375 58337 262108 194720 175968 75246 97607 20571 185614
13017A85614C489b3472C08022a45624B34647j12808L38339b41890B58767G4231
$$ 185614 3489 -23472 308022 -145624 234647 121839 460178 -241890 258767 74231
13006C81397A34603a34048A39339Q3095I0436R1642J01280A35260K23822r1593
$$ 381397 134603 -134048 139339 222434 90436 182078 283358 135260 359082 267489
12996B67489C1996J56861J2011J20343E7315b64C91468h4171B07924b1289A15202
$$ 267489 31996 188857 200868 321211 57315 -264 391468 -84171 207924 -21289 115202
12984H3218K32636I5541g7947B85544j00259B5743K13020q0470l3524L39431G0096
$$ 83218 315854 95541 -77947 285544 185285 25743 238763 158293 124769 464200 70096
12972A31208a75424b1776A17009E238J3242K40160d8148j07502j6451N8201B25569
$$ 131208 -175424 -21776 117009 5238 18480 258640 -48148 -155650 -172101 -113900 225569
12960b89242J30695B01478b07432o1849E4320N014a1016l9889A49603a11440k10575
$$ -289242 -158547 201478 -207432 -269281 54320 59334 -11016 -50905 149603 -111440 -322015
12949c22015h6247B7611c58467B88415q1385a40332B1618K37901g5063B03098
$$ -322015 -86247 27611 -358467 288415 207030 -140332 21618 259519 -75063 203098
12938e7444H9270Q578K31252c8469C79657D7094E809b0047k673j76740A90186
$$ -57444 89270 97848 329100 -38469 379657 47094 5809 -20047 -22720 -199460 190186
12926A43472a02828I1738B7097P501a95684A4096P0449J09843a96446R5257F1498
$$ 143472 -102828 91738 27097 34598 -195684 14096 84545 194388 -196446 -101189 61498
12914b23594J7640E0146e7007D05663j53138c1794r2875C9368N8477B9511a06262
$$ -223594 -205954 50146 -57007 405663 252525 -31794 -124669 39368 97845 29511 -106262
12902H8391j670K6554C7704b0833m3198F2293N0659a20921B11138L4275j4692
$$ 88391 86721 113275 37704 -20833 -64031 62293 112952 -120921 211138 245413 230721
12891B30721o2503F002K13403O040l2069c55228A99894a75006A08410J41358m9496
$$ 230721 168218 6002 219405 225445 193376 -355228 199894 -175006 108410 249768 200272
12880B00272a52140g1398j16835h8504C11748e4053A40883G583K59429e8857D4861
$$ 200272 -152140 -71398 -188233 -88504 311748 -54053 140883 7583 267012 -58857 44861
12868i8473C1960d954B81971a14331o8466h7792A17273c2370j06775d0506j77812
$$ -98473 31960 -4954 281971 -114331 -182797 -87792 117273 -32370 -139145 -40506 -218318
12857b18318e1379A74761a73503C38874C7294b25531c3638F5449c8218L884I3110
$$ -218318 -51379 174761 -173503 338874 37294 -225531 -33638 65449 -38218 -34334 93110
12845B25640E4940b8605A57908d5537J3348A21071b4251j27455E53933h3110A1530
$$ 225640 54940 -28605 157908 -45537 -32189 121071 -24251 -151706 553933 -83110 11530
12833b90808G8711N137f0623C7099a32133A85983J85594b10025d4202A47862c07211
$$ -290808 78711 83848 -60623 37099 -132133 185983 371577 -210025 -44202 147862 -307211
12821b26127A24915f5550a5412A15555a02547F3474e2012A28242c1968A526b3930
$$ -226127 124915 -65550 -15412 115555 -102547 63474 -52012 128242 -31968 1526 -23930
12809b23823n4711A45477f0265B47630A0895K22761r6580o7860a71693A9026K04684
$$ -223823 -278534 145477 -60265 247630 10895 233656 137076 69216 -171693 19026 223710
12798B23710a61771A32435c3427E4140a93149A81057b63016A15330f328k20607
$$ 223710 -161771 132435 -33427 54140 -193149 181057 -263016 115330 -6328 -226935
12788b26935c3545C4097a91460A45444j2974a35918d6721A30171J27307J30493
$$ -226935 -33545 34097 -191460 145444 132470 -135918 -46721 130171 257478 387971
12778C87971a36760A63804D038K99253j26359a52977P3035F6124b08278G3263
$$ 387971 -136760 163804 4038 303291 176932 -152977 -79942 66124 -208278 73263
12767g4559k91197J60857A3951b11669A64808J53449b1092q867j7317C01120A412
$$ -74559 -365756 -204899 13951 -211669 164808 318257 -21092 -29959 -47276 301120 1412
12755A78761b18777b6027H2624b94584Q24E2518b6466A77113K25875f7651C8322
$$ 178761 -218777 -26027 82624 -294584 -293760 52518 -26466 177113 402988 -67651 38322
12743D24677C6721O9799J18501g4620B31579b77805A10221L198j4074L2097D8681
$$ 424677 36721 106520 225021 -74620 231579 -277805 110221 113419 99345 131442 48681
12731a57758A44872g7550A0100a2418j36184e9309D2805K33880a4252j40066D894
$$ -157758 144872 -77550 10100 -12418 -148602 -59309 42805 276685 -14252 -154318 4894
12719e0646m597A852g173j22488E8119d5997a1268H3300g2417k24987A32610K16118
$$ -50646 -55243 1852 -7173 -129661 58119 -45997 -11268 83300 -72417 -297404 132610 348728
12707C48728K25008G3781J17744r1818l6160i3116K3975B74097c9039B75201b03558
$$ 348728 573736 73781 191525 99707 63547 -93116 -69141 274097 -39039 275201 -203558
12695d6314C25592A56351D5161a7964L791H6264K28121L9733A4256J69503K9491
$$ -46314 325592 156351 45161 -17964 -14173 86264 314385 354118 14256 183759 213250
12684B13250j0667a6893B98879I0872c6881B18855b22448B50712a48011B74554
$$ 213250 202583 -16893 298879 90872 -36881 218855 -222448 250712 -148011 274554
12673H3292J02571J24825i6762G3374D709K26677J81471a01275K4259j0378k7176
$$ 83292 185863 310688 -96762 73374 4709 231386 412857 -101275 -77016 -87394 -114570
12662a14570A79499a8622G8466N9537k3023K77574g8499C24819p4387A13163B5946
$$ -114570 179499 -18622 78466 138003 114980 392554 -78499 324819 250432 113163 25946
12650a98392e891E1089J23683G83h2412D0506R6023J29729d70906A90238b74184
$$ -198392 -5891 51089 174772 783 -82412 40506 136529 266258 -470906 190238 -274184
12638a55941D6069a5176B48592a44631I7607b376B94001f5623B28501K28871J01274
$$ -155941 46069 -15176 248592 -144631 97607 -2376 294001 -65623 228501 457372 558646
12627E58646A3349K49476J68740A22544f0651B19828J396J65267r2742A01724
$$ 558646 13349 262825 431565 122544 -60651 219828 221224 386491 293749 101724
12616A08785K13793b5580A08283d4606o9627k74897J22401h5384A04169J22476
$$ 108785 322578 -25580 108283 -44606 -114233 -389130 -266729 -85384 104169 226645
12606B26645A2755K05442A9987b27857c3181A21979M4570p9673J12218o0909a82958
$$ 226645 12755 218197 19987 -227857 -33181 121979 166549 86876 199094 138185 -182958
12594d6804A07997K49078g970p9555F4191a57650P8306A04526a70968H0180F756
$$ -46804 107997 357075 -7970 -87525 64191 -157650 -79344 104526 -170968 80180 6756
12582a999n1547A80205H7102L8938J13746J5282g9912A7568h2823l396B15374
$$ -1999 -53546 180205 87102 126040 239786 255068 -79912 17568 -82823 -86219 215374
12570b51824A0306b09079H1694b03704D6073b74067A27334a70185m8725B10247
$$ -251824 10306 -209079 81694 -203704 46073 -274067 127334 -170185 -218910 210247
12559E7462J73171R0111J74016a56599k69017C40516F819R8289a95693e4890E3360
$$ 57462 230633 320744 494760 -156599 -425616 340516 6819 105108 -195693 -54890 53360
12547C70517a13497k2562F2798M1269a7795A9744i1051L9532C85438A46181n7389
$$ 370517 -113497 -136059 62798 104067 -17795 19744 -91051 -51519 385438 146181 88792
12536H8792a67285H1739a916m9904c275j40061L5301A2845N991L19908j42184
$$ 88792 -167285 81739 -1916 -51820 -3275 -143336 -108035 12845 18836 338744 196560
12525A96560N119b14498C49844A2636g5208B12589d9574k70069C75816d3816A04166
$$ 196560 201679 -214498 349844 12636 -75208 212589 -49574 -319643 375816 -43816 104166
12513C97994b36558a5139A90860k2404l2850h9137K5228j3655B1640h2131F5223
$$ 397994 -236558 -15139 190860 168456 135606 -89137 -63909 -77564 21640 -82131 65223
12501C72117j23023L16406a29841B95352j33774a58512g1651A29752R1647b41098
$$ 372117 249094 565500 -129841 295352 161578 -158512 -71651 129752 221399 -241098
12490a8385I5441J04758b32563E8821R0412Q3410b04284d2656c511j15016j6141
$$ -18385 95441 200199 -232563 58821 149233 232643 -204284 -42656 -3511 -118527 -134668
12479a34668P818j5552L3162j98460A48874F3334J14905H5202R0706f0808M941
$$ -134668 -126850 -142402 -109240 -307700 148874 63334 178239 85202 175908 -60808 -55867
12468e5867k28119k1138c6725j65315A50b21251b5194A30430i92k54756h6251
$$ -55867 -283986 -305124 -36725 -202040 150 -221251 -25194 130430 -992 -255748 -86251
12456b26751F24J14018b39095P1669O090M8595k140m5349D8976i1435A96829a15498
$$ -226751 624 114642 -239095 -167426 -161336 -112741 -114881 -160230 48976 -91435 196829 -115498
12443b64613A27271k8937J03618h1360k6553k27450R0200b3883B70410c04401
$$ -264613 127271 98334 201952 -81360 -107913 -335363 -245163 -23883 270410 -304401
12432a08911J5755j40296A22968n61a28469J3660H418a68449G5459R4920n1541
$$ -108911 -93156 -233452 122968 122407 -128469 -114809 8418 -168449 75459 170379 118838
12421A18838p691a35507M1654k9204k03649G1480h8645j44246J02170d0774j57435
$$ 118838 111147 -135507 -93853 -123057 -326706 71480 -88645 -232891 -130721 -40774 -198209
12410a98209A63436a80489A16065f8429E3023b97044J41335J1769l1639B6487
$$ -198209 163436 -180489 116065 -68429 53023 -297044 -155709 -143940 -175579 26487
12399A72080a6660C10614d6443D6676a76341F2159h8691L046K374C40180b6259
$$ 172080 -16660 310614 -46443 46676 -176341 62159 -88691 -85645 -83271 340180 -26259
12387b4873l18198A53555C2607f2970n5113B61173p4343E6071J21017b40299J13754
$$ -24873 -343071 153555 32607 -62970 -118083 261173 186830 56071 177088 -240299 -126545
12376a26545B10301a80009O0421C09883G012R9029b21531B11159b20466A04054
$$ -126545 210301 -180009 -119588 309883 7012 106041 -221531 211159 -220466 104054
12365f4502j71944D5994R3335m1622a17533A64964b12748B39445H095i2852A93363
$$ -64502 -236446 45994 139329 97707 -117533 164964 -212748 239445 8095 -92852 193363
12353g9150A7657O4732b28025a0336C474J33308J58632c99160B18917f1647G9082
$$ -79150 17657 82389 -228025 -10336 3474 136782 295414 -399160 218917 -61647 79082
12341B26412l5477G8221N11695B9617K03666p4432n1722M7451b3507H6617A2138
$$ 226412 190935 78221 589916 29617 233283 158851 107129 154580 -23507 86617 12138
12329b63276C6200N9334Q1425a38463H4338r875b28520m7084B77974b1005B57890
$$ -263276 36200 95534 176959 -138463 84338 74463 -228520 -275604 277974 -21005 257890
12317b06036B17305C4014M08783C5724A0310J2496J45366p5656a10264B01693
$$ -206036 217305 34014 442797 35724 10310 22806 168172 92516 -110264 201693
12306B93305c25823H7574a61771e4507A17R5172B2132J93062B6323L4924B4393
$$ 293305 -325823 87574 -161771 -54507 117 95289 22132 215194 26323 61247 24393
12294G5396J17521C4654L0169Q5205G036b08339B76000L9420b75361C0073c29518
$$ 75396 192917 34654 64823 150028 7036 -208339 276000 315420 -275361 30073 -329518
12282C17394A57747A4973J08542K20558d3219F7622a25751C93699A91364J89652
$$ 317394 157747 14973 123515 344073 -43219 67622 -125751 393699 191364 381016
12272C81016A19748R745f9924B12445G97i6238b5242j41436a9535j41E7606Q154
$$ 381016 119748 129493 -69924 212445 797 -96238 -25242 -166678 -19535 -19676 57606 65760
12260F5760J24064A1091P1323a69461A97866A0880J96066b512k73402b159j74011
$$ 65760 189824 11091 82414 -169461 197866 10880 206946 -2512 -275914 -2159 -176170
12249a76170I4591i4667l16101B10771D3860J39534M7023K7683A4059J25460J80460
$$ -176170 94591 -94667 -410768 210771 43860 183394 230417 258100 14059 139519 319979
12238C19979b51827b9868k37526d0103A06430J0382a66919B84082a68316G9129
$$ 319979 -251827 -29868 -267394 -40103 106430 116812 -166919 284082 -168316 79129
12227h5946B68157L34012k85835L8389h4913A06345J47362j0495P6183f4251A7713
$$ -85946 268157 602169 316334 354723 -84913 106345 253707 243212 319395 -64251 17713
12215E42196G0203L30419l8989G7187b727H4107i5150j8994A55059N3972A03530
$$ 542196 70203 400622 361633 77187 -2727 84107 -95150 -114144 155059 209031 103530
12203D72886A49007N8374m1758b6216B54795J3830j03750k88G2201K24677J4147
$$ 472886 149007 207381 165623 -26216 254795 268625 164875 164587 72201 296878 311025
12192C11025j12584M28489A27132J39699J09058J2616b6195A24784j9584J37859
$$ 311025 198441 626930 127132 266831 375889 388505 -26195 124784 105200 243059
12182B43059i7902K7014A08125O8456B5734J04995D3807c12115A752a9271C84761
$$ 243059 -97902 -70888 108125 176581 25734 130729 43807 -312115 1752 -19271 384761
12170D7755O0355d8069B88992b2387D79112J8665B16394f0851F7537a02717n4607
$$ 47755 108110 -48069 288992 -22387 479112 497777 216394 -60851 67537 -102717 -157324
12159a57324L4288D06894d2160A87791b06248A50193k8552B3336J51872j1708
$$ -157324 -123036 406894 -42160 187791 -206248 150193 121641 23336 175208 163500
12149A63500J04552H1344e7371j9664F2259a84435C30870j43117a05805C66947
$$ 163500 268052 81344 -57371 -77035 62259 -184435 330870 187753 -105805 366947
12138a78340j05205f5972K3491B1376J28334c25641c4016j66572A63273M648J1459
$$ -178340 -283545 -65972 -42481 21376 149710 -325641 -34016 -200588 163273 167921 179380
12127A79380a75375f9914C617J21461i4075k09034E4610b98574J34706e8950j41668
$$ 179380 -175375 -69914 3617 125078 -94075 -303109 54610 -298574 -163868 -58950 -200618
12116b00618C26971D6636P6251J71140c07036B9532K3282d832k97599D4380f5531
$$ -200618 326971 46636 122887 294027 -307036 29532 52814 -4832 -302431 44380 -65531
12104F2869a0786o1919B4260a2977H3524e3652j17475K0001A64636a44264A10450
$$ 62869 -10786 -72705 24260 -12977 83524 -53652 -171127 -151126 164636 -144264 110450
12092C3157J60502b00273L3858A7950L25132A25791K8969a91787A18183d9939
$$ 33157 193659 -200273 -166415 17950 343082 125791 154760 -191787 118183 -49939
12081E0049J00813b45258r1812A85225J07654d4716q1352j45231D3641j678J28078
$$ 50049 150862 -245258 -337070 185225 292879 -44716 -126068 -271299 43641 41963 170041
12070A70041n3481K52327L01751J566839D26922r5599G4814L09511b4479A27737
$$ 170041 116560 368887 670638 2237477 426922 331323 74814 384325 -24479 127737
12059b36549B31415C5057G087b6545h303j8103k46456A85406b37795A77038k3863
$$ -236549 231415 35057 7087 -26545 -8303 -26406 -272862 185406 -237795 177038 153175
12048A53175J18467k7895d1472a2854b887B25396c55281J66097B231b14037p0654
$$ 153175 271642 243747 -41472 -12854 -2887 225396 -355281 -189184 2231 -214037 -284691
12037b84691b0182n0310A12683L32188c4105B37569B0254b47969b6254A40638
$$ -284691 -20182 -70492 112683 444871 -34105 237569 20254 -247969 -26254 140638
12026b71118b513j43926B27789c3625A61481G2831K51673p3064j12171J36677
$$ -271118 -2513 -146439 227789 -33625 161481 72831 324504 251440 139269 275946
12016B75946a23809j23218a05485B88609A14106l4082c0000B07955J16087F059
$$ 275946 -123809 -247027 -105485 288609 114106 80024 -30000 207955 324042 6059
12005f4362l23J7980k57480a35719A2540c27056I751N2262d7260G6916g736A52878
$$ -64362 -64685 -46705 -304185 -135719 12540 -327056 9751 62013 -47260 76916 -7736 152878
11992H6821a5359B46732c2783a354B5426J08841A344Q3674a20794e948E5590h0656
$$ 86821 -15359 246732 -32783 -1354 25426 134267 1344 85018 -120794 -5948 55590 -80656
11979a9245A43585n8760a78207B08425G7473b29211g2487n9234J4764j25311A49826
$$ -19245 143585 84825 -178207 208425 77473 -229211 -72487 -131721 -116957 -242268 149826
11967F0868a2937j45761A14194b64395k1030C79960c7458d777B5697d5831j12445
$$ 60868 -12937 -158698 114194 -264395 -285425 379960 -37458 -4777 25697 -45831 -158276
11956a58276c0994j18454H9417a61339P638K0026A3935J23895d5866K1534j8724
$$ -158276 -30994 -149448 89417 -161339 -153701 -133675 13935 137830 -45866 -24332 -43056
11945d3056A48862a15860e6027B88667J08826c25022a40617f7781F4209N06d0920
$$ -43056 148862 -115860 -56027 288667 397493 -325022 -140617 -67781 64209 64715 -40920
11933b94963R0271J6398D0027j9621a00297j80421H8588C8799M4121a6A88048
$$ -294963 -204692 -188294 40027 20406 -100297 -280718 88588 38799 82920 -16 188048
11921a38646A28535l5505k3129K9784a03132r494e0451m031A00346M160J14680
$$ -138646 128535 93030 69901 99685 -103132 -112626 -50451 -54482 100346 104506 219186
11910B19186a92808b35j91517A25607h3995p9902j20196A33836L2065J90380j21777
$$ 219186 -192808 -235 -191752 125607 -83995 -163897 -284093 133836 165901 356281 234504
11899B34504d2541K255A7926b01883B63621A2215J96087a23711A09291K5699K15108
$$ 234504 -42541 -40286 17926 -201883 263621 12215 208302 -123711 109291 134990 350098
11888C50098I7818e7546B97118Q1893a43850l31774B2999R9268a51791j02445
$$ 350098 97818 -57546 297118 379011 -143850 -475624 22999 122267 -151791 -254236
11878b54236A81417c08856A76151b01829A5136J21202m5744a19639d2278C05987
$$ -254236 181417 -308856 176151 -201829 15136 136338 90594 -119639 -42278 305987
11867A02809J72315g6473A79271c38222L8423a19060A52614a14859H4723h275
$$ 102809 275124 -76473 179271 -338222 -299799 -119060 152614 -114859 84723 -8275
11856D7579A1369a7907j80652O0643b6372j8721A22995a30960N487A90989l5014
$$ 47579 11369 -17907 -198559 -137916 -26372 -45093 122995 -130960 -125473 190989 155975
11845A55975D9400J8461i6175A75494M883e3146j42617A02221l1017j2490K1059
$$ 155975 49400 67861 -96175 175494 180377 -53146 -195763 102221 71204 58714 79773
11834G9773B0590f8308B34223b37837j295A97459b54824k87272b35603J1713j57110
$$ 79773 20590 -68308 234223 -237837 -239132 197459 -254824 -542096 -235603 -223890 -381000
11823c81000C06816j30132E1250b52000K0280L7101e3713k66653f3280A67506
$$ -381000 306816 176684 51250 -252000 -231720 -194619 -53713 -320366 -63280 167506
11812B32601b03726B26200P2319A6352b40945b1255j98242A71087c00939J26693
$$ 232601 -203726 226200 298519 16352 -240945 -21255 -219497 171087 -300939 -174246
11802a74246a7550G8211f760k97041A81255a25394q6701p8433A142a82616O3702
$$ -174246 -17550 78211 -6760 -303801 181255 -125394 -212095 -290528 1142 -182616 -118914
11791a18914F5579B6552b87077O5595A77786b02175A31077a87681D5297d9331
$$ -118914 65579 26552 -287077 -221482 177786 -202175 131077 -187681 45297 -49331
11780b05853F6452d0893k14525J10361N2339C67270h4035j00431O94I375a65254
$$ -205853 66452 -40893 -255418 -145057 -92718 367270 -84035 -184466 -183772 9375 -165254
11768b63229a29380A75595a25078k72749N9392f1812j28641B55786a26953N2090
$$ -263229 -129380 175595 -125078 -397827 -338435 -61812 -190453 255786 -126953 -74863
11758g4863E5684b62515B04407a85238A5539M2504J61604E1806a40448j60867
$$ -74863 55684 -262515 204407 -185238 15539 58043 219647 51806 -140448 -301315
11748c01315B9362b7295A98531H2510N0935n3699i8375A52284m1599g1750F0555
$$ -301315 29362 -27295 198531 82510 133445 79746 -98375 152284 110685 -71750 60555
11736f8001f426j17958m4610o8857A37452B2542a45400n4918A70673D0556K7821
$$ -68001 -6426 -124384 -168994 -237851 137452 22542 -145400 -200318 170673 40556 68377
11725F8377J3012i910m0282D84g5437j05098D7040P4823G405e6866B57918E7968
$$ 68377 81389 -9910 -50192 484 -75437 -180535 47040 121863 7405 -56866 257918 57968
11712B28328k2395a24922G1225J16738L2231P2362K7524A43030M2399I0304a93357
$$ 228328 205933 -124922 71225 187963 220194 292556 320080 143030 185429 90304 -193357
11700b62405F8454K62579K40608B42537a35292c9596E0708Q957L3506b06523E8949
$$ -262405 68454 331033 571641 242537 -135292 -39596 50708 59665 93171 -206523 58949
11688c8701D28820h2894C01031A3847a98845A04862P01m649C4053K40789b13994
$$ -38701 428820 -82894 301031 13847 -198845 104862 105563 100914 34053 274842 -213994
11676A13604R8198d9978k8412r7731g0172a9419B84836B0697N5298a72240f6312
$$ 113604 211802 -49978 -78390 -176121 -70172 -19419 284836 20697 75995 -172240 -66312
11664A89310a97157d2276C3617L0209f1557j11648E4923a44801I8632a68849A44208
$$ 189310 -197157 -42276 33617 63826 -61557 -173205 54923 -144801 98632 -168849 144208
11652b9590G7087b02593e5879B43213I6283j8875d4379n9444j9531k3477Q543
$$ -29590 77087 -202593 -55879 243213 96283 77408 -44379 -103823 -123354 -146831 -138288
11641a38288d6847A95517K5529a650j77315E5049d6898B50503G7992e0172G1696
$$ -138288 -46847 195517 221046 -1650 -178965 55049 -46898 250503 77992 -50172 71696
11629A27949J15567k422a51250l6172A07613d0810B7214b83313g508A23810e9150
$$ 127949 243516 241094 -151250 -187422 107613 -40810 27214 -283313 -7508 123810 -59150
11617e8203A45624a15705k3033l6835F7995a75141B46522a63462P0878F4962g2677
$$ -58203 145624 -115705 -138738 -175573 67995 -175141 246522 -163462 -92584 64962 -72677
11605f5774K9173J4419k41934F2070b00876j1220B6080J52702K1989p2262d6327
$$ -65774 -36601 -22182 -264116 62070 -200876 -212096 26080 178782 200771 128509 -46327
11593f2523A49469J42349b07706A9824g7181A67180a45502D5822K94174A15378
$$ -62523 149469 291818 -207706 19824 -77181 167180 -145502 45822 339996 115378
11582e3967F3366J2986g1270k99109G3538a82824G2642c84528g1521C07072B491
$$ -53967 63366 76352 -71270 -370379 73538 -182824 72642 -384528 -71521 307072 2491
11570a38977e2161D05720C1706a44755C6797J41863C1019M1936d95j784A26619
$$ -138977 -52161 405720 31706 -144755 36797 178660 31019 72955 -495 -2279 126619
11558B43620c8862k66599L4324C2511a49210D78e03110B70R9272a7265A07437
$$ 243620 -38862 -305461 -271137 32511 -149210 478 -503110 270 99542 -17265 107437
11546B42646f7663B51082A03785a43098A16091J41702A5820a05345B8580J90797
$$ 242646 -67663 251082 103785 -143098 116091 257793 15820 -105345 28580 219377
11536B19377G1802J69241a46489l40519A89649j9825P4480i807A04856J77163
$$ 219377 71802 241043 -146489 -487008 189649 169824 244304 -9807 104856 282019
11526B82019m4740N1006E3499K61523j09453N108J63558A21755J02224O3794c00897
$$ 282019 237279 288285 53499 315022 205569 210677 374235 121755 223979 287773 -300897
11514A05038L2992K16307l2374e4918B24981m8286C8371o191b8072p1189C12595
$$ 105038 138030 354337 321963 -54918 224981 176695 38371 32180 -28072 -99261 312595
11502g7197C31285j8598A52737M6528o6810C9599i6846B27335P9957o6637K82765
$$ -77197 331285 312687 152737 199265 132455 39599 -96846 227335 307292 240655 523420
11491E23420k06328q5708b7988B95825F1896R0652j0633K03779j26940K74969
$$ 523420 317092 231384 -27988 295825 61896 152548 141915 345694 218754 493723
11481D93723a0827E42062h4570D947O7747J41331J28085j19245K5174m2978J4044
$$ 493723 -10827 542062 -84570 4947 72694 214025 342110 222865 248039 205061 219105
11470B19105H5108J77365m3232D4548M4469f2101l7031j01027A21459a68014B16042
$$ 219105 85108 262473 219241 44548 89017 -62101 -99132 -200159 121459 -168014 216042
11458h7490A56886k3007J02154d6453k20887C61192D3048a9951d288C23639r8291
$$ -87490 156886 133879 236033 -46453 -267340 361192 43048 -19951 -4288 323639 225348
11447B25348h2000P815E5220a32840j5641j165A67081K5197i7266B5520a78930
$$ 225348 -82000 -74185 55220 -132840 -148481 -149646 167081 192278 -97266 25520 -178930
11435c0965O804k69747A68518a9470j02557F1456K11299R1966a9761o1822A52696
$$ -30965 -24161 -293908 168518 -19470 -122027 61456 272755 364721 -19761 -81583 152696
11423H0352K6551a83486L8871j01601M2110I3565Q36a42379R745j60561R3596
$$ 80352 106903 -183486 -144615 -246216 -204106 93565 94401 -142379 -132634 -293195 -199599
11412a99599C4842K53376g9402A70424c09744G7785a32545j32087b0674j74537
$$ -199599 34842 288218 -79402 170424 -309744 77785 -132545 -264632 -20674 -195211
11402a95211a6325B21741b8202n61k88926B31839a47857F4519M00534b54975I1202
$$ -195211 -16325 221741 -28202 -28763 -317689 231839 -147857 64519 465053 -254975 91202
11390d20773J60084A70804c66537A86877c28115R0304I8241I344J44295a02319
$$ -420773 -260689 170804 -366537 186877 -328115 -237811 98241 9344 153639 -102319
11379H3592L0661N8253p4631c46771b9725F2510b23446R2519D6654b29516D07068
$$ 83592 114253 172506 97875 -346771 -29725 62510 -223446 -130927 46654 -229516 407068
11367g4256j5060A44043C3199G012K4678a08171M2934k02672a11560L4250A5777
$$ -74256 -89316 144043 33199 7012 31690 -108171 -65237 -267909 -111560 -77310 15777
11355A17338j3476b97501J41347N3161j68094a1953A68470f4579l59178h7724
$$ 117338 103862 -297501 -156154 -102993 -271087 -11953 168470 -64579 -423757 -87724
11344A73943n8856c48447A2916Q2692M59911A71307Q9066A22126a93798B00302
$$ 173943 115087 -348447 12916 95608 555519 171307 260373 122126 -193798 200302
11333B30044c83392j06325A40765c05655B06863j4661e7734j99373c6746k61895
$$ 230044 -383392 -489717 140765 -305655 206863 192202 -57734 -257107 -36746 -298641
11323b98641b1112A61403J2130J17679H2173L3162b18329k74234E1249B5533f3642
$$ -298641 -21112 161403 173533 291212 82173 115335 -218329 -492563 51249 25533 -63642
11311e1348l68631E2955R7810f9387k8237c5628A2137a07012j60871a10337I9599
$$ -51348 -419979 52955 150765 -69387 -97624 -35628 12137 -107012 -267883 -110337 99599
11299a9206A69262i6560B08815b47387e0103I8531b01476e193J436D80828B25328
$$ -19206 169262 -96560 208815 -247387 -50103 98531 -201476 -5193 -3757 480828 225328
11287a34898d0607B22589a04476M4939G6794C7442d24146J69955a4117B7116a28162
$$ -134898 -40607 222589 -104476 -59537 76794 37442 -424146 -254191 -14117 27116 -128162
11275c04944a7394H255b70124a17410c5149B7759d46932O0176j27722a7202C68272
$$ -304944 -17394 8255 -270124 -117410 -35149 27759 -446932 -386756 -514478 -17202 368272
11263F4004K74565A52141d530C05814a64869C06598a38062n0839C57948a63624
$$ 64004 338569 152141 -4530 305814 -164869 306598 -138062 -188901 357948 -163624
11252a68925H0542c05559A57612J04426F6268a57765j78692A34019h0036c154
$$ -168925 80542 -305559 157612 262038 66268 -157765 -336457 134019 -80036 -3154
11241E9084h6446A90071H6157e1679E6296M1279e4639j20349I7636a83247A09217
$$ 59084 -86446 190071 86157 -51679 56296 97575 -54639 -174988 97636 -183247 109217
11229g9440F5619K902h9791A45373b16229a02563K1010H426a30206D9182a02066
$$ -79440 65619 68521 -89791 145373 -216229 -102563 -81553 8426 -130206 49182 -102066
11217A81122n0879R2089p5835b35034A77530o0387a90023C05840F0776a12595
$$ 181122 130243 222332 146497 -235034 177530 117143 -190023 305840 60776 -112595
11206I9805a2329k54672A61685c8314A13731a51275F3654J04612a61283O9463
$$ 99805 -12329 -267001 161685 -38314 113731 -151275 63654 168266 -161283 -91820
11196i1820c3020j18874L1390B12269E5456c07951G9949J8253c80369i8684k15796
$$ -91820 -33020 -151894 -120504 212269 55456 -307951 79949 98202 -380369 -98684 -314480
11185c14480C532b2515k43048a25656M9268A37118c43824K487A96003a73449B14338
$$ -314480 3532 -22515 -265563 -125656 -76388 137118 -343824 -341337 196003 -173449 214338
11173D3704a60530F6628b17976r7704c5062j59093C4378c74889i931j01151l6357
$$ 43704 -160530 66628 -217976 -315680 -35062 -194155 34378 -374889 -9931 -111082 -147439
11162a47439H468J53986e4837A11037b15183a04970J1482M1133k2391k44924B61196
$$ -147439 8468 162454 -54837 111037 -215183 -104970 -93488 -52355 -74746 -319670 261196
11150f9653l10900A02490g8306j76537Q5310B24161b22672K9078B69399H3246
$$ -69653 -380553 102490 -78306 -254843 -169533 224161 -222672 -193594 269399 83246
11139b4566C43451a52089A42229R3413r1553b34478A90653j2647b8145G0066J47791
$$ -24566 343451 -152089 142229 235642 144089 -234478 190653 178006 -28145 70066 217857
11128B17857L0684D9784J62414a3743A23636b868B0611a5110A12180a11790C12070
$$ 217857 248541 49784 212198 -13743 123636 -2868 20611 -15110 112180 -111790 312070
11116C35300b84570E3219M6901K59899F2045M1935L2316c14122D33936B01437
$$ 335300 -284570 53219 100120 360019 62045 103980 136296 -314122 433936 201437
11105C02146A00527M8240K04364A03949o093K73719A0976J46444c38836D1084
$$ 302146 100527 148767 353131 103949 97856 371575 10976 157420 -338836 41084
11094C97845p5751Q423I9841K62068c0828C27307A20470j2525K00782j25293q4550
$$ 397845 322094 330517 99841 361909 -30828 327307 120470 107945 308727 183434 98884
11083I8884K92895f7932F4145j9743K96282A21814M6020L26063j89221A11695
$$ 98884 391779 -67932 64145 44402 340684 121814 167834 493897 304676 111695
11072B89702J07206K34022B15032J91765o0069m2248J12504A40878M26157k58625
$$ 289702 396908 630930 215032 406797 346728 304480 416984 140878 567035 308410
11062C08410n6669K23698J35042j25726N9422K42915j7642n1219O6789p5782k7622
$$ 308410 251741 475439 610481 484755 544177 787092 769450 718231 785020 709238 681616
11051F81616r1888K62683j92931P464P7641j06172k47826M02292k70050K33314
$$ 681616 589728 852411 659480 666944 744585 638413 390587 792879 522829 756143
11041G56143k30582J28340K90165j74184j44722J84858j50810J76372l93120p5414
$$ 756143 525561 653901 944066 769882 625160 810018 659208 835580 442460 367046
11031C67046K23255J58092j11188L5723j01178J86234K705K80047m40029p8550
$$ 367046 590301 748393 637205 672928 571750 757984 760689 1040736 600707 522157
11021E22157O5051J70774l25678K12883k34790L03509j94915K15107C53279M3779
$$ 522157 587208 757982 432304 645187 410397 713906 518991 734098 353279 397058
11011C97058K62734j14392K00007l5028k03986L48909l72718K67254C43004K77186
$$ 397058 659792 545400 745407 710379 506393 855302 482584 749838 343004 620190
11001F20190J49566C66795K13669r671j6549K84598k57539K60986D04367L30582
$$ 620190 769756 366795 580464 570793 554244 838842 581303 842289 404367 734949
10991G34949J55672l22629Q7602k29506M57268N7877J23502l00012L37360j36763
$$ 734949 890621 567992 655594 426088 883356 941233 1064735 764723 1102083 965320
10981I65320K49152L78828p3437J37128K56448J27325j38125N09780R4382N30536
$$ 965320 1214472 1593300 1519863 1656991 1913439 2040764 1902639 2412419 2506801 3037337
10971C037337R5600n32131o6649q1263k41271k37245K0917l03461J16113m25709
$$ 3037337 3132937 2600806 2534157 2452894 2211623 1974378 1995295 1691834 1807947 1382238
10961A382238p1955J20701N0787o6740J50229m6685o9185n4693k13131k67631
$$ 1382238 1310283 1430984 1481771 1415031 1565260 1518575 1449390 1394697 1181566 913935
10951I13935J00685k90896B09804M43391K6208A88994R4003d5941D71822A63704
$$ 913935 1014620 723724 209804 653195 679403 188994 282997 -45941 471822 163704
10940B67451j06414Q8627c236A91067h0015B26701k2979M8453c18593i0549r3993
$$ 267451 161037 249664 -3236 191067 -80015 226701 203722 252175 -318593 -90549 -184542
10929a84542A09310h2120F4877b86897B49145G9545J40308M4917I4769K1817M5396
$$ -184542 109310 -82120 64877 -286897 249145 79545 219853 264770 94769 116586 161982
10918A61982A7016M7714a6012r0818J6070B14348a10819j35238d5307C76668A0595
$$ 161982 17016 64730 -16012 -106830 -90760 214348 -110819 -246057 -45307 376668 10595
10906h2097G4920k8213a37010B88468n100D8287O039a20343B49683j22947f9173
$$ -82097 74920 46707 -137010 288468 283368 48287 54326 -120343 249683 126736 -69173
10894A27740a05935D6507i4819j11788d2935b290j45470d0458o7741L3594K3656
$$ 127740 -105935 46507 -94819 -206607 -42935 -2290 -147760 -40458 -108199 -74605 -50949
10883e0949a275C9259A3909b92893A81097I50b13624k90272K30282F5899m510
$$ -50949 -1275 39259 13909 -292893 181097 950 -213624 -503896 -273614 65899 61389
10872F1389I22b45606b1840j24763H362J58392M1383H942N0347a52113l121d9298
$$ 61389 922 -245606 -21840 -146603 8362 166754 208137 8942 59289 -152113 -155234 -49298
10859C13127B8646K79360a05415m7909j11836b434q1257C23516a35162k57906
$$ 313127 28646 308006 -105415 -153324 -265160 -2434 -83691 323516 -135162 -393068
10849c93068O7289A28198A5354b58910F5756a5232B5693a44206A32915C8914M0906
$$ -393068 -325779 128198 15354 -258910 65756 -15232 25693 -144206 132915 38914 79820
10838G9820a37161N994j20063k10592J50844q9221a7054B4526L545J2142J75353
$$ 79820 -137161 -131167 -251230 -461822 -310978 -400199 -17054 24526 28071 40213 215566
10827B15566a4637F2228a05072C31663c76025a18570j03049C07332n1825A0976
$$ 215566 -14637 62228 -105072 331663 -376025 -118570 -221619 307332 255507 10976
10816a78362j19169h9290k2758A63640G2522J48799o8645a95684m27349i9349
$$ -178362 -297531 -89290 -112048 163640 72522 221321 152676 -195684 -623033 -99349
10805A21063a84834k35362F0984g6221A1064n455b05861A83532b1960l0251n0687
$$ 121063 -184834 -420196 60984 -76221 11064 5609 -205861 183532 -21960 -52211 -102898
10794a02898j40856G4316K8291n92A8680a10987k15287A60201A9819M25991a35655
$$ -102898 -243754 74316 102607 102015 18680 -110987 -326274 160201 19819 445810 -135655
10782a64206J6831E4104J1540a45738A5837b5269B06335a8544n2704J4056k72570
$$ -164206 -147375 54104 65644 -145738 15837 -25269 206335 -18544 -71248 -57192 -329762
10771c29762i8391b6151C37757b1650C329J33782B1409a1445j05391A24341a3759
$$ -329762 -98391 -26151 337757 -21650 3329 137111 21409 -11445 -116836 124341 -13759
10759G1671D96Q9100J23115c13801N6363g9981C96727I3892C6061d0266o556A03911
$$ 71671 496 89596 212711 -313801 -257438 -79981 396727 93892 36061 -40266 -46822 103911
10746A15666J57664G4629a28489G411b20819B0745L1560Q9510K1759J1078c38842
$$ 115666 273330 74629 -128489 7411 -220819 20745 52305 141815 163574 174652 -338842
10734e4592k65167J34415q7620B36573b30767B24921r0067h1444l5119l7221p8749
$$ -54592 -319759 -185344 -272964 236573 -230767 224921 134854 -81444 -116563 -153784 -232533
10723b32533N3355I7249J03748d86063h3589D02798c802A46771o2203a71580P5341
$$ -232533 -179178 97249 200997 -486063 -83589 402798 -3802 146771 84568 -171580 -96239
10712i6239A10460l2506d1430j56451A56384b78962D62117a30719m206a6962A53980
$$ -96239 110460 77954 -41430 -197881 156384 -278962 462117 -130719 -134925 -16962 153980
10700A13955e1968A56014m8042b20081a5624A43450a80834b2567A88616E0815
$$ 113955 -51968 156014 107972 -220081 -15624 143450 -180834 -22567 188616 50815
10689f5438q5011b6910j850H3314a47722a4071F6297B8368c7280A65643a38141
$$ -65438 -150449 -26910 -28760 83314 -147722 -14071 66297 28368 -37280 165643 -138141
10677E9678j5054b35034P2261c8879q5933B25145F724K1363J16155a76372I9845
$$ 59678 44624 -235034 -162773 -38879 -124812 225145 6724 28087 144242 -176372 99845
10665f9326l27352a7227G0418b05616q8149D0688a02090j0391H0547i8091m8512
$$ -69326 -396678 -17227 70418 -205616 -293765 40688 -102090 -112481 80547 -98091 -146603
10654a46603O8665L0145j06519E8244K68563A41609o6955f9254E5067a8515A8324
$$ -146603 -77938 -47793 -154312 58244 326807 141609 74654 -69254 55067 -18515 18324
10642d1876r6490k6878l3628A01140J04353a7601l17348C23025p2970D7828N095
$$ -41876 -138366 -165244 -198872 101140 205493 -17601 -334949 323025 250055 47828 52923
10631E2923a22323C6805a3680A01859c97034J58319P562e5811j38120B11571e7390
$$ 52923 -122323 36805 -13680 101859 -397034 -238715 -231153 -55811 -193931 211571 -57390
10619C3542N5178j7639F884b1710m05287B3864c19111e1755H9301h6475j3995
$$ 33542 88720 71081 6884 -21710 -426997 23864 -319111 -51755 89301 -86475 -100470
10608a00470A61943m7980c37648R5281B68188D2059a0604A33501a28951j68014
$$ -100470 161943 113963 -337648 -242367 268188 42059 -10604 133501 -128951 -296965
10598b96965P3130A21961a08232l285B31717b8893E5531b90939A25406b3383r2857
$$ -296965 -223835 121961 -108232 -111517 231717 -28893 55531 -290939 125406 -23383 -116240
10587a16240I073b10947I1311J97619A3279f8162k871I9105h0241B39556b16705
$$ -116240 9073 -210947 91311 288930 13279 -68162 -71033 99105 -80241 239556 -216705
10575E9126a55239P153l00156d8018A01698b50338b7297j43827c3942E9854J63792
$$ 59126 -155239 -148086 -448242 -48018 101698 -250338 -27297 -171124 -33942 59854 223646
10564B23646a43559k94272f5036j45033j89322J66174j88840A50068p1291b1428
$$ 223646 -143559 -437831 -65036 -210069 -399391 -233217 -422057 150068 78777 -21428
10553a4987j70331g2996r0512A47841c59056H7480J60073a80470A83910J27786
$$ -14987 -185318 -72996 -163508 147841 -359056 87480 247553 -180470 183910 311696
10543C11696B5959a46078B67125b93524A33095c37810e9153B8685h7203n1636
$$ 311696 25959 -146078 267125 -293524 133095 -337810 -59153 28685 -87203 -138839
10533a38839a5496E0714d64932b6671C10722C2289b5383j4310C17683A32490b6202
$$ -138839 -15496 50714 -464932 -26671 310722 32289 -25383 -39693 317683 132490 -26202
10521a83459c5691G2073F700h7427m8124j5744A50209a70818B5203K01020i5260
$$ -183459 -35691 72073 6700 -87427 -135551 -151295 150209 -170818 25203 226223 -95260
10509a51926k23511d2524A0972J42513F4906B802c624A38252L7446a7955j44669
$$ -151926 -375437 -42524 10972 153485 64906 2802 -3624 138252 175698 -17955 -162624
10498a62624f1393k06635B08142a49199H6115a12953l34753a02754c3948B06041
$$ -162624 -61393 -268028 208142 -149199 86115 -112953 -447706 -102754 -33948 206041
10487a10849L840C73582a51210A64575k4516K46023J93188L8092A78670m6844
$$ -110849 -107009 373582 -151210 164575 140059 386082 579270 617362 178670 131826
10477A31826i9699D0575L02382F5338J05786G0496a23608A35824o2265Q2094a41141
$$ 131826 -99699 40575 342957 65338 171124 70496 -123608 135824 73559 155653 -141141
10465a53458E1687j7553c60661i4287m2302e6944o3557B05291b32743G308e3616
$$ -153458 51687 34134 -360661 -94287 -136589 -56944 -120501 205291 -232743 7308 -53616
10453D904i223j13580A93198R651r5018R1226h2597j77003h0004B70622M3260
$$ 4904 -9223 -122803 193198 202849 107831 199057 -82597 -259600 -80004 270622 313882
10442C13882a05263j0481c1772j04556A24517b5572B9021J32252k9747J29596
$$ 313882 -105263 -115744 -31772 -136328 124517 -25572 29021 161273 131526 261122
10432B61122B1111b9417A07414b40699A32939a62220i975H9175Q0620a22953a1113
$$ 261122 21111 -29417 107414 -240699 132939 -162220 -9975 89175 169795 -122953 -11113
10420A22695a0088j04226H5474b22500e2681A01953J39371D1835i0849j80195
$$ 122695 -10088 -114314 85474 -222500 -52681 101953 241324 41835 -90849 -271044
10410b71044c3510k25638E6762b236j3104B4487b08738B3120i975r131j01479
$$ -271044 -33510 -259148 56762 -2236 -15340 24487 -208738 23120 -9975 -19106 -120585
10399a20585C59354G9200C7831e2119A45879J30508J27007j74130g9297c2730
$$ -120585 359354 79200 37831 -52119 145879 276387 403394 229264 -79297 -32730
10388B25576a3737k83303A05026m5065Q0571O6573c0443j12368j01950B66080
$$ 225576 -13737 -297040 105026 59961 140532 207105 -30443 -142811 -244761 266080
10377E8667J55003q4073J29398a54817b5960B76417R9039r0552K15027A97849
$$ 58667 213670 129597 258995 -154817 -25960 276417 375456 284904 499931 197849
10366B73992L20938B96744j01549H6943J68549l1256J39303r6117l9712J77680
$$ 273992 594930 296744 195195 86943 255492 224236 363539 267422 227710 405390
10356D05390r995j60854K7856A04801L28376k1200K76925o1169K2604F3367K395
$$ 405390 395395 234541 262397 104801 433177 411977 688902 627733 650337 63367 65762
10345F5762K64497j59996Q2717K0534n1248K54371F7674N5485A6056K99611J3408
$$ 65762 330259 170263 252980 273514 222266 476637 67674 123159 16056 315667 329075
10334C29075d2311D2360d6619c042A65053J71296E7628j9682L0817C0689L61665
$$ 329075 -42311 42360 -46619 -3042 165053 336349 57628 37946 68763 30689 392354
10323C92354R997j89603n4318G5417J7947B6159K29117E0995a0069A43583b26014
$$ 392354 402351 212748 158430 75417 93364 26159 255276 50995 -10069 143583 -226014
10311e3422D838f4961B52416H3916k5191L7512A7552a17890A04654l3273M4638
$$ -53422 4838 -64961 252416 83916 58725 96237 17552 -117890 104654 71381 116019
10300A16019b99423h9351L5831K6680p5555B91526A14106c38304N9302d9418r9216
$$ 116019 -299423 -89351 -53520 -26840 -102395 291526 114106 -338304 -279002 -49418 -148634
10289a48634c2082l97036a5331j36845e7553k16180M0485j2411P8878L5737A53657
$$ -148634 -32082 -429118 -15331 -152176 -57553 -273733 -233248 -245659 -166781 -131044 153657
10277a18091A35241K82363d3647k55789M7824N8178f5055k7455A51990e7568B64979
$$ -118091 135241 417604 -43647 -299436 -251612 -193434 -65055 -92510 151990 -57568 264979
10265A0669b23812B26482p9926c73925f9360B8703K23445M9294H3517J38063F2652
$$ 10669 -223812 226482 146556 -373925 -69360 28703 252148 301442 83517 221580 62652
10253B23112k0807F0426K23232C3627b60446B9974b03498Q8978l01691L9484B49549
$$ 223112 202305 60426 283658 33627 -260446 29974 -203498 -114520 -416211 -376727 249549
10241C2624a25023A2174h8876B1250b9566B55956b29018O7652O2011j02485D662
$$ 32624 -125023 12174 -88876 21250 -29566 255956 -229018 -161366 -99355 -201840 4662
10229F0975b71193A13407D4606R7224b79286Q6870e721C2912a86734h2236E6449
$$ 60975 -271193 113407 44606 141830 -279286 -192416 -5721 32912 -186734 -82236 56449
10217a85519M2743d7287o4624j37626B8099b13640K6257B596Q5206b03081O4238
$$ -185519 -142776 -47287 -111911 -249537 28099 -213640 -187383 2596 87802 -203081 -138843
10206a38843k90063A97734d7287A16898d7222G615K81080b37235B7310a62751
$$ -138843 -428906 197734 -47287 116898 -47222 7615 288695 -237235 27310 -162751
10195A17582c2218r1617F6511N4497L4616b32467D752a95784A9740a27966E6449
$$ 117582 -32218 -123835 66511 121008 155624 -232467 4752 -195784 19740 -127966 56449
10183D673e0555a3230K473M769j49947E6226b2854G4615a57418c9030q1126N8686
$$ 4673 -50555 -13230 -10757 -5988 -155935 56226 -22854 74615 -157418 -39030 -120156 -61470
10171f1470j31978A2532e5627B7432K15685c04600A08565R7490d5834B62634b35612
$$ -61470 -193448 12532 -55627 27432 243117 -304600 108565 206055 -45834 262634 -235612
10159C136d7847A74826c37980a08592m770b5874j82297H1985J37248D3731a77440
$$ 3136 -47847 174826 -337980 -108592 -113362 -25874 -208171 81985 219233 43731 -177440
10147a07653d2479H2223d37352a4808j09765A20259j9100b06108H7528a27281
$$ -107653 -42479 82223 -437352 -14808 -124573 120259 101159 -206108 87528 -127281
10136a69700d9289A94528J7381D647a9154C13090C0409d4910j04999M3207j68121
$$ -169700 -49289 194528 211909 4647 -19154 313090 30409 -44910 -149909 -106702 -274823
10125b74823d0145J1402k35159A43987d9710n51352g7851o6665p4348n3938R3543
$$ -274823 -40145 -28743 -263902 143987 -49710 -601062 -77851 -144516 -218864 -272802 -179259
10114a79259Q118K9013j3421f3133A80166g2993l7043l48273P2194a70350K9745
$$ -179259 -171141 -142128 -155549 -63133 180166 -72993 -110036 -458309 -386115 -170350 -140605
10103a40605l24901a31137k09831d2567j18935k8007o5528c4549k70535J01087
$$ -140605 -465506 -131137 -340968 -42567 -161502 -189509 -255037 -34549 -305084 -203997
10093b03997B35476j3595a39042B08214c7582N451C04327b45722b5493q2551b1345
$$ -203997 235476 221881 -139042 208214 -37582 -32131 304327 -245722 -25493 -108044 -21345
10081D6757c06226F2312a83959A14029L8280e3642C01072g4375B61620j06801
$$ 46757 -306226 62312 -183959 114029 152309 -53642 301072 -74375 261620 154819
10071A54819b4913j86693G3023A1800J4574J37147l5042f0640n2201A35983a37102
$$ 154819 -24913 -211606 73023 11800 26374 163521 128479 -60640 -112841 135983 -137102
10059A1360K09694a22443B6325a12789j41699d5832p7279B55772e5642n1721j49256
$$ 11360 221054 -122443 26325 -112789 -254488 -45832 -123111 255772 -55642 -107363 -256619
10048b56619Q0074H080a39846M0320n7128e2058D6152P8371B4614b45469A19321
$$ -256619 -176545 8080 -139846 -99526 -156654 -52058 46152 124523 24614 -245469 119321
10036a61399M6362k34604B40546a05926I1600c07929A35909J43659e18363B37374
$$ -161399 -115037 -349641 240546 -105926 91600 -307929 135909 279568 -518363 237374
10025a67201B8958i4371o7568h919I839a33118E1963L723a59515L1851k5566j34626
$$ -167201 28958 -94371 -161939 -8919 9839 -133118 51963 55686 -159515 -127664 -153230 -287856
10013b87856a5020A39649b07590A32563c84984J88090c5656D6944a40291l23582
$$ -287856 -15020 139649 -207590 132563 -384984 -196894 -35656 46944 -140291 -463873
10003d63873K14694j64367i9406D4353L4140b0361o8631B98133J14353d4598j27542
$$ -463873 -249179 -413546 -99406 44353 78493 -20361 -88992 298133 412486 -44598 -172140
9992a72140B04833O2723a35248j90551j40379a58238P4889j28831k64029a72281
$$ -172140 204833 267556 -135248 -325799 -466178 -158238 -83349 -212180 -476209 -172281
9981A23533C7164J30810C0932K43448h363k58795A4006a33828A45948a37802O0709
$$ 123533 37164 167974 30932 274380 -8363 -267158 14006 -133828 145948 -137802 -77093
9970g7093o04A32139b57354e2175p6402j7706K7318j08278i2829k9536C5336c68910
$$ -77093 -77697 132139 -257354 -52175 -128577 -146283 -118965 -227243 -92829 -122365 35336 -368910
9957c18079J14757r888b8381j30812E4407a63057C3374a0447B012R2565J65897
$$ -318079 -203322 -213210 -28381 -159193 54407 -163057 33374 -10447 2012 94577 260474
9946B60474a25466N3366A3224L7297c03131a3378A0054a69269A9667R4227C9952
$$ 260474 -125466 -72100 13224 50521 -303131 -13378 10054 -169269 19667 113894 39952
9934A67364o7018C9083b43829e2133A57641a29489K8970p4017A2088i7468j78204
$$ 167364 100346 39083 -243829 -52133 157641 -129489 -100519 -174536 12088 -97468 -275672
9923b75672C3994J55568a477j22313j23656Q5607l30477K35334r9676A07802g5841
$$ -275672 33994 189562 -1477 -123790 -247446 -161839 -492316 -256982 -356658 107802 -75841
9911C3248d3545j09329c3178A16481e2722j81770d1708q3825j20401j76032h731
$$ 33248 -43545 -152874 -33178 116481 -52722 -234492 -41708 -125533 -245934 -421966 -8731
9899A04078a61966j68532J3650B0164b33165l10773b6255D5821I62b43413o0535
$$ 104078 -161966 -330498 -316848 20164 -233165 -543938 -26255 45821 962 -243413 -303948
9888c03948b818n13839D5496b62158K5843Q4776A07026e7268j67857Q442B0581
$$ -303948 -2818 -516657 45496 -262158 -236315 -151539 107026 -57268 -225125 -216683 20581
9876a28674k9701H3175b86286a02626k8885C3472A6185L87923i9413M435A44961
$$ -128674 -158375 83175 -286286 -102626 -131511 33472 16185 404108 -99413 -94978 144961
9864b78918N2213B35379N2183b22724F1435b91862C2900a10545M8878F4440a54410
$$ -278918 -226705 235379 287562 -222724 61435 -291862 32900 -110545 -61667 64440 -154410
9852a55394o760K7028n8225k59716d1736C82g7985c5846D02422c97738a57675
$$ -155394 -162154 -135126 -193351 -453067 -41736 382 -77985 -35846 402422 -397738 -157675
9840A22496J8347J09048a43397C532a05618o0192H4053b11504M3795M4066N4401
$$ 122496 140843 249891 -143397 3532 -105618 -165810 84053 -211504 -167709 -123643 -69242
9829f9242D3120b80709A19075j9329b62939J23866I2074c74110I3077L94849k24818
$$ -69242 43120 -280709 119075 99746 -262939 -139073 92074 -374110 93077 487926 263108
9818B63108B8078e1605l06486a12375C1868c13562i8081n3640M3810k71549g8774
$$ 263108 28078 -51605 -358091 -112375 31868 -313562 -98081 -151721 -107911 -379460 -78774
9806b01991O1681C4519Q0038a60494a986A43989a03009d5541M349B99164a5758
$$ -201991 -140310 34519 114557 -160494 -1986 143989 -103009 -45541 -41192 299164 -15758
9794g332B29016E1135e931q6729k10879q0714O8409f4228G2983f2666j74279g3813
$$ -7332 229016 51135 -5931 -92660 -303539 -384253 -315844 -64228 72983 -62666 -236945 -73813
9781B09785b53256J03840j05820a14365B08184d6135m8216k62167e3430m03745
$$ 209785 -253256 -149416 -255236 -114365 208184 -46135 -94351 -356518 -53430 -457175
9771d57175C7055J52866b02360f6249k5628I3650J50811q368C8979J03882d65641
$$ -457175 37055 189921 -202360 -66249 -91877 93650 244461 236093 38979 142861 -465641
9759a62644Q0228b0219l65890a74683A5141G137K7979g6389k08493r082B17241
$$ -162644 -82416 -20219 -386109 -174683 15141 7137 35116 -76389 -284882 -293964 217241
9747A0699b45252A07453a91839I0972b36492D4846d6052n9120k11311a52088a5815
$$ 10699 -245252 107453 -191839 90972 -236492 44846 -46052 -105172 -316483 -152088 -15815
9735g7441M923A20700b36931f7501L0159n8553I3344a16049j66355Q8445G4559
$$ -77441 -72518 120700 -236931 -67501 -37342 -95895 93344 -116049 -282404 -193959 74559
9723a46832I7098c97941D71483d27677h3063A27096J56283b8471D3950a38760
$$ -146832 97098 -397941 471483 -427677 -83063 127096 283379 -28471 43950 -138760
9712A24081a2016G4111B244L85868h4565j86918C9333J6304a7113k27464I4833
$$ 124081 -12016 74111 2244 388112 -84565 -271483 39333 55637 -17113 -244577 94833
9700b08873j47344B8612B54b20703D2869d2460A57224b26498o0021A89548a24409
$$ -208873 -356217 28612 254 -220703 42869 -42460 157224 -226498 -286519 189548 -124409
9688A82896F4380J17033g3665A50248b54458A0875L8923c35886H7330b63397g7520
$$ 182896 64380 181413 -73665 150248 -254458 10875 49798 -335886 87330 -263397 -77520
9676b2556k22355R2933A9021b47634A19256J88063j40300d69700a03267j48641
$$ -22556 -244911 -151978 19021 -247634 119256 307319 167019 -469700 -103267 -251908
9666b51908F2644J01984J92874g9156f294k31025C50549g8079b9743k19566o354
$$ -251908 62644 164628 357502 -79156 -6294 -237319 350549 -78079 -29743 -249309 -255663
9655b55663I3922J57056k974A6438b23937L7511o1454B16301a77562K703j28545
$$ -255663 93922 250978 248004 16438 -223937 -186426 -247880 216301 -177562 -174859 -303404
9644c03404a18135l2865B49952p7933a76117B4518c13015e3658A52774c082F9244
$$ -303404 -118135 -151000 249952 172019 -176117 24518 -313015 -53658 152774 -3082 69244
9632f9522P339C00399b2413C67163b23460a1966p5707l27652a373k57046N2022
$$ -69522 -62183 300399 -22413 367163 -223460 -11966 -87673 -415325 -1373 -258419 -206397
9621b06397A81070b9272E3361d47879b13498k3251n6553J21100Q537c1356r1677
$$ -206397 181070 -29272 53361 -447879 -213498 -236749 -293302 -172202 -163665 -31356 -123033
9610a23033A23341n0878a58739m039j67682a50836F8400b20981h1516D92448a86533
$$ -123033 123341 72463 -158739 -162778 -330460 -150836 68400 -220981 -81516 492448 -186533
9598b214k51771A1628b40614g7360p8262j36499J7059c1870j6222A9648g0907
$$ -2214 -253985 11628 -240614 -77360 -155622 -292121 -275062 -31870 -48092 19648 -70907
9586a47527j45774D1231a9063a953F0249k7051Q3690L4418c38022J65451a869
$$ -147527 -293301 41231 -19063 -1953 60249 33198 116888 151306 -338022 -172571 -1869
9574c36528g5544k58076A68082c8078D4314J89093a93233P4038F059c08959A31965
$$ -336528 -75544 -333620 168082 -38078 44314 233407 -193233 -119195 6059 -308959 131965
9562d29673a26965o7195B12190a76450G6920L497O3582a25784E8425c29240a30528
$$ -429673 -126965 -194160 212190 -176450 76920 80417 143999 -125784 58425 -329240 -130528
9550b02441o8995A6191i4338A35009f241E2435c5806j66858d5440A70613D4952
$$ -202441 -271436 16191 -94338 135009 -6241 52435 -35806 -202664 -45440 170613 44952
9538b10629Q7625M0026A909K1118a96329B29183M0681I9260O1658o5762D0192
$$ -210629 -123004 -82978 1909 23027 -196329 229183 269864 99260 160918 95156 40192
9526i4825B55977c30168a5863e692O51D62348A68999e7895m7876a4280A74215
$$ -94825 255977 -330168 -15863 -5692 -5041 462348 168999 -57895 -105771 -14280 174215
9514F7065a82025P1460K8368B03646o0928b86512a17334C17516a10073k69065
$$ 67065 -182025 -110565 -82197 203646 142718 -286512 -117334 317516 -110073 -379138
9504c79138a58433A55249c46170D1140b8012k79988I0242b14719N4697p1487P2207
$$ -379138 -158433 155249 -346170 41140 -28012 -308000 90242 -214719 -160022 -231509 -159302
9493a59302n9252e5376p8961A2151d7784E5314f8870C04004b21578k6562h2569
$$ -159302 -218554 -55376 -134337 12151 -47784 55314 -68870 304004 -221578 -248140 -82569
9481b32188A31718b3090B65833a84503m23889A07527b32420c2308C1638O011j2872
$$ -232188 131718 -23090 265833 -184503 -608392 107527 -232420 -32308 31638 37649 24777
9470B4777a37756k168A27169a00576j6177D6237J97164A8248c42943N1637C4687
$$ 24777 -137756 -139924 127169 -100576 -116753 46237 243401 18248 -342943 -291306 34687
9458H9207i2472b1591C03634h7709q573l4970L6104j73382A13313k9015b1752
$$ 89207 -92472 -21591 303634 -87709 -96282 -131252 -95148 -268530 113313 84298 -21752
9446a91549D4819c7995n5539o2416B65753a09003r3586H5989b01237Q1249J3901
$$ -191549 44819 -37995 -93534 -155950 265753 -109003 -202589 85989 -201237 -119988 -106087
9435a06087b6719E3665c76917E8571b5450j64170l59024I7188j0392B091K106
$$ -106087 -26719 53665 -376917 58571 -25450 -189620 -548644 97188 86796 2091 4197
9424D197d24876h6664A47864g411n3410r363C6740K1245M4515K0133h8617k25600
$$ 4197 -424876 -86664 147864 -7411 -60821 -70184 36740 57985 102500 122633 -88617 -314217
9412c14217P0745e8408A24734k8859O655b40410J18108j31420l7811k3039j51334
$$ -314217 -243472 -58408 124734 95875 102530 -240410 -122302 -253722 -291533 -314572 -465906
9401d65906J85821a25118j4257M8413c5563r5990b7746B26181F386a9467r5921
$$ -465906 -280085 -125118 -139375 -90962 -35563 -131553 -27746 226181 6386 -19467 -115388
9390a15388j65668b4880j19763J880O7412C18987e11132C605a99708A04802C139
$$ -115388 -281056 -24880 -144643 -142763 -75351 318987 -511132 3605 -199708 104802 3139
9378a60740F3181a93213d551A01042b34659I9388J93200b8914p568k5955l6969
$$ -160740 63181 -193213 -4551 101042 -234659 99388 292588 -28914 -36482 -62437 -99406
9367i9406C13342b26072g7164K0577k28633a40393A19827a09826G2779J1060a35228
$$ -99406 313342 -226072 -77164 -56587 -285220 -140393 119827 -109826 72779 83839 -135228
9355b08209l05177A4395J27075P1705a95108d5603C5891J97695c9896A45165c04056
$$ -208209 -513386 14395 141470 213175 -195108 -45603 35891 233586 -39896 145165 -304056
9343b10429L9981Q1696B1586i4483C56329b79521B3605b42683a04798p3893H688
$$ -210429 -170448 -88752 21586 -94483 356329 -279521 23605 -242683 -104798 -178691 8688
9331c32166A92787H7910a01811A71867J52476b64140a26716j72192J18654j10559
$$ -332166 192787 87910 -101811 171867 324343 -264140 -126716 -298908 -180254 -290813
9321b90813Q2438A59028d05013J58295F7583J00506a40258n5940O4507A19761
$$ -290813 -208375 159028 -405013 -246718 67583 168089 -140258 -196198 -131691 119761
9310I9124L81695a41256l1343M5148p8261h5648A22496f6369l8248a9332A52178
$$ 99124 480819 -141256 -172599 -127451 -205712 -85648 122496 -66369 -104617 -19332 152178
9298B62523c15159Q4063B50114A21931d1717B9821a95444F8917B8963K2350J0085
$$ 262523 -315159 -231096 250114 121931 -41717 29821 -195444 68917 28963 51313 61398
9287F1398J31230f78556a12635k07523A9565J30598P6031g9915j26208Q0750L6928
$$ 61398 192628 -678556 -112635 -320158 19565 150163 226194 -79915 -206123 -125373 -88445
9276h8445A23791a42139K8550e3945j07700c4852A00615j0188K5301a32972M2889
$$ -88445 123791 -142139 -113589 -53945 -161645 -34852 100615 90427 115728 -132972 -90083
9265i0083K210A1155R2861d4689q9959H3070d5844j02249B28052J96828c05738
$$ -90083 -87873 11155 104016 -44689 -134648 83070 -45844 -148093 228052 424880 -305738
9253g3338B44969C967b01801L9257l9153A97881c9642E1130J05565b64512J27683
$$ -73338 244969 3967 -201801 -162544 -201697 197881 -39642 51130 156695 -264512 -136829
9242a36829A46319E5223a71133l2998o6664J10827F0741c80742a47885e7547j4409
$$ -136829 146319 55223 -171133 -204131 -270795 -159968 60741 -380742 -147885 -57547 -71956
9231g1956Q153D5702a0111k0568j99659C15860a78024Q139h4256j34380H6913
$$ -71956 -63803 45702 -10111 -30679 -230338 315860 -178024 -169885 -84256 -218636 86913
9219a82533c6571B11862G5780B4532k062d8839q4990A02751m9325J24120e32995
$$ -182533 -36571 211862 75780 24532 22470 -48839 -133829 102751 53426 177546 -532995
9207a65950k24923B21714a0703j04355I4898C4055J35303F525J13610c19330J7789
$$ -165950 -390873 221714 -10703 -115058 94898 34055 169358 6525 120135 -319330 -301541
9196c01541N9115C20565F7471a22181A1331K4413A0065a6200l5908A00398a27778
$$ -301541 -242426 320565 67471 -122181 11331 35744 10065 -16200 -52108 100398 -127778
9184H2088c31118J63879E1248c0369j54799P5649F3943j1659a4350k3382B05318
$$ 82088 -331118 -167239 51248 -30369 -185168 -109519 63943 52284 -14350 -37732 205318
9172b36069C45031J31600g051l28055A10598n4406f7131k21473a3225l08044c8814
$$ -236069 345031 476631 -7051 -335106 110598 56192 -67131 -288604 -13225 -321269 -38814
9160b71891B85033D295e05443a12339L1942b7966p376l62494B78408e0803J3754
$$ -271891 285033 4295 -505443 -112339 -80397 -27966 -35342 -397836 278408 -50803 -37049
9149c7049k70701a20198j19258B12826c2963A63770g8690G0511a69825E9304a57940
$$ -37049 -307750 -120198 -239456 212826 -32963 163770 -78690 70511 -169825 59304 -157940
9137g6450l94398a32625A72432a22265J1017b2032F6245J10481a53016A55694
$$ -76450 -470848 -132625 172432 -122265 -111248 -22032 66245 176726 -153016 155694
9126E6972K33804a9037k23906F0835c3987m2327H4128j5286a63603j60736a36027
$$ 56972 290776 -19037 -242943 60835 -33987 -76314 84128 68842 -163603 -324339 -136027
9114C18826a80144E7188h9809m25092B62887b02714P8768B23058a02157r6822
$$ 318826 -180144 57188 -89809 -514901 262887 -202714 -123946 223058 -102157 -198979
9104a98979b6411k00409m9292q1118e6839J9433m8954c2469k23840m0843g7521
$$ -198979 -26411 -226820 -276112 -357230 -56839 -37406 -86360 -32469 -256309 -297152 -77521
9092b29433k0421G5770a60283c9089n0367A3026J19860b51054I7602l3942a5097
$$ -229433 -249854 75770 -160283 -39089 -89456 13026 132886 -251054 97602 63660 -15097
9080a91267i0711r037o7240m8922k58933b34221b8173H3026d33549a3850j9517
$$ -191267 -90711 -99748 -166988 -215910 -474843 -234221 -28173 83026 -433549 -13850 -33367
9069c3367j59026M1432A73348c09784d5082q7734k33037a18166d2009k57382A42560
$$ -33367 -192393 -150961 173348 -309784 -45082 -132816 -365853 -118166 -42009 -299391 142560
9057b39940A26123b8481q8204C71181b61335Q6724P4244E223a3480E908d42901
$$ -239940 126123 -28481 -116685 371181 -261335 -174611 -100367 5223 -13480 5908 -442901
9045a39316K0502E293L8019a12298H5022a86101A87050a55747r6355j17010B24184
$$ -139316 -118814 5293 43312 -112298 85022 -186101 187050 -155747 -252102 -369112 224184
9033d06967b1483H6102a11140m9133D3614b93405J20501N1274K9908I761c32343
$$ -406967 -21483 86102 -111140 -160273 43614 -293405 -172904 -121630 -91722 9761 -332343
9021c5721p2118F7312P8743b88165A420b9762B52635d0377m7629C6069G9h4222
$$ -35721 -107839 67312 146055 -288165 1420 -29762 252635 -40377 -88006 36069 79 -84222
9008c1631o3933j34058A20122K2727c21813B08128a3947j30557A49924F4059J3183
$$ -31631 -95564 -229622 120122 142849 -321813 208128 -13947 -144504 149924 64059 77242
8997G7242b11796b9822C0856a72857J3438M8850A80510H0147a14931F446a27661
$$ 77242 -211796 -29822 30856 -172857 -159419 -110569 180510 80147 -114931 6446 -127661
8985c7880j98073h0420A83179b54577B19076a7214j72094r0055N9164D5781K44728
$$ -37880 -235953 -80420 183179 -254577 219076 -17214 -189308 -279363 -220199 45781 290509
8974B90509a15277A8963J28382a48528b1124D8996c03242f627G5129M2713a90531
$$ 290509 -115277 18963 147345 -148528 -21124 48996 -303242 -6627 75129 117842 -190531
8962C01014c182k45903q6198g2631o7024D7561f3622E7512c39540d4609A84788
$$ 301014 -3182 -249085 -335283 -72631 -139655 47561 -63622 57512 -339540 -44609 184788
8950a66156G0302b39638m435p5356a3031A48890a0276F2645j8830O193a17700
$$ -166156 70302 -239638 -244073 -319429 -13031 148890 -10276 62645 43815 50008 -117700
8938a23422j3259C27486a84743A631P0967b75733F5948f9948c0732C1212c31333
$$ -123422 -136681 327486 -184743 1631 72598 -275733 65948 -69948 -30732 31212 -331333
8926a78039e4150C34468b65613a0150A56688N87303C30331a4650j6587J4209G5445
$$ -178039 -54150 334468 -265613 -10150 156688 743991 330331 -14650 -31237 -17028 75445
8914a75241n8147g2239A39504b09577C7501b23610j00017G3376R448a84399D9405
$$ -175241 -233388 -72239 139504 -209577 37501 -223610 -323627 73376 82824 -184399 49405
8902B09640I1171L9551b37116J18189r9552B8740a07148B60736c59129J13295
$$ 209640 91171 130722 -237116 -118927 -218479 28740 -107148 260736 -359129 -245834
8892b45834A22795a32583B1696K6418P9280K73093b6054k45913J10900C22111
$$ -245834 122795 -132583 21696 48114 127394 400487 -26054 -271967 -161067 322111
$$ [...]
##END NTUPLES=NMR SPECTRUM
##END=
