
##TITLE=UV1204_M3_1292-1211_7185246_wvG09XVc7x
##JCAMPDX= 6.0         $$ Bruker NMR JCAMP-DX V2.0
##DATA TYPE= NMR SPECTRUM
##DATA CLASS= NTUPLES
##ORIGIN= BRUKER
##OWNER= Administrator
$$ 1.72 TOPSPIN		Version 2.1
$$ 2012-12-17 18:49:36.769 -0500  Administrator@X
$$ Compression mode = diff/dup
##.OBSERVE FREQUENCY= 400.02188249412
##.OBSERVE NUCLEUS= ^1H
##.ACQUISITION MODE= SIMULTANEOUS (DQD)
##.ACQUISITION SCHEME= undefined
##.AVERAGES= 64
##.DIGITISER RES= 22
##SPECTROMETER/DATA SYSTEM= spect
##.PULSE SEQUENCE= noesygpps1d.comp
##.SOLVENT NAME= COFFEE_meoh
##.SHIFT REFERENCE= INTERNAL, COFFEE_meoh, 1, 14.96106
##AUDIT TRAIL= $$ (NUMBER, WHEN, WHO, WHERE, PROCESS, VERSION, WHAT)
$$ ##TITLE= Audit trail, TOPSPIN		Version 2.1
$$ ##JCAMPDX= 5.01
$$ ##ORIGIN= Bruker BioSpin GmbH
$$ ##OWNER= Administrator
$$ $$ E:\/data/COFFEE/nmr/UV1204_M3_1292-1211_7185246_wvG09XVc7x/32/pdata/1/auditp.txt
$$ ##AUDIT TRAIL=  $$ (NUMBER, WHEN, WHO, WHERE, PROCESS, VERSION, WHAT)
(   1,<2012-12-17 18:49:31.019 -0500>,<Administrator>,<X>,<go>,<TOPSPIN 2.1>,
      <created by zg
	started at 2012-12-17 18:38:04.255 -0500,
	POWCHK enabled, PULCHK disabled,
       configuration hash MD5:
       86 BA 57 50 F2 9D 5C 9B 26 00 A9 28 5F 66 2E 89
       data hash MD5: 64K
       B2 CD 28 32 AD A2 93 4D CB 17 7E EC 34 84 61 85>)
(   2,<2012-12-17 18:49:34.066 -0500>,<Administrator>,<X>,<proc1d>,<TOPSPIN 2.1>,
      <Start of raw data processing
       efp LB = 0.3 FT_mod = 6 PKNL = 1 PHC0 = 0 PHC1 = 0 SI = 128K 
       data hash MD5: 128K
       9F 80 81 C6 7A 07 52 AA 92 65 72 4D 33 71 B2 AF>)
(   3,<2012-12-17 18:49:35.113 -0500>,<Administrator>,<X>,<proc1d>,<TOPSPIN 2.1>,
      <pk PHC0 = -82.00745 PHC1 = 0 
       data hash MD5: 128K
       78 10 97 65 C5 E6 91 5D DD 28 6C 43 20 34 60 B2>)
(   4,<2012-12-17 18:49:35.738 -0500>,<Administrator>,<X>,<proc1d>,<TOPSPIN 2.1>,
      <abs ABSG = 1 
       data hash MD5: 128K
       F8 D3 E7 7E 2B 6D 66 A7 6A 64 59 3C 49 80 80 0E>)
(   5,<2012-12-17 18:49:35.910 -0500>,<Administrator>,<X>,<proc1d>,<TOPSPIN 2.1>,
      <abs ABSG = 2 
       data hash MD5: 128K
       21 3C 47 F6 51 D7 36 5F DB A0 66 CC 4F 3E DD 5B>)
(   6,<2012-12-17 18:49:36.097 -0500>,<Administrator>,<X>,<proc1d>,<TOPSPIN 2.1>,
      <abs ABSG = 3 
       data hash MD5: 128K
       3A 40 1B 60 E5 A2 EC A2 ED BD 59 68 BA 05 11 F6>)
(   7,<2012-12-17 18:49:36.254 -0500>,<Administrator>,<X>,<proc1d>,<TOPSPIN 2.1>,
      <abs ABSG = 4 
       data hash MD5: 128K
       7E A2 77 36 9C 6C 8D F0 92 29 34 31 06 40 10 8D>)
(   8,<2012-12-17 18:49:36.441 -0500>,<Administrator>,<X>,<proc1d>,<TOPSPIN 2.1>,
      <abs ABSG = 5 
       data hash MD5: 128K
       64 DA 89 9C 8E 44 E1 86 41 23 AE 7B 5D 85 85 72>)
$$ ##END=
$$ 
$$ $$ hash MD5
$$ $$ 4E A4 B4 7C 99 69 BC 3A 6D 24 9C FE CA 96 C5 C8
##$RELAX= 
##$RELAX= 
##$RELAX= 
##$RELAX= 
##$RELAX= 
##$RELAX= 
##$RELAX= 
##$RELAX= 
$$ Bruker specific parameters
$$ --------------------------
##$DU= <E:\>
##$EXPNO= 32
$$ [...]
##$TP07= 0
##$TPNAME0= <>
##$TPNAME1= <>
##$TPNAME2= <>
##$TPNAME3= <>
##$TPNAME4= <>
##$TPNAME5= <>
##$TPNAME6= <>
##$TPNAME7= <>
##$TPOAL= (0..7)
0.5 0.5 0.5 0.5 0.5 0.5 0.5 0.5
##$TPOFFS= (0..7)
0 0 0 0 0 0 0 0
##$TUNHIN= 0
##$TUNHOUT= 0
##$TUNXOUT= 0
##$USERA1= <user>
##$USERA2= <user>
##$USERA3= <user>
##$USERA4= <user>
##$USERA5= <user>
##$V9= 5
##$VALIST= <valist>
##$VCLIST= <CCCCCCCCCCCCCCC>
##$VD= 0
##$VDLIST= <DDDDDDDDDDDDDDD>
##$VPLIST= <PPPPPPPPPPPPPPP>
##$VTLIST= <TTTTTTTTTTTTTTT>
##$WBST= 2048
##$WBSW= 25
##$XGAIN= (0..3)
0 0 0 0
##$XL= 0
##$YL= 0
##$YMAX_a= 6401291
##$YMIN_a= -12497450
##$ZGOPTNS= <>
##$ZL1= 120
##$ZL2= 120
##$ZL3= 120
##$ZL4= 120
##$ABSF1= 14.96106
##$ABSF2= -5.597122
##$ABSG= 5
##$ABSL= 3
##$ALPHA= 0
##$AQORDER= 0
##$ASSFAC= 0
##$ASSFACI= 0
##$ASSFACX= 0
##$ASSWID= 0
##$AUNMP= <proc_prof1d_extract.lims>
##$AXLEFT= 0
##$AXNAME= <>
##$AXNUC= <1H>
##$AXRIGHT= 0
##$AXTYPE= 0
##$AXUNIT= <>
##$AZFE= 0.1
##$AZFW= 0.1
##$BCFW= 0
##$BC_mod= 0
##$BYTORDP= 0
##$COROFFS= 0
##$CY= 15
##$DATMOD= 1
##$DC= 0
##$DFILT= <>
##$DTYPP= 0
##$F1P= 0
##$F2P= 0
##$FCOR= 0.5
##$FTSIZE= 131072
##$FT_mod= 6
##$GAMMA= 0
##$GB= 0
##$INTBC= 1
##$INTSCL= 1
##$ISEN= 128
##$LB= 0.3
##$LEV0= 0
##$LPBIN= 0
##$MAXI= 10000
##$MC2= 0
##$MEAN= 0
##$ME_mod= 0
##$MI= 0
##$NCOEF= 0
##$NC_proc= -2
##$NLEV= 6
##$NOISF1= 0
##$NOISF2= 0
##$NSP= 0
##$NTH_PI= 0
##$NZP= 0
##$OFFSET= 14.96106
##$PC= 1
##$PHC0= -82.00745
##$PHC1= 0
##$PH_mod= 1
##$PKNL= yes
##$PPARMOD= 0
##$PPDIAG= 0
##$PPIPTYP= 0
##$PPMPNUM= 2147483647
##$PPRESOL= 1
##$PSCAL= 4
##$PSIGN= 0
##$PYNMP= <proc.py>
##$REVERSE= no
##$SF= 400.020009612716
##$SI= 131072
##$SIGF1= 0
##$SIGF2= 0
##$SINO= 400
##$SIOLD= 131072
##$SPECTYP= <>
##$SREGLST= <1H.CDCl3>
##$SSB= 0
##$STSI= 131072
##$STSR= 0
##$SW_p= 8223.68421052631
##$SYMM= 0
##$S_DEV= 0
##$TDeff= 65536
##$TDoff= 0
##$TI= <>
##$TILT= no
##$TM1= 0
##$TM2= 0
##$TOPLEV= 0
##$USERP1= <user>
##$USERP2= <user>
##$USERP3= <user>
##$USERP4= <user>
##$USERP5= <user>
##$WDW= 1
##$XDIM= 131072
##$YMAX_p= 442258652
##$YMIN_p= -19067
##$CURPLOT= <Network HP LaserJet P1505>
##$CURPRIN= <$Network HP LaserJet P1505>
##$DFORMAT= <normdp>
##$LAYOUT= <+/1D_H.xwp>
##$LFORMAT= <normlp>
##$PFORMAT= <normpl>
##$SURQMSG= 1
$$ End of Bruker specific parameters
$$ ---------------------------------
##NTUPLES= NMR SPECTRUM
##VAR_NAME=  FREQUENCY,     SPECTRUM/REAL,   SPECTRUM/IMAG
##SYMBOL=    X,             R,               I
##VAR_TYPE=  INDEPENDENT,   DEPENDENT,       DEPENDENT
##VAR_FORM=  AFFN,          ASDF,            ASDF
##VAR_DIM=   131072,        131072,          131072
##UNITS=     HZ,            ARBITRARY UNITS, ARBITRARY UNITS
##FACTOR=    0.0627417313425164, 1,          1
##FIRST=     8223.62146879497, 646,          -54791
##LAST=      0,             2295,            -54696
##MIN=       0,             -19067,          0
##MAX=       8223.62146879497, 442258652,    0
$$ Real data points
##PAGE= N=1
##DATA TABLE= (X++(R..R)), XYDATA
$$ [...]
63881E20483n963m346k130J82K340M385O230P836R663J2262J5449J8390K0516
63868F05297K1989K3312K4914K6970K9171L0751L1221L1049L1212L2070L3138
63857I21094L3854L4080L3788L2764L0839K8130K4938K1576J8191J4507R962M445
63845A208168j327o597j1489j6540k1604k6018k9730l3329l6794l9228m0211m0559
63833I04742m1143m1610m0989l9128l6804l4774l3209l1874l0261k7775k4410
63822E22765k1185j9272j8649j8107j6750j4969j3696j3012j2050j0202p994o485
63810C50394o042o078o004n879n922n849n208m197l545l650m255m906n256n027
63796B78576m219l384l099l145k802k034j689k246l072l337l055k782k701k562
$$ plain form
63881 520483 514520 510174 508044 508226 510566 514951 521181 529017 538680 550942 566391 584781 605297
63868 605297 627286 650598 675512 702482 731653 762404 793625 824674 855886 887956 921094
63857 921094 954948 989028 1022816 1055580 1086419 1114549 1139487 1161063 1179254 1193761 1203723 1208168
63845 1208168 1206841 1200244 1188755 1172215 1150611 1124593 1094863 1061534 1024740 985512 945301 904742
63833 904742 863599 821989 781000 741872 705068 670294 637085 605211 574950 547175 522765
63822 522765 501580 482308 463659 445552 428802 413833 400137 387125 375075 364873 356879 350394
63810 350394 344352 338274 332270 326391 320469 314620 309412 305215 301670 298020 293765 288859 283603 278576
63796 278576 274357 270973 267874 264729 261927 259893 258204 255958 252886 249549 246494 243712 241011 238449
63782B38449k160j560r86p91j184j780j826j105k12L07N19N69J86p61j683j853
63766B24129j231l06M17M76m36j812k376j471RP64P12P15J086J344J188P68J19
63749B24095p43j167k84J712L500M126L813L143K191R53lO2J126K240K297J096
63733B48157k42j79J505L236L485K754K856M366N921O287N921N904O259O239N658
63718C08127N001M426L562K255Q66l11j419k652l826m492m347l466k342j632j720
63703B98030k337k698k130o67R34J863J994J927K273L062L908M463M503L850K672
63688C21647J631J227J077L83q94j830j655n95N72J341J608J415R07M03K40O15
63672C28092J538K667L317L001K100J556J741K037J725Q93J87p3k29q94k341m105
$$ plain form
63782 238449 236289 234729 233743 232952 231768 229988 228162 227057 226845 227152 227671 228240 228426 227665 225982 224129
63766 224129 222898 222592 223009 223485 223049 221237 218861 217390 217399 218163 218875 219590 220676 222020 223208 223976 224095
63749 224095 223352 222185 221901 223613 227113 231239 235052 238195 240386 241339 241336 241398 242524 244764 247061 248157
63733 248157 247915 247736 249241 252477 255962 258716 261572 265938 271859 278146 284067 289971 296230 302469 308127
63718 308127 313128 317554 321116 323371 324237 323926 322507 319855 316029 311537 307190 303724 301382 299750 298030
63703 298030 295693 292995 290865 290198 291132 292995 294989 296916 299189 302251 306159 310622 315125 318975 321647
63688 321647 323278 324505 325582 325965 325071 323241 321586 320991 321563 322904 324512 325927 326834 327237 327477 328092
63672 328092 329630 332297 335614 338615 340715 342271 344012 346049 347774 348667 348854 348781 348552 347658 345317 341212
63656C41212n226n154m451m138m393m415l687k690k043j576q16J03O39P19Q09
63641C04893J278K062K937L665M021M012M039M520N365O083O330O193O056O357
63627C67811P322Q768J0327J1917J3737J5658J7168J8175J9366K1351K3781K5891
63615E61272K7616K9642L2456L5905L9457M2464M4269M4558M3492M1105L6773
63604I79009K9911K1055J1651K921m539j0167j3350j4137j3362j1877j0273r341
63592I57501j0003j2394j5691j9152k2687k6101k8595k9634k9599k8915k7206
63581G07524k4204k0876j8564j7215j5570j3071j0403q101n755l089p33P71J953
63568E72667L579N446O883P978R316J0761J1507J1456J1573J2604J4226J5886
$$ plain form
63656 341212 335986 330832 326381 322243 317850 313435 309748 307058 305015 303439 302623 302726 303365 304084 304893
63641 304893 306171 308233 311170 314835 318856 322868 326907 331427 336792 342875 349205 355398 361454 367811
63627 367811 375133 383901 394228 406145 419882 435540 452708 470883 490249 511600 535381 561272
63615 561272 588888 618530 650986 686891 726348 768812 813081 857639 901131 942236 979009
63604 979009 1008920 1029975 1041626 1044547 1040008 1029841 1016491 1002354 988992 977115 966842 957501
63592 957501 947498 935104 919413 900261 877574 851473 822878 793244 763645 734730 707524
63581 707524 683320 662444 643880 626665 611095 598024 587621 579520 573765 570676 569943 570714 572667
63568 572667 576246 581692 588575 596553 605869 616630 628137 639593 651166 663770 677996 693882
63556F93882J7833K0665K4320K8196L2049L6237M1158M6863N2947N8117N9773
63545A112040N5020M2916K5805Q032o794j7317k3729k6380k5530k2104j7843j4340
63533A089776j2146j1059j0977j2074j4372j7674k1897k6903l1921l5719l7623
63522H57411l7976l7268l5511l2872l0298k8630k7379k5330k2346j9644j8023
63511E42134j6746j4729j2170j0169r123q366p370o578o620p236p468o770n509
63498D23280m339l506k928k664k925l599m175m197l630k677j546n26L8J51L28
63483C87085J041K132L099L762M305M720M753M377L931L658L406K888J984O96
63469D31837q79k484l820m781n371n454m969m331m134m278l939k696j248n60o28
$$ plain form
63556 693882 711715 732380 756700 784896 816945 853182 894340 941203 994150 1052267 1112040
63545 1112040 1167060 1209976 1235781 1243813 1237019 1219702 1195973 1169593 1144063 1121959 1104116 1089776
63533 1089776 1077630 1066571 1055594 1043520 1029148 1011474 989577 962674 930753 895034 857411
63522 857411 819435 782167 746656 713784 683486 654856 627477 602147 579801 560157 542134
63511 542134 525388 510659 498489 488320 479197 470831 463461 456883 450263 443027 435559 428789 423280
63498 423280 418941 415435 412507 409843 406918 403319 399144 394947 391317 388640 387094 386568 386606 386757 387085
63483 387085 388126 390258 393357 397119 401424 406144 410897 415274 419205 422863 426269 429157 431141 431837
63469 431837 430958 428474 424654 419873 414502 409048 404079 399748 395614 391336 387397 384701 383453 382893 382265
63454C82265n50K48J431K420L175M092N345O702P955R273J1023J3347J6075J8935
63440D81736K1763K4657K8188L3200L9632M5297M6684M1805L2217K1701J3190
63429H30070P442M213L409M784P544J1037J5470K1324K8377L5719M2503M8159
63417A060051N2027N3295N1363M6090L7700K6796J4557K661p256j4239j8228j9704
63405A285113j9262j7566j5586j4410j4672j6431j9713k4627l0656l6368m0552
63394A035270m3175m4561m4180m1415l7224l3631l1306k8935k5434k1536j8415
63383F65458j5870j2917r390n936k909l11J592K635L454M910O954Q922J0749J2986
63369F70327J5640J8054K0041K2255K5125K8179L0848L3332L6251L9764M3458
$$ plain form
63454 382265 381715 381963 383394 385814 388989 393081 398426 405128 413083 422356 433379 446726 462801 481736
63440 481736 503499 528156 556344 589544 629176 674473 721157 762962 795179 816880 830070
63429 830070 837512 841725 845134 849918 857462 868499 883969 905293 933670 969389 1011892 1060051
63417 1060051 1112078 1165373 1216736 1262826 1300526 1327322 1341879 1344540 1337284 1323045 1304817 1285113
63405 1285113 1265851 1248285 1232699 1218289 1203617 1187186 1167473 1142846 1112190 1075822 1035270
63394 1035270 992095 947534 903354 861939 824715 791084 759778 730843 705409 683873 665458
63383 665458 649588 636671 627281 621345 618436 618125 619717 622352 625806 630716 637670 646592 657341 670327
63369 670327 685967 704021 724062 746317 771442 799621 830469 863801 900052 939816 983274
63358I83274M6795M9345N0648N0129M7162M1281L2536K1744J0309l08q986j5141
63346A308788j8743k0061j9431j7447j5363j4676j5954j8491k1518k5249l0133
63335A091722l5532l9961m2437m2900m1493l8382l4342l0550k7410k4141j9823
63324G14751j4323q057j731L159M280L4q633j8443k5953k9495k9334k6621k2576
63311E37058j8402j5240j3678j3233j2673j1156q989p151o283o227o388o233n614
63298D05791m892m687n285o228o688o207n008l730k982k959l289l378k994k378
63284C45086j802j363j245j621k171k256j839j586j699j425l52N93L71n91j044
63269C27056p47m62m23j09M84O20J37j80J05M15K72J11M33R34J136J210J537J956
$$ plain form
63358 983274 1030069 1079414 1130062 1180191 1227353 1268634 1301170 1322914 1333223 1332915 1323929 1308788
63346 1308788 1290045 1269984 1250553 1233106 1217743 1203067 1187113 1168622 1147104 1121855 1091722
63335 1091722 1056190 1016229 973792 930892 889399 851017 816675 786125 758715 734574 714751
63324 714751 700428 692371 690640 693799 698079 698113 689480 671037 645084 615589 586255 559634 537058
63311 537058 518656 503416 489738 476505 463832 452676 443687 436536 430253 424026 417638 411405 405791
63298 405791 400899 396212 390927 384699 378011 371804 366796 363066 360084 357125 353836 350458 347464 345086
63284 345086 343284 341921 340676 339055 336884 334628 332789 331203 329504 328079 327727 328320 328691 328100 327056
63269 327056 326309 325847 325424 325315 325799 326419 326556 326376 326481 326896 327168 327279 327712 328646 329782 330992 332529 334485
63251C34485K085J999K012K133K232K419K867L448L937M351M752N028N112N203
63237C82063N529O094O883P941R183J0402J1591J2865J3966J4419J4254J4014
63225E09204J3837J3251J2168J1308J1188J1363J1231J1021J1305J2046J2799
63214F40721J3420J3913J3930J3152J1827J0206P821M141k71m119o877r137j1471
63201F97256j3733j5604j7032j7904j7898j7009j5655j4035j1828q921n949l678
63189E38010k124o95J022L041N310P784J0109J1705J2426J2833J3573J4581J5266
63176F42841J5338J5123J4917J4500J3614J2618J2137J2145J1993J1351J0593
63165G87170R993Q999O741L098j081m791p768j0561j3767j7200j9991k1645k2674
$$ plain form
63251 334485 336570 338569 340581 342714 344946 347365 350232 353680 357617 361968 366720 371748 376860 382063
63237 382063 387592 393686 400569 408510 417693 428095 439686 452551 466517 480936 495190 509204
63225 509204 523041 536292 548460 559768 570956 582319 593550 604571 615876 627922 640721
63214 640721 654141 668054 681984 695136 706963 717169 724990 729131 728860 724741 717864 708727 697256
63201 697256 683523 667919 650887 632983 615085 598076 582421 568386 556558 547637 541688 538010
63189 538010 535886 535191 536213 539254 544564 552348 562457 574162 586588 599421 612994 627575 642841
63176 642841 658179 673302 688219 702719 716333 728951 741088 753233 765226 776577 787170
63165 787170 797163 806162 812903 816001 814920 810129 802361 791800 778033 760833 740842 719197 696523
63152F96523k3734k4483k4084k2673k1328k0412j9021j6595j4074j2564j1661
63141D85894j0156p912n918m729l960l326l035k994k569j568o42k78k6P58J905
63126D41444K693K826K651K579K695K865K953K935L007L407M049M494M429M067
63112D87094L862L957M065L860L363K972L095L671M074L711K742J996K088K812
63098E33362L536L988M344M710M848M519L874L262K741K067J188N20M50P34P04
63083E74847L3r76j912k701l354l644l370k734k127j665j264r80q87o95L7J209
63067E49817K149K432K466K976M214N912P775R673J1383J2607J3396J4305J5905
63054F55010J8214K0784K3294K5747K8085K9939L1045L1715L2568L3773L4791
$$ plain form
63152 696523 672789 648306 624222 601549 580221 559809 540788 524193 510119 497555 485894
63141 485894 475738 467826 461908 457179 453219 449893 446858 443864 441295 439727 439085 438807 438781 439539 441444
63126 441444 444137 446963 449614 452193 454888 457753 460706 463641 466648 470055 474104 478598 483027 487094
63112 487094 490956 494913 498978 502838 506201 509173 512268 515939 520013 523724 526466 528462 530550 533362
63098 533362 536898 540886 545230 549940 554788 559307 563181 566443 569184 571251 572439 572959 573409 574143 574847
63083 574847 574880 573904 571992 569291 565937 562293 558923 556189 554062 552397 551133 550153 549266 548571 548608 549817
63067 549817 551966 554398 556864 559840 564054 569966 577741 587414 598797 611404 624800 639105 655010
63054 655010 673224 694008 717302 743049 771134 801073 832118 863833 896401 930174 964965
63043I64965L4922L4006L2581L1471L1112L1120L0684K9575K8631K8816K9904
63032A307787L0592K9943K8167K5846K2990J9231J4491Q923K482m886j2715k0150
63020A452701k6579l1909l6263l9659m1983m3026m2625m0903l8238l4917l0993
63009A045606k6634k2263j8163j4150r954n581j105L518Q039J1795J4548J7039
62997A002695K0003K2922K4598K4861K4807K5250K5833K5926K5546K4981K4248
62986A271670K3474K3122K3127K2379J9838J5866J1610P306K135m252j1039j7415
62974A387821k3495k9571l5121l9294m1979m3674m4479m4048m2465m0487l8637
62963I64571l6739l4531l2186k9908k7555k5104k3032k1688k0697j9532j8344
$$ plain form
63043 964965 999887 1033893 1066474 1097945 1129057 1160177 1190861 1220436 1249067 1277883 1307787
63032 1307787 1338379 1368322 1396489 1422335 1445325 1464556 1479047 1487970 1490452 1485566 1472851 1452701
63020 1452701 1426122 1394213 1357950 1318291 1276308 1233282 1190657 1149754 1111516 1076599 1045606
63009 1045606 1018972 996709 978546 964396 954442 948861 947756 951274 959313 971108 985656 1002695
62997 1002695 1022698 1045620 1070218 1095079 1119886 1145136 1170969 1196895 1222441 1247422 1271670
62986 1271670 1295144 1318266 1341393 1363772 1383610 1399476 1411086 1418392 1420527 1416275 1405236 1387821
62974 1387821 1364326 1334755 1299634 1260340 1218361 1174687 1130208 1086160 1043695 1003208 964571
62963 964571 927832 893301 861115 831207 803652 778548 755516 733828 713131 693599 675255
62952F75255j7631j7316j6933j6497j6387j6355j5567j3807j1889j0534r580q682
62940E04077q088q071q198p806o938o134n550m909m153l583l289k974k431j860
62926D30093j596j689j849j778j540j562k041k479k208j330o74o69q98r68j107
62911D07705j475j532q51j7R5l71n05o4K83J75K21J126K727M224N029N079M629
62894D26478M014L513L278L278L256K811J823Q21N77J085J427R50J41k03k01o68
62878D52380j817k920l212k688j976j852k680l972m598l994k942k643l241l826
62864D10019l801l463l277l218l032k640k054j319o18r0M29J109J678J703J240
62849C92666P66N64O27R21J240J030Q3q44q64k78j34o26r50q07q06j138r89M0
$$ plain form
62952 675255 657624 640308 623375 606878 590491 574136 558569 544762 532873 522339 512759 504077
62940 504077 495989 487918 479720 471914 464976 458842 453292 448383 444230 440647 437358 434384 431953 430093
62926 430093 428497 426808 424959 423181 421641 420079 418038 415559 413351 412021 411347 410678 409780 408812 407705
62911 407705 406230 404698 403847 403830 403925 403554 403049 402985 403268 403443 403664 404790 407517 411741 416770 421849 426478
62894 426478 430492 434005 437283 440561 443817 446628 448451 449272 449849 450934 452361 453311 453452 453249 453048 452380
62878 452380 450563 447643 444431 441743 439767 437915 435235 431263 426665 422671 419729 417086 413845 410019
62864 410019 406218 402755 399478 396260 393228 390588 388534 387215 386597 386507 386936 388045 389723 391426 392666
62849 392666 393432 393996 394623 395544 396784 397814 397897 397053 396189 395911 395777 395151 394201 393394 392588 391450 390461 390501
62831C90501J001Q98J16k54L9M05N46O53P74P78Q39J276J900K154J965J853K117
62814D07561K369K168J720J624K090K677K867K689K653L156M078M940N276M931
62800D50799M234L835M073M480M406M130M658O144P418P696P914R465J2261J5130
62786E46643J7643K0213K2766K4763K6605K9509L3644L7715M0800M3431M6271
62775H90003M8936N0801N1983N2668N2286N0179M6523M1876L6401L0019K2741
62764A374416J4422M901n158j4446k2443k9794l6742m2293m5739m7813m9347m9850
62752A050114m8646m6523m4798m3446m1603l9361l7479l5673l2852k9033k5486
62741F25214k2876k0630j8431j6860j6118j5246j3358j0816q620p253o525n944
$$ plain form
62831 390501 391502 392400 392516 392262 392301 392706 393252 393905 394679 395457 396296 397572 399472 401626 403591 405444 407561
62814 407561 409930 412098 413818 415442 417532 420209 423076 425765 428418 431574 435652 440592 445868 450799
62800 450799 455033 458868 462941 467421 471827 475957 480615 486759 494177 501873 509787 519252 531513 546643
62786 546643 564286 584499 607265 632028 658633 688142 721786 759501 800301 843732 890003
62775 890003 938939 989740 1041723 1094391 1146677 1196856 1243379 1285255 1321656 1351675 1374416
62764 1374416 1388838 1393739 1388581 1374135 1351692 1321898 1285156 1242863 1197124 1149311 1099964 1050114
62752 1050114 1001468 954945 910147 866701 825098 785737 748258 712585 679733 650700 625214
62741 625214 602338 581708 563277 546417 530299 515053 501695 490879 482259 475006 468481 462537
62729D62537m970l432j956j343j441j274m59L71P29J032J778K757L619M489N515
62714D67952O314O562O673P323Q655J0414J2524J5005J7545J9742K1618K3489
62702F23816K5447K7401K9476L1934L4751L7716M0909M4635M8736N2373N4749
62691A051943N5799N5860N4813N1991M7010M0265L2375K3477J3553L144o937j6555
62679A406738k6174l5578m3437m8631n1438n2881n3406n2844n1294m9245m7031
62668H94779m4822m2845m0954l8250l4068k9262k5573k3556k2044j9863j7276
62657E56266j5228j3958j2964j1931j1009j0336r767r088q231p276o309n344m416
62644D30409l777l708l972l793k791j583r74q85p02m57p44j540k103k135k164
$$ plain form
62729 462537 457567 454135 452179 450836 449395 448121 447662 448033 448762 449794 451572 454329 457948 462437 467952
62714 467952 474266 480828 487501 494824 503479 513893 526417 541422 558967 578709 600327 623816
62702 623816 649263 676664 706140 738074 772825 810541 851450 896085 944821 997194 1051943
62691 1051943 1107742 1163602 1218415 1270406 1317416 1357681 1390056 1413533 1427086 1430230 1423293 1406738
62679 1406738 1380564 1344986 1301549 1252918 1201480 1148599 1095193 1042349 991055 941810 894779
62668 894779 849957 807112 766158 727908 693840 664578 639005 615449 593405 573542 556266
62657 556266 541038 527080 514116 502185 491176 480840 471073 461985 453754 446478 440169 434825 430409
62644 430409 426632 422924 418952 415159 412368 410785 409811 408926 408224 407767 407023 405483 403380 401245 399081
62629C99081k450k434j682o55M0M26P13O46L5n99n64R4P87J211J412J378J127
62612C98566J014J324J736J733J473J655K547L668M509N155N973P018Q029Q879
62598D53279R840J1312J3362J5658J7903K0158K2479K4488K5769K6486K7088K7324
62586F95146K6272K3575J9972J6262J2420Q153L717n16m775r395j3868j7234j9313
62573G40416k0799k2172k3173k3473k3183k2511k1408j9877j8191j6655j5308
62562E13666j4018j2606j0852q744o852o054o659p918q596p972o292m435l176
62549D09492k592k169j515q70p13j020j258j054n39pL83N19K89j82n41o10n41
62532C97072m34RJ111K693M068M632M409M042M195M987O079P380R291J1981J4740
$$ plain form
62629 399081 396631 394197 392515 391860 391900 392326 393039 393685 393720 393121 392557 392651 393438 394649 396061 397439 398566
62612 398566 399580 400904 402640 404373 405846 407501 410048 413716 418225 423380 429353 436371 444400 453279
62598 453279 463119 474431 487793 503451 521354 541512 563991 588479 614248 640734 667822 695146
62586 695146 721418 744993 764965 781227 793647 801800 805517 805001 800226 790831 776963 759729 740416
62573 740416 719617 697445 674272 650799 627616 605105 583697 563820 545629 528974 513666
62562 513666 499648 487042 476190 467446 460594 454540 447881 439963 431367 423395 417103 412668 409492
62549 409492 406900 404731 403216 402346 401633 400613 399355 398301 397762 397755 398138 398657 398946 398764 398223 397613 397072
62532 397072 396638 396647 397758 400451 404519 409151 413560 417602 421797 426784 432863 440243 449534 461515 476255
62517D76255J6631J7722J8985K0967K3206K5228K7241K9404L1104L1737L1747
62506G50227L1972L2248L1537K9306K5862K1372J5613R062L132j305m809q097
62494I36120j0604j1335j0588r651q949p604m937j371K412O214R796J2568J4451
62481I16522J6284J8492J9838J8464J3998P953K134k673o624j0351j4723k0284
62469I59030k6461l1742l5008l6379l6684l6432l5669l4411l2861l1226k9529
62458E92628k7524k4847k1453j7920j5029j2908j0998q936p066n792m902l913
62446D31340k809j886j108j50R28J623J759J849K380L105L379L026K464J965J200
62431D49065k13j986l346m001m481n332o230o363n568m626m246m180l673k553
$$ plain form
62517 476255 492886 510608 529593 550560 573766 598994 626235 655639 686743 718480 750227
62506 750227 782199 814447 845984 875290 901152 922524 938137 947199 950331 949026 944217 936120
62494 936120 925516 914181 903593 893942 884993 877389 872452 871081 873493 879707 889503 902071 916522
62481 916522 932806 951298 971136 989600 1003598 1011551 1013685 1011012 1004388 994037 979314 959030
62469 959030 932569 900827 865819 829440 792756 756324 720655 686244 653383 622157 592628
62458 592628 565104 540257 518804 500884 485855 472947 461949 453013 445947 440155 435253 431340
62446 431340 428531 426645 425537 425387 426315 427938 429697 431546 433926 437031 440410 443436 445900 447865 449065
62431 449065 448852 446866 443520 439519 435038 429706 423476 417113 411545 406919 402673 398493 394820 392267
62417C92267j451r92j161j520j759j800j603j134n39q3R0O5J2l0j41l82o71p14
62399C78454j57J099K684L999M727M911M622L872L032K849L603M574M883M727
62385D27879N089O281P537Q246Q732R454J0112J0269J0206J0508J1109J1626J2237
62372E49285J3385J4792J5712J6267J7558K0190K3476K6545K9561L3315L8082
62361G98168M3438M8985N4688O0577O6472P1966P6513P9447Q0042P7572P1513
62350A529381O1968M9771L6056K1807Q143l488j2223j8917k5464l2811m0225m6741
62338A527257n2345n7246o0801o2013o0787n7956n4331n0325m6204m2085l7840
62327I45324l3498k9656k6989k5523k4797k4505k4453k4207k3390k2243k1210
$$ plain form
62417 392267 390816 389824 388663 387143 385384 383584 381981 380847 380308 380225 380315 380380 380392 380362 380221 379839 379168 378454
62399 378454 378297 379396 382080 386079 390806 395717 400339 404211 407243 410092 413695 418269 423152 427879
62385 427879 432968 439249 446786 455032 463764 473218 483330 493599 503805 514313 525422 537048 549285
62372 549285 562670 577462 593174 609441 626999 647189 670665 697210 726771 760086 798168
62361 798168 841606 890591 945279 1005856 1072328 1144294 1220807 1300254 1380296 1457868 1529381
62350 1529381 1591349 1641120 1677176 1698983 1707126 1703638 1691415 1672498 1647034 1614223 1573998 1527257
62338 1527257 1474912 1417666 1356865 1294852 1234065 1176109 1121778 1071453 1025249 983164 945324
62327 945324 911826 882170 855181 829658 804861 780356 755903 731696 708306 686063 664853
62316F64853k0141j8577j6740j5458j4970j4519j3400j1830j0444r419q443p237
62304E03675n874m725m189m227m175l407k146j147n97P0J142K130K615K914L475
62289D85534M141M528M729N042N372N424N263N108M885M567M662N649P021P708
62275E59633P432O981P068P685Q753J0572J3164J5847J8043K0157K3060K6973
62263G25368L1382L5884M0637M5999N2111N8789O5566P1868P7309Q1587Q3904
62252A370404Q2915P7735O8833N7447M4402L0133J5651K528q435j7879k6858l5610
62240A661266m3762n1229n8265o4753o9873p2682p2839p0813o7460o3413n8808
62229I67369n3646m8225m2979l8002l3216k8927k5695k3486k1541j9312j7024
$$ plain form
62316 664853 644712 626135 609395 593937 578967 564448 551048 539218 528774 519355 510912 503675
62304 503675 497801 493076 488887 484660 480485 477078 474932 473785 473188 473258 474400 476530 479145 482059 485534
62289 485534 489675 494203 498932 503974 509346 514770 520033 525141 530026 534593 539255 544904 551925 559633
62275 559633 567065 574046 581114 588799 597552 608124 621288 637135 655178 675335 698395 725368
62263 725368 756750 792634 833271 879270 931381 990170 1055736 1127604 1204913 1286500 1370404
62252 1370404 1453319 1531054 1599887 1657334 1701736 1731869 1747520 1750048 1741613 1723734 1696876 1661266
62240 1661266 1617504 1566275 1508010 1443257 1373384 1300702 1227863 1157050 1089590 1026177 967369
62229 967369 913723 865498 822519 784517 751301 722374 696679 673193 651652 632340 615316
62218F15316j5033j3177j1251r608q683q265p807p196o615n980n105m241l698
62205E08657l123j874r5J332K008K462L186L955M488N144O471Q357J0162J1563
62191E62693J2880J4559J6540J8236J9146J9461J9901K0862K1920K2388K2072
62180G70658K1208J9923J8250J6502J5114J4128J3475J3582J5120J8069K1664
62169I57693K5413K9619L4636M0170M5517N0056N3250N4569N3685N0452M4603
62158A439663L5902K4846J2882J735p374j4021j8793k3182k8576l4999m1262m6398
62146A300423n0354n3151n4246n3195n0407m6692m2571l8304l4156l0129k5976
62135H21242k1838j8408j6012j4109j2184j0580r804r526q941p804o409m833k922
$$ plain form
62218 615316 600283 587106 575855 566247 557564 549299 541492 534296 527681 521701 516596 512355 508657
62205 508657 505534 503660 503565 504897 506905 509367 512553 516508 520996 526140 532611 540968 551130 562693
62191 562693 575573 590132 606672 624908 644054 663515 683416 704278 726198 748586 770658
62180 770658 791866 811789 830039 846541 861655 875783 889258 902840 917960 936029 957693
62169 957693 983106 1012725 1047361 1087531 1133048 1183104 1236354 1290923 1344608 1395060 1439663
62158 1439663 1475565 1500411 1513293 1515028 1507654 1493633 1474840 1451658 1423082 1388083 1346821 1300423
62146 1300423 1250069 1196918 1142672 1089477 1039070 992378 949807 911503 877347 847218 821242
62135 821242 799404 780996 764984 750875 738691 728111 718307 708781 699840 692036 685627 680794 677872
62122F77872q16J141K939M846O902R009J1323J3984J6517J7937J7466J4892J0468
62109H04480M999j35l572m758m043k218k14J032Q76q61l987p874j1228j2604j1633
62094G48260r366o965m598j922R44L575N833P606Q610R108J0245J2664J5328J6731
62080H16053J6971J7521J9234K1736K4541K7448K9905L1251L1929L3200L5353
62069A105142L7353L8675M0263M2894M5716M7314M7484M6919M5582M2409L6579
62058A576330K8343J8660Q579r37r105j5517k0242k3748k6746k9957l3857l8480
62046A433323m3310m7318m9537m9957m9522m8892m7621m5088m1790l8835l6482
62035I34971l4143l1679k9492k7361k4435k0713j7429j5399j4091j2834j1954
$$ plain form
62122 677872 677056 678197 681136 685982 692884 701893 713216 727200 743717 761654 779120 794012 804480
62109 804480 809479 809344 805772 801014 796971 794753 794539 795571 796447 795586 791599 783725 772497 759893 748260
62094 748260 738894 731929 727331 725409 726353 729928 735761 743367 751977 761085 771330 783994 799322 816053
62080 816053 833024 850545 869779 891515 916056 943504 973409 1004660 1036589 1069789 1105142
62069 1105142 1142495 1181170 1221433 1264327 1310043 1357357 1404841 1451760 1497342 1539751 1576330
62058 1576330 1604673 1623333 1631912 1630975 1621870 1606353 1586111 1562363 1535617 1505660 1471803 1433323
62046 1433323 1390013 1342695 1293158 1243201 1193679 1144787 1097166 1052078 1010288 971453 934971
62035 934971 900828 869149 839657 812296 787861 767148 749719 734320 720229 707395 695441
62024F95441j1853j1953j1469j0654j0314j0573j0903j0971j0684r781q276o933
62012E71077o517o759o778o241n383m161k321k35J250J914K426L398M647N485
61998E51802N315L972J986M06j57k69r70k496m271n927p545q963r707r792r819
61983E03565j0078j0190r871r289q433o949n072l926m149m819m547l314k327k244
61969D18357k480k363k096k109k105j411r0R34R44K68j92N2P59J510K220K992
61953D15190L803M548N257O045O903P816R027J0844J3135J5286J6885J8215J9900
61940E52854K2169K4602K6479K7260K6928K6030K5300K4970K4592K3621K2066
61929H26871K0233J8088J5290J1874Q373N090J687k142n961r003j1086j2574j3509
$$ plain form
62024 695441 683588 671635 660166 649512 639198 628625 617722 606751 596067 586286 578010 571077
62012 571077 564560 557801 551023 544782 539399 535238 532917 532682 533932 535846 538272 541670 546317 551802
61998 551802 557117 561089 563075 563481 563324 563055 562085 559589 555318 549391 541846 532883 523176 513384 503565
61983 503565 493487 483297 473426 464137 455704 448755 443683 439757 435608 430789 426242 422928 420601 418357
61969 418357 415877 413514 411418 409309 407204 405793 405703 406637 407581 407849 407657 407709 408468 409978 412198 415190
61953 415190 418993 423541 428798 434843 441746 449562 458589 469433 482568 497854 514739 532954 552854
61940 552854 575023 599625 626104 653364 680292 706322 731622 756592 781184 804805 826871
61929 826871 847104 865192 880482 892356 900729 905819 907506 905364 899403 890400 879314 866740 853231
61916H53231j3314j1536q439m632m19M071Q462J2247J5286J7758J9540K0012J8772
61903I31039J6284J3483J0681P280K790k210o542r760j2411j4917j6879j7900
61891I00938j8460j9190j9643j8844j6940j5339j4924j5034j4672j3850j3178
61880G20864j2815j2587j2605j2907j2946j2237j1226j0671j0379r439p642n773
61868E89637m409l290k028p13N21J855L433N150O977R030J1169J3182J5417J8577
61854F64508K2551K6190K8683L0507L2576L4974L7129L8766L9920M0280L9198
61843A035282L6336L1886K6250J9912J3464P268J167n090j1117j5862j8316j8086
61831A103094j5522j1518p121k869J460O181J0890J4671J6996J8020J7869J6095
$$ plain form
61916 853231 839917 828381 819942 815310 814891 818962 827424 839671 854957 872715 892255 912267 931039
61903 931039 947323 960806 971487 978767 981557 979347 972805 963045 950634 935717 918838 900938
61891 900938 882478 863288 843645 824801 807861 792522 777598 762564 747892 734042 720864
61880 720864 708049 695462 682857 669950 657004 644767 633541 622870 612491 603052 595410 589637
61868 589637 585228 581938 579910 579197 579718 581573 585006 590156 597133 606163 617332 630514 645931 664508
61854 664508 687059 713249 741932 772439 805015 839989 877118 915884 955804 996084 1035282
61843 1035282 1071618 1103504 1129754 1149666 1163130 1170398 1171565 1166475 1155358 1139496 1121180 1103094
61831 1103094 1087572 1076054 1068933 1066064 1067524 1073705 1084595 1099266 1116262 1134282 1152151 1168246
61819A168246J2066N763k122j0618j8775k5604l0301l2911l4540l6355l8242l8888
61807I17719l7414l4511l1528k8825k5757k2070j8527j5900j4075j2513j1085
61796F65514j0014r307q719q093p395o656o030n739n671n360m627l985m020m596
61782E75302n035m932m462l961l582l310l046k654k093j541j196j023p85k92M09
61767E37799R87R97L50l96n47j72q5p08j351j020L69J944K826K755J985J048M78
61750E47259L52J72n35j556k278k506k597k835l098l177l035k675k019j096j25
61735E20251O30R80P62j2q87j145m87O07J359J513J494J736K087K099J818J942
61719E34747K930M179M529L597K238J516J565J722J447P36k20j332k460l316l732
$$ plain form
61819 1168246 1180312 1186075 1183953 1173335 1154560 1128956 1098655 1065744 1031204 994849 956607 917719
61807 917719 880305 845794 814266 785441 759684 737614 719087 703187 689112 676599 665514
61796 665514 655500 646193 637474 629381 621986 615330 609300 603561 597890 592530 587903 583918 579898 575302
61782 575302 570267 565335 560873 556912 553330 550020 546974 544320 542227 540686 539490 538467 537682 537390 537799
61767 537799 538786 539783 540133 539737 539190 539018 538933 538225 536874 535854 536223 538167 540993 543748 545733 546781 547259
61750 547259 547611 547783 547248 545692 543414 540908 538311 535476 532378 529201 526166 523491 521472 520376 520251
61735 520251 520881 521861 522623 522611 521724 520579 520092 520699 522058 523571 525065 526801 528888 530987 532805 534747
61719 534747 537677 541856 546385 549982 552220 553736 555301 557023 558470 559206 558986 557654 555194 551878 548146
61704E48146l944m403n222n924n863m896l603k740k608k918l107k746j928j346
61690D96898j620k356k323j083J19k22j828k954k625j562p51j55N82J077P26k25
61674D81698q71p30j12M02M42M0k87K8P83R54o6j521k085j356j28O51O34Lq45
61655D77634j494j735j632j256n56L48J081J485J885K550L215L500L530L635L770
61640D95960L599K999K097J009j05r64j510k143l188m381n158n262m763l867l035
61625D71288k813l121l133k327j243o35m36j72P9j1j85L5L68R8p90j668k389l431
61607D49514m868o103o700o774o474n862n336n392n823n965n775n788n924n353
61593C67377l927k733k687l384l914m031l925l504k681j909j683j842j951k001
$$ plain form
61704 548146 544202 539799 534577 528653 522790 517894 514291 511551 508943 506025 502918 500172 498244 496898
61690 496898 495278 492922 490599 489516 489635 489413 487585 484631 482006 480444 479693 479538 480120 481197 481923 481698
61674 481698 480827 480097 479985 480387 480829 480869 480582 480610 481393 482347 482281 480760 478675 477319 477191 477842 478476 478479 477634
61655 477634 476140 474405 472773 471517 470961 471309 472390 473875 475760 478310 481525 485025 488555 492190 495960
61640 495960 499559 502558 504655 505664 505559 504595 503085 500942 497754 493373 488215 482953 478190 474323 471288
61625 471288 468475 465354 462221 459894 458651 458016 457580 457408 457487 457476 457291 457326 457694 457792 457002 455334 452945 449514
61607 449514 444646 438543 431843 425069 418595 412733 407397 402005 396182 390217 384442 378654 372730 367377
61593 367377 363450 360717 358030 354646 350732 346701 342776 339272 336591 334682 332999 331157 329206 327205
61579C27205k132k017j335n54n54j371k069j933j269q06p46p52o06n23p99j319
61563C08420j561j144k96L95O23N89N95O61O76O49O21N06K45QM2L21N53N09K64
61544C12676J01J99N01Q49J221J746K393K852K853K538K326K398K490K281J785
61529C39209J322J056P20p6j191j908j757j205j044j297j266p45m29q20j468j684
61513C27417j465j145p43l10l63j154j859j437j55O78M19k58n03k82o8k16q38
61496C17718j703k213j940j254q67p63k65P58J538J490R85P07P68Q27O73M15K93
61479C17167M96Q96J039O85J94l3k14p02j110q07j02M5m77p24k16M05N53N88R53
61460C18636J383J496J427J299Q18N0j72O34J675J896J386R82R52Q48N03K80M93
$$ plain form
61579 327205 325073 323056 321721 321167 320613 319242 317173 315240 313971 313165 312419 311667 311061 310538 309739 308420
61563 308420 306859 305715 305419 305814 306437 307026 307621 308282 308958 309607 310228 310734 310979 310987 311029 311350 311903 312412 312676
61544 312676 312777 312976 313477 314326 315547 317293 319686 322538 325391 327929 330255 332653 335143 337424 339209
61529 339209 340531 341587 342307 342231 341040 339132 337375 336170 335126 333829 332563 331818 331389 330569 329101 327417
61513 327417 325952 324807 324064 323754 323391 322237 320378 318941 318786 319464 319883 319625 319122 318840 318772 318556 317718
61496 317718 316015 313802 311862 310608 309741 308978 308713 309471 311009 312499 313484 314191 314959 315786 316459 316874 317167
61479 317167 317663 318559 319598 320283 320477 320444 320230 319528 318418 317611 317509 317554 317077 316353 316137 316542 317095 317683 318636
61460 318636 320019 321515 322942 324241 325059 325109 324937 325571 327246 329142 330528 331510 332462 333310 333813 334093 334586
61443C34586J083J801K265K140J703J875L121M631N187M625L820L445L422L426
61429C77130L323L033K508J881J327Q19L69L55J127K406L448L822L646L211K687
61414D11092K135J469M73q44k015k526k381k016j824j975k403k701k293j136j15
61399C92940j96j314k429k654j982j026l44k8K64Q24J378J308N35j68r6N14Q95
61382C88421P35L26O8K89J257K741L768L434K037Q41O97J305J820J743J147N31
61366D11160N34J353K383K735K226J563J455J921K551L052L370L606M075N188
61352D47172O959Q765R916J0453J1093J2267J3448J3687J2689J0974R065O950
61340E73438M651K725J724J401J079N92J65m39j744l464m529m569m490n049n674
$$ plain form
61443 334586 335669 337470 339735 341875 343578 345453 348574 353205 358392 363017 366837 370282 373704 377130
61429 377130 380453 383486 385994 387875 389202 390021 390390 390745 391872 394278 397726 401548 405194 408405 411092
61414 411092 413227 414696 415169 414325 412310 409784 407403 405387 403563 401588 399185 396484 394191 393055 392940
61399 392940 392744 391430 389001 386347 384365 383339 382995 382967 383231 384055 385433 386741 387276 387108 387012 387526 388421
61382 388421 389156 389482 389550 389839 391096 393837 397605 401039 403076 403917 404614 405919 407739 409482 410629 411160
61366 411160 411694 413047 415430 418165 420391 421954 423409 425330 427881 430933 434303 437909 441984 447172
61352 447172 454131 462896 472812 483265 494358 506625 520073 533760 546449 557423 566488 573438
61340 573438 578089 580814 582538 583939 585018 585610 585775 585336 583592 580128 575599 571030 566540 561491 555817
61325E55817n396m331l450l293l594l833l506k225k67J236J403O62J61L19P36
61310E30439J232K075L247M317N243O567Q617J1021J3129J4439J4570J3327J0923
61297F39146P813M258N02k885n317o875p966q479p912o440n038m347m091l827
61283E88542l538l227k605j726j223j369j410m61J320L034M229N095N728N980
61269E98369N974O098O273N889M738L566L278L911M870N981P710J0278J3031J5039
61255F95005J5917J5726J4350J1548P641L597K02k496m762o648q144r448j0680
61242G21808j1557j1757j1389j0707r600p865n859m306l458k944k483k256k402
61229F35225k580k315j462j66J398K960M074M332L688K572J705J742K740L944
$$ plain form
61325 555817 550421 546090 542640 539347 535753 531920 528414 526189 525922 527158 528561 529223 529384 529703 530439
61310 530439 531671 533746 536993 541310 546553 553120 561737 572758 585887 600326 614896 628223 639146
61297 639146 646959 651217 651719 648834 643517 636642 628676 620197 612285 605845 600807 596460 592369 588542
61283 588542 585004 581777 579172 577446 576223 574854 573444 572983 574303 577337 581566 586661 592389 598369
61269 598369 604343 610441 616714 622603 627341 630907 634185 638096 642966 648947 656657 666935 679966 695005
61255 695005 710922 726648 740998 752546 760187 763784 763986 761490 756728 750080 741936 732488 721808
61242 721808 710251 698494 687105 676398 666798 658933 653074 648768 645310 642366 639883 637627 635225
61229 635225 632645 630330 628868 628702 630100 633060 637134 641466 645154 647726 649431 651173 653913 657857
61215F57857M450M205M055M617N457N708N199M508L995L355K352J469J449K369
61201G11045L665M994O597Q669J0872J2769J4435J6191J7930J9207J9941K0537
61189H66852K1087K0928J9222J5915J1923Q517O511N723N200M135K596J160q0
61176I89689j639l733n836p431q774j0468j2578j4525j5749j6173j6198j6440
61164H60145j7325j8629j9591j9628j8845j7695j6442j5163j3950j2831j1632
61153F78414j0172q393o232l634r31J205K483L398M447N276N024L342O45k464
61139F72408n472p835r098r275q751p686n850l195l31J872L143M098N564P675
61125F37267R784J1418J2994J5274J8153K0630K2013K2770K3840K5472K7057K7905
$$ plain form
61215 657857 662307 666512 670567 675184 680641 686349 691548 696056 700051 703406 705758 707227 708676 711045
61201 711045 714710 719704 726301 734970 745842 758611 773046 789237 807167 826374 846315 866852
61189 866852 887939 908867 928089 944004 955927 964444 970955 976678 981878 986013 988609 989769 989689
61176 989689 988050 984317 978481 971050 962276 951808 939230 924705 908956 892783 876585 860145
61164 860145 842820 824191 804600 784972 766127 748432 731990 716827 702877 690046 678414
61153 678414 668242 659849 653617 649983 649052 650257 652740 656138 660585 665861 670885 674227 674872 672408
61139 672408 666936 659101 650003 640728 631977 624291 618441 615246 614915 616787 619930 624028 629592 637267
61125 637267 647051 658469 671463 686737 704890 725520 747533 770303 794143 819615 846672 874577
61113H74577K7820K7059K6006K4873K3637K2247K0793J9326J7626J5472J3042
61102A112478J0662Q278N609K723j88l541q090j3692j9016k2854k5143k6471k7194
61089I93561k7452k7432k7143k6345k5079k3853k2881k1668j9683j7103j4561
61078G40361j2604j1543j1285j1026r716p253m690k984k093j565j207p82J59J489
61064F65261K286K049J571J881K922L920M596N331O421P862R543J1249J2699J3927
61050G51518J5257J6715J8012J9268K1009K3198K5053K6210K7212K8493K9738
61039A001683L0659L1479L2240L2570L2585L2998L3912L4674L5253L6514L8655
61028A373222M0855M2984M6039N0138N3756N5827N6878N7333N6771N6031N7815
$$ plain form
61113 874577 902397 929456 955462 980335 1003972 1026219 1047012 1066338 1083964 1099436 1112478
61102 1112478 1123140 1131418 1137027 1139750 1139562 1136021 1127931 1114239 1095223 1072369 1047226 1020755 993561
61089 993561 966109 938677 911534 885189 860110 836257 813376 791708 772025 754922 740361
61078 740361 727757 716214 704929 693903 684187 676934 672244 669260 667167 665602 664395 663613 663772 665261
61064 665261 667547 669596 671167 673048 675970 679890 684486 689817 696238 704100 713643 724892 737591 751518
61050 751518 766775 783490 801502 820770 841779 864977 890030 916240 943452 971945 1001683
61039 1001683 1032342 1063821 1096061 1128631 1161216 1194214 1228126 1262800 1298053 1334567 1373222
61028 1373222 1414077 1457061 1503100 1553238 1606994 1662821 1719699 1777032 1833803 1889834 1947649
61017A947649O3701P2538Q3120R6011J11033J25792J38934J52337J67964J85808
61007C144887K07871K40520K88946L52599M30598N28094O52061Q04861R88610
60998G639047J211543J482270J803927K183804K629996L095025L408585L317061
60990B6771258K666221J577360M19139m26102p80578o85320k69419L23890Q88671
60981C0485120J131491Q04230r4934j272961k322592k968733l170544l044694
60973A9546383k738446k364444j995608j671032j399418j172442r82007q24358
60965F398628o93983n83305m88674m10885l49538l01222k62904k32939k08743
60956B866435j87211j67551j50655j35808j20916j05767r2068q0333o9639o0497
$$ plain form
61017 1947649 2011350 2083888 2167008 2263019 2374052 2499844 2638778 2791115 2959079 3144887
61007 3144887 3352758 3593278 3882224 4234823 4665421 5193515 5845576 6650437 7639047
60998 7639047 8850590 10332860 12136787 14320591 16950587 20045612 23454197 26771258
60990 26771258 29437479 31014839 31433978 31007876 30227298 29541978 29272559 29596449 30485120
60981 30485120 31616611 32420841 32325907 31052946 28730354 25761621 22591077 19546383
60973 19546383 16807937 14443493 12447885 10776853 9377435 8204993 7222986 6398628
60965 6398628 5704645 5121340 4632666 4221781 3872243 3571021 3308117 3075178 2866435
60956 2866435 2679224 2511673 2361018 2225210 2104294 1998527 1906459 1826126 1756487 1695990
60946A695990n5094n4086n5425n6765n7135n6151n3667n0468m7593m4848m1506
60935A123252l8114l5823l4264l2084k9294k7078k5515k3491k0879j8697j7117
60924H20896j5295j3258j2003j1599j1076j0262r858r692q814p440o780o829o342
60911F91648n214m715n058m867l656k746k975l416l201k834k857k799k385k283
60897F42642k846l450l756m268m998n062m226l445l197k807k075j841k126j467
60883E97078P44K844L131K154J510J589J951K721M063N136N139M797N334O535
60869F44726P182P102P309Q212R049R284R491J0392J1763J2827J3394J4173J5776
60856G80680J7680J8565J7885J6601J5910J5770J5445J5065J5501J6847J8244
$$ plain form
60946 1695990 1640896 1586810 1531385 1474620 1417485 1361334 1307667 1257199 1209606 1164758 1123252
60935 1123252 1085138 1049315 1015051 982967 953673 926595 901080 877589 856710 838013 820896
60924 820896 805601 792343 780340 768741 757665 747403 737545 727853 719039 711599 704819 697990 691648
60911 691648 686434 681719 676661 671794 668138 665392 662417 659001 655800 652966 650109 647310 644925 642642
60897 642642 639796 636346 632590 628322 623324 618262 614036 610591 607394 604587 602512 600671 598545 597078
60883 597078 597822 600666 603797 605951 607461 609050 611001 613722 617785 622921 628060 632857 638191 644726
60869 644726 651908 659010 666319 674531 683580 692864 702355 712747 724510 737337 750731 764904 780680
60856 780680 798360 816925 834810 851411 867321 883091 898536 913601 929102 945949 964193
60845I64193J9150J9640J9336J7478J4373J1426R243O915L784N39k109m578p280
60832A072110r576j0915j2081j4097j6735j9056k0777k2039k2600k2337k1973
60821H79924k2137k2236k1352j9835j8859j8705j8649j8282j7774j6941j5250
60810F69904j2940j1068j0138r506q478p250o383n928n506m886m075l108k075
60797E78563j230q39q80j065j197j440k101l124l956m115l741l311k962k450j808
60782E44344j565k122l231m249m722m645m359m241m387m549m524m474m620m895
60768D87761n140n333n346m847l912l272l355l540l159k699l034l780l727k778
60754D33839k126k293k408j729p35n2N38J346K024K295K571L124L297K397P60
$$ plain form
60845 964193 983343 1002983 1022319 1039797 1054170 1065596 1074839 1081754 1085538 1086077 1083968 1079390 1072110
60832 1072110 1062534 1051619 1039538 1025441 1008706 989650 968873 946834 924234 901897 879924
60821 879924 857787 835551 814199 794364 775505 756800 738151 719869 702095 685154 669904
60810 669904 656964 645896 635758 626252 617774 610524 604141 598213 592707 587821 583746 580638 578563
60797 578563 577333 576494 575614 574549 573352 571912 569811 566687 562731 558616 554875 551564 548602 546152 544344
60782 544344 542779 540657 537426 533177 528455 523810 519451 515210 510823 506274 501750 497276 492656 487761
60768 487761 482621 477288 471942 467095 463183 459911 456556 453016 449857 447158 444124 440344 436617 433839
60754 433839 431713 429420 427012 425283 424548 424496 425034 426380 428404 430699 433270 436394 439691 442088 442848
60739D42848p21j698k298k512k265j768j242o03J51P01Q72R55J095R61L36m55
60723D34357j143j977l034l691l420k696k475l042l872m355m282l822l409l380
60709C89759l504l279k829k899l675m215l603k134r23o51j196k036k599k494j826
60694C51896j069n00r3N8k03n63m98j10O4J91J071K575L342K698J744J763K477
60677C64843K883K960L383M096M365M055L791L932M174M133L726L097K586K578
60663D14602K941K966K336J653J582J921K187K551L405M395M727M228L401K658
60649D55553K120J970K328K833K894K231Q64j138l411n193o034o309o612o878
60635D35218o654n876m889l997l409l258l295k923k053j392j388j426p96P1J97
$$ plain form
60739 442848 442127 440429 438131 435619 433354 431586 430344 429741 429892 430593 431465 432420 433515 434476 434812 434357
60723 434357 433214 431237 428203 424512 421092 418396 415921 412879 409007 404652 400370 396548 393139 389759
60709 389759 386255 382976 380147 377248 373573 369358 365755 363621 362698 362047 360851 358815 356216 353722 351896
60694 351896 350827 350327 350234 350292 350089 349526 349028 348918 348982 349173 350244 352819 356161 358859 360603 362366 364843
60677 364843 367726 370686 374069 378165 382530 386585 390376 394308 398482 402615 406341 409438 412024 414602
60663 414602 417543 420509 422845 424498 426080 428001 430188 432739 436144 440539 445266 449494 452895 455553
60649 455553 457673 459643 461971 464804 467698 469929 470793 469655 466244 461051 455017 448708 442096 435218
60635 435218 428564 422688 417799 413802 410393 407135 403840 400917 398864 397472 396084 394658 393862 393933 394130
60620C94130m54q96n00L30Q23O24q0q06j097q65l24M14J278J827J540P39L91P27
60602C97801Q93M08j7K59P06O50M76Q51J448J569J343J281J202O89N2j86k91p13
60584D08421r76l76O91J276J330J474J697J658J814K848M210M719M449M585N509
60569D43329O537P514R123J1379J3437J5174J7337J9775K1004K0186J8035J5088
60557F17918J0682M672j326n647q513j0977j2790j2792j0861q144n497k899l18
60544E53508J899L664N388P366R485J1679J4150J7033K0148K3117K5365K6047
60532G18849K4476K0754J5735J0181M313j668o990j0723j2654j3284j2947j1471
60520G24571r019o696n614n600n593n137m601l975k611n09J270K134K873M214
$$ plain form
60620 394130 393676 392780 392280 392610 393433 394057 393977 393171 392074 391209 390885 391299 392577 394404 395944 396683 397074 397801
60602 397801 398694 399102 399085 399344 400050 400700 401176 402027 403475 405044 406387 407668 408870 409559 409611 409425 409134 408421
60584 408421 407445 407069 407760 409036 410366 411840 413537 415195 417009 419857 424067 428786 433235 437820 443329
60569 443329 449866 457380 466503 477882 491319 506493 523830 543605 564609 584795 602830 617918
60557 617918 628600 633272 631946 626299 617786 606809 594019 581227 570366 562222 556725 553826 553508
60544 553508 555407 559071 564459 571825 581310 592989 607139 624172 644320 667437 692802 718849
60532 718849 743325 764079 779814 789995 794308 792640 785650 774927 762273 748989 736042 724571
60520 724571 715552 708856 703242 697642 692049 686912 682311 678336 675725 675216 676486 678620 681493 685707
60506F85707N451N718N805P344J0575J4346J8164K2833K8949L5952M3010M9845
60494I33699N6414O2623O8500P3730P6895P6225P1316O3203N2470L8458K0824
60483A594357R38j8972l7358n3360o6069p4658p9090p9980p7962p3561o7473o0552
60471I06260n3530m6961m1166l6072l1314k6757k2741j9758j7977j7016j6067
60460E76901j4420j2204j0355r484r084q344p357o752o416n639m421l639l701
60447D75085m012m035l936l833l292k143j010m75l39k18k59o87j174j260j029
60432D47383p98n26p2K78J48l37p44j027j566k523l446l593k602r77K26M35K89
60415D30548Q34K096L030K961K367J912J473O39l54r31j057j174j443j563j323
$$ plain form
60506 685707 691158 696876 702681 710025 720600 734946 753110 775943 804892 840844 883854 933699
60494 933699 990113 1052736 1121236 1194966 1271861 1348086 1419402 1482605 1535075 1573533 1594357
60483 1594357 1595295 1576323 1538965 1485605 1419536 1344878 1265788 1185808 1107846 1034285 966812 906260
60471 906260 852730 805769 764603 728531 697217 670460 647719 627961 609984 592968 576901
60460 576901 562481 550277 539922 530438 521354 513010 505653 498901 492485 486846 482425 478786 475085
60447 475085 471073 467038 463102 459269 455977 453834 452824 452349 452010 451792 451533 450846 449672 448412 447383
60432 447383 446585 446059 445987 446265 446413 446076 445332 444305 442739 440216 436770 433177 430575 429598 429824 430259 430548
60415 430548 431382 433478 436508 439469 441836 443748 445221 445860 445506 444575 443518 442344 440901 439338 438015
60400D38015q03p4Q58J721K017J597R56O99Q32Q89P23Q49J650K564K672K033J735
60383D58933K347L022K743J783J207J284J375J162J078J392J796K021K186K298
60369D84627K083J625J514K000K524K407J711J036P77Q02P14L49O7M54J504K457
60353E06651K784L004L894N169N805N628N627O534P805Q363P794O482N002L561
60339E84103J848n65l380n487o155n986o029o285n985n051m187l656l032k226
60325E27927j620j124k19Q68J198O50J64J13k48j156j487m46J054J776J992K842
60309E32284M500O185P520Q968J0974J3636J7032K1335K6497L2005L6580L8151
60297G55667L5008K7538J8114Q734n48j0285j9702k6985l1021l1936l0427k7368
$$ plain form
60400 438015 437212 437138 437996 439717 441734 443331 444287 444986 445818 446707 447430 448279 449929 452493 455165 457198 458933
60383 458933 461280 464302 467045 468828 470035 471319 472694 473856 474934 476326 478122 480143 482329 484627
60369 484627 486710 488335 489849 491849 494373 496780 498491 499527 500304 501106 501820 502169 502236 502690 504194 506651
60353 506651 509435 512439 516333 521502 527307 532935 538562 545096 552901 561264 569058 575540 580542 584103
60339 584103 585951 585386 582006 576519 570364 564378 558349 552064 546079 541028 536841 533185 530153 527927
60325 527927 526307 525183 524964 525832 527030 527680 527844 527957 527709 526553 525066 524620 525674 527450 529442 532284
60309 532284 536784 542969 550489 559457 570431 584067 601099 622434 648931 680936 717516 755667
60297 755667 790675 818213 836327 845061 844513 834228 814526 787541 756520 724584 694157 666789
60285F66789k3790k0399j7239j4316j2102j0825r801q300o673n801n760n839n632
60272E20312n281m801m040l200k706k589k528k418k260j789q59K4K86L13R93K320
60256D91777L188K824J648N24j90n30m76l4M56N72K02m15j012j436j612j443q97
60239D93146j86K65K14n3l5L55P87J139J722K679L587L930L673L150K647K296
60223E19316K104J948J742J673J959K358K413K234K414L099L736L986M165M502
60209E57649M648M340L885L605L387L205L327L507K883J349K64Q05K195K586J419
60194E99054j66r91r55n95m50r53k166l397l790l355k981l290l961m239l737k646
60178E61382j560j081j299j655j523q89k25J38K40K77L98N99O65L66j10l18k10
$$ plain form
60285 666789 642999 622600 605361 591045 578943 568118 558317 550017 543344 537543 531783 525944 520312
60272 520312 515031 510230 506190 502990 500284 497695 495167 492749 490489 488700 487841 487865 488151 488464 489457 491777
60256 491777 494965 497789 499437 499961 499771 499241 498765 498731 499187 499759 499961 499546 498534 497098 495486 494043 493146
60239 493146 492960 493225 493439 493386 493351 493706 494493 495632 497354 500033 503620 507550 511223 514373 517020 519316
60223 519316 521420 523368 525110 526783 528742 531100 533513 535747 538161 541260 544996 548982 553147 557649
60209 557649 562297 566637 570522 574127 577514 580719 584046 587553 590436 591785 592049 592854 595049 597635 599054
60194 599054 598888 597897 596942 596347 595897 594944 592778 589381 585591 582236 579255 575965 572004 567765 564028 561382
60178 561382 559822 558741 557442 555787 554264 553375 553150 553288 553528 553805 554203 554802 555467 555833 555723 555405 555195
60161E55195k23m82n48l04l74j093j646j099K39J248J623K061L000L989M474M484
60145E70544M337M224M238M462M837N256N827O727P807Q604Q869Q733Q395P848
60131F60708O992N854M573L198J569m71k664m309m953m891m633m136l089j763
60117F51985q31l54K19R39J190P83L07J0o27j678k158j411l27k97j534l193m603
60100F38420n561n924n733n387n057m284k794j150P4J215K797M396N143N019M819
60085F25993N012N364N508N329M889M451M230L840K476O7k431m305n827p143p551
60070F39902o734n821o057p105p820p974p991p685o670n512n137n320n136m592
60056E50348m490m849m870m300l623k850j468M26K007K809L000K736K255K297
$$ plain form
60161 555195 554972 554490 553942 553638 553264 552171 550525 549426 549665 550913 552536 554597 557597 561586 566060 570544
60145 570544 574881 579105 583343 587805 592642 597898 603725 610452 618259 626863 635732 644465 652860 660708
60131 660708 667700 673554 678127 681325 682894 682423 679759 675450 670497 665606 660973 656837 653748 651985
60117 651985 651154 650800 651019 651958 653148 653931 654238 654248 653621 651943 649785 648374 648047 647750 646216 643023 638420
60100 638420 632859 626935 621202 615815 610758 606474 603680 602530 602604 603819 606616 611012 616155 621174 625993
60085 625993 631005 636369 641877 647206 652095 656546 660776 664616 667092 667159 664728 660423 654596 647453 639902
60070 639902 633168 627347 621290 614185 606365 598391 590400 582715 576045 570533 565396 560076 554940 550348
60056 550348 545858 541009 536139 531839 528216 525366 523898 524324 526331 529140 532140 534876 537131 539428
60042E39428L179L843L082J556R71J503J628O02o24j229j586k027k146k010k643
60027E43527m443o300p085p036o986p135p241p233p011o397n636n218m880l843
60013D57083k263j350j506j590o88N32J094J286J901K709K774J912Q66K99K31
59998D63290L14K08r3j39M18J134J281J047J347K281K879K724K630L119L386K691
59982D88517J714J427J453P97k89o02P8N19k14j570k383k348k089k075j887q13
59966D80235R56K154J831O93L94J556L198M177M432M460M358L940L309K807K550
59951E21050K364J943J044j68r74q55l04k98q97j237r89r58j807l059l823l866
59935E07166l535l208l169l404l280k130m13N46L38M5N57J305J344Q57O48Q91
$$ plain form
60042 539428 542607 546450 549532 551088 552059 553562 555190 555792 555168 553939 552353 550326 548180 546170 543527
60027 543527 539084 532784 525699 518663 511677 504542 497301 490068 483057 476660 471024 465806 460926 457083
60013 457083 454820 453470 451964 450374 449686 450218 451312 452598 454499 457208 459982 461894 462760 463059 463290
59998 463290 463604 463812 463719 463580 463998 465132 466413 467460 468807 471088 473967 476691 479321 482440 485826 488517
59982 488517 490231 491658 493111 493908 493619 493017 493095 493614 493400 491830 489447 487099 485010 482935 481048 480235
59966 480235 481191 483345 485176 485869 486263 487819 491017 495194 499626 504086 508444 512384 515693 518500 521050
59951 521050 523414 525357 526401 526233 525259 524404 524100 523802 522905 521668 520679 519721 517914 514855 511032 507166
59935 507166 503631 500423 497254 493850 490570 488440 488027 488573 488911 488956 489513 490818 492162 493019 493667 494558
59919D94558J277J871K875L936M496M591M661M871N185N689O275O453O094N878
59905E58710O294O650N897M057K051M61p30j401j363j069j306k020k215j323K5
59890E72718R08J294J797K551K867K128P29j43K80J597K794L360L546L726L943
59875F04095M099M073L630K568J050n80k232l907n164n401m665l657k908k501
59861E88500k550l074l434k781j316j86J34M34J369K442K957L125L583M549O065
59846E99817Q348J1191J3679J5118J5611J5078J2647P972K517j572l479l688k491
59833F90748J69L442N349M353O26m297q725j1626j2888j3051j2675j2018j1259
59820F18148j0643j0106r209p803o412n541n020m421l766l318l020k599k004j273
$$ plain form
59919 494558 495835 497706 500581 504517 509013 513604 518265 523136 528321 534010 540285 546738 552832 558710
59905 558710 565004 571654 577551 581608 583659 584120 583390 581989 580626 579557 578251 576231 574016 572693 572718
59890 572718 573626 574920 576717 579268 582135 584263 584992 584849 585129 586726 589520 592880 596426 600152 604095
59875 604095 608194 612267 615897 618465 619515 618935 616703 612796 607632 602231 597566 593909 591001 588500
59861 588500 585950 582876 579442 576661 575345 575159 575293 575727 577096 579538 582495 585620 589203 593752 599817
59846 599817 608165 619356 633035 648153 663764 678842 691489 699461 701978 700406 696927 693239 690748
59833 690748 690917 694359 699708 704061 704687 700390 691665 680039 667151 654100 641425 629407 618148
59820 618148 607505 597399 588190 580387 573975 568434 563414 558993 555227 551909 548889 546290 544286 543013
59806E43013k92Q67J674J679J097M23k56j160k249l243m015m540m679m308l605
59791E20406k916k509k587l190l880l916l043j880j205j200j509j741j692j446
59777D87692j390j804k321k250j482n67M6K98J18m57p62p8J178J807J541J287
59761D82856J497J587J314J373J973K286K055K345L631M590M151L365L687M533
59747E21243M388L489L410M351M868M206L164K382J475K35o87q69p79q85r72p62
59731E48257m22j32J43K79M8k72l7P37J171O32m55j195j229q95o68o32m25K71
59713E45176J150J489J040L23j59m45n67j20J030K193K612K332J826J299Q92R06
59697E60977J236J218P21O12J292J725R29l62q30o13p83j310j178k52N63R53J480
$$ plain form
59806 543013 542721 543588 545262 546941 548038 548461 548205 547045 544796 541553 537538 532998 528319 524011 520406
59791 520406 517490 514981 512394 509204 505324 501408 498365 496485 495280 494080 492571 490830 489138 487692
59777 487692 486302 484498 482177 479927 478445 477878 477924 478222 478340 477883 477121 477043 478221 480028 481569 482856
59761 482856 484353 485940 487254 488627 490600 492886 494941 497286 500917 505507 509658 513023 516710 521243
59747 521243 525631 529120 532530 536881 541749 545955 549119 551501 552976 553211 552524 551655 550876 549991 549019 548257
59731 548257 547835 547703 547846 548125 548173 547901 547864 548601 549772 550404 549949 548754 547525 546630 545962 545330 544905 545176
59713 545176 546326 547815 548855 549178 549019 548574 548007 547887 548917 551110 553722 556054 557880 559179 560071 560977
59697 560977 562213 563431 564152 564764 566056 567781 568710 568348 567518 566905 566122 564812 563634 563382 563945 564898 566378
59680E66378K111J962Q06m94j416k410l718m645m670m333m470n060n328m573k878
59665E27262j266r76j994k681j666K71J224O95j08k86j36Q9P81J980K981L455
59649E29625L810M058L440J793J99m50o88j546l060m359m711m045k875k061k069
59634E17061k248j451L89K074K714K584K105R94q67k583l134k651k042j803j771
59619E09371j766j836k019k341k814l205l073k332j454p95j09R54K138K789K630
59604D96138K042J669J821K171K024J066k29j165j607j812j756j254o15m54p28
59589D97311p27j54M11M30J50qk09q13j597j921j622j316j692k672l444l326k484
59572D76317j617j080o43j57J03k7k45k88l46n55n62o5O91J310J684J667J019
$$ plain form
59680 566378 568489 570451 571257 570763 569347 566937 563219 558574 553904 549571 545101 540041 534713 530140 527262
59665 527262 525996 525020 523026 520345 518679 518950 520174 520869 520761 520475 520339 520428 521209 523189 526170 529625
59649 529625 533435 537493 540933 542726 542925 542475 541787 540241 537181 532822 528111 524066 521191 519130 517061
59634 517061 514813 513362 513751 515825 518539 521123 523228 524222 523355 520772 517638 514987 512945 511142 509371
59619 509371 507605 505769 503750 501409 498595 495390 492317 489985 488531 487736 487627 488581 490719 493508 496138
59604 496138 498180 499849 501670 503841 505865 506931 506702 505537 503930 502118 500362 499108 498493 498039 497311
59589 497311 496584 496430 496841 497271 497421 497413 497204 496391 494794 492873 491251 489935 488243 485571 482127 478801 476317
59572 476317 474700 473620 472977 472820 472923 472896 472651 472363 472017 471462 470900 470835 471526 472836 474520 476187 477206
59555D77206K09L35J549K492K199J660K241L473L896L492L550M515N698O930Q684
59540E28129J0676J2175J3910J7436K1897K3313J8484Q535k221r987j3309j2671
59528F16367r694o299l538j232J032L111M704N765O138N479L982K410J052o31
59514F28646k949n341p145q290q886q911q690q823r233r059p946o649n949n730
59500E25045n546n338n056m344l176k175j868k089k400k491j994p34O58J214R53
59485D90659Q33J187J324R44P12R96J232J194J608K780L854M205M425M931M901
59470E25785L678K215J745J888J500P02O10J496K584L436M233M901N085N087N752
59455E70697P330R195J0671J1520J1649J1103J0263R469Q539P103N154K784k26
$$ plain form
59555 477206 477415 477750 479299 481791 483990 485650 487891 491364 495260 498752 502302 506817 512515 519445 528129
59540 528129 538805 550980 564890 582326 604223 627536 646020 654555 652334 642347 629038 616367
59528 616367 606673 600374 596836 595604 596636 599747 604451 610216 616354 621833 625815 628225 629277 628646
59514 628646 625697 620356 613211 604921 596035 587124 578434 569611 560378 551319 543373 536724 530775 525045
59500 525045 519499 514161 509105 504761 501585 499410 497542 495453 493053 490562 488568 487834 488492 489706 490659
59485 490659 491492 492679 494003 494947 495659 496655 497887 499081 500689 503469 507323 511528 515953 520884 525785
59470 525785 529463 531678 533423 535311 536811 537513 538123 539619 542203 545639 549872 554773 559858 564945 570697
59455 570697 578027 587222 597893 609413 621062 632165 642428 651897 660436 667539 672693 675477 675251
59442F75251l926p542j0071j1314j1745j1592j0774r499q242p143o008m828l772
59429E68795k723j333N04K587M669O487P802Q760R924J1590J3475J5394J7693
59416F63624K0491K3163K5384K7938L1154L2712K8643J7368K035j1774k0277k3178
59404H17283k2189j8978j4394q581j473O103J1332J0337J562j1798k3687k9985
59392G15532l0866k8693k5042k0546j6210j3125j1225r569p748o043m478k870
59380E39117j504o80J58J615K945K932J963J695K555L332L388L507M044M147L663
59365E72877L994N917Q019Q641Q087P618P378O775O104O262P345Q727J0175J1781
59351F79700J3247J4233J5121J6449J7946J8817J8782J8110J7081J5964J5089
$$ plain form
59442 675251 671325 663783 653712 642398 630653 619061 608287 598788 590546 583403 577395 572567 568795
59429 568795 566072 564739 565243 567830 572499 578986 586788 595548 605472 617062 630537 645931 663624
59416 663624 684115 707278 732662 760600 791754 824466 853109 870477 872512 860738 840461 817283
59404 817283 795094 776116 761722 753141 751668 757771 769103 779440 781002 769204 745517 715532
59392 715532 684666 655973 630931 610385 594175 581050 569825 560256 552508 546465 541987 539117
59380 539117 537613 536933 537091 538706 541651 544583 546546 548241 550796 554128 557516 561023 565067 569214 572877
59365 572877 576871 582788 590807 599448 607535 615153 622531 629306 635410 641672 649017 657744 667919 679700
59351 679700 692947 707180 722301 738750 756696 775513 794295 812405 829486 845450 860539
59340H60539J4275J2704R957O635L404M1l901q091j1793j4670j6661j7576j7517
59327H17346j7123j6876j6700j6567j6630j6388j4761j1805r235q336q287p586
59315F57052o184n041m367l587k540j578p65J3N62P87J152K001L038M067N564
59300F50174P736R876J1522J3470J6585K0467K4064K6512K6273K0940R800l985
59288H33434j5585k2576k5575k5684k3332j9417j5512j2353r415o303l505j529
59276F52648k45P69J951L781O313Q768J0336J1089J1458J1306J0409R246Q274
59263G46103O902M369J247j214k899m749p085r286j0962j2292j3205j3347j2804
59250F70778j1932j0638q757o854n629m768l461j731j72J265K951M422M902M782
$$ plain form
59340 860539 874814 887518 897475 904110 907514 907555 903654 895563 883770 869100 852439 834863 817346
59327 817346 800223 783347 766647 750080 733450 717062 702301 690496 681261 672925 664638 657052
59315 657052 650868 645827 641460 637873 635333 633755 632990 633003 633565 634352 635504 637505 640543 644610 650174
59300 650174 657910 667786 679308 692778 709363 729830 753894 780406 806679 827619 837419 833434
59288 833434 817849 795273 769698 744014 720682 701265 685753 673400 663985 657682 654177 652648
59276 652648 652403 653172 655123 658904 665217 673985 684321 695410 706868 718174 728583 737829 746103
59263 746103 753005 757374 758621 757407 754508 749759 742674 733388 722426 710134 696929 683582 670778
59250 670778 658846 648208 639451 632597 626968 622200 618739 617008 616836 618101 621052 625474 630376 635158
59236F35158N211O275O944O785O363N887M857L235J662K98j390l483n332o648
59222F65822p732q543q592q005p559p422o857n497l955k845k073j320n48J98Q03
59207E95875R34M95J09M06J074J429J576K013K459K252J683J567J726J245K88
59192F15131Q6J021K029K310K258K337K276J888J578J481J053J10o21m53M23J411
59176F34318K199K632K661K578K776L147L315L474M221N606P122Q557J0034J1200
59162G03840J1303J0184Q378O328M191K356J121l3j911m328o319p491q229q658
59148G10732q488p884p463p326p042o534o117n713n056m477m453m618m310l815
59134F27436l855m121l748l013k989l603l660k890k215j791n78J610L343L631
$$ plain form
59236 635158 640369 646644 653588 660373 666736 672623 677480 680715 682377 682675 681285 677802 672470 665822
59222 665822 658090 649547 640955 632950 625391 617969 611112 605615 601660 598815 596742 595422 594874 595072 595875
59207 595875 596809 597304 597413 597819 598893 600322 601898 603911 606370 608622 610305 611872 613598 614843 615131
59192 615131 615217 616238 618267 620577 622835 625172 627448 629336 630914 632395 633448 633558 632937 632484 632907 634318
59176 634318 636517 639149 641810 644388 647164 650311 653626 657100 661321 666927 674049 682606 692640 703840
59162 703840 715143 725327 733705 740033 744224 746580 747701 747668 745757 741429 735110 727619 719390 710732
59148 710732 702244 694360 686897 679571 672529 665995 659878 654165 649109 644632 640179 635561 631251 627436
59134 627436 623581 619460 615712 612699 609710 606107 602447 599557 597342 595551 594973 596583 599926 603557
59120F03557L410M045N589P227Q522R501J0292J1206J2440J3442J3360J2298J1193
59107G26082J0405R455Q215P214O596N950N278M914M388K708L9k214l308l856
59093G81866m421m696m438l902l161k189j742k680m335n150n072n549o912p803
59079G19816p676p767q738r439r072q677r075r152p722n650m490m196l742l047
59065F21373k693k523j960j230r79j177j395j676k201k601k428j845j198n04Q6
59050E97049N7o07j092q97n16m50m31k22k30n33l97M87J170Q00l6k25L42R72J307
59031E96548J421J422J605K457L988N636P231R159J1268J2595J2811J2839J3327
59018F92307J3534J2528J0510Q181N627K724j09k369m016m982m894l850k668j801
$$ plain form
59120 603557 606967 611012 616601 623828 632350 641851 652143 663349 675789 689231 702591 714889 726082
59107 726082 736487 745942 754157 761371 767967 773917 779195 784109 788497 791205 791244 789030 785722 781866
59093 781866 777445 772749 768311 764409 761248 759059 757317 754637 750302 745152 740080 734531 727619 719816
59079 719816 712140 704373 695635 686196 677124 668447 659372 650220 642498 636848 632358 628162 624420 621373
59065 621373 618680 616157 614197 612967 611988 610811 609416 607740 605539 602938 600510 598665 597467 596963 597049
59050 597049 597106 596499 595407 594510 593994 593544 593113 592891 592661 592128 591731 592218 593388 594188 594152 593927 594269 595241 596548
59031 596548 597969 599391 600996 603453 607441 613077 620308 629467 640735 653330 666141 678980 692307
59018 692307 705841 718369 728879 737060 742687 745411 745302 742933 738917 733935 729041 725191 722523 720722
59004G20722q23N53J891L009M441O262P517P536O868O237N546M607L832L471L039
58989G84708K162J108o9j839m099n902o898p857r078r549q528o728n065l434j536
58974G17396K25J635L236N144O437O632O638P309Q256Q955R754J0869J1638J1818
58960H15942J2205J2927J2545J0140O895M218J566k214o644j0266j2675j4358
58948H30281j5326j5454j5396j5733j5827j4763j2812j0812q908p004n617n125
58936F87504m963m634m571m987m987m040l173l348l799l419k708k729l144k987
58922F34015k562k828l519l522k653j597o31L09Q62Q84J127K099L016L141L234
58907F31375M275N696O434O832P862R260J0105J0490J1032J1410J1074J0721J1349
$$ plain form
59004 720722 719899 720452 722343 725352 729793 736055 743572 751108 757976 764213 769759 774366 778198 781669 784708
58989 784708 786870 787978 787909 786070 781971 776069 769171 761314 752236 742687 734159 727431 722366 718932 717396
58974 717396 717621 719256 722492 727636 734073 740705 747343 754652 762908 771863 781617 792486 804124 815942
58960 815942 828147 841074 853619 863759 870654 874872 876438 874224 867580 857314 844639 830281
58948 830281 814955 799501 784105 768372 752545 737782 724970 714158 705250 698246 692629 687504
58936 687504 682541 677907 673336 668349 663362 659322 656149 652801 649002 645583 642875 640146 637002 634015
58922 634015 631453 628625 625106 621584 618931 617334 616703 617012 617874 618758 619885 621984 625000 628141 631375
58907 631375 635650 641346 647780 654612 662474 671734 681839 692329 703361 714771 725845 736566 747915
58894G47915J2510J3179J3720J5240J7586J9808K2055K5115K8402L0292L0232
58883I76054K8872K6328K2180J6942J1885P348K733j989o221j0105j4358j8748
58871A040921k2092k3711k3774k2401j9767j6827j4679j3293j1983j0769j0135
58860H51490r929r772j0110j1498j3210j3984j3781j3465j3147j2206j0736r509
58848G10143q695p834o861o156n823n857o543p779q595q381p775p436o858n603
58834F09947m574m655n143n002m631m773m771l697k234j540j148R6J839K900L329
58819E75943L834M007L223K442K922L848L590K569K496L297L354K397J601J042
58805F16565l62k399l495l264k838k639k001j168j307k347k881k523k334k699
$$ plain form
58894 747915 760425 773604 787324 802564 820150 839958 862013 887128 915530 945822 976054
58883 976054 1004926 1031254 1053434 1070376 1082261 1089609 1092342 1090353 1084132 1074027 1059669 1040921
58871 1040921 1018829 995118 971344 948943 929176 912349 897670 884377 872394 861625 851490
58860 851490 841561 831789 821679 810181 796971 782987 769206 755741 742594 730388 719652 710143
58848 710143 701448 693614 686753 680597 674774 668917 662374 654595 646000 637619 629844 622408 615550 609947
58834 609947 605373 600718 595575 590573 585942 581169 576398 572701 570467 568927 567779 567875 569714 572614 575943
58819 575943 579777 583784 587007 589449 592371 596219 599809 602378 604874 608171 611525 613922 615523 616565
58805 616565 616203 613804 610309 607045 604207 601568 599567 598399 597092 594745 591864 589341 587007 584308
58791E84308k803k399k130j915q73Q91K216K719L001L176K947K936L955N242N401
58776F06672M804M875N323M551K564R73O9j353l280m249m209m802o295o918n966
58761E92759m914m602l858j910J22J260K065K971L238K555J893J862J882J736
58747E97059K119K967L192K753L127M850O521P049P090P384P466P018O792P308
58733F72695Q077Q816R951J1291J1833J1455J1164J1112J0151P961N851M776M250
58720G89383L914M404N909P450Q390R176J0003J0203R511Q471P192N175K660N33
58706H82374j318l854o977r670j2076j5333j9095k1474k1876k1716k1844k1509
58694G05632k0366j9232j8148j6002j2813j0238r065q257p215o771p193p394o891
$$ plain form
58791 584308 581505 579106 576976 575061 574188 575079 577295 580014 583015 586191 589138 592074 596029 601271 606672
58776 606672 611476 616351 621674 626225 628789 629762 629831 628478 625198 620949 616740 611938 605643 598725 592759
58761 592759 587845 583243 579385 577475 577597 578857 580922 583893 587131 589686 591579 593441 595323 597059
58747 597059 599178 602145 605337 608090 611217 616067 622588 629637 636727 644111 651577 658595 665387 672695
58733 672695 680772 689588 699539 710830 722663 734118 745282 756394 766545 774506 780357 785133 789383
58720 789383 793297 797701 803610 811060 819450 828626 838629 848832 858343 866814 874006 879181 881841 882374
58706 882374 881056 877202 870225 860555 848479 833146 814051 792577 770701 748985 727141 705632
58694 705632 685266 666034 647886 631884 619071 608833 599768 591511 584296 577525 570332 562938 556047
58681E56047o436o084m869l023k152k375j784L83K440L078L187L776M469N113
58667E51770O570Q844J0684J1898J3745J6004J6398J3999J0615P571L871j040
58655F70929n377p585q370q575p563n433m221m955n787m961l461k799k470j517
58641E97855n32K9J365M030O057N611L728K438J814R15j30r73k361m537n955n501
58625F03853m465m323m226k716m26J082J879L003M398N392O256P466Q447Q506
58611F34126Q127P959P577O380M515K043j307m698o281n813n283n859o243n345
58597F29898m380m674n392n142m018k600p13J388K557K848M012O571Q648R129
58583F38132R526J1037J2288J1965J1153J1010J0466Q490O416N682N385M397L829
$$ plain form
58681 556047 549611 543527 538658 535635 533483 531108 529324 529707 532147 535225 538412 542188 546657 551770
58667 551770 558340 567184 577868 589766 603511 619515 635913 649912 660527 668098 671969 670929
58655 670929 665552 657967 649597 641022 633459 628026 623805 618850 613063 608102 604641 601842 599372 597855
58641 597855 597323 597352 598717 602747 608804 614415 618143 620581 622395 623310 623180 622207 619846 615309 609354 603853
58625 603853 599388 595065 590839 588123 587697 588779 590658 593661 598059 603451 609707 617173 625620 634126
58611 634126 642253 650212 657789 664169 668684 670727 669420 664722 658441 652628 647345 641486 635243 629898
58597 629898 625518 620844 615452 610310 606292 603692 602979 604367 606924 609772 613784 620355 629003 638132
58583 638132 647658 658695 670983 682948 694101 705111 715577 724067 730483 736165 741550 745947 749776
58570G49776N096P373R248J1030J3377J5618J7413J9971K3510K5823K5583K4693
58558I48511K4951K4821K2183J7940J3995R912M610n71l637n113o620p890q041
58545A035051q100r430j1168j1891j2322j3743j5424j6225j7023j8901k0601k0449
58533H59774j9099j7763j5709j2223r074q019p750o209m061k825j678O67K864
58520G58895L125K742L894N714N958M976M403L608J203j379j710o52j035l052
58506G86690m595n190n943o426n303l428k944l770m149l944m305m845m328l321
58492G24199l190l268k055k69K98L4O17J944K845L753N735Q104R846J1955J5298
58477G75846J7864J7438J5309J3871J2343Q634L824O78j018l532o749q708r457
$$ plain form
58570 749776 754872 762245 771493 782523 795900 811518 828931 848902 872412 898235 923818 948511
58558 948511 973462 998283 1020466 1038406 1052401 1062313 1066923 1066352 1062715 1057602 1050982 1043092 1035051
58545 1035051 1026951 1017521 1006353 994462 982140 968397 952973 936748 919725 900824 880223 859774
58533 859774 840675 822912 807203 794980 785906 777887 770137 763928 759867 757042 755364 756031 758895
58520 758895 762020 764762 768656 774370 780328 785304 789707 793315 794518 793139 791429 790777 789742 786690
58506 786690 782095 776905 770962 764536 759233 755805 752861 749091 744942 740998 736693 731848 727520 724199
58492 724199 721009 717741 715686 715417 715715 715749 716366 718310 721155 724908 730643 738747 748593 760548 775846
58477 775846 793710 811148 826457 840328 852671 861305 865129 865807 864789 861257 854508 845800 836343
58464H36343j0439j1007r488o785n003l605p70K583M223M825O578Q715Q826P508
58450H32504P241P536N791K269m09k073m679p704q572p375o574o222m126o01J457
58435H08463J443J573K552K863K445K908M068M280M089N533Q063R217R087R900
58421H76484J1501J1569R988Q709P509M406O0k622l309m341o212p170p120p598
58407H91854q212p415o291p175q979q519n971m253l627j846Q48K027K005L297
58393H37743N462N694M207L715L925K149q82j607JM41q84j058L41O22l20M09K905
58376H62863M165M016N395Q230R194Q223R023J2213J4165J3694J3753J5237J5316
58363I95487J3272J2088J2795J2996J2121J2374J3392J1986Q259O000N910M703
$$ plain form
58464 836343 825904 814897 805409 798624 793621 790016 789246 791829 796052 800877 807455 816170 824996 832504
58450 832504 839745 847281 853072 855341 854932 852859 848180 840476 831904 824529 817955 811733 807607 807006 808463
58435 808463 809906 811479 814031 816894 819339 822247 826315 830595 834684 840217 848280 857497 866584 876484
58421 876484 887985 899554 909542 918251 925760 930166 930226 927604 924295 919954 913742 906572 899452 891854
58407 891854 883642 876227 869936 862761 853782 845263 839292 835039 831412 829566 830414 832441 834446 837743
58393 837743 843205 848899 853106 856821 860746 862895 862013 860406 860407 860848 859964 858906 859247 859869 859549 859958 862863
58376 862863 867028 871044 876439 884669 893863 902086 911109 923322 937487 951181 964934 980171 995487
58363 995487 1008759 1020847 1033642 1046638 1058759 1071133 1084525 1096511 1104770 1110770 1116680 1121383
58351A121383J910J034K701L259J755J705M253O029N621N781P535Q410Q172R906
58337A189454J3721J5894J5791J7003K0114K1202J9204J7702J7636J5506J0756
58326A373983P607P362O206K865J126K395L176K305L217O557Q109O647O337Q760
58312A446652J0233R524J0391J3770J5508J4548J5204J8498J9763J7761J7439
58301A609291K0376K1399J8358J6227J7621J8255J5989J5361J8638K1147K0146
58290A812808J9673K2084K3489K2118K2426K6258K8839K8148K9177L4194L7980
58279B107194L7553L7378M0115M1724M0579M1626M6504M9578M8804N0134N5921
58268B597110N9711N8183N7288O0645O3103O1894O2774O8509P2763P2056P2152
$$ plain form
58351 1121383 1123293 1124327 1127028 1130287 1132042 1133747 1138000 1144029 1149650 1155431 1162966 1171376 1179548 1189454
58337 1189454 1203175 1219069 1234860 1251863 1271977 1293179 1312383 1330085 1347721 1363227 1373983
58326 1373983 1381590 1388952 1395158 1398023 1399149 1401544 1404720 1407025 1410242 1416799 1424908 1431555 1437892 1446652
58312 1446652 1456885 1466409 1476800 1490570 1506078 1520626 1535830 1554328 1574091 1591852 1609291
58301 1609291 1629667 1651066 1669424 1685651 1703272 1721527 1737516 1752877 1771515 1792662 1812808
58290 1812808 1832481 1854565 1878054 1900172 1922598 1948856 1977695 2005843 2035020 2069214 2107194
58279 2107194 2144747 2182125 2222240 2263964 2304543 2346169 2392673 2442251 2491055 2541189 2597110
58268 2597110 2656821 2715004 2772292 2832937 2896040 2957934 3020708 3089217 3161980 3234036 3306188
58257C306188P5933P7144P3112P1146P4916P7349P4659P4261Q0650Q6946Q8854
58246D161158R3120J03363J11774J14206J18918J30692J41201J45234J50966J63594
58236E434226J74808J79654J87434K03959K19896K28984K40418K60339K79145
58227G408863K90873L06412L33014L60015L80022M04229M40643M78070N08777
58218A0910918N45318N96880O51572P01140P59566Q37088R20766J002189J098053
58209A8023490J220782J357138J500227J672429J890651K142083K423059K766295
58201C2996154L198886L713092M313956N053996N985049P127629Q533268J0321358
58193H1243388J2599609J5400936J8743574K2675422K7203708L2263456L7719082
$$ plain form
58257 3306188 3382121 3459265 3532377 3603523 3678439 3755788 3830447 3904708 3985358 4072304 4161158
58246 4161158 4254278 4357641 4469415 4583621 4702539 4833231 4974432 5119666 5270632 5434226
58236 5434226 5609034 5788688 5976122 6180081 6399977 6628961 6869379 7129718 7408863
58227 7408863 7699736 8006148 8339162 8699177 9079199 9483428 9924071 10402141 10910918
58218 10910918 11456236 12053116 12704688 13405828 14165394 15002482 15923248 16925437 18023490
58209 18023490 19244272 20601410 22101637 23774066 25664717 27806800 30229859 32996154
58201 32996154 36195040 39908132 44222088 49276084 55261133 62388762 70922030 81243388
58193 81243388 93842997 109243933 127987507 150662929 177866637 210130093 247849175
58186B47849175M3011382M6453694M5188355L6718692K1143781J893573j6018063
58179D26240589k8714192l4941816l5753192l3368425l0095518k7479200k5850175
58172B10038071k4611201k3063815k0996223j8608195j6155605j3809969j1704116
58165H1088947r918161q429968p170109o109604n243124m530098l917318l391965
58157C2378600k959709k596639k270099j982819j752286j566879j401341j255785
58149A6593043j142579j052062r65125q83861q18754p60770o95220o28905n76129
58140I069638n31299m81140m30738l92423l61247l25853k92360k73982k66862
58131E713734k57911k47055k41096k34947k19463j99711j86480j77331j63697
$$ plain form
58186 247849175 290860557 337314251 382502606 419221298 440365079 442258652 426240589
58179 426240589 397526397 362584581 326831389 293462964 263367446 235888246 210038071
58172 210038071 185426870 162363055 141366832 122758637 106603032 92793063 81088947
58165 81088947 71170786 62740818 55570709 49461105 44217981 39687883 35770565 32378600
58157 32378600 29418891 26822252 24552153 22569334 20817048 19250169 17848828 16593043
58149 16593043 15450464 14398402 13433277 12549416 11730662 10969892 10274672 9645767 9069638
58140 9069638 8538339 8057199 7626461 7234038 6872791 6546938 6254578 5980596 5713734
58131 5713734 5455823 5208768 4967672 4732725 4513262 4313551 4127071 3949740 3786043
58122C786043j48657j40341j35465j26173j15894j12191j11069j04117r4254q9201
58112B608681q6299p8782p0346o8545o9991o6623o0795n9990o2226o0491n6361
58101A868232n5804n6588n2829m7084m5287m4700l9350l2449l1028l2848l0842
58090A399423k6169k4771k5243k2106j7243j6366j7727j5771j2487j3884j8449
58079A189207k0105j9571k1969k6068k6471k3926k3319k4061k2212j9458k0141
58068I41906k2163k0402j6521j5857j7285j5723j2054j0988j1605r560o376o938
58056G76434r907j0066q238r378j2592j2532r383q203r361q675o156n856p679
58043F58408p743o284p149r986j0807r652j0068j1707j1016q487p782q493p160
$$ plain form
58122 3786043 3637386 3497045 3361580 3235407 3119513 3007322 2896253 2792136 2697882 2608681
58112 2608681 2522382 2443600 2373254 2304709 2234718 2168095 2107300 2047310 1985084 1924593 1868232
58101 1868232 1812428 1755840 1703011 1655927 1610640 1565940 1526590 1494141 1463113 1430265 1399423
58090 1399423 1373254 1348483 1323240 1301134 1283891 1267525 1249798 1234027 1221540 1207656 1189207
58079 1189207 1169102 1149531 1127562 1101494 1075023 1051097 1027778 1003717 981505 962047 941906
58068 941906 919743 899341 882820 866963 849678 833955 821901 810913 799308 789748 783372 776434
58056 776434 766527 756461 748223 738845 726253 713721 704338 696135 686774 678099 671943 666087 658408
58043 658408 650665 644381 637232 627246 616439 606787 596719 585012 573996 565509 557727 549234 542074
58030E42074m608m862p526q616q091r204j1205j0224o903n625o620o062l719l200
58016D45609m702m677k756k100k887k220m70r56l306l760k127j865l244l025j090
58001D06424q01k441k806j639k041m062m291k379j783l233l555j718k12K60J741
57986C77464M006M277K659K309L568L388J200j15K08j91j683j834n20m84k114
57971C92138k750j872j843k988l038j998k358l962l913k076j359k017j084J767
57957C62647L276K360J480J409O2k457l047j127K76J20Q93L300M655M048M024
57942C81919N588O445N758N832P413Q110P174P229R412J1321J1488J1493J2000
57929D91182J1101Q278N792M452K244j420m326n818q077j1560j3612j3334j3291
$$ plain form
58030 542074 537466 532604 525078 516462 508371 499167 487962 477738 470835 465210 458590 452528 448809 445609
58016 445609 440907 436230 433474 431374 428487 426267 425797 424841 421535 417775 415648 413783 410539 407514 406424
58001 406424 405623 403182 400376 398737 396696 392634 388343 385964 384181 380948 377393 375675 375463 375723 377464
57986 377464 381470 385747 388406 390715 394283 397671 398871 398756 398964 398773 397090 395256 394736 394252 392138
57971 392138 389388 387516 385673 382685 379647 377649 375291 371329 367416 365340 363981 361964 360880 362647
57957 362647 365923 368283 369763 371172 371234 368777 365730 364603 364879 364999 365892 369192 373847 377895 381919
57942 381919 387507 393952 399710 405542 412955 421065 428239 435468 444880 456201 467689 479182 491182
57929 491182 502283 510561 516353 520805 523049 521629 517303 511485 503408 491848 478236 464902 451611
57916D51611j4610j4838j2731j0778j0786j1100j0270r478r083p028k955K2M5
57903C38021o99k17P8j172k299j744q63j044j130m9J001J206J995M054N430M772
57887C47340L589L339L063J891J015J303J613J223J088J193j81l046m808m549
57873C54073m736o829q651q371p630q219q822p711n870m798l857k270j321j996
57859B72992k747j901k42Q53J721L025M210M974O061P155O581M486L477M430M811
57844C19886K920O91J21Q0r26j822j402j004k015l226l202k953l703m282l376
57829B95787k100j831j622k99J037J163J306K955M981N585N297N539N885N257
57815C28940M302M109M048L099J931J493R73p73l175n180o960q645r122p977o819
$$ plain form
57916 451611 437001 422163 409432 398654 387868 376768 366498 357020 347937 340909 337954 337976 338021
57903 338021 337322 337105 337183 336011 333712 331968 331105 330061 328931 328882 329883 331089 333084 337138 342568 347340
57887 347340 350929 354268 357331 359222 360237 361540 363153 364376 365464 366657 366476 363430 358622 354073
57873 354073 349337 342508 333857 325486 317856 309637 300815 293104 287234 282436 278579 276309 274988 272992
57859 272992 270245 268344 268102 268955 270676 273701 277911 282885 288946 296101 302682 307168 310645 315075 319886
57844 319886 322806 323497 323618 323698 322772 320950 319548 318544 316529 313303 310101 307148 303445 299163 295787
57829 295787 293687 291856 290234 289935 290972 292135 293441 296396 301377 306962 312259 317798 323683 328940
57815 328940 333242 337351 341399 344498 346429 347922 348895 348122 344947 339767 332807 324162 315040 307063 300244
57800C00244o744o398m557k680k665l792m220l889l713l482k688j997j888j328
57786B50203K93J572J393J009J829K941L045L069M454O420P351P502Q005Q521
57772C07607Q143P368P028O507N094L707L295K815R97j300k558l054l791m389
57758C37469m170m056n092o380o531o050o225o886p138p036o731n459l342k439
57744B59934l826n380m814l208l011m122m786n010o054p561q011p329o489n287
57730A85046l057q06r6m51k19P16J371J981L368M710M492L167K476K590K209J079
57714B08576J37m02r88j195m09M18j46j583k119j452p96o72o49q46j586k084j382
57697A92822k31K1k22L78J458J411K18m78r8J48n73j569j895j299K8J492K207
$$ plain form
57800 300244 293500 287102 282545 279865 277200 273408 269188 265299 261586 258104 255416 253419 251531 250203
57786 250203 250496 252068 253461 254470 256299 259240 262285 265354 269808 276228 283579 291081 299086 307607
57772 307607 315750 323118 330146 336653 341747 345454 348749 351564 352561 351261 348703 345649 341858 337469
57758 337469 333299 329243 324151 317771 311240 305190 298965 292079 284941 277905 271174 265715 262373 259934
57744 259934 256108 250728 245914 242706 239695 235573 230787 225777 219723 212162 204151 196822 190333 185046
57730 185046 181989 181183 181087 180636 180417 181133 182504 184485 187853 192563 197055 200222 202698 205288 207497 208576
57714 208576 208713 208311 207323 206128 205719 206137 205991 204408 202289 200837 200041 199369 198720 197874 196288 194204 192822
57697 192822 192591 192612 192390 192768 194226 195637 195855 195377 195279 195427 194854 193285 191390 190091 190119 191611 193818
57680A93818K141K561M188N945O863Q032J0970J5230J9647K4764L1808M0211M8608
57667D14786N7341O7050P4944P5187O3603M0716J0773k0073m5256o0438o5720
57656F12913o4187n8532n0353m1674l4619k9500k5112k0934j7451j4593j1725
57645B44233r021p158n904m560l460l297l410k565j080l74o96j052j089j264j475
57630A97828j231q53r63j186r00o71j260k007j919j548j843k091j184j0j66j080
57614A78916j014k83o27j837j941p38j96j026j603q38L55J070J608K089J872R74
57598A76781K88J7m16q25n51k01j053k597k906j679p27j089j773j858j778j981
57582A57652k106k055k240k478k214j898k373k986k336q92o65k072l414l714l804
$$ plain form
57680 193818 195959 198520 202708 208653 215516 223548 234518 249748 269395 294159 325967 366178 414786
57667 414786 472127 539177 614121 689308 752911 793627 804400 784327 739071 678633 612913
57656 612913 548726 490194 439841 398167 363548 334048 308936 288002 270551 255958 244233
57645 244233 235212 228054 222150 217590 214130 210833 207423 204858 203778 203404 202708 201656 200567 199303 197828
57630 197828 196597 195744 194781 193595 192695 192024 190764 188757 186838 185290 183447 181356 180172 180162 179996 178916
57614 178916 177902 177619 176992 175155 173214 172476 172280 171254 169651 168813 169168 170238 171846 173935 175807 176781
57598 176781 177069 177086 176670 175845 175294 175093 174040 171443 168537 166858 166131 165042 163269 161411 159633 157652
57582 157652 155546 153491 151251 148773 146559 144661 142288 139302 136966 136074 135409 133337 129923 126209 122405
57567A22405m146l886k738j706j288q09j45j12o18n22K15K06q86j662j400j090
57551A01818j335j239k58O92Q69P35O15J02n59l41O41R13O4n56k43n5p13j364
57533I9786j362j356j584j089K88J081N46%N47J250J036P13J490K802L245K702
57517A10095K108J968K221K867L725M255M284M134L713K528R38P8J27J27j44K42
57501A43266J359J816R51r5l95o20j362j764j107k23n5j08L07N66j69j292j557
57484A39518q31J9L16p7r75j740j716j242j284j872k024j555j498k241k753k303
57468A17742j541j171r40n83m51n19j43O76J208J545K541L790L632J878M78N71
57452A28713R43M69q2Q1K04j96K2J410K303J326j18O0J512K462K526K408J927
$$ plain form
57567 122405 118259 114373 111635 109929 108641 107832 107687 107575 106957 106435 106650 106856 105970 104308 102908 101818
57551 101818 100483 99244 98986 99678 100547 101282 101897 101999 101440 101099 101740 102653 102717 102161 101918 101863 101150 99786
57533 99786 98424 97068 95484 94395 94683 95764 96310 96310 96857 98107 99143 99856 101346 104148 107393 110095
57517 110095 112203 114171 116392 119259 122984 127239 131523 135657 139370 141898 142836 142914 143041 143168 143024 143266
57501 143266 144625 146441 147392 147297 146902 146282 144920 143156 142049 141826 141771 141663 141970 142536 142367 141075 139518
57484 139518 138687 138706 139022 138945 137970 136230 134514 133272 131988 130116 128092 126537 125039 122798 120045 117742
57468 117742 116201 115030 114090 113507 113056 112537 112394 113070 114278 115823 118364 122154 125786 127664 128142 128713
57452 128713 129656 130125 130043 130124 130328 130132 130154 131564 133867 135193 135075 135135 136647 139109 141635 144043 145970
57435A45970N34r34j131k83L09M07P88J552K062K161K083J624O35j68q8M66P98
57418A56785J060J445J219n3j183q53K67M97k92p19j53N91P41M20K5k02l8M76
57400A60033Q21O81N01P77J285J642J995K476K631K125J441J255J659K385L099
57385A84806L208K434J741K439M014M483L336K287K357K349J344N92J245K212
57371B18847K161J878K550L303K741J599J459J918J585R29J571L215L924L210
57357B50890K480K520K718K785L137L440K823J728J636K705L468L143K518K255
57343B88246J960J430J231J527J706J629K025L072L779L336K209J405J363J922
57329C16840K661L097L057K974L270L571L217K361J821J984K495K912L048K907
$$ plain form
57435 145970 146504 145570 144439 144156 144465 144872 145660 147212 149274 151435 153518 155142 155777 155609 155521 155987 156785
57418 156785 157845 159290 160509 160456 159273 158420 158687 159184 158892 158173 158020 158611 159352 159772 159797 159595 159557 160033
57400 160033 160854 161535 162036 162813 164098 165740 167735 170211 172842 174967 176408 177663 179322 181707 184806
57385 184806 188014 190448 192189 194628 198642 203125 206461 208748 211105 213454 214798 215390 216635 218847
57371 218847 221008 222886 225436 228739 231480 233079 234538 236456 238041 238970 240541 243756 247680 250890
57357 250890 253370 255890 258608 261393 264530 267970 270793 272521 274157 276862 280330 283473 285991 288246
57343 288246 290206 291636 292867 294394 296100 297729 299754 302826 306605 309941 312150 313555 314918 316840
57329 316840 319501 322598 325655 328629 331899 335470 338687 341048 342869 344853 347348 350260 353308 356215
57315C56215K834L370M433N138M977M564M516M517M185M020M434M710M214L761
57301D15888M453N753O209N589M887M595M426M424M914N509N499N076M999N219
57287D87440M989M168L306K695K352K570L442M211M196L932M185M453L854L049
57273E38842L635N826Q158R494J0005J0277J0688J1643J3227J4645J5012J4571
57261F66023J4208J4154J4208J4665J5759J6640J6261J4955J3914J3472J3250
57250H27509J3402J4273J5186J5159J4517J4313J4549J4509J4434J5043J5776
57239I88670J5361J4010J3201J3337J3540J3693J4705J6509J7712J7705J7362
57228A155805J7323J7245J7148J7732J8852J9332J8885J8652J9242J9724J9269
$$ plain form
57315 356215 359049 362419 366852 371990 376967 381531 386047 390564 394749 398769 403203 407913 412127 415888
57301 415888 420341 426094 432303 437892 442779 447374 451800 456224 461138 466647 472146 477222 482221 487440
57287 487440 492429 496597 499903 502598 504950 507520 510962 515173 519369 523301 527486 531939 535793 538842
57273 538842 542477 548303 556461 565955 575960 586237 596925 608568 621795 636440 651452 666023
57261 666023 680231 694385 708593 723258 739017 755657 771918 786873 800787 814259 827509
57250 827509 840911 855184 870370 885529 900046 914359 928908 943417 957851 972894 988670
57239 988670 1004031 1018041 1031242 1044579 1058119 1071812 1086517 1103026 1120738 1138443 1155805
57228 1155805 1173128 1190373 1207521 1225253 1244105 1263437 1282322 1300974 1320216 1339940 1359209
57217A359209J8421J7963J7747J7393J7125J7229J7533J7888J8335J8555J8128
57206A555526J7521J7726J8708J9347J9134J8799J8978J9449J9953K0599K1106
57195A766846K0761J9563J8374J7657J6971J5940J4753J3571J2430J1730J1764
57184A940360J1844J1040R748R230R667J0104J0285J1010J2466J3754J4407J4934
57172B078849J5568J5820J5612J5537J5718J5658J5405J5494J5677J5108J3982
57161B248428J3351J3157J2155J0108Q302P476O906O106N676N860N876N426N327
57148B354154O050P089Q360J0669J4081J7405J9890K1890K3338K3347K2061K1048
57136B549382K0996K0789J9842J9362K0109K0723J9799J8021J6779J6095J5564
$$ plain form
57217 1359209 1377630 1395593 1413340 1430733 1447858 1465087 1482620 1500508 1518843 1537398 1555526
57206 1555526 1573047 1590773 1609481 1628828 1647962 1666761 1685739 1705188 1725141 1745740 1766846
57195 1766846 1787607 1807170 1825544 1843201 1860172 1876112 1890865 1904436 1916866 1928596 1940360
57184 1940360 1952204 1963244 1972992 1982222 1991889 2001993 2012278 2023288 2035754 2049508 2063915 2078849
57172 2078849 2094417 2110237 2125849 2141386 2157104 2172762 2188167 2203661 2219338 2234446 2248428
57161 2248428 2261779 2274936 2287091 2297199 2305501 2312977 2319883 2325989 2331665 2337525 2343401 2348827 2354154
57148 2354154 2360204 2367293 2375653 2386322 2400403 2417808 2437698 2459588 2482926 2506273 2528334 2549382
57136 2549382 2570378 2591167 2611009 2630371 2650480 2671203 2691002 2709023 2725802 2741897 2757461
57125B757461J5987J8307K1910K5617K9610L4882M1430M8421N5538O2952P0419
57114C182534P7539Q4529R1855R9645J08197J18477J31386J47176J66118J89104
57104D396560K17218K51589K94116L47276M12975M92978N90965P12585Q62563
57095H578825J043113J255682J502124J782405K092071K422637K762446L095766
57087B4535069L403075L664843L864652L987888M019536L945193L752009L425653
57079E4597918K949378K314585J538937O74925k02282j020269j730311k312551
57071E6810330k767374l103013l327944l449732l476664l419232l291240l110322
57063C0864809k895906k665015k429604k197529j974591j764952j570920j393922
$$ plain form
57125 2757461 2773448 2791755 2813665 2839282 2868892 2903774 2945204 2993625 3049163 3112115 3182534
57114 3182534 3260073 3344602 3436457 3536102 3644299 3762776 3894162 4041338 4207456 4396560
57104 4396560 4613778 4865367 5159483 5506759 5919734 6412712 7003677 7716262 8578825
57095 8578825 9621938 10877620 12379744 14162149 16254220 18676857 21439303 24535069
57087 24535069 27938144 31602987 35467639 39455527 43475063 47420256 51172265 54597918
57079 54597918 57547296 59861881 61400818 62075743 61873461 60853192 59122881 56810330
57071 56810330 54042956 50939943 47611999 44162267 40685603 37266371 33975131 30864809
57063 30864809 27968903 25303888 22874284 20676755 18702164 16937212 15366292 13972370
57055A3972370j235310j095554r73386q66489p72563o89333o14803n48525m91770
57046F684637m45321m07595l75459l46199l18215k90982k65290k42615k23452
57037C769509k06863j91980j78637j66158j53102j39056j25137j11640r6818p9122
57027B320996n9248l8774j8146L189K6499N4121Q6237J14329J20995R1998K9971
57016B732167m5589j11793j54889j72673j70443j56558j38694j21195j05291r1338
57006A463704p9688o9900o1009n2946m6377m1242l6752l2808k9977k8090k6271
56995I58644k4280k2611k1288j9898j8653j8062j7603j6069j3207r741n973j668
56983G69591K778O276P968P041K323o219j5865k2893k6020k6620k5865k3701k0637
$$ plain form
57055 13972370 12737060 11641506 10668120 9801631 9029068 8339735 7724932 7176407 6684637
57046 6684637 6239316 5831721 5456262 5110063 4791848 4500866 4235576 3992961 3769509
57037 3769509 3562646 3370666 3192029 3025871 2872769 2733713 2608576 2496936 2400118 2320996
57027 2320996 2261748 2222974 2204828 2208017 2234516 2288637 2374874 2489203 2610198 2702196 2732167
57016 2732167 2686578 2574785 2419896 2247223 2076780 1920222 1781528 1660333 1555042 1463704
57006 1463704 1384016 1314116 1253107 1200161 1153784 1112542 1075790 1042982 1013005 984915 958644
56995 958644 934364 911753 890465 870567 851914 833852 816249 800180 786973 777232 771259 769591
56983 769591 772369 778645 786613 793654 795977 789758 773893 751000 724980 698360 672495 648794 628157
56970F28157j8247j7069j5766j3160r764o592l779j076J492M143P502J1603J5638
56957E83082J9085K2045K3870K2519J6341O029n656j5806k2796k6421k7228k5751
56945E69313k2470j8401j4968j2751j0917q529n726k849O70N300J0111J3949J7404
56932E20136K2101K8242L4101L7511L6480K9086J5017k581j8637k9954l6460l9122
56920E95920l8501l5515l1631k7585k3217j8907j5750j3986j2696j1420j0652
56909C56060j0419r849q687p797p635p470o715n777n055m363l791l906m557m642
56895B65397l616k110n96J320L836O424Q967J2275J6809K1988K7048L1377L3441
56882D22560L0959K3240J2489K008o111j1176j3097j2450j0438p926m933j470
$$ plain form
56970 628157 609910 592841 577075 563915 554151 547559 543780 542704 544196 548339 555841 567444 583082
56957 583082 602167 624212 648082 670601 686942 692971 687315 671509 648713 622292 595064 569313
56945 569313 546843 528442 513474 500723 489806 481277 475551 472702 473372 478672 488783 502732 520136
56932 520136 542237 570479 604580 642091 678571 707657 722674 720093 701456 671502 635042 595920
56920 595920 557419 521904 490273 462688 439471 420564 404814 390828 378132 366712 356060
56909 356060 345641 335792 327105 319308 311673 304203 297488 291711 286656 282293 278502 274596 270039 265397
56895 265397 261781 259671 259075 260395 264231 270655 279622 291897 308706 330694 357742 389119 422560
56882 422560 453519 476759 489248 491256 485145 473969 460872 448422 437984 430058 425125 423655
56870D23655J877M737P520J0746J4561J9260K5331L2621M0361M8446N7606O7555
56858G54276P5592P7446O9328M9835K1651q365l2483m6770n2234n1773m7524m1224
56846G67755l4726k8720k2210j4385n944K335J1056K1145L2420M4417N7612P2633
56834I03388Q8940J04976J18143J23423J13745Q4734L9712j0998n5921q7555j03558
56823A319029j05783r8832q7919p6495o5537n4749m3974l3433k3345j3612l876
56812G11474O199J6675K7661L9731N3444O8074Q0948Q7968Q4607O7389L6445k478
56800A278137l9689o6847q1167q4931q1942p5067o6122n6563m7603l9852l2984
56789F05370k6086j8666j1204m291K424R682J7353K4706L1724L8707M4209M4645
$$ plain form
56870 423655 425532 430269 437789 448535 463096 482356 507687 540308 580669 629115 686721 754276
56858 754276 829868 907314 976642 1026477 1048128 1039763 1007280 960510 908276 856503 808979 767755
56846 767755 733029 704309 682099 667714 661770 664105 675161 696306 728726 773143 830755 903388
56834 903388 992328 1097304 1215447 1338870 1452615 1537349 1577061 1566063 1510142 1422587 1319029
56823 1319029 1213246 1114414 1026495 950000 884463 829714 785740 752307 728962 715350 711474
56812 711474 717673 734348 762009 801740 855184 923258 1004206 1092174 1176781 1244170 1280615 1278137
56800 1278137 1238448 1171601 1090434 1005503 923561 848494 782372 725809 678206 638354 605370
56789 605370 579284 560618 549414 545123 547547 557229 574582 599288 631012 669719 713928 758573
56777G58573L6925K1094L62k0570l7235m6980n0068m8947m6041m2484l8722l5117
56765D50790l1614k7779k3668j9925j6781j3833j1105r304q720q687q509q048
56753B62817p197n861m609m276m622m484l586k905k954l008k506j905j538r73
56739B12393j34J65m00r04n50K62Q54J094P76n46k387l258k554j276l17O32J716
56722B05566K040J186J93q3k53r35j402r21j69l2j51O0J14m56r10n22K0r8k35
56703B03012M71J331J125J25m81m43k53J88J181K071J978J239Q23Q24O99M22K26
56686B14538j85r56j361q62j57j2J8M27M36o58j790j549m94k30q78j265j089r87
56668B02946r06k86M26K98k58M8J187J850J654J514J756J586P99L96J154K680
$$ plain form
56777 758573 795498 816592 816954 796384 759149 712169 662101 613154 567113 524629 485907 450790
56765 450790 419176 391397 367729 347804 331023 317190 306085 296781 288061 279374 270865 262817
56753 262817 255620 249759 245150 240874 236252 231768 228182 225277 222323 219315 216809 214904 213366 212393
56739 212393 212259 212424 212024 211120 210570 210832 211686 212780 213556 213010 210623 207365 204811 203535 203218 203850 205566
56722 205566 207606 208792 208985 208902 208649 207714 206312 205391 205222 205190 205039 205099 205213 204757 203847 203325 203345 203247 203012
56703 203012 203483 204814 205939 206064 205583 205140 204887 205075 206256 208327 210305 211544 212367 213191 213890 214312 214538
56686 214538 214353 213397 212036 211174 211017 211005 211023 211450 211886 211228 209438 207889 207395 207165 206287 205022 203933 202946
56668 202946 202040 201754 202180 202478 202220 202268 203455 205305 206959 208473 210229 211815 212614 213010 214164 216844
56652B16844M168N029M824L661K668K962M192N103N286N207M934M169L275K873
56638B75195K638J936J365J971L134K982J116q56j762k215l046l987m559m962
56624B68950n399n553n367n391n902o395o386n966n354m598l934l684l674l454
56610A97893l037k753k425j661p75m88o95n23L22J213J629J633J293N30l58q37
56594A90961q42o45j93O74J509J657J247R32Q72P65O47P67R11P37M68M16L08k7
56576B01164J25J271K476K512J769J569K018K093J515J017Q38O51P79J895L541
56561B25233M551M981N927P365P845O686M787K985J176m34q24K98J718K143J497
56546B75934L32r34j773j683r69n88q17j016q81r41j541k258k603k486j916j076
$$ plain form
56652 216844 221012 226041 230865 234526 237194 240156 244348 249451 254737 259944 264878 269047 272322 275195
56638 275195 277833 279769 281134 283105 286239 289221 290337 289481 287719 285504 282458 278471 273912 268950
56624 268950 263551 257998 252631 247240 241338 234943 228557 222591 217237 212639 208705 205021 201347 197893
56610 197893 194856 192103 189678 188017 187242 186754 186059 185536 185858 187071 188700 190333 191626 192156 191798 190961
56594 190961 190119 189474 189281 189955 191464 193121 194368 195300 196172 196937 197584 198351 199262 199999 200467 200883 201191 201164
56576 201164 201289 202560 205036 207548 209317 210886 212904 214997 216512 217529 218367 219018 219797 221692 225233
56561 225233 229784 234765 240692 248057 255902 262588 267375 270360 271536 271102 270278 270576 272294 274437 275934
56546 275934 276266 275332 273559 271876 270907 270319 269502 268486 267605 266664 265123 262865 260262 257776 255860 254784
56530B54784o67j178j942j898j195q64j105j164q30o78q16p57n87r31j644j841
56514B36687j371r48q47p09o39j048j476j080k57k40r50j024q9O94O54M72O33
56497B28462P27P28J290K252K399J336R6n70j027j408j118k18K58J3m2L86K87
56480B33851p61j613j321m44K72R90J728J638M10p73p80rN39P17R50J370J921
56463B38685K537K762K058P88n0k09k93l84L7P53Q39K79j9K7m66j456j696p88
56445B43404K31P41J202J620J305O66J041K173K135N94k50Q52K186K000J230J483
56429B62613K205J925P68j23m82n69j19Q27J192M42k43K14J024R75M08K61L41
56412B71659R4R0J072K452L139L053K562J473j01r18j49J225J900K189L024L961
$$ plain form
56530 254784 254117 252939 250997 249099 247904 247040 245935 244771 243941 243263 242447 241690 241103 240172 238528 236687
56514 236687 235316 234368 233521 232812 232173 231125 229649 228569 228312 228072 227122 226098 226009 226703 227357 227829 228462
56497 228462 229189 229917 231207 233459 235858 237194 237290 236720 235693 234285 233167 232949 233207 233220 233178 233564 233851
56480 233851 233090 231477 230156 229712 229984 230974 232702 234340 234750 233977 233197 233188 233727 234444 235394 236764 238685
56463 238685 241222 243984 246042 246830 246780 246571 246278 245894 245931 246684 247523 247802 247783 247810 247344 245888 244192 243404
56445 243404 243635 244376 245578 247198 248503 249169 250210 252383 254518 255112 254862 255714 257900 259900 261130 262613
56429 262613 264818 266743 267511 267388 266906 266337 266218 267045 268237 268679 268436 268650 269674 270649 271057 271318 271659
56412 271659 271753 271843 272915 275367 278506 281559 284121 285594 285493 284575 284426 285651 287551 289740 292764 296725
56396B96725L808K578J302M56k22q59j531k602l995m746m245l241k755k752k669
56381B75252k369j786o44O58J004K19m39k74k09r29j425p08M68R14Q10Q56Q22
56364B72220L85K19Q49J467J185M92K10J78J00M68J379J673O87l84k77M29O25
56347B81905O11J131J689J452Q04M84K26k19O4J675L293L247J792L47n26r43n51
56330B96481P85K097K535K668L303M058M302M365M552M255L263K484K181J211
56316C38540n71j245J42J520R06m17k13J042J410R15Q37R91M67M0J052K723L259
56299C51398K803K748L000K560K000K588L598L285K039J782K644L008K593K777
56285C88823L823M429M154L970M210M198L959M350N315N824N637N427N355N124
$$ plain form
56396 296725 300533 303111 304413 304869 304647 303788 302257 299655 295660 290914 286669 283428 280673 277921 275252
56381 275252 272883 271097 270453 271111 272115 272334 271895 271621 271412 270483 269058 268350 268818 269732 270542 271398 272220
56364 272220 272605 272824 273673 275140 276325 276817 277027 277205 277305 277773 279152 280825 281512 281128 280851 281280 281905
56347 281905 282516 283647 285336 286788 287592 288076 288302 288083 288147 289822 293115 296362 298154 298501 297975 297032 296481
56330 296481 297266 299363 301898 304566 307869 311927 316229 320594 325146 329401 332664 335148 337329 338540
56316 338540 337969 336724 336866 338386 339292 338875 338662 339704 341114 342029 342866 343857 344324 344364 345416 348139 351398
56299 351398 354201 356949 359949 362509 364509 367097 370695 373980 376019 377801 380445 383453 386046 388823
56285 388823 392646 397075 401229 405199 409409 413607 417566 421916 427231 433055 438692 444119 449474 454598
56271D54598N096N779O673P110P558Q527R164Q772Q629J0150J2377J3624J4551
56258E72608J7015K0641K3393K5005K7188L0645L4470L8319M2805M7860N2879
56247I32828N8109O3892O9129P2655P5323P8408Q0783Q0352P7410P3698O8838
56236A731425O0830M9762L7904K6145J3357n76j3927k5614l6017m5124n2181n7303
56224A688681o1293o3967o4751o4466o4259o3359o0381n6193n2810n0042m6209
56213A040951m1640l8376l6595l4470l1427k8654k6455k3988k1479j9856j8421
56202G19590j5803j2908j1833j2121j1342r202p760p586p076n726m763m316l189
56189F05965j610j098j421q72L88M85o19j037m76m55r60m48P38N97o00l85J518
$$ plain form
56271 454598 459694 465473 472146 479256 486814 495341 504505 513277 521906 532056 544433 558057 572608
56258 572608 589623 610264 633657 658662 685850 716495 750965 789284 832089 879949 932828
56247 932828 990937 1054829 1123958 1196613 1271936 1350344 1431127 1511479 1588889 1662587 1731425
56236 1731425 1792255 1842017 1879921 1906066 1919423 1918847 1904920 1879306 1843289 1798165 1745984 1688681
56224 1688681 1627388 1563421 1498670 1434204 1369945 1306586 1246205 1190012 1137202 1087160 1040951
56213 1040951 999311 960935 924340 889870 858443 829789 803334 779346 757867 738011 719590
56202 719590 703787 690879 679046 666925 655583 646381 638621 631035 623959 618233 613470 609154 605965
56189 605965 604355 603257 601836 600964 601352 601837 601218 600181 599705 599250 598290 597842 598580 599177 598577 598192 599710
56172E99710K625K084J852K775L190K387J938K712L645M291N439O734O914O682
56158F52978P995J0225J0742R562R561J1638J3580J4250J4927J5934J6042J5982
56146H03416J8368K3231K7679L0926L5481M2497N0112N7556O6736P8525R1368
56135A325895J04504J18422J31177J38430J38193J31652J19082J00044P8426O1806
56125B447631N3837N1571N1197N1182M8624L8730K0911Q43j5875k7925l4999l6135
56113B649592l3883l4933m3521n8003p5508r4791j12642j23334j24820j20716
56103A827441j13755j02459q6834p1551o0030n0446m0795l2867k7865k3301j7736
56092A199802j3712j2495j0946p059l659l026k851j097K47j20M93L524N771N169
$$ plain form
56172 599710 602335 604419 606271 609046 612236 614623 616561 619273 622918 627209 632648 639382 646296 652978
56158 652978 660973 671198 681940 691502 701063 712701 726281 740531 755458 771392 787434 803416
56146 803416 821784 845015 872694 903620 939101 981598 1031710 1089266 1156002 1234527 1325895
56135 1325895 1430399 1548821 1679998 1818428 1956621 2088273 2207355 2307399 2385825 2447631
56125 2447631 2501468 2553039 2604236 2655418 2704042 2742772 2763683 2764526 2748651 2720726 2685727 2649592
56113 2649592 2615709 2580776 2537255 2479252 2403744 2308953 2196311 2072977 1948157 1827441
56103 1827441 1713686 1611227 1524393 1452842 1392812 1342366 1301571 1268704 1240839 1217538 1199802
56092 1199802 1186090 1173595 1162649 1155590 1151931 1148905 1146054 1144957 1145204 1145084 1145577 1149101 1154872 1160041
56078A160041M750O843Q726Q172P903J0053J1660J0456R768J2641J6162J6801
56066A283976J6441J7938J9533J8946J8284J9632K0398J8297J6259J7116J8178
56055A484998J6442J4447J5361J6974J6202J5073J6546J8774J9076J9268K1643
56044A674804K4100K4537K5430K8836L1722L1529L1175L3274L4926L3870L3888
56033B008091L8029M2371M2848M2410M4913M7876M7972M7674M9574N0402M7765
56022B509925M6447N0517N5636N6876N7525O2120O7545O9487P0978P5819Q0307
56011C203182Q0499Q0822Q6183R2551R4875R7107J04367J12498J15964J18798
56001D186846J26832J36371J41776J46830J57035J68145J74319J80048J91794
$$ plain form
56078 1160041 1164791 1171634 1180360 1188532 1196435 1206488 1218148 1228604 1238372 1251013 1267175 1283976
56066 1283976 1300417 1318355 1337888 1356834 1375118 1394750 1415148 1433445 1449704 1466820 1484998
56055 1484998 1501440 1515887 1531248 1548222 1564424 1579497 1596043 1614817 1633893 1653161 1674804
56044 1674804 1698904 1723441 1748871 1777707 1809429 1840958 1872133 1905407 1940333 1974203 2008091
56033 2008091 2046120 2088491 2131339 2173749 2218662 2266538 2314510 2362184 2411758 2462160 2509925
56022 2509925 2556372 2606889 2662525 2719401 2776926 2839046 2906591 2976078 3047056 3122875 3203182
56011 3203182 3283681 3364503 3450686 3543237 3638112 3735219 3839586 3952084 4068048 4186846
56001 4186846 4313678 4450049 4591825 4738655 4895690 5063835 5238154 5418202 5609996
55992E609996K05629K15608K26017K42457K59632K71637K85032L07346L32351
55983G955705L51987L72521M02743M36899M66802M99794N46044N99256O49602
55974A2281353P04054P73175Q50283R26068J011016J119438J245060J378025J531528
55965B1820000J724120J951744K207841K514264K899567L366134L916570M592988
55957D4993228N450466O516977P828647R479204J1577967J4180831J7313526K1020382
55949A38361228K5324710L0191382L5544266M1025850M5321444M5789861L9513005
55942D01071746K5534681O311694j3289466k8729471l7897978m1187015m0248005
55935B71566186l6860367l2448285k7954921k3842286k0237925j7146677j4546197
$$ plain form
55992 5609996 5815625 6031233 6257250 6499707 6759339 7030976 7316008 7623354 7955705
55983 7955705 8307692 8680213 9082956 9519855 9986657 10486451 11032495 11631751 12281353
55974 12281353 12985407 13758582 14608865 15534933 16545949 17665387 18910447 20288472 21820000
55965 21820000 23544120 25495864 27703705 30217969 33117536 36483670 40400240 44993228
55957 44993228 50443694 56960671 64789318 74268522 85846489 100027320 117340846 138361228
55949 138361228 163685938 193877320 229421586 270447436 315768880 361558741 401071746
55942 401071746 426606427 432918121 419628655 390899184 353001206 311814191 271566186
55935 271566186 234705819 202257534 174302613 150460327 130222402 113075725 98529528
55928I8529528j2371686j0533041q973613p669958o583329n659863m871991m215695
55920C7650352l671124l203609k798319k458782k175108j925103j702635j515680
55912A8199992j359794j219902j094243r91369r06950q27155p51469o89680o39575
55903I719855n89065n37492m94189m58492m20853l81785l50695l27423l02700
55894E857161k75765k54650k39816k23470k04484j88988j76853j61712j43774
55885C987649j29058j16880j00991q2139o6671n3804l6932j7086l319l24o592
55874C373853k2917n0656q2355j06077j19214j27873j33779j32857j25921j19280
55864B352924j14325j06858r6997q9707q5206p8563o9243o1826n6949n0662m3001
$$ plain form
55928 98529528 86157842 75624801 66651188 58981230 52397901 46738038 41866047 37650352
55920 37650352 33979228 30775619 27977300 25518518 23343410 21418307 19715672 18199992
55912 18199992 16840198 15620296 14526053 13534684 12627734 11800579 11049110 10359430 9719855
55903 9719855 9130790 8593298 8099109 7640617 7219764 6837979 6487284 6159861 5857161
55894 5857161 5581396 5326746 5086930 4863460 4658976 4469988 4293135 4131423 3987649
55885 3987649 3858591 3741711 3640720 3558581 3491910 3438106 3401174 3384088 3380769 3380445 3373853
55874 3373853 3350936 3300280 3217925 3111848 2992634 2864761 2730982 2598125 2472204 2352924
55864 2352924 2238599 2131741 2034744 1945037 1859831 1781268 1712025 1650199 1593250 1542588 1499587
55853A499587l8372l6947l4382l0341k8865k9989k9431k6913k6498k8239k7760
55842A161850k4728k3620k5320k5707k3523k2045k2118k0918j8497j8316k0284
55831I16774k0327j7801j6466j7221j6674j3892j1894j1496j0159p933q058j0673
55819G54180j2206j1939j2835j5060j5086j2361j0534j0786j0111p514n791n674
55807F24283m212n75K148K639L321N177O000N347N868Q017Q568O148L235J144
55793F77108k078p016j0984j2528j3417j4479j3860j0993q244p180p106q252j1997
55780E48974j6944j9137j7492j4939j3236j1068q125o314n690l716j16J981J129
55767D35307m68j361k834n087n903m832m469n901o857o047n286n653n537m228
$$ plain form
55853 1499587 1461215 1424268 1389886 1359545 1330680 1300691 1271260 1244347 1217849 1189610 1161850
55842 1161850 1137122 1113502 1088182 1062475 1038952 1016907 994789 973871 955374 937058 916774
55831 916774 896447 878646 862180 844959 828285 814393 802499 791003 780844 772911 764853 754180
55819 754180 741974 730035 717200 702140 687054 674693 664159 653373 643262 635748 629957 624283
55807 624283 620071 619496 621644 624283 627604 632781 638781 644128 649996 658013 666581 672729 675964 677108
55793 677108 675030 668014 657030 644502 631085 616606 602746 591753 583509 576329 569223 560971 548974
55780 548974 532030 512893 495401 480462 467226 456158 448033 441719 436029 432313 432197 434178 435307
55767 435307 434839 433478 430644 425557 419654 414822 410353 404452 397595 391548 386262 380609 375072 370844
55753C70844l555m250m492l754m222o642q492q187p416p524p165n510m226m322
55739B91087m231k922j728j457q82L37N19o08p51J051K567K102Q16k78k167m972
55723B78483o568o058n438n953n997m507l207l416l645k491j025k88O65K271K871
55708B35697J685O20J075J708J359J339K600L324J732j003k885l974n117n920
55694B32240n933n849n883m984l146k199k779k967j539n0P4k2R51K065K214K288
55678B04481L253M160L960L291K722J338j168l121l396l205l635l638k282q51
55664B01909o52p57J16J362J933K290L039L422K859K352K807L590M069M661N214
55649B38214M464K440J086J077M75j964m714o344p776r663j0302q500o119n282
$$ plain form
55753 370844 367289 363039 358547 354793 350571 343929 335437 327250 319834 312310 305145 299635 295409 291087
55739 291087 286856 283934 282206 280749 279867 280204 280723 280115 279364 280415 282982 285084 285900 285622 283455 278483
55723 278483 271915 265857 260419 254466 248469 243962 240755 237339 233694 231203 230178 229890 230555 232826 235697
55708 235697 237382 238002 239077 240785 242144 243483 246083 249407 251139 250136 247251 243277 238160 232240
55694 232240 226307 220458 214575 209591 206445 204246 201467 198500 196961 196911 196985 196963 197914 199979 202193 204481
55678 204481 207734 211894 215854 219145 221867 223205 222037 218916 215520 212315 208680 205042 202760 201909
55664 201909 201257 200500 200616 201978 203911 206201 209240 212662 215521 217873 220680 224270 228339 233000 238214
55649 238214 242678 245118 246204 247281 247756 245792 241078 234734 226958 217295 206993 198493 192374 187092
55635A87092n227m323l122k843k804j937j153j672k578k412j673j476j272k67
55621A54333N10q6r88o85Q5k94j470k039k078k469k798k117r05k75j85j70o67
55604A37702j804k213j008L98L38n30p29o27j370k396k306j271m50R9Q33J095
55588A25761J12j179j347p21n49o98j66Q86J421J303J153J062Q94J096J894K590
55572A33512K820L381M582N201M548L922M354M497K754J10j305j309j236j483
55558A64348j581j789k621l530l775l721l807l357k061j241j898k808k448j427
55544A28284j040q68nP46K81m31J38J235J033k50r34p43p18r32p26n42j167j780
55526A21581j125j7k98j791k655k283j606r29J66J077O66o35j326j246j473k124
$$ plain form
55635 187092 181865 177542 174420 171577 168773 166836 165683 164011 161433 159021 157348 155872 154600 154333
55621 154333 154843 154757 153769 153084 153169 152875 151405 149366 147288 144819 142021 139904 138999 138724 138539 138369 137702
55604 137702 135898 133685 132677 133075 133413 132883 132154 131527 130157 127761 125455 124184 123734 123833 124666 125761
55588 125761 125873 124694 123347 122626 122077 121379 121213 122099 123520 124823 125976 127038 127932 129028 130922 133512
55572 133512 136332 139713 144295 149496 154044 157966 162320 166817 169571 169681 168376 167067 165831 164348
55558 164348 162767 160978 158357 154827 151052 147331 143524 140167 138106 136865 134967 132159 129711 128284
55544 128284 127244 126376 126371 127117 127398 126967 127105 128340 129373 129123 128189 127446 126728 125796 125070 124528 123361 121581
55526 121581 120456 120439 120141 118350 115695 113412 111806 110877 111043 112120 112786 112151 110825 109579 108106 105982
55510A05982k307k037k138k415j918q77m44p23r08j100k043l253l392k446j737
55495G8244j786j889j643j298p64K15J152J461J647K387L110K979K528K664K885
55480I1892K212J117O77O32J87j78K60O11k70j469j404n98n67r25l31N05k04j803
55462I0344j803J39J855K259K302K299J353j81n78L15P24J17l2P89J100J83o64
55445A00521n46k84m36l03K46J42p65j131m93q0m39m46L67P36N0m03J95N84l20
55426I7195j437j277j82O27R41J110R40L03j01K93R99J324J281J032M48k51m28
55409A02817j33k15r18j500j476j134n74L55R79K83j206j715q06m9m64j145j086
55392I2013p44q12r63p54m77k30M92J548J849J102N35R79J587J292L30n50j174
$$ plain form
55510 105982 103675 101638 99500 97085 95167 94290 93846 93123 92215 91115 89072 85819 82427 79981 78244
55495 78244 76458 74569 72926 71628 70864 71079 72231 73692 75339 77726 80836 83815 86343 89007 91892
55480 91892 94104 95221 95898 96530 96717 96539 96799 97410 97140 95671 94267 93669 93102 92177 91846 92351 92147 90344
55462 90344 88541 88680 90535 92794 95096 97395 98748 98567 97989 98304 99028 99145 99113 99902 101002 101185 100521
55445 100521 99975 99691 99255 98952 99198 99340 98575 97444 96951 96871 96432 95986 96353 97089 97139 96736 96931 97515 97195
55426 97195 95758 94481 94299 94926 95867 96977 97917 98220 98119 98412 99411 100735 102016 103048 103496 103245 102817
55409 102817 102684 102469 101551 100051 98575 97441 96867 97222 98201 98484 97278 95563 94757 94708 94244 93099 92013
55392 92013 91269 90457 89494 88740 88263 88033 88525 90073 91922 93024 93559 94538 96125 97417 97747 97197 96023
55375I6023j416q46K23N32l16j010l88Q53J295O98j57o75p05k69K66L49K2j04
55357I4375J07J76P2L00P38N87j29k93O02J642J841J268M18m04p70l43L70N32
55339A01089L66O63J046L84r69j305l23K97k98q46l43K68n0o77o93m32m66m55
55321I7256j68k66r32j116l41K30k14n77K61J351J146j9n38P2R13J235J010L80
55303I9683l11m83p7K01Oj01J90K89j01k75J49M29J04l1O04J149O94j94o10p56
55283A00559j108j207o44k01n59q62p0J102J228M90K53Q00J076N90M1K2K63L39
55265A02112K01j3j37K5M04O15N14M28M56K66j15r7M54Q62P98Q41J286J414O84
55246A10998l12q42j032j179j055o55o16j067j079j44Q47J049R28J132J178M71
$$ plain form
55375 96023 94607 93761 93984 94516 94200 93190 92802 93655 94950 95648 95491 94816 94111 93842 94108 94457 94479 94375
55357 94375 94482 94658 94730 95030 95768 96355 96226 95933 96535 98177 100018 101286 101704 101300 100530 100187 100557 101089
55339 101089 101455 102118 103164 103548 102579 101274 100951 101248 100950 100104 99761 100029 99979 99302 98609 98177 97711 97256
55321 97256 97088 96822 95890 94774 94433 94663 94449 93872 94133 95484 96630 96611 96073 96145 97058 98293 99303 99683
55303 99683 99372 98889 98812 99013 99019 98918 99108 99397 99296 99021 99170 99599 99703 99672 100276 101425 102119 101925 101315 100559
55283 100559 99451 98244 97600 97399 96840 95978 95908 97010 98238 98728 98981 99781 100857 101447 101488 101510 101773 102112
55265 102112 102313 102300 102163 102188 102592 103207 103721 104149 104605 104871 104756 104659 105113 105975 106773 107614 108900 110314 110998
55246 110998 110686 109844 108812 107633 106578 105923 105307 104240 103161 103017 103864 104913 105841 106973 108151 108622
55230A08622m37p32o80q75j025o12L0L66N39O89L40m95p73o5L98l61j296r94M2
55211A02681M02P4k8J8m85j146j005l16q3k64m0M71M87J78L72Q92Q07K71M07J360
55191A05053J969J558O64q6o48r93r71q35r16q74k37N43O43K32J14K97J06l94
55173A05225m01K09O47M33j51p53j122p35O10J916J822L81r60j153m18N48J286
55156A07384J504J223R52J003R03K50l41q9N68O40K25J48K72l65j683k266j292
55139A09036L27J124N97o17j458j252l08L39K26M2L71N99n4j090j415r18k55L59
55121A05653R55R76R3p48m99J74j03j036j002L10J471J537R95K85p82j795j610
55104A04874l4J617K241J968J214J22o87k38J216K076J496M22o7k29o47r62o09
$$ plain form
55230 108622 108185 107453 106773 105898 104873 104261 104291 104657 105196 105885 106225 105730 104957 104892 105290 104929 103633 102639 102681
55211 102681 103083 103157 103129 103147 102662 101516 100511 100195 100112 99848 99808 100279 100766 100944 101316 102208 103015 103286 103693 105053
55191 105053 107022 108580 109244 109158 108510 107517 106546 105711 104795 103921 103684 104227 104870 105102 105216 105513 105619 105225
55173 105225 104824 105033 105680 106113 105962 105209 104087 103352 103962 105878 107700 108081 107121 105968 105550 106098 107384
55156 107384 108888 110111 111063 112066 112969 113219 112878 112789 113357 113997 114222 114370 114642 114277 112594 110328 109036
55139 109036 109363 110487 111084 110467 109009 107757 107449 107788 108014 108056 108427 109026 108972 107882 106467 105549 105294 105653
55121 105653 106608 107584 107677 106929 106430 106604 106501 105465 104463 104773 106244 107781 108776 109061 108279 106484 104874
55104 104874 104840 106457 108698 110666 111880 112002 111315 111077 112293 114369 115865 116287 116220 115991 115344 114382 113773
55087A13773K6K08j5q9R0K20K16K08J82N1j78n02r39j267j139n45K11Q73J206
55068A12590Q19k40j042p10L20Q24N23K90O75J205J337J121P49K72k6J62M62K12
55050A19543m29o31k61j7p4K69J228J904J555O28m7l08m21m73n41p96j038o87
55032A19404L36J274J422Q75J06o22j124j135p39m81p41j223j381j021l99J10
55016A14661L55N59J041J609J640J017M48L77K68l75r46o63P2L32K57O44J348
54999A22644J423P48J48m8k56m73j57N20P07K83O1L64N66L15K3r7l10n16k48K43
54979A25940J48m97p71l86L5L02Q56J408J014l4j18J201K263J741N14M4K50K24
54961A34134p6j30m5k28n08n12l93l55r2N36R30O24O6j41j72m12o35m88k83n32
$$ plain form
55087 113773 113799 114007 113992 113903 113993 114213 114429 114637 114819 114870 114692 114190 113251 111984 110845 110300 110511 111384 112590
55068 112590 113409 113169 112127 111417 111737 112561 113084 113374 114049 115254 116591 117712 118461 118733 118707 118869 119331 119543
55050 119543 119114 118483 118222 118205 118131 118400 119628 121532 123087 123715 123668 123360 122939 122466 121925 121129 120091 119404
55032 119404 119740 121014 122436 123311 123417 122795 121671 120536 119797 119316 118575 117352 115971 114950 114551 114661
55016 114661 115016 115575 116616 118225 119865 120882 121330 121707 121975 121600 120654 119991 120063 120395 120652 121296 122644
54999 122644 124067 124815 124963 124915 124659 124186 124029 124549 125256 125539 125600 125964 126530 126845 126868 126771 126461 125945 125697 125940
54979 125940 126088 125591 124820 124434 124469 124771 125627 127035 128049 128015 127897 129098 131361 133102 133616 133660 133910 134134
54961 134134 134058 133928 133883 133655 133147 132635 132242 131887 131795 132331 133261 133885 133951 133810 133638 133226 132591 132103 131820 131288
54941A31288j106j388r39K63J751K577K106R75M59P28Q31N22P70K022L311L848
54925A48018M181M980N832O223O531P029O985N841M323L199J901m56l389n651
54911A95547o853p379p292o500n539n040m793m243l445k735j950r17j15M9O0M87
54895A39342R35P40J13l25n61p53m95M43J295J360J247J935L117L810M073M743
54879A61019N873O755P200P448P047N309K746O58o83k129l936n313n896o320o942
54864A72836p196o625n566m364k886j280l03l86j041j613j995k158j739n87O65
54849A35762J092L64j053k322k779k363j615j066p32m43l75p31j173j200r47q98
54833A19521r58n17N08J454J842J835J662J247O74M08P02J161J203O39l18j293
$$ plain form
54941 131288 130182 128794 127855 128118 129869 132446 134552 135527 135986 136714 137545 138067 138837 140859 144170 148018
54925 148018 152199 157179 163011 169234 175765 182794 189779 195620 199943 203142 205043 204587 201198 195547
54911 195547 188694 181315 174023 167523 161984 156944 152151 147908 144463 141728 139778 138861 138746 138795 138855 139342
54895 139342 140277 141017 141130 140805 140244 139491 138996 139439 140734 142094 143341 145276 148393 152203 156276 161019
54879 161019 166892 173647 180847 188295 195342 200651 203397 204055 203372 201243 197307 191994 186098 179778 172836
54864 172836 165640 159015 153449 149085 146199 144919 144616 144230 143189 141576 139581 137423 135684 135097 135762
54849 135762 136854 137218 136165 133843 131064 128701 127086 126020 125288 124845 124470 123739 122566 121366 120419 119521
54833 119521 118563 118046 118554 120008 121850 123685 125347 126594 127268 127676 128378 129539 130742 131381 131063 129770
54817A29770j876j802j188m14K31N81M49j47o60m05O90J944K572K215J016l84
54801A32592j106p14J94N84J20n54p28m02q2j31m62o55l67L08Q98J084J020R72
54783A32571R42Q63Q68J053J159R71P56R50J587K363L166M034M770N110N186N456
54767A71805O092O790P184P105O437N059L039P25j418l054m135m939n809o717
54753A88164p271p169o464n365m106l051k499k254j824j188q08o99j42J201K528
54738A49053K820K089J115L78r0j31M36J255J677J661J879K844M274N435N864
54723A80559N719N545N657N681M915L152R19j197l051m632n729o178o122n794
54709A79444n332m954m844m757m179l087k044j405r48m80j68p3J5Qm46j115j175
$$ plain form
54817 129770 127894 126092 124904 124490 124721 125302 125751 125604 124944 124539 125229 127173 129745 131960 132976 132592
54801 132592 131486 130772 130966 131550 131670 131116 130388 129986 129904 129773 129311 128656 128289 128597 129495 130579 131599 132571
54783 132571 133513 134376 135244 136297 137456 138427 139183 140133 141720 144083 147249 151283 156053 161163 166349 171805
54767 171805 177897 184687 191871 198976 205413 210472 213511 214236 212818 209764 205629 200690 194881 188164
54753 188164 180893 173724 167260 161895 157789 154738 152239 149985 148161 146973 146165 145466 145324 146525 149053
54738 149053 151873 153962 155077 155455 155365 155234 155670 156925 158602 160263 162142 164986 169260 174695 180559
54723 180559 186278 191823 197480 203161 208076 211228 212147 210950 207899 203267 197538 191360 185238 179444
54709 179444 174112 169158 164314 159557 155378 152291 150247 148842 147894 147414 147246 147173 147188 147196 146750 145635 144460
54692A44460m71J22J1k78j93j25n63j105j121p42l89oM32L73m51j266j226o50
54674A36812l89n28n83m77l85j60J97R2p06j217m54J053J960J877J442J039N78
54657A40151J79j9l92j221j884j624p22O4P25J534J981J464N88M33Q52Q25J79
54640A43113l68n93p60n35N19J563J207l30j419j403j212j423j386o92lJ83K45
54623A36706N01O89Q13J284J872J764J015O25P78M84n59j206p16k9k24r04j054
54606A41839n64N4N61P91L54o63j358j171o59m61l07K65R16J042P12M03K62K57
54588A42273M86Q37R19P52Q54J228J127L14l38j83J34k38r71j237j050r86j011
54571A42910o00K49R84J314J345J094M89k79q48j088j016o59j87J05K42N77J131
$$ plain form
54692 144460 143989 144111 144122 143844 143651 143526 142963 141858 140737 139995 139606 139600 140032 140405 139954 138688 137462 136812
54674 136812 136423 135895 135312 134835 134450 134290 134487 134579 133873 132656 132202 133255 135215 137092 138534 139573 140151
54657 140151 140330 140311 139919 138698 136814 135190 134468 134532 135257 136791 138772 140236 140824 141257 142109 142934 143113
54640 143113 142745 142152 141392 140857 141376 142939 144146 143816 142397 140994 139782 138359 136973 136281 136278 136461 136706
54623 136706 137207 137896 138709 139993 141865 143629 144644 145269 146047 146531 145972 144766 144050 144021 143797 142893 141839
54606 141839 141275 141329 141890 142681 143035 142372 141014 139843 139184 138723 138416 138681 139597 140639 141351 141754 142016 142273
54588 142273 142759 143596 144515 145267 146121 147349 148476 148790 148452 148269 148403 148165 147194 145957 144907 143921 142910
54571 142910 142310 142559 143543 144857 146202 147296 147785 147506 146658 145570 144554 143895 143708 143813 144055 144632 145763
54554A45763J443J382J441J811J870J171L10J95Q66J642K019J887J309O62O02
54539A64373J274J829J383J71p69q66m98k85m13o28o61o45r78j631j833j032K5
54522A58816K6j053j774j186j4N30K38l28p63q61m02M55J105J248J191J057N14
54505A58799l51p75n30m07p79p26M47J761J828Q20o2m56q52j152o93L81J121J224
54487A59598J357J799J896J192K74n4K14N00M87M17O67J260J712J547J002R09
54471A74777J578K284K275J835J695J832J611R12K99J32J98K82M61P06P32M14
54455A92023r4o57j235j600j448q54l46l79r08j445j506j056o38p52j172j198
54439A76735o52j04L0K4J36J36p4o6L22M12l23j189j053J75J572K346K262J291
$$ plain form
54554 145763 147206 148588 150029 151840 153710 154881 155191 155386 156252 157894 159913 161800 163109 163771 164373
54539 164373 165647 167476 168859 169030 168261 167395 166897 166612 166199 165571 164910 164265 163287 161656 159823 158791 158816
54522 158816 158842 157789 156015 154829 154815 155345 155583 155255 154492 153631 153229 153684 154789 156037 157228 158285 158799
54505 158799 158448 157673 157143 156736 155957 155231 155678 157439 159267 160087 160025 159569 158717 157565 156872 157253 158374 159598
54487 159598 160955 162754 164650 165842 166116 166062 166276 166776 167263 167680 168347 169607 171319 172866 173868 174777
54471 174777 176355 178639 180914 182749 184444 186276 187887 188799 189098 189230 189428 189710 190171 190877 191609 192023
54455 192023 191929 191272 190037 188437 186989 186135 185789 185410 184502 183057 181551 180495 179857 179105 177933 176735
54439 176735 176083 175979 176009 176033 176169 176305 176231 176165 176487 176899 176576 175387 174334 174509 176081 178427 180689 181980
54421A81980k52j472j660j183r32j080j111q28n25k83K2J53k25p75q18l79l0K22
54403A70824Q99J882K344K087J860K024J869Q84k54o66n11m58m83j57K91J60n36
54386A82059r06l91N00J011J106J250J564J664J246M28n38j484k120j995j039
54371A82355Q1N41K49j75k24J01O22J152J293O42n23j279j073k79M54R07J065
54354A85909P43k7p62j147j498k048k226j337K73J436J516R68N84O80J031J279
54338A85374J310J429J923K451K218J004m13j313j934k774l485l293k232j168
54324A79097o97p15r79j414j796j820j557j333j099m62N71J332J184K33p84j090
54308A68671n12L16N73K30M6L89O35K36k96k07J94rp88j149o26J65N94P34P80
$$ plain form
54421 181980 181728 180256 178596 177413 176481 175401 174290 173462 172937 172654 172676 172829 172604 171829 171011 170632 170602 170824
54403 170824 171723 173605 175949 178036 179896 181920 183789 184673 184419 183753 183242 182784 182301 182144 182435 182595 182059
54386 182059 181153 180762 181262 182273 183379 184629 186193 187857 189103 189531 188993 187509 185389 183394 182355
54371 182355 182436 182977 183226 183051 182827 182928 183550 184702 185995 186637 186114 184835 183762 183483 183937 184844 185909
54354 185909 186652 186625 185863 184716 183218 181170 178944 177607 177880 179316 180832 181800 182384 183064 184095 185374
54338 185374 186684 188113 190036 192487 194705 195709 195296 193983 192049 189275 185790 182497 180265 179097
54324 179097 178400 177685 176706 175292 173496 171676 170119 168786 167687 167225 167796 169128 170312 170545 169761 168671
54308 168671 168159 168475 169048 169278 169324 169713 170348 170584 170288 170081 170275 170266 169478 168329 167703 167868 168462 169196 169976
54289A69976N55L6l03q4L72M33r8q20j138p67k6M26L21J26L72Q56R58N18j06o17
54269A70990r17q67n24l85p53j034m78N23Q19J69m14k07L18N60Q04J525K315K273
54251A74717J232n6q41j038r61p39k12O22J201Q84q4n77q4M22k08j426j595l06
54233A70951R86J029L23J3J58k2p11j234j085n26j11q9l08m70l77j42j04m62j061
54214A66758j537j583j112l90J16K26L23P75J259J133M48l0M2N1n93j450j474
54197A62962k84J402K529K667K200J739J395P70k81j182j242n74Ll6m33p33q29
54180A70073q25p16m76k81l53o45q02m37L92J005O47n99j736j927j349o98k85
54163A60988l1J8j81k85N9O43J000J136J324J413J057L94j76o56j160j196k73
$$ plain form
54289 169976 170531 170567 170264 170180 170552 170985 170887 170067 168929 168162 168136 168562 168883 169009 169381 170237 171195 171713 171607 170990
54269 170990 170073 169206 168682 168297 167544 166510 166032 166555 167374 167543 167129 166922 167240 167800 168604 170129 172444 174717
54251 174717 175949 175893 175052 174014 173053 172314 172102 172724 173925 174809 174725 174148 174064 174486 174278 172852 171257 170951
54233 170951 171937 172966 173289 173302 173460 173438 172727 171493 170408 169882 169771 169682 169374 168904 168527 168385 168281 167819 166758
54214 166758 165221 163638 162526 162136 162252 162478 162801 163576 164835 165968 166416 166386 166428 166479 165886 164436 162962
54197 162962 162678 164080 166609 169276 171476 173215 174610 175380 175099 173917 172675 172101 172104 172068 171635 170902 170073
54180 170073 169248 168532 168056 167775 167422 166777 165975 165538 165930 166935 167582 166983 165247 163320 161971 161273 160988
54163 160988 160957 160975 160794 160509 160568 161211 162211 163347 164671 166084 167141 167535 167359 166703 165543 164347 164074
54146A64074R37J160L05l80j67K82K27p3r0N9J02R1n1p00j596j675n84M89M01
54127A62811k37k9J064J767J440Q11O67Q27P60M75L35M43N96O51O06M27K3n74
54109A72863j076j109o20n8J00o9j39l1j15n03p54n52k05j20j42J49P10J104J169
54090A70602J189J297J154M19o06j145q02o4L27L67O50J242J351N49k50J25J433
54073A77838K291K049J409J158J186J100R28P48L36k91n58m9Q61J457J462R52
54057A92877J29n17k45J099K647L414L441L591M453N858P310Q484R379J0336J1819
54042B64075J3903J5900J6577J4854J0508M587r84m676o373o973p036o414n032
54029C02916l386k023j053m00p8KJ01L22O46J229K142K783K299P47q17j623j819
$$ plain form
54146 164074 165011 166171 166476 166096 165929 166211 166438 166365 166275 166334 166436 166527 166476 165776 164180 162505 161921 162410 162811
54127 162811 162574 162545 163609 165376 166816 167627 168294 169121 169881 170356 170691 171134 171730 172381 172987 173414 173437 172863
54109 172863 171787 170678 170058 170000 170100 170031 169892 169861 169746 169243 168489 167937 167732 167612 167470 167619 168329 169433 170602
54090 170602 171791 173088 174242 174661 174055 172910 172108 172044 172371 172738 173388 174630 175981 176530 176280 176405 177838
54073 177838 180129 182178 183587 184745 185931 187031 187959 188707 189043 188752 188194 188145 189006 190463 191925 192877
54057 192877 193006 192489 192244 193343 195990 199404 202845 206436 210889 216747 224057 232541 241920 252256 264075
54042 264075 277978 293878 310455 325309 335817 340404 339420 334744 328371 321398 314362 307948 302916
54029 302916 299530 297507 296454 296054 295976 295978 296079 296401 297047 298276 300418 303201 305500 306247 305430 303807 301988
54012C01988j724j339r80j447k931m458n081m984m842m735m393l954l719l549
53998B53852l132k569k114j749j448j456j888k387k630k683k560k052j445j549
53984B24190k443k941k143p33Q8K04J26l07j518k860l075j977n68M00R52J124
53968B08519P70K40J16K42k1n30m22L61P66L32M6Q48K068K338J510Q02J159K162
53950B21306K749K513J999J837J996K078K160K740L794M477M208L577L620M500
53936B63554N536O243O704P067P350P680Q120Q271P585O069M214K376P55k32k58
53921C41034K33M11J30L5N43J386K213K977L574L833M007M662N779O559O464N859
53905C89699N287M648L552K119Q93J52k60n53o88n08M4Q12J529K129K905M151
$$ plain form
54012 301988 300264 298925 297945 296498 293567 289109 284028 279044 274202 269467 265074 261120 257401 253852
53998 253852 250720 248151 246037 244288 242840 241384 239496 237109 234479 231796 229236 227184 225739 224190
53984 224190 221747 218806 216663 215930 216018 216222 216348 216041 214523 211663 208588 206611 206043 206443 207395 208519
53968 208519 209289 209529 209645 209887 209866 209336 208914 209275 210041 210373 210419 211267 213335 215673 217183 217985 219144 221306
53950 221306 224055 226568 228567 230404 232400 234478 236638 239378 243172 247649 251857 255434 259054 263554
53936 263554 269090 275333 282037 289104 296454 304134 312254 320525 328110 334179 338393 340769 341524 341292 341034
53921 341034 341267 341678 341808 341843 342386 343772 345985 348962 352536 356369 360376 365038 370817 377376 383840 389699
53905 389699 394986 399634 403186 405305 406198 406350 406090 405537 404849 404341 404385 405197 406726 408855 411760 415911
53889D15911N664O757O804N517K830j184o083j0953j4665j6384j6057j4559j3064
53876C50534j2005j0827q976o849n378m986n345n908o214n905n016m134l713l430
53862B61848k771k072k166l040l670l397k734k440k440k151j442p54m24l34j53
53847B31860K33O30P37N02J34k55q01j519k037k020j611j126n73L4K32l60j172
53830B22888j173k47O33P42M21L03M00L97L28M21N66M19m6m12k41M43J152J411
53812B28405J297J384J984K697L010L023L120L180K828K420K933M549O079O276
53798B73185N353M628M840N330M999L688K349J864K036K000J441R07Q52R78Q25
53783C15275M48P0m22j042j281q27l30o51j673k608l298m159n059n300m814m315
$$ plain form
53889 415911 421575 428332 435136 440653 443483 442299 436216 425263 410598 394214 378157 363598 350534
53876 350534 338529 327702 318726 311877 306499 301513 296168 290260 284046 278141 273125 268991 265278 261848
53862 261848 259077 257005 254839 251799 248129 244732 241998 239558 237118 234967 233525 232771 232347 232013 231860
53847 231860 232093 232723 233460 233962 234096 233841 233040 231521 229484 227464 225853 224727 224154 224188 224420 224060 222888
53830 222888 221715 221468 222101 222843 223264 223567 223967 224364 224692 225113 225679 226098 226052 225640 225399 225842 226994 228405
53812 228405 229702 231086 233070 235767 238777 241800 244920 248100 250928 253348 256281 260830 266909 273185
53798 273185 278538 283166 288006 293336 298335 302023 304372 306236 308272 310272 311713 312620 313472 314450 315275
53783 315275 315723 315793 315371 314329 313048 312221 311891 311240 309567 306959 303661 299502 294443 289143 284329 280014
53767B80014m169l981l578l372l430l117k145j160q05r46j280k010l229m236m209
53752B38347l177j853q07k10kP0K61L77k0p82j087n65J46M09M53P31J004Q23M16
53733B34534L13M11J71m05p64n77l6N66R68Q62K85r1L53J287J829J809J844K163
53715B45522K110J184l5n52j45N71J110J590K193K680K728K499K459K670K644
53700B69228K078J405J255J678K229K671L140L618L768L372K635J915J421J190
53686C01603J053O26k35j040j090l42N89J214J420J000k62j807k403j543k21K50
53670B98812k15o62m62Q2L56J35l70p89q28m24J75M79k5j430k935l233j892j07
53652B86667N69P9l28m1K59L6j71J34L92J3m63j39P79J318J198J012J129J315
$$ plain form
53767 280014 275845 271864 268286 264914 261484 258367 256222 255062 254257 253311 252031 250021 246792 242556 238347
53752 238347 235170 233317 232510 232300 232298 232368 232629 233006 232986 232204 231117 230552 230698 231107 231560 232291 233295 234118 234534
53733 234534 234847 235258 235429 235024 234260 233683 233647 234213 235181 236043 236328 236237 236590 237877 239706 241515 243359 245522
53715 245522 247632 248816 248781 248229 248084 248655 249765 251355 253548 256228 258956 261455 263914 266584 269228
53700 269228 271306 272711 273966 275644 277873 280544 283684 287302 291070 294442 297077 298992 300413 301603
53686 301603 302656 303282 303047 302007 300917 300575 301164 302378 303798 304798 304536 302729 300326 298783 298562 298812
53670 298812 298597 297935 297473 297555 297911 298046 297676 296887 296059 295635 295810 296289 296264 294834 291899 288666 286774 286667
53652 286667 287236 287315 286987 286946 287205 287241 287070 287204 287596 287609 287146 287007 287786 289104 290302 291314 292443 293758
53634B93758J357J291R99L07m02l62N91J768K478K735K886K982K831K491K401
53619C18111K908L709L995L417K686K761L537M024L895L974M769N429M951L773
53605C71939L147L372L624L358K931K791K915L082L008K244O70q45j142k45N49
53590D01398L61k79m47j14J12J6r7jJ91L41M14M34M71O22Q58R84Q79O22K61l71
53570D06655j433k759l881m357m118l529l080k875k540j768q60m00m96o24l46
53555C73589J73M85M39K84L40O98J189J562J737J855K066K314K479K629K947L456
53539C98242L975M356M596M720M748M814N148N828O704P587Q393R137R855J0653
53525D88756J1666J2886J4055J4853J5225J5434J5740J6095J6322J6536J7163
$$ plain form
53634 293758 295115 296406 297405 297712 297310 296948 297539 299307 301785 304520 307406 310388 313219 315710 318111
53619 318111 321019 324728 328723 332140 334826 337587 341124 345148 349043 353017 357786 363215 368166 371939
53605 371939 375086 378458 382082 385440 388371 391162 394077 397159 400167 402411 403081 402236 401094 400849 401398
53590 401398 401759 401480 401033 400919 401031 401047 400950 400949 401140 401481 401895 402329 402800 403422 404280 405264 406143 406765 407026 406655
53570 406655 405222 402463 398582 394225 390107 386578 383498 380623 378083 376315 375455 375055 374559 373935 373589
53555 373589 373762 374247 374686 374970 375310 376008 377197 378759 380496 382351 384417 386731 389210 391839 394786 398242
53539 398242 402217 406573 411169 415889 420637 425451 430599 436427 443131 450718 459111 468248 478103 488756
53525 488756 500422 513308 527363 542216 557441 572875 588615 604710 621032 637568 654731
53514F54731J8366J9794K1109K2486K4206K5964K7151K7687K8086K8537K8601
53503I26718K7896K6647K5328K4234K3627K3712K4097K3865K2646K1288K0911
53492A190969K1562K2284K2278K1584K0752K0301K0397K0747K0837K0469J9906
53481A422086J9380J8778J8012J7315J6858J6339J5306J3634J1430Q847O210L928
53469A588123J943k55k814n328p763j0772j4496j7786j9541k0144k0662k1192
53457A449313k1158k0772k0874k1455k1768k1913k2952k5063k6812k6880k5532
53446A194134k3879k2456k1250k0296j9570j8726j7531j6243j5078j3752j1940
53435I93413r792p589n277k770l75J500K744L427L758M349N950Q425J0528J1356
$$ plain form
53514 654731 673097 692891 714000 736486 760692 786656 813807 841494 869580 898117 926718
53503 926718 954614 981261 1006589 1030823 1054450 1078162 1102259 1126124 1148770 1170058 1190969
53492 1190969 1212531 1234815 1257093 1278677 1299429 1319730 1340127 1360874 1381711 1402180 1422086
53481 1422086 1441466 1460244 1478256 1495571 1512429 1528768 1544074 1557708 1569138 1577985 1584195 1588123
53469 1588123 1590066 1589811 1586997 1581669 1573906 1563134 1548638 1530852 1511311 1491167 1470505 1449313
53457 1449313 1428155 1407383 1386509 1365054 1343286 1321373 1298421 1273358 1246546 1219666 1194134
53446 1194134 1170255 1147799 1126549 1106253 1086683 1067957 1050426 1034183 1019105 1005353 993413
53435 993413 983621 976032 970755 967985 967610 969110 971854 975281 979039 983388 989338 997763 1008291 1019647
53421A019647J1646J2905J5499J8328K0349K1716K3216K5126K7013K8437K9513
53410A253395L0674L2028L3252L4191L5316L7169L9490M1450M2792M4204M6322
53399A670283M8921N1507N4191N7384O0783O3295O4096O3545O2867O3013O3786
53388B323671O4116O3339O2052O1274O0933N9745N6785N2539M8088M3906L9927
53377B936375L6153L2466K8252K3035J7351J2243P932L713r79o133j1799j8329
53365C060280k5714l3370m0968m8773n6692o3513o7774o9245o9071o8560o8247
53354B448353o7961o7363o6290o4866o3299o1584n9466n6904n4309n2144n0463
53343A783704m9119m8178m7696m7244m6178m4379m2192l9662l6417l2576k9097
$$ plain form
53421 1019647 1031293 1044198 1059697 1078025 1098374 1120090 1143306 1168432 1195445 1223882 1253395
53410 1253395 1284069 1316097 1349349 1383540 1418856 1456025 1495515 1536965 1579757 1623961 1670283
53399 1670283 1719204 1770711 1824902 1882286 1943069 2006364 2070460 2134005 2196872 2259885 2323671
53388 2323671 2387787 2451126 2513178 2574452 2635385 2695130 2751915 2804454 2852542 2896448 2936375
53377 2936375 2972528 3004994 3033246 3056281 3073632 3085875 3093807 3097520 3096541 3090408 3078609 3060280
53365 3060280 3034566 3001196 2960228 2911455 2854763 2791250 2723476 2654231 2585160 2516600 2448353
53354 2448353 2380392 2313029 2246739 2181873 2118574 2056990 1997524 1940620 1886311 1834167 1783704
53343 1783704 1734585 1686407 1638711 1591467 1545289 1500910 1458718 1419056 1382639 1350063 1320966
53332A320966k6768k5205k3404k1032j8633j6663j4935j3090j1226r806r222r448
53320A121534r955r971r036p364n490l684j951m49N82J328K371M019N971P740
53306A095645R116J0147J0984J1841J2796J3683J4478J5760J8125K1139K3622
53295A257336K5120K6426K8205K9976L1074L1886L3212L4772L5371L4374L2233
53284A599985K9588K6746K4048K1847J9814J7015J3170R248O361M377K101j366
53272A772934n805j0234j3723j5919j7142j8131j9577k1741k4365k6927k9032
53261A570338l0663l2017l3135l3798l3937l4024l4831l6669l8915m0295l9785
53250A182269l7480l4645l2695l1964l1671l0978k9785k8428k7154k6155k5666
$$ plain form
53332 1320966 1294198 1268993 1245589 1224557 1205924 1189261 1174326 1161236 1150010 1140204 1130982 1121534
53320 1121534 1111579 1101608 1092572 1085208 1079718 1076034 1074083 1073634 1074216 1075544 1077915 1081934 1087905 1095645
53306 1095645 1104761 1114908 1125892 1137733 1150529 1164212 1178690 1194450 1212575 1233714 1257336
53295 1257336 1282456 1308882 1337087 1367063 1398137 1430023 1463235 1498007 1533378 1567752 1599985
53284 1599985 1629573 1656319 1680367 1702214 1722028 1739043 1752213 1761461 1767822 1772199 1774300 1772934
53272 1772934 1767129 1756895 1743172 1727253 1710111 1691980 1672403 1650662 1626297 1599370 1570338
53261 1570338 1539675 1507658 1474523 1440725 1406788 1372764 1337933 1301264 1262349 1222054 1182269
53250 1182269 1144789 1110144 1077449 1045485 1013814 982836 953051 924623 897469 871314 845648
53239H45648k5567k5211k4115k2632k1478k0780j9972j8601j6729j4665j2653
53228F23245j0863r391q207p321o814o672o707o892p418q224q818q926q949r337
53214E08706r953j0467j0936j1350j1028r405p197n919o117o906p301p259p130
53201C97738o901o370n684n177m969m921m864m707m472m264m052l597k897k489
53187C32374k889l798m305l901k951k199k089k523l030l192l091l136l352l239
53173B88679k625k043j881j793j496j451j937k139j250Q7O10K76Nl5m28j022j014
53156B70543n43o63j439j751j264j002j406j467o30J5m94j349j359p74n15n42
53140B55360l70l32r05j418q84L52J109J208J429J835J561M06n81m94L18Q86P41
$$ plain form
53239 845648 820081 794870 770755 748123 726645 705865 685893 667292 650563 635898 623245
53228 623245 612382 602991 594784 587463 580649 573977 567270 560378 552960 544736 535918 526992 518043 508706
53214 508706 498753 488286 477350 466000 454972 445567 438370 432451 426334 419428 412127 404868 397738
53201 397738 390837 384467 378783 373606 368637 363716 358852 354145 349673 345409 341357 337760 334863 332374
53187 332374 329485 325687 321382 317481 314530 312331 310242 307719 304689 301497 298406 295270 291918 288679
53173 288679 286054 284011 282130 280337 278841 277390 275453 273314 272064 272151 272761 273037 273042 273007 272579 271557 270543
53156 270543 270000 269337 267898 266147 264883 263881 262475 261008 260378 260393 259899 258550 257191 256417 255902 255360
53140 255360 254990 254658 253753 252335 251451 251803 252912 254120 255549 257384 258945 259351 258770 258276 258594 259480 260221
53123B60221J68j93J25R43J543J554J418J606J764J266K59n29q53j110j561k091
53107B64530k597k957k771j798n91j9j86m59n68r02j666k371k413j744p93p6P5
53090B42694k38m88k95J14L22M10P82J374J599J109K61k56j2Q43J649J736J084
53073B52688K94k61p94j383j505q62j18kj82R1N29J21j091j749j011J96L94o24
53055B44731j700j758q54Q2K92j35n37n92n89p30o24N0P38N45n47j606j910j616
53037B33240j226r31o13j74K74L77j62j034j411r46l41m09r20j050o21j79L8L07
53019B24219O72P90O09M67M60L75K78N34J076J390J319J226J242J035M89n0l61
53002B35770n34n16j36L01J99l86p84p87q98j240j217n98k8O0J22N35Q42O48M34
$$ plain form
53123 260221 260389 260196 260321 261264 262807 264361 265779 267385 269149 270415 270674 270145 269292 268182 266621 264530
53107 264530 261933 258976 256205 254407 253816 253797 253611 253152 252584 251682 250016 247645 245232 243488 242695 242619 242694
53090 242694 242456 241968 241673 241787 242109 242519 243301 244675 246274 247383 247644 247388 247376 248219 249868 251604 252688
53073 252688 252982 252721 251927 250544 249039 248177 248059 248057 247875 247966 248495 248616 247525 245776 244765 244961 245355 244731
53055 244731 243031 241273 240419 240501 240793 240658 240121 239529 238940 238210 237586 237636 238374 238919 238372 236766 234856 233240
53037 233240 232014 231083 230470 230296 230570 230947 230785 229751 228340 227394 227053 226644 225724 224674 224053 223874 223912 224219
53019 224219 224891 225681 226290 226757 227217 227592 227870 228404 229480 230870 232189 233415 234657 235692 236181 236131 235770
53002 235770 235236 234720 234584 234885 235084 234698 233914 233127 232229 230989 229772 229174 229146 229206 229328 229863 230705 231353 231787
52983B31787O97R74O72J96L20R23J338J550J970K323J900R35N24J034J573J367
52967B50083P76M84M58K67p3k00j19k23p06j280j486j169o29l97p31j321j677
52950B42057j737j792j855j514n94M36R58Q81N22J72O2M32J161J488P53o34j494
52933B39302j300p45o44r02j029j104j481j860j468k70P83R46N10K06K80M91O22
52916B32337N53K01k71m54j99J17J22p4k00k08j20J68M78L10l97r12p12l07l55
52897B30077n27j09N99O45M3j30N71J279J211P33N13M16o7q45j389j503j412j270
52879B28835j064q21n98m02l17l99m11nO71J026R32R83J569K234K403K226K178
52862B39040K242K151K059K278K568K333J447L56o06j459k151k473k476k449k454
$$ plain form
52983 231787 232484 233458 234130 234326 234646 235569 236907 238457 240427 242750 244650 245585 246109 247143 248716 250083
52967 250083 250859 251343 251801 252068 251995 251795 251676 251453 250747 249467 247981 246812 246183 245786 245055 243734 242057
52950 242057 240320 238528 236673 235159 234565 235001 235959 236840 237362 237534 237596 238028 239189 240677 241430 240796 239302
52933 239302 238002 237257 236613 235711 234682 233578 232097 230237 228769 228499 229282 230228 230738 230944 231224 231715 232337
52916 232337 232890 233091 232820 232366 232167 232284 232406 232332 232132 231924 231804 231972 232450 232760 232363 231451 230739 230432 230077
52897 230077 229550 229441 230040 230685 230728 230598 231169 232448 233659 234392 234905 235321 235254 234409 233020 231517 230105 228835
52879 228835 227771 226950 226352 225950 225633 225234 224823 224818 225489 226515 227447 228430 229999 232233 234636 236862 239040
52862 239040 241282 243433 245492 247770 250338 252671 254118 254474 253868 252409 250258 247785 245309 242860 240406
52847B40406k251j841j620j813k137k218k023j678j179o11l50o36j084j021k92
52832B19652N83J109J283J295J226J226J556J991J630n1k048k668j585k69L7j16
52816B24851M99J833K733K770K747L310L993L953K942J257p19k536l738m265m476
52801B35154m585m394l722k745j709p61j65k34p66j050o70OM21M46K06k37p01
52784B14494p91m29m8M9J43N44J000J141J040Q73M28l74r03n30L12O11K30M0M77
52765B18307Q85O13M9pN00R30R36P63O58M81O4l88n82n61o42q69r34o77m22m73
52745B18631m69K72J759L061L277K466J377N50j5m55o43l06O62J987L079L493
52729B38726L309K900K282J106n69j911k235j916j856k236k382j874j116n96k39
$$ plain form
52847 240406 238155 236314 234694 232881 230744 228526 226503 224825 223646 223035 222685 222049 220965 219944 219652
52832 219652 220235 221344 222627 223922 225148 226374 227930 229921 231551 231500 229452 226784 225199 224930 224967 224851
52816 224851 225350 227183 229916 232686 235433 238743 242736 246689 249631 250888 250169 247633 243895 239630 235154
52801 235154 230569 226175 222453 219708 217999 217238 217073 216839 216073 215023 214353 214359 214780 215226 215432 215195 214494
52784 214494 213703 213274 213226 213275 213418 213962 214962 216103 217143 218016 218444 218070 217167 216637 216949 217560 217790 217830 218307
52765 218307 219192 219805 219854 219847 220347 221277 222213 222976 223634 224115 224179 223791 223209 222648 222006 221137 220203 219526 219104 218631
52745 218631 218162 218434 220193 223254 226531 228997 230374 230924 230909 230454 229811 229505 230167 232154 235233 238726
52729 238726 242035 244935 247217 248323 247754 245843 243608 241692 239836 237600 235218 233344 232228 231632 231393
52714B31393J94M94K68m36j192j737k099k327k447k604k751k345q77J210K663
52699B17407K783K143J613J255O83L7j59Nr0n48p13j52P69J542K049K213J821
52682B32658J055N06K12m93j672k187j290pJ51o75j069n18J22K81M19R15J328
52665B29736J272J085J169J394J597J927K319K274J660J111J231J918K760L528
52651B54981L873L244J536o01k527m107n142n030l543j441K12R66Q87J54p54j077
52635B41631o25j46k78n46L3J664L643N137N548M597K585L53j516l071m281m515
52619B50213l472k009j260j259j188p65m69o08r20j039p40J58J481K443K363J550
52603B44479Q69N91L56J08K48Q30J371J523J340Q46j0q69j114o21R5N79P88O85
$$ plain form
52714 231393 231587 232081 232349 231913 230721 228984 226885 224558 222111 219507 216756 214411 213534 214744 217407
52699 217407 220190 222333 223946 225201 225884 225921 225762 225767 225677 225129 224416 224264 225033 226575 228624 230837 232658
52682 232658 233713 234219 234431 233938 232266 230079 228789 228782 228933 228258 227189 226671 226793 227074 227493 228408 229736
52665 229736 231008 232093 233262 234656 236253 238180 240499 242773 244433 245544 246775 248693 251453 254981
52651 254981 258854 262098 263634 263033 260506 256399 251257 246227 242684 241243 241455 242421 243308 243462 242708 241631
52635 241631 241006 240860 240582 240036 240069 241733 245376 250513 256061 260658 263243 263596 262080 259009 254728 250213
52619 250213 246741 244732 243472 242213 241025 240260 239791 239183 238263 237224 236484 236642 238123 240566 242929 244479
52603 244479 245348 245939 246295 246403 246651 247481 248852 250375 251715 252561 252551 251682 250568 249947 250042 250621 251409 252094
52585B52094K06l18k74M26J179J489J439J221P50K5n93p74n99k52K52P67P80p8
52567B57740j436k424k507j900j199p21l19J94N79L81m21j222j436j063m60J09
52551B43895M56L68n9l05o1K54R1m31p79q11p19m54J47P40P51K86Q9M72R60J119
52531B46009J106J147J107Q78O61N41K08n21j191j160m13L88O74N29N11R82J711
52514B53167K134K033J727J561J479J329J302J671K282K620K320J367j6j344k007
52499B71625j875j559j684k052k030j540j124j107j250j205r08m76j01J7j1L06
52483B55026J168K021K219J863J496J228Q63N60N79O24L02N6O41J734K136J501
52467B74017P96Q34J337J832K467L322L759L181J874N42n17j312j832k302l197
$$ plain form
52585 252094 252300 251982 251708 252134 253313 254802 256241 257462 258212 258237 257644 256870 256271 256019 256271 257038 257818 257740
52567 257740 256304 253880 251373 249473 248274 247553 247234 247428 248007 248388 247967 246745 245309 244246 243786 243895
52551 243895 244351 244719 244660 244355 244294 244548 244639 244208 243429 242618 241899 241445 241592 242332 243083 243369 243458 243930 244890 246009
52531 246009 247115 248262 249369 250247 250908 251449 251657 251136 249945 248785 248372 248760 249434 249963 250474 251456 253167
52514 253167 255301 257334 259061 260622 262101 263430 264732 266403 268685 271305 273625 274992 274976 273632 271625
52499 271625 269750 268191 266507 264455 262425 260885 259761 258654 257404 256199 255291 254815 254714 254731 254720 255026
52483 255026 256194 258215 260434 262297 263793 265021 265884 266444 267023 267647 267949 268005 268646 270380 272516 274017
52467 274017 274813 275647 276984 278816 281283 284605 288364 291545 293419 293961 293444 292132 290300 287998 284801
52452B84801m453n148m533l051j787j323j506j963k272j933p61P86K027K573K350
52437B63807J423J06j059j770k148k303k101j538r25m07K11R15J256J043P18O47
52421B57875N47J00l50k61L26J006J609K106K244J965J840K485L690M747N561
52406B85490O777Q836J1272J3042J3165J1137P183K163k872p063r761j0568r723
52393C19078q164o759n580m150k348p32o1n86j665k175j563n62l55j019j376o43
52377B81340N72J315J616K022K497K600K427K493K854L139L304L563L602K755
52363C16099J122j97l39L23P05K08q52j700j789j136k26M50O69M40o7m51l02K52
52345C13209O16N54N94J233K164K731K842K828K751K463K181K282K703L127L629
$$ plain form
52452 284801 280348 275200 270667 267616 265829 264506 263000 261037 258765 256832 256071 256857 258884 261457 263807
52437 263807 265230 265336 264277 262507 260359 258056 255955 254417 253492 253085 253296 254211 255467 256510 257228 257875
52421 257875 258422 258522 258172 257911 258237 259243 260852 262958 265202 267167 269007 271492 275182 279929 285490
52406 285490 292267 301103 312375 325417 338582 349719 356902 359065 356193 349130 339369 328801 319078
52393 319078 310914 304155 298575 294425 292077 291345 291284 290698 289033 286858 285295 284733 284378 283359 281983 281340
52377 281340 281912 283227 284843 286865 289362 291962 294389 296882 299736 302875 306179 309742 313344 316099
52363 316099 317221 317024 316685 317008 317713 317921 317069 315369 313580 312444 312218 312668 313337 313777 313710 313259 312957 313209
52345 313209 313825 314379 314973 316206 318370 321101 323943 326771 329522 331985 334166 336448 339151 342278 345907
52330C45907M438N252N516N433N859P055Q310R079R658J0339J0613R910Q695P999
52316D54063Q063Q059P337O395O288P306Q649R455R792J0314J1135J1602J1318
52303E69776J0808J0836J1477J2256J2844J3089J2745J1792J0832J0364R844Q286
52291G04949N813L731K820K391J479K29m97l96K4J78j42q21j423j337m17O56J059
52274G18296Q28O88R39J076P12L78J009K695M345M684L447J608N04Q01K149L670
52258G47829M715N385O351Q047J0013J1300J1573J1479J1665J1806J1098R503
52246H60764P874O793N952M850L596K580J810J055M44L55P41R82N70l25j137j552
52230H95352j773k208k969l701l880l338k478j868j688j631j404j158j333k078
$$ plain form
52330 345907 350345 355597 361113 366546 372405 379460 387770 396849 406507 416846 427459 437369 446064 454063
52316 454063 462126 470185 477522 483917 490205 497511 506160 515615 525407 535721 546856 558458 569776
52303 569776 580584 591420 602897 615153 627997 641086 653831 665623 676455 686819 696663 704949
52291 704949 710762 714493 717313 719704 721183 721412 720915 720519 720543 720721 720579 719758 718335 716998 716581 717237 718296
52274 718296 719124 719812 720751 721827 722539 722917 723926 726621 730966 735650 739097 740705 741209 742010 744159 747829
52258 747829 752544 757929 764280 772327 782340 793640 805213 816692 828357 840163 851261 860764
52246 860764 868638 875431 881383 886233 889829 892409 894219 895274 895718 896073 896814 897796 898366 898041 896904 895352
52230 895352 893579 891371 888402 884701 880821 877483 875005 873137 871449 869818 868414 867256 865923 863845
52216H63845k986l426l064k035o34Q94K278L116L123K495J802J454J394J436J654
52201H71346K250L051L599L790M166N203O546P325P237O828O659O514N801M381
52187I44696K679J154q7j177k307l530m616n216n359n488n790n863n434m976n071
52172H93615n459n442m976m561m149l169j664m06L41J180K261K643J715L87pN57
52156H72866J056R50N05om79n36K06J410K277K546K522K268J479K95n67p11m99
52139H85582m73q40j575k501l019k459r37N67J320J611K181L265M573N942P560
52124I00797R521J1398J2439J2342J1753J1730J2513J3283J3352J3161J3452J3964
52112A049705J3825J3001J2392J2349J2164J1343J0466J0284J0643J0995J1358
$$ plain form
52216 863845 860859 857433 854369 852334 851700 852594 854872 857988 861111 863606 865408 866862 868256 869692 871346
52201 871346 873596 876647 880246 884036 888202 893405 899951 907276 914513 921341 928000 934514 940315 944696
52187 944696 947375 948529 948442 947265 944958 941428 936812 931596 926237 920749 914959 909096 903662 898686 893615
52172 893615 888156 882714 877738 873177 869028 865859 864195 863789 864130 865310 867571 870214 871929 872316 872309 872866
52156 872866 873922 874872 875377 875371 874892 874356 874562 875972 878249 880795 883317 885585 887064 887359 886792 886081 885582
52139 885582 885109 884269 882694 880193 877174 874715 873778 874345 875665 877276 879457 882722 887295 893237 900797
52124 900797 910318 921716 934155 946497 958250 969980 982493 995776 1009128 1022289 1035741 1049705
52112 1049705 1063530 1076531 1088923 1101272 1113436 1124779 1135245 1145529 1156172 1167167 1178525
52101A178525J2086J3058J3766J3897J3284J1552Q532M875J542j284m129o989
52089A258715q940r356q884q659q804q373o803m835l682l656m105m460m807n303
52075A168048n660n587n346n307n182m303k687j185l49L26J666L672N459O274
$$ plain form
52101 1178525 1190611 1203669 1217435 1231332 1244616 1256168 1264700 1269575 1271117 1269833 1265704 1258715
52089 1258715 1249775 1240419 1231535 1222876 1214072 1205699 1198896 1194061 1190379 1186723 1182618 1178158 1173351 1168048
52075 1168048 1162388 1156801 1151455 1146148 1140966 1136663 1133976 1132791 1132442 1132768 1134434 1138106 1143565 1149839
$$ [...]
##END NTUPLES=NMR SPECTRUM
##END=
