
##TITLE=UV1205_M3_1292-1211_7185422_fYbKX7pQcl
##JCAMPDX= 6.0         $$ Bruker NMR JCAMP-DX V2.0
##DATA TYPE= NMR SPECTRUM
##DATA CLASS= NTUPLES
##ORIGIN= BRUKER
##OWNER= Administrator
$$ 1.72 TOPSPIN		Version 2.1
$$ 2012-12-05 20:14:34.289 -0500  Administrator@X
$$ Compression mode = diff/dup
##.OBSERVE FREQUENCY= 400.02188249412
##.OBSERVE NUCLEUS= ^1H
##.ACQUISITION MODE= SIMULTANEOUS (DQD)
##.ACQUISITION SCHEME= undefined
##.AVERAGES= 8
##.DIGITISER RES= 22
##SPECTROMETER/DATA SYSTEM= spect
##.PULSE SEQUENCE= zg30
##.SOLVENT NAME= COFFEE_meoh
##.SHIFT REFERENCE= INTERNAL, COFFEE_meoh, 1, 14.98509
##AUDIT TRAIL= $$ (NUMBER, WHEN, WHO, WHERE, PROCESS, VERSION, WHAT)
$$ ##TITLE= Audit trail, TOPSPIN		Version 2.1
$$ ##JCAMPDX= 5.01
$$ ##ORIGIN= Bruker BioSpin GmbH
$$ ##OWNER= Administrator
$$ $$ E:\/data/COFFEE/nmr/UV1205_M3_1292-1211_7185422_fYbKX7pQcl/10/pdata/1/auditp.txt
$$ ##AUDIT TRAIL=  $$ (NUMBER, WHEN, WHO, WHERE, PROCESS, VERSION, WHAT)
(   1,<2012-12-05 20:14:25.923 -0500>,<Administrator>,<X>,<go>,<TOPSPIN 2.1>,
      <created by zg
	started at 2012-12-05 20:13:19.907 -0500,
	POWCHK enabled, PULCHK disabled,
       configuration hash MD5:
       86 BA 57 50 F2 9D 5C 9B 26 00 A9 28 5F 66 2E 89
       data hash MD5: 64K
       35 83 3F B8 9A 1E CD 8A BB 81 04 A2 FD 3E C9 FF>)
(   2,<2012-12-05 20:14:29.032 -0500>,<Administrator>,<X>,<proc1d>,<TOPSPIN 2.1>,
      <Start of raw data processing
       efp LB = 0 FT_mod = 6 PKNL = 1 PHC0 = 0 PHC1 = 0 SI = 32K 
       data hash MD5: 32K
       94 01 C1 B8 6B F5 03 68 19 AC 6E 46 94 40 38 8C>)
(   3,<2012-12-05 20:14:29.532 -0500>,<Administrator>,<X>,<proc1d>,<TOPSPIN 2.1>,
      <pk PHC0 = 100.5688 PHC1 = 0 
       data hash MD5: 32K
       3D 88 82 76 E4 42 7E 68 13 40 65 E3 DB 2E BB 74>)
(   4,<2012-12-05 20:14:29.782 -0500>,<Administrator>,<X>,<proc1d>,<TOPSPIN 2.1>,
      <abs ABSG = 1 
       data hash MD5: 32K
       E4 F7 F8 A9 CE 3C 97 D4 79 3A 6F AE D7 4A 50 38>)
(   5,<2012-12-05 20:14:29.923 -0500>,<Administrator>,<X>,<proc1d>,<TOPSPIN 2.1>,
      <abs ABSG = 2 
       data hash MD5: 32K
       99 C0 A7 A9 60 60 0C 8F 8E F9 FF E1 3C 4B 0C A6>)
(   6,<2012-12-05 20:14:30.079 -0500>,<Administrator>,<X>,<proc1d>,<TOPSPIN 2.1>,
      <abs ABSG = 3 
       data hash MD5: 32K
       51 23 6F 91 2D 57 B4 0B F8 E9 B3 28 CB 8F 72 ED>)
(   7,<2012-12-05 20:14:30.220 -0500>,<Administrator>,<X>,<proc1d>,<TOPSPIN 2.1>,
      <abs ABSG = 4 
       data hash MD5: 32K
       AA E5 5A EA 30 6D 7E BC C6 A4 2E EA E7 A1 74 F5>)
(   8,<2012-12-05 20:14:30.376 -0500>,<Administrator>,<X>,<proc1d>,<TOPSPIN 2.1>,
      <abs ABSG = 5 
       data hash MD5: 32K
       E5 ED 56 DB 12 A6 02 B8 B1 30 92 FC E1 FE A1 00>)
$$ ##END=
$$ 
$$ $$ hash MD5
$$ $$ 31 75 F7 F6 06 CF B4 5F AD F1 84 7A 70 73 32 06
##$RELAX= 
##$RELAX= 
##$RELAX= 
##$RELAX= 
##$RELAX= 
##$RELAX= 
##$RELAX= 
$$ Bruker specific parameters
$$ --------------------------
##$DU= <E:\>
##$EXPNO= 10
$$ [...]
##$TP= (0..7)
150 150 150 150 150 150 150 150
##$TP07= 0
##$TPNAME0= <>
##$TPNAME1= <>
##$TPNAME2= <>
##$TPNAME3= <>
##$TPNAME4= <>
##$TPNAME5= <>
##$TPNAME6= <>
##$TPNAME7= <>
##$TPOAL= (0..7)
0.5 0.5 0.5 0.5 0.5 0.5 0.5 0.5
##$TPOFFS= (0..7)
0 0 0 0 0 0 0 0
##$TUNHIN= 0
##$TUNHOUT= 0
##$TUNXOUT= 0
##$USERA1= <user>
##$USERA2= <user>
##$USERA3= <user>
##$USERA4= <user>
##$USERA5= <user>
##$V9= 5
##$VALIST= <valist>
##$VCLIST= <CCCCCCCCCCCCCCC>
##$VD= 0
##$VDLIST= <DDDDDDDDDDDDDDD>
##$VPLIST= <PPPPPPPPPPPPPPP>
##$VTLIST= <TTTTTTTTTTTTTTT>
##$WBST= 1024
##$WBSW= 4
##$XGAIN= (0..3)
0 0 0 0
##$XL= 0
##$YL= 0
##$YMAX_a= 679696
##$YMIN_a= -579658
##$ZGOPTNS= <>
##$ZL1= 120
##$ZL2= 120
##$ZL3= 120
##$ZL4= 120
##$ABSF1= 14.98509
##$ABSF2= -5.573092
##$ABSG= 5
##$ABSL= 3
##$ALPHA= 0
##$AQORDER= 0
##$ASSFAC= 0
##$ASSFACI= 0
##$ASSFACX= 0
##$ASSWID= 0
##$AUNMP= <proc_prof1d_extract_pilot.lims>
##$AXLEFT= 0
##$AXNAME= <>
##$AXNUC= <1H>
##$AXRIGHT= 0
##$AXTYPE= 0
##$AXUNIT= <>
##$AZFE= 0.1
##$AZFW= 0.1
##$BCFW= 0
##$BC_mod= 0
##$BYTORDP= 0
##$COROFFS= 0
##$CY= 15
##$DATMOD= 1
##$DC= 0
##$DFILT= <>
##$DTYPP= 0
##$F1P= 0
##$F2P= 0
##$FCOR= 0.5
##$FTSIZE= 32768
##$FT_mod= 6
##$GAMMA= 0
##$GB= 0
##$INTBC= 1
##$INTSCL= 1
##$ISEN= 128
##$LB= 0
##$LEV0= 0
##$LPBIN= 0
##$MAXI= 10000
##$MC2= 0
##$MEAN= 0
##$ME_mod= 0
##$MI= 0
##$NCOEF= 0
##$NC_proc= -8
##$NLEV= 6
##$NOISF1= 0
##$NOISF2= 0
##$NSP= 0
##$NTH_PI= 0
##$NZP= 0
##$OFFSET= 14.98509
##$PC= 1
##$PHC0= 100.5688
##$PHC1= 0
##$PH_mod= 1
##$PKNL= yes
##$PPARMOD= 0
##$PPDIAG= 0
##$PPIPTYP= 0
##$PPMPNUM= 2147483647
##$PPRESOL= 1
##$PSCAL= 4
##$PSIGN= 0
##$PYNMP= <proc.py>
##$REVERSE= no
##$SF= 400.02
##$SI= 32768
##$SIGF1= 0
##$SIGF2= 0
##$SINO= 400
##$SIOLD= 32768
##$SPECTYP= <>
##$SREGLST= <1H.CDCl3>
##$SSB= 0
##$STSI= 32768
##$STSR= 0
##$SW_p= 8223.68421052631
##$SYMM= 0
##$S_DEV= 0
##$TDeff= 65536
##$TDoff= 0
##$TI= <>
##$TILT= no
##$TM1= 0
##$TM2= 0
##$TOPLEV= 0
##$USERP1= <user>
##$USERP2= <user>
##$USERP3= <user>
##$USERP4= <user>
##$USERP5= <user>
##$WDW= 1
##$XDIM= 32768
##$YMAX_p= 466802348
##$YMIN_p= -724277
##$CURPLOT= <Network HP LaserJet P1505>
##$CURPRIN= <$Network HP LaserJet P1505>
##$DFORMAT= <normdp>
##$LAYOUT= <+/1D_H.xwp>
##$LFORMAT= <normlp>
##$PFORMAT= <normpl>
##$SURQMSG= 1
$$ End of Bruker specific parameters
$$ ---------------------------------
##NTUPLES= NMR SPECTRUM
##VAR_NAME=  FREQUENCY,     SPECTRUM/REAL,   SPECTRUM/IMAG
##SYMBOL=    X,             R,               I
##VAR_TYPE=  INDEPENDENT,   DEPENDENT,       DEPENDENT
##VAR_FORM=  AFFN,          ASDF,            ASDF
##VAR_DIM=   32768,         32768,           32768
##UNITS=     HZ,            ARBITRARY UNITS, ARBITRARY UNITS
##FACTOR=    0.250966925370066, 1,           1
##FIRST=     8223.43324360094, 94571,        -37964
##LAST=      0,             121246,          -19184
##MIN=       0,             -724277,         0
##MAX=       8223.43324360094, 466802348,    0
$$ Real data points
##PAGE= N=1
##DATA TABLE= (X++(R..R)), XYDATA
$$ [...]
19522a92410h23j47276A34277a29622A25149f0113k02565A8659f4574l40404J31028
19511b73950H04a8933j91481c9292j45852I6752A8617h8080A35885a0716D3982
19499A11167E2065c1654j38111A68388J42716c10222B2985b40291K1107l7492
19489b56676R6084e2076A57770J05026c46891L7691a681G2355a38794C0227K39366
19478B69593g6373L1775j48294h2935r36c1224j86184h4677F4239c7276j35589
19467a72865N8694o132e3787D6260c81113G3946c13567H3725K8274J89135b62885
19455d26442J42307F2874C0371N7618a74774k5228E7065b82649a00630k9391A41154
19443b6945j89462G9674a42055I9841B3815J05187a86626G5011K09082b2519j52941
$$ y = [-192410, -823, -148099, 134277, -129622, 125149, -60113, -262678, 18659, -64574, -404978, -273950, 804, -18933, -210414, -39292, -185144, 96752, 18617, -88080, 135885, -10716, 43982, 111167, 52065, -31654, -169765, 168388, 311104, -310222, 22985, -240291, -219184, -256676, -160592, -52076, 157770, 262796, -346891, -309200, -1681, 72355, -138794, 30227, 269593, -76373, -44598, -192892, -82935, -83871, -31224, -217408, -84677, 64239, -37276, -172865, -114171, -120303, -53787, 46260, -381113, 73946, -313567, 83725, 111999, 301134, -262885, -426442, -284135, 62874, 30371, 87989, -174774, -200002, 57065, -282649, -100630, -130021, 141154, -26945, -216407, 79674, -142055, 99841, 23815, 129002, -186626, 75011, 284093, -22519, -175460]
19432a75460F016J96185I4269d5798k3769j91259A4174c77320J42469a17221j30353
19421b47574M3188P3432A02147a57759A78647b60018C12332L9473a09957A88662
19410A76080J9784a49284A53360c45219A6843i7708A7041c574A19770C4003J3012
19399D7015J94665a56054C9379a1470q7140E9642a43084l1500G7076C3546J2402
19388D5948i5230a7901l31721a60960c4965o3599k8695k77280a4758A83835a27812
19376B54673H1277P508b49222J10188j0786K4955D19763a57776C53019A15667
19365g87C4994a7887A51349g5690A17838e05617P1674b11044k21839J34246N4548
19354b44089J12564H9846f7819q5071K8720q4218P7873H6429j3365g7385j4059
$$ y = [-175460, 6016, 202201, 94269, -45798, -69567, -260826, 14174, -377320, -234851, -117221, -247574, -204386, -130954, 102147, -157759, 178647, -260018, 312332, 351805, -109957, 188662, 176080, 195864, -149284, 153360, -345219, 16843, -97708, 17041, -3574, 119770, 34003, 47015, 241680, -156054, 39379, -11470, -98610, 59642, -143084, -174584, 77076, 33546, 45948, -95230, -17901, -349622, -160960, -34965, -98564, -127259, -404539, -14758, 183835, -127812, 254673, 81277, 88785, -249222, -139034, -149820, -124865, 419763, -157776, 353019, 115667, -787, 34994, -17887, 151349, -75690, 117838, -505617, -433943, -211044, -432883, -298637, -244089, -131525, 89846, -67819, -152890, -124170, -208388, -130515, 86429, 73064, -77385, -91444]
19343i1444B132b80485q9691a38210L6737H7580A8170c2020p5488B16117d09681
19331b74474e7302k05182E7271b07997p4673l2546E4434b0361C8105J15669a63904
19319h4953B20733q4027K3993a09206d8675o465j29767A54223J63011a65528o6866
19308b32394c6540k32431b5696C6627M7366d7488j45267A68021A6613a81348H9722
19296c2557j02850B77527g5367H659b14126a4403m8505A15339J62741a08809m2379
19285a51188K9030k33316C28094A9844J93644e9044A38877D2682j1200O4847a39315
19273b33303M7836I2236a45247H2007R8336h0925j50307d9704A03669b38148A697
19261h4412C276b29035c9524n05599B95394c32138r4768a29691B47327I9526a37684
$$ y = [-91444, 2132, -280485, -370176, -138210, -101473, 87580, 18170, -32020, -107508, 216117, -409681, -274474, -57302, -262484, 57271, -207997, -282670, -315216, 54434, -20361, 38105, 153774, -163904, -84953, 220733, 136706, 160699, -109206, -48675, -55140, -184907, 154223, 317234, -165528, -232394, -36540, -268971, -25696, 36627, 83993, -47488, -192755, 168021, 16613, -181348, 89722, -32557, -135407, 277527, -75367, 8659, -214126, -14403, -62908, 115339, 278080, -108809, -151188, -122158, -355474, 328094, 19844, 213488, -59044, 138877, 42682, 31482, 96329, -139315, -233303, -185467, 92236, -145247, 82007, 180343, -80925, -231232, -49704, 103669, -238148, 1697, -84412, 3276, -229035, -39524, -545123, 295394, -332138, -426906, -129691, 247327, 99526, -137684]
19249d3167I7864l2728a65984e0086B42340a15604B7900c38262o033J23825I3834
19237b40096h7776J3510A4843b80194c1550k07718A9663c49017b9258B87621a27714
19225E8333f3069p9384B6062d704C0249K47208b3265j01234e9968C3841J50790
19214A84631a54520m0630C9537a09036G263a53167k47527J95553G993c1983j51881
19203a83864G5685a04721a8842m427l27011a37451r680A32871L6901a03775I5195
19191b4003r5317N3884J8240G5677A2057K79455a77952I869J5548e1100A28550
19179G3207M9396J20185f6771k28889G2938a02957n8380A61830N8935m9517a3297
19167a84456B31107A6218b9652k29206b2052j37779K2142p740A31385h5460D2147
$$ y = [-43167, 97864, 65136, -165984, -50086, 242340, -115604, 27900, -338262, -344295, -220470, 93834, -240096, -87776, -74266, 14843, -280194, -31550, -239268, 19663, -349017, -29258, 287621, -127714, 58333, -63069, -142453, 26062, -4704, 30249, 277457, -23265, -124499, -59968, 33841, 184631, -154520, -195150, 39537, -109036, 7263, -153167, -400694, -205141, 7993, -31983, -183864, 75685, -104721, -18842, -23269, -350280, -137451, -147131, 132871, 169772, -103775, 95195, -24003, -119320, -65436, -47196, 75677, 12057, 291512, -177952, 9869, 25417, -51100, 128550, 73207, 122603, 242788, -66771, -295660, 72938, -102957, -161337, 161830, 220765, 171248, -13297, -184456, 231107, 16218, -29652, -258858, -22052, -159831, -137689, -145429, 131385, -85460, 42147]
19155b1754C4679h0015A67474a01497o6367A5696e4817j1859B46981E5980c07266
19143A01612e3241H4190B0526a44986M7478Q374B2212L4901J24611d3104A63995
19131A04741b57287c8654k3336H9415L5841a29793e0487H6292J395h0930C26256
19119B296d25287f4947B4059b99979h1079j56727A969R3187b31486i691j30224
19108a39915c4476k53837p670e5166j67498B38898j12315P4603c76844a20870
19097G078K7159E09i3728A22887a25252e0901o245j28964b7653E1346k1941b65438
19084i9396E718R738b09717c3791D9771e3645j30801F7125i0977j03408b0338
19072b70828R2895N3823M8822A7060c30505a21673J3273j23554j85915B3966J26843
$$ y = [-21754, 34679, -80015, 167474, -101497, -167864, 15696, -54817, -66676, 246981, 55980, -307266, 101612, -53241, 84190, 20526, -144986, -97508, -89134, 22212, 57113, 181724, -43104, 163995, 104741, -257287, -38654, -61990, 89415, 125256, -129793, -50487, 86292, 87687, -80930, 326256, 2296, -425287, -64947, 24059, -299979, -81079, -237806, 1969, 95156, -231486, -9691, -139915, -34476, -288313, -295983, -55166, -222664, 238898, 126583, 201186, -376844, -120870, 7078, 34237, 509, -93728, 122887, -125252, -50901, -57146, -186110, -27653, 51346, 29405, -265438, -99396, 5718, 15456, -209717, -33791, 49771, -53645, -184446, 67125, -90977, -194385, -20338, -270828, -177933, -124110, -75288, 17060, -330505, -121673, -108400, -231954, -417869, 23966, 150809]
19061A50809b00356K9001c186D5385a44618B49709F4353c1379F402a87415l0944
19050b18359m1551B49199n7498p2612i9003l23738a21153e7627C0902d8903B14245
19038A6689R2397a9818j4811H0977b3424c754m62783A94053n0560a49198A26184
19026G0884M5876a25174G4545l2178M6469i1329C88428e7359E4915c0721j65240
19015a95961a0143F3384a18087j06401A9293a1307j04497F3407R1563a52759l28016
19004d80775C99860B7618N1033e3957B8140M6837b09475M2241B23391J51162a93707
18992a98095i7278A11870b41191e3104l2177n3951A17698J96594A2550a91171
18981A55084a55257G0416J93077A15932Q3568c1632A46922b57919F9756J52756
$$ y = [150809, -200356, -171355, -3186, 45385, -144618, 249709, 64353, -31379, 6402, -187415, -218359, -259910, 249199, 191701, 119089, -99003, -422741, -121153, -57627, 30902, -48903, 214245, 16689, 109086, -19818, -34629, 80977, -23424, -3754, -466537, 194053, 143493, -149198, 126184, 70884, 116760, -125174, 74545, 42367, 88836, -91329, 388428, -57359, 54915, -30721, -195961, -10143, 63384, -118087, -224488, 19293, -11307, -115804, 63407, 154970, -152759, -480775, 399860, 27618, 78651, -53957, 28140, 74977, -209475, -167234, 223391, 374553, -193707, -198095, -97278, 111870, -241191, -53104, -85281, -139232, 117698, 314292, 12550, -191171, 155084, -155257, 70416, 263493, 115932, 199500, -31632, 146922, -257919, 69756, 222512]
18971B22512a07596p050B11797d0443k03449i3976A91069L8025m0439a21426B68897
18959G4503a44240B80151p9268B120a05942A32047B3186k774R1993l0675c78790
18947D5591a79792k07727a35384d2301j75604l9591E7006h6497j17634J5337k66463
18936d55257a12043p5880l5638C78671i3861K3390a8058A37689c36808e3137B32849
18924a50444E4033a85986f7342B9609a58268A76392m1339b06003B19617a67398
18913A88668a65077L2608q1627M5989i914r7313j34791M6177A25813a24030H6544
18901a76568F8915a32607c0073J2129o0078q0095o0722D36846g5066K4937k7247
18890g7376K1522l7834k21872q7328i6089I0824A3583a89871B82523I0041a79542
$$ y = [222512, -107596, -114646, 211797, -40443, -243892, -93976, 191069, 229094, 188655, -121426, 268897, 74503, -144240, 280151, 200883, 2120, -105942, 132047, 23186, 20412, 112405, 81730, -378790, 45591, -179792, -387519, -135384, -42301, -217905, -257496, 57006, -86497, -204131, -188794, -455257, -112043, -187923, -223561, 378671, -93861, -70471, -18058, 137689, -336808, -53137, 232849, -150444, 54033, -185986, -67342, 29609, -158268, 176392, 135053, -206003, 219617, -167398, 188668, -165077, -132469, -214096, -168107, -9914, -107227, -242018, -195841, 125813, -124030, 86544, -176568, 68915, -132607, -30073, -17944, -78022, -158117, -218839, 436846, -75066, -50129, -77376, -55854, -93688, -315560, -402888, -96089, 90824, 13583, -189871, 282523, 90041, -179542]
18878E86925c3604I8377Q2450m0092b25366i8233n5054B40168e6767a9619l12524
18867c32143P5706J11695d2124l02965a24387B28891b46890N8639k22931H2721
18856b10812A15961D1984M3028K78030F8904b16424B01504a14475I6339h0496
18845B94669h584B70405K35580a53505E7772c28857a07671j81246J35565d3853
18834b8018A35454C2493d7225j67523i9757J9631j5938b7744m6054j75712K1856
18823b27654r0000R5475E7832a3001r3396E26462a02355j1310b6460J690B27729
18811b54578a06422C46160C5763Q0819A5519J48682a94160h7395B730J24240b73227
18799a88585O9371o1686P7171j81459P6732D330a64045A15333c55465A39542o400
$$ y = [586925, -33604, 98377, 180827, 140735, -225366, -98233, -153287, 240168, -56767, -19619, -332143, -256437, -144742, -42124, -345089, -124387, 228891, -246890, -188251, -411182, 82721, -210812, 115961, 41984, 85012, 363042, 68904, -216424, 201504, -114475, 96339, -80496, 294669, -8584, 270405, 505985, -153505, 57772, -328857, -107671, -288917, -153352, -43853, -28018, 135454, 32493, -47225, -214748, -99757, -80126, -96064, -27744, -73798, -249510, -227654, -317654, -222179, 57832, -13001, -106397, 526462, -102355, -113665, -26460, -24770, 227729, -254578, -106422, 346160, 35763, 116582, 15519, 164201, -194160, -87395, 2730, 126970, -273227, -188585, -119214, -180900, -103729, -285188, -208456, 4330, -164045, 115333, -355465, 139542, 133142]
18788A33142a43420j29584O2390j12852E7344a28257N5313k03254B84316a72569
18777A69507D7602N1830i6103B14407J39340b39331R2710n8107I9385b23095F6672
18765d111j12549J951d773l7627n7547r8183e6963m4732B7717b69184B9330O1276
18753I0606b2080I0107b80599B92556a61886O3940A9552K10454g8632A89334a87032
18741e6886K1308j42850e3050D6787j6747c66009d5057p2022a4523r8452r4918
18730b07893B20594I0482A2226J83428e0607m4027k426m8056G4990N36R4194J7014
18718A86734p3727b02239l30668B99712A4581O0726a44339m9979J4267C1296j1193
18707B0103K44011D1226d9625q0610m3831c90A37556d14265b03158f5065O350
$$ y = [133142, -143420, -273004, -210614, -323466, 57344, -128257, -72944, -276198, 284316, -172569, 169507, 47602, 99432, -96103, 214407, 353747, -239331, -146621, -204728, 99385, -223095, 66672, -4111, -116660, -114709, -4773, -42400, -99947, -198130, -56963, -101695, 27717, -269184, 29330, 90606, -22080, 90107, -280599, 292556, -161886, -97946, 19552, 230006, -78632, 189334, -187032, -56886, -35578, -178428, -53050, 46787, 30040, -366009, -45057, -117079, -14523, -112975, -207893, 220594, 90482, 12226, 195654, -50607, -94634, -97060, -145116, 74990, 75526, 169720, 186734, 113007, -202239, -532907, 299712, 14581, 75307, -144339, -194318, -180051, 31296, 20103, 264114, 41226, -49625, -130235, -174066, -390, 137556, -414265, -203158, -65065, -58715]
18696e8715n4646j65035c6409B30039E9475a19999D1419K36803b40389F362K39167
18685B45529a81686B66691b00651m3810A81638J7275q1895a2993p3549j5663A38353
18673B14233r0345k4533a62659A882a31754k29879l0049A62896m1774Q7811i7289
18661C2619b57497B46821j00025i6585j74077i7261o7630D1764l35c29849C91023
18649b79241g2611k2028D496a41566B15701H4477c70411d3425j35896h3214j70005
18638b53219h9759E0153a12833E2934i0020A36724D1832L55463b6079m41529J42998
18627c24610e0528p8004j8988H2705J73117b93484a13110E4151b09244c5815p6038
18616a11853l0689H0586a11386K2438j58729A83588a12446j90656R6457d7336
$$ y = [-58715, -113361, -278396, -36409, 230039, 59475, -119999, 41419, 278222, -240389, 6362, 245529, -181686, 266691, -200651, -244461, 181638, 198913, 117018, -12993, -86542, -102205, 138353, 214233, 123888, 99355, -162659, 1882, -131754, -361633, -391682, 162896, 121122, 208933, -97289, 32619, -257497, 246821, 146796, -96585, -270662, -97261, -164891, 41764, 41429, -329849, 391023, -279241, -72611, -94639, 4496, -141566, 215701, 84477, -370411, -43425, -179321, -83214, -253219, -89759, 50153, -112833, 52934, -90020, 136724, 41832, 397295, -26079, -467608, -324610, -50528, -128532, -147520, 82705, 255822, -293484, -113110, 54151, -209244, -35815, -111853, -142542, 80586, -111386, -88948, -247677, 183588, -112446, -303102, -206645, -47336]
18605E3252L1909d08370a86316B18400a80192A14426a68676H6517b8075a2917
18594b90180a41757A24377K1429B4026a30547j03190D3733a23847l2592O9949
18584h6490a2366A0872b6606j74352g3983J3713A07530d4025e375k80580C8910
18572e5251D21303a82017k0141H1332a9074j72427O2512d6043B66020e8878j07838
18561a66716a7361A06697O0613b39989i8636L6311p4851c3341l19862N9898N2328
18550b40977c6208m8119m24334A94456a35641k1696k8796H8529a86275A24835
18539D7216a17083q7638M8403C6527E850a93227j04542i7808j69451B00327d48523
18527b12662d7958A33395b06296A95168D9697f092I415b20694D6815i0960A41618
$$ y = [53252, 85161, -408370, -186316, 218400, -180192, 114426, -168676, 86517, -28075, -12917, -290180, -141757, 124377, 145806, 24026, -130547, -233737, 43733, -123847, -156439, -86490, -12366, 10872, -26606, -200958, -73983, -60270, 107530, -44025, -5375, -285955, 38910, -55251, 421303, -182017, -202158, 81332, -19074, -191501, -128989, -46043, 266020, -58878, -166716, -17361, 106697, 167310, -239989, -98636, -62325, -137176, -33341, -353203, -293305, -240977, -36208, -84327, -508661, 194456, -135641, -157337, -186133, 88529, -186275, 124835, 47216, -117083, -204721, -156318, 36527, 5850, -193227, -297769, -97808, -267259, 200327, -448523, -212662, -47958, 133395, -206296, 195168, 49697, -6092, 9415, -220694, 46815, -90960, 141618]
18515a03268A1877K44180a07222o9454O7340k5719A2598J26030O4038k0238H5892
18503A43396k5185K31439C1074a86l82968a00030G5451a92747A81496K22747A91307
18491h2023K8734j90208A81382c16525E0222K46632j30980a13596D8958g7659
18480E6510c7213C9233a78381a7222B35515M1590a90296Q2752B27366n9492e7338
18468e8545K8064k314A17899N8778a79611A4755b70684A29183E240b22989K7196
18457a95793a0131m1178d628B06858c95308J24952m0286E1065b14728B0876J78640
18446A99516g4328A36043B0893b18460j05711D112g3271i466k10697R4286g613
18434f7914e869p9071A30459b27210A98974a58380O4538d2391n6445E0386g4060
$$ y = [-103268, 11877, 256057, -107222, -176676, -109336, -135055, 12598, 138628, 202666, 182428, 85892, 143396, 118211, 349650, 31074, -186, -383154, -100030, 75451, -192747, 181496, 404243, 191307, -82023, -53289, -243497, 181382, -316525, 50222, 296854, 165874, -113596, 48958, -77659, 56510, -37213, 39233, -178381, -17222, 235515, 277105, -190296, -107544, 227366, 167874, -57338, -58545, -30481, -32795, 117899, 176677, -179611, 14755, -270684, 129183, 5240, -222989, -195793, -10131, -51309, -4628, 206858, -395308, -270356, -310642, 51065, -214728, 20876, 199516, -74328, 136043, 20893, -218460, -324171, 4112, -73271, -9466, -220163, -125877, -7613, -67914, -5869, -84940, 130459, -227210, 198974, -158380, -93842, -42391, -98836, 50386, -74060]
18422B38137l7911N407h6966K9658m0279l30771A34932b48278i6580c2834j26587
18411a59421C2579d1644L915a2415I7126J95667H5142b26203O4842B13765c63762
18399d8791j25198E9380a9421k48265C15304a33819A61458R1113d67429B7591
18388B93222a93751O0099p5313N6992F8350O1763d5824k91464B82898b24461P1965
18377a52496B75537A10946h3061J9873A3503P612b25789h4652p8830f4839m2943
18366a07782j68518B03051D2204K15898g5688j23660G0453a53174A16599g5847
18355f6141J7492j11543b6515j72893g332q6519C4320a22494m0804B8710J80832
18344B09542r3507J6489J65887I5369j1311d8233A31456a34385l70070A63008
$$ y = [238137, 200226, 205633, -86966, -57308, -97587, -428358, 134932, -248278, -96580, -32834, -159421, 32579, -41644, -37729, -12415, 97126, 292793, 85142, -226203, -161361, 213765, -363762, -48791, -173989, 59380, -19421, -267686, 315304, -133819, 161458, 252571, -467429, 27591, 293222, -193751, -133652, -208965, -151973, 68350, 130113, -45824, -337288, 282898, -224461, -152496, 275537, 110946, -83061, -63188, 13503, 21115, -225789, -84652, -163482, -64839, -107782, -276300, 203051, 42204, 258102, -75688, -199348, 70453, -153174, 116599, -75847, -66141, -48649, -160192, -26515, -199408, -7332, -93851, 34320, -122494, -163298, 28710, 209542, 116035, 132524, 298411, 95369, 84058, -48233, 131456, -134385, -504455, 163008]
18333A6481a93961G9436N6357c99338h6134k13750h4539g663p9870C6416b20219
18321d4759H4555O8133g2108I3025d14436i0346Ib40834F8650a3511G4241A7121
18308d2604I3869M4635J99737a74471Q4311k06101O8287C5468a26444l5067H457
18296a05315n0482D6502b56618C32135A02874e6017j84870H3135c11983B1154
18285A2261i0267k5618D50K07988a10701B02148l3418F2817O8936h1682A27371
18273h7644n7862A46968a37822e2960m01632J95982P3510E4768c70061a8426j04607
18262a23033l7962A42027K2176P5997d68652h8077r5993b3404B2153c52171a70842
18250f5314A52167C159J17251a50116J9690j18060f348k59353A01235J73222F9253
$$ y = [16481, -193961, 79436, 135793, -399338, -86134, -299884, -84539, -7663, -87533, 36416, -220219, -44759, 84555, 152688, -72108, 93025, -414436, -90346, 9, -240834, 68650, -13511, 74241, 17121, -42604, 93869, 138504, 338241, -174471, -90160, -296261, -227974, 35468, -126444, -161511, 8457, -105315, -155797, 46502, -256618, 332135, 102874, -56017, -240887, 83135, -311983, 21154, 12261, -90267, -115885, 450, 208438, -110701, 202148, 168730, 62817, 131753, -81682, 127371, -87644, -145506, 146968, -137822, -52960, -454592, -258610, -185100, 54768, -370061, -18426, -123033, -160995, 142027, 164203, 240200, -468652, -88077, -184070, -23404, 22153, -352171, -170842, -65314, 152167, 3159, 120410, -150116, -130426, -248486, -6348, -265701, 101235, 274457, 69253]
18238E574e2013l3022j33075o7235A89946a09738j32312a14351I2709a68840h3919
18226E5128b76641P4056M0959P2653m6587j21092b3715B14967J11942b9092C48965
18214A5964R7547A7858b7867j30532j1716A36246C2938b61272J6024J5868J0644
18203b18736o0245P8660A8055M9867a79541n6048Q0795A60749K56363j67789g6376
18191A53736K1448f1774q7605f5311E3145P0113J28471d0853R216A50046K5074
18180A75120K4923b93355B04367f990B6434J348b26180A07376a64842j0086l2323
18169b07251I2288J14572f1949G3969N4428D7206c9604r1036m0088A55733D1689
18157H3029b34293C79284a15000b8796o0974j91729P2398C09426b28701Q9360
$$ y = [5574, -52013, -85035, -218110, -285345, 189946, -109738, -242050, -114351, 92709, -168840, -83919, 55128, -276641, -202585, -161626, -88973, -135560, -256652, -23715, 214967, 326909, -29092, 348965, 15964, 113511, 17858, -27867, -158399, -170115, 136246, 32938, -261272, -245248, -229380, -218736, -278981, -200321, 18055, 67922, -179541, -235589, -154794, 160749, 417112, 249323, -76376, 153736, 175184, -61774, -149379, -65311, 53145, 123258, 251729, -40853, -31637, 150046, 175120, 200043, -293355, 204367, -6990, 26434, 27782, -226180, 107376, -164842, -174928, -207251, 92288, 206860, -61949, 73969, 128397, 47206, -39604, -130640, -170728, 155733, 41689, 83029, -234293, 379284, -115000, -28796, -89770, -281499, -209101, 309426, -228701, -139341]
18147a39341N1960G2975J77708d9860j35338K5729e4333J8638A7533a17798j32325
18136b50123B10857e7458j385D8007b54092B05351A0804J12877c03025J36692
18126a66333j6872n1943B4842h6066r3341C7960b6693k33021P2775A8406J34886
18115A53292G5064a35932d935A08283B2839a852B3319M5183e9140B93994b98590
18103c37305R3844G330O6072d4669A53548g0291N419H7864C735e4733F1063c07733
18090g8632k7014A64290E5205g4208A18885c47296B73647q8384d5216k25995J12023
18079a59188g582k860A42122f7332M835j73965d3855J2934A59354a43811L304
18068a40507H711L58725a91053N1919A82927A4722b96013l7164J33342o9038F4958
$$ y = [-139341, -87381, 72975, 250683, -49860, -185198, -159469, -54333, -35695, 17533, -117798, -250123, 210857, -57458, -58843, 48007, -254092, 205351, 10804, 123681, -303025, -166333, -183205, -235148, 24842, -86066, -179407, 37960, -26693, -259714, -186939, 18406, 153292, 75064, -135932, -4935, 108283, 22839, -1852, 23319, 68502, -59140, 293994, -298590, -337305, -243461, 7330, 73402, -44669, 153548, -70291, -64872, 87864, 3735, -54733, 61063, -307733, -78632, -105646, 164290, 55205, -74208, 118885, -347296, 273647, 185263, -45216, -271211, -159188, -7582, -10442, 142122, -67332, -62497, -236462, -43855, -30921, 159354, -143811, -140507, 8711, 367436, -191053, -139134, 182927, 14722, -296013, -333177, -199835, -268873, 64958]
18056A47665L0925c4131A42760b3619q1589A74414F0399c21587E7218K2744a99389
18044B41348q3105J2913B665K34247a05562j40588A96778a44720A59599g355j64415
18033a71770G6082E095b63680j5064A0990a57069A06879d3071H4219J20184c0458
18021A5557b37660A09779J07843A2825b11038B15639H6169f1284A6604d4905k32756
18010b77661M2170F0241j3644c38978J51160i0246J0236b1072l35519J75057K9926
17999a51608k8290b9253a2016C06454a1695F7937b7203A26136f1981a0292k64730
17988b75022G8698a69747A76412c4626j09245k93734a90451A7014N568P2411k6667
17977F8326a14840J2301A33564a95704c1557o4093b6505C4600b1677j18493d4786
$$ y = [147665, 178590, -34131, 142760, -23619, -105208, 174414, 60399, -321587, 57218, 79962, -199389, 241348, 158243, 171156, 2665, 236912, -105562, -246150, 196778, -144720, 159599, -7355, -171770, 76082, 5095, -263680, -278744, 10990, -157069, 106879, -43071, 84219, 204403, -30458, 15557, -237660, 109779, 217622, 12825, -211038, 215639, 86169, -61284, 16604, -44905, -277661, -235491, 60241, 46597, -338978, -187818, -90246, -80010, -21072, -356591, -181534, -151608, -179898, -29253, -12016, 306454, -11695, 67937, -27203, 126136, -61981, -10292, -275022, 78698, -169747, 176412, -34626, -143871, -437605, -190451, 17014, 22582, 94993, 68326, -114840, -102539, 133564, -195704, -31557, -95650, -26505, 34600, -21677, -140170, -44786]
17965a49135A29098n6549d08649J11473b6142A28082c47889J53365B56335a6903
17954A38527e21804A30890a37154p5485h3205m4275q4710f7925r2458m8150F0592
17942A60792M7188L3590b44266B5399J30307a01755B36604C9143a45600D2003
17931a60163Q0006I9080k862K5815R0091a3607l44397J12892I7549i5115l1549
17920a26664M8594f402F6635b00481K1190B01460k8036d25386i6062A86867D3060
17908b19807D0464a9170l43398c4700B10069e5752b723p551j52855B17442a75362
17896A82853G7254B1276b71686C65151c07677A70210H0978P7836a41169M9966
17886i1203A27647a22241b5301B4403L48300A47529k2994J73318j14704b82759
$$ y = [-149135, 129098, 72549, -408649, -297176, -26142, 128082, -347889, -194524, 256335, -16903, 138527, -521804, 130890, -137154, -212639, -83205, -127480, -212190, -67925, -160383, -208533, 60592, 160792, 207980, 241570, -244266, 25399, 155706, -101755, 236604, 39143, -145600, 42003, -160163, -80157, 99080, 96218, 122033, 212124, -13607, -358004, -245112, 97549, -95115, -126664, -78070, -6402, 66635, -200481, -179291, 201460, 173424, -425386, -96062, 186867, 43060, -219807, 40464, -19170, -362568, -34700, 210069, -55752, -2723, -10274, -163129, 217442, -175362, 182853, 77254, 21276, -271686, 365151, -307677, 170210, 80978, 158814, -141169, -91203, 127647, -122241, -25301, 24403, 372703, 147529, 124535, 297853, 183149, -282759]
17875F9460J55907c8618j63112A81401e5174H4024f7312K8652F6445F11a50357
17863i3355j90664b2912B80446l4878h8299J0821C16592A1053a51113C3487b28523
17851g7657D9292J19724E2473b31588A28178P4935n058O5150G514g7925A51477
17839A2851l603P7781c05593D25702h511B06906o424E9449g112j60694B36961
17827b61960i460A61473a42433A04141b14302j96458A58481b21466e125j46831
17817a51956L5072M8293j05523O6782j0026A73281k5955J18977b7276F851R9303
17806A06154b12490e0940a2507e010m4464A6025K99442a58928D9871Q0761P959
17795A38591D7388J59827a09313R853B19901q3343J41359E3420a42111F5833a06988
$$ y = [69460, 225367, -38618, -201730, 181401, -55174, 84024, -67312, -38660, 66445, 611, -150357, -93355, -284019, -22912, 280446, 245568, -88299, -77478, 316592, 11053, -151113, 33487, -228523, -77657, 49292, 169016, 52473, -231588, 128178, 203113, 198055, 263205, 7514, -77925, 151477, 12851, 9248, 87029, -305593, 425702, -8511, 206906, 200482, 59449, -7112, -167806, 236961, -261960, -9460, 161473, -142433, 104141, -214302, -410760, 158481, -221466, -5125, -151956, -116884, -68591, -174114, -107332, -117358, 173281, 147326, 266303, -27276, 6851, 106154, -212490, -50940, -12507, -5010, -49474, 16025, 315467, -158928, 49871, 130632, 138591, 47388, 207215, -109313, -99460, 219901, 136558, 277917, 53420, -142111, 65833, -106988]
17783B35533a51866l588B25613b20567A21149K03273j56870j1124A1832a51922
17772D2919J43958f1419A01269m0634c50216D7961a53348J3067O0535n3373M678
17761a28441a9192k38838B86609c54446A00250b4400q8947H3834K86974f0672
17750a25287I7420J23071a99754C98370B010a50780D2289J55959b29981d1820
17739b10575c558k91546B0020J68469n5231b55985A8722c50014B91416f859q8163
17728i5022H2716L1551g0900b9748B68807c00154A45226a26079B1656b15741A25279
17716a3742A64742h3334A23149L31110B9864K02516m8612a2778G2273e3295B74581
17704b01007A4015P5594e9297a3949j26144D4097a11660A19287e9325a9441C77434
$$ y = [235533, -151866, -155454, 225613, -220567, 121149, 324422, 167552, 156428, 11832, -151922, 42919, 186877, -61419, 101269, 60635, -350216, 47961, -153348, -140281, -79746, -133119, -128441, -19192, -258030, 286609, -354446, 100250, -24400, -113347, 83834, 370808, -60672, -125287, 97420, 220491, -199754, 398370, 2010, -150780, 42289, 198248, -229981, -41820, -210575, -3558, -295104, 20020, 188489, 133258, -255985, 18722, -350014, 291416, -6859, -95022, 82716, 114267, -70900, -29748, 268807, -300154, 145226, -126079, 21656, -215741, 125279, -13742, 164742, -83334, 123149, 454259, 29864, 232380, 183768, -12778, 72273, -53295, 274581, -201007, 14015, 89609, -59297, -13949, -140093, 44097, -111660, 119287, -59325, -19441, 377434]
17692H0184g894r5136d1644J7884k04547C7332e26j84885j00228E4327b4299l91419
17680d15718A14861K29062K3513f8997H0454f9523k13810D9378J99003g9300B3249
17668A69516a41627A79269a30024p1029l2019A9686J63520a9829A16497L0720
17658A47217f2223I7733a34360A12815N7876g808j82001H7286L27251A68725g2877
17646b7014A4609L84048I3918c73767B2869J52882a28086O861j11965I0727a16041
17634B04985A6366Q4343a3445m65359F2370a6040B49142b00649D2857b96121C1914
17622a8514B16105O2666j16307e4582q4372N6716G288K0987M09251p6758I1148
17610A30288N6044a07586D8497b17319B43967H9920b3006k29195B2306a05873
$$ y = [80184, -7894, -103030, -41644, -23760, -228307, 37332, -526, -185411, -285639, 54327, -24299, -415718, 114861, 343923, 367436, -68997, 80454, -69523, -283333, 49378, 248381, -79300, 23249, 169516, -141627, 179269, -130024, -201053, -233072, 19686, 183206, -19829, 116497, 147217, -62223, 97733, -134360, 112815, 170691, -7808, -189809, 87286, 414537, 168725, -72877, -27014, 14609, 398657, 93918, -373767, 22869, 175751, -128086, -121225, -233190, 90727, -116041, 204985, 16366, 100709, -13445, -478804, 62370, -16040, 249142, -200649, 42857, -296121, 31914, -18514, 216105, 278771, 162464, -54582, -138954, -82238, 7288, 28275, 437526, 360768, 91148, 130288, 186332, -107586, 48497, -217319, 243967, 89920, -23006, -252201, 22306, -105873]
17599H1696b06609g6468d126m5109k56569A34318a89021A5003i2057L1802J3966
17588d6289E4782a01381C3674a5246D9287J21168a49641B38084A4166F604O96491
17577G03095g9130A25185k2876B2807M3191J01055a39078A13824J2708c5663A40082
17565g4979A9994J6265I756L297a89045B2974P1383a10513E329J71598A3575J26530
17553A40105b28300A38088L5091A1996J61393n1705k0769M8460E9658J80801r2784
17542A47675a11418B9459b91304A74448p4582c16765e3802A27251c0707A06623
17531F2542J70191a28406C040d9790C83384I1188J11804c46924A62172R4052b07
17519a2976k5753r7357A17963b9915j12554G152R0911L68187A34758o877A0155
$$ y = [81696, -206609, -76468, -4126, -49235, -305804, 134318, -189021, 15003, -92057, -60255, -46289, 54782, -101381, 33674, -15246, 49287, 170455, -149641, 238084, 14166, 6604, 703095, -79130, 125185, 102309, 22807, 65998, 167053, -139078, 113824, 126532, -35663, 140082, -74979, 19994, 36259, 9756, 13053, -189045, 22974, 94357, -110513, 5329, 176927, 13575, 140105, -228300, 138088, 173179, 11996, 173389, 121684, 100915, 149375, 59658, 240459, 147675, -111418, 29459, -291304, 174448, 99866, -316765, -53802, 127251, -30707, 106623, 62542, 232733, -128406, 3040, -49790, 383384, 91188, 202992, -346924, 162172, 256224, -207, -12976, -38729, -136086, 117963, -29915, -142469, 7152, 98063, 466250, 134758, 127881, 10155]
17507C39206A33485C4499L8402b0641D69743b11914C52097I6988b1397B35094
17496e903B516K04737o0208o4524K80945K4953j01496a35966J1857A88288Q2549
17485B70837j01936a07026L381L2378E01585F191P5803l9413a4331k00875m9924
17474b65130A93003q767J34396A5170J43648a15468B120K33876A11458J93682
17464C05140b00614d3929H0820a20522a5082A19670J6000k9769J23755J62953
17454C92609e2411A90134J33136K782j38252F5304N16476B83546E2103J16575
17444A68678K36776k4632J6634A25105E5038j3228L89716A79736q185K01375L5338
17433D08264A18328J65454e1649B20291E0201L03515j53962l2974M3794n1170
$$ y = [339206, 133485, 34499, 72901, -20641, 469743, -211914, 352097, 96988, -21397, 235094, -5903, 2516, 207253, 147045, 82521, 363466, 388419, 286923, -135966, -124109, 188288, 270837, 168901, -107026, -103645, -71267, 501585, 6191, 81994, 42581, -14331, -215206, -265130, 193003, 184236, 318632, 15170, 158818, -115468, 2120, 235996, 111458, 305140, -200614, -43929, 80820, -120522, -15082, 119670, 135670, 105901, 229656, 392609, -52411, 190134, 323270, 326052, 187800, 65304, 581780, 283546, 52103, 168678, 405454, 380822, 397456, 125105, 55038, 41810, 431526, 179736, 171551, 372926, 408264, 118328, 283782, -51649, 220291, 50201, 353716, 199754, 166780, 210574, 159404]
17423A59404K09702e0713D7886L69261j59804a21220C05991M1399A69257L67916
17413E37173k65312A34349e5367A66030O8661l82P0127d927H6139a912A55104
17401g5241j937l9392G0678L2559b8734D17527C436K80639D0903J04948K69355
17390D15206a20476A21934P2552J97743i5494A6880Q8444J069c48844B51011F9856
17378a57079C8473H652K76968A15689g0945o4615I3100f4299C5602K05283d8949
17366G5230J81490a8933B23192D9730h1155c4777B14736f2409G3285e3440j0946
17355f4386E3669a24185j8149C08775J42192F9113J69956a17877A95630q710K97357
17344D84277B01516K18763a4088C74533A59680J60899A39618A036f6639B04873
$$ y = [159404, 369106, -50713, 47886, 417147, 257343, -121220, 305991, 347390, 169257, 537173, 271861, 134349, -55367, 166030, 234691, 234309, 304436, -4927, 86139, -1912, 155104, -75241, -77178, -116570, 70678, 103237, -28734, 417527, 3436, 284075, 40903, 145851, 415206, -120476, 121934, 194486, 392229, -95494, 16880, 105324, 106393, -348844, 251011, 69856, -157079, 38473, 8652, 285620, 115689, -70945, -135560, 93100, -64299, 35602, 240885, -48949, 75230, 256720, -18933, 223192, 49730, -81155, -34777, 214736, -62409, 73285, -53440, -64386, 53669, -124185, -142334, 308775, 450967, 69113, 239069, -117877, 195630, 186920, 484277, 201516, 420279, -14088, 374533, 159680, 320579, 139618, 1036, -66639, 204873]
17333B63296q3749a59946A79198m7145G142J17092P3233C1262J4635J70241r5419
17322A20719m0820M7978R9293o5650H0566L13903j69762A5478K16055P0499N1075
17311C53107e79m2226A51192J40077a09607B24647N1679j03816L6113e4765a171
17299E5823h5981c8489D21183A98657Q1164l512N9493j21103b8008B08630G1774
17287B63681p722o6532J57364j25688m7427J28848a41114a2227j82115B75607
17276E55099G1878J16467J22645j13066k229C4453M9215K12012D3757b2571C59606
17264B58534F5233R6196E480Q1097c30071d6202o2483A59919L600a2582A18777
17252B30484J2370j15813J25957N5774j14985c42646H5873N53443r3668k39660
$$ y = [263296, 179547, -159946, 179198, 132053, 7142, 124234, 197467, 31262, 45897, 216138, 120719, 79899, 127877, 227170, 161520, 80566, 394469, 224707, 15478, 231533, 302032, 353107, -579, -42805, 151192, 291269, -109607, 224647, 276326, 172510, 208623, -54765, -1171, 55823, -85981, -38489, 421183, 198657, 279821, 276309, 335802, 214699, -28008, 208630, 71774, 263681, 255959, 189427, 346791, 221103, 173676, 302524, -141114, -12227, -194342, 275607, 555099, 71878, 188345, 310990, 197924, 195695, 34453, 83668, 295680, 43757, -22571, 359606, 258534, 65233, 161429, 5480, 86577, -330071, -46202, -108685, 159919, 163519, -12582, 118777, 230484, 242854, 127041, 252998, 308772, 193787, -342646, 85873, 639316, 545648, 305988]
17242C05988J94139i970B31749l0048p2595K01716o1920i0720G4344K52899A44011
17230a37651F53307H5483l9646J75245l5082j139f4583C36239H1260L75517A15447
17218B79331a8366D39355B3036O9084k8001i9232A84644P4511R1144f2045D18975
17206D78343h0289A48562M372L39800A6719F513L19014E9449k6652M5309K10241
17195B88347J06411f0072A22291K26016A54490O322M340P9916l1948J40497c0626
17183B38735J14172o6197m5480J0252K18236j79257K23345M253j4075l7865k14091
17172B52028D7353M63086N4394k08303M6764H5316J08488k1352a7124B6590K62525
17161B89115O2980j41106l7330Q1136O7678I3466N2680i281A89628K57016Q1215
$$ y = [305988, 500127, -9970, 231749, 201701, 129106, 330822, 268902, -90720, 74344, 327243, 144011, -137651, 653307, 85483, 45837, 221082, 186000, 184861, -64583, 336239, 81260, 456777, 115447, 279331, -18366, 439355, 23036, 92120, 64119, -99232, 184644, 259155, 350299, -62045, 418975, 478343, -80289, 148562, 152934, 492734, 16719, 6513, 325527, 59449, 32797, 78106, 288347, 394758, -60072, 122291, 348307, 154490, 160812, 165152, 245068, 213120, 353617, -30626, 238735, 352907, 286710, 241230, 251482, 469718, 290461, 513806, 518059, 503984, 466119, 252028, 47353, 510439, 564833, 356530, 403294, 85316, 193804, 172452, -17124, 26590, 289115, 352095, 210989, 173659, 254795, 322473, 93466, 146146, -9281, 189628, 446644, 527859]
17150E27859k33947j9135J36154n840m5274h6503B85863K71429B51148N8534I7594
17138C84725e0228B32487Q8024A12213K79559A20799K65162j77608J46635r9850
17128B55138l3727J50823I6006L01609j41359j7094O7249j9586j11385P4563K02383
17117D52386j73719r0776l3186R7728K77656k52300I4738L04380r6442j36354
17107A66322p4828J94211J17034A76778M7695I9796J81000m4110H1643P5928L66961
17096E24532j9765N4385m8525J64791l03398O1418k14319J40730O4838M2941L17100
17085G84728k17236k40785L61867k18773L1496k32136G3998R5690N99818C57206
17074G81552B43550A07491Q1700L03808F1487M17370k11902f5673D39049q8564
$$ y = [527859, 293912, 274777, 410931, 405091, 359817, -86503, 285863, 557292, 251148, 309682, 97594, 384725, -50228, 232487, 320511, 112213, 391772, 120799, 385961, 208353, 354988, 255138, 221411, 372234, 96006, 397615, 256256, 239162, 306411, 286825, 175440, 250003, 452386, 278667, 187891, 154705, 252433, 530089, 277789, 94738, 399118, 302676, 166322, 91494, 285705, 402739, 176778, 224473, 99796, 280796, 236686, 81643, 157571, 524532, 504767, 559152, 510627, 675418, 372020, 433438, 219119, 359849, 424687, 467628, 784728, 567492, 326707, 688574, 469801, 501297, 269161, 73998, 169688, 769506, 357206, 781552, 243550, 107491, 189191, 492999, 61487, 478857, 266955, -65673, 439049, 350485]
17064C50485j10865N10268j80956q4826j93028K98558J65513p3763k86513o8566
17054C26307J21999R3282j39579J93337A76743O12469C40292R3210I7153P45915
17044H43068k41877j81709L4859O7474K7211H2752M53423k52583l9310K56280
17034E00562K49535k70987j4979P1859K60670k7972C48009n8708N1084M52164
17024G92549j16295k16367K81187j16452o8519J4238L45894l36796j15910K09832
17014F73361j12932L2286Q5390J68516j74582J4472j12533J66755K86199n08751
17004E18181O3538j55287L27375O4831k56285K55351k16851n3162K55761j18916
16994F84536J19356l75347J71049J75724k31957K44942k38043j56295L91517l21576
$$ y = [350485, 239620, 749888, 568932, 484106, 291078, 589636, 755149, 681386, 394873, 326307, 448306, 541588, 402009, 595346, 176743, 789212, 340292, 433502, 97153, 843068, 601191, 419482, 454341, 521815, 549026, 82752, 536175, 283592, 244282, 500562, 750097, 479110, 464131, 535990, 796660, 768688, 348009, 289301, 340385, 792549, 676254, 459887, 741074, 624622, 556103, 570341, 916235, 579439, 463529, 673361, 560429, 592715, 678105, 846621, 672039, 686511, 573978, 740733, 1026932, 518181, 581719, 426432, 753807, 818638, 562353, 817704, 600853, 547691, 803452, 684536, 803892, 428545, 599594, 775318, 543361, 788303, 550260, 393965, 785482, 463906]
16984D63906K18237L52657j04660k61532J74500j15565J1483K4041k60926K47624
16974G49765L2801J17956j99869j36782M61309m75015K44994J6831k08940M65189
16964A068239J81483k79588k63625K29130k45180L65962C80419L63085L43469
16955A086973j04087K55261m90185j45809K28882L17831M2373k36856m2526j42402
16945G69455L73350k82965P4962J05525j49151Q3582L07363l09224Q8846J51769
16935A213512l12147L90258m87038K94204k82171L26790p0153J00115j67552Q4194
16925A090012J88170j16185K3279l61088L06466K48908j82655J05789j21435L49717
16915A530978k4782J9519j83987P9829p5893J55668j71885P646K43109J63740
$$ y = [463906, 682143, 1034800, 930140, 668608, 843108, 727543, 739026, 763067, 502141, 749765, 782566, 900522, 700653, 563871, 1025180, 550165, 795159, 811990, 603050, 1068239, 1249722, 970134, 706509, 935639, 690459, 1056421, 380419, 743504, 1086973, 982886, 1238147, 747962, 602153, 831035, 1148866, 1191239, 954383, 911857, 769455, 1142805, 859840, 934802, 1040327, 891176, 974758, 1282121, 972897, 1061743, 1213512, 901365, 1291623, 804585, 1098789, 816618, 1143408, 1073255, 1173370, 1005818, 1090012, 1278182, 1161997, 1185276, 824188, 1130654, 1379562, 1196907, 1302696, 1181261, 1530978, 1506196, 1525715, 1341728, 1421557, 1345664, 1501332, 1329447, 1337093, 1580202, 1743942]
16905A743942l07237o5927N2514K3179L33873k80912Q4643j22659L68793l10058
16895A520151j56275L95103L33784p57593M27613K10548n13078K49841R2254j5502
16885A786846J29451k14393j44434N70209J8631M4185J74799m39724K71623j58985
16875B038208L38784k91537K15683R1123k43536O9820P4835j23619M54183l2731
16865B591213l61798K86892j00361K11914J22201K50968m16860o5850L41524O9781
16855B929624K35377m27567L40500r0708J80790M2547n9983J94633m54394K60060
16845C150879J05544j48776J92509O1113k9371J48916j77241Q6532L64111K43017
16835C997233j40476K26687j7334j11611L9907Q1655J71085O4943K82598k22709
$$ y = [1743942, 1436705, 1370778, 1423292, 1446471, 1780344, 1499432, 1584075, 1461416, 1830209, 1520151, 1363876, 1758979, 2092763, 1335170, 1762783, 1973331, 1460253, 1710094, 1802348, 1786846, 1916297, 1701904, 1557470, 2127679, 2146310, 2190495, 2365294, 1925570, 2197193, 2038208, 2376992, 2085455, 2301138, 2392261, 2148725, 2218545, 2293380, 2169761, 2623944, 2591213, 2229415, 2516307, 2415946, 2627860, 2750061, 3001029, 2584169, 2518319, 2859843, 2929624, 3165001, 2737434, 3077934, 2987226, 3168016, 3210563, 3150580, 3345213, 2890819, 3150879, 3256423, 3107647, 3300156, 3361269, 3331898, 3480814, 3303573, 3390105, 3754216, 3997233, 3856757, 4083444, 4066110, 3954499, 3994406, 4076061, 4247146, 4312089, 4594687, 4371978]
16825D371978N41840l97482J69144K1157r075M65298j31406M88537j37238L08948
16815E691701j63822j4118J94735L73203L4515L5509J44253j47985M20799n3019
16805F515771M72701J40739n7172M40411J96711k32266J77776M84543j57560N03216
16795H484870J37150L44726P411K29026N00396L5676L45842J54824L75777N27474
16785A1143172o0719L61646L07994M29546L60411L05589M61030K59489L03394
16776A3871552P20342N82923L46328M37260N18277K64973P97101O04528P18710
16767A8861994P07727O93943K20827J162778J040682K35943J224615J017733R17606
16758B6083848J294768J188843J055008J300149J171869J236647K257167J423689
$$ y = [4371978, 4913818, 4516336, 4685480, 4706637, 4697562, 5162860, 5031454, 5519991, 5382753, 5691701, 5527879, 5513761, 5708496, 6081699, 6116214, 6151723, 6295976, 6147991, 6568790, 6515771, 6988472, 7129211, 7072039, 7512450, 7709161, 7476895, 7654671, 8139214, 7981654, 8484870, 8622020, 8966746, 8974157, 9203183, 9703579, 9739255, 10085097, 10239921, 10615698, 11143172, 11082453, 11444099, 11752093, 12181639, 12542050, 12847639, 13308669, 13568158, 13871552, 14591894, 15174817, 15521145, 15958405, 16476682, 16741655, 17538756, 18143284, 18861994, 19569721, 20263664, 20484491, 21647269, 22687951, 22923894, 24148509, 25166242, 26083848, 27378616, 28567459, 29622467, 30922616, 32094485, 33331132, 35588299, 37011988]
16750C7011988J751650K090107J890220K303306K015939K527699K369700L014758
16742E4975367K607894L362841L617456L826602L534988M539558M789100M567292
16734H5821098N492889N161889N994878O167814O777783O758339P454115P747803
16726A37376608P470548P580448Q209398P526115P428992O707887O272372N416351
16718A93988719M049272L144630J617711R23788r40565k357707l665650m662108
16710A92098090n343040o516185o989383p516469p693956p901939p857913q118994
16702A34160211o844321p413171p253254o520236o248064n973104n645202n127095
16694H3135764n124082m255487m118072l806419l585418l421688l229287l047655
$$ y = [37011988, 38763638, 40853745, 42743965, 45047271, 47063210, 49590909, 51960609, 54975367, 57583261, 60946102, 64563558, 68390160, 71925148, 76464706, 81253806, 85821098, 91313987, 96475876, 102470754, 108638568, 115416351, 122174690, 129628805, 137376608, 144847156, 152427604, 160637002, 168163117, 175592109, 182299996, 188572368, 193988719, 198037991, 201182621, 202800332, 203724120, 202783555, 200425848, 196760198, 192098090, 186755050, 180238865, 173249482, 165733013, 158039057, 150137118, 142279205, 134160211, 127315890, 119902719, 112649465, 106129229, 99881165, 93908061, 88262859, 83135764, 78011682, 73756195, 69638123, 65831704, 62246286, 58824598, 55595311, 52547656]
16686E2547656k951796k298109k363930k178079j935383j938759j876792j700910
16678C5303898j982220q34783j985606j432086j077503j300898l55238j376075
16670B4959489j106671p12987j196656o35365r60798l01803j042542m90760r01460
16661A7610447p13516J18103j152412m52009n75233o1071n66168p65413k64297
16652A3178431m27892n32124l14346n12617j06586k81738n42271k30949k77733
16643I952175j94607j05290o45512j63601j47942j07346k12718j46048n71767
16634G657344k43269K33733o14269N14062k57261k82850n55027Q4275J9884l12998
16624F243624q3344j75318j25496J19685m21697j1333o0074J0925j51196l99279
$$ y = [52547656, 49595860, 47297751, 44933821, 42755742, 40820359, 38881600, 37004808, 35303898, 33321678, 32486895, 30501289, 29069203, 27991700, 26690802, 26335564, 24959489, 23852818, 23139831, 21943175, 21307810, 20347012, 20045209, 19002667, 18511907, 17610447, 16896931, 17015034, 15862622, 15410613, 14835380, 14774309, 14208141, 13442728, 13178431, 12750539, 12218415, 11904069, 11391452, 11284866, 11003128, 10460857, 10229908, 9952175, 9757568, 9652278, 9006766, 8843165, 8695223, 8587877, 8375159, 8229111, 7657344, 7414075, 7647808, 7033539, 7547601, 7290340, 7007490, 6452463, 6536738, 6556622, 6243624, 6160280, 5984962, 5859466, 5979151, 5557454, 5546121, 5486047, 5496972, 5345776, 4946497]
16614D946497p5690j35108q1014k2512m2983k87994Q1557M6689k68847j76793
16604C983802J84941J21705j57422o19862M19559k65614j93974M35237n68134
16595C340238K35233k19443M17520o62656j83358m4289q6519L93291j23226j98834
16585B867957k77692Q8650J64965m16824K02812K9781j9738n20k39327K19286
16575B619350j52625J53530m72647L71252o796j17617l66749K31134L1067m10579
16565A879320P8586j11653J47629N694P6643q510J16213l13197J51782k56195
16555A766312o9976P20529l76864m11957K21332k0766r1203n6712k64516M11653
16545A827832k89100J5518K91490n25898K64219j67762j52950Q2249K51694j00576
$$ y = [4946497, 4870807, 4735699, 4654685, 4632173, 4589190, 4301196, 4382753, 4429442, 4160595, 3983802, 4168743, 4290448, 4133026, 3513164, 3932723, 3667109, 3473135, 3908372, 3340238, 3575471, 3356028, 3773548, 3110892, 2927534, 2883245, 2796726, 3190017, 3066791, 2867957, 2590265, 2678915, 2843880, 2427056, 2629868, 2659649, 2639911, 2639391, 2400064, 2619350, 2466725, 2620255, 2147608, 2518860, 2512064, 2394447, 2027698, 2258832, 2289899, 1879320, 1957906, 1846253, 1993882, 1999576, 2076219, 2067709, 2183922, 1870725, 2022507, 1766312, 1696336, 2416865, 2040001, 1628044, 1849376, 1828610, 1737407, 1680695, 1416179, 1827832, 1538732, 1554250, 1845740, 1319842, 1584061, 1416299, 1263349, 1345598, 1597292, 1496716]
16535A496716k7382M29225p00684L31683o4203k57986Q3377r495m710R0219r0442
16524A276318L61983l24878L9922k56473K58416k60342j86072J54369J50263l120
16514A210386j47758Q3107m290m6456R2723j35446j03777N24427o43869O3068
16504H92115N6530j94616j82614M42364j31970l20761O27044j51484r2911P9860
16494A023557M6776M0825r3855k35631O0825M22126n61534K30844k3960j06630
16484H03343R2960P0151P6963k02160q827J60647m85041L81166l7790k86917k08151
16473C56344L82905J55200j74013M5607r8101k0772j67185L43102M9039L9273
16463I11399C17929L43330J85467l97048J21789o0796K64370p1883r4405K48645
$$ y = [1496716, 1469334, 1898559, 1197875, 1529558, 1465355, 1207369, 1290746, 1281251, 1276541, 1366760, 1276318, 1638301, 1313423, 1353345, 1096872, 1355288, 1094946, 908874, 1063243, 1213506, 1210386, 1062628, 1145735, 1141445, 1094989, 1187712, 1052266, 948489, 1472916, 829047, 892115, 948645, 754029, 571415, 1013779, 881809, 561048, 1188092, 1036608, 943697, 1023557, 1070333, 1111158, 1017303, 781672, 842497, 1264623, 703089, 933933, 909973, 803343, 896303, 966454, 1043417, 841257, 832430, 993077, 508036, 889202, 851412, 564495, 356344, 739249, 894449, 720436, 766043, 667942, 647170, 479985, 823087, 872126, 911399, 317929, 661259, 846726, 449678, 571467, 510671, 775041, 703158, 608753, 857398]
16453H57398j84021P9333n2379J73826k79318l4311K17955j38911J08927j27021
16443F21478k08469J66358o2002L6290n3027Q4883l5027L15219k77665k68737
16433C19301M42284j30362M95N38019E55906j96747K16591m7758j68695L81689
16423G40986j06225k1117j05113j58912j60567L99287j89754M91137l00269A80882
16412C61773M01943j1180C57281K26997k23571K08186K65532C82978K43460J16979
16402G43417B43818L17500Q9973k59112J04991o8802j29172O2946j34317J25655
16392C53480k587j32438L28326K66789C70832K82503j71161l7386j37799L24239
16382F31228j16354k41757K62978k42980E8152K85440M18789B74542I6322J39536
$$ y = [857398, 673377, 752710, 700331, 874157, 594839, 560528, 778483, 639572, 748499, 621478, 413009, 579367, 517365, 553655, 500628, 585511, 550484, 865703, 588038, 319301, 761585, 631223, 631718, 1169737, 555906, 359159, 575750, 527992, 359297, 740986, 634761, 613644, 508531, 349619, 189052, 588339, 398585, 889722, 589453, 180882, 361773, 763716, 752536, 357281, 584278, 360707, 568893, 834425, 382978, 626438, 743417, 243818, 561318, 651291, 392179, 497170, 428368, 299196, 362142, 227825, 353480, 350893, 218455, 546781, 813570, 370832, 653335, 482174, 444788, 306989, 631228, 514874, 273117, 536095, 293115, 58152, 343592, 762381, 274542, 96322, 235858]
16372B35858K54638p5334P6135j49742R5785j89684P7956A36682K20021I7474
16361f9934D82480j39776A56352L07449j05295m8155K21540K27842C49771K66383
16351F16154K12711C56079J87255k11228M7904A82198M76895B85933G8994M95204
16341E74198j69168K48005A11964O29696k20367q3986k8716O7327j05585j51847
16331B18486r5157K82795J25543A84788J95563A50092e7923C78507J71873k47091
16321C03289A37122k0061M23491l3641A4306L28587j00694K88556m8444J8780
16311E01091n105G0576J55863K5649p5419B6390R8469Q340Q7709h1172B88625
16299C27378A20474A8826K11388A08521K06935j4824b6048C07922O3927A01294
$$ y = [235858, 490496, 415162, 491297, 341555, 437340, 247656, 325612, 136682, 356703, 97474, -69934, 482480, 342704, 156352, 463801, 358506, 310351, 531891, 759733, 349771, 616154, 828865, 356079, 543334, 332106, 380010, 182198, 659093, 285933, 78994, 574198, 405030, 653035, 111964, 741660, 521293, 437307, 408591, 475918, 370333, 218486, 123329, 406124, 531667, 184788, 380351, 150092, -57923, 378507, 550380, 303289, 137122, 117061, 540552, 506911, 14306, 342893, 242199, 530755, 482311, 501091, 495986, 70576, 226439, 252088, 176669, 26390, 124859, 133199, 220908, -81172, 288625, 327378, 120474, 18826, 230214, 108521, 315456, 300632, -26048, 307922, 371849, 101294]
16288B65731M60632B67623c034H4834J90208j2741I5201M4404J07517H6715J53857
16277B40572E3282K66821c7893D70331B22637M1942P3156j12723R8812R38k8291
16266B96471e9652B63179K63652A94829J23115J74976j59862r9989K10089A45828
16255I8416O6468K17900j71397o3920K04617A04418J58049J27467K11129A60501
16244D86351C9700M5237K53K04157K4766A24073N3400B694a83233A58199L27134
16233D85333B6066g5747B5653g5548C7393i4540D31951A08887R1197K441J41391
16222C43916g2119B13967C0160K94713A31940N5182Q2321B8259O6485J02570c04237
16210D26635A97601a07146p8384E09233k53254a40616A667L16586l6970N183A30725
$$ y = [265731, 726363, 267623, -3034, 84834, 275042, 262301, 95201, 139605, 247122, 86715, 240572, 53282, 320103, -37893, 470331, 222637, 264579, 337735, 225012, 323824, 324762, 296471, -59652, 263179, 526831, 194829, 317944, 492920, 333058, 233069, 443158, 145828, 98416, 164884, 382784, 211387, 147467, 352084, 104418, 262467, 389934, 601063, 160501, 486351, 39700, 84937, 85190, 289347, 314113, 124073, 177473, 2694, -183233, 158199, 485333, 26066, -75747, 25653, -75548, 37393, -94540, 431951, 108887, 200084, 202525, 343916, -72119, 213967, 30160, 324873, 131940, 187122, 269443, 28259, 94744, 197314, -304237, 426635, 197601, -107146, -185530, 509233, 255979, -140616, 1667, 318253, 281283, 286466, 130725]
16198B4157K28662b0976B0252a2678B70244A3882a22086j48565A82892p3342a08842
16186B30311b456l7003A30041L66589c89073A41555M4211k136N7662a303B16385
16174A96333B6301K01054K4818h3102D093K19638G8910a32944A07704K48568i5355
16162b24578C24666A53501h9856A91454A6780J01839J25457q8023M1505J06302
16152C03860j04558j7591J20880a72271L7556H2496e3980n4736A42310J04546
16142B46856p4629o2034m9119c5381D43966A59001L1841o27g7677I0210K76044
16131C66254b42558A79224q0657C1497N3677j224c7426I8356l9424a5750F2020
16119b44790D1762i406B26622a52209A58728g3827B73817d9393k3239A61076B5449
$$ y = [24157, 252819, -20976, 20252, -12678, 270244, 13882, -122086, -270651, 182892, 109550, -108842, 230311, -2456, -39459, 130041, 496630, -389073, 141555, 185766, 183630, 241292, -1303, 216385, 196333, 26301, 227355, 252173, -83102, 4093, 223731, 78910, -132944, 107704, 356272, -95355, -224578, 324666, 153501, -89856, 191454, 16780, 118619, 244076, 156053, 197558, 303860, 199302, 181711, 302591, -172271, -134715, 82496, -53980, -108716, 142310, 246856, 172227, 110193, 61074, -35381, 443966, 159001, 190842, 190215, -77677, 90210, 366254, -242558, 179224, 98567, 31497, 85174, 83950, -37426, 98356, 58932, -15750, 62020, -244790, 41762, -9406, 226622, -152209, 158728, -73827, 273817, -49393, -72632, 161076, 25449]
16107G632a64300C13578B6457a26232B68064j11277d9833C35328b6610A88620
16096F23972a08629k96683a51074B15892B183K39349H599J22260h0784k15074
16086b95858h6702o7226B35739b37764A79428a99390h2156B4650R7312j1163g8946
16074c0154C46580c13066M9036C4504J4663a35765G1284L3457b095A20989J63907
16063B84896e0563B49244a76296a914C7713O283B1533O0642f5172A82526C922
16051d3275j0836D7241g8954H8860i778j56080A29271a93101l5179N5752B28068
16039a5393o1961k43332J34757D1294e15716A97169f2820E5838J7704a14305A78871
16027B19214M7296J14182D7777b8539A64321A2508a3197l06076I7862a20375F669
$$ y = [7632, -164300, 313578, 26457, -126232, 268064, 156787, -49833, 335328, -26610, 188620, 623972, -108629, -405312, -151074, 215892, 2183, 241532, 8599, 130859, -80784, -295858, -86702, -153928, 235739, -237764, 179428, -199390, -82156, 24650, 121962, 110799, -78946, -30154, 346580, -313066, -264030, 34504, 49167, -135765, 71284, 104741, -2095, 120989, 284896, -50563, 249244, -176296, -1914, 37713, 43996, 21533, 82175, -65172, 182526, 3922, -43275, -54111, 47241, -78954, 88860, -9778, -165858, 129271, -193101, -228280, -172528, 228068, -15393, -77354, -320686, -185929, 41294, -515716, 197169, -62820, 55838, 73542, -114305, 178871, 219214, 266510, 380692, 47777, -28539, 164321, 12508, -13197, -319273, 97862, -120375, 6669]
16015B07036K25010i1622q6669J3394L8184C20398a18053j00152B01199b14897
16004a11985N599j8979D9586b54666j23418J37051B20208b8094R432l10292F8641
15992C23393A53719a77137A49716c61696c0358m6276C13270d80669D3517J17970
15982A61487K87965k14510n7677K76771j64560d9150k32812A44472i2703k0795
15972a13498j55999E204R5734a95326k8264L853n206a09932j32420C8953b48l10934
15960c11182g1335M581A4211c68753C33586b4187o8055B3289e8125j36067j36585
15949c30777a58476G6383N9753a51429O2017n2567K6744B1345B619d90587A19216
15937B10348A01894f3513a0453j80428f9844B74158b57271C8786h370C5130b37871
$$ y = [207036, 432046, -91622, -178291, -164897, -126713, 320398, -118053, -218205, 201199, -214897, -111985, -106386, -125365, 49586, -254666, -378084, -241033, 220208, -28094, -18662, -328954, 68641, 323393, 153719, -177137, 149716, -361696, -30358, -76634, 313270, -480669, 43517, 161487, 449452, 234942, 177265, 454036, 289476, -49150, -281962, 144472, -92703, -113498, -269497, 5204, 100938, -195326, -223590, -219737, -224943, -109932, -242352, 38953, -248, -311182, -71335, -66754, 14211, -368753, 333586, -24187, -92242, 23289, -58125, -194192, -330777, -158476, 76383, 136136, -151429, -89412, -141979, -115235, 21345, 2619, -490587, 119216, 210348, 101894, -63513, -10453, -190881, -69844, 274158, -257271, 38786, -8370, 35130, -237871]
15925b24759A00402L9465A7017e710j12457J7831d6280j1894l50115a35989J1071
15914a24918a2961j12292r405o2423k1028Q6602B9698P0970h0064l11029i3659
15902A7338d60604C7089c51784A75517h9109c4935l5493H0561O2490a57726H6815
15890c22901A00400m4932a01407A72664b65104j3741A63667p6550a37565I2572
15879I1969M7092L0513J01937c42412A27899d33966A79335c35872A6941b48176
15868b68264J15330C4049b94981A92423A0705a24585M3393B10606H9513a55537
15857A7505i8512f123D6154O1257E0702a42156m9803B25438N8032B6369a34503
15845A86569l5513a09682C31384b66603b8512j03865j8095o7719A20846l5632
$$ y = [-224759, 100402, 139867, 17017, -5710, -118167, -100336, -46280, -58174, -408289, -135989, -124918, -12961, -125253, -134658, -197081, -218109, -131507, 29698, 100668, -80064, -391093, -93659, 17338, -460604, 37089, -351784, 175517, -89109, -34935, -70428, 80561, 143051, -157726, 86815, -322901, 100400, 55468, -101407, 172664, -265104, -278845, 163667, 87117, -137565, 92572, 91969, 139061, 169574, 271511, -342412, 127899, -433966, 179335, -335872, 16941, -248176, -268264, -152934, 34049, -294981, 192423, 10705, -124585, -81192, 210606, 89513, -155537, 17505, -98512, -6123, 46154, 107411, 50702, -142156, -191959, 225438, 283470, 26369, -134503, 186569, 151056, -109682, 331384, -266603, -28512, -132377, -150472, -218191, 120846, 85214]
15835H5214e4472o3712j14675A40045P8672D9616b80599j57542R9077h7450A17233
15823b27120j22868K2601J57294P9667B35112a67615B4846J19650a09880M0963
15813f8917G3883b78769B17067a33178A58551c32879g5717j01862A3939b39562
15802b06613d1008j80962K3119q3888k34020a35986J1158N0654k48976A27384
15791A8691L49497A58000o8286R1758p1978L11082e5178j57301G5302c55053O4241
15780b90812D3496J3774a09643k08418B40368a05493B09799l5417L05609a39762
15769b05171D596b57700P6010c8721P509B5748b47503A25525c37175J32649n3907
15758b58433A02896Q2203a94527A92498k3320H1578O2697f0456H5595P9067N1859
$$ y = [85214, -54472, -118184, -232859, 140045, 218717, 49616, -280599, -438141, -339064, -87450, 117233, -227120, -349988, -327387, -170093, -90426, 235112, -167615, 24846, 144496, -109880, -68917, 73883, -278769, 217067, -133178, 158551, -332879, -75717, -177579, 13939, -239562, -206613, -41008, -221970, -198851, -282739, -516759, -135986, -124828, -74174, -323150, 127384, 18691, 368188, 158000, 89714, 181472, 109494, 420576, -55178, -212479, 75302, -355053, -290812, 43496, 57270, -109643, -318061, 240368, -105493, 209799, 174382, 479991, -139762, -205171, 4596, -257700, -181690, -38721, -31212, 25748, -247503, 125525, -337175, -204526, -258433, 102896, 185099, -194527, 192498, 169178, 81578, 144275, -60456, 85595, 164662, 216521]
15747B16521r6459k2294P061M5926p285i8951a179l8197k03830A14638C7376a46574
15734A4021a9232l30590D18279b37114C2871L9890P7945C9858d13190a53338F27216
15722c7283H8927a44829a7372A42627k8608b15783A15819N5876c56262h0713c8702
15710a2433p872A20411a84995d4210B38462a0828k60489J07500B62596b08611
15699a83956h6640c0261Q129A05930c7652l14409A09276i229B78224J57789a80344
15687g3544A49499a73667a6732D2559a67551P1542c4158j27961m52282a59350
15676b1903o7944k01379k5301d1949B59822C9443K50362F02J87374c5315B2201
15664I1565b66111B3790L53847b61327A12302J35319a57261j53646Q0498k04067
$$ y = [216521, 120062, 97768, 104829, 150755, 143470, -98951, -1179, -39376, -243206, 114638, 37376, -146574, 14021, -19232, -349822, 418279, -237114, 32871, 72761, 150706, 39858, -413190, -153338, 627216, -37283, 88927, -144829, -17372, 142627, 114019, -215783, 115819, 171695, -356262, -80713, -38702, -12433, -20305, 120411, -184995, -44210, 238462, -10828, -271317, -163817, 262596, -208611, -183956, -86640, -30261, -22132, 105930, -37652, -352061, 109276, -9229, 278224, 436013, -180344, -73544, 149499, -173667, -16732, 42559, -167551, -96009, -34158, -162119, -614401, -159350, -21903, -89847, -291226, -316527, -41949, 259822, 39443, 289805, 602, 187976, -35315, 22201, 91565, -266111, 23790, 377637, -261327, 112302, 247621, -157261, -310907, -230409, -434476]
15654d34476C30776C8056b48241K4016g4228L3703A42098b84631e878k39336a03549
15642b90855A0541b56570K2304j66307J40161N0787j70755a56561J2370B1588
15631A49780k3193i945k4620b518j6762A38760k5878f374j3819F6392B8787K28317
15619B57104b31833C1686I409d0736B2523c64119A06881m1563L4464a31398G3391
15607A84039b13681D00778c54743a55790I5781h9688j29531L3459j71309J56896
15597b00173K4870P1955M3345C33508M9094a86946f5188b2074k14491A95806c5094
15585e4794B28141a07291C4325Q7330I213c9623D4778a31914A72784b60367G4548
15573e4786j92308a21114M0440Q230j70156a05937K5349a8818B32388M3655a7854
$$ y = [-434476, 330776, 38056, -248241, -224225, -74228, -40525, 142098, -284631, -5878, -245214, -103549, -290855, 10541, -256570, -234266, -400573, -260412, -209625, -380380, -156561, -144191, 21588, 149780, 126587, -9945, -34565, -2518, -19280, 138760, 112882, -6374, -20193, 66392, 28787, 257104, -231833, 31686, 9409, -40736, 22523, -364119, 106881, 65318, 99782, -131398, 73391, 184039, -213681, 400778, -354743, -155790, 95781, -89688, -219219, -185760, -357069, -200173, -175303, -103348, -60003, 333508, 382602, -186946, -65188, -22074, -236565, 195806, -35094, -54794, 228141, -107291, 34325, 121655, 9213, -39623, 44778, -131914, 172784, -260367, 74548, -54786, -247094, -121114, -80674, -72444, -242600, -105937, -80588, -18818, 232388, 276043, -17854]
15561c47268h9763j64498B04973L2095a43978J985B03088G6293R400a98772j87157
15550c85929I0613a00181A17932J46575j3786b42124C3852J19708c6940H5872
15539B03567c46898J17472i7115E219J34717m2933a05284B1388Q4075a00226j05472
15528b05698B5989a92632B20262F7159O0991a16912k74586e7524G8184J20293
15518A98477b47429J07495f8428I8163K3053c1835j7104B01141H0906K26041i2121
15506A36297J97635I0565i3360A72011M1854b24191A4676f9416j8880A4871J31273
15495A46144J52108j23313b88009J37124k0266A19069b63753A02483J17560C298
15484b45528H5523a56201f3768j5011A35081i3766B7041a06564n6296d7967j8653
$$ y = [-347268, -89763, -254261, 204973, 237068, -143978, -141993, 203088, 76293, 85693, -198772, -385929, 90613, -100181, 117932, 264507, 250721, -242124, 33852, 153560, -36940, 85872, 203567, -346898, -229426, -97115, 5219, 139936, 97003, -105284, 21388, 105463, -100226, -205698, 25989, -192632, 220262, 67159, 128150, -116912, -391498, -57524, 78184, 198477, -247429, -139934, -68428, 98163, 121216, -31835, -48939, 201141, 80906, 306947, -92121, 136297, 333932, 90565, -93360, 172011, 213865, -224191, 14676, -69416, -88296, 14871, 146144, 298252, 174939, -288009, -150885, -171151, 119069, -263753, 102483, 220043, 3298, -245528, 85523, -156201, -63768, -78779, 135081, -93766, 27041, -106564, -162860, -47967, -66620]
15473f6620q4876A01338n520M5330a01293d1382J4262I0293L49527F0210J21271
15462A81481J7761P9141g4483A40076n0362I672J41607e2843a9596o4212A38505
15450a15597d2630k22258B73475a42509E4217A3918K08567b57426O6825B6970
15439b8390A38491b34241B96271b04749G6135A985M6872a03299E0966a94695B4119
15427g4616J9285C09680j4147L878b8195k94513A29680K5837Q3228a62575c1871
15415a83970H0478L858g597o4212A58446a52083B60902b66037a19500A71832a06554
15403e2917f699l27652a44475o2181P6581q4512A53851c30468c6474B0643K7042
15392D7685K72079b5544k66669B17265b19382j7696C39603O2697f3502k4931l5022
$$ y = [-66620, -151496, 101338, 95818, 141148, -101293, -41382, -27120, 90293, 439820, 60210, 181481, 199242, 278383, -74483, 140076, 89714, 9672, 151279, -52843, -19596, -83808, 138505, -115597, -42630, -264888, 273475, -142509, 54217, 13918, 222485, -257426, -190601, 26970, -28390, 138491, -234241, 296271, -204749, 76135, 1985, 48857, -103299, 50966, -194695, 24119, -74616, -55331, 309680, 295533, 299411, -28195, -322708, 129680, 155517, 238745, -162575, -31871, -183970, 80478, 84336, -7597, -71809, 158446, -152083, 260902, -266037, -119500, 171832, -106554, -52917, -6699, -334351, -144475, -206656, -130075, -214587, 153851, -330468, -36474, 20643, 47685, 319764, -25544, -292213, 217265, -219382, -237078, 339603, 402300, -63502, -88433, -123455]
15381a23455O116b1277k0663F2089b15619e9376I8304J03M0495i0927B91368j44142
15369A47226J37949h9699d242B01942a21883i888B32053L3708a18578p4672G0393
15357g3265E3131A3908O4696b66618B55095e0702A39901b24037G9108c18920I8615
15345G3777L17081e7429p2737I5782e6907l22772J8386d8955p2510A40764P9169
15334B19933a05694D4210R316J70052h7013B002L1128a50057k54056c2773k111
15323c4884F0044a56968k81852B13643H0071J14239I0771J33669a01073B3682
15312B10268F2271c9628B40645A8295R9422b52664A81113i603o65r2272j51108
15301b53648B68182c17506B53593a67144m3158a1878m0284A18793M2513c4582
$$ y = [-123455, -117339, -21277, -41940, 62089, -215619, -59376, 98304, 98407, 138902, -90927, 291368, 147226, 285175, -89699, -4242, 201942, -121883, -9888, 232053, 265761, -118578, -193250, 70393, -73265, 53131, 13908, 78604, -266618, 255095, -50702, 139901, -224037, 79108, -318920, 98615, 73777, 390858, -57429, -130166, 95782, -56907, -379679, -361293, -48955, -121465, 140764, 219933, -105694, 44210, 53526, 223578, -87013, 2002, 33130, -150057, -404113, -32773, -34884, 60044, -156968, -438820, 213643, 80071, 194310, 90771, 224440, -101073, 23682, 210268, 62271, -39628, 240645, 18295, 117717, -252664, 181113, -9603, -10268, -102540, -253648, 268182, -317506, 253593, -167144, -210302, -11878, -52162, 118793, 161306, -34582]
15290H0102a14848L2620A6600P1507K49612A16853G164K32558g9318p2730R468
15279a42580D2161j5724a45217E6010K8030c0141B34125C7330d0622A22600K7195
15268A49795C73J32360a02111L7331A15826b70597B25776K65797b03679A23942
15257g6794k82834e0133B8712N2864J57257P1467b0281D37048K24021O11587M85983
15246A758639l54046L35534p08272m84819B06639I1493K11076j6796B5204c1392
15235a45994f7276A51107j2559B7905R0522a41490D45258B22365e2643B31050
15224F5888L53381g6162C30798b1152j5126j9718A9752a55278g1913g491p9192
15213h6683j49952B12946n0496a37717k4757H6896m1530K0293a35293C38219g5225
$$ y = [80102, -114848, -82228, 16600, 88107, 337719, 116853, 7164, 239722, -79318, -152048, -142580, 42161, 26437, -145217, 56010, 84040, -30141, 234125, 37330, -40622, 122600, 149795, 373, 132733, -102111, -64780, 115826, -270597, 225776, 491573, -203679, 123942, -76794, -359628, -50133, 28712, 81576, 238833, 310300, -20281, 437048, 661069, 1272656, 1758639, 1404593, 1740127, 1031855, 547036, 206639, 91493, 302569, 285773, 25204, -31392, -145994, -67276, 151107, 138548, 27905, 118427, -141490, 445258, 222365, -52643, 231050, 65888, 419269, -76162, 330798, -21152, -36278, -55996, 19752, -155278, -71913, -7491, -86683, -236635, 212946, 162450, -137717, -162474, 86896, 45366, 65659, -135293, 338219, -75225]
15201A32623n3091J39536m0213C2723J03666K50514B8153D757K5906Q2021a24108
15189C29214G4643L5467D9024N7997a49241P0310l6918B8919J7708j266K32502
15178B77863a8925A67127L33042A08767j065M0143K81947j74530J39029g5018
15167A73623a07528G936a2576C83837H7879a32345a1308j42491g2067A916L6051
15156C7967A8084Q4332K74275a42406A61677o2985K128P8143A6014K40722p79
15145B55957a75053B39473M2828k9332b38016A22081P1124K8604G5028o714c4200
15133f8763G893L26742j49449J41425a88759B96536j21222R0105O8607a1963J364
15122a0599D49212I9963g7745B11991d8471A77635p93J20108D2589L92058j90362
$$ y = [132623, 79532, 219068, 178855, 32723, 136389, 386903, 28153, 4757, 30663, 112684, -124108, 329214, 74643, 110110, 49024, 107021, -149241, -78931, -115849, 28919, 46627, 45361, 277863, -18925, 167127, 500169, 108767, 107702, 147845, 429792, 255262, 394291, -75018, 173623, -107528, 7936, -12576, 383837, 87879, -132345, -11308, -153799, -72067, 1916, 37967, 18084, 102416, 376691, -142406, 161677, 98692, 100820, 178963, 16014, 256736, 255957, -175053, 239473, 282301, 252969, -238016, 122081, 193205, 221809, 75028, 68314, -34200, -68763, 7893, 334635, 185186, 326611, -188759, 296536, 175314, 265419, 334026, -11963, -10599, 449212, 99963, -77745, 211991, -48471, 177635, 176842, 296950, 42589, 434647, 244285]
15111B44285O389p8237P4106q6686b8959C59602D8482J1742P6435E0189K09404
15100B59593a6272A36618d4303A70207a02946G3005j4440J92038G1371J9298J5348
15089A06017N8667M5858j5954g4781l2474j19790A56020K5750K07946d4342l49157
15078c93499F98648k92007j05479a81030e1552A8474P6071m2748a05506a5356
15067A07941J50472o7341C0207K28171G1950K93008b4517C94817j61673n5172
15057A77972G1864k7i3065E2189J87041A15187j6125O10O1050k1058J09409n5350
15045A93723J16538E7868J56033f4842C84881A59015p7467f1585A62798a273B57639
15033B39820f1483G34859A27781N6916J00346A37434J96693E0845L17925K17220
$$ y = [244285, 250674, 172437, 246543, 159857, -28959, 359602, 48482, 60224, 136659, 50189, 259593, -16272, 136618, -44303, 170207, -102946, 73005, 58565, 250603, 71371, 90669, 106017, 164684, 210542, 194588, -74781, -107255, -227045, 156020, 181770, 389716, -44342, -393499, 698648, 406641, 301162, -181030, -51552, 18474, 94545, 51797, -105506, -15356, 107941, 258413, 191072, 30207, 258378, 71950, 364958, -24517, 394817, 233144, 177972, 71864, 71837, -93065, 52189, 239230, 115187, 99062, 99672, 160722, 139664, 249073, 193723, 310261, 57868, 213901, -64842, 384881, 159015, 81548, -61585, 162798, -1273, 257639, 239820, -61483, 734859, 127781, 184697, 285043, 137434, 334127, 50845, 368770, 585990]
15023E85990k29641G5684J18292b7085I3208K7720M5764G7871J00376J72799A03142
15011a44994C99415e3771A57016L57262A24974J81146j18126L05782k39233j01982
15001A52561J88148g3584C94132A51954f6769C43141q6294K05313B22223l6795
14991A85428a2301A50155a32681B8196J26880R7853n7344O7921R0452J97809f1235
14979C5586M82368k53769A19057K45014j55971K29161A68313J62640j16245K2532
14969B37240j8151q3806J07821A035L72396R8653A57852K90987j15115M3739A56312
14957I6566L65002A17804L03852J79932B56616M7818e750B11468F8176k8632L94691
14946D34235a78131A04519K7354L44851j62086j11556J37423a02248C17973P4728
$$ y = [585990, 356349, 75684, 193976, -27085, 93208, 120928, 166692, 77871, 178247, 351046, 103142, -144994, 399415, -53771, 157016, 514278, 124974, 306120, 187994, 493776, 254543, 152561, 340709, -73584, 394132, 151954, -66769, 343141, 256847, 462160, 222223, 185428, -12301, 150155, -132681, 28196, 155076, 252929, 195585, 263506, 353958, 551767, -61235, 35586, 517954, 264185, 119057, 364071, 208100, 437261, 168313, 330953, 214708, 237240, 219089, 135283, 243104, 1035, 373431, 472084, 157852, 448839, 333724, 377463, 156312, 96566, 461568, 117804, 421656, 601588, 256616, 304434, -5750, 211468, 68176, 39544, 434235, -178131, 104519, 131873, 476724, 314638, 203082, 340505, -102248, 317973, 392701]
14936C92701p9156j45052m0805h6732B56244R9804j44088j2102K68354A83051
14925C54596l1804L70586B36340J62579J60483B60586R5026A67012M88442k89825
14915C65629A24218M48354e2169A89436L40197j81954b8877B30191L82608j85833
14905D26966q341A17895M49942B68460k9333M25945l17036A05470L7203J14790
14895B57463K01511A83734N6403r76A5009K47427n1735M3228L71120B65570P0836
14884C36406p8424J49616M9057B14535K13890p0848N4621A73830J48167o0961
14874B61036L71110j76518m1861J15501j77315J83532B29855n9313K54512A54335
14863E75908j91115j64524r2356D8682K18710r4664L71292B51407K20457j77925
$$ y = [392701, 313545, 168493, 127688, -86732, 256244, 356048, 211960, 199858, 468212, 183051, 354596, 322792, 693378, 236340, 398919, 559402, 260586, 355612, 167012, 655454, 365629, 124218, 572572, -52169, 189436, 529633, 347679, -28877, 230191, 612799, 426966, 418625, 117895, 567837, 268460, 239127, 665072, 348036, 105470, 142673, 257463, 458974, 183734, 240137, 239161, 15009, 262436, 210701, 253929, 625049, 265570, 336406, 257982, 407598, 456655, 214535, 428425, 357577, 412198, 173830, 321997, 261036, 632146, 455628, 413767, 529268, 351953, 535485, 229855, 170542, 425054, 154335, 575908, 384793, 220269, 127913, 48682, 267392, 172728, 544020, 251407, 471864, 293939]
14853B93939q7882J0019L86717k00299J59775j06960l3305A45548L79379j59251
14843C65676k7334J95052k8359A64517K18326J5291K00807q3893P1290K20539
14833H06877l29093K2849J60007j93408n536L01532B47718J52890j46104p0790
14823A83714M9812j04582J12873J62702L22691p2106B03755L30453m0297n3618
14813D40293R2507B13579K86988M0719O0366q4228L7501k19883J31033j69636
14803B96439J55531l7363r8676K22984B67874K27857p060J65345j8142j65932
14793D69942L07207q7924J63061l5859l09298o8149j27125J04678R7553K01045
14783G15131l26508p2323J25688l5278J31982J00675B63145J94182L31088C47093
$$ y = [293939, 206057, 216076, 602793, 402494, 562269, 455309, 422004, 145548, 524927, 365676, 338342, 533394, 505035, 164517, 382843, 398134, 598941, 515048, 586338, 806877, 477784, 500633, 660640, 467232, 461696, 763228, 247718, 400608, 254504, 183714, 233526, 128944, 241817, 404519, 727210, 655104, 203755, 534208, 493911, 440293, 532800, 213579, 500567, 541286, 601652, 517424, 554925, 335042, 466075, 296439, 451970, 414607, 315931, 538915, 267874, 495731, 488671, 654016, 635874, 469942, 777149, 689225, 852286, 816427, 507129, 438980, 311855, 416533, 514086, 715131, 388623, 316300, 441988, 406710, 538692, 639367, 263145, 457327, 788415, 347093]
14772D60423o5503J3896j21523L96843k8492B38231N46051k41730J69420I4811
14761D56387K14667O6334k58253M83115o5246j54413k22926K39740j07330o1207
14751E90868N4517M26988D06013J76537J60566k68501J83082B23205J76970L65055
14741G65230j06111K27058l3636R7380n7871C77972O03895m63789O5778O072M66967
14730A056895l24553K1423L2411P9336K95478o4577n41351L85504Q8735D48725
14719I08499m05790Q16074k04506j89266l05729L30858l86504K71452J17746q0264
14709H72570m969O3755q1118K52861m45724K38482n8342K6642L18406J72074F59558
14697E94618J55101K78853j30375J73210q5994P5962N5885k57310k0107L59438
$$ y = [460423, 394920, 408816, 287293, 684136, 655644, 238231, 784282, 542552, 711972, 94811, 456387, 671054, 737388, 479135, 962250, 897004, 742591, 519665, 759405, 652075, 590868, 645385, 1072373, 406013, 582550, 743116, 474615, 657697, 223205, 400175, 765230, 659119, 886177, 852541, 949921, 892050, 377972, 981867, 518078, 583856, 589928, 1056895, 732342, 753765, 786176, 865512, 1160990, 1096413, 555062, 940566, 1029301, 448725, 908499, 502709, 1318783, 1114277, 925011, 619282, 950140, 563636, 835088, 952834, 872570, 867601, 931356, 850238, 1103099, 657375, 895857, 837515, 864157, 1182563, 1354637, 659558, 594618, 749719, 1028572, 898197, 1071407, 985413, 1061375, 1117260, 859950, 839843, 1199281]
14687A199281k11016K5309m53637L25740N01044r4373m06369P4409M7573j56171
14677H51790K21481k34198J43505j40333J08185L8805K9725k21356L09101j46385
14667I60320J66703j61671M133J21687l45134M91124k66603M9291K85014k73590
14657A031274R9470K81064o53824L51771r6175k2530K47864o8597j53843J23054
14647A139528M9892J1835J84423J09533R0064j17558k01521K05511p5046k84365
14637A112296J8105l67117L57177K80345K38591l36912K32031k90448J11567m1000
14627A314635K41148Q206l51049J93603J59494l92824L54485j10143J03459j27469
14617A393545r1457J50841L98073l46478j91342J92257m0515L30266l83519K59195
$$ y = [1199281, 988265, 1013574, 559937, 885677, 1386721, 1292348, 885979, 960388, 1007961, 851790, 1073271, 839073, 982578, 842245, 950430, 989235, 1018960, 797604, 1106705, 960320, 1127023, 965352, 969485, 1091172, 746038, 1237162, 970559, 1019850, 1304864, 1031274, 1130744, 1411808, 757984, 1109755, 1013580, 991050, 1238914, 1170317, 1016474, 1139528, 1189420, 1201255, 1385678, 1495211, 1585275, 1467717, 1266196, 1471707, 1396661, 1112296, 1130401, 763284, 1120461, 1400806, 1639397, 1302485, 1534516, 1244068, 1355635, 1314635, 1555783, 1563989, 1212940, 1406543, 1566037, 1173213, 1527698, 1417555, 1521014, 1393545, 1302088, 1452929, 1851002, 1504524, 1313182, 1505439, 1464924, 1795190, 1411671, 1670866]
14607A670866L53934l24876j62235l4324L46139j51937J29076j65913L31417m01739
14597A590408J63127j028K59002l66838K46145J20160j36849r9395j88716N42800
14587B128816R8199k01648k20480R6403K791M4250j32684m9167L92274o5698j9384
14576B073672Q4596J06771k04798O5753k2777L7206O6638L41275m2079j39742
14566B366515J81753R4488k33480K83848J52996j54544K73326j2193j26677J57287
14556B983319k65335J157313j40266N87658M0373R16038O67596J949802M152135
14547A2048633P799294J1096780Q196728r760397j3536674G803449l085057j129864
14539C588528q96112k33956R8478m17340j01758J4990M69897j89428j30026J05100
$$ y = [1670866, 2024800, 1699924, 1537689, 1503365, 1849504, 1697567, 1826643, 1660730, 1992147, 1590408, 1753535, 1752507, 2011509, 1644671, 1890816, 2010976, 1874127, 1774732, 1586016, 2128816, 2227015, 2025367, 1804887, 1901290, 1904081, 1948331, 1815647, 1766480, 2158754, 2093056, 2073672, 2158268, 2265039, 2060241, 2125994, 2103217, 2140423, 2207061, 2548336, 2506257, 2366515, 2548268, 2642756, 2409276, 2693124, 2846120, 2691576, 2964902, 2952709, 2826032, 2983319, 2717984, 3875297, 3735031, 4322689, 4363062, 5279100, 5946696, 7896498, 12048633, 19847927, 30944707, 39141435, 29381038, 15844364, 7803449, 4718392, 3588528, 2692416, 2458460, 2556938, 2139598, 2037840, 2052830, 2522727, 2333299, 2203273, 2308373]
14529B308373J26443k65784J04817J80344Q8308k34187o2868M21159m64482J81669
14519B383792Q3455J80339k12913L02943K8051j6311O0183k19649K15204K62175
14509C067269L14654k12280P2219k81841J08798M02929l03003j15143j5484K67882
14499C306000Q8649j40936M05805n5561J43943l01444q6327O41036o33152L79368
14489C747381l13282M49703R6723l44896L1265M16186j82400q1184M41921k82780
14479C978637J70503J91048n38945N96416k84621M49203l53976O18776k34263
14470D592778K97741j51201j40464R6959j01717K65561j059J30872k4467K42129
14460E207132J83381o16426j90340J028247k99466j00250L0547K02489K42357
$$ y = [2308373, 2434816, 2169032, 2273849, 2454193, 2542501, 2308314, 2245446, 2666605, 2202123, 2383792, 2467247, 2647586, 2434673, 2737616, 2765667, 2749356, 2809539, 2589890, 2805094, 3067269, 3381923, 3169643, 3241862, 2960021, 3068819, 3471748, 3168745, 3053602, 3038118, 3306000, 3394649, 3253713, 3659518, 3603957, 3747900, 3446456, 3360129, 4001165, 3368013, 3747381, 3434099, 3883802, 3980525, 3635629, 3666894, 4083080, 3900680, 3819496, 4261417, 3978637, 4149140, 4340188, 3801243, 4397659, 4113038, 4562241, 4208265, 4827041, 4592778, 4890519, 4739318, 4598854, 4695813, 4594096, 4859657, 4858598, 4989470, 4965003, 5207132, 5390513, 4774087, 4583747, 5611994, 5312528, 5212278, 5242825, 5445314, 5687671]
14451E687671J48397n36776L82242J21668K9118L14777l12007L09983R5191Q7594
14441F327858J15871j94605L64742j63337L28032J58124K04843l29774L95280
14432G207034j40498m2856M42776j01192K02098j69830M2206M26257r9534K70899
14422H037360J57290J81256Q2498J97744l7712n5371L01682R1208p8948K28008
14412I105015M83531k1914M09981k30348L46068k32882K69172L07242M6093j13790
14402A0368168L73088N91270M557L61817l23885L27806J20006J51063M95668L42235
14392A2811793j66152L67014q8926K95263P43125l5219j95322O86699J95499j98884
14382A4414890P56233M7672K61379Q86188j69051Q09688l84324L81234N50687
$$ y = [5687671, 5836068, 5299292, 5681534, 5803202, 5832320, 6147097, 5835090, 6145073, 6240264, 6327858, 6443729, 6249124, 6613866, 6450529, 6778561, 6936685, 7141528, 6811754, 7207034, 7066536, 7023680, 7466456, 7365264, 7567362, 7397532, 7439738, 7865995, 7766461, 8037360, 8194650, 8375906, 8458404, 8656148, 8618436, 8563065, 8864747, 8955955, 8877007, 9105015, 9588546, 9566632, 9976613, 9746265, 10092333, 9859451, 10128623, 10435865, 10481958, 10368168, 10741256, 11332526, 11337083, 11698900, 11375015, 11702821, 11822827, 11973890, 12469558, 12811793, 12645641, 13012655, 12923729, 13218992, 13962117, 13926898, 13731576, 14418275, 14613774, 14414890, 15171123, 15218795, 15480174, 16366362, 16197311, 17006999, 16622675, 17003909, 17554596]
14373A7554596J10398O14335L32429k1372O77170J23497K24258P37171N90576
14364B0943058M09275L13828L30474Q48092M30414M03383O40546N8712R42260
14355B5320042P89220L65320M74818O30237J182730M70500O62969M63147J197660
14346C1556643L15867J260084N10507Q40173J130574M09113J594223Q39011Q43472
14337C9299667J154265J168956J203360J218902J249469J296539J544110J786645
14329D9921913J199909J699935J825107J600222J870205J684848J671565K522983
14321F3996687K179622K261349K436802K494108K376755L737045K146614L339693
14313H4968675L130026L844997L550266M035114L822186M103452M509694M819466
$$ y = [17554596, 17664994, 18279329, 18611758, 18590386, 19267556, 19391053, 19615311, 20352482, 20943058, 21352333, 21666161, 21996635, 22844727, 23275141, 23678524, 24319070, 24377782, 25320042, 26109262, 26474582, 26949400, 27579637, 28762367, 29232867, 29895836, 30358983, 31556643, 31872510, 33132594, 33643101, 34483274, 35613848, 36022961, 37617184, 38456195, 39299667, 40453932, 41622888, 42826248, 44045150, 45294619, 46591158, 48135268, 49921913, 51121822, 52821757, 54646864, 56247086, 58117291, 59802139, 61473704, 63996687, 66176309, 68437658, 70874460, 73368568, 75745323, 79482368, 81628982, 84968675, 88098701, 91943698, 95493964, 99529078, 103351264, 107454716, 111964410, 116783876]
14305A16783876N232214N496718N526032O122014O059886O905842P263582P266283
14297A66656447Q353855P760164Q931131R724552R477809J0640745J1037223J1557607
14289B44139533J1840074J2736325J3416018J3306135J4206117J4274790J4847892
14282C38766884J4853233J5148538J4493689J4770768J4105350J2941232J2587763
14275D37667457J0760630R335251O290204K748806j90776p05333N63246J72838
14267D66642323l728954m775951o317093q499603j0680069j2014734j3113473
14260D07512446j4289371j4281863j4603556j5201951j5766146j5002507j3961415
14253C04405637j4337897j3901769j3214811j2709936j2396403j1442765j0636875
$$ y = [116783876, 122016090, 127512808, 133038840, 139160854, 145220740, 152126582, 159390164, 166656447, 175010302, 182770466, 191701597, 201426149, 210903958, 221544703, 232581926, 244139533, 255979607, 268715932, 282131950, 295438085, 309644202, 323918992, 338766884, 353620117, 368768655, 383262344, 398033112, 412138462, 425079694, 437667457, 448428087, 457763338, 464053542, 466802348, 466611572, 465906239, 466469485, 466642323, 462913369, 458137418, 451820325, 443320722, 432640653, 420625919, 407512446, 393223075, 378941212, 364337656, 349135705, 333369559, 318367052, 304405637, 290067740, 276165971, 262951160, 250241224, 237844821, 226402056, 215765181]
14246B15765181j0602423r763100r020631q523194q783762p634050p326076o897924
14238A47214021o227403o174237n493628n695058n492271m809981m458265m118987
14230A04744191l883521m416632l623439l276968l904333l252810k615461l269998
14222G6501029k418926k834879k295869k032487k434228k384758k061681j899500
14214E8138701j619327j687854j365292j790436j880331j598897j130406q99695
14206D6166463j068714j555578j255905j486749r03964j226255p13660r37476
14198C7018162r92816j092376r37026r16918o09755p13573q79675o77055r47674
14189B9251294n16123r82935o4070j105803p83994k52253n96490n02606p26810
$$ y = [215765181, 205162758, 195399658, 186379027, 177855833, 169072071, 161438021, 154111945, 147214021, 140986618, 134812381, 129318753, 123623695, 118131424, 113321443, 108863178, 104744191, 100860670, 96444038, 92820599, 89543631, 85639298, 82386488, 79771027, 76501029, 74082103, 71247224, 68951355, 66918868, 64484640, 62099882, 60038201, 58138701, 56519374, 54831520, 53466228, 51675792, 49795461, 48196564, 47066158, 46166463, 45097749, 43542171, 42286266, 40799517, 39895553, 38669298, 37955638, 37018162, 36025346, 34932970, 33995944, 33079026, 32469271, 31755698, 30876023, 30198968, 29251294, 28735171, 27752236, 27688166, 26582363, 25798369, 25546116, 24949626, 24447020, 23720210]
14180B3720210l27617p76790J2056r17810p67613k841k88833l30217o17988l30121
14170A9372436l82712m68414l42786k67864l56376o26074k8585l27535o8321o14925
14160A5888844J13817m52173n43733k11116j05398k14115P2691o00471l09793
14151A3638553J20823n58818k98028j56023k25460k17338j92848p4071k06271
14142A1830519k09900j01828k77196K90650p18396K7155k96501m26436L53073
14133A0471140o06476J1574K48539o33755Q5957n0033p1389j22266k70824k19701
14123H842766J98280j93021J9398l66015l223m16132L70553n87932Q6337J36913
14113H087924m94111Q2178j54268k16064L14624n29959J5683k24236n0364L43416
$$ y = [23720210, 23392593, 22615803, 22627859, 21710049, 20942436, 20939595, 20650762, 20320545, 19702557, 19372436, 18989724, 18521310, 18178524, 17910660, 17554284, 16928210, 16899625, 16572090, 16503769, 15888844, 16002661, 15550488, 15006755, 14795639, 14690241, 14476126, 14548817, 13948346, 13638553, 13759376, 13200558, 12902530, 12746507, 12521047, 12303709, 12110861, 12036790, 11830519, 11620619, 11518791, 11241595, 11532245, 10813849, 10841004, 10544503, 10118067, 10471140, 9864664, 9876238, 10124777, 9491022, 9576979, 9526946, 9455557, 9333291, 9062467, 8842766, 9041046, 8848025, 8867423, 8501408, 8498185, 8082053, 8452606, 7864674, 7951011, 8087924, 7593813, 7675991, 7521723, 7305659, 7620283, 7090324, 7106007, 6881771, 6831407, 7174823]
14103G174823m15928K75923k39533j80686J10432k35117k22348l0923K09101k57573
14093F188171J71999k12739k19216J5505j59972O6127k42865L82366l89756O5325
14083E664945m08795K48238k18943m8296j12031P1391R2266k84974L7338Q9523
14073E130662j93081j95849N5664k1008l4951j18627n6422K40409k22221j03597
14063D480979o659J31719j06469k06355K51490j75668K76932o01614K94600o8437
14053D270518m58432L24092k51800K23804Q9857o06952P8916q9454O3579k0230
14043C623898M5481p0631j43788j13662J13418l21038K29563j14749Q147L57670
14033C614309k97020n9983k70221O07476o32352L66545j14037J02479l99186L22564
$$ y = [7174823, 6758895, 7034818, 6795285, 6614599, 6725031, 6489914, 6267566, 6236643, 6445744, 6188171, 6360170, 6147431, 5928215, 5943720, 5783748, 5849875, 5607010, 5989376, 5599620, 5664945, 5256150, 5504388, 5285445, 5237149, 5125118, 5196509, 5288775, 5003801, 5041139, 5130662, 4937581, 4741732, 4797396, 4776388, 4741437, 4622810, 4566388, 4806797, 4584576, 4480979, 4474320, 4606039, 4499570, 4293215, 4544705, 4369037, 4645969, 4044355, 4338955, 4270518, 3812086, 4136178, 3884378, 4108182, 4198039, 3591087, 3670003, 3580549, 3644128, 3623898, 3669379, 3598748, 3454960, 3341298, 3454716, 3133678, 3363241, 3248492, 3256639, 3614309, 3317289, 3257306, 2987085, 3594561, 2962209, 3328754, 3214717, 3317196, 2918010, 3240574]
14023C240574l36888J524J5035k59211J49186J19723k94350L16996P562l28125
14013B632026J14530J18197m06326Q0334K93714J72611m63420Q2878j0051L5189
14003B649682l42645J15465K25427k33723L09750o18947O93704k13855n12915
13994B071943K84365O9838j68234O83815J08472J595081L126678O223636J1460170
13985B5455764J1505276n318040j2666538p128842l791485j734941j168008o61486
13977D491700k15049n73751r3765j09256o03559j79578k4947q404P1888M4761
13967B800040k54415J05161j14641R8864k4054m60756N84610k12367j27151l54479
13957B040812L50763J29772l25654M9646J30415o7060l69663J60391Q533J12404
$$ y = [3240574, 2903686, 2905210, 2920245, 2661034, 2810220, 2929943, 2635593, 2952589, 2960151, 2632026, 2746556, 2864753, 2458427, 2538761, 2832475, 3005086, 2541666, 2624544, 2614493, 2649682, 2307037, 2422502, 2647929, 2414206, 2723956, 2105009, 2798713, 2584858, 2071943, 2356308, 2426146, 2257912, 2941727, 3050199, 4645280, 7771958, 13995594, 25455764, 36961040, 31643000, 18976462, 11847620, 8056135, 6321194, 5153186, 4491700, 4276651, 3702900, 3609135, 3499879, 2896320, 2716742, 2691795, 2683391, 2755279, 2800040, 2545625, 2650786, 2536145, 2635009, 2610955, 2150199, 2734809, 2522442, 2395291, 2040812, 2391575, 2521347, 2195693, 2245339, 2375754, 2308694, 1939031, 2099422, 2107955, 2220359]
13947B220359J75938l86536j3716L536k27075N55310m34943k9965N31991o53544
13937A741355R1020J52068k58572L61041l61234J22502k79295J13989L02039R7006
13927B081919k87511j04446P9589L0358j84825N0515M2987m005j12331K5471j24318
13916A493403L18184o221k34757n1435l9995K73656m14483m1186J59405K63268
13906A719839l82093M044L42897k84005l3782j63302J31191J0800j2887q154k84894
13895A039654N23111k45275k04975L79501p8935N5643J06755k90669m8948q2467
13885A153395K07823L41411j88144l54999L70659j03891r5605K43405k84233M2464
13875A332285N1423N2948k39463l96812K67281K96122k15128j46998L44574J62460
$$ y = [2220359, 2396297, 2009761, 1996045, 1999581, 1772506, 2327816, 1892873, 1862908, 2394899, 1741355, 1832375, 1984443, 1725871, 2086912, 1725678, 1848180, 1568885, 1682874, 1984913, 2081919, 1794408, 1689962, 1769551, 1799909, 1615084, 1665599, 1708586, 1704581, 1592250, 1617721, 1493403, 1811587, 1805366, 1570609, 1519174, 1479179, 1752835, 1338352, 1297166, 1456571, 1719839, 1337746, 1341790, 1684687, 1400682, 1366900, 1203598, 1334789, 1345589, 1332702, 1324548, 1039654, 1562765, 1317490, 1112515, 1492016, 1413081, 1468724, 1575479, 1284810, 1235862, 1153395, 1361218, 1702629, 1514485, 1159486, 1530145, 1426254, 1330649, 1574054, 1289821, 1332285, 1383708, 1436656, 1197193, 800381, 1067662, 1363784, 1148656, 1001658, 1346232, 1508692]
13865A508692j82995l7924K95497k51276j43367J47461P4037n17343L89330J1272
13855A293384l91046K21717N910J68244m00270L66943j71132q2290J394J04033
13845A116887j77023r0875J53794J32389j03043J0797k87727O25089J2898m99098
13835H94088J71164K80303k44554j65796q8566j05080N33095k18020j37762M5997
13825I64869k71645L2644M53914m25241L01022K60847k52358j55294M71563m85982
13815H94339J04734l0251j02971L15748l10596J20236o696J50111l80679M22417
13805A176392m62484K28749j44246j59484M18094j23737j41694O8488k06939K80627
13795I33766J18606j27929j6797R0001C05236O57264Q7434l78248K93651m04188
$$ y = [1508692, 1325697, 1287773, 1583270, 1331994, 1188627, 1336088, 1410125, 892782, 1282112, 1293384, 902338, 1124055, 1129965, 1298209, 897939, 1264882, 1093750, 1011460, 1012854, 1116887, 939864, 848989, 1002783, 1135172, 1032129, 1042926, 755199, 1380288, 1393186, 894088, 1065252, 1345555, 1101001, 935205, 846639, 741559, 1274654, 1056634, 918872, 964869, 693224, 725868, 1179782, 754541, 1055563, 1316410, 1064052, 908758, 1380321, 894339, 999073, 968822, 865851, 1181599, 871003, 991239, 984543, 1134654, 753975, 1176392, 713908, 942657, 798411, 638927, 1057021, 933284, 791590, 860078, 653139, 933766, 1052372, 924443, 907646, 997647, 305236, 962500, 1049934, 671686, 965337, 561149]
13785E61149M54382m68614Q231M42471m87532k5478K80976k1107r4733K56858
13775I06603J50225j75623R1044k35572k66218J64870K71702l04561L24200k9193
13765H97477Q0503K340m48386M22112j76440k2004J65156l36754J58926J45090
13755H88020k18582J5095j74525K76976j56418M0836K380L40817D76588J67107
13745F43695K91427C68962N30031m34272M79532m00527L04838J0791O050K6277
13735H91682o0716j54720j42309J10976J35374o3542j16640J05488K5954j72316
13725E59231K44455j87125j24213l5599J62798P9753J19603k65694K58362j31358
13715F80213N5781M6527j62924B50812L38362k79458j52885P99999M3385m59261
$$ y = [561149, 1015531, 546917, 555148, 997619, 510087, 484609, 765585, 744478, 649745, 906603, 1056828, 881205, 972249, 736677, 470459, 635329, 907031, 602470, 926670, 897477, 977980, 980320, 531934, 954046, 777606, 755602, 920758, 584004, 742930, 888020, 669438, 684533, 510008, 786984, 630566, 671402, 673782, 1014599, 476588, 643695, 935122, 368962, 898993, 464721, 944253, 543726, 848564, 859355, 865405, 891682, 830966, 676246, 533937, 644913, 780287, 716745, 600105, 705593, 731547, 559231, 803686, 616561, 492348, 456749, 619547, 699300, 818903, 553209, 811571, 680213, 735994, 782521, 619597, 250812, 589174, 309716, 156831, 956830, 1000215, 540954]
13705E40954r2143J16475m7138j7076J91765k14985J26015K84439m26838j13951
13695C47517L34282A66339N00272k08641J61861r7428j30581j88581K11492J3913
13685D28646P5311j15969L00035m5651k27964P29548m72136j53063J4211J29038
13675F62006j85688K00594B25963M00395K95296j67461l01358J53990N5623B65575
13664A92240L24798j09885R6309J35489k15020J90501j36855K29359k47350J93268
13654F52854j55806K5407j99190J04069N74563A91038M89867l20439K71357j54625
13644D77198k23755K82578l4612A67835M48141B59492K49786j89351A34004L27672
13634D61676k15639l5966l1813M58758j96255r4483M01587j91712k01769h9167
$$ y = [540954, 448811, 565286, 518148, 501072, 692837, 477852, 603867, 888306, 461468, 347517, 681799, 166339, 666611, 457970, 619831, 522403, 391822, 203241, 414733, 428646, 503957, 387988, 688023, 642372, 414408, 1143956, 671820, 518757, 532968, 662006, 476318, 676912, 225963, 626358, 921654, 754193, 452835, 606825, 662448, 265575, 192240, 517038, 407153, 503462, 638951, 423931, 614432, 477577, 706936, 459586, 652854, 497048, 522455, 323265, 427334, 1001897, 191038, 680905, 360466, 631823, 477198, 253443, 536021, 501409, 167835, 615976, 259492, 509278, 319927, 134004, 461676, 246037, 210071, 178258, 637016, 440761, 346278, 747865, 556153, 354384, -89167]
13623F78435l03950K08252B16743N21250C15731J73394K30685B88262L83559p8647
13613E93174k23064j06487O0909K92627J05951p3976n9489A77247K453L70592
13603E50292r7614B06314J81199K77210k87855r6347M28685A65606B7502O80780
13593G08282m3711l18131M5881m8499N7462Q6696j52783j36707J93409A90865
13582C76041k6479e5427E94554A68758l0330d6696B32141d2469F10124j7022B72270
13570D27665K30330B65815J44127j75744P5346J2840l6495E4110L03231M97226
13560H54567B53799M59822l02573j37815M7170K16987E0184N08948j2179k42676
13550C04277K74215B67723q8385K3673L25065j69342j69003I3452K74261p321
$$ y = [678435, 374485, 582737, 216743, 737993, 315731, 489125, 719810, 288262, 671821, 593174, 370110, 263623, 324532, 617159, 723110, 649134, 589645, 177247, 179700, 550292, 452678, 206314, 387513, 664723, 376868, 280521, 709206, 165606, 27502, 708282, 664571, 346440, 392321, 343822, 401284, 487980, 335197, 198490, 391899, 190865, 376041, 349562, -55427, 594554, 168758, 138428, -46696, 232141, -42469, 610124, 593102, 272270, 427665, 657995, 265815, 409942, 234198, 309544, 322384, 285889, 54110, 357341, 854567, 253799, 713621, 411048, 273233, 320403, 537390, 50184, 559132, 546953, 304277, 578492, 267723, 179338, 203011, 528076, 358734, 189731, 93452, 367713, 360392]
13540C60392L0287j90216K17511A71825N7382K13044k9779K54041k59916J62988
13530E69585j05654A70916L89826A04146P363J67540d3981B45055j76L25781k44864
13519C25796n5918N3506K12025j68444m5338j23447Q0257A12670k7153K43077
13509C28594r9410P2145b5140C46285l1933M9483A81383J74708r0700M9066M98222
13498H12679C07084J4485J28554D9471M65169L3542j74073j41320J20772R0428
13488D43989A55631P8149b1846A63645K48257A11766C4141Q9677Q7163j03486
13478A07495K83618o0924a11590G13818B96103j44645K8152J82331j17425L2736
13468B77252Q765A29733J60850M7735A66980J73903j21341Q8083K43645k65380
$$ y = [360392, 390679, 200463, 417974, 171825, 229207, 442251, 412472, 666513, 406597, 569585, 463931, 170916, 560742, 104146, 111509, 279049, -43981, 245055, 244879, 570660, 325796, 269878, 323384, 535409, 366965, 321627, 198180, 278437, 112670, 85517, 328594, 229184, 301329, -25140, 346285, 314352, 363835, 181383, 356091, 265391, 314457, 812679, 307084, 321569, 450123, 49471, 514640, 548182, 374109, 232789, 353561, 443989, 155631, 233780, -21846, 163645, 411902, 111766, 34141, 123818, 210981, 107495, 391113, 330189, -111590, 713818, 296103, 151458, 179610, 361941, 244516, 277252, 286017, 129733, 290583, 338318, 166980, 340883, 219542, 307625, 551270, 285890]
13458B85890K38423R8811k08809E868a04170r9008D18062P4591a8194D36125j73090
13447B63035c926B17772J63684M0413J0650A62308K17187A70133C2999K18819
13437B51818J97847e0650C29119Q109l2542A30715M37861A23269a8875I3923Q8553
13426A82476J85895A50398J67373Q954g1490C64145J12606F1721K82216l6657
13416C07280J08986k2244Q7659k09415K64745B20599q7112K37263A09564B6338
13405B59802A9846a24967A97380J01525R6551a61580A30184J02828I1002J29061
13395B20063m7355J17109C065L08090E4528K64265Q7677L87833B13097J27983
13385C41080C0859a28059D9593d5196A86641F6863J68467J81864j80539C7081
$$ y = [285890, 524313, 623124, 414315, 5868, -104170, -203178, 418062, 492653, -18194, 436125, 263035, -3926, 217772, 381456, 421869, 432519, 162308, 379495, 170133, 32999, 251818, 449665, -50650, 329119, 337228, 304686, 130715, 568576, 123269, -18875, 93923, 182476, 368371, 150398, 317771, 326725, -71490, 364145, 476751, 61721, 343937, 307280, 416266, 394022, 481681, 272266, 537011, 220599, 133487, 370750, 109564, 26338, 259802, 19846, -124967, 197380, 298905, 395456, -161580, 130184, 233012, 91002, 220063, 172708, 289817, 3065, 311155, 54528, 318793, 406470, 794303, 213097, 341080, 30859, -128059, 49593, -45196, 186641, 66863, 235330, 417194, 236655, 37081]
13374A75129L56946j69148K33976A15505K06978R5688A82264P0868J56216J12461
13364E21809j91975j27620F3681b8004D81562B08693a35177b2349E51289b6364
13353A85542J32471r5492J08259K13327A85501J65352J41910J23089B49094K0343
13343B69437J75058K9631P2652g453C40643A01758D8724a57068B04853p3840R8629
13332B29642A10109J02961J05841j59166J8326K38884A86580F1566J01541j2683
13322A50424J98497j59922o9395M90557k85186L1547J57019B12228J50635m0039
13312C22824J76129B30129E4553a04569B51710R1544A33823K60101A58952K1441
13302A80393e3205A00739B8253L80862D6453i0368D430O9032K38260R9059h3104
$$ y = [175129, 532075, 362927, 596903, 115505, 322483, 418171, 182264, 253132, 409348, 521809, 329834, 202214, 63681, -28004, 481562, 208693, -135177, -22349, 551289, -26364, 185542, 318013, 222521, 330780, 544107, 185501, 350853, 492763, 615852, 249094, 269437, 444495, 474126, 546778, -7453, 340643, 101758, 48724, -157068, 204853, 131013, 229642, 110109, 213070, 318911, 159745, 178071, 416955, 186580, 61566, 163107, 150424, 348921, 188999, 119604, 610161, 324975, 356522, 513541, 212228, 362863, 322824, 498953, 230129, 54553, -104569, 251710, 343254, 133823, 393924, 158952, 180393, -53205, 100739, 28253, 409115, 46453, -90368, 4430, 73462, 311722, 410781, -83104]
13290a49294A02156K15016j27151k4185J8798R2427I7998J58862L257A0033h1654
13278B37192e1140C98027A37636J41579C8577J17598K45469N5780k18105i1374
13267D79869j97728J38239j51382I3038i2362A87065d6358k7048C19272M489A21675
13255B04545j3129q5981l7349a5734B20019l1666n9109b2639D33338H0251G787
13243E11584g7175B37201h0617A60028o1646J46261B0456a61031k1605C30158
13232b7760l3726A60511D9727i075m5372a1964l4435B13841A2040J28426F0548
13220c0170l79956A41356j2574J64749a03271I3281l2606K13648H0274L68735
13210D49009I2130P5989E3964M69945H5084K09749E6830O3744k7621j4112d4196
$$ y = [-149294, 102156, 317172, 190021, 165836, 184634, 277061, 97998, 256860, 260117, 10033, -81654, 237192, -51140, 398027, 137636, 279215, 38577, 156175, 401644, 457424, 239319, -91374, 479869, 282141, 420380, 268998, 93038, -92362, 187065, -46358, -73406, 319272, 323761, 121675, 204545, 191416, 105435, 68086, -15734, 220019, 188353, 129244, -22639, 433338, 80251, 7787, 511584, -77175, 237201, -80617, 160028, 98382, 244643, 20456, -161031, -182636, 330158, -27760, -61486, 160511, 49727, -9075, -54447, -11964, -46399, 213841, 12040, 140466, 60548, -30170, -410126, 141356, 128782, 293531, -103271, 93281, 60675, 274323, 80274, 449009, 92130, 168119, 53964, 523909, 85084, 294833, 56830, 120574, 92953, 78841, -44196]
13198a5721A84826G6987k4394b733A03318a7945B60739l2892A6723M12121A85133
13186B27202F253K64918J30357a72694A8576R9783a592C10213c8080C2689K86340
13175C19029A43484o6867J20308h5101A32678L2900p5083K13807a16189b2483
13164A9167a34509B6619a44451B12449a04840C7755J09130R2320P8032a68830
13153b9539F4710a92130l594B11408g0072C16424G6395J85050A2754K11201j00689
13142A23266A4616c7854B48575E6775k4147Q8370f3270F2414K0937A2252J26535
13131A38787o7987K28232j37720J28971A36056J16801A4655M65693i1764A50970
13120c2598l1773B66823a7991A1485K13924a24183B10932R4843b6306B37532c320
$$ y = [-15721, 184826, 76987, 52593, -2733, 103318, -17945, 260739, 227847, 16723, 428844, 185133, 227202, 6253, 271171, 401528, -172694, 18576, 118359, -1592, 310213, -38080, 32689, 319029, 143484, 76617, 196925, -85101, 132678, 165578, 90495, 304302, -116189, -22483, 19167, -134509, 26619, -144451, 212449, -104840, 37755, 146885, 239205, 317237, -168830, -29539, 64710, -192130, -195724, 211408, -70072, 316424, 76395, 261445, 12754, 223955, 123266, 14616, -37854, 248575, 56775, 32628, 120998, -63270, 62414, 83351, 12252, 138787, 70800, 299032, 161312, 290283, 136056, 252857, 14655, 480348, -91764, 150970, -32598, -64371, 266823, -17991, 11485, 225409, -124183, 210932, 305775, -26306, 237532, -3320]
13108i2869r0844d95A35233C2631J06521K4966n8390d7030A9725f7016D42081
13096A33682j2797d0758J9277k1316j6524E8978h8353C97561b69466A58535O909
13085A65444m4780j9609J19868D7402N2170J54430H2833K06196c83484h3941C41455
13073F5080J3999g0415B04188a68348d7979b3040B71826l0349J16414K0530g3376
13061C71131b2123I0269M8492m0385a4518C27364L6247A74800k6692k7277a13295
13049A52414o4792K167J71157I2304C8165L16386a03275A31704J43953A13107
13038A65519J65825c389A75582E3303a15917B53100j00973L3334e3142A14470
13027A16988a5117B85999d7802j68701P3317C27711I4963K03102j0199q7153a9239
$$ y = [-92869, -183713, -495, 135233, 32631, 139152, 164118, 105728, -47030, 19725, -67016, 442081, 133682, 120885, -40758, -21481, -42797, -59321, 58978, -88353, 397561, -269466, 158535, 165444, 120664, 101055, 220923, 47402, 99572, 254002, 82833, 289029, -383484, -83941, 341455, 65080, 79079, -70415, 204188, -168348, -47979, -23040, 271826, 241477, 357891, 378421, -73376, 371131, -22123, 90269, 138761, 98376, -14518, 327364, 363611, 174800, 148108, 120831, -113295, 152414, 87622, 89789, 260946, 92304, 38165, 354551, -103275, 131704, 275657, 113107, 165519, 331344, -3389, 175582, 53303, -115917, 253100, 152127, 185461, -53142, 114470, 116988, -15117, 285999, -47802, -216503, -143186, 327711, 94963, 298065, 287866, 200713, -19239]
13015A47272c8253q4031N4019B1063J22332a09328A67801h398A10250J33280p1437
13004A72093a34160A25398B3971K74316I6234d9628A2609a09735B49063a20997
12993I1018n371L6448J65827e72508D2339c7401k08877A3330P3586K68034n6277
12982B98673j09660h6792a4774A82138a35550M6807k5589A07965g3858j69118
12972b42976A57435L5158J63316a59719A42505Q8520A05252m2945K36234G4591
12961a25399C28693q0958o7669n275K26954b7601j25091N5893K2771H7301b1072
12949A79090b61737E625K89234A9294K48510r5061C0413L84312j76748E3254K16072
12938B69326L3113b05315e8336A39797K63030a27779d489B85037d6718B01873
$$ y = [147272, -38253, -122284, -68265, 21063, 143395, -109328, 167801, -8398, 110250, 243530, 172093, -134160, 125398, 23971, 298287, 96234, -49628, 12609, -109735, 249063, -120997, 91018, 85647, 122095, 287922, -572508, 42339, -37401, -246278, 13330, 86916, 354950, 298673, 189013, -86792, -14774, 182138, -135550, -88743, -114332, 107965, -73858, -242976, 157435, 192593, 355909, -159719, 142505, 231025, 105252, 62307, 298541, 74591, -125399, 328693, 247735, 180066, 174791, 401745, -27601, -152692, -96799, -74028, 87301, -21072, 179090, -261737, 5625, 294859, 19294, 267804, 172743, 30413, 414725, 237977, 53254, 269326, 302439, -205315, -58336, 139797, 402827, -127779, -4489, 285037, -46718, 201873]
12927D3663G251b56962E4526Q5883F0580L27785A05549a5091B88241J9410b03278
12915b32493a03211j0739A41528a11179p8080B15335B2593K958a9743q5681j53155
12904b58579A51367n8427d0437H3689b54390A21909O2039m2919J35578D6419j9130
12893B7289e5015l47018A76662n1797h4403G6546b6458I8072J70371F3708c3257
12881a5564j3453n5319L0825m9074A13070J22867g6620G7072L0015P9205a14219
12869E54386a18624A60482p1011K3010a96222b603E9959K05572Q6912A65358b37288
12857B65152L6076j30558h5000j21643a1524r9489o5999a203j51093K6296A33416
12845a84403P8697F4939b5825B73116N8764b48078B13200M9627N0060b83338C34416
$$ y = [43663, 7251, -256962, 54526, 140409, 60580, 388365, 105549, -15091, 288241, 307651, -203278, -232493, -103211, -113950, 141528, -111179, -189259, 215335, 22593, 25551, -19743, -105424, -258579, 151367, 92940, -40437, 83689, -254390, 121909, 183948, 141029, 276607, 46419, 27289, -55015, -402033, 176662, 124865, -84403, 76546, -26458, 98072, 268443, 63708, -33257, -15564, -29017, -84336, -53511, -102585, 113070, 235937, -76620, 77072, 107087, 186292, -114219, 554386, -118624, 160482, 89471, 112481, -196222, -2603, 59959, 265531, 352443, 165358, -237288, 265152, 301228, 170670, -85000, -206643, -11524, -111013, -177012, -1203, -152296, -126000, 133416, -184403, -105706, 64939, -25825, 273116, 331880, -248078, 213200, 262827, 312887, -283338, 334416]
12833H5686K49104d188I707a72655L0690E6888L92026j52865B8510f2615q9935
12822a52550r696b7608A35287c84453H4462l5013i3999j83142F479c64176l6721
12811d00897a14304I8018K9168a38821A40412h0376A47846C7805c7864l05324
12801c43188E44642H2318a55628c3163k0758A19111L59625C1557b1710H5899p669
12790G8230N6738a50581G619K15561J7837I1783k5428k9000a05718A78426B3717
12778B48439D4671a99207O4523A8318L1743K15806G3180a52477b415M62k50279
12767b52232B60018r6062K05346j33216B7254a15616c5629m47002A96915m3561
12757A53354J93184e3950D8906J51158b06663C24124b93655B5707j501P8038m5858
$$ y = [85686, 334790, -4188, 9707, -172655, -141965, 56888, 448914, 296049, 28510, -62615, -152550, -162246, -27608, 135287, -384453, 84462, 49449, -93999, -277141, 6479, -364176, -400897, -114304, 98018, 127186, -138821, 140412, -80376, 147846, 37805, -37864, -343188, 544642, 82318, -155628, -33163, -53921, 119111, 478736, 31557, -21710, 85899, 78230, 134968, -150581, 7619, 223180, 241017, 91783, 66355, 37355, -105718, 178426, 23717, 248439, 44671, -199207, -134684, 18318, 50061, 265867, 73180, -152477, -2415, -1953, -252232, 260018, 163956, 369302, 236086, 27254, -115616, -35629, -482631, 196915, 153354, 346538, -53950, 48906, 200064, -206663, 324124, -293655, 25707, 24206, 102244, 56386]
12746E6386J94081i4593C05995A44138J79595c6329A70600K18601D4246c746D24753
12734b32301A39479K18865H4964H088M42259G1923b51994B17060G6688O5710h9157
12722E20150b59495i6575F6357K03817l8211e5309A50961Q7725d48447K12958
12712b35489f5441B73088A30673M5187R1335o0738L883a25597A80257q6697Q9689
12701A83249J32203B2691c2548B20039a31834j09335f1724A10574f8095j68895
12691b36990A7146K86084D823J46032a21835j9671c6643B70224g2235m736A8593
12679C5037J9567N9730K30239d8841C1635N5884l128f0748E3659L01670b4298
12667C47517e5073j1032D6604L8010k0630h3328H5618j7790J3769J36312j06908
$$ y = [56386, 250467, -94593, 305995, 144138, 323733, -36329, 170600, 389201, 44246, -3746, 424753, -232301, 139479, 358344, 84964, 8088, 450347, 71923, -251994, 217060, 76688, 142398, -89157, 520150, -259495, -96575, 66357, 270174, 231963, -55309, 150961, 238686, -448447, -235489, -65441, 273088, 130673, 175860, 267195, 206457, 210340, -125597, 180257, 93560, 183249, 315452, 22691, -32548, 220039, -131834, -241169, -61724, 110574, -68095, -236990, 17146, 303230, 4823, 150855, -121835, -141506, -36643, 270224, -72235, -76971, 18593, 35037, 54604, 114334, 344573, -48841, 31635, 87519, 84391, -60748, 53659, 355329, -24298, 347517, -55073, -66105, 46604, 84614, 63984, -83328, 85618, 67828, 81597, 217909, 111001]
12656A11001m9731c065o4616B36684P5649F7411B5184M0248J60605J47940I1448
12644C6725J1800J90473C863g4068B32485R5802c40485B4599K60624R2338d0795
12632D3404D001K9180K48390G2500B0504c7989k4927A10198m8829K23856A38544
12620E2784e9112p8804A12847b1333k8158a2043A18821a05311n0204i442j6903
12609b6345j81273A16260C0923c4454j41458A78025h406j56807c6232A97271g9970
12597e9474A97122P5432j09068E266J14115b09193h7683A58784C8046J74799c9226
12585d9024a1271A70796C0919J18726a23386m0234B09910K82250c63894C7710
12574B46225b09977e1229j13329j41197A36548M3445A8833N5728P0433N7346j00669
$$ y = [111001, 61270, -3065, -67681, 236684, 312333, 67411, 25184, 65432, 226037, 373977, 91448, 36725, 48525, 238998, 3863, -74068, 232485, 328287, -340485, 24599, 285223, 377561, -40795, 43404, 4001, 33181, 281571, 72500, 20504, -37989, -62916, 110198, 61369, 285225, 138544, 52784, -59112, -137916, 112847, -21333, -49491, -12043, 118821, -105311, -155515, -9442, -26345, -207618, 116260, 30923, -34454, -175912, 178025, -8406, -165213, -36232, 197271, -79970, -59474, 197122, 272554, 163486, 5266, 119381, -209193, -87683, 158784, 38046, 212845, -39226, -49024, -11271, 170796, 30919, 149645, -123386, -163620, 209910, 492160, -363894, 37710, 246225, -209977, -51229, -164558, -305755, 136548, 179993, 18833, 74561, 144994, 202340, 101671]
12563A01671P761D865R6106J24377D9555M54234c153D39144B8862O9006b7885
12551B4970J67128l2503J22201B770c3813A0670K26104O5344h6262c5095R552
12540b5543D06443A92154c1519R26C59290n4139A03574q102c5673C35528G008
12528a71290a8617A27460a86311D7585d8992H2740a65527B06665l2195d6605j65389
12517b11994N4232C60112A41414b85799B4344a64097e1633B95338M1862G4261
12506A19523C9668B376M81206e5479K2015C34484A1389a62073A14069J46523p4100
12495A86492f4785r4789A2402a7247K906A25963B103R170L85264a56466B62078
12483d85799F2501a82347d4131C17151c8501B65155a5185j2597q7186k10549I1406
$$ y = [101671, 109432, 4865, 100971, 225348, 49555, 503789, -3153, 439144, 28862, 97868, -27885, 24970, 192098, 159595, 281796, 2770, -33813, 10670, 236774, 302118, -86262, -35095, -25543, 406443, 192154, -31519, -30593, 359290, 305151, 103574, 95472, -35673, 335528, 7008, -171290, -18617, 127460, -186311, 47585, -48992, 82740, -165527, 206665, 174470, -46605, -211994, -157762, 360112, 141414, -285799, 24344, -164097, -51633, 295338, 337200, 74261, 119523, 39668, 2376, 483582, -55479, -33464, 334484, 11389, -162073, 114069, 260592, 186492, -64785, -159574, 12402, -17247, -14341, 125963, 2103, 11273, 396537, -156466, 262078, -485799, 62501, -182347, -44131, 317151, -38501, 265155, -15185, -27782, -114968, -325517, 91406]
12471a94266f7122D85967A82318m7301c52575j142a28455j69326a37451A75212
12460a90285j95289H6392b8397k6901A1553K08347H3242Q9939G5353k848N9261
12449A31766k5967J42254H4020m692b8919A64096h9968C22726a08783j8223A4831
12437B78484m8701j02816J3148a4037A13340k6354a4231B42042n730D3757d06049
12425b4946I9425E858d855G8954e7202q2773Q688p217A3742N8705K06161j25595
12413A53013a56460B53299d39660D11497a42880F7943M79101d50574a61066c725
12402A35598h4910C02162b61666A39727n1158g0776j26647A4876N6295e7656A2741
12390b34832D9470a49459B14053i3394L2198I2306r617a88475e6607l3992c8906
$$ y = [-194266, -67122, 485967, 182318, 135017, -352575, -353717, -128455, -297781, -137451, 175212, -190285, -385574, 86392, -28397, -55298, 11553, 219900, 83242, 173181, 75353, 72505, 131766, 105799, 248053, 84020, 79328, -28919, 164096, -89968, 322726, -108783, -127006, 14831, 278484, 229783, 126967, 140115, -14037, 113340, 86986, -14231, 242042, 236312, 43757, -406049, -24946, 99425, 5858, -4855, 78954, -57202, -139975, -131287, -138504, 13742, 72447, 278608, 153013, -156460, 253299, -439660, 411497, -142880, 67943, 547044, -450574, -161066, -3725, 135598, -84910, 302162, -261666, 139727, 88569, -70776, -197423, 14876, 71171, -57656, 12741, -234832, 49470, -149459, 214053, -93394, -61196, 92306, 82689, -188475, -56607, -90599, -38906]
12378A68537d63822a93506A00184j7211k7445J64965q4397c4361l6667C57026
12367C23786j42293b50923F0639c3884A06901D7003a26406G9933a53680E0406
12356b16547G1418a32118j50909J38187B85481b2757B11277H5529f7585A79507
12345f7654I179O885L1024Q5408a51000I766f9856A06116R1525J0611c7719q3996
12333a21715f144C67706h5243A85120G3522b02753A48670E2644B6188L4584i3377
12321c6939H7647J68086D9028K2435J28909D1724e0615F9588M4307c11944A94348
12309A6819d5015B6058h2124B10431h6154H363c4220l22287a2270C50096a94391
12297a60606o6456c5007A70560b35105C53086j40075p6891j0443M1768N4926J77644
$$ y = [168537, -463822, -193506, 100184, 82973, 55528, 220493, 136096, -34361, -71028, 357026, 323786, 181493, -250923, 60639, -33884, 106901, 47003, -126406, 79933, -153680, 50406, -216547, 71418, -132118, -283027, -144840, 285481, -22757, 211277, 85529, -67585, 179507, -67654, 9179, 16064, 47088, 132496, -151000, 9766, -69856, 106116, 197641, 208252, -37719, -121715, -6144, 367706, -85243, 185120, 73522, -202753, 148670, 52644, 26188, 60772, -93377, -36939, 87647, 255733, 49028, 71463, 200372, 41724, -50615, 69588, 113895, -311944, 194348, 16819, -45015, 26058, -82124, 210431, -86154, 8363, -34220, -356507, -12270, 350096, -194391, -160606, -227062, -35007, 170560, -235105, 353086, 213011, 136120, 125677, 167445, 222371, 400015]
12286D00015b2158A42603F7991b8965B0710J70821a98871L0788B0029J01119J20247
12275B41395k6297l6202J58509a39621e9255E26974A49334a81415k8495C50806
12264b69311a7553r0074B45837m7750g654H7345R8680p052d3063k40728a5206
12252B13935M3320q1837J33357B6939c9450k2556K745n3272o9805B43676F0228
12240E32878a7801B33985a92984Q702D52957b27036i128B35176C3996j616J67891
12229B00271d4841B72717R8176A75882J24636A31291i3759k80D45324a48812A66502
12217B81721n4902p3616K32595j9415A31136c133A41048N81j3884K43848D3724
12205A17677M45410b8528I8192J09534H2141Q7412m4603K28359a46961A67980
$$ y = [400015, -22158, 142603, 67991, -28965, 20710, 191531, -198871, -168083, 20029, 121148, 241395, 215098, 178896, 337405, -139621, -59255, 526974, 149334, -181415, -209910, 350806, -269311, -17553, -107627, 245837, 198087, -7654, 87345, 186025, 178973, -43063, -283791, -15206, 213935, 257255, 175418, 308775, 26939, -39450, -62006, -59261, -112533, -182338, 243676, 60228, 532878, -17801, 233985, -192984, -184282, 452957, -227036, -9128, 235176, 33996, 32380, 200271, -44841, 272717, 370893, 175882, 300518, 131291, -93759, -94039, 445324, -148812, 166502, 281721, 226819, 153203, 385798, 366383, 131136, -3133, 141048, 141629, 127745, 371593, 43724, 117677, 563087, -28528, 98192, 207726, 82141, 169553, 124950, 353309, -146961, 167980]
12194e8425j00862C27794A43723a12819D4785L91425A30293d8532A56943f9195
12183B36119n9671K61469j85719e7973B19452b7676O901R942l3833A69206n6543
12172A12663i2968A44816m5647J94716j34364J29057j32093e2843C20929b5935
12161B07127o2414J06562a81809I5928K90766l1532A58844O3747b25j06987j73079
12150b80291e1821H3279c1886r4336A86997j8650G8984a44976A61865J56994E6337
12138I4692i1593J1183I9790A0245L5392P0218J40750i0334b3560j53532C34410
12126a78827h9085M1110F0925b0959k21658D00551j30563h9876A98624P584p2482
12115A33726J0759a22341L9502a9888l1876j60975J9946A20819h1509A9522C593
$$ y = [-58425, -159287, 327794, 143723, -112819, 44785, 436210, 130293, -48532, 156943, -69195, 236119, 176448, 437917, 252198, -57973, 219452, -27676, -20775, -10833, -44666, 169206, 112663, -92968, 144816, 99169, 293885, 159521, 288578, 156485, -52843, 320929, -25935, 207127, 144713, 251275, -181809, 95928, 386694, 355162, 158844, 222591, -225, -107212, -280291, -51821, 83279, -31886, -126222, 186997, 168347, 78984, -144976, 161865, 318859, 56337, 94692, -91593, -80410, 99790, 10245, 45637, 115855, 256605, -90334, -23560, -177092, 334410, -178827, -89085, -47975, 60925, -20959, -242617, 400551, 269988, -89876, 198624, 206208, 133726, 144485, -122341, -82839, -19888, -51764, -212739, -192793, 120819, -81509, 19522, 3593]
12103a43542C02406b04699B50352c47383h5455m7210L2602c9747A59179a75598
12092a78461A9194b24253C2183J33028g4801I4721a51274k40847B35391j14543
12082A20848m4183l5055a62797a3166F7497a3752B63564A04033P6139h1774A7789
12070A2730b2107j4354B2879r578J39837h8432c5858C28971L37308M85799D78366
12058A61880a53678b5407B1078J92037q0657b78663C5344j0446a73608A55543
12047F4049A2527a18667B37195D7415b13092N5322L185r0486m6520e0871j72823
12036b23694A56986K3665C2824J96497a94658e0448B0072a93487h709k81366N8548
12025b31527B58315a98465K0994B07056r7549a63360g8677G1197a47377j48720
$$ y = [-143542, 302406, -204699, 250352, -347383, -85455, -132665, -100063, -39747, 159179, -175598, -178461, 19194, -224253, 32183, 165211, -74801, 94721, -151274, -392121, 235391, 120848, 76665, 41610, -162797, -13166, 67497, -13752, 263564, 104033, 180172, -81774, 17789, 12730, -22107, -36461, 22879, 13301, 153138, -88432, -35858, 328971, 666279, 1152078, 478366, 161880, -153678, -25407, 21078, 213115, 132458, -278663, 35344, 24898, -173608, 155543, 64049, 12527, -118667, 237195, 47415, -213092, -157770, -154585, -245071, -291591, -50871, -223694, 156986, 180651, 32824, 229321, -194658, -50448, 20072, -193487, -8709, -290075, -231527, 258315, -198465, -177471, 207056, 109507, -163360, -78677, 71197, -147377, -296097]
12015b96097E1131L5300a5132C89258E033J96596P7995c52203A68909K15104r1821
12004B92192F088a5981A92970k937b89660B19858b92040h3916l35959K05880g793
11992d0966j19189i230o36330b84547A23165b3014A35563a21389k55412h2137
11981b33886R4968B63840a76429c0162l4354j2432B55154a58804C26508a62860
11970B32287a14608A47017b85137E756K01798i7440j48558D5439J27089g5944
11959c49149G9777a94529A78916b52067I7768f9856A99555g8713o4006A1846f4384
11947f2877l08878c1694l3790D09687A64124K6986p9652k9751b95643b6336j20440
11936a46776D7804a03619j2737m3117J1773B35723a02388M0504j62772g4067D9072
$$ y = [-296097, 51131, 86431, -15132, 389258, 5033, 201629, 279624, -352203, 168909, 384013, 292192, 6088, -15981, 192970, 190033, -289660, 219858, -292040, -83916, -419875, -213995, -7793, -40966, -160155, -9230, -645560, -284547, 123165, -23014, 135563, -121389, -376801, -82137, -233886, -138918, 263840, -176429, -30162, -64516, -76948, 255154, -158804, 326508, -162860, 232287, -114608, 147017, -285137, 5756, 207554, -97440, -245998, 45439, 172528, -75944, -349149, 79777, -194529, 178916, -252067, 97768, -69856, 199555, -78713, -142719, 11846, -64384, -62877, -371755, -31694, -65484, 409687, 164124, 191110, 111458, 81707, -295643, -26336, -146776, 47804, -103619, -116356, -159473, -147700, 235723, -102388, -61884, -224656, -74067, 49072]
11924A31240e9374j91549M9054A45375b24763j42312a5438D16235A0384i0979
11913H9505C087J28552F2983a74305k75268A4273L1633B2215J06801a31970a5888
11901a19340K1126l1196A17083a80695B14235F9864c35556A4372J84082o3570
11891A34884h2530k86192D3081L2174h9466C4612j5717a71147c3087a623r4096
11880i5719k7042a8676Q226m7829H438J1405J12601b09874E7678J55937p945e63377
11867A58066f8317J5264o7391cj93514f8811a5003l3819j94563Q1639C52358A7276
11854c05763a13823j96038d2217m7282j06198l8002g0038H7943a18258D4830d3222
11842g5534m04486J59563g1221j64708B64752p8845e2593A1173J40977h0100j31861
$$ y = [131240, -59374, -250923, -201869, 145375, -224763, -367075, -15438, 416235, 10384, -90979, 89505, 3087, 131639, 62983, -174305, -449573, 14273, 45906, 22215, 129016, -131970, -15888, -119340, -98214, -129410, 117083, -180695, 214235, 69864, -335556, 14372, 198454, 134884, -82530, -368722, 43081, 75255, -89466, 34612, 18895, -171147, -33087, -1623, -95719, -122761, -18676, -10450, -58279, 8438, 19843, 132444, -209874, 57678, 213615, 205670, -563377, 158066, -68317, -53053, -120444, -3, -193517, -68811, -15003, -48822, -243385, -161746, 352358, 17276, -305763, -113823, -309861, -42217, -89499, -195697, -233699, -70038, 87943, -118258, 44830, -43222, -75534, -480020, -320457, -71221, -235929, 264752, 185907, -52593, 11173, 152150, -80100, -211961]
11831b11961P198G0363M6552C1367a62197K3438B12149e33I6701N8426a0717l58007
11819c68724A6114b9398A43042a23067e1191F8646d1505C40928h4333j38103C2986
11807C26218p1846i0781b5023m0449P877o7544B6418c1334G025a7051q9144C0565
11794h9464A53443G2659N88679f0152A77589f8710c3349j84841A30975D2121b07203
11782c0980A72039B3133b47650I3812R2447c62462H1522e3904l9376J3946k52610
11771c31944R9232L7150C6546J62770b27979e4214M02l1831A74585N3303a39563
11759d533j57002H7653N4699a3823l7247J3238a5702F5127L63430a50316q4608
11748b34924O0906P633C1748O1198D0599a5281p9523A11435e4162D7002i4746
$$ y = [-211961, -204763, 70363, 116915, 31367, -162197, -138759, 212149, -533, 96701, 155127, -10717, -368724, 16114, -29398, 143042, -123067, -51191, 68646, -41505, 340928, -84333, -222436, 32986, 326218, 254372, -90781, -25023, -65472, -57595, -125139, 26418, -31334, 7025, -17051, -106195, 30565, -89464, 153443, 72659, 661338, -60152, 177589, -68710, -33349, -218190, 130975, 42121, -207203, -30980, 172039, 23133, -247650, 93812, 186259, -362462, 81522, -53904, -93280, -79334, -331944, -232712, -195562, 36546, 199316, -227979, -54214, -53812, -85643, 174585, 227888, -139563, -4533, -161535, 87653, 142352, -13823, -51070, -37832, -15702, 65127, 428557, -150316, -234924, -174018, -166385, 31748, 92946, 40599, -15281, -94804, 111435, -54162, 47002, -94746]
11736f1898j9940E4159e2850r7949A0465b8836K721A46700D8972b71673e3940
11724d4849B88708M3657a85097P1647b7584j21213n4436L5352B19385l2960E7004
11712G534K18943g8488A11376j8319q235a94414A25969M4755b85178J41240m45161
11701e89099a72928A5976a83342A4625R3257a89230a4802D216d8355B5684J664
11690B7348b87183A15674J12695k2909a8852A13631Q3756F8960N3868b28524Q7302
11679a41222A3898L174R4799L47710h273j34851A22274h2076n6077A44319A8446
11667D4507K3263b15008D1561J18744e5262I9016a4548l1925A79689e1729m9807
11656a01536b7141B07450D5479a47522j4359l7814k0098F8504A9022J88080p9442
$$ y = [-61898, -81838, 54159, -52850, -150799, 10465, -28836, -26115, 146700, 48972, -271673, -53940, -44849, 288708, 332365, -185097, -113450, -27584, -148797, -203233, -167881, 219385, 186425, 57004, 7534, 226477, -78488, 111376, 93057, 84822, -194414, 125969, 170724, -285178, -143938, -589099, -172928, 15976, -183342, 14625, 107882, -189230, -14802, 4216, -48355, 25684, 27348, -287183, 115674, 228369, 205460, -18852, 113631, 197387, 68960, 122828, -228524, -141222, 13898, 17072, 111871, 459581, -8273, -143124, 122274, -82076, -138153, 144319, 18446, 44507, 67770, -215008, 41561, 160305, -55262, 99016, -14548, -46473, 179689, -51729, -101536, -27141, 207450, 45479, -147522, -161881, -199695, -219793, 68504, 19022, 207102, 127660]
11645A27660L75433a54181A65379k0583a57918k92315a20472j29360C06001b28391
11634B08650K01653a40529L6470M5944j16440A4237P6915M5442d36319A76993
11623A54792f0549B24333a94445H4260a60666b486I5713J17170A3917K78923F2901
11611A60427j786d535j53155D37240b9418m7325C8780K81081a13515c6630A28886
11599a19627K3999M2591l9299B488R848f8041Q243A68058O9602b52546A67899
11587a32698I9055Q3586Q5507q7044i5058M4876m9642l18972A9634K26036d0641
11575A022J86206b86703F4171a58516H5624K9868c00708E1867a38838C53055C5160
11563a99520k09163A11485K88799E0428J44771h7497k88688C59512a84640b7216
$$ y = [127660, 503093, -154181, 165379, 144796, -157918, -450233, -120472, -249832, 306001, -228391, 208650, 410303, -140529, -104059, -58115, -174555, 14237, 91152, 136594, -436319, 176993, 154792, -60549, 224333, -194445, 84260, -160666, -2486, 95713, 212883, 13917, 292840, 62901, 160427, 158641, -4535, -157690, 437240, -29418, -76743, 38780, 319861, -113515, -36630, 128886, -119627, -95628, -53037, -92336, 2488, 12336, -68041, -59798, 168058, 237660, -252546, 167899, -132698, 99055, 182641, 268148, 181104, -95058, -50182, -99824, -418796, 19634, 245670, -40641, 1022, 187228, -286703, 64171, -158516, 85624, 115492, -300708, 51867, -138838, 353055, 35160, -199520, -408683, 111485, 400284, 50428, 195199, -87497, -376185, 359512, -184640, -27216]
11552d1694G1457L6777A812f0032B8262d1829M758D5483a18918j0254A36534D8118
11539a14455q4592C03837c08314D0001J18850a2831I1028J37365P0165c28521
11528h5299B16719E2400R6215j2535J28433H3777j2225N0891L1403Q154b06943
11516a44486A32392a36913D00272j98424b20025E1121b18361m5560E9855J23248
11506A83103P6617P6861B047O9075O1928k4404f3680r7344C12217P5877A15244
11494A11765d5850F0020j7922g7215B34860l4289L41676a8238j53043B05973A8466
11482B15710C1750J62411I3418K30577B4472Q0828a984C72950E4679e2653j3866
11471f6519C38288a60188C53652j04160h6116G3686d248D7428a28312d6187A18669
$$ y = [-41694, 71457, 108234, 1812, -60032, 28262, -41829, -37071, 45483, -118918, -129172, 136534, 48118, -114455, -199047, 303837, -308314, 40001, 158851, -12831, 91028, 228393, 298558, -328521, -85299, 216719, 52400, 148615, 136080, 264513, 83777, 71552, 122443, 153846, 162000, -206943, -144486, 132392, -136913, 400272, 201848, -220025, 51121, -218361, -263921, 59855, 183103, 259720, 336581, 2047, 71122, 133050, 108646, -63680, -161024, 312217, 388094, 115244, 111765, -45850, 60020, 42098, -77215, 234860, 200571, 542247, -18238, -171281, 205973, 18466, 215710, 31750, 194161, 93418, 323995, 24472, 105300, -1984, 372950, 54679, -52653, -66519, 338288, -160188, 353652, 249492, -86116, 73686, -4248, 47428, -128312, -46187, 118669]
11459B93484n3646q2525K80599A69035l0554a83478c1838F8375L07576h5553a1117
11447G4796h8321B52105g9796n2029k4938A48645a36822B18701B0732J22723J2908
11436A56363G5705g1588A34676l9964h292j19840R086k38935B32216a16494j52016
11425b68510c2150A15128c12526A11099a87677C90913H2717a41959c709A9597
11414b03709I6724a06093j73317L1310R5398F798a42423A22451n8118e70875K40293
11403c30582A38656l2345I653K9775b39181Q9632e1214A43241a96476r1114I4181
11391a69709D60886b99012A65372l685g2664j12629A00234K96545H4793a14236
11380A92501b63561C1276J63100k2561O0592H2700L09252A39646g1679A23098
$$ y = [293484, 239838, 157313, 437912, 169035, 138481, -183478, -31838, 68375, 375951, -85553, -11117, 74796, -88321, 252105, -79796, -131825, -156763, 148645, -136822, 218701, 20732, 143455, 156363, 75705, -71588, 134676, 94712, -8292, -128132, -119046, -357981, 232216, -116494, -268510, -32150, 115128, -312526, 111099, -187677, 390913, 82717, -141959, -3709, 19597, -203709, 96724, -106093, -279410, -248100, -152702, 6798, -142423, 122451, 64333, -570875, -330582, 138656, 106311, 9653, 39428, -239181, -149549, -51214, 143241, -196476, -287590, 94181, -169709, 460886, -299012, 165372, 161687, -72664, -185293, 100234, 396779, 84793, -114236, 192501, -263561, 31276, 194376, 171815, 232407, 82700, 391952, 139646, -71679, 123098]
11369A07920o128K78364B3693i2871r60B80397E3994J6253K66901f0444m1392
11358a01836H1271J84475a4582k56278a3053B99979b50225O7684O6369a2383k34606
11347b46989A73366C5467K7935h8633d0380A87616e415A32224k9535c5056B927
11335A99368e9631A4310K45877E8493a10895N2552B29379b95342A31471K68587
11325D00058g7927D6906K85953b44812R2769j53245K962E2004a67130A80214q4210
11314I6004p459c6672B04197G1133i4436A0327c4726m110p920C0699d7498j4380
11302f1878B0419K60032c05807l8214j84692b3485p2989j28173E3143g1732j0348
11291h2080k36542a19349A76222a04043A86355i3847j6270B2361d6378k3179b7015
$$ y = [107920, 101792, 380156, 23693, -92871, -93831, 280397, 53994, 70247, 337148, -60444, -101836, 81271, 265746, -14582, -270860, -13053, 299979, -250225, -182541, -116172, -12383, -246989, 173366, 35467, 63402, -88633, -40380, 187616, -5415, 132224, 102689, -35056, 2927, 199368, -59631, 14310, 260187, 58493, -110895, -58343, 229379, -295342, 131471, 400058, -77927, 46906, 332859, -244812, -152043, -305288, -302326, 52004, -167130, 180214, 96004, 88545, -36672, 204197, 71133, -94436, 10327, -34726, -38836, -46756, 30699, -47498, -61878, 20419, 280451, -305807, -344021, -528713, -23485, -96474, -224647, 53143, -71732, -82080, -318622, -119349, 176222, -104043, 186355, -93847, -110117, 22361, -46378, -69557, -27015]
11279a32900K639M4595l38954A27759L07581J58505b59296L1095C53558p2236
11269B81322a11210D9985a34800A35053a877n7020A6709b09508A48933a54972
11258A25906l9595L44645b12310A4088a98678a9223p6907k14482A49264a88517
11247B7807J40152a44520b6768n8181K9164n7095j96540B50125a74155c2935D5983
11235g806o2467J2387l2955k2835B91263q6899m0429c49063C2332b13190d8825
11223C920b58305g9985l6681N6426F5413R0981a73444L0102L6358n00532K38223
11212c69293a09118a1229D634h1293B39731F8226b07546j4904A60939c7450A25875
11200f2592j33380M1873d4220B8807c28362a63397J5574N2468p8589m7538A04773
$$ y = [-132900, -130261, -85666, -424620, 127759, 435340, 593845, -259296, -228201, 353558, 281322, -111210, 49985, -134800, 135053, -1877, -58897, 16709, -209508, 148933, -154972, 125906, 86311, 430956, -212310, 14088, -198678, -19223, -96130, -310612, 149264, -188517, 27807, 167959, -144520, -26768, -84949, -55785, -112880, -309420, 250125, -174155, -32935, 45983, -7806, -70273, -57886, -90841, -113676, 291263, 204364, 163935, -349063, 32332, -213190, -48825, 3920, -258305, -79985, -116666, -60240, 65413, 156394, -173444, -143342, -106984, -607516, -369293, -109118, -11229, 4634, -81293, 239731, 68226, -207546, -222450, 160939, -37450, 125875, -62592, -195972, -154099, -44220, 28807, -328362, -163397, -147823, -95355, -173944, -221482, 104773]
11188B4109n623R935a27738L9181I6022b11769b5654A05044l7616f0012E8242
11176F8395d39705a83900F3298c47794J64045G9016b55892B26711b5313H20J20431
11165A21251a4210k56321H4724J15177a66802E64072b90615R3155A47981e8927
11154b3248C02831A01346K44534f64198B88284C9095e6597A10442d02270K00094
11144b02176R8846j84934d7175o0122m151E1956K3919c16905D90607C0581b65638
11132A1917d8398A85369a28378C10059A04252C6890b20003A37689m5380N703f4652
11120F2791b56407C67552b46206c8100A6387b38883B05104A1944d85196B21530
11109b6697d354C67386j05825n1846I3266B3339J41831K79017F4771d4177D61825
$$ y = [24109, 18486, 28421, -127738, -88557, 96022, -211769, -25654, 105044, 67428, -60012, 58242, 68395, -439705, -183900, 63298, -347794, -183749, 79016, -255892, 226711, -25313, 820, 121251, -14210, -270531, 84724, 199901, -166802, 564072, -290615, -197460, 147981, -58927, -23248, 302831, 101346, 345880, -664198, 288284, 39095, -56597, 110442, -402270, -202176, -103330, -288264, -47175, -107297, -111448, 51956, 75875, -316905, 490607, 30581, -265638, 11917, -48398, 185369, -128378, 310059, 104252, 36890, -220003, 137689, 92309, 98012, -64652, 62791, -256407, 367552, -246206, -38100, 16387, -238883, 205104, 11944, -485196, 221530, -26697, -4354, 367386, 261561, 209715, 93266, 23339, 165170, 444187, 64771, -44177, 461825]
11097A64542a24757C7181M02060A7326K08494j10623p112K50564E2808g5254C45514
11085A49446j8282R1054j04650K26726c5848F6923A2994R3450L8383l1995O4425
11074A77257J0371e7946b4499E12453B05096J94017j83418E9220L89399A71397
11063C21729q4717J91884J01950B27143K84310J87948k76253L35819C44076R3074
11053D37150K46609P2570k17790L06607j48839J80884j94217k57197N77589l66476
11043F36890J62081k37689q8844k13861N11382j21525M16794l65488l32985j41149
11033B25606Q5915P9125J63449j38041J31489M05111m25990J1788l9299b9913
11022I13141l13354i2883D84063r4713K3761R6125A86255K28681J50727O253m800
$$ y = [164542, -124757, 37181, 439241, 17326, 225820, 115197, 108085, 358649, 52808, -75254, 345514, 149446, 131164, 222218, 117568, 344294, -35848, 66923, 12994, 106444, 144827, 112832, 177257, 187628, -57946, -24499, 512453, 205096, 399113, 215695, 59220, 448619, 171397, 321729, 237012, 428896, 530846, 227143, 511453, 699401, 423148, 758967, 344076, 437150, 683759, 756329, 538539, 845146, 696307, 877191, 682974, 425777, 1003366, 636890, 798971, 561282, 472438, 258577, 769959, 648434, 1065228, 699740, 366755, 225606, 311521, 390646, 554095, 416054, 547543, 952654, 526664, 538452, 499153, -29913, 913141, 599787, -92883, 484063, 389350, 413111, 509236, 186255, 414936, 565663, 571916, 567116]
11011E67116k44202Q9767L76341l14444J18127k18043Q5477k4015j33055A47324
11000F73522B59102M39808J05265j4613l88941J58139J39722j3311k18630K94944
10990G61485k14048J51200Q5996j1141K43875o5734k39991k54436M20591j56703
10980G21094L66661l54057K73057o6711K34334P16888L98867M64042k77605J47255
10970B623825j7795l04138l26099J95176k21469l34462m94127K46792K20752m79183
10960A109272M43108n2155j55707J93198k14242R932j57883n34397J44928j3676
10950G72378M1417C81290j43517K27618k26537J1536o9422a3641D34397b21190
10939B83025j23819K43981a92437K2278E2724J01117J02602A14749J57080J47593
$$ y = [567116, 322914, 412681, 789022, 474578, 592705, 374662, 460139, 436124, 303069, 147324, 673522, 259102, 698910, 804175, 789562, 400621, 558760, 698482, 685171, 466541, 761485, 547437, 698637, 784633, 773492, 1017367, 951633, 711642, 457206, 877797, 721094, 1087755, 733698, 1006755, 940044, 1174378, 1891266, 2290133, 2754175, 2476570, 2623825, 2606030, 2301892, 1975793, 2170969, 1949500, 1615038, 1120911, 1367703, 1588455, 1109272, 1552380, 1500225, 1344518, 1537716, 1323474, 1333406, 1175523, 641126, 786054, 772378, 813795, 381290, 237773, 465391, 238854, 250390, 180968, -13641, 434397, -221190, 283025, 159206, 403187, -192437, -170159, 52724, 153841, 256443, 114749, 271829, 419422]
10929D19422D3601N8986J2856J20093k7094g7748r5744N4405A8506K37105d5279
10917H0870c97036g2124F8434k4529J20043Q2356r4667N517a15333j72346R651
10906b78028J20525j82655A61133b73606E7599g7157A22864m0869c3393k02751
10896b36144A48613b04464p0497i1711K6488n8832j63040q7973C1882O2913i9199
10884C95572a59853j88252A84888A2505K5064R2059a07046k58222A12799O0038
10874A72837c63826a07299H2258a01583k1767F2878J0492K56K00769r9298J78358
10863C53455J8462c32746E6966I181c5111p7172A64598j4985r087O1043J74078
10852C75647a47221d7539n4740B37737e6433A71037C7880e6858F4665J9883a89241
$$ y = [419422, 43601, 102587, 115443, 235536, 208442, -77748, -173492, -119087, 18506, 255611, -45279, 80870, -397036, -72124, 68434, 43905, 163948, 246304, 151637, 157154, -115333, -287679, -278028, -157503, -340158, 161133, -273606, 57599, -77157, 122864, 81995, -33393, -236144, 148613, -204464, -274961, -91711, -65223, -124055, -287095, -375068, 31882, 94795, -99199, 395572, -159853, -348105, 184888, 12505, 37569, 129628, -107046, -365268, 112799, 172837, -363826, -107299, 82258, -101583, -123350, 62878, 73370, 73626, 274395, 175097, 353455, 371917, -332746, 56966, 9181, -35111, -112283, 164598, 149613, 140526, 201569, 375647, -147221, -47539, -102279, 237737, -56433, 171037, 37880, -56858, 64665, 84548, -189241]
10840d10137d8870n0779A47587B4585b25670A60511f7428R158j72228A48743d31867
10828A3567K6381J90068i7803l0339N6918n6872j19755H984a40951B3873d1307
10816C20013a82098j5024C71658b3964j29239k41090h9211l37179g7554j23877
10806b01431b4856k2487A3974b75204D3033a31222c5863B10683A6304J94078f9042
10794b54780B13398c00048J09750Q6028k00515J48250E271d7484A28599b66508
10783E863N5383J6170A2325K09739a72396B40835B3636P7359a74569F4854c5016
10771e2022J8482l8086o270B1490J02134b166n7429C18799A04058e4192J3951
10760d0241k8439j00139q2918e6324I5354o425N9937a00201j62561a16795d4413
$$ y = [-410137, -48870, -99649, 147587, 24585, -225670, 160511, -67428, -58270, -230498, 148743, -431867, 13567, 39948, 230016, -97803, -128142, -71224, -128096, -247851, 8984, -140951, 23873, -41307, 320013, -182098, -197122, 371658, -23964, -153203, -394293, -89211, -426390, -77554, -201431, -24856, -47343, 13974, -275204, 43033, -131222, -35863, 210683, 16304, 210382, -69042, -254780, 213398, -300048, -190298, -104270, -304785, -156535, 5271, -47484, 128599, -266508, 5863, 61246, 77416, 12325, 222064, -172396, 240835, 23636, 100995, -174569, 64854, -35016, -52022, -33540, -71626, -77896, 21490, 123624, -2166, -59595, 318799, 104058, -54192, -40241, -68680, -168819, -251737, -56324, 95354, 88929, 148866, -100201, -262762, -116795, -44413]
10748A02568B3015a65989M1195N3726A62536B8403a9457l44491G141c27780J43801
10737a83979B15183b54240I5758b47158r7954g2043c681B24493A03099a38691
10726C19393H4618B9701a90551E5352b95033K2589D7942c35423C3626e5808A40732
10714c56541g1841L2910k85089D15967G1219d7317A03105m9501a5975C9561q174
10703C1387n820b29333n5313i4762A08658d32686J85981a9101k68975k25494a75514
10691A47962A6368O0994a59190C8520K78346c38561A5052L04987h821I388g8672
10679a08499j86052B22212g7003r1072B08475c88308Q969D4726a5171D812K77190
10668B82002J8634b35513G0407a81556L9558H6468b70126i8086M4115j45256B0541
$$ y = [102568, 23015, -165989, -124794, -71068, 162536, 28403, -19457, -363948, 7141, -327780, -183979, 215183, -254240, 95758, -247158, -345112, -72043, -3681, 224493, 103099, -138691, 319393, 84618, 29701, -190551, 55352, -295033, -272444, 47942, -335423, 33626, -55808, 140732, -356541, -71841, -38931, -324020, 415967, 71219, -47317, 103105, 53604, -15975, 39561, 31387, 25567, -229333, -284646, -94762, 108658, -432686, -246705, -19101, -288076, -513570, -175514, 147962, 16368, 77362, -159190, 38520, 316866, -338561, 15052, 320039, -8821, 9388, -78672, -108499, -294551, 222212, -77003, -168075, 208475, -388308, -379339, 44726, -15171, 4812, 282002, 300636, -235513, 70407, -181556, -141998, 86468, -270126, -98086, -53971, -199227, 20541]
10656a84372a202o2649j30476O5408A08872b57122A77858D1436J56178B4784a70536
10644a82981B821a0153E6954a09009G285a84225E3514K70354b04772p3757f3402
10632c05344P9440A09837g9869n0381j88299j73430g5656j6900n0289B52632G347
10620a70106b704k6027A16121a39115f7737E967J56044Ab5969m6222j5259n4554
10608a42004E0565e5841j44344a895C1761a64046P3752E6748a93552e3088G6429
10596I2009a35670e7357B6855f5222j50657B0573d980q2923p4949I608h4776p1845
10584a56621L0688r1744H5286d7401C22681A29608a81804O9637A403a77015L2511
10573a44504k57172a60730A04388B1450J19642M0131l8795J53228C0594J29345
$$ y = [-184372, -1202, -63851, -194327, -128919, 108872, -257122, 177858, 41436, 197614, 24784, -170536, -182981, 2821, -10153, 56954, -109009, 7285, -184225, 53514, 323868, -204772, -278529, -63402, -305344, -225904, 109837, -79869, -130250, -318549, -491979, -75656, -92556, -142845, 252632, 7347, -170106, -2704, -28731, 116121, -139115, -67737, 5967, 162011, 1, -25969, -72191, -87450, -142004, 50565, -55841, -200185, -1895, 31761, -164046, -90294, 56748, -193552, -53088, 76429, 92009, -135670, -57357, 26855, -65222, -215879, 20573, -4980, -87903, -162852, 9608, -84776, -156621, -125933, -217677, 85286, -47401, 322681, 129608, -181804, -112167, 1403, -177015, -144504, -401676, -160730, 104388, 21450, 141092, 181223, 142428, 295656, 30594, 159939]
10563A59939L7661a09743j15791R0392C83139b06395G6148a07921A30751h1631
10552E9171b58774H0501l4730b16768k1241b2465k66071E37174A53486E0960J44700
10541A95660i1904l47968b16387A2326a61605q6238f3339l25130B68879g0115
10530b57642b8100B07956d9512B903g692A11503A7538J07812L53333f8638k22304
10519b90942M2628N3205b2337H4849Q5133O7024D7975a4264m81095J70739A34456
10507g7571B1624a5476A59494C5468a34294G3508a64945j258K7045B43892I5423
10495a56502k8476B36788D7096b02195p5364a26320B08543R6958j01877a68685
10484C1012a01933A60983k044J00424k728J58112g3120o0521c9735r2296A20097
$$ y = [159939, 197600, -109743, -225534, -135142, 383139, -206395, 76148, -107921, 130751, -81631, 59171, -258774, 80501, 45771, -216768, -238009, -22465, -288536, 537174, 153486, 50960, 195660, -91904, -439872, -216387, 12326, -161605, -247843, -63339, -388469, 268879, -70115, -257642, -28100, 207956, -49512, 2903, -7692, 111503, 17538, 125350, 478683, -68638, -290942, -248314, -195109, -22337, 84849, 169982, 237006, 47975, -14264, -495359, -324620, 134456, -77571, 21624, -15476, 159494, 35468, -134294, 73508, -164945, -166203, -139158, 243892, 95423, -156502, -184978, 236788, 47096, -202195, -277559, -126320, 208543, 305501, 203624, -168685, 31012, -101933, 160983, 158939, 259363, 256635, 414747, -73120, -133641, -39735, -132031, 120097]
10472A00971B2715J4771J28531a57251J3756M224A20096b3774B17046J09317a2182
10460h5468k66622A55877p0620b11423B94432a3339k5640l08036N2917d2383C02689
10448a49820A22022O9329K0284a7768q4932j4170H6527a32047k0727b492j40154
10437a42646H6790J57230A00243e8630A26379K8579f7052j37956C6900c13285
10426A35932R6917A656b47077I9103b25916A48167b26737F20b87207D65299h7725
10414A51461l5100a28964J4318j7365o1441g0885r359A26735b61402B25188n2144
10403A73044F3131a76486B0613a07960B06460a09634q9910A86815b05836c6664
10392c39680G5642a411E19061F8910P3992B8338J92892a47742A07584D4509J85740
$$ y = [100971, 22715, 37486, 166017, -157251, -143495, -139271, 120096, -23774, 217046, 326363, -12182, -85468, -352090, 155877, 85257, -211423, 294432, -13339, -38979, -347015, -294098, -42383, 302689, -149820, 122022, 191351, 211635, -17768, -102700, -116870, 86527, -132047, -152774, -2492, -142646, 86790, 244020, 100243, -58630, 126379, 154958, -67052, -205008, 36900, -313285, 135932, 232849, 1656, -247077, 99103, -225916, 148167, -226737, 620, -287207, 465299, -87725, 151461, 116361, -128964, -114646, -132011, -193452, -70885, -80244, 126735, -261402, 225188, 173044, 63131, -176486, 20613, -107960, 206460, -109634, -199544, 186815, -205836, -36664, -339680, 75642, -1411, 519061, 68910, 142902, 28338, 221230, -147742, 107584, 44509, 230249]
10381B30249q4302e9043A22277K35852p7721p646D9539F619J05821a61594O5970
10370i5624D74129j81034P2116J18331k7563J07130A01412J91428r388a1996I1725
10358A61364m3951K08801A23210L8427P7976k6873L3410C8068K29724N19322A93578
10346D76185J73547k69711A60310K32506G6930K84763H2191J80791O9080J40914
10336D72976A41814C1022q257J06676J26975h1569j2467K0916C75331a49401o2205
10325b11606C96386j42125J19617j76645j7322J2419a24901A45460b24242B71162
10314b77291D9172r025Q6808a13879J7018M208A61856a84665A37958M8188J9763
10303B05909b02337B16050F155L0888c5254B54307k5350b4614E1461j3639b61798
$$ y = [230249, 145947, -59043, 122277, 358129, 280408, 272762, 49539, 6619, 112440, -161594, -95624, 474129, 293095, 365211, 483542, 455979, 563109, 101412, 292840, 283452, -11996, 91725, 161364, 117413, 326214, 123210, 161637, 239613, 212740, 246150, 38068, 267792, 787114, 193578, 476185, 649732, 380021, 160310, 392816, 76930, 361693, 82191, 262982, 332062, 472976, 141814, 31022, 22765, 129441, 256416, -81569, -94036, -73120, 375331, -149401, -211606, 396386, 254261, 373878, 197233, 179911, 192330, -124901, 145460, -224242, 271162, -277291, 49172, 40147, 126955, -113879, -96861, -92653, 161856, -184665, 137958, 186146, 205909, -202337, 216050, 6155, 37043, -35254, 254307, 228957, -24614, 51461, 37822, -261798]
10291d1416A18595a96197n7510h7562R729n143a7622A9072E391a25722q8460A52187
10278c25370e3472l3125k04217f7838A87706a20115k39388C9582b78101i8392
10267a43402d5748G3748c1280h095D26015I3637p631L99972k29797D9471K93425
10256C42896l1452g6475C61819A33133i509j52049r9970I4579b38138J0527N7804
10245a69807q5892m1146O2209j23562J76444j85381A14979D3512k0996Q5834f5704
10233a74469n6649p1865C95757J08920a6906H1351b62297Q4053H7822h1462l46699
10222d28161E983K24994c11593B87779a73828H5735b45102a18500p3779A39341
10211a08897M6970c0j9627q8384d7483k16970B60272a3513l04711a26610C183
$$ y = [-41416, 118595, -196197, -253707, -87562, -77833, -82976, -17622, 19072, 5391, -125722, -214182, 152187, -325370, -53472, -86597, -290814, -67838, 187706, -120115, -359503, 39582, -278101, -98392, -143402, -45748, 73748, -31280, -8095, 426015, 93637, 86006, 485978, 256181, 49471, 342896, 311444, -76475, 361819, 133133, -9509, -161558, -261528, 94579, -238138, -227611, -169807, -255699, -296845, -234636, -358198, -181754, -367135, 114979, 43512, 22516, 108350, -65704, -174469, -231118, -302983, 395757, 504677, -16906, 81351, -262297, -178244, 87822, -81462, -428161, 5983, 230977, -311593, 287779, -173828, 85735, -245102, -118500, -192279, 139341, -108897, -61927, -30, -19657, -108041, -47483, -264453, 260272, -13513, -318224, -126610, 3183]
10199A4386a16374E2727J3016b34829j07191J30819A1695a44119D12219E5660
10188b68600b4875n699A70198d4735A93302i7981H495O6519J54658b46741a04150
10176a45576c2320I0309K76691r9393B9571b50281O524B25416b07535B26160b41498
10164a22784l6586G6371O9888C546a20658F5970J47782b95084a041k76982Q0710
10153a97313e0570J6153j60539c9458j36381A43167a22933G4020K01290H4289
10142F2982a48524l104r3332O2938A08478c01869A85646G275b1884p6635j64521
10131b63040H1856a12772C36251e9385A13619c36376A04346B7476b32444G1081
10120a72230b7378l3785j43676l8011G9598i3511n9294H6137a86027B72772a18818
$$ y = [14386, -116374, 52727, 65743, -234829, -342020, -211201, 11695, -144119, 412219, 55660, -268600, -24875, -30574, 170198, -44735, 193302, -97981, 8495, 75014, 229672, -246741, -104150, -145576, -32320, 90309, 367000, 267607, 29571, -250281, -243757, 225416, -207535, 226160, -241498, -122784, -159370, 76371, 146259, 3546, -120658, 65970, 213752, -295084, -1041, -278023, -197313, -50570, -34417, -194956, -39458, -175839, 143167, -122933, 74020, 275310, 84289, 62982, -148524, -151628, -244960, -182022, 108478, -301869, 185646, 7275, -21884, -98519, -263040, 81856, -112772, 336251, -59385, 113619, -336376, 104346, 27476, -232444, 71081, -172230, -27378, -61163, -204839, -242850, 79598, -93511, -152805, 86137, -186027, 272772, -118818]
10108c02996a4409C0281K12952e3724k48037A42006B8452c2953A59881f3983k52614
10097c16597O9250B51361G321h5515A53453c14557a09767K0323k7854j1793e1288
10085E5766a39622A37996a07217E2027b36850D6337K24030D0145b30790d712j55575
10074a60287I003a38800D3991a44987o6983F163e868p5373G9934C5854a65030
10062c64089A34164a31004q1003d4976B6145M0255b58745A39752L3535D5368b7953
10050G3149i2609K9159E0420b20000M1100h4562j7080A4697g0688J1824F0275
10038a9388B78324f5482o2469B27599d637j12713B6755J11251B8548d8023n3787
10027a01810A31849a9844G0067A6603J92916c12345O4978B3799b33861E6666h1409
$$ y = [-302996, -14409, 30281, 243233, -53724, -301761, 142006, 28452, -32953, 159881, -63983, -316597, -247347, 251361, 7321, -85515, 153453, -314557, -109767, -89444, -117298, -129091, -51288, 55766, -139622, 137996, -107217, 52027, -236850, 46337, 270367, 40145, -230790, -4712, -160287, 9003, -138800, 43991, -144987, -211970, 6163, -5868, -81241, 79934, 35854, -165030, -364089, 134164, -131004, -212007, -44976, 26145, 66400, -258745, 139752, 173287, 45368, -27953, 73149, -92609, -63450, 50420, -220000, -178900, -84562, -101642, 14697, -70688, -58864, 60275, -19388, 278324, -65482, -127951, 227599, -4637, -117350, 26755, 138006, 28548, -48023, -101810, 131849, -19844, 70067, 16603, 209519, -312345, -247367, 23799, -233861, 56666, -81409]
10015a07457o366E8208b39995J8164D18725a76048p9242M591J18533j306k82550
10004d16022a01159J8255C93471c24349a49431H8205b44139A2130b67263J06562
9994a60701A2244c3795j40161j01022b4841A4607c9410G6566a80893j77951B6441
9982b61699i6869B70151E2831a83116B4086a49617g2371I7090f1419j06124A05380
9970b82678B7045j1618b5603A1425a50250k5857C8541b99635c2108q3370J9545
9959i5933l6997G148a84799A57640E3856c14202g7485A66322a96956k7661A75381
9947a5032k88469a35266j45951J35226e8487k75591b5700B96792f4007j55749
9937b19756K1813k40481A23714i3066l8760m86267A36674C7841b25380l05722
$$ y = [-107457, -113823, 58208, -239995, -221831, 418725, -176048, -255290, -250699, -132166, -133472, -416022, -101159, -82904, 393471, -324349, -149431, 88205, -244139, 12130, -267263, -160701, 12244, -33795, -173956, -274978, -24841, 14607, -39410, 76566, -180893, -358844, 26441, -261699, -96869, 270151, 52831, -183116, 24086, -149617, -72371, 97090, -61419, -167543, 105380, -282678, 27045, 15427, -25603, 11425, -150250, -176107, 38541, -299635, -32108, -115478, -95933, -132930, 7148, -184799, 157640, 53856, -314202, -77485, 166322, -196956, -224617, 175381, -15032, -303501, -135266, -281217, -145991, -58487, -334078, -25700, 296792, -64007, -219756, -197943, -438424, 123714, -93066, -131826, -618093, 136674, 37841, -225380, -531102]
9927e31102F563a15025A31739M5775c51535a07646l44950Q5524g4575h517j49028
9916a57545A39696Q2479I4660a37342k7433c377l0588o937A60351b55690g0505
9904F8717h373A1905P1684J18516c1313k31000E1008f8733e910j8522J1443D8811
9891b4947A47896J77660b37682o4141Q751i1724A6427J63045D9899a53290A98449
9879a3870l6115H2625a00859f288B6533L52637G4057k9959i445k741j62400A98776
9866b17995m1082J12355D908N4975k2792b12329B45219O4449g9061j06492q510
9855a94063d9210m43348D0790K32415G2846f518k46657D8404A6037f5945r8608
9844a64553m7942A19033m4558a60941M7955j06022A10357a39260o0335k317A63749
$$ y = [-531102, 6563, -115025, 131739, 177514, -351535, -107646, -452596, -367072, -74575, -8517, -157545, 139696, 222175, 94660, -137342, -164775, -3377, -33965, -40902, 160351, -255690, -70505, 68717, -8373, 11905, 83589, 202105, -31313, -262313, 51008, -68733, -5910, -24432, -12989, 48811, -24947, 147896, 325556, -237682, -301823, -293072, -91724, 16427, 179472, 49899, -153290, 198449, -13870, -49985, 82625, -100859, -6288, 26533, 379170, 74057, 44098, -9445, -12186, -174586, 198776, -217995, -259077, -146722, 4908, 59883, 37091, -212329, 245219, 309668, -79061, -185553, -194063, -49210, -492558, 40790, 273205, 72846, -6518, -253175, 48404, 16037, -65945, -164553, -212495, 119033, 74475, -160941, -112986, -219008, 110357, -139260, -199595, -201912, 163749]
9832H2859k5344d30061a87848a974o9721A96523I8213d1968m417o0345k74171
9821c80901a14480B1769Q4062c2773p9953A94733b11652B19248b09558b8399j49261
9810a77660B27531P4422F9963a78964j15955B01499a41519G1352a50102j19871
9800b69973K280A60968c07692J07865i0926H5372L0022b15305A01893D2778G005
9788d30834a63307C22325b28280b1595B10617J60570f0647A88366Q6459b30409
9777b61804B14717a28950b7423j4219k2496b9247D30045g506G6079J11245f9471
9765c4833B7882a56748L3212G9656b36895G3405B179a58010P4251j4707k08454
9754c06920j19501A06071m2507a50353c6922I5365D5075d24143J18850J14851
$$ y = [82859, 57515, -430061, -187848, -1974, -71695, 196523, 98213, -41968, -46385, -106730, -380901, -114480, 21769, 105831, -32773, -112726, 194733, -211652, 219248, -209558, -28399, -177660, 227531, 301953, 69963, -178964, -294919, 201499, -141519, 71352, -150102, -269973, -267693, 160968, -307692, -199827, -90926, 85372, 115394, -215305, 101893, 42778, 7005, -430834, -163307, 322325, -228280, -21595, 210617, 371187, -60647, 188366, 274825, -230409, -261804, 214717, -128950, -27423, -41642, -64138, -29247, 430045, -7506, 76079, 187324, -69471, -34833, 27882, -156748, -123536, 79656, -236895, 73405, 2179, -158010, -83759, -98466, -306920, -426421, 106071, 63564, -150353, -36922, 95365, 45075, -424143, -305293, -190442]
9744a90442A24629Q4060a47601M2207b8252q1555M3668k97986d9548l2434j34205
9733b16187A65136g6704k9931A75352d5995l53258a51728A24036j2245c26406
9722f7636k2021k1743k1000q1532B9629R0967b87816O2289j4763K6618d6408J1349
9710c5059A30228c071B55551I7421a86718c356A7253a55184g459m6144a5755m1048
9698e6803B7230f363R84j28338P627d1732r1954A68980c5748G745a05325A13677
9685H1392A948K9649O4899A8117q965g7960f620A74394b894q8371j09753B14688
9672A43684b02072j17940h1911K1914F5422b09704Q4904p5098Q6483D8487J88974
9661B37461E6257L15147b99931B76638P0773j05455H8216d744n4601r4960c9873
$$ y = [-190442, 124629, 208689, -147601, -105394, -28252, -109807, -66139, -364125, -49548, -81982, -216187, 165136, -76704, -106635, 175352, -45995, -399253, -151728, 124036, 111791, -326406, -67636, -89657, -111400, -132400, -213932, 29629, 120596, -287816, -225527, -240290, -213672, -46408, -35059, 130228, -3071, 255551, 97421, -186718, -3356, 17253, -155184, -7459, -53603, -15755, -56803, 27230, -6363, -5379, -133717, -126090, -41732, -133686, 168980, -35748, 7745, -105325, 113677, 81392, 1948, 31597, 96496, 18117, 9152, -77960, -6620, 174394, -2894, -91265, -201018, 214688, 143684, -202072, -320012, -81911, -59997, 65422, -209704, -124800, -199898, -113415, 48487, 237461, 56257, 371404, -299931, 276638, 347411, 241956, 88216, -4744, -59345, -154305, -39873]
9649a00275D29596c16057p1646J75018d4433n952m605k47911B48665E6980Q6708
9638A43688a689A9376a29389m4929D0967L3351C0599b4751g359n5078A7939n012
9626A2927c78004j50402K39863a20240b4213C931b94148Q7157k8049g6745j28411
9615b05156D239K21709c08421P0358B17159D0907A0889a24109N2083A98046i2905
9603A72724b29197d314A31319b94839Q3023A00360a68058r1656D1290K62303I1791
9591e7188l3319k8530p0535j48822J644D7462b24758J01494j40710b9597p6495
9580a06092k6565O2902l46211C20493A35670a10964A60348d9213j33740Q0005
9570a02948H4946c84264J86095M6619b3259n0130C7968b43275B35935j01455a43214
$$ y = [-100275, 429596, -316057, -387703, -212685, -44433, -50385, -54990, -302901, 248665, 56980, 143688, -1689, 19376, -129389, -174318, 40967, 74318, 30599, -24751, -7359, -62437, 17939, 12927, -378004, -528406, -288543, -120240, -24213, 3931, -294148, -206991, -235040, -76745, -205156, 4239, 225948, -308421, -238063, 217159, 40907, 10889, -124109, -72026, 198046, -92905, 172724, -229197, -4314, 131319, -294839, -211816, 100360, -168058, -259714, 41290, 303593, 91791, -57188, -90507, -119037, -189572, -338394, -336750, 47462, -224758, -123264, -263974, -29597, -106092, -132657, -69755, -415966, 320493, 135670, -110964, 160348, -49213, -182953, -102948, 84946, -384264, -198169, -151550, -23259, -73389, 37968, -243275, 235935, 134480, -143214]
9558d289j2695j90024j2781A06609a40447M8073M96j9648c4005A41734H513O383
9546A4896i1741B98107a34890K2935B8151a4900m2069l51554a7289n0033l8726
9535a06048J7847B09840a00011J5148A4756J53105g3023J4992o7228j5428A05377
9523b63209j55636A05727A1846a4890A10967a03687A70894D5622a11056A941J63696
9512A65637p2551b50706R0877n7368c6850G0893R6772A4994a30949C46928a68756
9500a95827a4008j54873A4545a11451E6974K66325A32454f5141m7120p45G6029
9488a01207A68986f3737g518l46767R0764J18961j83166E7370b6501A9859a83071
9476A49523k8386O2358Q8807M4994G7087g6946j39649d056l3078j48039e9306
$$ y = [-4289, -16984, -207008, -219789, 106609, -140447, -92374, -91878, -111526, -34005, 141734, 8513, 14896, -91741, 298107, -134890, -111955, 28151, -14900, -56969, -408523, -17289, -67322, -106048, -88201, 209840, -100011, -84863, 14756, 167861, -73023, -58031, -125259, -140687, 105377, -263209, -418845, 105727, 11846, -14890, 110967, -103687, 170894, 45622, -111056, 1941, 165637, 93086, -250706, -159829, -217197, -36850, 70893, 167665, 14994, -130949, 346928, -168756, -195827, -14008, -168881, 14545, -111451, 56974, 323299, 132454, -65141, -112261, -113006, 76029, -101207, 168986, -63737, -7518, -354285, -263521, -144560, -327726, 57370, -26501, 19859, -183071, 149523, 121137, 183495, 272302, 317296, 77087, -76946, -216595, -4056, -37134, -185173, -59306]
9464a83913m0545a6761j32905b0068B41326b15954E4232h1065r8017h3582n4025
9453a37607B63894E0782a01344k64381B1242K4837a07477q5166e3115l3820a3592
9441e27597g8259B96725B6074J15005b51879A59044e7555f715m459j15490j96156
9430c22820c2976m4987L6697D2148J77188c97359E2818j1209J35684b47705h1909
9418B16902b37948A38773c11201A83567a05594l6448g298A70105e4110b5534m283
9407b9817A3440J04356P613b9530k51437h7155j80267a9157m2660j31580e3293
9395a88517g163p9800j1701B20102b18227B30368I196K18838C1567g5007L384
9384g1623E7061J68100c4882k07519E9528b97319D1153b00938E4807M7333h0591
$$ y = [-183913, -224458, -16761, -149666, -20068, 241326, -215954, 54232, -81065, -179082, -83582, -137607, 263894, 50782, -101344, -365725, 21242, 46079, -107477, -192643, -53115, -86935, -13592, -527597, -78259, 296725, 26074, 141079, -251879, 159044, -57555, -6715, -11174, -126664, -322820, -32976, -77963, -41266, 42148, 219336, -397359, 52818, 41609, 177293, -247705, -81909, 216902, -237948, 138773, -311201, 183567, -105594, -142042, -7298, 170105, -54110, -25534, -29817, 13440, 117796, 125409, -29530, -280967, -87155, -267422, -19157, -61817, -193397, -53293, -188517, -7163, -86963, -98664, 220102, -218227, 230368, 9196, 228034, 31567, -75007, -71623, 57061, 225161, -34882, -242401, 59528, -297319, 41153, -200938, 54807, 102140, -80591]
9372a85924p1975F2992d23834k487J73968B24852g2409A28364e51426A30909P6977
9361B07886b05482A28813c01587B18569a02601q3506h4633j8139A54947E3833
9350b08415B01373a34369M3317j89342M2143P1426l24865K44412a10476N2186
9340e8290j53103J7063j86529a59213I1400g4625M118B19005B3594J50445a0456
9328a4010F2926b00112O0905D647b23413h9384m4364I5454c19457d4112n6012
9317a00124B0874o831b09468j8813J01227d7243j69179h3128q4156P0080A48131
9305A73668d13476B03765j01192e2531B39879c35573C13584b01883k78046B42372
9294f4236j28120F6542a61356j67663Q7920D2214c6633B1707M4927a23797D3542
$$ y = [-185924, -257899, 62992, -423834, -426321, -252353, 224852, -72409, 128364, -551426, 130909, 207886, -205482, 128813, -301587, 218569, -102601, -186107, -84633, -102772, 154947, 53833, -208415, 201373, -134369, -91052, -280394, -238251, -166825, -491690, -247278, -110476, -58290, -211393, -194330, -380859, -159213, 91400, -74625, -70507, 219005, 23594, 174039, -10456, -14010, 62926, -200112, -139207, 4647, -223413, -89384, -133748, 95454, -319457, -44112, -100124, 20874, 14043, -209468, -228281, -127054, -47243, -216422, -83128, -167284, -97204, 148131, 173668, -413476, 203765, 102573, -52531, 239879, -335573, 313584, -201883, -479929, 242372, -64236, -192356, 66542, -161356, -329019, -241099, 42214, -36633, 21707, 66634, -123797, 43542]
9282b70675R0699G8763N2430R204b03531A52857a30473I4719b00275A46376a09279
9270b12115L0552c156j95511D32498i5972H3762M21251A53972D4861b34034g6021
9258A30160C5155J6319J27799h9626L4744l15103n4509j1070a80602G9694L0421
9247A10115m0105e9111a023q2244k30579Q2613o2759a9511l88339J92739j83705
9236c98816J88219P1469L6850D4353f4316j8602r5980B427K66062J51744b2256
9224A39076b3537I512e89775a70977j2324C0024b73629j32467J79753h6431Q253
9213g8178k18064a19965j00741C2810K1917J5338b83311a12347i150l45419f8312
9201a35856B7336j0648a83366A76680B9426h9877a7534B57437e3828m0924j89017
$$ y = [-270675, -179976, 78763, 131193, 140397, -203531, 152857, -130473, 94719, -200275, 146376, -109279, -212115, -181563, -3156, -198667, 432498, -95972, 83762, 505013, 153972, 44861, -234034, -76021, 130160, 35155, 51474, 179273, -89626, -54882, -369985, -424494, -435564, -180602, 79694, 110115, 70010, -59111, -1023, -83267, -313846, -231233, -293992, -19511, -407850, -215111, -398816, -210597, -139128, -102278, 44353, -64316, -82918, -178898, 2427, 268489, 420233, -22256, 139076, -23537, 9512, -589775, -170977, -183301, 30024, -273629, -406096, -226343, -86431, -78178, -296242, -119965, -220706, 32810, 54727, 70065, -283311, -112347, -9150, -354569, -68312, -135856, 27336, 16688, -183366, 176680, 29426, -89877, -17534, 257437, -53828, -94752, -283769]
9190b83769j14433A1062a09770k92681a17258J7708j19918C03121b48343B2210
9179d6857e442A04187c7884A31992i1144B5978a54224j34447h0700A99271e3573
9167C7359a6168j70730B7288P8956b29999N2129N913A5132a16676B86818a69786
9155A20755d7947O275k34451E7086B5007R0520M3381b43146R2578F7822d1118
9143e16816a77995A52917b7578k32436A08606K70958i7518p8613B06712a2194
9132c1195k1104q8086e303B95571A43723k1251d7126H109c70045J71823e225D5954
9119a63357A9765J12866J1554B8428J16452b01698C06062D8608i7267k52668a33149
9107a97699L0635O3158k46350A10218a34949n3254f9355m9175k61757J22786a09700
$$ y = [-283769, -398202, 11062, -109770, -402451, -117258, -99550, -219468, 303121, -248343, 22210, -46857, -5442, 104187, -37884, 131992, -91144, 25978, -154224, -288671, -80700, 199271, -53573, 37359, -16168, -186898, 27288, 106244, -229999, -177870, -171957, 15132, -116676, 286818, -169786, 120755, -47947, -41672, -276123, 57086, 25007, 115527, 158908, -243146, -150568, 67822, -41118, -516816, -177995, 152917, -27578, -260014, 108606, 379564, -97518, -176131, 206712, -12194, -31195, -52299, -140385, -5303, 295571, 143723, 122472, -47126, 8109, -370045, -198222, -5225, 45954, -163357, 19765, 132631, 144185, 28428, 144880, -201698, 306062, 48608, -97267, -349935, -133149, -197699, -167064, -103906, -350256, 110218, -134949, -188203, -69355, -118530, -380287, -257501, -109700]
9095b30402D2681M5234J21366F2834a31726K544A46680a71134j41012A19434i6422
9083a01246m09982d3769k17583A39902b38669A8072i7234l4914b593k6110k7397
9072e6100l8620l9512N9562a9402G837L18992q7962b43086c896k5399C42023f212
9059A42152n1742D631b37425A7830O9742B2893a08139E5702K07217B6212b41569
9047a61580g9040k63611L9684J03371A10337h5111F2522c6678a27p8404D3822
9035b50444B9744b23182H1269h9153K8046A18741a21379B54230a78473A84169
9024f7838A25215b0662k97880d4409j34168G932J69446d2351k09504J19279A20416
9012a99642E6454O4498m2387g8292k44581j10852J89825n2178I055a06009H0323
$$ y = [-230402, 42681, 87915, 209281, 62834, -131726, -129182, 146680, -171134, -312146, 119434, -96422, -101246, -511228, -43769, -261352, 139902, -238669, 18072, -97234, -132148, -2593, -28703, -56100, -94720, -134232, -74670, -19402, 7837, 326829, 238867, -243086, -3896, -29295, 342023, -6212, 142152, 90410, 4631, -237425, 17830, 87572, 22893, -108139, 55702, 262919, 26212, -241569, -161580, -79040, -342651, -302967, -199596, 110337, -85111, 62522, -36678, -127, -78531, 43822, -250444, 29744, -223182, 81269, -89153, -61107, 118741, -121379, 254230, -178473, 184169, -67838, 125215, -20662, -318542, -44409, -178577, 7932, 177378, -42351, -251855, -132576, 120416, -199642, 56454, 120952, 78565, -78292, -322873, -433725, -243900, -296078, 9055, -106009, 80323]
9000a40959M2486H1073b5003j94089l6244n5311R0668F2253J46976j04263a82154
8988b56948I0680a22733L7883j90038j0946F5715L1471i8103K4786l3189j23744
8977b30250m8130B58566C7050J57000G1766p954j4528c62211A74633F6484i4163
8965c13871e3556j27746D6711a00793G5442b98460A648a11083K9195B02126a6193
8953a08015B32646c49951R7127B2888b65444A4670k756J49296a92495G2470l3653
8942C8817a54572j14217k9699j11225a59981c3355G3137b69261B09243n4341a79463
8930H8254K27109j22104r2895m1398N7470c8710I93329K000814M003078J918119
8920H915340B723022G89988C07859p2284P0257a72582a3607j08077j2203B71759
$$ y = [-140959, -98473, 81073, -25003, -219092, -255336, -310647, -219979, 62253, 209229, 104966, -182154, -256948, 90680, -122733, -84850, -274888, -285834, 65715, 97186, -98103, -73317, -106506, -230250, -278380, 258566, 37050, 194050, 71766, 63812, 49284, -362211, 174633, 66484, -94163, -313871, -53556, -181302, 46711, -100793, 75442, -298460, 1648, -111083, -81888, 202126, -16193, -108015, 232646, -349951, -252824, 22888, -265444, 14670, 11914, 161210, -192495, 72470, 38817, -154572, -268789, -298488, -409713, -159981, -33355, 73137, -269261, 209243, 154902, -179463, 88254, 315363, 193259, 100364, 58966, 116436, -38710, 993329, 2994143, 6997221, 8915340, 2723022, 789988, 307859, 235575, 305832, -172582, -13607, -121684, -133887, 271759]
8909d01579a51942B53048j23748c2638F1914a58935c059k61721R8041A9417M8287
8898F7704f6134p6377q3157m1323E2755d71567b01470n4122a15944I4794h7060
8886c77702h7867k37548a30535B14012J47335b7884m0507o3956e2097J8887A61248
8874b47372F0398a37047k41634Q3345I5472i8938I0074g24277d6532j0336L161
$$ y = [-401579, -151942, 253048, 129300, -32638, 61914, -158935, -3059, -264780, -166739, 19417, 67704, -66134, -142511, -225668, -266991, 52755, -471567, -201470, -255592, -115944, 94794, -87060, -377702, -87867, -325415, -130535, 214012, 361347, -27884, -68391, -132347, -52097, -33210, 161248, -247372, 60398, -137047, -378681, -295336, 95472, -98938, 90074, -724277, -46532, -56868, -53707]
$$ [...]
##END NTUPLES=NMR SPECTRUM
##END=
