
##TITLE=UV1205_M3_1292-1211_7185422_fYbKX7pQcl
##JCAMPDX= 6.0         $$ Bruker NMR JCAMP-DX V2.0
##DATA TYPE= NMR SPECTRUM
##DATA CLASS= NTUPLES
##ORIGIN= BRUKER
##OWNER= Administrator
$$ 1.72 TOPSPIN		Version 2.1
$$ 2012-12-05 20:27:36.987 -0500  Administrator@X
$$ Compression mode = diff/dup
##.OBSERVE FREQUENCY= 400.02188249412
##.OBSERVE NUCLEUS= ^1H
##.ACQUISITION MODE= SIMULTANEOUS (DQD)
##.ACQUISITION SCHEME= undefined
##.AVERAGES= 64
##.DIGITISER RES= 22
##SPECTROMETER/DATA SYSTEM= spect
##.PULSE SEQUENCE= noesygpps1d.comp
##.SOLVENT NAME= COFFEE_meoh
##.SHIFT REFERENCE= INTERNAL, COFFEE_meoh, 1, 14.96096
##AUDIT TRAIL= $$ (NUMBER, WHEN, WHO, WHERE, PROCESS, VERSION, WHAT)
$$ ##TITLE= Audit trail, TOPSPIN		Version 2.1
$$ ##JCAMPDX= 5.01
$$ ##ORIGIN= Bruker BioSpin GmbH
$$ ##OWNER= Administrator
$$ $$ E:\/data/COFFEE/nmr/UV1205_M3_1292-1211_7185422_fYbKX7pQcl/12/pdata/1/auditp.txt
$$ ##AUDIT TRAIL=  $$ (NUMBER, WHEN, WHO, WHERE, PROCESS, VERSION, WHAT)
(   1,<2012-12-05 20:27:30.815 -0500>,<Administrator>,<X>,<go>,<TOPSPIN 2.1>,
      <created by zg
	started at 2012-12-05 20:16:00.643 -0500,
	POWCHK enabled, PULCHK disabled,
       configuration hash MD5:
       86 BA 57 50 F2 9D 5C 9B 26 00 A9 28 5F 66 2E 89
       data hash MD5: 64K
       34 73 04 0F FA 14 A0 3C 64 0D E0 D9 61 8E DE 3A>)
(   2,<2012-12-05 20:27:33.940 -0500>,<Administrator>,<X>,<proc1d>,<TOPSPIN 2.1>,
      <Start of raw data processing
       efp LB = 0.3 FT_mod = 6 PKNL = 1 PHC0 = 0 PHC1 = 0 SI = 128K 
       data hash MD5: 128K
       01 10 05 E2 61 F7 64 59 1A 45 5D 98 51 DC 13 83>)
(   3,<2012-12-05 20:27:35.050 -0500>,<Administrator>,<X>,<proc1d>,<TOPSPIN 2.1>,
      <pk PHC0 = -77.09656 PHC1 = 0 
       data hash MD5: 128K
       6C EC 48 87 2F CF 1F 18 13 23 81 CE 71 F3 CA 73>)
(   4,<2012-12-05 20:27:35.925 -0500>,<Administrator>,<X>,<proc1d>,<TOPSPIN 2.1>,
      <abs ABSG = 1 
       data hash MD5: 128K
       03 EF FA 2F 74 67 FE 61 06 F7 38 3C B1 85 CF 7D>)
(   5,<2012-12-05 20:27:36.112 -0500>,<Administrator>,<X>,<proc1d>,<TOPSPIN 2.1>,
      <abs ABSG = 2 
       data hash MD5: 128K
       AE 6B 6E DF 46 65 47 6B 8C 0C D2 B4 4F F8 6B 1A>)
(   6,<2012-12-05 20:27:36.300 -0500>,<Administrator>,<X>,<proc1d>,<TOPSPIN 2.1>,
      <abs ABSG = 3 
       data hash MD5: 128K
       12 A8 4D 38 9C 54 97 AF 6D 55 71 D0 27 5A 43 96>)
(   7,<2012-12-05 20:27:36.472 -0500>,<Administrator>,<X>,<proc1d>,<TOPSPIN 2.1>,
      <abs ABSG = 4 
       data hash MD5: 128K
       61 35 65 01 06 69 79 46 39 1B 8D CD 19 15 F1 92>)
(   8,<2012-12-05 20:27:36.659 -0500>,<Administrator>,<X>,<proc1d>,<TOPSPIN 2.1>,
      <abs ABSG = 5 
       data hash MD5: 128K
       0C 84 3B 74 1B C8 7A 86 63 C6 56 22 54 FD 42 F7>)
$$ ##END=
$$ 
$$ $$ hash MD5
$$ $$ 96 E9 EE 56 E3 B0 34 E4 C8 23 AC 25 39 96 37 90
##$RELAX= 
##$RELAX= 
##$RELAX= 
##$RELAX= 
##$RELAX= 
##$RELAX= 
##$RELAX= 
##$RELAX= 
$$ Bruker specific parameters
$$ --------------------------
##$DU= <E:\>
##$EXPNO= 12
$$ [...]
150 150 150 150 150 150 150 150
##$TP07= 0
##$TPNAME0= <>
##$TPNAME1= <>
##$TPNAME2= <>
##$TPNAME3= <>
##$TPNAME4= <>
##$TPNAME5= <>
##$TPNAME6= <>
##$TPNAME7= <>
##$TPOAL= (0..7)
0.5 0.5 0.5 0.5 0.5 0.5 0.5 0.5
##$TPOFFS= (0..7)
0 0 0 0 0 0 0 0
##$TUNHIN= 0
##$TUNHOUT= 0
##$TUNXOUT= 0
##$USERA1= <user>
##$USERA2= <user>
##$USERA3= <user>
##$USERA4= <user>
##$USERA5= <user>
##$V9= 5
##$VALIST= <valist>
##$VCLIST= <CCCCCCCCCCCCCCC>
##$VD= 0
##$VDLIST= <DDDDDDDDDDDDDDD>
##$VPLIST= <PPPPPPPPPPPPPPP>
##$VTLIST= <TTTTTTTTTTTTTTT>
##$WBST= 1024
##$WBSW= 4
##$XGAIN= (0..3)
0 0 0 0
##$XL= 0
##$YL= 0
##$YMAX_a= 6054840
##$YMIN_a= -11726274
##$ZGOPTNS= <>
##$ZL1= 120
##$ZL2= 120
##$ZL3= 120
##$ZL4= 120
##$ABSF1= 14.96096
##$ABSF2= -5.597221
##$ABSG= 5
##$ABSL= 3
##$ALPHA= 0
##$AQORDER= 0
##$ASSFAC= 0
##$ASSFACI= 0
##$ASSFACX= 0
##$ASSWID= 0
##$AUNMP= <proc_prof1d_extract.lims>
##$AXLEFT= 0
##$AXNAME= <>
##$AXNUC= <1H>
##$AXRIGHT= 0
##$AXTYPE= 0
##$AXUNIT= <>
##$AZFE= 0.1
##$AZFW= 0.1
##$BCFW= 0
##$BC_mod= 0
##$BYTORDP= 0
##$COROFFS= 0
##$CY= 15
##$DATMOD= 1
##$DC= 0
##$DFILT= <>
##$DTYPP= 0
##$F1P= 0
##$F2P= 0
##$FCOR= 0.5
##$FTSIZE= 131072
##$FT_mod= 6
##$GAMMA= 0
##$GB= 0
##$INTBC= 1
##$INTSCL= 1
##$ISEN= 128
##$LB= 0.3
##$LEV0= 0
##$LPBIN= 0
##$MAXI= 10000
##$MC2= 0
##$MEAN= 0
##$ME_mod= 0
##$MI= 0
##$NCOEF= 0
##$NC_proc= -2
##$NLEV= 6
##$NOISF1= 0
##$NOISF2= 0
##$NSP= 0
##$NTH_PI= 0
##$NZP= 0
##$OFFSET= 14.96096
##$PC= 1
##$PHC0= -77.09656
##$PHC1= 0
##$PH_mod= 1
##$PKNL= yes
##$PPARMOD= 0
##$PPDIAG= 0
##$PPIPTYP= 0
##$PPMPNUM= 2147483647
##$PPRESOL= 1
##$PSCAL= 4
##$PSIGN= 0
##$PYNMP= <proc.py>
##$REVERSE= no
##$SF= 400.02000965389
##$SI= 131072
##$SIGF1= 0
##$SIGF2= 0
##$SINO= 400
##$SIOLD= 131072
##$SPECTYP= <>
##$SREGLST= <1H.CDCl3>
##$SSB= 0
##$STSI= 131072
##$STSR= 0
##$SW_p= 8223.68421052631
##$SYMM= 0
##$S_DEV= 0
##$TDeff= 65536
##$TDoff= 0
##$TI= <>
##$TILT= no
##$TM1= 0
##$TM2= 0
##$TOPLEV= 0
##$USERP1= <user>
##$USERP2= <user>
##$USERP3= <user>
##$USERP4= <user>
##$USERP5= <user>
##$WDW= 1
##$XDIM= 131072
##$YMAX_p= 378808585
##$YMIN_p= -13973
##$CURPLOT= <Network HP LaserJet P1505>
##$CURPRIN= <$Network HP LaserJet P1505>
##$DFORMAT= <normdp>
##$LAYOUT= <+/1D_H.xwp>
##$LFORMAT= <normlp>
##$PFORMAT= <normpl>
##$SURQMSG= 1
$$ End of Bruker specific parameters
$$ ---------------------------------
##NTUPLES= NMR SPECTRUM
##VAR_NAME=  FREQUENCY,     SPECTRUM/REAL,   SPECTRUM/IMAG
##SYMBOL=    X,             R,               I
##VAR_TYPE=  INDEPENDENT,   DEPENDENT,       DEPENDENT
##VAR_FORM=  AFFN,          ASDF,            ASDF
##VAR_DIM=   131072,        131072,          131072
##UNITS=     HZ,            ARBITRARY UNITS, ARBITRARY UNITS
##FACTOR=    0.0627417313425164, 1,          1
##FIRST=     8223.62146879497, -106,         -53671
##LAST=      0,             448,             -53747
##MIN=       0,             -13973,          0
##MAX=       8223.62146879497, 378808585,    0
$$ Real data points
##PAGE= N=1
##DATA TABLE= (X++(R..R)), XYDATA
$$ [...]
67926 90564 93083 94869 95846 96457 96936 97146 97109 97206 97659 98220 98608 99007 99864 101288 102844 103855 103801 102603
67908 102603 100673 98622 96772 95014 93171 91372 89908 88825 87784 86310 84175 81639 79329 77776
67894 77776 76977 76484 75912 75238 74631 74261 74316 74931 75909 76723 76979 76768 76456 76310 76418 76782 77245 77548 77705
67875 77705 78098 78943 79812 80049 79593 79053 79012 79553 80494 81694 82940 83791 83818 83023 81937 81226 81101 81060 80388
67856 80388 79024 77756 77316 77467 77333 76482 75198 73719 71917 69932 68531 68318 68949 69613 69970 70127 69936
67839 69936 69098 67952 67441 68063 69367 70699 71881 72879 73395 73313 73206 73785 75074 76626 78260 80001 81498
67822 81498 82297 82668 83444 84866 86290 87213 87863 88466 88689 88337 87942 87989 88048 87439 86336 85390 84538 83072
67804 83072 80847 78523 76549 74719 72913 71513 70732 70172 69408 68501 67572 66342 64515 62334 60410 59291
67788 59291 59316 60531 62467 64337 65660 66422 66640 66263 65646 65361 65263 64503 63001 62146 63278 65955 68573
67771 68573 70298 71517 72695 73794 74842 76090 77450 78450 79019 79625 80476 81210 81682 82458 84107 86404
67755 86404 88623 90371 91777 93051 94125 94670 94346 93147 91531 90084 89067 88452 88233 88429 88861 89355
67739 89355 90049 91059 91887 91751 90588 89164 88006 86792 85080 83084 81291 79721 78080 76342 74780
67724 74780 73550 72621 71898 71099 69756 67770 65805 64685 64443 64342 63836 63051 62284 61450 60308 59014 58103
67707 58103 57935 58334 58873 59402 60098 60985 61626 61517 60655 59550 58739 58508 58925 59765 60475 60625 60490 60756 61568
67688 61568 62281 62301 61690 60727 59378 57602 55732 54042 52302 50302 48642 48364 49808 52265 54674 56286
67672 56286 56812 56541 56388 57207 58842 60275 60901 61217 61985 63161 64067 64362 64337 64371 64536 64782 65144 65586 65932
67653 65932 66137 66510 67416 68789 70109 70869 70903 70295 69226 68082 67432 67585 68219 68755 69008 69154 69106 68448
67635 68448 67226 66269 66343 67234 68148 68781 69494 70480 71362 71777 71933 72329 73214 74562 76313 78268 79823 80199
67617 80199 79070 76892 74561 72860 72135 72267 72759 72987 72683 72242 72387 73390 74779 75927 76722 77366 77758
67600 77758 77544 76835 76313 76291 76117 74931 72823 70732 69275 68121 66633 64697 62750 61254 60384 60035
67584 60035 59888 59545 58797 57826 57094 57030 57787 59180 60712 61746 61820 60972 59747 58863 58748 59352 60351 61489
67566 61489 62752 64229 65833 67142 67613 67091 66077 65284 64844 64200 62927 61383 60289 59893 59953 60301 60879
67549 60879 61296 60974 59875 58545 57330 56115 55034 54735 55479 56550 57150 57404 57894 58616 59127 59419 59809
67532 59809 60075 59610 58547 57900 58260 58967 58999 58180 57111 56261 55632 55111 54688 54314 53821 53099 52287 51753 51851
67513 51851 52554 53362 53708 53518 53229 53293 53763 54337 54629 54439 53953 53659 53877 54448 55007 55413 55631 55375 54301
67494 54301 52563 50850 49795 49597 50110 50962 51636 51887 52102 52882 54205 55425 56127 56455 56558 56260 55574
67477 55574 55010 55021 55467 55951 56334 56577 56424 55659 54540 53603 53141 53117 53432 54020 54784 55622 56496 57427 58577
67458 58577 60300 62743 65304 66906 67048 66260 65291 64272 63031 61796 61025 60691 60248 59321 58153 57381
67442 57381 57556 58696 60128 60950 60909 60605 60647 60952 61170 61412 62005 62817 63455 63993 64883 66124 67125 67482
67424 67482 67425 67332 67227 66962 66503 65856 64986 64042 63406 63254 63241 62814 61800 60566 59645 59249 59120 58875 58460
67405 58460 58125 57940 57613 56976 56336 56033 55927 55707 55530 55826 56549 57140 57237 56936 56339 55370 54216 53400 53161
67386 53161 53208 53333 53793 54736 55758 56494 57296 58608 59890 59909 58301 56248 55282 55785 57006 58221 59315
67369 59315 60319 60965 61022 60737 60572 60651 60822 61143 61833 62686 63051 62664 62067 61839 61771 61317 60646 60585 61536 63030
67349 63030 64498 65931 67454 68745 69289 68999 68160 66945 65387 63834 62940 62953 63286 63086 62235 61461 61393
67332 61393 61798 61983 61753 61548 61734 62242 63050 64489 66698 69179 71343 73236 75231 77202 78550 79023
67316 79023 78998 78956 79101 79497 80072 80402 79941 78637 76981 75451 74297 73824 74261 75136 75411 74651 73680 73660 74779
67297 74779 76162 76826 76437 75389 74412 74019 74143 74459 75014 76096 77401 77923 77075 75502 74287 73676 73051
67280 73051 71930 70511 69294 68582 68333 68283 68255 68460 69255 70458 71342 71595 71856 72869 74452 75863 76829
67263 76829 77595 78206 78488 78684 79399 80775 82265 83295 83686 83399 82450 81174 80032 79041 77828 76378 75156
67246 75156 74361 73658 72871 72347 72256 72142 71720 71638 72742 74782 76517 77147 77088 77219 77787 78341 78514 78529 78850
67227 78850 79494 79924 79710 79081 78581 78338 78067 77781 77945 78797 80005 81294 82888 84823 86224 86010 84275
67210 84275 82360 81443 81532 81977 82489 83237 84235 85055 85238 84828 84397 84528 85242 85965 86149 85909 85909 86571 87527 87864
67190 87864 86882 84692 82321 81149 81905 83994 86016 87119 87720 88690 90119 91259 91569 91332 91108 91036 90984
67173 90984 91011 91288 91696 91962 92113 92398 92751 92789 92421 92012 91760 91378 90703 90204 90427 91251 92177 93114 94302
67154 94302 95547 96222 96158 95929 96051 96386 96690 97303 98800 101100 103269 104230 103587 101904 100327 99751 100160
67137 100160 100902 101581 102396 103535 104723 105707 106782 108322 109992 110994 111040 110626 110363 110457 110922 111807 113033
67120 113033 114354 115703 117273 119020 120334 120534 119679 118641 118360 119132 120568 122128 123610 125142 126767
67105 126767 128186 129041 129367 129572 129954 130370 130460 130095 129535 129187 129229 129471 129645 129853 130570 132066 133973 135611
67087 135611 136632 137141 137386 137678 138472 140001 141812 143095 143591 143744 143907 143987 144108 144972 147002 149607 151897
67070 151897 153822 155875 157983 159576 160767 162521 165257 168025 169656 170233 170831 172052 173477 174477 174987
67055 174987 175413 176165 177461 179278 181334 183250 184846 186141 187108 187650 187959 188665 190376 193066 196058 198665
67039 198665 200817 203001 205577 208254 210354 211624 212565 213895 215834 218147 220681 223526 226614 229559
67025 229559 232123 234578 237372 240491 243416 245701 247442 249144 251247 253832 256696 259603 262461 265300
67011 265300 268193 271244 274584 278278 282205 286098 289775 293293 296913 300890 305282 309896 314470 318909
66997 318909 323274 327536 331577 335534 339851 344640 349243 352986 356305 360516 366248 372615 378237 382631
66983 382631 386306 389988 394261 399467 405336 410938 415663 420095 425224 431029 436662 442015 448081 455439
66969 455439 463249 470351 476748 483328 490643 498616 507116 516032 524888 533103 540734 548530 557136 566610
66955 566610 576653 586933 597160 607239 617468 628272 639742 651661 663894 676387 688797
66944 688797 700640 711957 723435 735669 748621 761987 775797 790380 805871 821992 838260
66933 838260 854368 870565 887694 906561 927099 948377 969568 990690 1012197 1034139 1056104
66922 1056104 1077897 1099964 1123007 1147332 1172657 1198586 1225204 1253047 1282408 1312801 1343386
66911 1343386 1373830 1404476 1435767 1467920 1501173 1535774 1571480 1607517 1643457 1679820 1717504
66900 1717504 1756870 1797690 1839571 1882006 1924339 1966325 2008602 2052058 2096744 2141895 2186964
66889 2186964 2232074 2277450 2323007 2368646 2414401 2460085 2505268 2549864 2594221 2638313 2681236
66878 2681236 2721981 2760409 2797089 2832468 2866659 2899790 2931938 2962660 2991005 3016150 3037816
66867 3037816 3056162 3071568 3084502 3095165 3103097 3107451 3107846 3104707 3098601 3089447 3076685 3060146 3040485
66854 3040485 3018645 2995026 2969324 2941158 2910716 2878659 2845445 2810958 2774873 2737200 2698235
66843 2698235 2658114 2616773 2574348 2531255 2487646 2443074 2397030 2349782 2302344 2255604 2209704
66832 2209704 2164336 2119332 2074783 2030753 1987220 1944220 1901814 1859893 1818311 1777278 1737322
66821 1737322 1698725 1661192 1624304 1588074 1552795 1518509 1484925 1451816 1419217 1387291 1356250
66810 1356250 1326305 1297354 1268807 1240131 1211581 1183944 1157505 1131808 1106554 1082134 1058918
66799 1058918 1036640 1014977 994243 974765 955924 936637 916717 897006 878090 859642 841252
66788 841252 823179 805877 789306 773152 757393 742239 727768 713961 700875 688450 676314
66777 676314 664089 651743 639443 627270 615351 604023 593554 583857 574726 566120 557874 549399
66765 549399 540193 530629 521784 514362 508017 501753 494764 486876 478492 470167 462156 454405 447048 440559
66751 440559 435094 429916 424037 417345 410623 404470 398776 393250 387827 382391 376775 371369 367090 364215
66737 364215 361717 358332 353982 349564 345650 342056 338535 335113 331644 327690 323137 318527 314528 311330
66723 311330 308630 305886 302495 298168 293360 289000 285578 282767 280073 277452 274989 272406 269396 266213
66709 266213 263373 260857 258055 254573 250652 246764 243177 240039 237458 235275 233042 230541 228112 226221
66695 226221 224791 223232 221098 218470 215708 213009 210289 207427 204534 202002 200197 199032 197910 196254
66681 196254 194124 192184 190995 190406 189745 188572 187057 185554 183977 181878 179177 176514 174614 173464 172424
66666 172424 171082 169568 168052 166410 164656 163222 162411 161854 160997 159961 159346 159217 158867 157758 156190 154782
66650 154782 153697 152733 151801 150887 149735 148011 145759 143350 141021 138767 136736 135377 135031 135529 136277 136613
66634 136613 136093 134655 132686 130876 129886 130065 131303 133037 134450 134967 134641 133999 133410 132658 131191 128791
66618 128791 125994 123802 122843 122800 122803 122409 121957 121884 122081 122203 122252 122349 122150 121172 119732 118911 119317 120354 120997
66599 120997 120804 119858 118188 115829 113231 111070 109723 109256 109761 111226 113077 114310 114224 112844 110690 108388
66583 108388 106431 104975 103827 102862 102287 102214 102149 101466 100323 99527 99384 99279 98635 97723 97169 97137 97427 97969
66565 97969 98680 99080 98635 97385 95862 94478 93401 92830 92876 93141 92973 92254 91532 91291 91436 91614 91704 91785 91928
66546 91928 92147 92345 92240 91597 90616 89759 89132 88424 87599 87154 87395 87838 87759 87088 86329 85821 85510 85296 85158
66527 85158 84980 84678 84451 84505 84558 84078 83108 82349 82277 82550 82510 81931 81038 80149 79599 79739 80572 81503 81803 81361
66507 81361 80749 80551 80843 81306 81595 81537 81151 80592 79983 79257 78257 77010 75830 75059 74791 74888 75249 75943 76990
66488 76990 78078 78693 78635 78279 78198 78604 79292 80008 80593 80850 80628 80105 79617 79095 78044 76340 74663 73832
66470 73832 73929 74430 74962 75506 76017 76306 76337 76242 76032 75601 75033 74557 74227 73985 74041 74736 75897 76742 76668 75811
66450 75811 74676 73520 72339 71176 70211 69694 69910 70918 72122 72521 71687 70228 68971 67999 66924 65789
66434 65789 65082 64994 65275 65862 67020 68619 69866 70111 69583 68952 68424 67699 66673 65771 65510 65989 66888 67791
66416 67791 68444 68824 69031 69081 68846 68264 67583 67205 67290 67608 67825 67827 67697 67483 67096 66454 65644 64980 64909 65732 67273
66395 67273 68842 69772 69971 69760 69174 67806 65597 63383 62175 62080 62498 63303 65062 67813 70367 71475
66379 71475 71288 70975 71095 71099 70447 69437 68642 68117 67602 67159 67147 67737 68737 69767 70384 70275 69634 69200 69548
66360 69548 70410 70950 70692 69907 69236 69232 70152 71761 73288 73994 73935 73816 74005 74054 73455 72429 71542 70879 70116
66341 70116 69331 69105 69693 70561 71033 71078 71139 71399 71528 71125 70141 68909 67928 67609 68021 68847 69673 70327 70910
66322 70910 71636 72702 74121 75472 76008 75364 74119 73318 73401 73900 74146 73934 73388 72614 71733 70953 70353 69838
66304 69838 69550 69972 71268 72749 73469 73244 72690 72368 72396 72801 73615 74375 74109 72240 69280 66322 64115
66287 64115 62906 62828 63855 65410 66585 66933 66774 66574 66356 65933 65460 65308 65501 65655 65615 65815 66742 68216
66269 68216 69504 70116 70217 70213 70197 69902 69083 67831 66681 66367 67243 68831 70231 71061 71712 72496 73023 72831
66251 72831 72249 71995 72142 72197 72144 72586 73619 74354 74124 73542 73707 74653 75302 74876 73735 72771 72482 72804 73447
66232 73447 74137 74779 75544 76626 77825 78609 78752 78698 79101 80129 81420 82611 83641 84520 85073 85099 84694 84246
66214 84246 84055 84061 83960 83506 82637 81490 80391 79719 79561 79552 79277 78785 78456 78381 78179 77576 76775 76088 75478 74796
66194 74796 74176 73857 73739 73555 73384 73596 74252 75035 75877 77204 79229 81290 82388 82384 82278 83085 84638 85756
66176 85756 85584 84474 83426 82911 82598 82079 81381 80631 79673 78383 77041 76020 75317 74757 74481 74715 75152
66159 75152 75157 74693 74477 75019 75965 76713 77262 78030 79069 79932 80168 79646 78488 77065 76007 75814 76345 76975
66141 76975 77348 77751 78633 80000 81482 82865 84276 85818 87208 87973 88010 87842 88206 89417 91159 92829
66125 92829 93997 94619 94994 95500 96214 96800 96938 96804 96830 96930 96419 95001 93476 92970 93600 94453 94901 95380
66107 95380 96569 98242 99390 99344 98399 97385 96943 97251 98077 98849 98902 97969 96542 95535 95545 96489 97954 99666
66089 99666 101439 102891 103592 103559 103330 103325 103373 103099 102645 102628 103365 104465 105307 105627 105417 104539 102858 100714 98873
66070 98873 97817 97326 96930 96595 96670 97211 97691 97543 96889 96513 97111 98574 100023 100498 99681 98066 96499 95533
66052 95533 95156 95029 94933 94931 95185 95748 96573 97663 99079 100711 102155 102984 103204 103240 103382 103430 103162 102937 103345
66033 103345 104221 104607 104045 103428 103951 105473 106669 106847 106806 107571 109028 110397 111561 113001 114618 115570 115583
66016 115583 115652 116905 119203 121430 122882 123837 124880 126291 128157 130485 132899 134653 135349 135479 135900 136915
66000 136915 138147 139235 140262 141515 143157 145257 147882 151012 154516 158338 162515 166987 171530 175979
65986 175979 180246 184035 186843 188530 189667 190986 192569 193852 194281 193641 191827 188850 185167 181553 178354
65971 178354 175117 171273 167013 163127 160061 157438 154612 151439 148320 145562 142969 140196 137434 135451
65957 135451 134807 135176 135655 135703 135555 135728 136403 137399 138512 139715 141112 142809 144783 146815 148697 150551
65941 150551 152766 155551 158701 161905 165071 168214 171208 173904 176370 178791 181131 183030 184051 184024 183277
65926 183277 182604 182773 183929 185591 187359 189423 192164 195474 198741 201458 203624 205623 207929 210817 214127
65911 214127 217432 220675 224450 229316 234921 240208 244463 247736 250262 252002 252962 253535 254189 255073 256103
65896 256103 257138 257780 257366 255636 253290 251441 250407 249351 247182 243615 239244 234806 230569 226400 222143
65881 222143 217772 213236 208367 203030 197220 190899 183958 176648 169937 164982 162131 160678 159658 158557
65867 158557 157229 155604 153820 152331 151451 150937 150334 149536 148672 147637 146218 144694 143849 144198 145441 146786
65851 146786 147609 147754 147441 147045 146798 146627 146396 146313 146870 148298 150254 152172 153777 155131 156257 156941 156973
65834 156973 156606 156609 157664 159653 161756 163381 164697 166061 167296 168050 168630 169773 171604 173476 175031 176812
65818 176812 179475 183001 187091 191827 197342 203157 208447 212794 216236 218767 220392 221474 222369 222703 221635
65803 221635 218869 214946 210494 205890 201709 198745 197116 195874 193979 191336 188549 186090 184097 182557
65789 182557 181151 179254 176640 173977 172117 171149 170696 170900 172313 174897 177955 181201 185171 190300 196305
65774 196305 202818 209972 217813 225669 232808 239347 245775 251713 255917 257604 257118 255137 251778 246874
65760 246874 240644 233575 225833 217313 208351 199962 193145 188106 184432 181959 181170 182549 185795 190033
65746 190033 194792 200397 207261 215251 224057 233847 244973 257141 269467 281505 293647 306189 318388
65733 318388 328855 336637 341552 343698 343128 339970 334396 326407 316021 303806 290854 277987 265225
65720 265225 252213 238924 225689 212809 200548 189421 179969 172113 165038 158032 151225 145316 140701
65707 140701 137146 134246 131890 130171 129038 128310 127959 128133 128745 129185 128754 127487 126312 126092 126586 126715
65691 126715 125960 125062 125037 125822 126384 126083 125369 125024 125237 125770 126605 127939 129675 131494 133476 136240 140203
65674 140203 144974 149775 154333 159080 164522 170673 177219 184068 191565 200250 210576 222794 236874
65661 236874 252391 268658 285050 301121 316386 330290 342660 353939 364510 373852 380898 385368
65649 385368 388236 390571 392371 393021 392577 391934 391804 392172 392905 394273 396441 398788 400140 399603 396902 392076
65633 392076 385253 376701 366740 355375 342248 327168 310627 293585 276749 260277 244267 229292
65621 229292 216129 204998 195356 186523 178296 170783 163935 157555 151678 146584 142399 138904 135776 132820
65607 132820 129922 127004 124145 121592 119501 117746 116087 114517 113375 113074 113661 114607 115196 115213 115107 115292
65591 115292 115456 114945 113786 112929 113306 114935 117109 119202 121057 122772 124432 126100 127903 130051 132756
65576 132756 136070 139876 144171 149295 155702 163525 172607 182942 194710 207793 221646 235879 250653
65563 250653 266142 281798 296536 309547 320578 329456 335678 338703 338526 335809 331341 325269 316937
65550 316937 305679 291816 276633 261378 246578 232447 219465 208089 198124 188893 180039 171790
65538 171790 164435 157851 151686 145874 140891 137482 135938 135563 135171 134313 133701 134069 134923 135024 133901 132282
65522 132282 130988 130006 128851 127307 125552 123852 122385 121073 119468 117142 114308 111719 109758 108054
65508 108054 106283 104922 104767 105873 107401 108440 108722 108615 108714 109388 110507 111566 112185 112432 112614 112935 113444
65491 113444 114141 114900 115424 115509 115308 115270 115897 117506 119943 122447 124233 125437 127126 130020 133540 136517
65475 136517 138547 140020 141038 141096 140000 138486 137488 137070 136389 134603 131660 128330 125592 123851 122720
65460 122720 121610 120448 119619 119291 119132 118689 117749 116342 114785 113749 113727 114247 114121 112837 111274 110605 110878
65443 110878 111221 111152 110988 111085 111428 112061 113257 114925 116449 117543 118847 121146 124225 127014 128719 129362
65427 129362 129292 128756 128110 127882 128267 128769 128717 128060 127417 127318 127596 127533 126560 124892 123512 123371 124452 125743 126344
65408 126344 126469 127099 128719 130720 132083 132349 131767 130797 129755 128841 128223 128041 128421 129487 131225 133373
65392 133373 135564 137610 139549 141372 142799 143457 143375 143220 143881 145676 147988 149805 150596 150558 150117 149438 148540
65375 148540 147597 146916 146689 146882 147299 147665 147827 148031 148871 150712 153253 155827 158041 159922 161557 162976
65359 162976 164421 166401 169254 172781 176479 180093 183854 188209 193372 199075 204842 210511 216322 222264
65345 222264 227505 230964 232546 233374 234513 235797 236286 235629 234394 233128 231656 229536 226733 223469 219656
65330 219656 214978 209503 203804 198352 193096 187835 182751 178265 174410 170709 166785 162929 159831 157801
65316 157801 156410 154949 153128 151263 149804 148806 147903 146782 145536 144478 143690 142883 141713 140078 138090
65301 138090 135933 133830 131962 130271 128436 126315 124335 123205 123190 123917 124993 126521 128735 131329 133552
65286 133552 135057 136242 137570 138787 139226 138741 137886 137077 136088 134695 133428 133117 133755 134414 134404 134056 134070
65269 134070 134553 135062 135306 135298 134968 134130 132927 131887 131351 131168 131087 131187 131657 132292 132550 132192 131685 131828 132933
65250 132933 134495 135711 136246 136343 136299 136146 135884 135672 135551 135278 134715 134174 133990 133924 133394 132215 130728 129262
65232 129262 127916 126879 126459 126681 127212 127762 128191 128171 127298 125742 124296 123510 123185 122989 123071 123642 124378 124717
65214 124717 124488 123808 122684 121233 120004 119449 119227 118694 118034 118198 119608 121527 123000 123902 124740 125737 126549
65197 126549 126741 126277 125541 124921 124368 123391 121689 119732 118422 118186 118659 119241 119592 119560 119041 118219 117675 117995
65179 117995 119375 121651 124423 127023 128732 129363 129452 129663 130164 130825 131734 133056 134486 135262 134921 133754
65163 133754 132432 131343 130461 129753 129480 130008 131383 133220 135008 136456 137469 137988 138049 137967 138228 139180 140958
65146 140958 143660 147312 151643 156190 160780 165710 171306 177513 184111 191125 198777 207025 215327 222893
65132 222893 229220 234433 239115 243758 248409 252933 257353 261599 265127 267311 268253 268656 268753 267916 265635
65117 265635 262348 258871 255426 251674 247360 242404 236670 230284 223960 218455 213782 209467 205390 201750
65103 201750 198288 194317 189613 184672 179870 174972 169724 164408 159471 155032 151035 147546 144621 142141
65089 142141 140053 138457 137264 136145 135074 134521 134784 135467 135993 136297 136596 136786 136605 136231 136144 136352 136201
65072 136201 135138 133418 131986 131740 132850 134541 135672 135780 135523 135893 137100 138518 139560 140157 140363 140003
65056 140003 138977 137585 136267 135146 134091 133167 132787 133317 134590 135877 136437 136124 135413 134801 134340 133811
65040 133811 133172 132559 131914 131001 129853 128942 128666 128784 128584 127652 126337 125357 124910 124398 123160 121416 120170
65023 120170 120086 120701 120937 120206 118777 117286 116208 115708 115628 115552 115188 114761 114856 115795 117341 119003 120415 121464
65005 121464 122317 123428 125242 127767 130567 133199 135505 137449 138998 140290 141624 143053 144149 144391 143697
64990 143697 142457 141193 140358 140312 141184 142706 144351 145761 146964 148171 149380 150328 150928 151650 153184 155575
64974 155575 157908 159171 159362 159468 160406 162216 164176 165291 164751 162417 159081 155895 153356 151090 148605
64959 148605 145801 142692 139294 136128 134204 133943 134550 135018 135310 135854 136276 135641 133951 132491 132363 133335
64943 133335 134420 134945 134677 133528 131763 130197 129605 129985 130745 131433 131887 131855 131022 129525 128023 127125 126966
64926 126966 127435 128451 129745 130631 130465 129361 128147 127443 127027 126330 125327 124609 124648 125417 126725 128446 130244
64909 130244 131513 131987 132060 132162 132140 131765 131525 132230 133893 135652 136903 137892 139091 140568 142269 144355 146988
64892 146988 150197 154203 159379 165508 171558 176639 180823 184630 188211 191590 195314 200070 205720 211326
64878 211326 216142 220115 223442 226125 227999 228829 228365 226643 224186 221524 218627 215240 211565 208038 204553
64863 204553 200640 196492 193047 190844 189443 188306 187556 187407 187377 186679 185042 182676 179742 176409 173150
64848 173150 170377 167845 164950 161610 158406 155809 153679 151576 149315 147088 145212 143765 142391 140612
64834 140612 138497 136821 136288 136762 137575 138374 139292 140357 141206 141444 140998 140080 139049 138246 137708 137121 136322
64817 136322 135744 136002 137191 138992 141274 143979 146557 148327 149580 151548 154858 158677 161872 164450 167221
64802 167221 170505 173916 177196 180423 183364 185345 186024 185908 185850 186270 186957 187362 187024 185896 184346 182708
64786 182708 180855 178471 175667 173066 171305 170635 170852 171297 171034 169583 167636 166592 167198 168900 170646
64771 170646 171938 172946 174008 175305 176818 178366 179895 181824 184725 188431 191924 194467 196472 198816
64757 198816 201690 204697 207755 211117 214602 217641 220257 223313 227401 232010 236185 239640 242820 246167
64743 246167 249699 253094 255894 257741 258680 259023 258701 257025 253397 248057 241830 235420 229314 224042 219881
64728 219881 216347 212586 208452 204791 202503 201630 201481 201281 200614 199593 198832 198941 199897 201151 202385 203775
64712 203775 205411 206997 208422 210216 212975 216661 220824 225165 229366 232695 234438 234672 233986 232458 229528
64697 229528 225046 219863 215111 211197 207746 204177 200108 195488 190608 185877 181428 177118 172900 168984
64683 168984 165551 162684 160651 159849 160211 161083 161949 162989 164574 166575 168566 170469 172511 174703 176871
64668 176871 179160 182046 185728 189807 193670 196957 199694 202216 204907 207724 210015 211105 211024 210287 209022
64653 209022 206803 203503 199830 196701 194436 192865 191897 191573 191634 191537 191040 190582 190887 192204 194002 195514
64637 195514 196583 197792 199631 201735 203324 204397 206049 209447 214788 221432 228691 236144 243459 250336
64623 250336 256557 261817 265580 267438 267625 266802 265236 262424 257725 251232 243860 236568 229635 222800 216082
64608 216082 210202 205947 203200 200964 198455 195778 193295 190725 187470 183724 180668 179271 179206 179176 178186
64593 178186 176320 174456 173445 173538 174403 175549 176749 178125 179969 182502 185732 189436 193311 197213 201162
64578 201162 205106 208901 212717 217245 223155 230305 237796 244828 251287 257451 263495 269434 275236 280615
64564 280615 284839 287138 287423 286416 284931 283064 280154 275550 269371 262497 255750 249125 241917 233662
64550 233662 224867 216746 210256 205454 201747 198624 196077 194372 193582 193469 193747 194276 194955 195623 196228 196952
64534 196952 197981 199212 200362 201287 201952 202103 201307 199410 196734 193699 190496 187292 184472 182383 180915
64519 180915 179632 178283 177001 176069 175725 176171 177415 179007 180166 180405 179934 179369 179196 179632 180752 182431
64503 182431 184244 185739 186857 187844 188721 189206 189331 189801 191416 194283 197896 201855 206108 210539 214738
64488 214738 218299 221048 222933 224065 224993 226453 228546 230489 231571 232045 232670 233625 234439 234889 235379 236313
64472 236313 237554 238650 239185 238773 237082 234216 230831 227654 225030 223044 221786 221279 221280 221434 221591 221903
64456 221903 222723 224410 227013 230054 232843 235134 237202 239202 240739 241301 240907 240119 239626 239988 241456 243722
64440 243722 246075 248194 250609 254106 258848 264482 270905 278393 286975 296184 305584 315258 325725 337744
64426 337744 352281 370220 391848 416818 444812 476025 510937 549902 593158 641018 693724
64415 693724 751202 813078 878728 946996 1015982 1083462 1147716 1207875 1263441 1313527 1356613
64404 1356613 1391069 1415900 1430998 1436615 1432715 1419042 1395796 1363978 1324902 1279560 1228638 1172953
64392 1172953 1113518 1051187 986582 920573 854692 790807 730327 673849 621531 573626 530468
64381 530468 492061 458009 427953 401866 379718 361100 345411 332286 321407 311986 303005 294191
64369 294191 286258 279803 274333 268886 263334 258359 254136 249813 244584 238719 233045 227859 222909 218168
64355 218168 213930 210186 206542 202904 199713 197284 195433 194012 193373 193847 195179 196891 198877 201145 203329
64340 203329 205130 206984 209480 212090 213387 212783 211251 209921 208654 206636 203773 200793 198273 196305
64326 196305 194906 194059 193416 192631 192000 192177 193252 194681 196147 197746 199181 199590 198706 197606 197629 198842
64310 198842 200162 200845 201219 201912 202915 203698 203925 203666 202946 201380 198489 194313 189512 184829 180594 176878
64294 176878 173837 171594 169870 168149 166226 164339 162771 161670 161248 161701 162756 163750 164394 165121 166448
64279 166448 168392 170807 173868 177666 181622 184876 187192 188983 190536 191773 192811 194186 196232 198658
64265 198658 201041 203476 206433 210005 213527 215961 216670 215925 214674 213775 213444 213488 213786 214271 214590 214328 213581
64248 213581 212823 212017 210367 207318 203429 199777 196754 193972 191172 188578 186340 184307 182640 182062 182971
64233 182971 184616 185753 186062 186439 187847 190307 193151 195840 198279 200610 203033 205744 208807 212197 216017
64218 216017 220442 225206 229446 232503 234724 237041 239756 242236 243884 244857 245512 245551 244193 241097 236828
64203 236828 232479 228999 226648 224745 222006 217510 211493 205138 199629 195537 192890 191442 190749 190258 189546
64188 189546 188501 187342 186639 187266 189954 194629 200281 205759 210730 215736 221277 227044 232198 236294 239551
64173 239551 242133 243460 242623 239423 234636 229232 223621 217784 211776 205831 200166 194999 190625 187198
64159 187198 184447 181854 179144 176501 174298 172720 171591 170510 169211 167849 166813 166268 166063 166158 166822
64144 166822 168234 170112 172062 174063 176335 178916 181725 184834 188261 191551 194036 195531 196412 196959 197027
64129 197027 196466 195506 194494 193508 192424 191215 190062 189213 188770 188526 188096 187378 186791 186830 187517 188586 190080
64112 190080 192338 195471 199263 203595 208453 213495 218173 222498 227183 232761 238912 244892 250181 254448
64098 254448 257430 259310 260919 263091 266002 269445 273452 278238 283731 289538 295261 300530 304951 308325
64084 308325 310632 311504 310068 305840 299479 292159 284441 276383 268463 261463 255381 249287 242584 235815
64070 235815 229964 225475 222228 219882 217863 215543 212956 211030 210619 211479 212587 213267 213598 213910 214411 215287
64054 215287 216684 218350 219660 220243 220531 221475 223667 226750 229758 232077 234010 236362 239612 243725 248559
64039 248559 254038 259889 265694 271388 277203 282858 287314 289847 291024 291979 292910 292958 291511 288910 285739
64024 285739 282128 278145 274347 271439 269665 268878 268890 269328 269479 268872 267945 267592 268012 268496 268422 267967 267523 266815
64006 266815 265050 261813 257467 252790 248515 245206 243200 242421 242343 242291 241857 241083 240286 239680 239153 238487 237826
63989 237826 237751 238767 240770 243170 245432 247354 249012 250758 253241 256948 261553 266064 269896 273588 278165
63974 278165 283962 290391 296777 303062 309649 316830 324491 332271 339983 347943 356797 366839 377600 388300
63960 388300 398660 409072 420158 432526 446857 463675 482847 503768 526352 551552 580588
63949 580588 613977 651719 694229 742698 798607 863298 937956 1023561 1120677 1229478 1350011
63938 1350011 1482151 1625284 1778224 1939521 2107653 2280930 2457371 2634612 2809581
63929 2809581 2978281 3136297 3279739 3405590 3511217 3594079 3652218 3684747 3691584 3672861
63919 3672861 3628798 3559925 3467223 3352303 3217803 3067492 2905694 2736590 2563993 2391297
63909 2391297 2221147 2055353 1895480 1743436 1601105 1469629 1349481 1241021 1144400 1059010
63899 1059010 983705 917666 860475 811226 768296 730394 697263 668903 644542 622959 603502
63888 603502 586105 570498 555953 541850 528036 514570 501513 489049 477437 466757 456981 448347
63876 448347 441388 436440 433355 431803 431689 433145 436286 441095 447486 455375 464730 475568 487863 501542
63862 501542 516608 533170 551186 570224 589623 608863 627716 646147 664203 681832 698573
63851 698573 713605 726448 737511 747585 756703 763906 768257 769739 768916 765924 760135 750840 738061
63838 738061 722593 705234 686074 664662 640864 615336 589040 562601 536372 510850 486568
63827 486568 463690 442142 422090 403861 387397 372247 358109 344945 332570 320663 309267
63816 309267 298742 289046 279723 270779 262900 256361 250446 244568 239400 236008 234162 232410 229814 226830
63802 226830 224343 222520 220897 219111 217149 215178 213349 211636 209746 207361 204533 201636 198959 196588
63788 196588 194680 193484 192989 192817 192606 192316 192067 191886 191667 191188 190141 188373 186172 184086 182395 181025
63772 181025 180017 179751 180473 181848 183233 184280 185020 185493 185516 184887 183670 182220 180934 179967 179153 178185 176847
63755 176847 175113 173190 171636 171195 172186 173997 175443 175765 175217 174674 174856 175921 177550 179231 180578 181525
63739 181525 182261 183030 184038 185442 187232 189171 191010 192657 194002 194781 195032 195542 197316 200462 204099
63724 204099 207535 211027 215045 219289 223034 226282 229924 234677 240237 245588 249863 252784 254523 255325
63710 255325 255219 254024 251719 248776 245982 243824 242111 240269 237934 235229 232531 230090 227923 226023
63696 226023 224545 223752 223818 224794 226676 229334 232351 235111 237159 238469 239425 240641 242748 246050 250230
63681 250230 254561 258515 262043 265180 267619 268968 269383 269675 270655 272365 273980 274475 273577 272103 271305 271768
63665 271768 273053 274451 275870 277721 280086 282269 283353 282995 281564 279565 277161 274323 271281 268515
63651 268515 266226 263969 261035 257163 252752 248477 244895 242292 240595 239381 238262 237333 237023 237458 238287
63636 238287 239230 240431 242051 243860 245591 247471 250019 253420 257465 262004 267046 272411 277739 283054
63622 283054 289020 296337 305004 314368 323846 333449 343581 354490 366099 378407 391930 407500 425568
63609 425568 445830 467722 491176 516680 544520 574148 604356 634045 662666 689928 715211
63598 715211 737459 755628 769082 777535 781039 780351 777090 772897 768280 762665 755667 747770 739422 729967
63584 729967 718085 703147 685623 666219 645178 622642 599296 576294 554628 534708 516513
63573 516513 500038 485538 473324 463338 455101 448208 442727 438990 437150 437153 438999 442654 447746 453678
63559 453678 460171 467499 476039 485721 496034 506488 517059 528270 540872 555371 571841 590228
63547 590228 610687 633490 658709 686221 716018 748164 782336 817381 851352 881887 906746
63536 906746 924363 934241 936949 933851 926806 917720 907933 897899 887642 877414 867586 857848 846869
63523 846869 833026 815416 794161 769953 743439 715003 685000 654146 623474 593696 564774
63512 564774 536532 509646 485554 465118 447736 432132 417713 404717 393181 382409 371757
63501 371757 361591 353002 346495 341257 335884 329779 323658 318683 315303 313045 311222 309525 307901 306244
63487 306244 304442 302629 301092 299856 298612 297218 296171 296279 297803 300128 302484 304758 307281 310015
63473 310015 312516 314720 317118 319838 322113 323243 323645 324217 324838 324293 321768 317763 313322 309008 304939
63458 304939 301260 298075 295212 292499 290049 287979 286107 284329 283068 282910 283908 285643 287848 290567 293747
63443 293747 297151 300845 305380 311307 318797 327904 338942 352250 367692 384743 403134 423194 445471
63430 445471 470110 496632 524034 550797 575007 595044 610507 622349 631960 640323 648178 656579
63418 656579 666785 679694 695832 715802 740103 768383 799410 832032 865667 899472 931571
63407 931571 959734 982648 1000018 1011675 1017381 1017668 1014142 1008443 1001219 992440 982380 971577 959765
63394 959765 945433 926952 904015 877634 848849 817888 784741 750176 715734 682882 652452
63383 652452 624785 599911 577466 556843 537778 520718 506412 495192 486699 480247 475411 472333
63371 472333 471500 473120 476759 481768 487932 495477 504498 514825 526533 540103 555846 573540 592961
63358 592961 614388 638147 663896 690877 718779 747934 778693 810925 844058 877118 908691
63347 908691 937238 961713 981627 996514 1005772 1009306 1008060 1003538 996858 988466 978574 967473 955320
63334 955320 941897 926770 909487 889445 865812 838093 806959 774220 741708 710325 680330
63323 680330 652189 626635 604020 584169 567010 552866 541881 533508 526795 520819 514557 506671
63311 506671 495941 481976 465455 447831 430842 415746 402559 390238 378015 366357 356281
63300 356281 348046 341037 334761 329283 324676 320579 316587 312649 308957 305650 302719 299913 296727 292840
63286 292840 288626 284913 282124 279944 277846 275635 273467 271742 270973 271284 271924 271807 270757 269689 269299
63271 269299 269181 268706 268126 268013 267996 267037 264968 262920 262014 262340 263465 265176 267179 268637 268818 268055 267372
63254 267372 267234 267215 266929 266660 266857 267570 268738 270591 273306 276529 279712 282784 286106 289880 294049 298714
63238 298714 304180 310551 317655 325349 333508 341771 349835 358051 367109 376859 386103 393944 400909 408237
63224 408237 416454 425186 434051 443082 452381 461834 471186 480065 488134 495639 503546 512587 522224 531039
63210 531039 538082 543355 547125 549446 550411 550178 548532 544956 539462 532961 526465 520227 513867 507148 500427
63195 500427 494537 490346 488214 487829 488809 491438 496412 503850 513022 523231 534572 547612 562654 579533
63181 579533 597805 616880 636224 655703 675584 696089 717059 738097 758834 779068 798973
63170 798973 819075 839559 859536 877454 892341 904218 913317 919485 922468 922043 917624 908448 894586
63157 894586 877018 856264 831708 803040 771722 740107 709441 679580 650357 622254 595848
63146 595848 571509 549713 530816 514323 499003 483962 469177 455073 442232 431520 423604 418030
63134 418030 413383 408741 404476 401309 399178 397449 395726 393976 392232 390753 390217 391174 393326 395805 398157
63119 398157 400699 403908 407844 412248 416890 421634 426361 431058 435913 441075 446320 451116 455171 458786
63105 458786 462521 466584 470813 475198 480061 485554 491378 497261 503412 510068 516769 522602 527142 530708
63091 530708 533629 535743 536837 537214 537485 537935 538299 538058 536803 534395 530923 526542 521401 515854 510618
63076 510618 506417 503339 500743 497964 495060 492802 491993 492828 494824 497290 499819 502324 504748 507072 509683
63061 509683 513391 518719 525424 532993 541395 550936 561590 573018 585290 599025 614681 632052 650611
63048 650611 670052 690438 712126 735576 760838 787154 813400 839024 864260 889480 914743
63037 914743 939954 964938 989306 1012857 1036171 1060081 1084269 1107130 1127463 1145616 1162376
63026 1162376 1177384 1189411 1197659 1201903 1201631 1196097 1185364 1170553 1152866 1132988 1111544 1089517
63014 1089517 1067840 1046975 1027184 1008981 993131 980364 971188 965763 963937 965651 971386 981928
63002 981928 997616 1017995 1042204 1069439 1099059 1130582 1163777 1198599 1234944 1272608 1311425
62991 1311425 1351175 1391304 1430950 1469318 1505909 1540482 1572973 1603272 1630712 1653873 1671312
62980 1671312 1682471 1687427 1685790 1676518 1658951 1633460 1600711 1560936 1514447 1462450 1406672 1348391
62968 1348391 1288454 1228189 1169606 1114411 1063159 1015550 971243 930176 892352 857716 826230
62957 826230 797811 772074 748311 725923 704909 685745 668691 653315 638811 624617 610471
62946 610471 596133 581542 567263 554142 542147 530067 516887 503240 490846 480579 471655 462827
62934 462827 453758 444938 436760 429247 422428 416372 410805 405244 399786 395381 392910 392045 391400 389862 387552
62919 387552 385400 384051 383377 382892 382334 381803 381516 381511 381564 381396 381028 380854 381203 381863 382218 381829 380780 379505
62901 379505 378444 377855 377676 377573 377369 377464 378520 380662 383265 385690 387875 390004 391910 393178 393660 393565
62885 393565 393214 392994 393367 394434 395494 395446 393740 390761 387336 384109 381340 378905 376402 373586 370739
62870 370739 368383 366601 364953 363100 361111 359097 356968 354765 352766 350971 348878 346217 343623 342078
62856 342078 341773 341993 342030 341774 341336 340581 339323 337754 336465 336038 336581 337555 338098 337790 337090 336740 336738 336319 335074
62837 335074 333659 332978 332953 332633 331460 329939 328890 328510 328429 328370 328370 328443 328481 328534 328896 329754 330857 331699 331954 331732
62817 331732 331525 331886 332981 334427 335723 336850 338198 339857 341367 342421 343439 345036 347143 349147 350806
62802 350806 352488 354557 357061 360142 364194 369303 374976 380748 386702 393026 399410 405326 410751 416217
62788 416217 422253 429147 437135 446442 457184 469528 483884 500602 519556 540364 562976 587688
62776 587688 614579 643339 673730 705857 739736 774812 810052 844362 876837 906712 933210
62765 933210 955465 972652 984250 990036 989778 983273 970907 953847 933222 909357 882269 852649
62753 852649 821699 790108 757986 725877 694988 666036 638575 611941 586357 562636 541255
62742 541255 522228 505411 490359 476202 462351 449189 437559 427730 419361 412242 406422 401697
62730 401697 397596 393916 390769 388040 385382 382922 381519 382028 384561 388497 392929 397132 401055 405508
62716 405508 411428 418804 426709 434525 442680 452028 463084 476234 492126 511127 532637 555632 579887
62703 579887 606154 635119 666823 701382 739704 782984 831667 885269 943029 1004287 1068334
62692 1068334 1134435 1202190 1271374 1341063 1409221 1473567 1532619 1585428 1630500 1665694 1689366
62681 1689366 1700996 1700495 1687558 1662278 1625953 1580586 1527696 1468182 1403241 1334777 1264782 1194797
62669 1194797 1126083 1059727 996291 935759 878221 824399 775213 730964 691233 655434 623175
62658 623175 594100 567697 543450 521154 501012 483411 468550 456190 445619 435759 425482 414224
62646 414224 402480 391495 382198 374511 367784 361627 355969 350583 345141 339808 335359 332484 331199 331005
62632 331005 331328 331685 331675 331050 329744 327829 325535 323246 321230 319362 317322 315070 312935 311304 310394 310193
62616 310193 310375 310430 310236 310335 311192 312418 313332 314170 315900 318787 321970 324791 327714 331479 336054 341039
62600 341039 346478 352548 358901 365142 371706 379532 388991 399774 411696 424878 439102 453681 468217
62587 468217 483069 498847 515597 532513 548262 561631 572085 579655 584225 585300 582738 577234
62575 577234 569550 559575 546882 531994 516357 501036 486091 471259 456496 441816 427372 413974
62563 413974 402727 393685 385460 376712 367539 358934 351368 344651 338916 334854 332817 332146 331607 330326
62549 330326 328254 326016 324354 323544 323278 323142 323113 323467 324353 325725 327526 329662 331805 333571 334998 336593
62533 336593 338777 341491 344494 347794 351566 355770 360206 364957 370469 377072 384673 393082 402429 413047
62519 413047 425125 438786 454355 472193 492364 514860 540115 568696 600360 634015 668960
62508 668960 705645 744666 785351 825936 864890 901414 934693 963364 986112 1002498 1012965
62497 1012965 1018116 1017979 1011877 999161 980305 957158 931886 905851 879728 854230 830045 807304
62485 807304 785966 766868 751658 741377 735592 733187 733575 736928 743613 753694 766627 781196 796124
62472 796124 810807 825056 838064 848354 855085 858717 859831 857864 851681 840998 826450 808520
62460 808520 787280 763217 737484 710995 683782 655630 626960 598785 571980 546938 523872
62449 523872 503087 484799 468817 454700 442302 431942 423790 417317 411761 407100 404030 402868 402998
62436 402998 403683 404971 407332 410684 414254 417262 419375 420641 421274 421402 420757 418809 415505 411624 407964
62421 407964 404383 400030 394454 388001 381229 374409 367664 361130 354868 348883 343337 338528 334652 331750
62407 331750 329758 328352 326912 325035 323028 321551 320840 320627 320702 321037 321436 321596 321590 321817 322405 323170 324271
62390 324271 326314 329504 333143 336319 338764 340782 342718 344863 347548 350913 354739 358856 363535 369177
62376 369177 375782 382994 390490 398075 405626 413323 421775 431494 442356 453998 466634 480950 497150
62363 497150 514684 533211 553326 575947 601320 629232 660009 694613 733495 775915 820835
62352 820835 868140 918408 971533 1026091 1080116 1131966 1180252 1223424 1259964 1288826 1309390
62341 1309390 1321233 1324326 1319339 1307308 1289042 1265115 1236266 1203355 1166965 1127521 1085889 1043475
62329 1043475 1001631 961265 923002 887290 854270 823997 796902 773545 753703 736136 719506
62318 719506 703162 686842 670198 653031 635568 617980 599941 581168 562174 543925 526822
62307 526822 510548 494863 480101 466823 455384 445852 437955 431073 424611 418506 413119 408629 404846
62294 404846 401610 398994 397000 395408 394154 393586 394091 395554 397379 399041 400573 402518 405362 408992 412890
62279 412890 416957 421852 428125 435198 441782 447396 452927 459415 466763 474003 480576 486884 493751 501792
62265 501792 511342 522607 535737 550893 568350 588460 611471 637466 666489 698692 734347 773753
62253 773753 817068 864142 914578 967872 1023315 1079643 1135005 1187522 1235744 1278319 1313532
62242 1313532 1339759 1356526 1364709 1365383 1358717 1344250 1321941 1292515 1256904 1215806 1169875 1120017
62230 1120017 1067405 1013508 960150 909118 861331 816651 774755 736003 701129 670314 643006
62219 643006 618569 596634 576830 558698 542109 527331 514386 502653 491413 480587 470695 462270
62207 462270 455537 450374 446178 441940 436913 431294 426006 421820 418852 416787 415275 414152 413589 414033 415706
62192 415706 418237 421078 424230 428206 433283 439241 445912 453525 462273 471912 482010 492359 502919
62179 502919 513655 524605 535844 547141 557968 568102 577935 587920 598073 608410 619548 632343
62167 632343 647177 664185 684053 707856 735954 767648 802157 839409 879469 921636 964474
62156 964474 1006475 1046213 1082073 1112443 1136421 1154106 1166089 1172787 1174271 1170544 1161790 1148409
62144 1148409 1130880 1109657 1085219 1058198 1029384 999605 969682 940485 912780 886885 862652
62133 862652 840039 819575 801985 787338 774884 763786 753740 744693 736303 728104 720126 712930
62121 712930 706867 701661 696978 693171 691093 691246 693412 697038 701562 706179 709801 711656 711864 711091 709746
62106 709746 707813 705435 703154 701324 699481 696608 691977 685581 677810 668967 659271 649271 640030 632645
62092 632645 627554 624356 622408 621460 621703 623358 626458 630916 636612 643456 651533 661166 672554 685418
62078 685418 699286 714169 730628 749070 769278 790744 813124 836200 859732 883685 908383
62067 908383 934060 960393 986838 1013264 1039896 1066714 1093420 1120114 1147540 1176316 1205991
62056 1205991 1235095 1262016 1285717 1305717 1321645 1333003 1339348 1340554 1336763 1328122 1314759 1297032
62044 1297032 1275478 1250349 1221437 1188630 1152453 1113821 1073468 1032021 990495 950149 911710
62033 911710 875078 839936 806338 774602 745001 717821 693498 672403 654531 639444 626371
62022 626371 614344 602578 590932 579838 569664 560260 551178 542030 532605 522934 513405 504496 496268
62009 496268 488478 481356 475737 472020 469443 467005 464810 463862 464591 466243 467818 469065 470422 472353 474941
61994 474941 477885 480775 483574 486694 490257 493434 495071 494978 493981 492589 490353 486861 482634 478363 473722
61979 473722 467762 460369 452627 445632 439537 433854 428245 422739 417512 412725 408460 404698 401396 398532
61965 398532 395879 392828 388842 384239 380194 377684 376539 375731 374445 372705 371017 369706 368676 367726 366952
61950 366952 366748 367372 368601 369985 371440 373410 376402 380620 386117 393061 401577 411507 422595 434775
61936 434775 447947 461589 475088 488569 502965 518967 536134 553313 569720 585208 599646
61925 599646 612514 623291 631947 638815 644132 647868 649896 650133 648559 645234 640359 634275 627429 620397
61911 620397 613929 608852 605861 605325 607277 611599 618246 627199 638166 650403 663046 675638 688148
61898 688148 700389 711590 720697 727029 730496 731217 729083 723774 715162 703735 690667 677365 664701
61885 664701 652540 640053 626643 612643 599111 586947 576214 566313 556685 547135 537586 527846
61873 527846 517860 507913 498290 488906 479665 471085 464019 458693 454485 450820 447812 445772 444676 444580 446084
61858 446084 449726 455182 461726 469387 478941 490741 504345 519475 536651 556428 578499 602079
61846 602079 626838 652930 680284 708352 736462 764024 790337 814574 836103 854638 870018
61835 870018 881903 889740 892994 891571 886149 878059 868676 859008 849828 841966 836160 832754 831797 833402
61821 833402 837736 844665 853591 863637 873822 883082 890424 895135 896699 894453 887564 875512 858525
61808 858525 837498 813555 787660 760484 732539 704505 677387 652106 628847 607011 585972
61797 585972 565770 546962 529983 514894 501636 490242 480648 472472 465097 458009 451061 444466 438551
61784 438551 433464 429167 425654 423009 421109 419392 417225 414538 411899 409875 408468 407245 405815 404016
61770 404016 401815 399353 397077 395631 395494 396714 398939 401646 404472 407446 410845 414768 418993 423398
61756 423398 428211 433531 438827 443410 447325 451165 454918 457678 458902 459388 460403 462193 463931 464968
61742 464968 465401 465401 464661 462831 460078 456913 453735 450847 448647 447394 446779 446009 444481 442368 440491 439610
61726 439610 439831 440709 441827 443123 444660 446401 448441 451207 454954 459070 462294 463804 463964 463929 464654 466243
61710 466243 468079 469474 470314 470985 471611 471639 470515 468596 466770 465184 462951 459402 455101 451221 448241
61695 448241 445718 443138 440503 438057 435780 433309 430249 426586 422837 419696 417413 415614 413835 412090
61681 412090 410735 409845 408961 407514 405469 403471 402250 401836 401461 400386 398695 397048 395818 394849 393980 393275
61665 393275 392603 391473 389595 387282 385047 383083 381406 380174 379471 379013 378436 377821 377595 377989 378867 380061
61649 380061 381630 383714 386209 388652 390504 391726 392960 394871 397313 399549 401288 403022 405154 407345
61635 407345 408999 410016 410696 411269 411818 412311 412338 411262 409048 406537 404419 402355 399682 396600 393955 392075
61619 392075 390540 388965 387320 385588 383814 382494 382175 382560 382651 381925 380830 379982 379404 378685 377289 374567
61603 374567 370087 364347 358686 354099 350429 346968 343429 339952 336477 332605 328094 323230 318644 314845
61589 314845 311847 309220 306560 303885 301445 299252 297031 294654 292377 290599 289490 288784 287847 286193 284055
61574 284055 282209 281071 280269 279387 278562 277986 277308 276224 275157 274519 273725 271909 269388 267338 266189 265488
61558 265488 265294 266283 268199 269560 269518 268857 268583 268653 268892 269955 272218 274540 275409 274822 273989 273653 273780 274527
61540 274527 276234 278468 280145 280707 280452 279756 278847 278362 279192 281393 283936 285779 286730 287117 287146 286896 286502
61523 286502 286029 285379 284515 283661 283155 283171 283441 283239 281914 279715 277796 277083 277337 277566 277020 275554 273500
61506 273500 271693 271061 271563 271937 271209 270003 269513 269607 269106 267752 266695 266829 267788 268887 269999 271003 271276
61489 271276 270470 269186 268240 267696 267143 266478 265912 265558 265477 265817 266445 266849 266889 267352 269178 272175 274966 276221
61471 276221 275757 274474 273437 272938 272336 270907 268854 267248 266911 267652 268670 269327 269357 268752 267754 266711 265782
61454 265782 265005 264712 265359 266747 267966 268529 269089 270509 272592 274367 275431 276269 277273 278075 278086 277312 276364
61437 276364 275910 276310 277592 279572 281919 284237 286284 288188 290383 293108 296044 298692 300997 303258 305409
61422 305409 306908 307524 307786 308346 309212 309954 310397 310808 311664 313469 316468 320102 323071 324439 324542 324479 324849
61405 324849 325404 325668 325394 324461 322848 320800 318686 316695 314872 313305 311901 310200 307921 305673 304551
61390 304551 304929 306035 306825 306823 306063 304780 303448 302773 303184 304444 305931 307230 308373 309625 311067 312357
61374 312357 312972 312885 312817 313476 314700 315817 316755 318163 320370 322915 325384 327967 330716 332872 333708 333714 334202
61357 334202 335800 338008 340245 342725 346062 350430 355359 360138 364294 367982 372034 377408 384351 392172
61343 392172 399848 406766 412936 418757 424559 430171 434920 438315 440733 443130 446026 449099 451831 454100
61329 454100 455948 457166 457477 456932 455831 454472 453190 452330 451818 450982 449220 446745 444285 442233 440536
61314 440536 439292 438828 439139 439800 440624 441950 444070 446836 450102 454191 459571 466296 474020 482300 490726
61299 490726 499121 507877 517651 528263 538206 545761 550456 553052 554337 554479 553404 551100 547495 542612
61285 542612 537036 531711 527060 522649 517936 512969 508111 503498 499102 495088 491740 489160 487341 486421
61271 486421 486583 487738 489507 491552 493799 496335 499199 502322 505624 509124 512946 517218 522078 527746
61257 527746 534407 541859 549465 556712 563708 570926 578587 586565 594676 602583 609548 614892 618779 621972
61243 621972 624624 625862 624900 622068 618347 614277 609776 604755 599478 594456 590287 587315 585056 582236
61229 582236 577957 572756 568099 564895 562907 561488 560415 559920 560329 561868 564579 568279 572664 577400 582054
61214 582054 586242 590114 594384 599399 604363 608106 610577 612927 616046 619658 623121 626408 629735 632742
61200 632742 634732 635613 636044 636660 637690 639433 642607 647833 654925 662968 671161 679529 688801 699637 711962
61185 711962 724995 737832 749837 760497 769174 775365 779230 781637 783486 785100 786361 787223 787808 788023
61171 788023 787486 785945 783545 780452 776473 771385 765453 759209 752715 745476 737239 728461 719798 711522
61157 711522 703701 696618 690474 684777 678449 670700 661689 652369 643849 636789 631114 626259 621795 617766
61143 617766 614334 611326 608374 605330 602189 598681 594300 588736 582078 574689 567220 560649 555709 552124
61129 552124 548795 544967 540937 537490 535047 533669 533562 535131 538580 543749 550313 557974 566535 575987
61115 575987 586527 598356 611522 626007 641792 658680 676230 694145 712638 732150 752656
61104 752656 773434 793549 812452 830098 846648 862157 876453 889237 900275 909456 916637 921525
61092 921525 923780 923178 919632 913210 904254 893382 881088 867393 852155 835734 819047 802786 786836
61079 786836 770720 754474 738796 724298 710896 697984 685107 672431 660668 650536 642086 634553
61067 634553 627054 619462 612442 606662 602300 599357 597992 598215 599596 601690 604520 608227 612433 616493
61053 616493 620390 624859 630548 637494 645460 654276 663666 673310 683434 694953 708652 724475 741939
61040 741939 760987 782039 805385 830864 858019 886351 915609 946119 978716 1014178 1052836
61029 1052836 1094751 1139906 1188021 1238617 1291498 1346750 1404017 1462407 1521694 1583160 1648699
61018 1648699 1719611 1797005 1882839 1979467 2088379 2210401 2347224 2501962 2678630 2882685
61008 2882685 3122738 3410858 3760738 4186210 4701673 5322782 6065930 6947530 7983725
60999 7983725 9189742 10579705 12168494 13970512 15983839 18158135 20367854 22421779
60991 22421779 24117241 25311738 25971888 26179036 26097631 25922441 25817375 25859296 26006558
60982 26006558 26110092 25967138 25396246 24302676 22709441 20744119 18589478 16422458
60974 16422458 14371189 12505681 10853405 9418251 8190229 7149291 6270545 5530395
60966 5530395 4908853 4387922 3950364 3580644 3265911 2995680 2761328 2556213 2375427
60957 2375427 2214924 2071165 1941622 1824938 1720247 1626701 1543620 1470380 1405743 1347708
60947 1347708 1294386 1244710 1198047 1153561 1110440 1068568 1028625 991497 957679 927038 898960
60936 898960 872791 848227 825154 803197 781807 760936 741141 722705 704973 687090 669200
60925 669200 652450 637710 624680 612348 600041 587833 576188 565510 556001 547728 540686 534792
60913 534792 529799 525237 520603 515770 511233 507721 505466 503987 502693 501536 500818 500482 499979 498976 497886
60898 497886 497453 497945 498895 499546 499394 498399 496795 494734 492193 489312 486615 484456 482287 479040 474451 469486
60882 469486 465049 460791 455711 449583 443117 436983 431368 426343 421909 417674 413218 408950 405904 404482
60868 404482 404033 403880 404055 404677 405437 406363 408444 412554 418073 423475 428214 433151 438985 445107 450447 454829
60852 454829 458909 463044 466844 469914 472612 475796 479870 484234 487761 489878 491111 492456 494209 495572
60838 495572 495451 493538 490446 486930 483190 478949 473953 468165 461649 454591 447536 441255 436109 431652
60824 431652 427122 422317 417727 413807 410422 407171 404035 401420 399589 398254 396812 394936 392829 390889
60810 390889 389215 387629 386238 385689 386523 388357 390083 390971 391366 392225 394259 397627 402121 407298 412657
60795 412657 418033 423796 430435 438040 446447 455784 466499 478709 491825 504997 517817 530492 543564
60782 543564 557631 573178 590323 608600 627154 645331 663096 680780 698495 715934 732798
60771 732798 749173 765241 780656 794505 806067 815464 823307 829651 833537 833783 830216 823919 816088
60758 816088 806796 795162 780710 764189 746864 729319 711350 692815 674085 655617 637578 620123
60746 620123 603692 588681 574987 562149 549866 538134 526963 516221 505806 495785 486265 477153
60734 477153 468116 458896 449717 441227 433854 427277 420805 414222 407928 402268 397182 392697 389287 387343
60720 387343 386615 386583 387136 388429 390244 391990 393282 394079 394286 393692 392358 390609 388535 385960 383005 380184
60704 380184 377668 374918 371429 367490 363711 360031 355758 350594 345135 340252 336321 333155 330389 327764
60690 327764 325261 323202 321969 321436 320855 319633 318099 317171 317272 317934 318548 319085 319808 320667 321446 322359 323942
60673 323942 326279 328805 331017 332965 334824 336405 337538 338615 340235 342371 344300 345360 345423 344695 343515
60658 343515 342397 341831 341838 342032 342287 343026 344680 347179 350213 353687 357639 361937 366428 371194 376328 381509
60642 381509 386184 390158 393756 397386 401181 405027 408636 411525 413191 413413 412303 410036 406719 402546
60628 402546 397871 393086 388542 384594 381558 379522 378308 377586 376892 375682 373694 371306 369251 367922 367194
60613 367194 366867 366811 366588 365522 363561 361672 360886 361221 361957 362653 363305 363793 363968 364275 365460 367434 369138
60596 369138 369842 369920 369949 369753 369075 368634 369592 372018 374640 376198 376523 376169 375636 375174 374889 374723 374566 374644 375580
60577 375580 377908 381719 386860 393232 400721 409063 417962 427268 437022 447536 459483 473595 490082
60564 490082 508509 528246 548720 569071 587963 604039 616459 624877 629266 629943 627400 621796 612971
60551 612971 601376 588725 577210 568206 562081 558974 559081 562233 567883 575813 586465 600426 617917
60538 617917 638892 663214 690480 719914 750572 781397 810932 837298 858742 874081 882660 884321
60526 884321 879710 870301 857692 842960 826803 810026 793493 777726 762903 749179 736762 725688
60514 725688 715828 707196 700142 695240 693050 693814 697147 702184 708401 716388 727556 742973 762634 785923
60500 785923 812626 843367 879263 921339 970141 1025603 1087021 1153193 1222766 1294474 1366934
60489 1366934 1438174 1505583 1566590 1619392 1662901 1696117 1717997 1727981 1726270 1713297 1689126 1653600
60477 1653600 1606842 1549452 1482532 1407975 1328609 1247627 1167741 1090917 1018624 951793 890594
60466 890594 834794 784477 740060 701481 667846 638191 612197 589817 570516 553379 537864
60455 537864 523990 511828 501227 492071 484335 477709 471498 465206 459011 453398 448489 444011 439784
60442 439784 435897 432425 429336 426704 424660 422995 421224 419318 417992 417815 418198 417851 416221 413997 412066
60427 412066 410471 408619 406159 403304 400533 398219 396300 394112 390875 386741 383039 381020 380522 380353 379861
60412 379861 379553 380148 381589 383208 384413 385000 385137 385254 385665 386157 386237 385932 385964 386888 388387 389734 390600 391074
60394 391074 391180 390942 390819 391525 393189 394973 395805 395451 394836 395304 397468 400650 403494 405198 406141 407305
60378 407305 409187 411356 412984 413677 413879 414483 415959 417875 419408 420266 420869 421656 422659 423835 425315 427029
60362 427029 428494 429378 429971 430703 431503 432054 432405 432735 432747 431954 430643 429969 430918 433503 437008 440668 444059
60345 444059 447253 450668 454473 458135 460935 462860 464530 466233 467604 468302 468403 467876 466277 463336 459507
60330 459507 455640 452423 450277 449300 449009 448583 447642 446403 444899 442701 439854 437423 436422 436667 437384 438503
60314 438503 440479 443121 445654 448066 451455 456735 463684 471685 480866 492048 505874 522381 541293
60301 541293 562392 585524 610203 635077 657956 676690 690057 697536 698493 692290 679352 661540
60289 661540 641117 619711 598423 578298 560000 543329 527702 513143 500365 489901 481573 474889
60277 474889 469557 465350 461747 458091 454102 450013 446144 442539 439181 436386 434654 433993 433678 432925 431640
60262 431640 430254 428923 427315 425169 422712 420322 418079 415895 413946 412698 412431 412786 412896 412108 410665
60247 410665 409528 409379 409980 410719 411483 412544 413762 414584 414976 415708 417360 419530 421485 423223 425353 428052
60231 428052 430686 432491 433248 433302 433224 433543 434534 436136 438146 440444 442921 445252 447053 448283 449293 450398
60215 450398 451561 452592 453542 454803 456818 459703 463095 466385 469182 471542 473741 475893 477928 479910
60201 479910 482178 484965 487924 490313 491834 493122 495082 497784 500414 502409 504094 505908 507493 508242
60187 508242 508402 508861 509887 510916 511603 512186 512515 511695 509324 506356 503973 502114 499941 497332 494984 493284
60171 493284 492014 491117 490790 490643 489691 487595 485269 483801 483234 482791 481847 480216 477920 475263 473047 472152
60155 472152 472777 474404 476594 479588 483924 489581 495745 501516 506685 511607 516456 521012 525228 529425
60141 529425 533579 536932 538901 540118 541876 544619 547654 550338 552755 555065 556904 557932 558445 558914 559247
60126 559247 558941 557803 556198 554692 553656 553078 552562 551661 550302 548657 546706 544379 542292 541701 543294
60111 543294 546390 549714 552699 555673 559138 563310 568075 572900 576968 579852 581858 583427 584448 584606
60097 584606 584021 582966 581215 578367 574688 570938 567488 564279 561646 560300 560346 561062 561947 563301 565370
60082 565370 567591 569284 570609 572220 574286 576405 578306 580012 581333 581720 580762 578587 575726 572724 569818
60067 569818 566781 563115 558609 553634 548747 544084 539318 534052 527992 520912 512801 504084 495428 487251
60053 487251 479585 472424 465967 460447 455845 451870 448168 444573 441235 438473 436493 435351 435196 436190 438010
60038 438010 439724 440658 441200 442307 444278 446578 448852 451401 454385 457234 459425 461354 463697 466121 467430
60023 467430 467042 465588 463759 461246 457349 452241 446979 442329 438115 433747 428958 423857 418649 413629
60009 413629 409250 405814 403097 400511 397743 395162 393481 393053 393542 394284 394929 395650 396760 398243 399802
59994 399802 401258 402726 404397 406293 408292 410217 411858 413129 414304 415926 418312 421289 424614 428363
59980 428363 432647 437096 441105 444595 448142 452188 456468 460353 463480 465801 467338 468259 468986 469875 470850
59965 470850 471656 472387 473339 474322 474609 473847 472683 472143 472492 473025 472931 472035 470676 469188 467732 466454 465457
59948 465457 464562 463327 461466 459204 457119 455638 454750 454103 453311 452219 451033 450129 449615 449167 448458 447647
59932 447647 447154 446995 446815 446684 447364 449400 452268 454886 456722 457938 458656 458755 458433 458267 458464 458556 458193 457842
59914 457842 458295 459664 461228 462198 462370 462175 462279 463044 464231 465344 466318 467584 469328 471103 472497 473843
59898 473843 475818 478604 481877 485412 489057 492228 494094 494512 494297 494357 494900 495693 496687 498098 500092 502667
59882 502667 505739 509232 513202 517860 523223 528720 533519 537422 541137 545456 550389 555255 559292 561960
59868 561960 562964 562366 560561 557936 554634 550764 546596 542316 537833 533149 528743 525276 523012 521706
59854 521706 520968 520516 520282 520564 521958 524880 529278 534914 541697 549441 557618 565696 573461 580605 586275
59839 586275 589729 591292 592037 592539 592603 592229 592025 592255 592107 590424 586751 581258 574165 565893 557472 550000
59823 550000 543612 537534 531282 525292 520159 515700 511190 506319 501467 496994 492673 488067 483264 478878
59809 478878 475337 472480 469939 467557 465247 462755 459972 457240 454939 452934 450907 449052 447765 446687
59795 446687 444863 442102 439370 437393 435590 433057 429969 427140 424616 421723 418364 415216 412589 410068
59781 410068 407600 405937 405454 405259 404217 402375 400665 399568 398800 398070 397372 396558 395335 393826 392584 391946
59765 391946 391813 392116 392895 393753 393907 393220 392642 393152 394629 396362 398337 401289 405463 409975 413647 416109
59749 416109 417886 419742 422172 425243 428634 431929 434990 437977 440924 443543 445565 447113 448564 450188
59735 450188 452073 454230 456509 458482 459656 459877 459448 458882 458554 458510 458495 458273 457954 457857 457936 457583 456284 454384
59717 454384 452935 452689 453342 453777 453009 450974 448598 447093 447078 448280 449983 451615 452926 453945 454973 456461
59701 456461 458638 461308 464087 466654 468661 469781 470182 470665 471910 473727 475496 477124 478976 481017 482739
59686 482739 484022 485279 486506 486946 486257 485397 485601 486824 487907 488161 488000 487952 487748 486816 485157 483228 481107
59669 481107 478293 474463 470119 466197 463143 460617 458128 455686 453649 452177 451181 450735 451084 452187 453562
59654 453562 454752 455675 456420 457120 458204 460357 463703 467310 469992 471573 472866 474422 475804 476256 475608
59639 475608 474190 472154 469386 466044 462786 460281 458656 457625 456976 456652 456343 455329 453118 450191 447841
59624 447841 447047 447612 448435 448530 447719 446489 445392 444589 443871 442970 441772 440208 438108 435381 432294 429374
59608 429374 426954 425006 423457 422376 421735 421202 420424 419425 418586 418321 418905 420463 422838 425498 427776 429317
59592 429317 430203 430712 431046 431294 431526 431835 432287 432847 433335 433513 433168 432156 430442 428216 425862 423669 421632
59575 421632 419689 418046 416980 416339 415496 413896 411456 408511 405606 403263 401591 400093 398267 396413 395443
59560 395443 395768 396813 397798 398521 399139 399722 400366 401321 402556 403562 404022 404379 405330 407073 409510 412781 417018
59543 417018 421825 426676 431717 437585 444560 452467 461364 471671 483633 497170 512195 528241 543598
59530 543598 555533 561818 561867 556465 547148 536039 525441 516758 509961 504482 500327 497939 497310 497822
59516 497822 498895 500353 502105 503844 505200 505942 505898 504791 502367 498745 494563 490547 486862 483039 478681
59501 478681 474000 469428 464979 460457 456096 452376 449157 445591 441115 436054 431047 426434 422497 419753
59487 419753 418455 418143 418208 418643 419719 421204 422542 423686 425134 427072 429123 431137 433631 437043 440908
59472 440908 444241 446637 448644 451090 454280 457787 460806 462714 463551 464019 464892 466328 467852 468986 469741
59457 469741 470452 471364 472540 474058 476086 478850 482655 487808 494276 501462 508614 515433 522066 528544 534637
59442 534637 540288 545696 550653 554164 555166 553543 550198 546197 542053 537665 532676 526945 520832 514959
59428 514959 509609 504575 499724 495396 492064 489957 489283 490371 493104 496645 500365 504875 511519 520994
59414 520994 533054 547400 563994 582497 602244 623022 645081 667872 689212 706086 716056 718020
59402 718020 712513 701854 689463 678243 669597 664019 661968 663469 667105 670033 669205 662556 649487
59389 649487 630868 608616 584895 561485 539713 520545 504431 491256 480766 472871 467295 463224
59377 463224 459762 456683 454399 453226 452975 453250 453886 455020 456866 459397 462169 464582 466461 468266 470571
59362 470571 473455 476506 479337 481906 484417 487120 490195 493740 497803 502397 507459 512955 519165 526684
59348 526684 535786 545883 556048 566054 576443 587586 599297 611534 624705 638836 653027 666390
59336 666390 679097 691821 704348 715536 724649 732048 738400 743698 747345 748842 748131 745417 740974
59323 740974 735091 728107 720364 712134 703610 695047 686767 678855 670914 662464 653649 645272 638040 632057
59309 632057 627142 623199 620067 617409 615168 613920 614489 617318 622390 629463 638134 647977 658977 671588
59295 671588 685856 700385 712399 718992 718555 711531 700039 686505 672367 658126 644439 632474
59283 632474 622956 615497 609371 604486 601067 598838 597232 596262 596449 597903 599969 601911 603616 605600 608554
59268 608554 612786 617951 623428 629029 635009 641320 647390 652936 658367 663854 668477 670950 670843 668544
59254 668544 664435 658813 652272 645387 638155 630362 622187 613826 604908 595140 585320 576800 570067 564676
59240 564676 560366 557273 555129 553342 551945 551499 551911 552376 552687 553543 555195 556777 557485 557559 557548 557442 557062
59223 557062 556577 556011 554906 553132 551434 550443 549570 547538 543786 538829 533538 528506 523826 519101 513962
59208 513962 508776 504392 500937 497565 493825 490590 488962 488832 489297 490082 491712 494478 497983 501591 504790
59193 504790 507262 509187 511263 513923 516771 519419 522525 527194 533374 539649 544719 548523 551858 555552
59179 555552 560122 565636 571584 577282 582511 587460 592082 596065 599502 603013 606922 610792 614070 616828
59165 616828 619555 622560 625888 629540 633362 636915 639843 642313 644822 647562 650210 652322 653710 654397
59151 654397 654395 653649 652055 649441 645600 640540 634684 628666 622855 617219 611758 606868 602950 599751 596488
59136 596488 592780 589171 586500 584976 584113 583397 582695 582076 581562 581186 581094 581384 581918 582449 583020 584188 586683
59119 586683 590741 595892 601533 607565 614271 621714 629601 637709 646061 654587 662974 670933 678277 684602
59105 684602 689394 692747 695610 698896 702458 705300 706574 706146 704380 701786 698814 695615 692011 687857
59091 687857 683341 678751 674159 669649 665634 662486 659916 657125 653608 649469 644930 639917 634239 627843
59077 627843 620788 613242 605611 598358 591569 584961 578476 572586 567790 563987 560603 557107 553080 547986
59063 547986 541461 534043 527277 522601 520137 518711 517104 515076 513190 511900 511044 510134 508854 507249 505659
59048 505659 504547 504238 504585 504909 504417 502824 500575 498469 497090 496558 496718 497358 498214 498968 499468 499862 500370
59031 500370 501009 501838 503317 505988 509675 513471 516738 519745 523051 526719 530560 534797 539925 546040 552817
59016 552817 559991 567454 575011 582498 589932 597064 603042 607207 610057 612665 615139 616520 616360 615535 615091
59001 615091 615020 614648 613732 612639 611827 611631 612341 614134 617051 621129 626184 631417 635760 638837 641115 642890
58985 642890 643763 643417 642267 640811 638941 636506 634037 632135 630499 628367 625810 623829 623152 623610 624854
58970 624854 627061 630598 635388 641017 647372 654786 663392 672532 681251 689460 698144 707979 718162 727272
58956 727272 735035 742297 749281 754937 758379 759947 760280 759102 755631 749596 741256 731056 719860 708927
58942 708927 698874 689115 678906 668426 658224 648325 638717 630081 623018 616992 611077 605359 600603
58929 600603 596832 593386 590127 587450 585203 582796 580375 578736 577935 577061 575578 573846 572092 569986 567630
58914 567630 565912 565316 565212 564848 564301 563964 563838 563954 564877 567158 570718 575241 580705 587075 593977 601220
58898 601220 609194 618249 627986 637730 647427 657521 668069 678428 687871 696308 704449 713362 723769
58885 723769 735734 749101 763964 780289 797262 813698 829141 843945 858067 870486 880082 886519
58873 886519 889920 890259 887548 882216 874837 865713 855066 843320 830935 818278 805882 794427 784144
58860 784144 774602 765332 756332 747721 739352 731052 722856 714692 706303 697819 689822 682389 674593 665604
58846 665604 655934 646849 638797 631084 623022 614711 606601 598934 591884 585850 581227 577949 575373 572600
58832 572600 568966 564336 558959 553092 546921 540832 535447 531181 527916 525297 523186 521679 520843 520639 521021
58817 521021 521950 523337 525073 527097 529466 532367 535875 539577 542716 545057 547370 550601 554730 558931
58803 558931 562644 565741 567756 567949 566435 564414 562807 561307 559216 556552 553742 550797 547498 544035
58789 544035 540816 537887 535086 532554 530638 529461 529041 529568 531058 532950 534573 535893 537423 539507 542101
58774 542101 545015 547959 550461 552163 553082 553259 552387 550146 546738 542618 537894 532415 526292 519922 513671
58759 513671 507926 503239 499868 497322 494862 492417 490510 489412 488967 489227 490623 493237 496393 499238 501457
58744 501457 503254 504897 506522 508254 510391 513448 517943 523932 530834 537972 545234 553030 561584 570516
58730 570516 579133 586977 594063 600679 606930 612460 616789 620018 622988 626510 630606 634669 638203 641246
58716 641246 644274 647879 652339 657266 661872 665800 669512 673682 678553 684064 690101 696146 701048 703794
58702 703794 704412 703571 701440 697475 691277 683046 673120 661605 648640 634622 620005 605157 590487
58689 590487 576426 563170 550722 539221 528933 519869 511690 504141 497357 491698 487419 484516 482641
58676 482641 481143 479398 477170 474607 471996 469742 468386 468292 469253 470667 472160 473862 476122 479131 482809
58661 482809 486907 491268 496013 501264 506546 510796 513295 514318 514533 514073 512718 510667 508427 506038 503230
58646 503230 500422 498710 498453 498491 497361 494890 492024 489385 486707 483683 480669 478194 476163 474089 472010
58631 472010 470713 470827 472026 473446 474698 476090 477894 479864 481569 482858 483865 484923 486553 489070
58617 489070 491958 494172 495471 496988 499941 504129 508309 511775 514868 518105 521614 525470 529841 534455
58603 534455 538451 541118 542486 543031 543081 542717 541960 540900 539776 538985 538761 538831 538663 538093 537404 536812 536346 536315
58585 536315 537413 540033 543834 548340 553681 560287 567993 575913 583318 590377 597872 606273 615196 623724
58571 623724 631158 637444 642959 648058 652911 657693 662784 668726 676007 684788 694794 705519 716658
58558 716658 728400 741321 755941 772192 789152 805400 819926 832718 844260 854467 862459 867440
58546 867440 869437 869018 866667 862728 857606 851602 844616 836285 826398 815169 803257 791535 780470
58533 780470 769627 758139 745792 733233 720983 708884 696887 685708 676070 667776 660263 653677
58521 653677 648649 645238 642940 641650 641763 643188 645063 646716 648285 650112 652054 653754 655185 656537
58507 656537 657785 658714 659213 659334 659119 658600 657937 657422 657233 657182 656795 655764 654294 652820 651448 649973 648407
58490 648407 647017 645738 644145 642304 641137 641437 642889 644535 645926 647370 649378 652322 656365 661240
58476 661240 666378 671760 678238 686420 695586 704440 712675 720904 729151 736255 741013 743280 743752 743144 741789
58461 741789 739686 736804 733493 730466 728152 726343 724886 724343 725405 727842 730632 733009 734942 736839
58447 736839 739350 743164 748234 753348 757131 759319 760457 760745 760068 758918 758217 758126 757964 757438 757104 757482
58431 757482 758583 760491 763597 767904 772761 777578 782276 786947 791690 796899 803076 810187 817716 825282
58417 825282 832611 839017 843848 847466 850891 854341 857000 858328 858559 857732 855353 851496 847212 843282 839397
58402 839397 835101 830775 827067 824064 821609 819805 818670 817903 817516 818082 819838 822168 824535 827321 831129
58387 831129 835742 840410 844689 848467 851615 854281 857165 860905 865417 870327 875766 882252 889996 898738
58373 898738 908074 917570 926727 935155 942754 949674 956311 963274 970940 979068 987277 995798 1005112 1014915
58359 1014915 1024287 1033034 1041949 1051492 1061144 1070458 1079882 1089957 1100487 1111128 1122010 1133013 1143148
58346 1143148 1151556 1158774 1166189 1174500 1183462 1192902 1203163 1214403 1226067 1237346 1248068 1259008
58334 1259008 1271251 1285117 1299771 1314139 1328017 1341914 1355998 1369878 1383394 1396936 1410847
58323 1410847 1425093 1439628 1454487 1469367 1483722 1497379 1510519 1523122 1535082 1546787 1558728
58312 1558728 1570528 1581393 1591586 1602489 1614971 1628681 1643112 1658243 1673842 1689356 1705037
58301 1705037 1722097 1741110 1761208 1781466 1802150 1823913 1846652 1869877 1893511 1917642 1942072
58290 1942072 1966661 1991588 2016881 2042327 2068205 2095441 2124738 2156212 2189955 2226093 2264189
58279 2264189 2303603 2344636 2388161 2433953 2480693 2528003 2577085 2628844 2682619 2737361 2792832
58268 2792832 2849069 2905925 2963782 3023551 3085396 3148618 3213268 3280481 3350715 3423063 3496949
58257 3496949 3573098 3652300 3734677 3820706 3911284 4006128 4103802 4203981 4307849 4415660 4526090
58246 4526090 4639039 4756902 4881777 5013360 5150854 5294929 5446466 5605485 5772892
58237 5772892 5951232 6142013 6344177 6556839 6781622 7020636 7274268 7542822 7828405
58228 7828405 8133188 8457677 8802597 9170678 9564883 9986894 10439131 10926156 11452349
58219 11452349 12020527 12634649 13301249 14026420 14814515 15672307 16611491 17644787 18783114
58210 18783114 20039691 21433776 22987586 24723778 26670418 28865949 31356782 34195286
58202 34195286 37446139 41192920 45536676 50594878 56508521 63445880 71592534 81140409
58194 81140409 92289397 105248299 120217244 137361845 156797738 178576841 202654586
58187 202654586 228834035 256677700 285360401 313496214 339096772 359828780 373541068
58180 373541068 378808585 375234482 363438229 344814609 321179672 294414038 266213529
58173 266213529 237993633 210879860 185687558 162890237 142647189 124904591 109499584
58166 109499584 96213885 84797984 75000125 66591501 59369421 53151472 47779314 43123880
58158 43123880 39078415 35548593 32452998 29726813 27317096 25175926 23261650 21542579
58150 21542579 19993846 18592358 17318055 16156987 15098879 14133283 13250594 12443886
58142 12443886 11706443 11029674 10406227 9832668 9306111 8820298 8367667 7943227 7543939
58133 7543939 7166548 6808851 6471357 6155135 5859445 5583257 5326905 5089969 4869491
58124 4869491 4662539 4468689 4287944 4118395 3958337 3808586 3669947 3540114 3415906
58115 3415906 3297154 3185629 3081275 2982205 2887492 2797368 2711316 2628319 2548556 2472759 2400320
58104 2400320 2329857 2261167 2194964 2131251 2069533 2010039 1953209 1898659 1846066 1796249 1749882
58093 1749882 1706052 1663759 1623964 1588389 1556931 1527979 1500676 1475181 1451219 1428064 1405611
58082 1405611 1383874 1361793 1338085 1312987 1287824 1263136 1238553 1214117 1190336 1167194 1144355
58071 1144355 1122071 1100690 1079655 1058259 1037006 1016962 998064 979410 960911 943387 927098
58060 927098 911490 896362 882196 869317 857588 846819 836574 825815 813660 800382 786884
58049 786884 773479 760017 746830 734548 723227 712575 702780 694208 686502 678927 671375 664202 657320
58036 657320 650322 643247 636349 629355 621793 613796 605680 596999 586976 575762 564481 554072 544734
58023 544734 536226 527961 519066 509143 498877 489329 480897 473444 466871 460893 454886 448805 443643 440046
58009 440046 437083 433445 429307 425783 423037 420245 417142 414273 411887 409861 408599 408656 409485 409914 409985 411041
57993 411041 413731 417127 420124 422470 423985 424039 422508 420361 418537 416889 414804 412215 409368 406180 402561
57978 402561 399005 396139 393775 390963 387128 382856 379366 377258 375921 374305 372166 370194 368931 368137
57964 368137 367448 367058 367234 367713 368244 369268 371279 373795 375705 376505 376531 376160 375478 374614 373666 372314 370131
57947 370131 367233 364114 360965 357692 354405 351271 348192 345286 343428 343427 344871 346654 348514 351071 354379
57932 354379 357549 360056 362504 365749 370000 375037 380540 385827 389942 392443 393620 393739 392586 390059
57918 390059 386580 382610 378286 373829 369749 366115 362064 356551 349546 342173 335768 330895 327119 323578
57904 323578 319856 316279 313234 310448 307272 303529 299642 295986 292578 289390 286520 283915 281358 278742
57890 278742 276098 273351 270419 267493 264887 262649 260705 259250 258530 258342 258235 258129 258216 258330 258031 257290
57874 257290 256494 255617 254039 251364 247976 244543 241391 238522 235853 233231 230454 227408 224039 220288 216400
57859 216400 213111 211102 210441 210966 212949 216623 221194 225246 228294 231185 234742 238801 242942 247310 252064
57844 252064 256527 259687 261402 262556 264050 265980 267816 269093 269892 270690 271784 272905 273530 273469 272933 272126
57828 272126 271066 269758 268236 266506 264814 263870 264372 266205 268449 270292 271644 272868 274255 275792 277235
57813 277235 278406 279600 281413 283727 285082 283688 279086 272364 264853 257234 249886 243199 237149 231156
57799 231156 224855 218699 213455 209356 206080 203314 201048 199373 198208 197296 196543 196343 197295 199375 201696
57784 201696 203506 205174 207615 210885 213984 216106 217508 219031 221251 224244 227695 231033 233822 236181
57770 236181 238551 241036 243335 245320 247249 249327 251394 253057 253809 253129 251000 248256 245799 243396 239822
57755 239822 234365 227696 221086 215287 210397 206354 203224 201190 200377 200549 201056 201438 201909 202798 203693 203766
57739 203766 202964 202150 201889 201753 201106 200062 199345 199524 200589 201992 202982 203185 202889 202566 202287 201949 201781 202053
57721 202053 202499 202726 203013 203940 205331 206359 206650 206438 205735 204335 202720 201872 201880 201685 200554 198890 197306
57704 197306 195882 194691 194032 193581 192280 189801 187279 185992 185982 186580 187451 188416 189039 189239 189681 190787 191903
57687 191903 192183 191744 191200 190619 189795 189141 189439 191030 193923 198403 204827 213227 223736 237031 253705
57672 253705 273654 296802 323965 356175 393548 435724 483051 536192 594339 654202 710403
57661 710403 756246 784897 791650 775965 741249 692778 636147 576841 519681 467770 422149 382489
57649 382489 347897 317473 290939 268777 251301 237789 227088 218813 213152 209615 206912 204170
57637 204170 201561 199579 198364 197921 198257 199036 199640 199881 200197 200890 201543 201445 200286 198245 195713 193137 190890
57620 190890 189084 187589 186273 185168 184405 184038 183751 182785 180594 177726 175516 174506 173742 172225 170496
57605 170496 169976 171028 172618 173707 174052 173554 171801 168637 164589 160430 156691 153654 151273 148976 146097
57590 146097 142680 139398 136667 134354 132409 131057 130134 128878 126750 124060 121466 119252 117362 115733
57576 115733 114285 112856 111449 110314 109582 108967 107950 106095 103223 99636 96149 93577 92083 91277 90847
57561 90847 90675 90484 90015 89554 89665 90261 90601 90430 90422 91159 92254 93034 93537 94274 95355 96406 97138 97464 97230
57542 97230 96342 95129 94183 93841 94114 95029 96742 99271 102389 105735 108893 111436 113228 114669 116411 118756
57526 118756 121424 123874 125697 126776 127260 127482 127734 128042 128198 128030 127640 127307 127229 127377 127619 127904 128317 128986
57508 128986 129989 131235 132322 132622 131794 130278 128965 128271 127752 126780 125281 123535 121535 118926 115587
57493 115587 112027 109191 107917 108285 109230 109069 106877 103370 100221 98571 98399 99063 100018 100999 101894 102568
57477 102568 102661 101720 99776 97683 96500 96494 96980 97060 96311 94868 93178 91675 90451 89230 87755 86020 84046
57460 84046 81809 79668 78391 78221 78287 77592 76407 75894 76422 76981 76492 75048 73613 72942 73049 73407 73464 73132
57442 73132 72813 72776 72718 72304 71880 72098 72923 73643 73857 73783 73539 72847 71621 70315 69420 69106 69459 70478 71701
57423 71701 72464 72780 73362 74503 75565 75880 75553 74999 74353 73870 74285 76003 78243 79664 79730 79019 78359 78143
57405 78143 78361 78766 79009 78903 78591 78281 77925 77306 76242 74595 72391 70155 68752 68506 68734 68601 68177
57388 68177 68231 69157 70666 72538 75033 78235 81375 83310 83733 83593 84115 85608 87435 88996 90239 91155
57372 91155 91450 91153 91017 91648 92509 92530 91579 90535 89994 89693 89337 89101 89039 88800 88290 87950 87972 87963 87787 88030
57352 88030 89030 90117 90499 90377 90441 90677 90483 89767 89208 89455 90556 92079 93409 94121 94414 94932 95821 96355
57334 96355 95997 95367 95516 96577 97809 98734 99452 99974 100025 99603 99142 99054 99515 100609 102148 103459 104013 104235
57316 104235 105006 106332 107170 106720 105240 103390 101436 99482 97945 97309 97636 98620 99901 101122 101996 102580
57300 102580 103286 104411 105809 107158 108262 108959 109062 108591 107880 107227 106649 106152 105948 106066 106021 105296 104125
57283 104125 103360 103473 104052 104474 104749 105342 106396 107656 109222 111792 115802 120707 125646 130577 136105 142294
57267 142294 148444 154256 160503 168005 176412 184584 191816 198165 203847 209015 214070 219528 225459 231503
57253 231503 237571 244031 250999 257837 263721 268480 272605 276628 280840 285615 291521 298765 306655 314062
57239 314062 320569 326806 333461 340336 346888 353397 360846 369619 379027 388367 397683 407149 416448 425389
57225 425389 434653 445164 456939 469199 481422 493715 506286 519156 532407 546209 560569 575405
57213 575405 590829 606959 623563 640269 657111 674522 692834 712069 732055 752472 772976
57202 772976 793614 814909 837135 859739 881948 903640 925126 946339 966899 986799 1006380
57191 1006380 1025742 1044818 1063897 1083337 1102822 1121656 1139830 1158084 1176901 1196203 1216078
57180 1216078 1236854 1258215 1279178 1299452 1320014 1341699 1363823 1384911 1404450 1423259 1442281
57169 1442281 1461571 1480485 1498533 1515943 1533430 1551415 1569666 1588001 1606974 1627196 1648080
57158 1648080 1668140 1686798 1705072 1724119 1743806 1763247 1782087 1800589 1818911 1837036 1855103
57147 1855103 1873258 1891349 1909205 1926949 1944557 1961454 1977105 1991766 2006142 2020517 2034828
57136 2034828 2049380 2064806 2081280 2098260 2115084 2131481 2147591 2163898 2181075 2199493 2218930
57125 2218930 2239069 2260141 2282578 2306192 2330296 2354746 2380406 2408518 2440028 2475552 2515497
57114 2515497 2560070 2609550 2664686 2726521 2795789 2872943 2958900 3055266 3163621 3285173 3421620
57103 3421620 3576133 3753209 3958005 4196352 4475222 4802420 5185594 5631774 6147642
57094 6147642 6739232 7410390 8161053 8986776 9879374 10827581 11817306 12831985 13853286
57085 13853286 14861862 15838304 16765175 17630308 18429716 19167537 19852094 20489571 21078275
57076 21078275 21606000 22051322 22387755 22588537 22630338 22495754 22175198 21668315 20984480
57067 20984480 20142338 19168658 18096253 16960627 15796012 14632498 13494958 12402903
57059 12402903 11370425 10406567 9516497 8702711 7965253 7301447 6706244 6173410 5696629
57050 5696629 5270060 4888580 4547800 4243645 3971764 3727582 3507086 3307335 3125978
57041 3125978 2960496 2808261 2667304 2536590 2415328 2302271 2195954 2095470 2000747 1912210
57031 1912210 1830609 1757080 1692842 1638576 1594451 1560776 1537924 1525030 1519175 1516258 1512183 1502513
57019 1502513 1481786 1445104 1391304 1324030 1249180 1171730 1095019 1021668 953737 892056 836463
57008 836463 786912 743754 706814 674804 646051 619522 595043 572862 553303 536580 522516
56997 522516 510382 499236 488552 478397 468922 459847 450695 441521 432975 425492 418780 412501 407150
56984 407150 403717 402587 403253 404966 406952 407994 406704 402649 396606 389372 380957 371325 361120 350926
56970 350926 340478 329606 319479 311741 306559 302710 299692 298540 300069 303398 307078 311036 316462
56957 316462 324019 333017 342296 351115 358920 364808 367791 367510 364376 358970 351539 342241 331784 321522
56943 321522 312717 305791 300396 296098 292809 290669 289878 290819 294066 299985 308368 318654 330534 344088
56929 344088 359176 374779 389197 400907 409027 412884 411606 404661 392739 377628 361101 344251
56917 344251 327825 312574 298907 286656 275576 265800 257577 250957 246035 242976 241288 239626 237128
56904 237128 234577 233407 233813 234830 236177 238799 243272 248749 254154 259587 265815 273038 281028 290024
56890 290024 300530 312304 324378 336119 347678 359258 370481 380546 388582 393717 395241 392934
56878 392934 387054 377997 366329 353172 340119 328445 318560 310331 303742 299201 297453 299303 305208
56865 305208 315051 328512 345614 366594 391218 418778 448879 481546 515960 549446 578354 599824
56853 599824 612358 615252 608599 594047 574593 553029 531004 509817 491351 477488 469024 465913
56841 465913 468412 477281 492854 514615 541886 574443 612295 655207 702564 753220 805086 854985
56829 854985 898950 932639 951918 954074 939147 909990 870765 825463 777562 730163 685702 645689
56817 645689 611130 583003 562014 548155 541014 540442 546621 559596 579059 604388 634423 667342
56805 667342 701166 734244 764686 789295 803811 804833 791610 766098 731616 691542 648854 606237
56793 606237 566081 530061 498683 471554 448430 429906 416920 409734 407706 409922 415697 424544
56781 424544 436047 449859 465470 481795 497113 509387 516593 516974 509553 494565 473318 447588
56769 447588 419274 390258 362049 335422 310711 288386 268969 252383 237874 224764 212946
56758 212946 202587 193713 186157 179549 173273 166830 160375 154494 149366 144581 139990 136164 133762 132766
56744 132766 132600 132500 131566 129070 125262 121510 119074 117979 117489 117265 117511 118254 119168 119927 120156 119248 116956
56727 116956 114192 112442 112242 112776 113139 113349 113857 114677 115441 115935 116143 116088 116017 116455 117634 119033 119877 119991
56709 119991 119704 119064 117678 115499 113262 111805 111170 110689 109936 109287 109516 110948 113154 115397 117321 119090
56693 119090 120875 122325 122793 122095 120875 120030 119905 120226 120680 121154 121442 121217 120619 120530 121687 123644 125111
56676 125111 125458 125386 125892 126966 127752 127752 127404 127459 128194 129360 130659 131980 133267 134392 135251 135917 136547 137129
56658 137129 137409 137134 136347 135375 134601 134382 135005 136460 138266 139824 140986 141979 142768 142918 142303 141488 141050
56641 141050 140806 140212 139261 138502 138311 138660 139583 141233 143362 145255 146459 147172 147753 148268 148846 149954 151794
56624 151794 153671 154621 154615 154624 155388 156605 157525 157966 158382 159131 160025 160653 160923 161195 161927 163186 164476 165074 164607
56605 164607 163319 161771 160307 158861 157244 155551 154185 153496 153408 153487 153373 153039 152583 151968 151161 150423 150152
56588 150152 150359 150535 150243 149661 149343 149576 150218 151128 152427 154163 155914 156973 157024 156574 156621 157783 159734
56571 159734 161578 162842 163955 165657 168140 171030 174078 177391 180915 184164 186853 189596 193574 199492
56557 199492 207083 215527 224038 232014 238944 244475 248558 251422 253363 254476 254559 253388 251254 249118 247910
56542 247910 247601 247247 246163 244807 244181 244446 244507 243091 240006 236144 232470 229284 226373 223504 220628 217881
56526 217881 215572 213971 212883 211616 209649 207228 205031 203337 201884 200439 199009 197380 195042 191900
56512 191900 188765 186680 185911 185866 185830 185485 184889 184297 183936 183675 182992 181521 179549 177648 175967 174243 172493
56495 172493 171255 171034 171808 173231 175070 177308 179886 182404 184062 184119 182667 180794 179644 179347 179191 178712
56479 178712 178217 178269 179162 180934 183380 185823 187310 187419 186666 185962 185896 186637 188153 190210 192411 194538 196688
56462 196688 198949 201131 202988 204454 205504 206115 206571 207505 209269 211486 213537 215253 216764 217943 218481
56447 218481 218458 218342 218382 218375 218130 217818 217672 217636 217513 217311 217262 217519 217971 218339 218386 218074 217605 217358 217703 218682 219800
56426 219800 220333 220033 219442 219258 219425 219187 218120 216768 216034 216145 216512 216495 216083 215833 216280 217441 218862 220072
56408 220072 220897 221228 220762 219343 217531 216378 216498 217593 218914 219857 220066 219424 218284 217355 217080 217292 217664
56391 217664 218212 219138 220477 222143 224072 226066 227763 228986 229876 230533 230942 231404 232532 234401 236166 237054
56375 237054 237295 237575 238001 238260 238399 238624 238526 237411 235456 233772 233182 233559 234478 235829 237555 239363 241054
56358 241054 242782 244737 246903 249234 251642 253761 255182 256083 257110 258498 259769 260548 261100 261750 262247
56343 262247 262217 261910 262011 262869 264274 265864 267473 269173 271125 273358 275620 277739 280124 283428 287511
56328 287511 291234 293684 295223 296860 299010 301445 304159 307473 311238 314657 317172 319047 320764 322251
56314 322251 323116 323436 323866 324969 326689 328555 330202 331594 332892 334291 335925 337738 339364 340327 340562
56299 340562 340623 341208 342504 344187 346005 348018 350257 352510 354670 356999 359757 362756 365663 368640 372302
56284 372302 376959 382179 387223 391713 395783 399873 404513 410023 416107 421881 426717 431066 436071 442289
56270 442289 449195 456228 463898 473287 484605 496868 509122 521506 534829 549507 565318 581939
56258 581939 599393 618067 638579 661568 687432 716376 748849 785686 827545 874453 926233
56247 926233 983160 1045828 1114550 1189304 1270089 1356798 1448764 1544929 1644445 1746548 1849647
56236 1849647 1951029 2047770 2137657 2219072 2290269 2349091 2393290 2421051 2431487 2424864 2402243
56225 2402243 2364885 2314165 2251926 2180442 2101774 2017509 1929265 1839081 1748941 1660168 1573584
56214 1573584 1490087 1410719 1336225 1266808 1202297 1142402 1086868 1035535 988288 944958 905403
56203 905403 869710 838063 810221 785361 762672 742036 723882 708398 695101 683168 672018
56192 672018 661578 652106 643866 636849 630748 625178 619962 615228 611224 608031 605501 603497 602097 601379
56178 601379 601037 600472 599446 598470 598358 599515 601706 604329 606760 608678 610351 612422 615151 617982 620175
56163 620175 621766 623597 626496 630689 635870 641512 647192 652979 659471 667180 675930 685121 694403 703854
56149 703854 713743 724525 736888 751318 767744 786005 806463 829611 855391 883632 915125 951515
56137 951515 994002 1042734 1097513 1158382 1225237 1297350 1373358 1451210 1528092 1601021 1667833
56126 1667833 1727386 1779189 1823657 1862572 1898119 1930959 1959804 1982990 1999644 2009233 2011244 2006099
56114 2006099 1995506 1981089 1963025 1940450 1912507 1878403 1837212 1788528 1733113 1672494 1608444
56103 1608444 1543348 1480345 1422144 1369941 1323974 1284616 1252142 1225856 1204417 1187022 1173645
56092 1173645 1164285 1158564 1155953 1155866 1157588 1160589 1164745 1169896 1175431 1180795 1186220 1192415 1199637 1207401
56078 1207401 1215020 1222149 1229037 1236489 1245309 1255578 1266743 1278524 1291229 1304990 1319370 1334079
56066 1334079 1349470 1365870 1383083 1400984 1419916 1439926 1460259 1480283 1500341 1521048 1542413
56055 1542413 1564415 1587787 1613267 1640456 1668194 1695741 1722900 1749493 1775519 1801442 1827599
56044 1827599 1853742 1879862 1906860 1935651 1966187 1998166 2032040 2068330 2106599 2146194 2187440
56033 2187440 2230988 2276471 2323006 2370506 2419208 2468407 2517154 2566066 2616968 2670716 2726562
56022 2726562 2783646 2841946 2901754 2963404 3027554 3094718 3164525 3236433 3311012 3389472 3472097
56011 3472097 3558369 3648556 3743917 3845204 3952018 4063716 4180159 4301681 4429166 4563840
56001 4563840 4706105 4855022 5009960 5172135 5343429 5524446 5715130 5916414 6129582
55992 6129582 6354736 6591855 6842760 7110062 7394728 7696822 8018138 8361720 8729237
55983 8729237 9121449 9541127 9992933 10480468 11006168 11574163 12190422 12859892 13586555
55974 13586555 14376951 15241008 16189149 17231680 18381738 19656161 21073459 22654778
55966 22654778 24428187 26429673 28700719 31290176 34260906 37692615 41680146 46336314
55958 46336314 51799005 58229936 65802969 74696631 85096686 97194634 111172979 127187563
55950 127187563 145353672 165725040 188259940 212778919 238893160 265860456 292394910
55943 292394910 316584536 336092750 348655682 352676883 347657024 334299272 314280851
55936 314280851 289796140 263049331 235881059 209620069 185113515 162825190 142932589
55929 142932589 125414729 110132140 96885776 85450280 75595209 67103326 59780669
55922 59780669 53456202 47979693 43222876 39078820 35456914 32279007 29479518 27004919
55914 27004919 24810370 22857394 21114119 19554394 18154950 16894493 15755394 14723794
55906 14723794 13787222 12933661 12152980 11437097 10778196 10168639 9603010 9078199 8590890
55897 8590890 8136766 7712651 7317460 6950164 6608451 6290177 5994585 5721240 5469082
55888 5469082 5237246 5025511 4833116 4658324 4499806 4357413 4230929 4119043 4019993 3931940
55878 3931940 3852034 3776387 3701883 3627163 3551122 3471529 3386027 3293707 3194813 3089651 2978713
55867 2978713 2863420 2745906 2628290 2512617 2401001 2295118 2195732 2103108 2017633 1939658
55857 1939658 1868989 1804844 1746157 1691924 1641643 1595550 1554062 1516932 1483268 1452228 1423132
55846 1423132 1395019 1366884 1338491 1310273 1282325 1254145 1225512 1196963 1169281 1143054 1118723
55835 1118723 1096281 1074878 1053492 1032133 1011576 991886 972305 952813 934663 918740 904347
55824 904347 890269 876177 862224 848041 833107 817668 802442 787647 773004 758481 744386
55813 744386 730875 717918 705670 694465 684451 675482 667177 658950 650295 641348 632919 625725 619814
55800 619814 614882 610760 607368 604529 602150 600248 598569 596545 593940 591287 589457 588987 589853 591460 592783
55785 592783 593092 592801 593030 594036 594556 592992 588637 581409 571058 557413 541068 523304 505527 489126
55771 489126 475354 464719 456708 450644 446488 444282 443171 441654 438738 434360 428953 423191 418014 414109
55757 414109 411198 408314 404862 401043 397246 393523 389864 386582 384053 382115 379906 376469 371675 366454
55743 366454 361846 357782 353206 347499 341288 335549 330460 325620 320981 316882 313285 309663 305639 301337
55729 301337 297097 293202 289807 286727 283335 279078 274068 268874 263884 259227 255134 251810 248984 246097
55715 246097 243016 240102 237597 235401 233561 232403 232043 232226 232944 234725 237859 241559 244308 245062 243931
55700 243931 241724 239021 235716 231413 226195 220852 216217 212427 208997 205523 202014 198674 195717 193412
55686 193412 191913 190893 189680 187974 186220 185122 185058 186039 187919 190325 192621 194289 195323 195982 196209
55671 196209 195589 193895 191429 188714 186010 183274 180446 177624 174962 172594 170705 169545 169190 169347 169526
55656 169526 169444 169205 169118 169444 170259 171402 172601 173796 175306 177403 179747 181592 182577 182915 182749 181922 180679
55639 180679 179983 180450 181312 181199 179738 177597 175078 171663 167194 162513 158363 154362 149828 145063 140950
55624 140950 137582 134264 130868 128274 127175 127132 127258 127327 127677 128350 128912 129016 128704 128124 127305 126254 124986
55607 124986 123417 121448 119208 116986 114886 112793 110703 108838 107327 106068 105058 104559 104684 105015 104926
55592 104926 104170 102912 101434 100165 99799 100748 102335 103037 101848 99167 96189 93733 92001 91125 91338 92518
55576 92518 93998 95146 95994 97077 98714 100626 102328 103760 105352 107549 110437 113856 117554 120970 123161
55561 123161 123411 121993 119925 117846 115498 112520 109350 106872 105350 104155 102612 100645 98471 96027
55547 96027 93103 89908 87118 85254 84227 83596 83103 82760 82567 82417 82255 82044 81576 80652 79618 79293 80049
55530 80049 81218 81820 81694 81455 81522 81737 81914 82118 82218 81727 80406 78674 77101 75776 74415 72809 70943
55513 70943 68976 67288 66253 65744 65261 64739 64795 65753 66910 67331 67050 66899 67320 67949 68284 68234 68035 68111 68963
55494 68963 70707 72752 74390 75649 76999 78262 78534 77357 75372 73522 72152 71140 70359 69609 68614
55479 68614 67600 67449 68674 70484 71484 71215 70442 69952 69676 69176 68468 67984 67933 67995 67618 66517 64978 63715
55461 63715 63259 63379 63282 62560 61759 61822 63090 65031 66830 67931 68120 67524 66627 65965 65587 65144 64624 64542 65067
55442 65067 65461 65021 64269 64402 65582 66655 66778 66482 66596 66889 66568 65694 65179 65478 66047 66268 66298 66722 67728
55423 67728 68842 69398 69141 68517 68292 68774 69525 69985 70091 69988 69501 68427 67202 66644 67044 68011 69177 70429
55405 70429 71427 71557 70706 69531 68674 68140 67715 67456 67379 67079 66219 65116 64474 64650 65507 66706 67800 68291
55387 68291 68074 67695 67746 68042 67769 66495 64705 63348 63100 64008 65500 66655 66822 66190 65699 66224 67827
55370 67827 69711 70884 70952 70371 69881 69669 69269 68273 66884 65582 64521 63535 62561 61728 61134 60780 60566 60089
55352 60089 58712 56337 53939 52682 52456 51988 50642 49452 49826 51697 53665 54736 55182 55665 56289 56844
55336 56844 57385 58045 58568 58602 58350 58438 59102 59937 60507 60870 61343 62067 62953 63716 63815 62768 60834 59057 58215
55317 58215 57996 57612 56957 56561 56623 56820 57092 57804 58894 59561 59234 58311 57444 56637 55694 55116 55685 57193 58407
55298 58407 58491 57906 57694 58315 59459 60553 61105 60879 60153 59674 60002 60872 61473 61297 60536 59682 59051 58752 58861
55279 58861 59400 60242 61214 62280 63486 64769 65961 66938 67596 67706 67062 65926 65079 65105 65742 66222 66209 66073
55261 66073 66232 66647 67156 67955 69357 71187 72789 73645 73775 73497 72966 72094 70836 69473 68540 68347 68592
55244 68592 68627 68165 67544 67187 66990 66536 65726 64935 64586 64866 65784 67138 68361 68788 68313 67531 67057 66893 66742
55225 66742 66668 67032 67813 68431 68427 68041 67889 68226 68764 69115 69155 68985 68721 68411 68013 67416 66629 65960 65847 66389
55205 66389 67139 67480 67146 66404 65780 65648 65928 66140 65924 65491 65360 65624 65864 65904 66162 66909 67613 67615 67178 67177 67848
55184 67848 68560 68856 69029 69423 69878 70226 70706 71413 71835 71509 70778 70307 70136 69845 69488 69612 70343 71058 71137
55165 71137 70561 69629 68592 67803 67792 68809 70501 72309 73992 75533 76727 77213 76879 76048 75245 74873 75000
55148 75000 75264 75078 74209 73157 72737 73148 73644 73352 72293 71371 71328 71952 72454 72385 71918 71384 70939 70721 70939
55129 70939 71539 71978 71679 70679 69671 69409 70202 71867 73909 75696 76662 76590 75741 74684 73887 73475 73335
55112 73335 73434 73873 74544 74921 74492 73373 72212 71406 70764 70115 69862 70534 71906 73044 73300 72984 72902 73468
55094 73468 74459 75537 76706 78095 79451 80169 79975 79352 78982 78932 78757 78408 78500 79430 80672 81367 81389 81396 81956
55075 81956 82987 84030 84664 84625 83902 82879 82115 81761 81356 80393 79023 77971 77690 77767 77399 76461 75789 76196
55057 76196 77457 78673 79453 80195 81154 81847 81692 80730 79365 77866 76575 76112 76716 77608 77683 76732 75452
55040 75452 74390 73567 73042 73092 73674 74311 74802 75451 76328 76867 76581 75787 75160 74872 74600 74162 73715 73397 73140
55021 73140 72851 72570 72388 72319 72207 71806 71129 70700 71113 72169 72838 72436 71617 71755 73367 75512 76793 76651
55003 76651 75623 74657 74356 74729 75354 75781 75879 75822 75756 75612 75374 75431 76330 78070 79884 81038 81640 82315 83169
54984 83169 83580 83174 82465 82242 82686 83547 84787 86429 87924 88430 87847 87022 86678 86538 85863 84506 83134
54967 83134 82578 83240 84950 87060 88735 89464 89483 89554 90220 91307 92172 92463 92452 92580 92784 92606 91913 91154 90754
54948 90754 90608 90475 90510 90976 91661 92109 92320 92737 93543 94415 94965 94966 94138 92308 89974 88204 87682 88153 89025
54929 89025 90109 91485 92918 93848 93943 93496 93302 94147 96213 98907 101411 103460 105481 108102 111741 116486
54913 116486 121963 127454 132596 137938 144243 151244 157626 162297 165057 165897 164489 160783 155448 149248
54899 149248 142452 135414 129130 124516 121397 118873 116440 114195 112148 110058 107991 106482 105990 106445 107341
54884 107341 108054 108172 107815 107505 107497 107483 107281 107527 109118 112144 115850 119600 123337 127120 130821 134467 138463
54867 138463 143204 148695 154633 160564 165819 169639 171559 171517 169511 165434 159470 152444 145474 139260 133847
54852 133847 129025 124714 120840 117061 112963 108607 104610 101507 99285 97700 96687 96005 94854 92595
54838 92595 89798 87825 87209 87200 87085 87088 87510 87865 87636 87268 87532 88263 88605 88277 87794 87595 87700 88172 89107 90134
54818 90134 90576 90204 89305 88096 86732 85798 85952 86881 87386 86846 86003 85907 86565 87081 86803 85948 85248 85239 85820
54799 85820 86404 86546 86341 86125 86054 86291 87235 88951 90635 91359 91341 91701 92889 94148 94673 94549 94212 93748
54781 93748 93190 92884 93000 93148 92994 92940 93725 95575 98100 100720 102882 104201 104791 105281 106276 108009 110604
54764 110604 114156 118309 122341 126096 130397 136022 142696 149556 156206 162712 168845 174016 177805 180060
54750 180060 180614 179424 176771 172852 167421 160420 152783 145858 140115 135075 130523 126958 124610 122787
54736 122787 120676 118329 116413 115224 114446 113718 113082 112848 113217 114096 115215 116407 117761 119421 121358 123474
54720 123474 125839 128590 131676 134955 138503 142474 146690 150744 154582 158560 162712 166317 168525 169184
54706 169184 168719 167354 164837 160951 156005 150696 145627 140975 136506 131846 126867 121932 117730 114772
54692 114772 113025 112018 111215 110235 108820 106853 104583 102689 101844 102092 102682 102606 101339 99167 96950 95514
54676 95514 95084 95225 95420 95653 96247 97162 97803 97680 96970 96155 95312 94120 92547 91174 90700 91274 92381 93338
54658 93338 93826 93983 94065 94117 94105 94239 94833 95737 96259 95944 95215 94895 95187 95528 95425 95035 94772 94699 94574 94323
54638 94323 94228 94652 95725 97246 98789 99917 100382 100204 99620 98983 98594 98481 98380 98114 97935 98265 99042 99572
54620 99572 99234 98152 96978 96104 95371 94559 93834 93542 93694 93933 93993 94040 94447 95348 96471 97360 97691 97478 97080
54601 97080 96959 97250 97494 96984 95551 93949 93319 94193 96058 97847 98780 98737 98044 97089 96153 95432 95123 95437
54583 95437 96478 97969 99184 99439 98779 97954 97465 96899 95575 93715 92416 92338 92948 93329 93351 93609 94546 96023
54565 96023 97582 98719 99048 98686 98416 99057 100583 102218 103303 103759 103729 103316 102761 102512 102830 103545 104199 104296
54547 104296 103588 102508 102143 103180 104906 105883 105703 105391 105879 106886 107717 108427 109484 110782 111796 112455
54531 112455 113189 114201 115254 116103 116641 116681 116096 115165 114378 113952 113838 114039 114492 114759 114355 113373 112393 111797
54513 111797 111562 111616 111852 111905 111496 111080 111534 113000 114525 115142 114856 114331 114082 114309 115156 116544 117913 118540
54495 118540 118193 117329 116665 116660 117243 117845 117806 116954 115730 114701 114075 113809 113926 114453 115133 115503 115345 114871 114426
54476 114426 114130 113906 113760 113923 114717 116270 118312 120196 121196 121025 120183 119683 120209 121511 122710 123202 123102
54459 123102 122902 122984 123571 124764 126336 127640 128027 127318 125805 123950 122275 121300 121251 121830 122462 122794 122836 122794
54441 122794 122864 122997 122734 121541 119584 117850 117060 116732 115788 113945 111921 110416 109573 109458 110333 112070 113877
54424 113877 115075 115832 116739 117919 118981 119687 120291 121210 122658 124651 127069 129518 131222 131323 129639 127097
54408 127097 125118 124307 124017 123437 122714 122551 123036 123589 124027 124860 126352 128001 129286 130319 131361 132228 132679
54391 132679 132962 133481 134227 135020 136001 137337 138684 139452 139499 139120 138539 137813 137095 136444 135495 133890 132007 130783
54373 130783 130745 131597 132732 133652 133959 133478 132552 131736 131104 130334 129500 129133 129270 129156 128298 127249 126808 126965
54355 126965 127199 127399 127724 127886 127437 126715 126629 127427 128435 129203 130104 131372 132340 132264 131396 130545 129935 129156 128066
54336 128066 127049 126466 126393 126806 127470 127749 127181 126245 125931 126528 127550 128890 131112 134290 137463 139870 141953
54319 141953 144373 146662 147795 147746 147387 146957 145624 142796 139067 135502 132586 130242 128387 126995 125870
54304 125870 124806 123901 123431 123435 123594 123571 123456 123774 124847 126115 126433 125296 123489 122177 121652 121381 121021 120752
54286 120752 120737 120889 121222 121833 122484 122754 122704 122797 123017 122693 121459 119919 119032 119209 120169 121183 121318 120022
54268 120022 117824 116000 115290 115368 115768 116575 117815 118856 119084 118708 118268 117774 117027 116421 116626 117611 118715
54251 118715 119589 120377 121027 121125 120600 120038 120076 120832 122033 123312 124264 124521 123985 122909 121701 120768 120365 120370 120330
54232 120330 119903 119177 118364 117494 116688 116377 116755 117222 116975 116051 115303 115362 116090 116932 117345 116962 115956 115171 115284
54213 115284 115861 115916 115462 115654 117071 118682 119100 118237 116996 115816 114402 112786 111730 111781 112529 113160 113482
54196 113482 114008 115203 116964 118759 119988 120234 119509 118462 118044 118608 119456 119643 119158 118884 119345 120071 120434
54179 120434 120501 120623 120669 120373 120085 120320 120666 119992 117998 115821 114722 114652 114518 113489 111740 110193 109875 111205
54161 111205 113533 115498 116123 115510 114387 113283 112370 111778 111621 111794 112030 112164 112171 112082 112025 112238 112724 113027 112624
54142 112624 111551 110422 109839 109956 110592 111480 112325 112853 112978 112880 112785 112724 112594 112391 112243 112246 112451 113031 114206
54123 114206 115807 117172 117800 117933 118090 118134 117495 116385 115989 116961 118418 119134 119226 119752 120925 121803 121756 121234
54105 121234 120758 120090 118955 117892 117668 118281 119100 119748 120316 120926 121564 122233 122846 123054 122557 121501 120321
54088 120321 119331 118746 118953 120305 122643 125260 127403 128715 129259 129323 129188 129003 128882 129106 130011 131637 133684
54071 133684 135795 137643 138751 138764 138048 137537 137693 138038 138055 138034 138507 139246 139499 139044 138444 138295 138692 139381 140007
54052 140007 140299 140379 140807 141994 143695 145448 147245 149283 151344 153020 154477 156339 158904 162036 165730
54037 165730 170018 174402 178230 181794 186216 191967 198328 204670 211403 219017 226868 233692 238945 242957
54023 242957 246144 248759 251179 253695 256036 257676 258611 259391 260432 261626 262574 262792 261884 259976 257845
54008 257845 256174 254786 253148 251513 250854 251577 252960 254130 255031 256065 257147 257586 256655 254012 249710
53993 249710 244136 237901 231592 225578 219944 214468 208759 202734 196945 192074 188100 184401 180768 177734
53979 177734 175649 173988 172044 169898 168132 166961 166233 166071 166760 168012 169045 169584 170210 171458 173069
53964 173069 174432 175358 176046 176557 176700 176292 175230 173535 171648 170490 170786 172242 173747 174490 174692 175148
53948 175148 176284 177817 179215 180294 181306 182588 184254 186253 188571 191214 194078 197042 200121 203296
53934 203296 206196 208373 210100 212429 216052 220346 224108 227105 230274 234300 238628 242303 245319 248598
53920 248598 252812 257773 262952 268185 273735 280017 287340 295646 304362 312792 320811 328928 337434 345747
53906 345747 352866 358224 361774 363513 363551 362652 361990 361980 361782 360425 358109 355867 354149 352342 349718 346200
53890 346200 342013 337151 331618 325863 320441 315333 309962 303885 297170 290142 283065 276181 269764 263969
53876 263969 258778 254258 250711 248333 246726 244984 242438 239262 236170 233519 230896 227711 223993 220356
53862 220356 217297 214839 212803 211079 209508 207882 206307 205337 205437 206428 207735 209112 210860 213368 216669
53847 216669 220550 224991 230421 237435 246106 255543 264357 271609 277045 280365 280720 277383 270669 261764
53833 261764 251784 241442 231506 223001 216629 212221 208916 205829 202611 199610 197484 196513 196304 196330 196561
53818 196561 197293 198535 199967 201378 202711 203739 204231 204509 205233 206466 207459 207672 207564 207997 209263 211087
53802 211087 213311 216051 219329 223034 227216 232061 237449 242824 247588 251504 254711 257497 260062 262394
53788 262394 264299 265594 266324 266826 267542 268576 269315 268740 266439 263263 260603 259022 257895 256361 254073
53773 254073 250964 246927 242159 237399 233295 229736 226193 222600 219498 217398 216231 215363 213982 211657
53759 211657 208771 206284 204801 204022 203179 201800 199856 197552 195324 193704 192757 191896 190643 189337 188653
53744 188653 188672 188913 189014 188756 187697 185619 183364 182361 183016 184168 184420 183499 182073 180883 180436 181037 182509
53727 182509 184112 185177 185740 186281 187070 188058 189176 190432 191816 193349 195020 196541 197442 197679 197863 198551
53711 198551 199640 200809 202208 204134 206233 207743 208588 209554 211178 212987 214149 214477 214435 214463 214695 215201
53695 215201 216144 217722 220096 223308 227092 230849 233967 236095 237144 237293 237149 237525 238646 239808 240174
53680 240174 239759 239165 238525 237326 235338 233030 230856 228707 226504 224752 223966 223870 223808 223719 224059 224778 225050
53663 225050 224194 222392 220382 218811 218033 218097 218620 218958 218766 218286 217969 217997 218220 218331 218071 217540 217327 217922
53645 217922 218921 219277 218553 217495 217147 217791 219077 220740 222691 224719 226618 228467 230329 231839 232568 232734
53629 232734 233091 234056 235320 236363 237081 237839 239096 241008 243267 245412 247380 249571 252220 255038 257768
53614 257768 260769 264543 268893 272985 276164 278340 279782 281046 282931 285924 289637 293281 296603 299851
53600 299851 302937 305325 306781 307500 307410 306200 304355 303319 303977 305491 306356 306228 306011 306320 306609 306006 304469
53583 304469 302816 301726 300931 299463 296726 293272 290361 288750 288149 287768 287060 285851 284206 282482 281216
53568 281216 280639 280438 280179 279764 279300 278845 278538 278707 279531 280774 282102 283494 285041 286579 287828 288775 289632
53551 289632 290534 291563 292898 294596 296385 297979 299505 301261 303234 305257 307532 310505 314191 318112
53537 318112 322059 326504 331997 338443 345225 351899 358523 365472 373135 381729 391204 401264 411617 422259
53523 422259 433493 445599 458448 471488 484238 496846 510125 524950 541674 560031 579450
53512 579450 599394 619587 640094 661145 682831 705051 727706 750759 774063 797355 820544
53501 820544 843697 866603 888717 909837 930507 951300 971879 991275 1009091 1025995 1042927
53490 1042927 1060208 1077514 1094456 1110988 1127459 1144325 1161667 1178969 1195620 1211607 1227370
53479 1227370 1242960 1257689 1270728 1281718 1290628 1297438 1302293 1305647 1307782 1308304 1306520 1302333 1296340
53466 1296340 1289000 1280052 1268980 1255773 1240942 1224970 1208064 1190448 1172512 1154488 1136114 1116863
53454 1116863 1096510 1075371 1054016 1032896 1012216 991973 972041 952341 933000 914286 896367
53443 896367 879293 863249 848672 836032 825573 817310 811073 806480 803052 800504 798795 797811 797300
53430 797300 797322 798462 801228 805413 810468 816385 823752 832908 843527 855206 868042 882405 898437
53417 898437 916047 935150 955632 977288 1000117 1024590 1051275 1080184 1110750 1142500 1175532
53406 1175532 1210222 1246615 1284298 1322885 1362483 1403624 1446831 1492301 1539918 1589338 1639985
53395 1639985 1691168 1742483 1794081 1846382 1899466 1952830 2005660 2057238 2107246 2155901 2203732
53384 2203732 2250885 2296631 2339800 2379729 2416466 2450021 2479879 2505475 2526747 2543845 2556540
53373 2556540 2564338 2567023 2564773 2557791 2546138 2529828 2508787 2482710 2451251 2414382 2372403 2325792
53361 2325792 2275390 2222568 2168650 2114094 2058722 2002895 1947914 1894948 1843937 1793939 1744305
53350 1744305 1695272 1647670 1602388 1559784 1519153 1478993 1438321 1397626 1358079 1320033 1282951
53339 1282951 1246763 1212465 1180982 1152062 1124755 1098615 1073917 1051005 1029922 1010564 992766
53328 992766 976260 960930 947028 934743 923533 912314 900485 888576 877784 869042 862476 857483
53316 857483 853247 849420 846512 845509 846990 850681 855786 861575 867697 874275 881863 891138 902403 915446
53302 915446 929921 945745 963039 981913 1002446 1024695 1048481 1073337 1098916 1125379 1153064
53291 1153064 1181672 1210088 1237208 1262822 1287505 1311720 1335217 1357285 1377295 1394883 1409851
53280 1409851 1422160 1431929 1439203 1443723 1445187 1443710 1439763 1433628 1425217 1414522 1401823 1387281 1370657
53267 1370657 1351773 1330988 1308908 1285851 1261923 1237296 1212011 1185794 1158660 1131450 1105028
53256 1105028 1078960 1051777 1022811 993144 964380 936938 910005 882844 855736 829666 805334
53245 805334 782397 759667 736229 712300 688708 665758 643211 621340 601129 583049 566345
53234 566345 550133 534635 520706 508517 497399 486772 476653 467338 459084 451944 445496 438927
53222 438927 431785 424385 417009 409102 399962 389935 380098 370817 361487 351838 342666 334888 328517 322963
53208 322963 317855 313096 308502 303822 298992 294134 289471 285334 281939 278999 275931 272576 269365 266516
53194 266516 263562 260051 256380 253374 251214 249275 247006 244521 242214 240127 237964 235581 233241 231315
53180 231315 229797 228208 226106 223585 221123 219009 217210 215826 215213 215356 215420 214434 212385 210203 208617
53165 208617 207429 206116 204742 203857 203627 203569 203227 202735 202504 202660 203060 203600 204138 204294 203797 203025 202696 202964
53147 202964 203235 202990 202346 201594 200701 199577 198409 197360 196323 195375 194962 195187 195353 194886 194301 194484 195318
53130 195318 195914 196050 196381 197128 197614 197410 197027 196946 196787 196092 195318 195307 196135 197175 198039 198822 199523 199883 199873
53111 199873 199890 200287 200866 200937 199871 197769 195653 194724 195266 196479 197438 197844 197695 196795 195063 192976 191164
53094 191164 189754 188563 187696 187429 187600 187657 187310 186727 186113 185506 185005 184748 184662 184586 184663 185197 186037 186556 186321
53075 186321 185416 183988 181944 179454 177350 176506 176890 177534 177503 176684 175683 175194 175535 176567 177844 178829 179165
53058 179165 178878 178328 177892 177681 177580 177439 177109 176360 175079 173666 172939 173333 174319 174908 174700 174218 174140 174502
53040 174502 174800 174712 174409 174059 173283 171464 168692 166064 164703 164560 164543 163830 162702 161998 162110 162744 163332 163411
53022 163411 162905 162317 162394 163261 164096 164061 163355 162882 163031 163326 163311 163205 163439 164015 164642 165223 165866 166578 167235 167765
53002 167765 168121 168143 167699 166943 166230 165701 165122 164216 163030 161913 161196 161020 161381 162205 163286 164340 165242 166131
52984 166131 167131 168061 168638 168968 169524 170514 171473 171724 171127 170230 169735 169974 170861 172147 173605 174965 175775
52967 175775 175579 174445 173214 172879 173674 175044 176513 178122 179827 181057 181357 181134 181150 181447 181337 180430 179061
52950 179061 177622 176059 174316 172776 171840 171334 170707 169723 168650 167825 167256 166687 165907 164969 164113 163471 162850
52933 162850 161965 160894 160060 159701 159566 159331 159073 159040 159073 158636 157488 156044 154967 154662 155378 157372 160527
52916 160527 163845 165924 166238 165672 165468 165916 166402 166547 166670 167061 167393 167168 166406 165545 164881 164432 164145 163892
52898 163892 163366 162358 161130 160209 159800 159635 159389 158998 158610 158476 158942 160209 162003 163663 164684 165054 165057
52881 165057 164925 164762 164600 164438 164285 164233 164333 164473 164526 164629 165059 165786 166402 166655 166855 167530 168790 170278 171664
52862 171664 173048 174783 176963 179133 180532 180687 179798 178499 177233 175970 174546 173120 172165 172019 172545
52847 172545 173198 173397 172863 171728 170389 169198 168192 167022 165189 162503 159392 156709 155136 154756 155187
52832 155187 156018 156967 157697 157761 156906 155442 154171 153818 154466 155566 156528 157269 158046 158797 158868 157605 155180 152632
52814 152632 151028 150657 151061 151677 152302 152970 153628 154189 154881 156227 158475 161139 163324 164544 165056 165417 165843
52797 165843 166030 165481 163951 161650 159036 156460 154112 152263 151219 150877 150677 150302 150056 150194 150231 149545 148442
52780 148442 147852 148058 148482 148738 149003 149192 148781 147912 147778 149182 151339 152807 153041 152351 150971 149082 147386
52763 147386 146665 146896 147512 148316 149361 150181 150099 149310 148804 149102 149805 150479 151203 152028 152622 152744 152595 152478 152525
52744 152525 152803 153226 153395 153118 153039 154041 155904 157359 157666 157465 157777 158849 160323 161876 163302 164492
52728 164492 165637 166967 168062 168110 167167 166455 166898 168029 168928 169622 170822 172661 174455 175501 175532 174585 172987
52711 172987 171396 170357 169860 169538 169070 168159 166552 164513 162918 162344 162326 161991 161199 160486 160104 159751 159197
52694 159197 158624 158236 157880 157174 155857 154129 152796 152815 154388 156704 158799 160398 161626 162344 162316 161849 161675
52677 161675 162228 163386 164798 166084 166857 166968 166619 166021 165194 164394 164212 164762 165187 164731 163972 164169 165572
52660 165572 167215 168392 169431 170865 172665 174635 176838 179200 181178 182242 182421 182178 182068 182616 184035
52645 184035 185846 187161 187499 186954 185519 182885 179204 175487 172767 171253 170610 170626 171096 171467 171248 170710
52629 170710 170691 171635 173124 174374 174962 175126 175531 176693 178474 180136 180985 180848 179968 178722 177558 176909 176893
52612 176893 177245 177692 178176 178536 178289 177090 175300 173766 173152 173650 175103 177048 178780 179818 180336 180857
52596 180857 181533 182045 182235 182481 183301 184769 186417 187536 187562 186435 184751 183388 182871 183126 183830 184758 185730
52579 185730 186476 186808 186873 187036 187514 188209 188850 189220 189292 189224 189159 188977 188369 187303 186260 185777 185812 185856 185696 185747
52559 185747 186440 187513 188222 188152 187600 187145 187070 187247 187350 187108 186435 185493 184620 184160 184248 184668 184897 184425 183130
52540 183130 181306 179364 177642 176527 176392 177159 178201 179018 179741 180572 181006 180336 178938 178285 179345 181486
52524 181486 183345 184314 184760 185186 185776 186532 187300 187719 187580 187259 187354 187894 188290 188176 187973 188428 189787 191581
52506 191581 193101 193958 194220 194171 194095 194235 194766 195557 196114 196072 195691 195474 195346 194689 193315 191830 190771 189969
52488 189969 189176 188780 189288 190422 191377 191776 191812 191648 191300 190981 190980 191214 191475 192010 193275 195079 196577 197185
52470 197185 197007 196387 195680 195494 196456 198460 200699 202618 204294 205712 206420 206342 206330 207302 209148 210945 211997
52453 211997 212210 211699 210530 208812 206747 204623 202902 202030 201920 201835 201098 199755 198304 197017 195810 194599
52437 194599 193456 192484 191776 191386 191115 190569 189647 188791 188453 188521 188620 188812 189553 190954 192480 193514 193970 194244
52419 194244 194726 195495 196404 197371 198574 200282 202505 204882 207008 208799 210517 212562 215303 218927 223296
52404 223296 228104 233222 238782 244775 250693 255677 258940 260041 259047 256576 253475 250194 246561 242318
52390 242318 237739 233537 230292 228128 226776 225780 224746 223657 222897 222759 223005 223088 222754 222272 222099 222494 223469
52373 223469 224943 226863 229169 231620 233745 235210 236340 238035 240940 244724 248339 250968 252646 253968
52359 253968 255268 256087 255557 253464 250800 248993 248576 248948 249454 250185 251449 252964 254101 254813 255758 257501
52343 257501 259898 262384 264627 266804 269342 272441 275803 278930 281757 284872 288968 294215 300284 306784
52329 306784 313475 320240 327149 334547 342827 352164 362539 373889 385984 398330 410566 422909 435875
52316 435875 449498 463031 475514 486456 496003 504685 513073 521434 529569 537092 543954 550577 557346
52303 557346 564094 570248 575496 580115 584593 589056 593244 597014 600546 603894 606640 608335 609146 609654 609989
52288 609989 609637 608250 606156 603783 600989 597414 593343 589769 587524 586611 586399 586351 586572 587773 590642 595192
52272 595192 600769 606727 612881 619280 625821 632256 638424 644313 650134 656432 663842 672477 681760 690969
52258 690969 699688 707667 714759 721284 727971 735068 741954 748076 753822 759838 765951 771584 776877 782351
52244 782351 787552 791189 792898 793814 794917 795649 794962 793028 791037 789600 788315 786880 785829 785816 786685 787664
52228 787664 788315 788967 790270 792490 795324 798258 800984 803507 806005 808666 811524 814332 816840 819403 823104
52213 823104 828808 836058 843257 849113 853692 858063 863190 869303 875965 882510 888534 894127 899552 904708
52199 904708 909164 912760 915868 918958 922219 925765 929809 934322 938788 942634 945711 948039 949366 949514
52185 949514 949071 949146 950180 951326 951279 949494 946404 942647 938401 933471 927779 921620 915489 909704 904190
52170 904190 898584 892615 886422 880524 875461 871455 868402 866193 864890 864545 864881 865331 865489 865475 865766 866667
52154 866667 867986 869234 870057 870472 870735 871050 871361 871351 870641 869155 867358 865999 865493 865619 865917 866253 866789
52137 866789 867477 867855 867488 866409 865112 864260 864379 865585 867519 869764 872422 876106 881363 888374 897303
52122 897303 908458 921807 936687 952438 969141 987313 1006896 1026931 1046295 1064466 1081521
52111 1081521 1097586 1112449 1125723 1137348 1147777 1157390 1165734 1171750 1174974 1176110 1176103 1175104 1172806 1169510
52097 1169510 1166158 1163359 1160910 1158315 1155374 1152252 1149382 1147207 1145578 1143508 1140061 1135495 1130915 1126790
52083 1126790 1122476 1117372 1111832 1106593 1101979 1098174 1095685 1094846 1095136 1095777 1096947 1099728 1104662 1110830 1116715
52068 1116715 1121723 1126570 1132244 1138944 1146188 1153700 1161645 1169818 1177136 1182487 1185916 1188378 1190337 1191251
52054 1191251 1190548 1188443 1185436 1181604 1176815 1171222 1164969 1157795 1149506 1140590 1131754 1122954 1113511 1103186
52040 1103186 1092450 1081579 1070165 1057966 1045727 1034649 1025209 1017018 1009778 1003813 999423 996089
52028 996089 992759 988930 985138 982248 980478 979279 977976 976226 973865 970704 966670 961960 956782 951048
52014 951048 944556 937461 930306 923450 916588 908985 900196 890402 879998 868972 856871 843349 828542
52001 828542 812884 796736 780342 763924 747560 731004 713896 696212 678393 660992 644289
51990 644289 628265 612893 598455 585533 574595 565503 557500 549768 541915 533984 526223 518962 512416
51977 512416 506391 500319 493777 486786 479525 472027 464413 457066 450252 443837 437710 432220 427822 424621
51963 424621 422699 422502 424305 427556 431387 435532 440172 445185 450387 456259 463330 470806 476820 480341
51949 480341 481962 482621 482475 481416 479732 477657 475066 472201 469991 469080 469241 470405 473525 479595 488324
51934 488324 498594 509816 521992 534816 547553 559591 570354 578869 584192 586147 584992 580570
51922 580570 572566 561499 548589 534548 519225 502618 485620 469465 454789 441382 428578 415912
51910 415912 403737 393166 385021 378944 373887 369310 365431 362486 360335 358848 358138 358371 359736 362568
51896 362568 367011 372503 378054 383079 387633 391879 395719 398837 400663 400394 397718 393578 389673 387054
51882 387054 385564 384680 384370 385092 387533 392491 400462 411113 423516 437141 452253 469172 487391
51869 487391 505444 521276 532836 538918 539707 536221 529212 519018 506392 492676 478880 465096
51857 465096 451156 437376 424368 412525 402070 393228 386043 380294 375864 372874 371167 370016 368675
51844 368675 367000 365293 363774 362462 361264 359866 357815 355043 352144 349748 347758 345534 342808 340115
51830 340115 338269 337591 337724 338133 338665 339432 340186 340214 339150 337656 336788 336796 336975 336620 335589 333941 331759 329518
51812 329518 328056 327816 328463 329467 330636 331898 333070 334224 335871 338348 341273 343880 345666 346465 346192
51797 346192 344846 342572 339546 336044 332631 329888 327814 325933 324092 322560 321171 319117 316097 312980
51783 312980 310653 308741 306245 303139 300564 299473 299685 300298 300557 300359 300231 300790 302011 303234 304062 304845
51767 304845 306007 307450 309111 311533 315153 319482 323759 328109 333186 338910 344529 349767 354871 359422
51753 359422 362168 362372 360543 357472 353362 348296 342833 337502 332240 326864 321736 317438 314161 311868
51739 311868 310750 311026 312455 314532 317075 320298 324380 329300 335010 341510 348699 356268 363632 369959
51725 369959 374588 377619 379896 382194 384570 386625 388015 388446 387475 384819 380867 376554 372735 369859 368163
51710 368163 367787 368495 369412 369261 367122 363232 358961 355685 353559 351696 349666 348273 348495 350043 351550
51695 351550 351993 351300 349731 347469 345065 343562 343578 344595 345526 345715 344966 342973 339469 334946 330570 327117
51679 327117 324415 322035 320040 318683 317759 316856 316137 316364 318061 321049 324854 329244 334242 339936 346440
51664 346440 353781 361671 369559 376999 383682 389002 391992 391999 389199 384211 377533 369735 361989 355777 351969
51649 351969 350456 350696 352306 355030 358427 361719 363912 364152 362203 358571 353949 348594 342412 335538 328475
51634 328475 321673 315343 309742 305260 302030 299648 297460 295007 292198 289254 286586 284533 283152 282297
51620 282297 281823 281535 281102 280374 279711 279599 280005 280559 281330 282732 284517 285579 285233 284146 283452 283382 283376 283237
51602 283237 283425 284265 285545 286998 288667 290600 292615 294595 296764 299553 303367 308488 314844 321695 327796
51587 327796 332109 334385 335036 334626 333503 331813 329872 328488 328683 330822 334183 337770 341460 345997 351964
51572 351964 359246 367602 377217 388447 401392 415884 431572 447801 463818 479354 494694 509944
51560 509944 524656 538574 552384 567321 584306 603908 626758 653199 682495 712872 742321
51549 742321 768976 790906 806377 814640 815986 810856 799343 781767 759150 732737 703418 671998
51537 671998 639684 607786 577033 547594 519712 494009 471175 451563 435025 420982 408792
51526 408792 398218 389364 382004 375264 368370 361594 356048 352446 350287 348286 345440 341648 337465 333375
51512 333375 329368 325335 321713 319308 318321 317930 317194 316089 315329 315378 316028 316695 316700 315482 313077 310331 308089
51495 308089 306227 303976 301180 298608 296948 296086 295580 295319 295372 295590 295740 295805 295954 296420 297469 299116 300716
51478 300716 301251 300342 298700 297325 296493 295736 294536 292818 290996 289771 289653 290494 291656 292735 293798 294853
51462 294853 295522 295459 294683 293258 291036 288062 284861 281973 279533 277614 276591 276708 277567 278454 278997 279250
51446 279250 279508 280392 282709 286676 291644 297049 303349 311462 321511 332598 343468 352834 359499 363010
51432 363010 364162 364196 363645 362549 361406 360855 360397 358500 354254 348262 341657 335075 328825 323253 318423
51417 318423 314003 309959 306888 305295 304974 305426 306404 307700 308970 310202 311857 314030 315870 316439 315876
51402 315876 315180 315026 315271 315495 315544 315547 315719 316137 316573 316716 316748 317477 319642 323259 327837 332973 338544 344617
51384 344617 351596 360201 371001 384107 399555 417750 439162 463845 491640 522691 557310 595367
51372 595367 636063 678168 720194 760514 797675 830560 858071 878896 891916 896735 893585 882871
51360 882871 865091 840865 810688 775003 734996 693049 651682 612095 574188 537886 503788
51349 503788 472561 444468 419719 398659 381286 366997 355107 345215 336880 329425 322413 315939
51337 315939 310079 304412 298571 292996 288598 285680 283593 281528 279319 277396 276197 275791 275933 276324 276742
51322 276742 276942 276549 275321 273576 272142 271619 271757 271797 271405 271053 271400 272469 273604 274175 274193 274124 274202 274111 273426
51303 273426 272248 271179 270651 270504 270368 270233 270388 270881 271323 271301 270721 269671 268189 266389 264613 263179 262021
51286 262021 260879 259810 259193 259175 259439 259701 260142 261126 262777 265150 268507 272983 278037 282699 286374 289148
51270 289148 291347 293255 295206 297404 299437 300468 300163 299044 297707 296125 294122 292157 291042 290958 291184
51255 291184 290837 289585 287682 285623 283841 282528 281594 280763 279675 278016 275828 273744 272542 272310 272364 272157
51239 272157 271869 271815 271800 271528 271258 271369 271560 271148 270102 269076 268436 267962 267631 267919 269018 270345 271249 271721
51221 271721 271973 271753 270692 269195 268396 269162 271385 274300 277235 279969 282531 284854 286758 288254 289723
51206 289723 291571 293821 296286 299009 302098 305077 306895 306889 305498 303810 302659 302339 302889 304169 305751
51191 305751 307055 307670 307444 306428 304933 303552 302826 302872 303441 304230 304999 305510 305689 305842 306459 307684 309140
51174 309140 310302 310963 311264 311442 311599 311634 311296 310328 308647 306388 303832 301316 299174 297628 296683 296141 295787
51157 295787 295534 295362 295176 294846 294390 294000 293731 293251 292091 290167 287886 285705 283796 282259 281350 281233 281590
51140 281590 281755 281285 280248 279077 278315 278420 279537 281374 283421 285228 286455 286882 286683 286502 286908 287786
51124 287786 288600 289132 289601 290156 290836 292040 294430 298028 301910 305150 307814 310621 313871 317060 319432
51109 319432 320597 320717 320360 320179 320577 321613 323171 325039 326871 328426 329925 331837 334113 335999 336816
51094 336816 336615 335886 335002 334314 334310 335141 336176 336581 336254 335774 335557 335535 335606 335827 336133 336315 336398 336657 337133 337517
51074 337517 337667 337868 338424 339268 340203 341240 342459 343789 345180 346842 349016 351607 354343 357295 360946
51059 360946 365629 371113 377006 383378 390579 398316 405328 410395 413535 415825 418261 421399 425957 432764
51045 432764 441530 450409 457606 463146 468377 474006 479427 483842 487129 489482 491030 492094 493117 493836
51031 493836 493067 489690 483543 475065 464677 452992 441097 429927 419572 409771 400887 393707 388348
51018 388348 384076 380402 377803 377045 378189 380565 383536 386964 391054 395996 401729 407861 413818 419225
51004 419225 424206 429232 434686 440620 446917 453533 460434 467350 473809 479511 484571 489300 493952 498868
50990 498868 504675 511853 520057 528287 536018 543927 553159 564038 575762 587321 598342 609046 619642
50977 619642 629893 639050 646116 650372 651880 651459 650150 648769 648012 648719 651701 657229 664957 674514 686031
50962 686031 699902 716164 734506 754930 777962 803939 832321 862029 892306 922859 953371
50951 953371 983408 1012916 1042263 1071557 1100234 1127648 1153780 1179192 1204581 1230663 1258166
50940 1258166 1287496 1318480 1350655 1383569 1416422 1447674 1475625 1499479 1519382 1535360 1546729
50929 1546729 1552868 1554197 1551882 1546513 1537377 1523139 1503117 1477768 1447952 1413984 1375695 1333372
50917 1333372 1288235 1241797 1195044 1148531 1102959 1059129 1017474 978095 941288 907523 876829
50906 876829 848713 822882 799624 779235 761422 745509 730852 716811 702817 688956 676204
50895 676204 665477 656566 648407 640300 632400 625141 618811 613696 609968 607116 604075 600370 596765 594343
50881 594343 593226 592693 592349 592546 593603 595219 596934 598751 600988 603756 606989 610769 615233 620202 625339
50866 625339 630731 637024 644793 654004 664211 675073 686567 698986 712966 729259 748135 769142
50854 769142 791779 816268 843272 873000 905115 939573 977065 1018348 1063549 1112303 1164326
50843 1164326 1219591 1278204 1340186 1405018 1471261 1537162 1602002 1666413 1730953 1794874 1856772
50832 1856772 1915865 1971832 2023903 2071300 2114563 2155398 2195021 2233734 2272340 2312719 2356220
50821 2356220 2402445 2450597 2501294 2555904 2614369 2674685 2734264 2790686 2841215 2882682 2912317
50810 2912317 2928042 2927940 2910423 2875368 2824327 2759175 2681152 2591618 2492950 2387971 2278999
50799 2278999 2168198 2058416 1952741 1853230 1760687 1675553 1598359 1529327 1468241 1414888 1369103
50788 1369103 1330299 1297509 1270128 1248105 1231157 1218262 1208244 1200451 1194440 1189332 1184016 1177865
50776 1177865 1170863 1163111 1154588 1145385 1135727 1125620 1114698 1102566 1089088 1074240 1057907 1040078
50764 1040078 1021117 1001603 981782 961334 939917 917958 896729 877392 860038 843853 828270
50753 828270 813615 800483 788882 778477 769506 762885 759210 758103 758833 761270 765865 772913 782281
50740 782281 793800 807464 823135 840461 859360 880373 904290 931458 961629 994295 1028956
50729 1028956 1065101 1102201 1139819 1177680 1215617 1253505 1291153 1328114 1363677 1397219 1428603
50718 1428603 1458014 1485403 1510247 1531909 1550028 1564517 1575417 1583019 1588128 1592044 1596236 1601926
50706 1601926 1609854 1620370 1633885 1651204 1673182 1699889 1730319 1762999 1796671 1830167 1861851
50695 1861851 1889632 1911498 1925795 1931092 1926223 1910731 1885094 1850453 1808287 1760464 1709326 1657433
50683 1657433 1607095 1559934 1516639 1477062 1440884 1408392 1380562 1358341 1341976 1331075 1325075
50672 1325075 1323561 1326437 1334015 1346720 1364326 1385528 1408518 1431964 1455299 1478238 1500373 1521292
50660 1521292 1540749 1558561 1574517 1588634 1601438 1613868 1626777 1640460 1654649 1669030 1683761
50649 1683761 1699380 1716120 1733609 1751480 1770140 1790669 1814016 1840559 1870342 1903319 1939268
50638 1939268 1977820 2018707 2061651 2105876 2150076 2193143 2234674 2274460 2311684 2345005 2373400
50627 2373400 2396702 2415444 2430455 2442417 2451279 2455765 2453587 2442339 2420463 2387950 2346738 2300485
50615 2300485 2253517 2209608 2171550 2141297 2119767 2106328 2099134 2096410 2097259 2100998 2106099 2110149 2110615
50602 2110615 2105298 2092346 2070519 2039557 1999919 1952133 1896780 1835144 1769408 1701861 1634106
50591 1634106 1567176 1502080 1439836 1381063 1325952 1274748 1228044 1186414 1149869 1117890 1090070
50580 1090070 1066533 1047540 1032721 1021026 1011563 1004354 1000098 999361 1002109 1007740 1015161 1023029 1030465
50567 1030465 1037680 1045556 1054507 1064040 1073482 1082719 1092069 1101892 1112612 1124826 1139103 1155845 1175468
50554 1175468 1198305 1224084 1251933 1281275 1312388 1345686 1380821 1416932 1453334 1489366 1524072
50543 1524072 1556927 1588708 1620690 1653102 1685490 1718720 1755422 1797875 1846370 1900334 1960150
50532 1960150 2026826 2100453 2180160 2265498 2356972 2455157 2560039 2671281 2788384 2910333
50522 2910333 3035559 3162469 3289592 3415068 3536418 3651010 3756425 3850303 3930179 3993691
50512 3993691 4038771 4063769 4067936 4051885 4017142 3965011 3896289 3812276 3715662 3610151 3499612
50501 3499612 3387957 3279450 3178470 3088740 3012791 2951946 2906635 2876917 2862869 2864352 2880203
50490 2880203 2907807 2943452 2982762 3020656 3051519 3070123 3072500 3055907 3018547 2960017 2881895
50479 2881895 2787346 2680135 2564318 2444368 2324447 2207118 2093272 1983588 1879496 1782392
50469 1782392 1692490 1609052 1531535 1460023 1394762 1335796 1283003 1236111 1194621 1157989 1125854
50458 1125854 1097853 1073394 1051955 1033552 1018475 1006616 997458 990800 986928 985866 986947 989476
50446 989476 993443 999096 1006095 1013611 1021165 1028889 1036997 1045540 1054676 1064540 1074589 1083719 1091495 1098790
50432 1098790 1106659 1114902 1122495 1129289 1136504 1145392 1156103 1168216 1181776 1197273 1214934 1234600
50420 1234600 1256206 1279943 1306040 1334756 1366490 1401589 1440145 1482392 1529151 1581286 1638617
50409 1638617 1699897 1764072 1831024 1900736 1972185 2043555 2113298 2180406 2243830 2302228 2354406
50398 2354406 2399486 2436390 2463512 2479230 2482585 2473294 2451331 2416909 2370806 2314442 2249553 2178086
50386 2178086 2102499 2025898 1951489 1881799 1818501 1762846 1715984 1678695 1651011 1632352 1622078
50375 1622078 1619753 1624813 1635967 1650901 1666579 1680024 1689068 1692345 1688573 1676156 1653932 1622230
50363 1622230 1582691 1536945 1485946 1430852 1373861 1317450 1262956 1210552 1160462 1113490 1070237
50352 1070237 1030529 994006 960696 930558 902938 877115 853214 831967 813606 797467 782737
50341 782737 769217 757264 747272 739308 733006 727787 723457 720554 719781 721035 723361 725922 728608 731563
50327 731563 734694 737995 741945 746976 752712 758255 763251 768274 774005 780377 786681 792367 797551 802777
50313 802777 808307 813712 818318 822079 825800 830361 835972 842397 849591 857687 866591 876158 886644 898307
50299 898307 910427 921318 929628 935173 938322 939176 937896 935400 933028 931525 930767 930419 930455 931071 932520
50284 932520 935107 939056 944348 950890 958868 968707 980759 995294 1012639 1032696 1053973 1073333 1087077
50271 1087077 1092541 1088961 1077294 1059479 1037782 1014487 991722 970978 952502 935421 918917 903252
50259 903252 889358 877606 867500 858633 851338 846098 842740 840588 839232 838809 839630 841771 844947 848637
50245 848637 852452 856519 861308 866954 872901 878440 883373 887907 892048 895427 897697 898856 899138 898720 897549
50230 897549 895342 891795 886986 881571 876418 871971 868013 864130 860387 857495 856209 856589 857988 859888
50216 859888 862544 866656 872645 880573 890564 902721 916562 931044 945300 958966 971707 983098
50204 983098 993280 1003255 1014014 1025622 1037398 1048539 1058112 1064904 1067886 1066617 1060784 1049779 1033408
50191 1033408 1012729 989480 964764 938993 912900 887709 864246 842623 822974 805740 791018
50180 791018 778247 766786 756163 745522 733566 719561 703938 687577 670978 654482 638733
50169 638733 624372 611614 600477 590977 582763 575148 568034 562329 558795 556957 555856 555460 556451 558891
50155 558891 562055 565584 569832 574909 580219 585340 590619 596412 602302 607561 611999 615832 619032 621363
50141 621363 622873 623798 623948 622710 619895 616337 613388 611889 611768 612602 614375 617508 622192 627889 633606
50126 633606 638555 642480 645566 648366 651700 656235 661940 668144 674307 680621 687674 695679 704242 712887
50112 712887 721562 730518 739892 749625 759757 770546 782235 794887 808686 824227 842245 863030
50100 863030 886321 911753 939218 968891 1001175 1036588 1075277 1116443 1158585 1200478 1241669
50089 1241669 1282022 1321327 1359710 1397935 1436644 1475384 1512774 1547518 1578817 1605912 1627586
50078 1627586 1642177 1647934 1643620 1629228 1606042 1575721 1539414 1498060 1453166 1406657 1359987 1313897
50066 1313897 1268972 1225901 1185136 1146813 1111106 1078226 1048056 1020270 994899 972289 952409
50055 952409 934711 918721 904265 891051 878728 867612 858661 852276 847688 843929 840890 838905 837813
50042 837813 837112 836864 837803 840545 844960 850197 855071 858703 861120 863105 865199 867153 868544 869435 870014
50027 870014 870004 869048 867376 865443 863102 859722 855044 849354 842928 835847 828302 820486 812184 803018 793120
50012 793120 783075 773205 763427 753796 744557 735580 726398 717002 708044 700011 692760 686112 680365 675858
49998 675858 672526 670400 670137 672485 677364 683927 691462 699866 709305 719710 730704 741863 753019
49985 753019 764290 775681 786785 797160 807068 817436 828910 841216 853636 865771 877656 889492
49973 889492 901531 913910 926295 938015 948861 959441 970341 981320 991795 1001772 1011676 1021419
49961 1021419 1030233 1037271 1041638 1041885 1036335 1024272 1006319 983555 956951 927927 898602 870668
49949 870668 844458 819844 797708 779719 766622 757495 750872 745941 742393 739716 737206 734425 731159
49936 731159 727051 721747 715345 708274 700569 691629 680899 668545 655127 640784 625183 608410 591613
49923 591613 576420 563719 553195 544042 535885 528898 523239 518676 514774 511277 508226 505843 504397
49910 504397 504095 504964 506825 509430 512562 516041 519757 523760 528198 533119 538511 544621 551969 560723 570193
49895 570193 579338 587831 596284 605370 614968 624274 632371 638551 642432 644123 644107 642705 639785 635166 629039
49880 629039 621710 613150 603213 592154 580520 568630 556603 544836 533993 524395 515785 507758 500148
49867 500148 492998 486556 481320 477620 475122 473210 471948 472044 473657 475967 478412 481660 486629 492984 499484
49852 499484 505678 512396 520444 529554 538877 547999 557067 566201 575071 582972 589253 593860 597401 600428
49838 600428 602694 603439 602315 599569 595397 589710 582693 574990 567032 558770 550475 543221 537927 534232
49824 534232 530995 527806 525433 524787 526022 528670 532165 536081 540309 545202 551289 558676 566945 575639
49810 575639 584455 592958 600609 607405 614064 621130 628152 634150 638767 642462 645576 647640 647799 645643
49796 645643 641413 635571 628419 620162 611196 602157 593549 585296 576824 567716 558196 548821 539904 531543
49782 531543 524075 517949 512991 508328 503461 499036 495955 493881 491419 487963 484728 483435 484382 486355
49768 486355 488216 489941 492083 494936 498524 502920 508145 513993 520314 527237 534737 542135 548449 553223
49754 553223 556597 558706 559513 559312 558725 557881 555970 552093 546322 539539 532463 525239 517903 510734 504092
49739 504092 498250 493415 489593 486395 483328 480388 477990 476223 474605 472861 471583 471718 473551 476504
49725 476504 479780 482917 485847 488837 492322 496483 500981 505411 509946 515195 521499 528803 537206 547026
49711 547026 557993 568837 578106 585134 589891 592263 592073 589684 586005 581783 577267 572573 567952 563519
49697 563519 559166 554922 551064 547599 543933 539418 534092 528611 523569 519123 515216 511892 509386 508057
49683 508057 508165 509615 512041 515248 519418 524654 530649 537209 544907 554669 566632 579924 593663 607616
49669 607616 621538 634266 644039 649739 651663 651218 650057 649304 649230 649562 650190 651512 654015 657698 662025
49654 662025 666128 668732 668122 662820 652595 638633 622637 605963 589608 574558 561657 551094
49642 551094 542299 534558 527711 522105 517903 514708 512039 509967 508883 508676 508622 508216 507674 507295 506748 505481
49626 505481 503520 501300 498789 495421 490962 485927 481028 476604 472767 469656 467287 465392 463651 461975
49612 461975 460485 459359 458735 458513 458336 458063 458202 459455 461764 464251 466183 467574 468801 470148 471870
49597 471870 474068 476199 477277 477033 476375 476315 476898 477649 478473 479490 480496 481418 482936 485748 489320 492275
49581 492275 494114 495721 498030 500907 503627 505806 507556 509218 511255 514043 517490 521211 525190 529875
49567 529875 535442 541424 547341 553242 559389 565823 572550 579744 587374 594892 601625 607176 611213 613269
49553 613269 613236 611758 609670 607183 604043 600369 596901 594410 593191 593100 593800 595002 596678 598958 601665
49538 601665 604131 605817 606860 607700 608358 608658 609079 610710 614117 618720 623616 628691 634632 642125 651404
49523 651404 662399 674884 688437 702571 716964 731326 744976 756830 766095 772923 778249 783040
49511 783040 787827 792811 798120 803817 809854 816185 822829 829691 836359 842166 846335 847987 846220 840546
49497 840546 831299 819501 806261 792348 778151 763813 749434 735342 722188 710611 700889 693052
49485 693052 687140 682963 679755 676596 673305 670512 668706 667592 666602 665619 664822 664163 663397 662495 661624 660791
49469 660791 659804 658549 657122 655674 654334 653224 652467 652208 652665 653996 655966 657923 659303 660065 660532 660928
49453 660928 661156 660894 659788 657763 655236 652795 650507 647802 644196 639864 635343 630994 627053 623809 621258
49438 621258 618816 615916 612797 610244 608563 607343 606268 605659 605966 607101 608680 610840 614444 620278 628104
49423 628104 636723 645174 653755 663640 675545 689158 703840 719220 734708 748856 759756 765983
49411 765983 767019 763269 756243 748353 741828 737691 736068 737098 741008 747586 756354 767183 780069 794367
49397 794367 809076 823918 839373 855453 871189 885604 898502 909939 919643 927487 933956 939510
49385 939510 943789 945984 945747 943354 939312 934251 928903 923626 918079 911853 905244 898958 893199 887596
49371 887596 882061 877254 874017 872661 872893 874134 875760 877270 878505 879624 880708 881333 880700 878337 874669
49356 874669 870698 867048 863505 859624 855441 851298 847251 843190 839431 836576 834736 833528 832937 833522 835451
49341 835451 837973 840335 842708 845642 848941 851712 853336 853888 853749 853262 852665 851950 850854 849232 847263
49326 847263 845020 842265 839140 836630 835589 835541 835186 834026 832717 831771 830810 829368 827711 826418 825723 825694
49310 825694 826529 828130 829696 830336 829978 829285 828857 828850 829213 829865 830584 831066 831161 830960 830733 830942 832100 834351
49292 834351 837267 840352 843686 847795 852944 858874 865220 871884 878959 886597 895009 904232 913778 922844
49278 922844 931098 938969 946958 954993 962821 970636 978806 987126 995020 1002496 1010243 1018508 1026455 1033021
49264 1033021 1037996 1041846 1044815 1046702 1047240 1046089 1042643 1036464 1028038 1018626 1009406 1001203 995019 992123
49250 992123 993310 998488 1007197 1018980 1032900 1047141 1059623 1068872 1074050 1074564 1070200 1061520 1049661
49237 1049661 1035688 1020378 1004512 988939 974265 960684 948139 936542 925870 916221 907808 900829
49225 900829 895431 891808 890132 890245 891621 893812 896804 900842 906075 912427 919503 926428 932081 935837
49211 935837 937992 939290 940276 941183 942105 942948 943569 944324 946130 949578 954245 959364 964920 971589 979788 989373
49195 989373 1000098 1011778 1023942 1035936 1047475 1058699 1069669 1080221 1090346 1100244 1109909 1119031
49183 1119031 1127390 1135067 1142360 1149899 1158665 1169336 1181606 1194707 1208594 1223954 1241097 1259669
49171 1259669 1279764 1302480 1328786 1358289 1389591 1421337 1452231 1480304 1502917 1517700 1523412
49160 1523412 1520235 1509738 1494561 1477696 1461693 1448212 1437911 1430641 1426033 1424108 1425045 1428258 1432123
49147 1432123 1434939 1436072 1436067 1435971 1436735 1438845 1442144 1446120 1450613 1455996 1462510 1469808 1477490 1485738 1495052
49132 1495052 1505640 1517504 1530874 1546027 1562714 1580198 1597907 1615727 1633684 1651632 1669347
49121 1669347 1686779 1704205 1722170 1741029 1760416 1779382 1797336 1814635 1832084 1850234 1869636
49110 1869636 1891424 1916966 1946905 1981078 2019567 2063463 2114413 2173526 2240496 2313185 2387854
49099 2387854 2460388 2528170 2591164 2650864 2707470 2757362 2793270 2807776 2797764 2766180 2719693
49088 2719693 2664562 2604135 2539137 2469411 2395575 2319805 2245470 2175864 2113093 2058001 2010690
49077 2010690 1970761 1937383 1909753 1887541 1870523 1857857 1848140 1840169 1833310 1827202 1821624 1816714
49065 1816714 1812805 1809898 1807663 1806009 1805157 1805044 1805218 1805578 1806709 1809031 1812072 1815054 1817915 1821223 1825256
49050 1825256 1829799 1834818 1840748 1847860 1855709 1863479 1870703 1877393 1883648 1889435 1894764 1899857 1905043 1910569
49036 1910569 1916632 1923434 1931042 1939215 1947592 1956155 1965380 1975806 1987483 1999848 2011989 2022889 2031635
49023 2031635 2037710 2041197 2042601 2042415 2040923 2038396 2035391 2032755 2031313 2031426 2032855 2035142 2038175 2042290
49009 2042290 2047871 2054999 2063524 2073167 2083465 2093941 2104537 2115552 2126868 2137604 2146983 2155308
48997 2155308 2163503 2171775 2179264 2185166 2189688 2193616 2197247 2200006 2201018 2199929 2197250 2193976 2190797 2187682
48983 2187682 2184330 2180821 2177571 2174804 2172515 2170979 2170871 2172657 2176078 2180351 2184694 2188654 2192277 2196079
48969 2196079 2200608 2205823 2211036 2215545 2219170 2222128 2224652 2226878 2228924 2230889 2232863 2234983 2237375 2240013
48955 2240013 2242799 2245875 2249769 2255199 2262695 2272290 2283529 2295966 2309827 2325927 2344766 2366033
48943 2366033 2389273 2414600 2442183 2471491 2501856 2533647 2567935 2604925 2643660 2683478 2724774
48932 2724774 2767884 2812130 2856802 2902468 2950403 3000979 3053319 3106310 3159356 3212274 3265114
48921 3265114 3318116 3371399 3424692 3477633 3530159 3582249 3633464 3683165 3731057 3777028 3820578
48910 3820578 3860873 3897543 3931166 3962934 3993873 4024119 4052691 4078266 4100514 4120461 4139346
48899 4139346 4157476 4174564 4190572 4205478 4218638 4229303 4237730 4244828 4250576 4253699 4253265 4249828 4244476
48886 4244476 4237376 4227904 4215801 4201471 4185226 4166806 4145756 4121861 4095061 4065223 4032213 3996115
48874 3996115 3957192 3915628 3871480 3824987 3776712 3727142 3676186 3623446 3569084 3514061 3459316
48863 3459316 3405094 3351419 3298822 3248062 3199397 3152745 3108554 3067848 3031261 2998435 2968542
48852 2968542 2941073 2916033 2893720 2874430 2858109 2844189 2832078 2821819 2813961 2808746 2805818 2804823
48840 2804823 2805899 2809434 2815703 2824898 2837141 2852201 2869441 2888215 2908154 2928958 2950195 2971467
48828 2971467 2992610 3013669 3034841 3056404 3078448 3100679 3122798 3144946 3167340 3189576 3210931
48817 3210931 3231451 3252067 3273384 3294978 3316169 3336923 3357575 3378266 3399106 3420443 3442351
48806 3442351 3464240 3485463 3506091 3526587 3547092 3567592 3588432 3609934 3631681 3652972 3673967
48795 3673967 3695698 3718819 3742864 3766930 3790552 3813711 3836333 3858072 3878371 3896653 3912588
48784 3912588 3926240 3937768 3947011 3953603 3957306 3957869 3954584 3946442 3932817 3913699 3889265 3859592 3824939
48771 3824939 3786006 3743749 3699142 3653030 3605840 3557372 3507227 3455650 3403635 3352090 3301248
48760 3301248 3251083 3201918 3154324 3108639 3064923 3023226 2983624 2946120 2910768 2877878 2847877
48749 2847877 2820962 2797070 2776142 2758290 2743674 2732286 2723827 2717757 2713508 2710755 2709384 2709220 2709903
48736 2709903 2711155 2713098 2716150 2720549 2725992 2731743 2737152 2742099 2746900 2751720 2756187 2759731 2762204 2763906
48722 2763906 2765009 2765261 2764454 2762988 2761748 2761447 2762285 2764147 2766959 2770726 2775306 2780295 2785224 2789831 2794065
48707 2794065 2797904 2801410 2804990 2809296 2814527 2820004 2824725 2828293 2830995 2833113 2834589 2835505 2836431 2838045
48693 2838045 2840580 2843852 2847692 2852200 2857637 2864108 2871194 2877927 2883386 2887400 2890439 2892830 2894448 2895221
48679 2895221 2895362 2894823 2893029 2889661 2885343 2880957 2876404 2870596 2862626 2852402 2840139 2825779 2809129
48666 2809129 2790191 2769115 2746096 2721440 2695485 2668330 2639885 2610349 2580387 2550679 2521493
48655 2521493 2492755 2464243 2435532 2406064 2375593 2344462 2313287 2282544 2252645 2224161 2197586
48644 2197586 2172945 2149876 2128043 2107270 2087429 2068471 2050489 2033361 2016375 1998555 1979477
48633 1979477 1959494 1939095 1918403 1897443 1876477 1855745 1835155 1814698 1795005 1776988 1760743
48622 1760743 1745181 1729026 1712015 1694904 1678472 1662897 1648148 1634585 1622829 1613073 1604896 1597887
48610 1597887 1592281 1588755 1587653 1588599 1590885 1594096 1598295 1603658 1609982 1616480 1622128 1626355 1629381 1631783
48596 1631783 1633823 1635439 1636859 1638828 1641992 1646247 1650793 1654660 1657008 1657264 1655334 1651511 1645926 1638276
$$ [...]
##END NTUPLES=NMR SPECTRUM
##END=
