
##TITLE=UV1206_M3_1292-1211_7185466_C9TVL7FzHI
##JCAMPDX= 6.0         $$ Bruker NMR JCAMP-DX V2.0
##DATA TYPE= NMR SPECTRUM
##DATA CLASS= NTUPLES
##ORIGIN= BRUKER
##OWNER= Administrator
$$ 1.72 TOPSPIN		Version 2.1
$$ 2012-12-05 23:55:38.158 -0500  Administrator@X
$$ Compression mode = diff/dup
##.OBSERVE FREQUENCY= 400.02188249412
##.OBSERVE NUCLEUS= ^1H
##.ACQUISITION MODE= SIMULTANEOUS (DQD)
##.ACQUISITION SCHEME= undefined
##.AVERAGES= 8
##.DIGITISER RES= 22
##SPECTROMETER/DATA SYSTEM= spect
##.PULSE SEQUENCE= zg30
##.SOLVENT NAME= COFFEE_meoh
##.SHIFT REFERENCE= INTERNAL, COFFEE_meoh, 1, 14.98509
##AUDIT TRAIL= $$ (NUMBER, WHEN, WHO, WHERE, PROCESS, VERSION, WHAT)
$$ ##TITLE= Audit trail, TOPSPIN		Version 2.1
$$ ##JCAMPDX= 5.01
$$ ##ORIGIN= Bruker BioSpin GmbH
$$ ##OWNER= Administrator
$$ $$ E:\/data/COFFEE/nmr/UV1206_M3_1292-1211_7185466_C9TVL7FzHI/10/pdata/1/auditp.txt
$$ ##AUDIT TRAIL=  $$ (NUMBER, WHEN, WHO, WHERE, PROCESS, VERSION, WHAT)
(   1,<2012-12-05 23:55:29.892 -0500>,<Administrator>,<X>,<go>,<TOPSPIN 2.1>,
      <created by zg
	started at 2012-12-05 23:54:23.423 -0500,
	POWCHK enabled, PULCHK disabled,
       configuration hash MD5:
       86 BA 57 50 F2 9D 5C 9B 26 00 A9 28 5F 66 2E 89
       data hash MD5: 64K
       1A 4A AF B8 8E A2 1B 90 9D 9D E9 33 1F 3A 39 FF>)
(   2,<2012-12-05 23:55:33.001 -0500>,<Administrator>,<X>,<proc1d>,<TOPSPIN 2.1>,
      <Start of raw data processing
       efp LB = 0 FT_mod = 6 PKNL = 1 PHC0 = 0 PHC1 = 0 SI = 32K 
       data hash MD5: 32K
       29 BC 68 8E CF 46 78 52 53 77 B5 5A 16 73 AF 53>)
(   3,<2012-12-05 23:55:33.486 -0500>,<Administrator>,<X>,<proc1d>,<TOPSPIN 2.1>,
      <pk PHC0 = 98.48145 PHC1 = 0 
       data hash MD5: 32K
       F8 A2 69 37 AA 60 B4 1F FA 4C 03 8C D8 72 3B 89>)
(   4,<2012-12-05 23:55:33.720 -0500>,<Administrator>,<X>,<proc1d>,<TOPSPIN 2.1>,
      <abs ABSG = 1 
       data hash MD5: 32K
       23 6A 93 26 BE D6 01 9D 5B 75 54 E3 B9 B5 7F EC>)
(   5,<2012-12-05 23:55:33.876 -0500>,<Administrator>,<X>,<proc1d>,<TOPSPIN 2.1>,
      <abs ABSG = 2 
       data hash MD5: 32K
       D4 3E 92 95 AD 6D 33 1D A0 50 B5 D1 9B 97 1E 8F>)
(   6,<2012-12-05 23:55:34.017 -0500>,<Administrator>,<X>,<proc1d>,<TOPSPIN 2.1>,
      <abs ABSG = 3 
       data hash MD5: 32K
       5F 4E 3E 3C 24 81 8D 70 9C AD 3D 50 07 3B 39 91>)
(   7,<2012-12-05 23:55:34.173 -0500>,<Administrator>,<X>,<proc1d>,<TOPSPIN 2.1>,
      <abs ABSG = 4 
       data hash MD5: 32K
       2D C9 02 69 4B C9 16 23 F4 5B DC EE DB 99 EE 02>)
(   8,<2012-12-05 23:55:34.329 -0500>,<Administrator>,<X>,<proc1d>,<TOPSPIN 2.1>,
      <abs ABSG = 5 
       data hash MD5: 32K
       D4 CF 97 94 15 3E 3E 43 B1 4F BD F2 AD 3D 60 12>)
$$ ##END=
$$ 
$$ $$ hash MD5
$$ $$ 9C 48 DA BA B9 09 94 19 B9 C2 06 6D F2 F5 2E C1
##$RELAX= 
##$RELAX= 
##$RELAX= 
##$RELAX= 
##$RELAX= 
##$RELAX= 
##$RELAX= 
$$ Bruker specific parameters
$$ --------------------------
##$DU= <E:\>
##$EXPNO= 10
$$ [...]
150 150 150 150 150 150 150 150
##$TP07= 0
##$TPNAME0= <>
##$TPNAME1= <>
##$TPNAME2= <>
##$TPNAME3= <>
##$TPNAME4= <>
##$TPNAME5= <>
##$TPNAME6= <>
##$TPNAME7= <>
##$TPOAL= (0..7)
0.5 0.5 0.5 0.5 0.5 0.5 0.5 0.5
##$TPOFFS= (0..7)
0 0 0 0 0 0 0 0
##$TUNHIN= 0
##$TUNHOUT= 0
##$TUNXOUT= 0
##$USERA1= <user>
##$USERA2= <user>
##$USERA3= <user>
##$USERA4= <user>
##$USERA5= <user>
##$V9= 5
##$VALIST= <valist>
##$VCLIST= <CCCCCCCCCCCCCCC>
##$VD= 0
##$VDLIST= <DDDDDDDDDDDDDDD>
##$VPLIST= <PPPPPPPPPPPPPPP>
##$VTLIST= <TTTTTTTTTTTTTTT>
##$WBST= 1024
##$WBSW= 4
##$XGAIN= (0..3)
0 0 0 0
##$XL= 0
##$YL= 0
##$YMAX_a= 629244
##$YMIN_a= -538182
##$ZGOPTNS= <>
##$ZL1= 120
##$ZL2= 120
##$ZL3= 120
##$ZL4= 120
##$ABSF1= 14.98509
##$ABSF2= -5.573092
##$ABSG= 5
##$ABSL= 3
##$ALPHA= 0
##$AQORDER= 0
##$ASSFAC= 0
##$ASSFACI= 0
##$ASSFACX= 0
##$ASSWID= 0
##$AUNMP= <proc_prof1d_extract_pilot.lims>
##$AXLEFT= 0
##$AXNAME= <>
##$AXNUC= <1H>
##$AXRIGHT= 0
##$AXTYPE= 0
##$AXUNIT= <>
##$AZFE= 0.1
##$AZFW= 0.1
##$BCFW= 0
##$BC_mod= 0
##$BYTORDP= 0
##$COROFFS= 0
##$CY= 15
##$DATMOD= 1
##$DC= 0
##$DFILT= <>
##$DTYPP= 0
##$F1P= 0
##$F2P= 0
##$FCOR= 0.5
##$FTSIZE= 32768
##$FT_mod= 6
##$GAMMA= 0
##$GB= 0
##$INTBC= 1
##$INTSCL= 1
##$ISEN= 128
##$LB= 0
##$LEV0= 0
##$LPBIN= 0
##$MAXI= 10000
##$MC2= 0
##$MEAN= 0
##$ME_mod= 0
##$MI= 0
##$NCOEF= 0
##$NC_proc= -8
##$NLEV= 6
##$NOISF1= 0
##$NOISF2= 0
##$NSP= 0
##$NTH_PI= 0
##$NZP= 0
##$OFFSET= 14.98509
##$PC= 1
##$PHC0= 98.48145
##$PHC1= 0
##$PH_mod= 1
##$PKNL= yes
##$PPARMOD= 0
##$PPDIAG= 0
##$PPIPTYP= 0
##$PPMPNUM= 2147483647
##$PPRESOL= 1
##$PSCAL= 4
##$PSIGN= 0
##$PYNMP= <proc.py>
##$REVERSE= no
##$SF= 400.02
##$SI= 32768
##$SIGF1= 0
##$SIGF2= 0
##$SINO= 400
##$SIOLD= 32768
##$SPECTYP= <>
##$SREGLST= <1H.CDCl3>
##$SSB= 0
##$STSI= 32768
##$STSR= 0
##$SW_p= 8223.68421052631
##$SYMM= 0
##$S_DEV= 0
##$TDeff= 65536
##$TDoff= 0
##$TI= <>
##$TILT= no
##$TM1= 0
##$TM2= 0
##$TOPLEV= 0
##$USERP1= <user>
##$USERP2= <user>
##$USERP3= <user>
##$USERP4= <user>
##$USERP5= <user>
##$WDW= 1
##$XDIM= 32768
##$YMAX_p= 464005525
##$YMIN_p= -852154
##$CURPLOT= <Network HP LaserJet P1505>
##$CURPRIN= <$Network HP LaserJet P1505>
##$DFORMAT= <normdp>
##$LAYOUT= <+/1D_H.xwp>
##$LFORMAT= <normlp>
##$PFORMAT= <normpl>
##$SURQMSG= 1
$$ End of Bruker specific parameters
$$ ---------------------------------
##NTUPLES= NMR SPECTRUM
##VAR_NAME=  FREQUENCY,     SPECTRUM/REAL,   SPECTRUM/IMAG
##SYMBOL=    X,             R,               I
##VAR_TYPE=  INDEPENDENT,   DEPENDENT,       DEPENDENT
##VAR_FORM=  AFFN,          ASDF,            ASDF
##VAR_DIM=   32768,         32768,           32768
##UNITS=     HZ,            ARBITRARY UNITS, ARBITRARY UNITS
##FACTOR=    0.250966925370066, 1,           1
##FIRST=     8223.43324360094, -192140,      174122
##LAST=      0,             141676,          -178821
##MIN=       0,             -852154,         0
##MAX=       8223.43324360094, 464005525,    0
$$ Real data points
##PAGE= N=1
##DATA TABLE= (X++(R..R)), XYDATA
$$ [...]
19538f966H1483i3858B15296c6005k31663h0309k94259a07885j41449I6773j2304
19527H4469A0646b67088A80680b44961D56558A1806a7445j60739f9133m7775B80673
19515f0904C76873c351o9000B0931a58522N2936A08969J2228c2509I3332C7388
19503f8375Q500j00019j31739r1268A53552c5185r8764A65940a70359J3852a0257
19491f19H2570b10878J89M9315N9355k7674j15835C44549H7191i2941q880J7500
19479h4321D3511a20744b2050r9321A90344c74274A12959a89354j70710M4394
19469c15670A391a22454B62636A12888a08907m5843L4526M8969r1116A69836k1085
19458A48751G488c02820N3830J06842c5844j99104f7736K7468D01381I3663a42633
$$ y = [-6966, 81483, -93858, 215296, -36005, -267668, -80309, -374568, -107885, -249334, 96773, 84469, 10646, -267088, 180680, -244961, 456558, 11806, -17445, -178184, -69133, -116908, 280673, -60904, 376873, -3351, -72351, 20931, -158522, -105586, 108969, 121197, -32509, 93332, 37388, -68375, -59875, -159894, -291633, -382901, 153552, -35185, -133949, 165940, -170359, -156507, -10257, -619, 82570, -210878, -210689, -161374, -102019, -129693, -245528, 344549, 87191, -92941, -101821, -84321, 43511, -120744, -22050, -121371, 190344, -374274, 112959, -189354, -360064, -315670, 1391, -122454, 262636, 112888, -108907, -154750, -120224, -71255, -162371, 169836, 148751, 7488, -302820, -248990, -142148, -35844, -234948, -67736, -40268, 401381, 93663, -142633]
19446d8419C49631c3742j40106A62035L939d43304b6670l9832B51684g6637A60535
19434b97229J48117L7625k38929f7372j45652f5137H8306a49854b7297n3534r3456
19423a74287O4644n3416A30320f3397L0844J1075j09013c7461b813n9826B4033
19411b40148F8364q131b81614B35113e8158B33089k4546a72675j6862I4911b6577
19399h6638k39837C54572d2962j4547n830G0974L0999a65516b8583A47622c9172
19387a34527E5198a9514c200k38855A70069h8578r4130B64529i0416k24584k7963
19376c42963g3950B1787a46873b8387I1988K95958d80914J60452A62440a54856
19365c00542A24226a16792B47650d807q4444o8779l42968A49634a67735K8656
$$ y = [-48419, 349631, -33742, -173848, 162035, 165974, -443304, -26670, -66502, 251684, -76637, 160535, -297229, -149112, -111487, -350416, -67372, -213024, -65137, 88306, -149854, -27297, -80831, -174287, -109643, -163059, 130320, -63397, -32553, -21478, -130491, -37461, -2813, -62639, 24033, -240148, 68364, 60233, -281614, 235113, -58158, 233089, 208543, -172675, -189537, 94911, -26577, -86638, -326475, 354572, -42962, -57509, -63339, 70974, 101973, -165516, -28583, 147622, -39172, -134527, 55198, -19514, -3200, -242055, 170069, -88578, -182708, 264529, -90416, -315000, -342963, -73950, 21787, -146873, -28387, 91988, 387946, -480914, -320462, 162440, -154856, -300542, 124226, -116792, 247650, -4807, -89251, -158030, -500998, 149634, -167735, -139079]
19355a39079C2727b12484m7678A50148c67476a20010o3618q0628F7253g0493C68112
19343a47887B0015a40612e6540A43383M7904E2620c79248C8479a71277A4491f0426
19331h8136m5410L885j59994M2134B82179F88J24738J41623d9858A04248a93913
19319A11726l7491Q9948B905J27629L20557D3065d713B40853d1116k51728d6091
19307F6154R2249K027a57008B5153Q4656C0695L2929h4333l46047J36069L3789
19296b60522e8855A54822a83542j62867A44417b13892K1234p6678h054E8281f9571
19284i9897B10939a26035b007B06209j3656a49530A34930f6678D9424c9164k20877
19273b60041d32m6727A6006R6827i3814A7039J2124J78556H2446d95184B9915
$$ y = [-139079, 32727, -212484, -260162, 150148, -367476, -120010, -183628, -264256, 67253, -70493, 368112, -147887, 20015, -140612, -56540, 143383, 191287, 52620, -379248, 38479, -171277, 14491, -60426, -88136, -133546, -129661, -289655, -247521, 282179, 688, 125426, 267049, -49858, 104248, -193913, 111726, 74235, 164183, 2905, 130534, 451091, 43065, -4713, 240853, -41116, -292844, -46091, 66154, 158403, 160430, -157008, 25153, 109809, 30695, 63624, -84333, -430380, -294311, -260522, -58855, 154822, -183542, -346409, 144417, -213892, -192658, -269336, -8054, 58281, -69571, -99897, 210939, -126035, -2007, 206209, 192553, -149530, 134930, -66678, 49424, -39164, -260041, -432, -47159, 16006, 112833, -93814, 17039, 29163, 207719, 82446, -495184, 29915]
19261f599A5991Q8967a13647A81109b99301d9117j95899e8575B65005k1027a17245
19249A26525a06277B9838a99250b8005B36544e48117a2346n8930j22581b9421
19238D4916J5391d80039P2601J03266a42877L5010J14I4318J985a06702k0711
19227a27413l6637q5421H9575O4476m9258a1044F2724b604D6688a06063b0418
19215D5284K00384g7007K1730j2969A2752a94173I147a05310A6947K83109b77346
19203A1586a91690C31357A11840J35051a2400A12983j1507b81680A12376b05436
19192a34771n0860Q4346A31705b03140H4409h3317B55499O0599b66558I4208a34201
19180a32160k81324H6162c85578a83717j15306B78609A4776a6474p9785C9463
$$ y = [-6599, 15991, 104958, -113647, 181109, -299301, -49117, -245016, -58575, 265005, 243978, -117245, 126525, -106277, 29838, -199250, -28005, 236544, -548117, -12346, -71276, -193857, -29421, 44916, 60307, -480039, -407438, -304172, -142877, -107867, -107753, 94318, 96303, -106702, -127413, -164050, -249471, 89575, 154051, 104793, -11044, 62724, -2604, 46688, -106063, -20418, 45284, 245668, -77007, -55277, -68246, 12752, -194173, 9147, -105310, 16947, 300056, -277346, 11586, -191690, 331357, 111840, 246891, -12400, 112983, 101476, -281680, 112376, -205436, -134771, -185631, -101285, 131705, -203140, 84409, -83317, 255499, 316098, -266558, 94208, -134201, -132160, -413484, 86162, -385578, -183717, -299023, 278609, 14776, -16474, -96259, 39463]
19169D9699a38099n2604N3430j06939G9752J01445J02473b38997n8277J40575
19159a56699D1350f1438J898k5669b0842k16466r7584A66916a6214B01136a91397
19147b20870H2053j9376c17367B03644i5860E3044b5866k01675N6474k36817h1608
19135b8390k06224g3274j04172e1648o7409l09319a71492f0860m3355j47928B23766
19123a85581I4740b45617Q6804d8025k94073D1125b03665E1972h8529n3997p7292
19112b19818p4991I7493a05893A76041k8846e7482l22717h5884C44494C1646g3154
19100c12702F6359J80422c55284G0707J49314a62616D4422a18333M2721j23505
19090a99117R7562j45035i8188L5185N785A95776a10583B39923o8634i2781d5186
$$ y = [49699, -138099, -190703, -137273, -244212, 79752, 181197, 283670, -238997, -297274, -156699, 41350, -61438, -59540, -85209, -20842, -237308, -334892, 166916, -16214, 201136, -191397, -220870, 82053, 62677, -317367, 203644, -95860, 53044, -25866, -227541, -171067, -407884, -81608, -28390, -234614, -73274, -177446, -51648, -119057, -428376, -171492, -60860, -104215, -252143, 223766, -185581, 94740, -245617, -158813, -48025, -342098, 41125, -203665, 51972, -88529, -142526, -219818, -294809, 97493, -105893, 176041, 147195, -57482, -380199, -85884, 344494, 31646, -73154, -312702, 66359, 246781, -355284, 70707, 220021, -162616, 44422, -118333, -75612, -199117, -101555, -246590, -98188, -63003, -57218, 195776, -110583, 239923, 171289, -92781, -45186]
19078a57757j15089D099b45941A33297O7219a47485A35973C9854a43942e8220
19067i0110B08315c86807D7490b27376G5867f650l70243c1059B19470D3413J61849
19056B05262h6218o3128l9045b4705A50380G3592f9408k71702A42031A8269J72903
19045A91172b09721c8711J8933j88379F7323a52072A75802l7138a72954r8263
19035b71217c3943C35669a95465D8092J22882a94509N7692j58797A14277E4783
19024g3713j79174a19077d9068k0983B592a86852A68074C9166f5195C28829a27714
19012C59455E3930P2677a58995F7156k6620H998N2091a71364E9345M0964b02661
19000e9143A440a2780B80748D353K00534h7703b4022A7083J78757g6225k24968
$$ y = [-157757, -272846, 4099, -245941, 133297, 200516, -147485, 135973, 39854, -143942, -58220, -90110, 208315, -386807, 47490, -227376, 75867, -6650, -376893, -31059, 219470, 43413, 205262, -86218, -149346, -188391, -24705, 150380, 73592, -69408, -341110, 142031, 18269, 191172, -209721, -38711, -19778, -208157, 67323, -152072, 175802, 138664, -172954, -271217, -33943, 335669, -195465, 48092, 170974, -194509, -136817, -295614, 114277, 54783, -73713, -252887, -119077, -49068, -70051, 2592, -186852, 168074, 39166, -65195, 328829, -127714, 359455, 53930, 126607, -158995, 67156, 40536, 8998, 61089, -171364, 59345, 100309, -202661, -59143, 1440, -12780, 280748, 4353, 204887, -87703, -24022, 17083, 195840, -76225, -301193]
18989c01193A27773a47903j07290B04159f1350m70198a37569B5444N3405b08316
18978b28395P4845N6724k24260A59220g3668j80235b5793D55791C9038d835j46047
18967a50882N4929B07485e7485A15665L31979c73844B00688p5734e8612A57959
18956h28k81824E5086b56090A6568R3354c55354j12403O0081c9818k92350a00086
18944B62284j29627e8543b1521A84328e8812k25209i9438L3476j95277e8561j92746
18933b51307i2070j1344G8880Q6919a798j33466b2385r7501m202j45133B2941
18921A60867d8258G4081j5790n988N7762a53577F9581b61007b8549j29063j30826
18910b88438a12829B8417a17867d9761C44785b31918a7060k59181b2010n6620
$$ y = [-301193, 127773, -147903, -255193, 204159, -61350, -531548, -137569, 25444, 78849, -208316, -228395, -153550, -96826, -321086, 159220, -73668, -253903, -25793, 455791, 39038, -4835, -150882, -95953, 207485, -57485, 115665, 447644, -373844, 200688, 124954, -58612, 157959, -828, -282652, 55086, -256090, 16568, 109922, -355354, -467757, -407676, -39818, -332168, -100086, 262284, 132657, -58543, -21521, 184328, -58812, -284021, -99438, -65962, -261239, -58561, -251307, -92070, -103414, 78880, 165799, -1798, -135264, -22385, -119886, -124088, -269221, 22941, 160867, -48258, 74081, 58291, 52303, 110065, -153577, 69581, -261007, -28549, -157612, -288438, -112829, 28417, -117867, -49761, 344785, -231918, -17060, -276241, -22010, -78630]
18900g8630o0141B54921E3375j5966c05416J10262B75723b26426B06164d1139
18889H9643L1525h708j22381A90918d45224C88600c62344B4564M91505A11683
18878a95918P5608B24938e27703g780l3689j976j10002j96031P5906D6326J0252
18867E6578i9527l22352A60536a66061d284k07008C8018a23601j79340I4004b30515
18855C0695a95966B89813A26535J2681a23501d9240F5197c9756H9802a90883E1356
18843I0334C5886A1513a63674A30268b87644A10749c64184a14455G3932b8101
18832b78972c2414A31811h690B54470F7980b30940O5587C53216b75949i1177o113
18821i7290D7988J44332a38455B57131d5597r8018f926l3748q0682K5985B38502
$$ y = [-78630, -138771, 254921, 53375, 37409, -305416, -195154, 275723, -226426, 206164, -41139, 89643, 121168, -8708, -131089, 190918, -445224, 388600, -362344, 24564, 516069, 111683, -195918, -120310, 224938, -527703, -7780, -41469, -43445, -153447, -349478, -273572, 46326, 56578, -99527, -421879, 160536, -166061, -4284, -211292, 38018, -123601, -302941, 94004, -230515, 30695, -195966, 289813, 126535, 139216, -123501, -49240, 65197, -39756, 89802, -190883, 51356, 90334, 35886, 11513, -163674, 130268, -287644, 110749, -364184, -114455, 73932, -28101, -278972, -32414, 131811, -8690, 254470, 67980, -230940, -165353, 353216, -275949, -91177, -97290, 47988, 192320, -138455, 257131, -45597, -143615, -6926, -40674, -121356, -95371, 238502]
18809A65982e920k45802R1387n0086A15114b0751k62517A0245g8657c1891I3672
18797a75503F7436c29370E1321K06908J06995b41476J14723M6701A8740a16106
18786c32473d8890a6824l3315A52488b5468D2993c60621B5967P1278d05819a63229
18774g1282i236k91174a39286L7647D5126b74387D7935f2200k7483p2721P435
18763a54969p2629m4024a04593M5975A67545B4113f9528q5945c2637j5327K895
18752d5069G6736g6807m2791A54354e5676F7022a177r431A96455b25622N2560
18741a73062M1276k6363m4304D5102K50975A05911a102H2597b3280k13098m0406
18730b76784R381i7292d0003C0183a97184A12846b66991m3238E6416a73787G0052
$$ y = [165982, -5920, -251722, -160335, -210421, 115114, -20751, -283268, 10245, -78657, -31891, 93672, -175503, 67436, -329370, 51321, 258229, 365224, -241476, -126753, -80052, 18740, -116106, -332473, -48890, -16824, -50139, 152488, -25468, 42993, -360621, 25967, 97245, -405819, -163229, -71282, -9236, -300410, -139286, -101639, 45126, -274387, 47935, -62200, -89683, -162404, -154969, -227598, -271622, -104593, -58618, 167545, 24113, -69528, -155473, -32637, -47964, -45069, 76736, -76807, -119598, 154354, -55676, 67022, -1177, -10608, 196455, -225622, -173062, -131786, -158149, -202453, 45102, 296077, 105911, -1102, 82597, -23280, -236378, -276784, -267403, -97292, -40003, 30183, -197184, 112846, -266991, -310229, 56416, -173787, 70052]
18718b34593a14221r0150C12845j3341E7842a02153D4266O2319a57297B0856m225
18707A6631J48685i2944k63126J55352j693A0223h1587b002A19034b4496j55427
18696a79923n0596A07619c0519E793b30854A80067b26945j24679K1854C05431
18685b36242B2894b23787B65055D0289L3040c11793F3366b96952A75198c1091
18674b15541K0341B71705b18112j70805d0705n3787H27c26461C10155A08311b18474
18662a60150m4604d0801j43442B66102a52903D1966h7731E7392a97347F5531b2684
18650b2119I5169R958J22578e8570k06064e3033I3108a86970L2586j1707A06577
18638g5151A58687b86598K0168i7570j07608A0740P8310a460k82818a18579A73416
$$ y = [-234593, -114221, -204371, 312845, 299504, 57842, -102153, 44266, 106585, -157297, 20856, 16631, 165316, -92944, -356070, -200718, -202411, 10223, -81587, -2002, 119034, -24496, -179923, -230519, 107619, -30519, 5793, -230854, 180067, -226945, -351624, -329770, 305431, -236242, 22894, -223787, 265055, 40289, 73329, -311793, 63366, -296952, 175198, -31091, -215541, -195200, 271705, -218112, -388917, -40705, -94492, 827, -326461, 310155, 108311, -218474, -160150, -204754, -40801, -184243, 266102, -152903, 41966, -87731, 57392, -197347, 65531, -22684, -22119, 95169, 105127, 227705, -58570, -264634, -53033, 93108, -186970, -154384, -166091, 106577, -75151, 158687, -286598, -266430, -97570, -205178, 10740, 89050, -1460, -284278, -118579, 173416]
18626e41404I1835e4299D5986b297B76029I3546d09184g6796n0628J7845B53454
18614b24518A17929F511f5668k81138e668F7915a01810K996q8351J1750F6388
18602F3662a30275f3408j7375K4617G1208b2223H7904b31527q7455a58821m4256
18591b03077A08370a56658H6409i4718j7070E3610K75370A37082b64242i1266
18580d97273a79503A24044d17571a55851M9567C1150M2887M069a34624A08891
18569c31969A00403f5101l8867p5924C20372b00225q3901B10095a63231g8555
18558a24073A07158c7454B0651a0575j00695G2571b8907B22223c33595J59660
18548a73935D28002D9174d8580b4109A8509b63670j38192H1141N5372M1616b84190
$$ y = [-541404, 91835, -54299, 45986, -2297, 276029, 93546, -409184, -76796, -127424, -109579, 253454, -224518, 117929, 6511, -65668, -346806, -5668, 67915, -101810, -98814, -187165, -175415, 66388, 63662, -130275, -63408, -80783, -56166, 71208, -22223, 87904, -231527, -318982, -158821, -203077, 108370, -156658, 86409, -94718, -111788, 53610, 328980, 137082, -264242, -91266, -497273, -179503, 124044, -417571, -155851, -106284, 31150, 74037, 78106, -134624, 108891, -331969, 100403, -65101, -103968, -179892, 320372, -200225, -284126, 210095, -163231, -78555, -124073, 107158, -37454, 20651, -10575, -111270, 72571, -28907, 222223, -333595, -173935, 428002, 49174, -48580, -24109, 18509, -263670, -401862, 81141, 136513, 178129, -284190]
18536i8860j0981j15015A10310C8962O1923C1111a54547m0005A42533E1729a76035
18524c62960D10781j28768j22351g3765k7893M6283E446a15523m3662A16724b92660
18512A94636I2078N9303b3386j17554j01580j84791A95419B9064J36912N9418
18502B25394A8968c46012H1771B5522h9643C05027A43871o3492c78585J44898
18492b33687L8749C39324A37603R1259a18792C92240F0172L4095e3341r8571E0011
18480B54617a32129c2248j1299A04286b96106E8106f6134r7426A53561F4495a61197
18468E2649b15316b7494l1942C11620a33297r5216A50874e4493j99904C35291
18457b02970c3312j87956A6275a05578L2607j34549B14809a10163C36508f9189
$$ y = [-98860, -109841, -224856, 110310, 38962, 100885, 31111, -154547, -194552, 142533, 51729, -176035, -362960, 410781, 282013, 159662, -73765, -101658, -55375, 5446, -115523, -159185, 116724, -292660, 194636, 92078, 151381, -23386, -140940, -242520, -427311, 195419, 29064, 165976, 225394, 18968, -346012, 81771, 25522, -89643, 305027, 143871, 80379, -378585, -233687, -194938, 339324, 137603, 228862, -118792, 392240, 60172, 94267, -53341, -151912, 50011, 254617, -132129, -32248, -43547, 104286, -296106, 58106, -66134, -163560, 153561, 64495, -161197, 52649, -215316, -27494, -59436, 311620, -133297, -228513, 150874, -54493, -254397, 335291, -202970, -33312, -221268, 16275, -105578, -72971, -207520, 214809, -110163, 336508, -69189]
18446H7013J04806c20173i6015A29183a26305M3707j33061G7381f1336n2861k07984
18435c22181J60512O0016E2191c7610j60787I2293c60983D1892a61185c7575B7934
18423e9539j25244A31610b3238l99434A2490b00709e9548j86805B07374n9778
18413A47596a82275A68500B9487a04921j56266c8217J6003F3047a33493C4646
18402b43785K2211I0941j1810a12929j07083E03399I7375l1807b70608A21896
18391b74796B5660K21287G6109F071Q5165J24352f8844l1544k17086B27915C8662
18379G4033a56699E0592b88245P2257j38399a45884k83111b2298r5435p0833B03355
18367A25125a51549A88645H7216J22896h0791J0787q5566l38197G8336d8267k08469
$$ y = [87013, 191819, -320173, -96015, 129183, -126305, -82598, -215659, 77381, -61336, -114197, -322181, -161669, -101653, 52191, -37610, -198397, 92293, -360983, 41892, -161185, -37575, 27934, -59539, -184783, 131610, -23238, -422672, 12490, -200709, -59548, -246353, 207374, 147596, -182275, 168500, 29487, -104921, -261187, -38217, -22214, 63047, -133493, 34646, -243785, -221574, 90941, 79131, -112929, -220012, 503399, 97375, 65568, -270608, 121896, -274796, 25660, 246947, 76109, 6071, 91236, 215588, -68844, -100388, -317474, 227915, 38662, 74033, -156699, 50592, -288245, -215988, -354387, -145884, -428995, -22298, -117733, -188566, 203355, 125125, -151549, 188645, 87216, 210112, -80791, -70004, -155570, -493767, 78336, -48267, -256736]
18356b56736J00083A06894c772B8401O4432B8857A3221B922J49601b11312B2185
18344E20802d2762B18624E3970L5804a57693j53880B05399B9329q242b15383A33261
18332d2177l6821o1143K5135A58783j8331B2689J5745g6957g340j40627A40302
18320c151B97010g9088D2674a81468j27576N7824D00704j75048b42977A98884
18309h4437K6468j24979B31047c6614q5884A82168c4360A05103c0136B79727i8573
18297A2141J10943c76705f8566m4171H1756e1381j07813J1947d0821l5088H4177
18285C29244A08019e41463A82534a9727B13594G043b8412A19984K1985l6573c22952
18273H3639Q5937J7678f792A24836m0437b47014A15495c40946J8861a27056j39005
$$ y = [-256736, -156653, 106894, -3772, 28401, 92833, 28857, 13221, 2922, 152523, -211312, 22185, 520802, -42762, 218624, 53970, 89774, -157693, -311573, 205399, 29329, 21087, -215383, 133261, -42177, -78998, -140141, -115006, 158783, 140452, 22689, 38434, -76957, -7340, -147967, 140302, -3151, 297010, -79088, 42674, -181468, -309044, -251220, 400704, 225656, -242977, 198884, -84437, -57969, -182948, 231047, -36614, -122498, 182168, -34360, 105103, -30136, 279727, -98573, 12141, 123084, -376705, -68566, -112737, 81756, -51381, -159194, -147247, -40821, -75909, 84177, 329244, 108019, -541463, 182534, -19727, 213594, 7043, -28412, 119984, 141969, 105396, -322952, 83639, 169576, 187254, -6792, 124836, 84399, -247014, 115495, -340946, -322085, -127056, -266061]
18262b66061a7357E1810a44385c4897a2015A15653C006a20421B48952H6092N0294
18251A36386c49305c6460j06380b2687j65142J5623A72902h6033C62191b4810
18240A9533f8914A66453b76600k8768i4003A0428R7755l224H834b16894N8715
18229a58179B93552b50253a13013A58644C1429p159M6087J82497b98719B1050
18218a09262j51908A90294K7767b46782g0507c2154j04002H7625a52984C32509
18207H6994c7683k4245C8978L35210a09749A68854E1783i912d648J048E3542c63041
18194B7628d9021r7895L2036j9827c5601J4144r458n1477A21164b2415r8577j69475
18182b90467E43471b39528i8847B9075a64375k63766E9160a1815r5226j54394
$$ y = [-266061, -17357, 51810, -144385, -34897, -12015, 115653, 3006, -120421, 248952, 86092, 136386, -349305, -36460, -142840, -22687, -187829, -172206, 172902, -86033, 362191, -24810, 19533, -68914, 166453, -276600, -305368, -94003, 10428, 108183, 104959, 8834, -216894, -158179, 293552, -250253, -113013, 158644, 31429, 24270, 70357, 252854, -298719, 21050, -109262, -261170, 190294, 218061, -246782, -70507, -32154, -136156, 87625, -152984, 332509, 86994, -37683, -61928, 38978, 374188, -109749, 168854, 51783, -9912, -4648, -3600, 53542, -363041, 27628, -49021, -146916, -114880, -134707, -35601, -21457, -30915, -82392, 121164, -22415, -120992, -290467, 543471, -239528, -98847, 29075, -164375, -428141, 59160, -11815, -107041, -261435]
18172b61435D5472c38510B53169I0066c02592a02946L7637j39523A7022a60409
18161B16460d6956p7667g676G1787a95664A527b89464J38724L4046A60767p6736
18150H4031a86167A6571b1024B09894j04032B7304K15597b45732d0938k97382
18140c38320q1259c2801B09718J34013a26839j3759q287c8559C80552i8652q1663
18129a80315M3614k22583A7392e1298E9141K5670j8635Q6474J61956a41959B44480
18117F6304a97595E0248h5249L0630m6811D6275j758K65287j13924b3269k621
18106b5890r8932B09150j1221A8108J94334c9475k26352G5795a20054H5886c31707
18094b26674B5274b85208q574H2313O279J9655a07682k22383H8199h299m351D4652
$$ y = [-261435, 45472, -338510, 253169, 90066, -302592, -102946, -65309, -204832, 17022, -160409, 216460, -46956, -124623, -7676, 71787, -195664, 1527, -289464, -150740, -116694, 160767, 84031, -186167, 16571, -21024, 209894, 105862, 27304, 242901, -245732, -40938, -338320, -419579, -32801, 209718, 343731, -126839, -140598, -148885, -38559, 380552, -98652, -180315, -136701, -359284, 17392, -51298, 59141, 84811, 66176, 152650, 314606, -141959, 244480, 66304, -197595, 50248, -85249, -54619, -101430, 46275, 44517, 309804, 195880, -23269, -25890, -124822, 209150, 197929, 18108, 212442, -39475, -265827, 75795, -120054, 85886, -331707, -226674, 25274, -285208, -293782, 82313, 88592, 108247, -107682, -330065, 88199, -8299, -12650, 44652]
18081E0355d2398j8122k52093c1949J5463l0834J830j62833j35632a32319j09574
18070b41893l2999L1607m705B00257P9050a12340j83719A26135a279k28834A69380
18058a09313M9715l43204F5396a03279D83016a22769N2015L0787C7596e8451A38312
18046a75448A14327c21164A55126e753A46618h6386A88412L1608a1308A71719
18035F2593L9958J3968K7400c6681j68552A79904K2191b6626B93833a57882B6326
18023a80337n0271O6575A63711L5161n8972F1586J60775j3135a4997l24341d9928
18011C9971g6943L7760A72187b6007J0542B3906K36419b28482C76115d7861j94312
18000b42173B06540h2800A42149f9679j98750C5165a4977A91453F9682J23160
$$ y = [50355, -42398, -60520, -312613, -31949, -16486, -47320, -45490, -208323, -343955, -132319, -241893, -274892, -243285, -247990, 200257, 279307, -112340, -296059, 126135, -1279, -230113, 169380, -109313, -59598, -402802, 65396, -103279, 483016, -122769, -70754, -39967, 37596, -58451, 138312, -175448, 114327, -321164, 155126, -5753, 146618, -86386, 188412, 220020, -11308, 171719, 62593, 102551, 116519, 143919, -36681, -205233, 179904, 202095, -26626, 293833, -157882, 26326, -180337, -230608, -164033, 163711, 198872, 139900, 61586, 222361, 209226, -14997, -339338, -49928, 39971, -76943, -39183, 172187, -26007, -15465, 23906, 260325, -228482, 376115, -47861, -242173, 206540, -82800, 142149, -69679, -268429, 35165, -14977, 191453, 69682, 192842]
17990A92842a20930B47353D4035a29877A1508J65276a39826F8563C0461j364g2445
17978b23629P7868j49845I0320l1454Q550c06940c614B81749a18078j8994D1383
17966E1855b68887A84528C8542J773b80804f5138B16452d6843k48619J34792A2240
17954C11989a47715b4251A35822b10659l2183D7031a43115B47646a56777F2300
17943a92681b6493m20610b3139A19422c64513a25220B08759A9116a42714C3019
17932E9876L2625a11690j61585A08831a37438G9407a55402r5303D2836r104J36042
17921A69774b9290k30326F1237P2535K61001b44902b276B54872a45595o2C8408
17909A23008C9499e5626l01261R8126O6336D4926J59221A6258K0069a17623I5409
$$ y = [192842, -120930, 247353, 44035, -129877, 11508, 176784, -139826, 68563, 30461, 29097, -72445, -223629, -145761, -295606, 90320, 58866, 67416, -306940, -3614, 281749, -118078, -137072, 41383, 51855, -268887, 184528, 38542, 40315, -280804, -65138, 216452, -46843, -295462, -160670, 12240, 311989, -147715, -24251, 135822, -210659, -242842, 47031, -143115, 247646, -156777, 62300, -192681, -26493, -447103, -23139, 119422, -364513, -125220, 208759, 19116, -142714, 33019, 59876, 92501, -111690, -273275, 108831, -137438, 79407, -155402, -250705, 42836, 33732, 169774, -29290, -259616, 61237, 133772, 394773, -244902, -2276, 254872, -145595, -145657, 38408, 123008, 39499, -55626, -356887, -258761, -192425, 44926, 204147, 16258, 36327, -117623, 95409]
17897b00498j51546A88734h5402A85069L2752b45972B60214b64275E03868B7745
17886A81750c19199l3090J67360g7937j11137A2995d30897B13668K37686g1174
17875f5014l7506j97380F4051B4254J12719G478e1881m82486a32275k60868a20247
17863f657A48002a92179h1600j58719H1089A6801b92739g2564K6323k52327I898
17851a51588D0746a07258M3480q0979a3968r3780B01770d33080a10255e1293m648
17840e5941j25270B02569A4111N6922b41364P3771d3499r1947l10523A74663a22521
17828B64073j17994a58386l7420A88109G2261J27188D4287f6327C95260j24345
17818B70915C4501b49209B3456b57561I1689m4912J2943b69838B56660b19283
$$ y = [-200498, -352044, 188734, -85402, 185069, 217821, -245972, 260214, -264275, 503868, 27745, 181750, -319199, -352289, -184929, -77937, -189074, 12995, -430897, 213668, 451354, -71174, -65014, -102520, -299900, 64051, 24254, 136973, 7478, -51881, -534367, -132275, -393143, -120247, -6657, 148002, -192179, -81600, -240319, 81089, 16801, -292739, -72564, -46241, -298568, 9898, -151588, 40746, -107258, -63778, -144757, -13968, -107748, 201770, -433080, -110255, -51293, -55941, -181211, 202569, 14111, 71033, -241364, -167593, -43499, -135446, -445969, 174663, -122521, 264073, 146079, -158386, -195806, 188109, 72261, 199449, 44287, -66327, 395260, 270915, 34501, -249209, 23456, -257561, 91689, 46777, 59720, -269838, 256660, -219283]
17807I3553b30999B7265a97892g7104A16889P0750f2461A23274h6620I4620a04791
17795B93775A08765A5768C965f1588H7162b16387h1163C9723a89381B66611k9108
17784B37503d5802b1960H5016b39863c3143j16493f731B01619c34383a25712A28060
17772a45246k25106G6723a04613A42558J7369f1782G9437a2022B1372c1137k49154
17761b80291A31986b8609o0987C3399d59054A49452c05329J18808e2113k08382
17751b60495B18647h9847k2361C702b08895G6569J76447L0928a03931M952j68420
17740b67399h1701R650C25389d4698E7953B5296K34225B8108J03651i3444R714
17729h3730B24289H9276b65283f1639D7459J61636P9979a33097K3745k21475B75167
$$ y = [93553, -230999, 27265, -197892, -77104, 116889, 187639, -62461, 123274, -86620, 94620, -104791, 293775, 108765, 15768, 3965, -61588, 87162, -216387, -81163, 39723, -189381, 266611, 237503, -45802, -21960, 85016, -239863, -33143, -149636, -6731, 201619, -334383, -125712, 128060, -145246, -370352, 76723, -104613, 142558, 159927, -61782, 79437, -12022, 21372, -31137, -280291, 131986, -28609, -89596, 33399, -459054, 149452, -305329, -186521, -52113, -260495, 218647, -89847, -112208, 3702, -208895, 76569, 253016, 283944, -103931, -98979, -267399, -81701, -72051, 325389, -44698, 57953, 25296, 259521, 28108, 131759, -93444, -83730, 224289, 89276, -265283, -61639, 47459, 209095, 289074, -133097, -109352, -330827, 275167]
17717A56643J6262h1975q5089H618J07874a93591G2388b53536B5726b00795j8650
17706b19445k24386B3713b68634A75332J7319P2802a85226A48446P8900j03566
17696A23780f4596B10580J936d2036C7492d14064c7463n9533C05109j33191N2343
17685B24261c24568A59267a59140H7293O4536J93202i8306f441l38302g2623B67822
17673A47713d7079l646k8043A72571a57508e4161B93741C8110i3373D22466A37904
17661A37240i2177A17555c52071A91910a71828r2758A22013m6263P5615J22246
17651B73611a08691j5549H4412b62028D9084G260b10030b9913j27445j73265A28435
17639a21564b9586H7815e6406l8875A80580L9406b2333j75713o9963G4009B7957
$$ y = [156643, 172905, -81975, -167064, 8618, 116492, -193591, 72388, -253536, 25726, -200795, -219445, -443831, 23713, -268634, 175332, 192651, 265453, -185226, 148446, 227346, 123780, -64596, 210580, 212516, -42036, 37492, -414064, -37463, -96996, 305109, 171918, 224261, -324568, 159267, -159140, 87293, 151829, 345031, -98306, -6441, -344743, -72623, 267822, 147713, -47079, -50725, -78768, 172571, -157508, -54161, 293741, 38110, -93373, 422466, 137904, 137240, -92177, 117555, -352071, 191910, -171828, -264586, 122013, 75750, 151365, 273611, -108691, -124240, 84412, -262028, 49084, 7260, -210030, -29913, -157358, -330623, 128435, -121564, -29586, 87815, -56406, -95281, 180580, 219986, -22333, -198046, -268009, 74009, 27957]
17627A10268a58852b2821C16535a74343q6028g987G659c22534a04757N0055A09050
17615D8717J7399a72944l830C2402f0180k58782D12928a98435f8557B86556C402
17603C97419g7453L6416k1713j2859A29239l4914J93707h386j07907A50359J15885
17592B66244c1156G8213K06370d2415j44531A30929a21341C70200a44799G5066
17581A32036M7970b2989B4067c62690L4411A58061c72978J39194p838k33238a65812
17569A27209D2801P1853J95057e9743A26051Q5413a2086A19511J45592B7370O6760
17558I4130J14901B8766e7923A40567A0017a52969B4474d07300H19J54265k4213
17547A30871g8601L2229j49832A33775D5413h3883O45k18992a1327A28884K80667
$$ y = [110268, -158852, -22821, 316535, -174343, -260371, -7987, 7659, -322534, -104757, -54702, 109050, 48717, 66116, -172944, -176774, 32402, -60180, -318962, 412928, -198435, -68557, 286556, 3402, 397419, -77453, -41037, -62750, -75609, 129239, 94325, 288032, -8386, -116293, 150359, 266244, -31156, 78213, 284583, -42415, -186946, 130929, -121341, 370200, -144799, 75066, 132036, 180006, -22989, 24067, -362690, -328279, 158061, -372978, -233784, -241622, -474860, -165812, 127209, 42801, 114654, 309711, -59743, 126051, 211464, -12086, 119511, 265103, 27370, 94130, 209031, 28766, -57923, 140567, 10017, -152969, 24474, -407300, 819, 155084, 130871, -78601, -46372, -196204, 133775, 45413, -83883, -83238, -302230, -11327, 128884, 409551]
17536D09551g8009L0662F02924B9006a38323B20962l6440L7543N1807A03851J31509
17525B35360f3517N316F8237b70254C4139a03189H5419P2687f5563E2497Q0198
17514A32695b98401E6920e2717k81531A69057G1117K75145O6148I4249K47284
17504C41533a13791A46824a46572B28491a36078k22083A3729J3887J77019J2810
17494B17445K18082f3018n1966D17307I2573a2875B11103N562F8586a64779P5404
17483h9375B14411l9587E9450O9949L35533C7789K03759b16127A75602d6036E12837
17471A42458R9399n2801R3804q2498k6356a44027E5284K1952J47690H2781a77018
17459A41866R9910o7193l2516D4313K20958l9069r0187M0440K39620j86284F8110
$$ y = [409551, -78009, -47347, 602924, 29006, -138323, 220962, 184522, 222065, 273872, 103851, 235360, -63517, -58201, 68237, -270254, 34139, -103189, 85419, 158106, -65563, 52497, 132695, -298401, 56920, -52717, -334248, 169057, 71117, 346262, 412410, 94249, 341533, -113791, 146824, -146572, 228491, -136078, -358161, 13729, 27616, 204635, 217445, 435527, -63018, -114984, 417307, 92573, -12875, 211103, 216665, 68586, -164779, -89375, 214411, 174824, 59450, 129399, 464932, 37789, 241548, -216127, 175602, -46036, 512837, 142458, 241857, 189056, 282860, 200362, 174006, -144027, 55284, 77236, 224926, 82781, -177018, 141866, 241776, 174583, 142067, 44313, 265271, 226202, 136015, 176455, 416075, 229791, 68110]
17447D07731A86121J63764r2885k1391G5885l6697b38340C71836b9671D7896K26698
17436B74594c04474C71806j56665o5778b77572D54266H2796J82450q4350k5796
17426A55100J62489j54844R9301C4110K35436b14875A8680P2768R9301J71881
17416C62630E3666J56561c3690d031A63570a76958J1407e36C86427n9086a44241
17404C37473F0385J22487E4963b05404H7885J41262N3033a15681A39252b22658
17393A4324b16667A20046K89333i8370A50216m5231K27897e3673p0758E6550N0260
17382A06810K0502J90334A42704F4437b8583C99719A24531R3904b45722R7352
17372a48370B60096n4207f5521R746F7620K05414a3602B22J15021J94319A25290
$$ y = [407731, 186121, 349885, 257000, 235609, 75885, 39188, -238340, 371836, -29671, 47896, 274594, -304474, 371806, 215141, 149363, -277572, 454266, 82796, 265246, 180896, 155100, 317589, 162745, 262046, 34110, 269546, -214875, 18680, 91448, 190749, 362630, 53666, 210227, -33690, -4031, 163570, -176958, -165551, -536, 386427, 327341, -144241, 337473, 60385, 182872, 54963, -205404, 87885, 229147, 282180, -115681, 139252, -222658, 14324, -216667, 120046, 409379, -98370, 150216, 104985, 332882, -53673, -124431, 56550, 106810, 127312, 317646, 142704, 64437, -28583, 399719, 124531, 218435, -245722, -148370, 260096, 205889, -65521, -55775, 67620, 273034, -13602, 222, 115243, 309562, 125290]
17360g6072j01880A54451K3605i856H9962d1123J063a3643D4091a58818c9717
17348b91626A24355b7242B48489J19058A53010b77933A12571O9507b29803L4241
17338a95562C89485j70924J02610r3291k1685a73333J5259A39830a8965j49004
17328a67969D05032H1620J5880J27899a27558m313A84588R7772A2361h72B7700
17316A66017b38680B17288p7695n9960k4180J73101C9338j9078c1775B43459G9803
17304A3374K92266J57121A87302d3907C13901A40309H323c4562A88001k0222o8581
17293I9198J781L37798N1197F5914a43771H53L40506o2905P8198c7267H9794L28151
17281D17945c24123b8079B33293Q0532j46679o9909o679J47355F0998L12089A74349
$$ y = [-76072, -177952, 154451, 178056, -9856, 89962, -41123, -40060, -13643, 44091, -158818, -39717, -291626, 124355, -27242, 248489, 367547, 153010, -277933, 112571, 182078, -229803, -195562, 389485, 218561, 321171, 227880, 206195, -173333, -158074, 139830, -18965, -167969, 405032, 81620, 97500, 225399, -127558, -131871, 184588, 282360, 12361, -872, 27700, 166017, -238680, 217288, 139593, 79633, 55453, 228554, 39338, 20260, -31775, 243459, 79803, 13374, 305640, 462761, 187302, -43907, 313901, 140309, 8323, -34562, 188001, 167779, 99198, 100979, 438777, 489974, 65914, -143771, 853, 341359, 278454, 356652, -37267, 89794, 417945, -324123, -28079, 233293, 313825, 167146, 97237, 90558, 237913, 60998, 373087, 174349]
17269C12464M00288c48655A67704J76778l1933E6163N3287c2068a5678I9228J27719
17258B26947e0339A65778J34758l4440A12387b4553h589B02133a9854e406j6702
17247b2108B53643a98595R0359D29108c3736B23926A04162d4423A63821p6765
17237H7056A0216L6832M38014a21550h777B44754g1172B82471g6178A59884P2529
17226B32413K0544A1567K68585K50767a7473k0640k4565B64509b9125B56966n4199
17215B02767P8018l8870C2405K39827f0527j74276B42338K08171j70076J7012
17205B97445A26318K25117F2353M6503k8496M23339b1396B45775j07969B345b4599
17193a9317D25093A05912N3758m0837R9174b7534B97625M2065j31280M2109j08405
$$ y = [312464, 712752, -348655, 167704, 344482, 312549, 56163, 109450, -32068, -15678, 99228, 226947, -50339, 165778, 300536, 266096, 112387, -24553, -8589, 202133, -19854, -5406, -22108, 253643, -198595, -108236, 429108, -33736, 223926, 104162, -44423, 163821, 87056, 10216, 47048, 485062, -121550, -8777, 244754, -71172, 282471, -76178, 159884, 232413, 252957, 11567, 280152, 530919, -17473, -38113, -62678, 264509, -29125, 256966, 202767, 280785, 241915, 32405, 272232, -60527, -234803, 242338, 450509, 280433, 297445, 126318, 351435, 62353, 108856, 80360, 503699, -21396, 245775, 137806, 2345, -24599, -19317, 425093, 105912, 159670, 118833, 218007, -27534, 297625, 339690, 208410, 250519, 142114]
17182A42114B9098L16840j27971L52180I7444J1207a54411F0576K13991l3829
17172B40738M62567I6590N23842B00043p9757K54495j11133r9426a8317A65133
17161D56076j86471A14165J99235r8002K2584R8686A01674L7784M29184A0931
17150B69081a55174B35487c0770m8104A99801O1782K60075j23259G173J70502
17140A77675a2842A05144M09795q7046p0629J33004j66687J62512J9121H6244
17129A54997F8863Q5736a33595F05259F8689K19328K17680j73047E3722L01725
17119C55447A16830M85900A79187a09892C35063K84744C08590H4979L29183n6253
17109C57909A62077C173O1069P65258B11158J9034J76131A98789K08324j49306
$$ y = [142114, 29098, 345938, 217967, 570147, 97444, 108651, -154411, 60576, 274567, 240738, 703305, 96590, 620432, 200043, 120286, 374781, 263648, 164222, -18317, 165133, 456076, 269605, 114165, 313400, 215398, 237982, 336668, 101674, 139458, 568642, 10931, 269081, -155174, 235487, -30770, -78874, 199801, 261583, 521658, 398399, 7173, 177675, -12842, 105144, 514939, 427893, 357264, 490268, 323581, 486093, 505214, 86244, 154997, 68863, 154599, -133595, 605259, 68689, 288017, 505697, 332650, 53722, 355447, 116830, 602730, 179187, -109892, 335063, 619807, 308590, 84979, 414162, 357909, 162077, 3173, 64242, 829500, 211158, 230192, 406323, 198789, 407113, 257807]
17099B57807J32898o0460a58352B56179A04938K80111J49944A53013K27580A1305
17088B75077R8266j76115J57375J02981p8119j28847L49703k79609J33408J47179
17078F01299k07533j69431K22360B21618R3645k5454j5823J3420L04116B07568
17067f0269D15881p3210K05816k41736o4334j4688J97891F9995L05819k2562L41730
17056F94982k88903J33108n6398A89207K01259j7698p6789l2079J10717q5984
17046B88633J49092L4764j32497k581J69299k51602K10312B10591K92154j89534
17036C13211J07756K05085j34400j24813N06540l99032O8712j29965J01684j70166
17026C44612k3643J84657J89414l13368j01709O34750m05084J22675B88244K42349
$$ y = [257807, 390705, 330245, -158352, 256179, 104938, 385049, 534993, 153013, 380593, 11305, 275077, 373343, 197228, 354603, 457584, 379465, 250618, 600321, 320712, 454120, 601299, 393766, 224335, 446695, 221618, 315263, 289809, 273986, 287406, 591522, 207568, -60269, 415881, 342671, 548487, 306751, 242417, 227729, 425620, 69995, 375814, 353252, 694982, 406079, 539187, 482789, 189207, 390466, 372768, 295979, 263900, 374617, 288633, 437725, 472489, 339992, 337411, 506710, 255108, 465420, 210591, 502745, 313211, 420967, 626052, 491652, 366839, 873379, 474347, 543059, 413094, 514778, 344612, 320969, 505626, 695040, 381672, 279963, 914713, 509629, 632304, 288244, 530593]
17016E30593j00716r4114Q9029J77641k07006R0396N435L26892A87460K52888
17006D40348K15127j7146l04771K39922B77024K78339o9323K59926j74957m4962
16996E26047N7490j40302L69047j66586m8802j67585L99012l46852K64816j08266
16986F38019K3163j77752K75130k1564k58113r2917j50157K37969J32699M48193
16976A054670m35060M5366J77591k72600K99960m00243K34911m3410M4433l5602
16966F70016K1053j93735L39464r9184R3426j65137L70377K3329j41153q9652
16956H28804j19120Q2847J95090m7069m1402r2056L73977j16985l01436j07608
16946F55042J25738j99178K43426P6837N9367R5253j1289k32149K91476n0054
$$ y = [530593, 429877, 335763, 424792, 602433, 395427, 485823, 491258, 818150, 187460, 440348, 655475, 638329, 333558, 573480, 277024, 555363, 486040, 745966, 571009, 526047, 583537, 443235, 812282, 645696, 596894, 429309, 828321, 481469, 746285, 638019, 661182, 483430, 758560, 736996, 478883, 385966, 235809, 473778, 606477, 1054670, 619610, 664976, 842567, 569967, 869927, 469684, 704595, 661185, 705618, 670016, 691069, 497334, 836798, 737614, 831040, 665903, 1036280, 1059609, 918456, 828804, 709684, 792531, 987621, 940552, 899150, 807094, 1181071, 1064086, 762650, 655042, 780780, 581602, 825028, 901865, 961232, 1056485, 1045196, 813047, 1104523, 1054469]
16936A054469j72885R0878J99319l12173L15536j93951M30194m28727Q1777j45277
16926I19160Q8809J95465o0596j15361J91142J15735P4435m79993J57922m49586
16916F37132N60580R7674l66648J47422L43750j88066K60523m03492j26611M90471
16906A452735M8631j89309K58379k76102M22789o00059K8806J86775L2718K49509
16896A614872j36969K12469m38918K38007K56260l44395K07682J8529J44936k17518
16886A554955K21344l99392M73198l82516M25028k15633J40075j14874K75073
16877A977258k38178K1054k05625K74919M30870j39222j05886K53597J40274n05549
16867A903512K47264J49908o5888j69256L24557J14061m48992K19989J63783j4364
$$ y = [1054469, 881584, 972462, 1171781, 859608, 1175144, 981193, 1411387, 982660, 1064437, 919160, 1007969, 1203434, 1142838, 1027477, 1218619, 1334354, 1408789, 928796, 1086718, 637132, 1197712, 1295386, 928738, 1076160, 1419910, 1231844, 1492367, 1088875, 962264, 1452735, 1501366, 1312057, 1570436, 1294334, 1717123, 1117064, 1145870, 1332645, 1365363, 1614872, 1477903, 1690372, 1251454, 1489461, 1745721, 1401326, 1609008, 1627537, 1772473, 1554955, 1776299, 1376907, 1850105, 1467589, 1892617, 1676984, 1817059, 1702185, 1977258, 1739080, 1760134, 1554509, 1829428, 2260298, 2121076, 2015190, 2268787, 2409061, 1903512, 2150776, 2300684, 2234796, 2065540, 2390097, 2504158, 2055166, 2275155, 2438938, 2424574]
16857B424574J92084K7140k31741j13698M12168m1165j43925K11229J67773k10500
16847B693939K20426k63717J85890L93513P00l26750K2101P48769k35323J28520
16837C568068p0864j55244K28324J42151K4267l20084Q88441k19673o1491K1196
16827D045091j05221K14734l74656O12201K13850j55382l368M3768J70746L20644
16817D982407l3847N50249k0613l26281J65008k37055P68640J81454P1543J15509
16807F217014K83138k93553Q6759L52427J06609j7927L78714J15117O071M26639
16797G661008l8168P76489l58331M07389J30762J33876O62353j11527N82227m84777
16787I361301P36526L68808M71102l3102L45807P22036N4580O30353L5162L73697
$$ y = [2424574, 2616658, 2643798, 2412057, 2298359, 2710527, 2669362, 2525437, 2736666, 2904439, 2693939, 2914365, 2650648, 2836538, 3230051, 3230751, 2904001, 2926102, 3674871, 3439548, 3568068, 3497204, 3341960, 3570284, 3712435, 3736702, 3416618, 4305059, 4085386, 4023895, 4045091, 3939870, 4154604, 3779948, 4392149, 4605999, 4450617, 4447249, 4491017, 4661763, 4982407, 4948560, 5498809, 5478196, 5151915, 5316923, 5079868, 5848508, 6029962, 6101505, 6217014, 6500152, 6206599, 6293358, 6645785, 6752394, 6734467, 7113181, 7228298, 7234369, 7661008, 7622840, 8399329, 8040998, 8448387, 8579149, 8713025, 9375378, 9263851, 9846078, 9361301, 10097827, 10466635, 10937737, 10904635, 11250442, 11972478, 12027058, 12657411, 12692573, 13066270]
16777A3066270O13823J23823Q11852K23173Q02505P78382K33488J052829J55379
16768A7861524O26512P27191R19041O17900J063744P29623J055692R07679J125576
16759B5634482J049098J027822J425338J217265J506984J289182K004004J308537
16751C6462712K093973K158816J711356K317053K727153K436098K377310L196827
16743E5481298L253521L589052L416041M130389L909029M814193M741402N338173
16735H8673098N514679O006329O248052O465171O586696P535469O977071P836003
16727A41842568P331687P511684P535192O460249N996014N499059M403495L319811
16719A89899759J697963R41558o66805j917140l059762m438974n292639o226115
$$ y = [13066270, 13680093, 13803916, 14615768, 14838941, 15641446, 16419828, 16653316, 17706145, 17861524, 18488036, 19215227, 20134268, 20752168, 21815912, 22545535, 23601227, 24508906, 25634482, 26683580, 27711402, 29136740, 30354005, 31860989, 33150171, 35154175, 36462712, 38556685, 40715501, 42426857, 44743910, 47471063, 49907161, 52284471, 55481298, 58734819, 62323871, 65739912, 69870301, 73779330, 78593523, 83334925, 88673098, 94187777, 100194106, 106442158, 112907329, 119494025, 127029494, 134006565, 141842568, 149174255, 156685939, 164221131, 170681380, 176677394, 182176453, 186579948, 189899759, 191597722, 192539280, 191872475, 189955335, 186895573, 182456599, 177163960, 170937845]
16711A70937845o461122p352865p362935p509384p624833p578987p100774o963130
16703A12983815o671693o266753n685019n902202n465060m851426m432430m114118
16695F9595114l813135l564926l676315l165130l208085k477374k575993k507982
16687D4606174k509675j639172k251802j468132j970477j380445j686399j400734
16679C0299338j709223r99162q30149j348852j285363o94592q24009j007339p55721
16670B0844928p03911o67383j022799m11862p44589o36910m10605n38383m32622
16661A5275864r11247k19338r05476l41249q8728r57934L59514o52604j63957
16652A1394845k40203n13597O5053r38392j96622k83214j46671l99396j55681
$$ y = [170937845, 164476723, 157123858, 149760923, 142251539, 134626706, 127047719, 119946945, 112983815, 106312122, 100045369, 94360350, 88458148, 82993088, 78141662, 73709232, 69595114, 65781979, 62217053, 58540738, 55375608, 52167523, 49690149, 47114156, 44606174, 42096499, 40457327, 38205525, 36737393, 34766916, 33386471, 31700072, 30299338, 28590115, 27590953, 26760804, 25411952, 24126589, 23431997, 22607988, 21600649, 20844928, 20141017, 19473634, 18450835, 18038973, 17294384, 16657474, 16246869, 15708486, 15275864, 14364617, 14145279, 13239803, 12898554, 12809826, 11851892, 12211406, 11558802, 11394845, 11154642, 10641045, 10706098, 9767706, 9571084, 9287870, 9141199, 8741803, 8586122]
16643H586122q5421l06954K22648o52032j83614l9376j83164j08223k56507m50302
16633F543177L32988m73613K6389n54210K33402p5573l80863j34392n9456j77282
16623E280567L13435m36535Q3022l32886J11599K8160m26850J94247l81224l20388
16613D113147K03519m66925K99607j31549m10478M28803K63835o28799J69755
16604C840915j76610K44461o02116M43570m01470Q1683n1809j87916o0064l59004
16594B771640M56390m4503l02033l7754K06229q2254l55913L0125K42564j33435
16584B751056j71939k93501J45595J72399k02299k93813L01586j90292R5889j45102
16574B169579l59113K13909N7995m02084N79763m09835L29806j52230k21496M98643
$$ y = [8586122, 8500701, 8193747, 8416395, 7764363, 7580749, 7541373, 7358209, 7249986, 6993479, 6543177, 6876165, 6402552, 6428941, 5874731, 6108133, 6032560, 5651697, 5517305, 5457849, 5280567, 5594002, 5157467, 5240489, 4907603, 5019202, 5047362, 4620512, 4814759, 4433535, 4113147, 4316666, 3849741, 4149348, 4017799, 3607321, 4036124, 4299959, 3671160, 3840915, 3664305, 3908766, 3306650, 3750220, 3348750, 3430433, 3378624, 3190708, 3130644, 2771640, 3228030, 3183527, 2881494, 2843740, 3049969, 2967715, 2611802, 2641927, 2884491, 2751056, 2579117, 2285616, 2431211, 2603610, 2401311, 2107498, 2409084, 2218792, 2314681, 2169579, 1810466, 2024375, 2082370, 1680286, 2260049, 1850214, 2180020, 2027790, 1806294, 2304937]
16564B304937n10876O6422J10985m47922J81278M4469K0032j58488o9328K82514
16554A824023J13970r9817j56988o3414O5472R2992m18923L52547k33321K19201
16544A695742J03383j52101j25443l8387j05262l35951R1738M67482j47548j30219
16534A323434M9135q292O2256m4819p4990k62401J93680q8J77466k10033j65309
16523A040039K32723K2073k13889N6009J2670j27347N3686J72398l80983N88688
16513A456067P5884n06912l41829M53822q3073j52590K09091l9940j73526J84875
16503A081869j71122K736l79085O05055J2295j11816l04845K8483K39043J25755
16493A128368D73323M41284l12052K98875k7099L15216n74954J87363K2783J1216
$$ y = [2304937, 1794061, 1860483, 1971468, 1523546, 1704824, 1749293, 1769325, 1610837, 1541509, 1824023, 1937993, 1838176, 1681188, 1617774, 1683246, 1776238, 1357315, 1709862, 1476541, 1695742, 1799125, 1647024, 1521581, 1483194, 1377932, 1041981, 1133719, 1601201, 1453653, 1323434, 1372569, 1364277, 1426533, 1381714, 1306724, 1044323, 1238003, 1237915, 1415381, 1205348, 1040039, 1272762, 1294835, 1080946, 1136955, 1149625, 1022278, 1075964, 1248362, 867379, 1456067, 1531951, 1025039, 683210, 1137032, 1053959, 901369, 1110460, 1070520, 896994, 1081869, 910747, 913483, 534398, 1139453, 1151748, 1039932, 735087, 763570, 1002613, 1128368, 473323, 914607, 602555, 901430, 874331, 1189547, 614593, 801956, 824739, 835955]
16483H35955j06823n4831j66385K42416N9936K4855j91509L50441j95047j6882
16473G82126j97916K29896q1409m4688m5268Q9797l7737o991C00353K35088k0953
16462E14488J11648L3577k1254n5402M6873L25633m20273J34272O8491J57013
16452H95066l35736J11662L21062D78934L01427k4421L7868l2225k74323J86292
16442F73552K09924l81705K39144J2144A37456Q39771D22307K69222K22476A83158
16431E74809J87830l71820L33515l04832K60874k23451J90418K47759j61412l58018
16421C75672O1722L22618C75334m1345K2628K59060A95114K811J85117R0863M71293
16410I45198B61854j04116K22044j8467A49733Q57869C36510q2510J84709j53292
$$ y = [835955, 729132, 674301, 507916, 750332, 810268, 835123, 643614, 994055, 799008, 782126, 584210, 814106, 732697, 688009, 642741, 732538, 694801, 687810, 300353, 535441, 514488, 626136, 659713, 638459, 583057, 629930, 955563, 535290, 669562, 738053, 895066, 559330, 670992, 992054, 478934, 780361, 755940, 793808, 761583, 487260, 673552, 883476, 501771, 740915, 753059, 137456, 977227, 422307, 691529, 914005, 183158, 574809, 762639, 390819, 724334, 419502, 680376, 456925, 647343, 895102, 733690, 375672, 437394, 760012, 375334, 333989, 356617, 615677, 195114, 197925, 383042, 473905, 945198, 261854, 157738, 379782, 361315, 149733, 1007602, 336510, 254000, 438709, 285417]
16400B85417M02092j16115J7061q0282J28975k63870J4753J64340k40670J3424
16390C25125K90562A11431i732B32140K41889J52612k64944K27362k19160N4917
16380D24816l6236J13898Q3260j2216n2381l0776j05419j8760A17319J47070J58650
16369D23039N1551m6316l3229F1076K48150p3352A00191P4426K43097j36659I4390
16357B35853J79467k742j2762M4670J67644B81243J04424o9090P4548G6941K86205
16346C63146K69741j11575k05628N1146q5521j970B9671R3131J62452K01900J81143
16335F68297j76294k5298r6739j22305H4085O04546C38534j12371g2313B37381
16324D67257k21017K33566k5039J6437j67371o4134L72996B50712H2347N1903
$$ y = [285417, 687509, 571394, 588455, 508173, 637148, 373278, 388031, 552371, 311701, 325125, 615687, 111431, -9732, 232140, 474029, 626641, 361697, 589059, 369899, 424816, 388580, 502478, 585738, 573522, 521141, 490365, 384946, 366186, 117319, 264389, 423039, 474590, 428274, 395045, 61076, 309226, 235874, 100191, 174617, 417714, 281055, 94390, 235853, 415320, 412578, 399816, 444486, 612130, 281243, 385667, 316577, 391125, 76941, 363146, 632887, 521312, 315684, 366830, 281309, 279339, 29671, 122802, 285254, 487154, 668297, 492003, 466705, 369966, 247661, 84085, 688631, 338534, 226163, -72313, 237381, 467257, 246240, 479806, 454767, 471204, 303833, 239699, 612695, 250712, 82347, 134250]
16314A34250M64218B39949J47511P9413j256L5376j82358P2446L08417k47614
16304D51884K4836j10160L60184A54914N8524q7318K09688F1260L04454j744K21400
16293E85370A97877K41085j29519O2213j31951q1132L69564B37424R0268o8770
16283B58922l1884Q6732C3901L2549J03896q2160K3727M09563A17200b9013E02490
16271B59057A9234J58282J98055q9497L03458m5692K29650C79289j81932j6599
16261A80758K8229K5940R9740P3869a68472A76380J62665H4956L05863H4464p413
16250G7051M5142M42337a00152j01463A12096K83782A65200K41882A51045j4853
16240A36192K16643j40884J38722j13711K69524B02203l8549J05113j29601Q3820
$$ y = [134250, 598468, 239949, 387460, 466873, 465617, 500993, 318635, 391081, 699498, 451884, 476720, 366560, 726744, 154914, 213438, 126120, 335808, 61260, 365714, 363970, 585370, 197877, 438962, 309443, 371656, 239705, 158573, 528137, 237424, 327692, 258922, 227038, 313770, 33901, 66450, 170346, 88186, 111913, 521476, 117200, -29013, 502490, 259057, 19234, 177516, 375571, 286074, 589532, 543840, 773490, 379289, 197357, 180758, 208987, 234927, 334667, 408536, -168472, 176380, 339045, 84956, 390819, 84464, 77051, 122193, 564530, -100152, -201615, 112096, 395878, 165200, 407082, 151045, 136192, 352835, 211951, 350673, 236962, 506486, 202203, 163654, 268767, 139166, 222986]
16230B22986l747o0236j3419f0879D35012j38083k8887M9468h6821A11320e6340
16218E25960b07130B76526P1478F0406J00254m4009K9876A6224N44565j51131
16208D09658a45202D8996J15202j8751c09375D53675i7371C13800o4094A24344
16197c0168A90592K0872D0334j6824J3772J14923K31386A26235J28062q2798l1705
16186A39794e2837E9356J9004K30723N1067C9400O1264a52960J3087A12315i9451
16174a13755n6344A83855J9766J20510J2775j35998G54K43132j16924m3214M63907
16163E47655A70522l0427J81163r9530J3583n5049K26144A52850J47130j41139
16153A58841m2472C1673b50450G1954K18400m985d6922B2419a8368j56705C466
$$ y = [222986, 219239, 159003, 145584, -60879, 435012, 296929, 268042, 317510, -86821, 111320, -56340, 525960, -207130, 276526, 348004, 60406, 160660, 116651, 146527, 16224, 560789, 409658, -145202, 48996, 164198, 145447, -309375, 453675, -97371, 313800, 249706, 124344, -30168, 190592, 211464, 40334, 23510, 37282, 152205, 383591, 126235, 254297, 171499, 139794, -52837, 59356, 78360, 309083, 360150, 39400, 100664, -152960, -139873, 112315, -99451, -113755, -170099, 183855, 203621, 324131, 336906, 200908, 754, 243886, 126962, 83748, 547655, 170522, 140095, 321258, 221728, 235311, 180262, 406406, 152850, 299980, 158841, 116369, 31673, -250450, 71954, 290354, 285369, -46922, 22419, -18368, -175073, 3466]
16141A60146B4554J21443a58558C64602j73048J17130a31860F8345J81387g1190
16130C81373j24424c65859B53755N849m2148g1620A94281a23385A37763a82789
16119I4602h0619k17852i1665d2077A31153k8885e0965A02882K4015J02971b0317
16107G4585R5934A4773N2933r833a35142B24137c6608n8546d2786o1837A57296
16095h3143c4347i611A32859c44118A40067b08183A5354J36312l034C7029M8052
16084H5081a05109d3997A09456c52355B17942L7089b23958D28750a2046A56747
16073A15934L2885a16443A78462B5848a02707M5047H4905C8543c03809B64787
16062B19653a75844A99611a56034B29745F8435a28783A09024b68773A98381M2666
$$ y = [160146, 24554, 145997, -158558, 364602, 191554, 308684, -131860, 68345, 249732, -71190, 381373, 256949, -365859, 253755, 259604, 217456, -71620, 194281, -123385, 137763, -182789, 94602, -80619, -298471, -91665, -42077, 131153, 102268, -50965, 102882, 126897, 229868, -20317, 74585, 170519, 14773, 67706, 57873, -135142, 224137, -36608, -95154, -42786, -104623, 157296, -83143, -34347, -9611, 132859, -344118, 140067, -208183, 15354, 151666, 148632, 37029, 85081, -105109, -43997, 109456, -352355, 217942, 255031, -223958, 428750, -12046, 156747, 115934, 148819, -116443, 178462, 25848, -102707, -57660, 84905, 38543, -303809, 264787, 219653, -175844, 199611, -156034, 229745, 68435, -128783, 109024, -268773, 198381, 241047]
16052B41047b58463a21282L8748c0613D4849P3700c00281a04289B48622j3509
16042B35113C7223a76014g1674B52912b97173A71296h9661l51833a1233A53199
16031A42328f3441j08906A75984a0832l7237E080b90606E2060J8522J57664M4773
16020B73019F8633f5735A38683F3488L14575E9731J7214d68352b508A47048a77070
16008a04133k31305A6063R114a49463f9203k654F6597J5194J11228d5458B41622
15996e564I0625b86685I2699O3396C4002a11230j40910A5022d30273C87552F4676
15984c8369H9949A6504e542j21256I3444e02I3236e3175B89086l4378a14703k90905
15972d05608i798C2333N3268J35170a02099k8416E0739J31951h4524A37705a25297
$$ y = [241047, -258463, -121282, -82534, -30613, 44849, 118549, -300281, -104289, 248622, 235113, 37223, -176014, -71674, 252912, -297173, 171296, -89661, -441494, -11233, 153199, 142328, -63441, -172347, 175984, -10832, -48069, 5080, -290606, 52060, 70582, 228246, 273019, 68633, -65735, 138683, 63488, 378063, 59731, 76945, -468352, -2508, 147048, -177070, -104133, -335438, 16063, 25177, -149463, -69203, -71857, 66597, 81791, 193019, -45458, 241622, -5564, 90625, -286685, 92699, 156095, 34002, -111230, -252140, 15022, -430273, 387552, 64676, -38369, 89949, 16504, -5542, -126798, 93444, -502, 93236, -53175, 289086, 254708, -114703, -405608, -9798, 32333, 85601, 220771, -102099, -130515, 50739, 182690, -84524, 137705, -125297]
15960C90706A45895a44874p302n110M5778a8445j84422j76887a74687J2587J2085
15949a50015c9355j25115L4242k4882e8549A75717E2083K56309n6562a15748B18766
15937a2205C428b10124i3194I4498K93825C2063a72522k3135H2826J61808D4078
15925G9651g2678B31476g2273a7000A94120c88459C2555h7606a4281A32892h1329
15913b53133e5990A07954L2880i6463l0351A1863b06760A97979b4182j91924h8325
15901a11227A58518E9283J53940b294p3411B4285a44636j44634D23280D7207f4906
15889c6107m8038o4579B00061a51598c3744j54730P2476q1810A7646b22482J03950
15878a18532D3072J72309b30175a09139B26766D3561c36251J57370A45801a14359
$$ y = [390706, 145895, -144874, -152176, -157286, -111508, -18445, -202867, -379754, -174687, -162100, -150015, -39355, -164470, -130228, -155110, -58549, 175717, 52083, 308392, 251830, -115748, 218766, -12205, 3428, -210124, -93194, 94498, 388323, 32063, -172522, -195657, 82826, 244634, 44078, 79651, -72678, 231476, -72273, -17000, 194120, -388459, 32555, -87606, -14281, 132892, -81329, -253133, -55990, 107954, 140834, -96463, -126814, 11863, -206760, 197979, -24182, -216106, -88325, -111227, 158518, 59283, 213223, -2294, -75705, 24285, -144636, -289270, 423280, 47207, -64906, -36107, -84145, -148724, 200061, -151598, -33744, -188474, -115998, -197808, 17646, -222482, -118532, 43072, 215381, -230175, -109139, 226766, 43561, -336251, -178881, 145801, -114359]
15867A41626i1527j4278A18270a10591A17055l3382m191O3500b62281A39539n0350
15856H9189a84496A20372d27039b4963C5758m170J44448a93532B09768j9879a70252
15844e6239C038a47446N8648e801I4490b47312g0070j61047G6399a25466J2431
15833a13035e5152j15265p754j72461j85562i5477G4773C1830a54404b3628p2723
15822i6351I9458a27586A4620b63061G0329a25127D4001e4453j2101E3415F391
15810A88939J67218i3388G2694J1166a75441p3392A88384a75020M3077F2332b83639
15798A39048d16856a9340n3886k47092g8700o0171k00393I0980A5731a93464M1191
15787a52273g4249o1355m7868K5257l80260i7088j03066A41864a7071E0841a49536
$$ y = [141626, -91527, -105805, 118270, -110591, 117055, 83673, 79482, 142982, -262281, 139539, 89189, -184496, 120372, -427039, -24963, 35758, 31588, 176036, -193532, 209768, 189889, -170252, -56239, 3038, -147446, -88798, -5801, 94490, -247312, -70070, -231117, 76399, -125466, -113035, -55152, -170417, -178171, -350632, -536194, -95477, 74773, 31830, -154404, -23628, -96351, 99458, -127586, 14620, -263061, 70329, -125127, 44001, -54453, -66554, 53415, 6391, 188939, 356157, -93388, 72694, 83860, -175441, -248833, 188384, -175020, -131943, 62332, -283639, 139048, -416856, -19340, -73226, -320318, -78700, -138871, -339264, 90980, 15731, -193464, -152273, -74249, -135604, -183472, -158215, -538475, -97088, -200154, 141864, -17071, 50841, -149536]
15775g702I3636B1395a7798j25246C56214B4612b0385j45161B6787L63638a54190
15763a62829g6943E1154a16564j10844A24638D1667J55792e4688A55500a85667
15752A31352J8406P2227a05494A23065c29870g6873j56260F5899b9977A06570
15741b84514B75597d9466p3852J5231k42770a8317k68596R9750j28797a16311
15730a14424M3299A8765e2619j11030k19381K3123R603J65331F5584j9859h4951
15718b80977J04186C4784d44377c246p0686n5602o6605q1230M0604c836r3589
15707i7425j78900I0566P70k9144F111g3672A37561h909C60001a2527p6519k0468
15695a09514L2661m0897h755j12549j28736J14320E896P1571j2982O0512c9697
$$ y = [-7702, 93636, 21395, -17798, -143044, 356214, 24612, -20385, -165546, 26787, 390425, -154190, -162829, -76943, 51154, -116564, -227408, 124638, 41667, 197459, -54688, 155500, -185667, 131352, 149758, 221985, -105494, 123065, -329870, -76873, -233133, 65899, -29977, 106570, -284514, 275597, -49466, -123318, -108087, -350857, -18317, -286913, -187163, -315960, -116311, -114424, -71125, 18765, -52619, -163649, -383030, -359907, -350304, -184973, 65584, 45725, -84951, -280977, -176791, 34784, -444377, -3246, -73932, -129534, -196139, -277369, -236765, -3836, -97425, -276325, 90566, 91336, 62192, 6111, -73672, 137561, -8909, 360001, -12527, -89046, -109514, -76853, -117750, -8755, -121304, -250040, -135720, 5896, 77467, 64485, 124997, -39697]
15683C6013J9121b70445B14183L5180D5020a33307l3377b4916A34219d1657j565
15672d3222k32862f594B1161a15518A13670a9125k41964a03732C0995A513J4849
15661A6362f812A13318c25920h1918A2165b06981d6373B046c43173B2202b40909
15649b83144B58612F1062a09854l4093B29779M2908H4856e72268G8893h1591L818
15638g7773L2559E006b44767O3689P6195L0916B2316b5811q0012j73282C31686
15626d5227B10430A03874J1909a35121A38391b48658H6983a82299j49745i5679
15615H0020e192A72961C4022b49546A17990a31755H7270J02501b94629K961B06252
15603b56825J02674f897k01919k90501d9925C7785J23019c03915h5229K6453k35699
$$ y = [36013, 55134, -270445, 214183, 249363, 45020, -133307, -166684, -24916, 134219, -41657, -43222, -276084, -6594, 21161, -115518, 113670, -19125, -261089, -103732, 30995, 1513, 16362, -6812, 113318, -325920, -81918, 12165, -206981, -46373, 2046, -343173, 22202, -240909, -283144, 258612, 61062, -109854, -143947, 229779, 272687, 84856, -572268, 78893, -81591, -77773, -45214, 5006, -244767, -181078, -104883, -73967, 22316, -25811, -105823, -279105, 331686, -45227, 210430, 103874, 115783, -135121, 138391, -248658, 86983, -182299, -332044, -95679, 80020, -5192, 172961, 34022, -249546, 117990, -131755, 87270, 189771, -294629, -291668, 206252, -256825, -154151, -6897, -208816, -499317, -49925, 37785, 160804, -303915, -85229, -58776, -294475]
15592b94475A2488M48090j77812B1275b62214R1157h972k33657C504J90618b52686
15580e4053J5106a7139k08447B60913P217b03841I9576G727K55953G5001J04156
15569A79157d0818b887A04524c22895A19346a49412A100J37165N2190b15487A76874
15557H8232b05888k9336A31995e5723k19848a05936d4280m5656M0125j96876B8246
15545A21199a67580N1737e592j74412n1609F2369J85995a99567G5884R6217i282
15533h963A81089c26819B26447c41324C9366d3304k6515k2710k85812A71468b68464
15521G4479b08438C0403J78420E9790f0488J2760J1296B35955d8047D88043b20121
15509B6295J42688m0176O4088b79515A01498d9327j74849G1185a2318A96601a32958
$$ y = [-294475, 12488, 460578, 282766, 21275, -262214, -171057, -8972, -242629, 3504, 194122, -252686, -54053, -38947, -17139, -225586, 260913, 268130, -203841, 99576, 7727, 263680, 75001, 179157, -40818, -2887, 104524, -322895, 119346, -149412, 1100, 138265, 190455, -215487, 176874, 88232, -205888, -235224, 131995, -55723, -275571, -105936, -44280, -89936, -49811, -246687, 28246, 121199, -167580, -115843, -5592, -180004, -231613, 62369, 248364, -199567, 75884, 172101, -9282, -8963, 181089, -326819, 226447, -341324, 39366, -43304, -69819, -92529, -378341, 171468, -268464, 74479, -208438, 30403, 208823, 59790, -60488, -47728, -36432, 235955, -48047, 488043, -220121, 26295, 168983, 128807, 192895, -279515, 101498, -49327, -224176, 71185, -12318, 196601, -132958]
15497b83830A6068J4907b68835E9709c35104R4877o48D6436J91612i891l1425
15486d1316p8251A68081a12174I8242K9895i7363A84113D2374b43862h1563o4750
15475a46313O1513j03938c1213A71815D2699q000e524B8599b37042I4286a95196
15463A7721a36775j50979j3842h1127j89223a5846j8445E6494j3277J25039k79
15452A67977P1410a9010j13854l7042A0991R7469a32068F6201e7282A9939f1028
15440H9227e17490A66624m9025e0806A4345J11384a97354m2873B63330C350L44124
15429C47474j25282h6614k50275L5108B43745a03807l6946n6060C9633a40766
15418C72451a56080m051j2121O2727G5506B38J97010p9261L26012I649J51098
$$ y = [-283830, 16068, 30975, -268835, 59709, -335104, -240227, -240875, 46436, 238048, -9891, -41316, -119567, 168081, -112174, 98242, 128137, -97363, 184113, 42374, -243862, -81563, -146313, -84800, -188738, -31213, 171815, 42699, 34699, -5524, 28599, -237042, 94286, -195196, 17721, -136775, -287754, -301596, -81127, -270350, -15846, -34291, 56494, 43217, 168256, 167977, 239387, -19010, -132864, -169906, 10991, 108460, -132068, 66201, -57282, 19939, -61028, 89227, -517490, 166624, 117599, -50806, 14345, 125729, -197354, -240227, 263330, 3350, 347474, 222192, -86614, -336889, -301781, 243745, -103807, -140753, -196813, 39633, -140766, 372451, -156080, -160131, -172252, -109525, 75506, 238, 197248, 117987, 443999, 9649, 160747]
15407A60747h5187C66703a21624r162G0786A3759J58673J7435c01375A6158b58513
15395a00666B7763a66112C7650h8388H8214J02016p5531D1552b4556B82123Q904
15384B91027a44559K2189m5060N7628A53873b95588h2632j58070l3121A42491
15373F1980J09857b83866c5025k1689A45640F0665c09693A11264M247L3914D0266
15361a97741A00099m6305J72936h0521A31571C8978O3924a08275B82945d0394
15350a51967n1n8066B96377d5755n066l7911G1301K8731b6428k75123J7354c002
15337a2000B20220e0876k39933K5051B88410q0685F8642N930k6599b97060f9566
15325G4522B3181a23638A59812f3051B11579d0972k17612A43063B4291d8923r0478
$$ y = [160747, -85187, 366703, -121624, -130786, 70786, 13759, 172432, 189867, -301375, 16158, -258513, -100666, 27763, -166112, 37650, -88388, 88214, 190230, 114699, 41552, -24556, 282123, 291027, -144559, -122370, -167430, -109802, 153873, -295588, -82632, -240702, -273823, 142491, 61980, 171837, -283866, -35025, -56714, 145640, 60665, -309693, 111264, 115511, 149425, 40266, -197741, 100099, 53794, 226730, -80521, 131571, 38978, 102902, -108275, 282945, -40394, -151967, -152018, -210084, 296377, -45755, -50821, -88732, 71301, 100032, -26428, -301551, -284197, -3002, -12000, 220220, -50876, -290809, -265758, 288410, 207725, 68642, 74572, 47973, -297060, -69566, 74522, 23181, -123638, 159812, -63051, 211579, -40972, -258584, 143063, 24291, -48923, -139401]
15314a39401A73254i8741D7559c37261F6471J8313J71346a33503J7779j27174
15304b42898B45908q3981h7992j647j3123c5553H6435c8922o630K0440C69537
15292C11061D8213i6590C69565A390K77326M0230A57988r559a23117k05941B56473
15280B53291H3330a2956k16085L3279C2267b03345N7450E7404J26014R1130C6743
15268i8172k6840a682q6949r3054J4457e6262G8288d3743A9025O7379L5201J46347
15256B67952a80719J2434e2780m7511C65993m4570M10724j22695O97946K46945
15246A554343j86478J40584o18695A81618N2051d41629b9331j20593H6218J5506
15236A01724k2515J78905a0100H303a99751I2351P4160h5780E711a5023B28143
$$ y = [-139401, 173254, -98741, 47559, -337261, 66471, 84784, 256130, -133503, -115724, -242898, 245908, 161927, -87992, -89639, -102762, -35553, 86435, -38922, -45552, -25112, 369537, 311061, 48213, -96590, 369565, 1390, 278716, 318946, 157988, 148429, -123117, -329058, 256473, 253291, 83330, -12956, -229041, -195762, 32267, -203345, -145895, 57404, 183418, 274548, 36743, -98172, -125012, -1682, -88631, -181685, -167228, -56262, 78288, -43743, 19025, 86404, 121605, 267952, -180719, -168285, -52780, -100291, 365993, 321423, 732147, 609452, 1307398, 1554343, 1367865, 1508449, 889754, 181618, 233669, -441629, -29331, -149924, 86218, 101724, 79209, 258114, -10100, 8303, -199751, 92351, 166511, -85780, 5711, -15023, 228143]
15224B69416j20120a60178q1756g7050A51103m8193j9728P4960a01007B17141
15213h1345A8812J00843C5778M8523a77034j06637B11425a46731B17066F3035
15202A54078C3740b56791a23283B96316b92065A60068N831H601J90836b07417
15191f5067A50545M24889a34639o3738g0892r91p6750A13297d5154a9671r7434
15180a17105E82844D1905L32403b36502c8840B90706o3601G4250k7371k2029Q5985
15169A10835a95586B64023P1115i3843A34684A1207J00537a35097A8175K9110
15159D7285a01237A44527J20544a34046c0662A17271c1741A71287K4979J3117
15149B09383F3913a25730j68877E3575M4811J0017A8509L11876A55582O3241p4299
$$ y = [269416, 149296, -160178, -241934, -77050, 151103, 102910, 83182, 158142, -101007, 217141, -81345, 18812, 119655, 35778, 84301, -177034, -283671, 211425, -146731, 217066, 63035, 154078, 33740, -256791, -123283, 296316, -292065, 160068, 165899, 8601, 199437, -207417, -65067, 150545, 575434, -134639, -198377, -70892, -71883, -148633, 113297, -45154, -19671, -117105, 582844, 41905, 374308, -236502, -38840, 290706, 227105, 74250, 46879, 24850, 110835, -195586, 264023, 335138, -93843, 134684, 11207, 111744, -135097, 18175, 47285, -101237, 144527, 265071, -134046, -30662, 117271, -31741, 171287, 196266, 209383, 63913, -125730, -294607, 53575, 98386, 108403, 18509, 330385, 155582, 218823, 144524]
15138A44524i4541j1604b9277j012j9104B52704o6340B9996e1582k68021A58933
15126D94891j76921E7576K40105N8556A43100b11012e060E9403K39794A17468
15115F2697a62793M6044A9941R0943k2172J85062E8874J8251J90764a78546B75535
15103A5859M44708I4429a2595o761o4248A4861K43457j14255a83859C15270C0072
15091b25167f1708H4166O3370J80198G8810b04248C52262j4231A13751F076a09207
15079A01785K63363d67309H3948L3878a224A05393A5796f3802K3697k03129B8366
15067C37528H9695f0621B6873j2389P4745J22181a48418H3115C0396b50684F7300
15055c4496J1725r3696C00530A9129K483J29869O6936F5080J48621B0027L9925
$$ y = [144524, -94541, -106145, -29277, -30289, -49393, 252704, 186364, 29996, -51582, -319603, 158933, 494891, 317970, 57576, 297681, 356237, 143100, -211012, -5060, 59403, 299197, 117468, 62697, -162793, -116749, 19941, 110884, 88712, 273774, 58874, 77125, 267889, -178546, 275535, 15859, 460567, 94429, -12595, -19356, -83604, 14861, 258318, 144063, -183859, 315270, 30072, -225167, -61708, 84166, 147536, 327734, 78810, -204248, 352262, 338031, 113751, 6076, -109207, 101785, 365148, -467309, 83948, 117826, -1224, 105393, 15796, -63802, -40105, -243234, 28366, 337528, 89695, -60621, 26873, 14484, 89229, 211410, -148418, 83115, 30396, -250684, 67300, -34496, -22771, -116467, 300530, 19129, 21612, 151481, 218417, 65080, 213701, 20027, 59952]
15044E9952L54879f8250k1017B12925c8709F9489A3078J69251M6932r5206f6746
15032G2939M00678B16227a42155C93428I5779J70083p5439P6773J6678A15333
15021H6134q829J19803N0632M3950c65019A48830L10502A97804I0348g1130A94365
15009I3069A5359J73016P8614O329o4033a16350A96975c6300B07072e2234m3013
14998i5247l7757B18682K52728L8415A99962j15a09248A06183J99080G565L6197
14987D3762M16640C5225Q4310J59058j17500J42929A29904A1064L02192m0394
14977B72862j30749L31455A76971d7261F7494A6381n580K07446j04401c8024A72864
14965i8647C87406J66957D6401K73103j9188J22227j78906L7036D5787L90418
$$ y = [59952, 414831, -68250, -89267, 212925, -38709, 69489, 13078, 182329, 229261, 134055, -66746, 72939, 473617, 216227, -142155, 393428, 95779, 265862, 190423, 267196, 283874, 115333, 86134, 77305, 197108, 247740, 291690, -365019, 148830, 459332, 197804, 90348, -71130, 194365, 93069, 15359, 188375, 266989, 273318, 209285, -116350, 196975, -36300, 207072, -52234, -95247, -133004, 218682, 471410, 509825, 199962, 199847, -109248, 106183, 305263, 7565, 43762, 460402, 35225, 119535, 278593, 161093, 304022, 129904, 11064, 313256, 272862, 142113, 473568, 176971, -47261, 67494, 16381, 10801, 218247, 113846, -38024, 172864, -98647, 387406, 554363, 46401, 319504, 300316, 422543, 243637, 280673, 45787, 436205]
14955D36205H1859K63037j51054J37011a7644C97056A66510c2047B84849Q3548
14945C68397m193p8523k7202P513C0278L15075j09338p0015k5255J54279j06138
14934A88886l0908E5392J53739B8644J28940i286o784C00177A25556m4513K89620
14923C70663J4119p0968A25653M21056g5423E06909F1587d6699D02716j92910
14913B09806K30504J16068B36247h620B04960i0B74545j00708K1713J16499c1250
14901C86231q1724R9078Q7997k31066G3516K14683A24893J53343a3599B73875
14890E53400B75883J18245m8433h4985C03465K36903k31588K15120J77794B88597
14879F01169B84688A6584M35196N8896k43776K067a2268D08967P3615B14255J75685
$$ y = [436205, 81859, 344896, 193842, 330853, -17644, 397056, 166510, -32047, 284849, 368397, 364204, 285681, 258479, 265992, 30278, 345353, 236015, 166000, 140745, 295024, 188886, 157978, 55392, 209131, 28644, 157584, -9286, -16070, 300177, 125556, 81043, 370663, 384782, 313814, 125653, 546709, -75423, 506909, 61587, -46699, 402716, 209806, 440310, 556378, 236247, -8620, 204960, -90, 274545, 173837, 195550, 312049, -31250, 386231, 304507, 403585, 491582, 260516, 73516, 288199, 124893, 278236, -13599, 273875, 553400, 275883, 394128, 345695, -84985, 303465, 540368, 308780, 523900, 701694, 288597, 601169, 284688, 16584, 451780, 510676, 266900, 268967, -12268, 408967, 482582, 214255, 389940]
14868C89940A45073q176L59313A76737p2627M32199A67006M88080k59021A33049
14857C27421M9275j66762L90270k84922h6453E26446R5765j11066m3012B26487
14846C53449A63664Q1050M9851K76817M042G9744L84735m8407B06595K72881l1049
14835D48427j22778M5061L28914C20700M19943A43367K88828j31258Q3895J08035
14825D92867A85362J96359o4661j3179Q2688L94510k98750k33783R7702J95888
14815E42136Q6294j9364j03718k48709J82935n0650K95598k37237J8992q033j39991
14804C18253j4028h758D52771j4014K22720n7491r2291B29104K08513L79516l09845
14793E07288N0617k14147J27497O4334j7129q559K4212j36704j7209J28696K2066
$$ y = [389940, 145073, 136897, 496210, 176737, 104110, 536309, 167006, 655086, 396065, 133049, 327421, 376696, 209934, 600204, 315282, -86453, 526446, 622211, 511145, 468133, 226487, 353449, 163664, 244714, 294565, 571382, 575424, 79744, 464479, 416072, 206595, 479476, 448427, 325649, 370710, 699624, 320700, 740643, 143367, 432195, 300937, 384832, 492867, 185362, 381721, 317060, 303881, 386569, 781079, 482329, 248546, 346248, 542136, 628430, 609066, 505348, 256639, 439574, 388924, 684522, 447285, 466277, 458244, 318253, 304225, -8758, 452771, 438757, 661477, 603986, 511695, 229104, 437617, 817133, 507288, 557905, 343758, 471255, 535589, 518460, 509901, 534113, 397409, 380200, 508896, 530962]
14782E30962B61562J45905J45649J33929j79652m0141j41899K15108j02181K51516
14772F89796m0078k65339J20894k9940l1814L72847l33099j32495N24912k03862
14762F71822m5925M8845l29111j2195J75980j16113K52097j97010L04972K90632
14752A043994k48837k02168l778K66968R1789m26405K46861n0821J320k05652
14742E13271L54521r1525j73569Q152j84059J24599k2967M62386j72973j19145
14732F98691R1773k71987k11687K53555m319J11558j74195M48346m18646K14244
14722G37333P0873L5140J0907j403j58398J80468l31380L59134j82424R8355J4723
14711H33328N8407j32931j92409m5083K76319k80742J40034J88777j73358M88303
$$ y = [530962, 261562, 407467, 553116, 687045, 507393, 467252, 325353, 540461, 438280, 689796, 649718, 384379, 505273, 475333, 443519, 816366, 483267, 350772, 875684, 671822, 625897, 674742, 345631, 333436, 509416, 393303, 645400, 448390, 753362, 1043994, 795157, 592989, 589211, 856179, 947968, 521563, 768424, 717603, 718923, 513271, 867792, 776267, 602698, 610850, 426791, 551390, 528423, 990809, 817836, 698691, 790464, 518477, 306790, 560345, 556026, 667584, 493389, 941735, 523089, 737333, 808206, 843346, 854253, 852850, 694452, 874920, 543540, 902674, 720250, 818605, 833328, 891735, 758804, 566395, 521312, 797631, 516889, 656923, 845700, 672342, 1160645]
14701A160645k93447k9039n8078k34812K47145J43705m22313M53807l17366L76066
14691A026313l61421J94492J91995D78513O06300j46573j65008J37761m2767j17537
14681G50689o74j63770K57880n7479Q636K77619k44330L8339j60161L61637l91700
14670F76686M57473k70012M5771j64041l8970L19773m54376J19949O7071J80212
14660I39536L22239l20806J89238k83401L38588k06028k81715K98497j9815j73118
14650H03215M38627k64810J13506K11268n4509l12869k5309J19686N5886J58891
14640A243582m91210K67420L40485l12123N4689J21008r3430l2129k95980K23927
14630A026239L95677m73668K3586K41053L8621J42419K9141k56525K61388j20099
$$ y = [1160645, 867198, 838159, 780081, 545269, 792414, 936119, 513806, 967613, 650247, 1026313, 664892, 859384, 1051379, 478513, 1084813, 938240, 773232, 910993, 868226, 750689, 750015, 586245, 844125, 786646, 795282, 1072901, 828571, 866910, 706749, 1068386, 676686, 1134159, 864147, 909918, 745877, 706907, 1026680, 572304, 692253, 759324, 939536, 1261775, 940969, 1130207, 846806, 1185394, 979366, 697651, 996148, 976333, 803215, 1241842, 977032, 1090538, 1301806, 1247297, 934428, 909119, 1028805, 1084691, 1243582, 752372, 1019792, 1360277, 1048154, 1102843, 1223851, 1130421, 1098292, 802312, 1026239, 1421916, 948248, 971834, 1212887, 1251508, 1393927, 1423068, 1166543, 1427931, 1307832]
14620A307832m08870L79944J79484j53842K63588n59955p2834O24755k87056J3398
14610A286444K53577j54477j96724K9645j69313K37029N37937k07797l12269J51157
14600A455209j23373J66800m7333K92138l70376K66713l12401J8658M1052j091
14590A385996L24008j61635L67192m22748L70495j80190P613r1354N27298m11099
14580A715576P9118j05598K09338j91529J47165J33562j26287J80270j10445j20526
14570A810644O35250k92850O2654j29148K14304k38956j36530N13154j53958K68724
14560B553288k98974M91107j95011k14982O25617K42765L64549J88434N98709
14551D355502P48040J208511K485403M447624O549282J1866160M765858j2413773
$$ y = [1307832, 898962, 1278906, 1458390, 1304548, 1568136, 1008181, 935347, 1560102, 1273046, 1286444, 1540021, 1385544, 1188820, 1218465, 1049152, 1286181, 1824118, 1616321, 1304052, 1455209, 1331836, 1498636, 1451303, 1743441, 1373065, 1639778, 1327377, 1346035, 1387087, 1385996, 1710004, 1548369, 1915561, 1492813, 1863308, 1683118, 1690731, 1599377, 2126675, 1715576, 1794694, 1689096, 1898434, 1706905, 1854070, 1987632, 1861345, 2041615, 1931170, 1810644, 2445894, 2153044, 2215698, 2086550, 2300854, 2061898, 1925368, 2438522, 2284564, 2553288, 2254314, 2745421, 2550410, 2335428, 2961045, 3203810, 3568359, 3756793, 4355502, 5103542, 6312053, 8797456, 13245080, 19794362, 31660522, 36426380, 24012607]
14543B4012607A1255029E462079k058044r98400n7841j54327n01054L1222N8055
14534A781690L59929l18911J45457K44663O3477l01698j47681l8883J92273Q0850
14524B061166N0726J7882P2392n7986M46899j89574j59438l4510L03051m4212
14514B466396j75694J59873K18053j38111n1317M7520K36680o0396j66455J71062
14504B707611k70627m5106K87651k71417L26201M00974r432j59560J59990j26161
14494C000124K05338j68648Q3366j32359k4585m8737M50900j67505L40962j81471
14484C357385l7607K29169J34193j16801l25561L7690M10220J22092j45576K2059
14474C687263j33893Q8196M7298o180R0153J78609j22604K03147M30983l09152
$$ y = [24012607, 11255029, 5462079, 3404035, 2405635, 2347794, 2193467, 1692413, 1723635, 1781690, 2141619, 1822708, 1968165, 2212828, 2276305, 1974607, 1826926, 1788043, 1980316, 2061166, 2111892, 2129774, 2202166, 2144180, 2591079, 2401505, 2242067, 2207557, 2510608, 2466396, 2290702, 2450575, 2668628, 2530517, 2479200, 2526720, 2763400, 2703004, 2536549, 2707611, 2436984, 2391878, 2679529, 2408112, 2734313, 3135287, 3125855, 2966295, 3126285, 3000124, 3205462, 3036814, 3120180, 2987821, 2963236, 2914499, 3365399, 3197894, 3538856, 3357385, 3319778, 3548947, 3683140, 3566339, 3240778, 3278468, 3688688, 3810780, 3665204, 3687263, 3553370, 3641566, 3688864, 3682684, 3772837, 3951446, 3828842, 4031989, 4462972, 4153820]
14464D153820k78256M75805o4499L72894j42380m53412L03395K60869K9077J29575
14454D786888p9888j76214q7488N89763N3026n0950l19635L84436J46124j96399
14444E049663J71843O4434K58049l66762N50564J80061n07259M99123r1892k7
14434E807797K50681K684l8249K85487N89911m27830l16329N70494k20913M0780
14424F544513K62503J20111J90827J05527P5118m0774K89821j2395L9212j71584
14414G402879M74194Q3506R2600K37465k22596O60316k33726K44275J68650j69828
14404H737735K81082M30526j85501J40538R4144J55556O30334r9215L45307K65403
14394A0795909l43805L83030J20379K37882N4819L16571M26468K60815k21430
$$ y = [4153820, 3875564, 4351369, 4286870, 4659764, 4517384, 4063972, 4367367, 4628236, 4657313, 4786888, 4707000, 4530786, 4443298, 5033061, 5086087, 5035137, 4715502, 5099938, 5246062, 5049663, 5221506, 5285940, 5543989, 5177227, 5727791, 5907852, 5400593, 5899716, 5807824, 5807797, 6058478, 6061162, 6022913, 6308400, 6898311, 6470481, 6154152, 6724646, 6503733, 6544513, 6807016, 6927127, 7117954, 7223481, 7298599, 7257825, 7547646, 7535251, 7574463, 7402879, 7877073, 7960579, 8053179, 8290644, 8068048, 8728364, 8494638, 8738913, 8907563, 8737735, 9018817, 9449343, 9263842, 9404380, 9498524, 9654080, 10284414, 10185199, 10530506, 10795909, 10452104, 10835134, 10955513, 11193395, 11248214, 11564785, 11991253, 12252068, 12030638]
14385A2030638M52051L72074m9021Q8328M34727M10280Q5363M08377j8573J63179
14375A4377423K90784M49652j54684J057660Q3843K72079N94081J67212K63923
14366A7401973J67939P77449J53826M83874M16885N39842L69507J69812N91300
14357B1072407Q48702j6767J056427J10687Q82193O53443N68459N53923L54683
14348B6084157Q96619O69906M76653N04285J212204P40822P89371P33318O25836
14339C2733171J547987O61338J128511P26188J209456J153734J143552J094844
14331D1398781J135661J352699J533797J592823J505774J812227J373872J680038
14323E3385672K222177J887285J440377K226147K663403K125472K512202K830168
$$ y = [12030638, 12482689, 12854763, 12805742, 12894070, 13328797, 13739077, 13824440, 14232817, 14214244, 14377423, 14668207, 15117859, 14963175, 16020835, 16104678, 16376757, 16970838, 17138050, 17401973, 17569912, 18347361, 18501187, 18985061, 19401946, 19941788, 20311295, 20481107, 21072407, 21921109, 21904342, 22960769, 23071456, 23953649, 24607092, 25175551, 25729474, 26084157, 26980776, 27650682, 28127335, 28631620, 29843824, 30584646, 31374017, 32107335, 32733171, 34281158, 34942496, 36071007, 36797195, 38006651, 39160385, 40303937, 41398781, 42534442, 43887141, 45420938, 47013761, 48519535, 50331762, 51705634, 53385672, 55607849, 57495134, 58935511, 61161658, 63825061, 65950533, 68462735, 71292903]
14315G1292903K835543K731402L070486L277091L576547L230871L820209M362079
14307I8197131M272271M599602N021488N497142N210662N685542O222310P080833
14299A41786981O899595P405415Q166084Q193627Q912980R721373J0262719J0648353
14291B11997127J1229633J1853206J2762559J3205482J3647809J4583811J5108691
14284C04388318J5129917J6034944J5618941J6513125J5973024J5328061J4651024
14277D13637354J3780734J2516573R725886O390674M105078J968836J074185Q06205
14269D64005525j32835k002819l496747o620032j0002977j1799114j3479680j5069141
14261D01402180j5915807j6037568j6113881j6382197j6185246j5944304j4709146
$$ y = [71292903, 74128446, 76859848, 79930334, 83207425, 86783972, 90014843, 93835052, 98197131, 102469402, 107069004, 112090492, 117587634, 122798296, 128483838, 134706148, 141786981, 148686576, 156091991, 164258075, 172451702, 181364682, 191086055, 201348774, 211997127, 223226760, 235079966, 247842525, 261048007, 274695816, 289279627, 304388318, 319518235, 335553179, 351172120, 367685245, 383658269, 398986330, 413637354, 427418088, 439934661, 449660547, 456051221, 460156299, 462125135, 463199320, 464005525, 463872690, 461869871, 458373124, 451753092, 441750115, 429951001, 416471321, 401402180, 385486373, 369448805, 353334924, 336952727, 320767481, 304823177, 290114031]
14254B90114031j3666520j4288449j3441507j2600307j2131163j1661866j0594677
14247B01729542j0048958r833035q896579q031287q029789p553318p109122o889913
14239A35337541n703869n912091n624948n092001m880015m605605m447082l701357
14231I5370573l941081l647637l048658m112052k561706l380606k759953k413362
14223F9505518k637142k502797k221199k006326k147524j936635j912648j873044
14215E2268203j409213j385522j503688j600338j398428j218659j378250j507874
14207D0866231l10670j268306j341042j089212r55745j099287o56879j275157
14199C2869933m97853j037373j191434o60160n26128n12246o04403o06929j070601
$$ y = [290114031, 276447511, 262159062, 248717555, 236117248, 223986085, 212324219, 201729542, 191680584, 181847549, 172950970, 164919683, 156889894, 149336576, 142227454, 135337541, 129633672, 123721581, 118096633, 113004632, 108124617, 103519012, 99071930, 95370573, 91429492, 87781855, 84733197, 80621145, 78059439, 74678833, 71918880, 69505518, 66868376, 64365579, 62144380, 60138054, 57990530, 56053895, 54141247, 52268203, 50858990, 49473468, 47969780, 46369442, 44971014, 43752355, 42374105, 40866231, 40555561, 39287255, 37946213, 36857001, 35901256, 34801969, 34145090, 32869933, 32372080, 31334707, 30143273, 29483113, 28956985, 28444739, 27840336, 27233407, 26162806]
14190B6162806l71696r40624n69692n48623n57561n67100j43851p30163m72087
14181B1261409l13138p64136m22983j71995m32701n21608l29609k94049m24071
14172A7587119k25888n30026m11279k6916o22851k77096k02404Q0451n57511j72563
14162A4641036n35796j89080j15737l59640J39738l53193m66020j10544l37102
14153A2313662L423m3064o14021k8226j97373m96986J99281m04820k12360M6034
14143A0565550m13436J9272k06554m20217R1715J02349N005k34049K69261p54566
14133I024330k0232j9233n40449K96257l86432L1699J2904l66750L19109l06389
14123H044814k33693l73326Q0746p7039l50175K24523l0109m6993k70427M1443
$$ y = [26162806, 25791110, 24850486, 24280794, 23732171, 23174610, 22607510, 22463659, 21733496, 21261409, 20948271, 20184135, 19761152, 19589157, 19156456, 18634848, 18305239, 18011190, 17587119, 17361231, 16831205, 16419926, 16393010, 15770159, 15493063, 15290659, 15371110, 14813599, 14641036, 14105240, 13916160, 13800423, 13440783, 13580521, 13227328, 12761308, 12650764, 12313662, 12317085, 12274021, 11660000, 11631774, 11434401, 10937415, 11136696, 10731876, 10519516, 10565550, 10152114, 10171386, 9964832, 9544615, 9636330, 9738679, 9743684, 9509635, 9778896, 9024330, 9004098, 8984865, 8444416, 8740673, 8354241, 8385940, 8398844, 8032094, 8351203, 8044814, 7811121, 7437795, 7518541, 7441502, 7091327, 7315850, 7285741, 7238748, 6968321, 7009764]
14113G009764q1658o5848k49935k65649O6206K41085p61474M99022k87091j50872
14103E953550K52933m51640j29548J21596K4300m1390M40848m52478o56804N58328
14093E619695l02440n5095l94508K28559J94660j09857k65959k78n1233j07919
14083D755625j26036j1427M6172O4886L5326j18715k45661L10066j02661n91829
14073D015746L13916J3110j22960J80614m65066J77227m03211L44655k36826K95532
14063D112737P029j66263l05769Q2796J08048k2994j56977j2071K68283m78649
14053C436170l9108M76797m41177O6094l26359P0331J95188j50487L7230k84674
14043C040005M38254r509o2948k12269k6767j60928r7153K62724k61211J29351
$$ y = [7009764, 6928106, 6862258, 6612323, 6346674, 6412880, 6653965, 5892491, 6391513, 6104422, 5953550, 6206483, 5754843, 5625295, 5746891, 5771191, 5729801, 6170649, 5718171, 5061367, 5619695, 5317255, 5262160, 4867652, 5096211, 5290871, 5181014, 4915055, 4914777, 4863544, 4755625, 4629589, 4618162, 4664334, 4729220, 4764546, 4645831, 4400170, 4710236, 4607575, 4015746, 4329662, 4342772, 4219812, 4400426, 3935360, 4112587, 3709376, 4054031, 3817205, 4112737, 4119766, 3953503, 3647734, 3730530, 3838578, 3815584, 3658607, 3646536, 3914819, 3436170, 3397062, 3873859, 3432682, 3498776, 3172417, 3242748, 3437936, 3287449, 3324679, 3040005, 3478259, 3468750, 3405802, 3193533, 3166766, 3005838, 2908685, 3171409, 2910198, 3039549]
14033C039549m25170N29427l33054J56724j83178J71043j80329J24572R4275k80455
14023B713404j80246j23877K19987J24069k09934J21565k64621p4146J32908K8937
14013B488046L08147l95183j96555J40136r7828l92286N83536l55485p3887M05411
14003B414052k33628K5794l20514K97886k58168J66290K30834j96248K29728j57844
13993B198182K06860K27161M04328Q25739J387831L519786O100934J2308681R054000
13984C6233502j0812826j1335724n733941j742549j847446p66033l29502j83424
13976C482057k81248m04778K5710M617j69499Q3471l54421L43372n65272k7497
13966B136512L20369k14247L8225L5013l02154k86276M58059j22353p9321m5925
$$ y = [3039549, 2614379, 3143806, 2810752, 2967476, 2784298, 2955341, 2775012, 2899584, 2993859, 2713404, 2533158, 2409281, 2629268, 2753337, 2543403, 2664968, 2400347, 2326201, 2459109, 2488046, 2796193, 2401010, 2204455, 2344591, 2246763, 1854477, 2438013, 2082528, 2008641, 2414052, 2180424, 2206218, 1885704, 2183590, 1925422, 2091712, 2322546, 2126298, 2356026, 2198182, 2405042, 2632203, 3036531, 3862270, 5250101, 8769887, 14870821, 27179502, 36233502, 25420676, 14084952, 8351011, 6608462, 4761016, 3994983, 3665481, 3482057, 3200809, 2796031, 2821741, 2826358, 2656859, 2740330, 2385909, 2729281, 2164009, 2136512, 2456881, 2242634, 2280859, 2315872, 2013718, 1727442, 2185501, 2063148, 1983827, 1937902]
13956A937902N295J52410l87671K45449J46992m25500M02534m1847j94733J43337
13946A984168Q0811l18541j22941J27936K50666m88406M6850n25806P12998o924
13936A740811k18365M18755l34540l4954n7005J51582m5684k67803P8615J20036
13926A551448k67666K26386L96513m21442p3864K385k34855J65856m6219k1599
13916A276943J459M3519N0103J25803j88904n8825J70454J38141j77630q6357
13906A294706L0915l71684M96836k96067M17676k41462j30182L09716l30461L7702
13896A217695L3895J45925j01886j08948Q7520j73833N65211m14760r9864n7312
13886A093643p8828K33457k63637n3733J71210k56752Q18033m25342k67588M39936
$$ y = [1937902, 1943197, 2095607, 1707936, 1953385, 2100377, 1674877, 2077411, 2035564, 1840831, 1984168, 2064979, 1746438, 1623497, 1751433, 2002099, 1513693, 1560543, 1034737, 1747735, 1740811, 1522446, 1941201, 1606661, 1571707, 1514702, 1666284, 1620600, 1352797, 1431412, 1551448, 1283782, 1510168, 1906681, 1485239, 1411375, 1413760, 1178905, 1344761, 1298542, 1276943, 1278402, 1321921, 1372024, 1497827, 1308923, 1250098, 1420552, 1558693, 1381063, 1294706, 1325621, 953937, 1450773, 1154706, 1572382, 1330920, 1200738, 1510454, 1179993, 1217695, 1251590, 1397515, 1295629, 1186681, 1274201, 1100368, 1665579, 1250819, 1150955, 1093643, 1014815, 1248272, 984635, 930902, 1102112, 845360, 1663393, 1238051, 970463, 1410399]
13876A410399j98908j69439Q1704j27310J04532l24563K88582m6512K24072j94619
13866A047938n3228K27452j05947j4795r3857J09149m02613K05197J06537J79950
13856A205783k242J63703n20523K16902p1225L27955n83305K38594j29430j57242
13846F88970K90764j92234J66970n0697j09602j15552L99949m34700J77051J96514
13836A017433m69366L71873Q1635L48045k77204k43495L15769k41244P4550K1441
13826I99437L8833l31578O7384J45108j50652j1340K37596m45095K17363N258
13816G72314k3489K01014k90090M28423j33524J52679k9669j10545m55664M2996
13806E54445L89206j95483n8266R7448r544q1122M86811n17182J10393K32035
$$ y = [1410399, 1211491, 1042052, 1123756, 996446, 1100978, 776415, 1064997, 1018485, 1242557, 1047938, 994710, 1222162, 1116215, 1101420, 1007563, 1116712, 714099, 919296, 1025833, 1205783, 1203541, 1367244, 846721, 1063623, 992398, 1320353, 737048, 975642, 846212, 688970, 979734, 787500, 954470, 903773, 794171, 678619, 1078568, 643868, 820919, 1017433, 548067, 919940, 1001575, 1349620, 1072416, 828921, 1144690, 903446, 977996, 999437, 1038270, 706692, 774076, 919184, 768532, 757192, 994788, 549693, 767056, 772314, 748825, 949839, 659749, 1088172, 954648, 1107327, 1077658, 967113, 511449, 554445, 943651, 748168, 689902, 787350, 777806, 696684, 1183495, 666313, 776706, 1008741]
13796A008741j94167J03874k24460J86527M1867O9966n4760j43142j25185j43812
13786E25449J87219j15439k68841N17213J85544n14828K16626P370j70343K7816
13776E97786Q2234J37004J19551m14534J69914j73067J70032O8582M0863P3209
13766H71574k24170K26045C64053J2473L95698P3180j12599j68839P5156j42874
13756D96248J20298j70549M40180n9042C05538P5524Q4120L15913r1803j48198
13746E41094K66247k67065R9643j17044Q7873j25665L8605o193K33897n9100j88013
13735E04279J22590j37674k4331L00888l4130k88643k05691J29174O40115l08183
13725F98394B90497P2666J14813k3764L38138l75644N68900D89526J23201J62178
$$ y = [1008741, 814574, 918448, 693988, 880515, 922382, 992348, 937588, 794446, 669261, 525449, 712668, 597229, 328388, 845601, 1031145, 516317, 732943, 740313, 569970, 597786, 680020, 817024, 936575, 522041, 691955, 518888, 688920, 757502, 798365, 871574, 647404, 873449, 364053, 376526, 772224, 845404, 732805, 563966, 639122, 496248, 616546, 445997, 886177, 827135, 305538, 381062, 465182, 781095, 689292, 541094, 807341, 540276, 639919, 522875, 610748, 485083, 523688, 517495, 751392, 692292, 504279, 626869, 489195, 464864, 765752, 731622, 442979, 237288, 366462, 1006577, 698394, 290497, 363163, 477976, 454212, 792350, 416706, 985606, 489526, 612727, 774905]
13715G74905l56878o715o0990R5861J94636j53722K85976j97427B68042L9916
13705C07958K56939J24655m8318k19354L76855k91591K44355K9184l62956J31812
13695E49539j14970n2971J8489K27211J50047k18836K7141j97632J74646B39072
13684C95521J33768J32126J47730k70420q0201k23780K17426K22942j89330A92715
13673E67569l879j965q8144q66K57017A99608K34676p9033j35217J60660n1933
13662C28761n0664J80612j0983J14721J66119q2587B90250J1473J3931K25991
13652E41645A31889M07320p642J27547A36233L8162J72264K16009j33202D8757
13641G10922B84437M8580J99749A02546K88548I9234J69322K57022k04086J76680
$$ y = [774905, 418027, 411312, 350322, 446183, 640819, 487097, 773073, 575646, 268042, 307958, 564897, 689552, 641234, 421880, 798735, 507144, 751499, 780683, 417727, 549539, 434569, 381598, 400087, 627298, 777345, 558509, 585650, 388018, 562664, 239072, 395521, 529289, 661415, 809145, 538725, 458524, 234744, 452170, 675112, 485782, 192715, 567569, 563690, 561725, 473581, 472715, 729732, 199608, 434284, 355251, 220034, 380694, 328761, 278097, 458709, 447726, 562447, 728566, 645979, 290250, 301723, 315654, 541645, 131889, 539209, 531567, 659114, 136233, 174395, 346659, 562668, 429466, 48757, 710922, 284437, 333017, 532766, 102546, 391094, 99234, 268556, 525578, 321492, 498172]
13631D98172Q1643j75619O558j40125J4799P7723L35484l907j83541B34900L42012
13620E76912k87972q196K80030J29032B89654J01151K85448l29198j04575R7118
13610C39598r5735j05992L14524l7668P9453a41063C78044p2967J10029j67698
13600B47408C3709M43287k18994q6363M28483k27660j73100M53671A39460K20170
13590C59630n2780f029H8248K52940j68003J78191q0119Q8932M10748e6022C85116
13578D46581p1865F7578L40540q2790a18891B48227n8555M56447j66486k334k24424
13567B52875j9288L11117j82138r7249q9758F4661J61882J35714K57247B42112
13556B41274j872R3515J36797j32259Q0224j41142K50502A22677L32362f869D69825
$$ y = [498172, 579815, 404196, 410754, 270629, 285428, 363151, 698635, 694728, 511187, 234900, 576912, 288940, 280744, 560774, 689806, 289654, 390805, 676253, 347055, 242480, 339598, 243863, 137871, 452395, 414727, 494180, -141063, 378044, 305077, 415106, 247408, 33709, 476996, 258002, 171639, 600122, 372462, 199362, 653033, 139460, 359630, 306850, -6029, 88248, 341188, 173185, 351376, 271257, 360189, 770937, -56022, 385116, 446581, 374716, 67578, 408118, 325328, -118891, 248227, 189672, 646119, 479633, 477299, 252875, 233587, 544704, 362566, 265317, 175559, 64661, 226543, 362257, 619504, 242112, 241274, 239402, 332917, 469714, 337455, 417679, 276537, 527039, 122677, 455039, -6869, 469825]
13544A51173b33668A56626L27105G0300M10493n5574j96003K945J19977J66150
13534E18288A60482J59929H031M99958A81475J54007L92417C14195K34017B12231
13523D41188c963C60222A24169K69572j15629F3751f333A61635i1356B56780N4037
13512C10817L4271K22336B34099O2322j47763K33111r99J39833j35618j59694
13502B25291P3469n474J1422j27045q8164R6968A0677N51687K18500A22524l2215
13491I0309L35546M409j47309j8370F3520J05563L35527A34102m1961L86279k9106
13480D49314A75471o15k1014K83415F1696k8206P7423L24051j9724l6594r7202
13469B81444j40056a3625D45575E6498N25055C4079J4114c8183A81267M04014
$$ y = [151173, -233668, 156626, 483731, 70300, 480793, 425219, 229216, 232161, 352138, 518288, 160482, 320411, 8031, 507989, 181475, 335482, 727899, 314195, 548212, 212231, 441188, -3963, 360222, 124169, 393741, 278112, 63751, -6333, 161635, -91356, 256780, 310817, 345088, 567424, 234099, 296421, 148658, 381769, 380770, 520603, 384985, 225291, 298760, 293286, 304708, 177663, 89499, 186467, 10677, 562364, 780864, 122524, 90309, 425855, 430264, 282955, 264585, 63520, 169083, 504610, 134102, 92141, 478420, 449314, 175471, 174856, 153842, 437257, 61696, 33490, 110913, 434964, 415240, 378646, 281444, 141388, -13625, 445575, 56498, 581553, 34079, 48193, -38183, 181267, 585281]
13459E85281E2536J76438K5054P6363A58133L25731k07860j25593D5929L60798
13449D06727P6427a20457A37366A7351L81554C5472M6015J17186o4301K31805
13439C66177M8377D0787K25563J3657r7288p2787l1367J63903i0951C32207J14912
13428D47119p6071f1100B84325b33267B72352q9501n7103N8564m8010g9754A9071
13416A72400r309P4190l4108f0653D78255A72626f419A80719J00961L0622J64918
13405D77220F1418K8243L93659B38815b0368C60787J25142k40404a21638B03075
13394D00206c35k16664I6581L05714C7071L74321D5568J37016J65243A50523M0002
13383A90525A5662L55169j16341K45081B00638d361k21357F38271C00159A27263
$$ y = [585281, 52536, 228974, 254028, 330391, 158133, 483864, 276004, 150411, 45929, 406727, 483154, -120457, 137366, 17351, 398905, 35472, 81487, 198673, 134372, 366177, 414554, 40787, 266350, 280007, 182719, 109932, 78565, 242468, -90951, 332207, 447119, 371048, -61100, 284325, -233267, 272352, 182851, 125748, 184312, 136302, -79754, 19071, 172400, 163091, 237281, 203173, -60653, 478255, 172626, -6419, 180719, 281680, 312302, 477220, 61418, 89661, 483320, 238815, -20368, 360787, 485929, 245525, -121638, 203075, 400206, -335, -216999, 96581, 402295, 37071, 411392, 45568, 182584, 347827, 150523, 190525, 15662, 370831, 254490, 499571, 200638, -4361, -225718, 638271, 300159, 127263]
13372C03843A21608Q1063p7112j017J53657o8632p6587C1089J88841o5817M6291
13361B00404K50780C7781b68B80861j02377n4735m2117O7641J24149a119B55642
13349a24401A65365J61639J22142A65670L37452j95401r3946P2178a21879I7472
13338B67621I8524L05529b0368C56086n9599J40378j24026a87689I3068M565K39830
13327C37463c69962A3658O07952i0627F9685Q6364O9854l0898l6853J25924j29432
13316A54644E2106L13762j15216J37490A22955n3676J02106Q1577L644a8018F3333
13304b790F2515L35217B9264K1513C271M03112k6700j78465D9560K81294l5855
13293B94999A07140O142O4853o8414J70633j6956J88562I6924J31406P8268L88725
$$ y = [303843, 121608, 202671, 125559, 124542, 278199, 209567, 132980, 31089, 219930, 154113, 200404, 451184, 37781, -268, 280861, 178484, 123749, 81632, 149273, 273422, -1119, 255642, -124401, 165365, 327004, 449146, 165670, 503122, 307721, 213775, 285953, -121879, 97472, 267621, 98524, 404053, -20368, 356086, 296487, 436865, 312839, -187689, 93068, 97633, 337463, -369962, 13658, 621610, -90627, 69685, 156049, 225903, 195005, 158152, 284076, 154644, 52106, 365868, 250652, 388142, 122955, 69279, 171385, 252962, 256606, -18018, 63333, -2790, 62515, 397732, 29264, 50777, 3271, 406383, 379683, 201218, 49560, 330854, 294999, 107140, 113282, 178135, 109721, 280354, 263398, 451960, 96924, 228330, 306598, 695323]
13282F95323A23845L50629I7579K10737N0692A03912k2901a31821A80179l1441
13272A48738B8663n674b50742B8327L0325g2855B33774H6197J40416J00792K65659
13261E93064j98024A15602m3046c5738A15042N01056H0692C4099K19331n1717
13251B01713Q397C7131Q6244c10567B60357b53704A09556p866b0767j26347N6126
13240i0988B47908J08585j27160a974F8084b76836f4849C11871j42475J46225
13230C15621R8273l6180j41430L88683k59016A55141h5858B67458A8091c924A35884
13218d9966B7326M04499f3113m6421B49798O6707a77424B58185a73327h5500E48334
13206B31786p2861C0420K14192L2109a20631B73768A15312J75171a99425C1400
$$ y = [695323, 123845, 474474, 97579, 308316, 359008, 103912, 81011, -131821, 180179, 148738, 28663, 22989, -250742, 28327, 58652, -72855, 233774, 86197, 226613, 327405, 593064, 395040, 115602, 72556, -35738, 115042, 616098, 80692, 34099, 253430, 201713, 210110, 37131, 123375, -310567, 260357, -253704, 109556, 101690, -20767, -147114, -90988, 247908, 356493, 229333, -1974, 68084, -276836, -64849, 311871, 169396, 315621, 413894, 377714, 236284, 624967, 365951, 155141, -85858, 267458, 18091, -3924, 135884, -49966, 27326, 431825, -63113, -109534, 249798, 316505, -177424, 258185, -173327, -85500, 548334, 231786, 158925, 30420, 244612, 276721, -120631, 273768, 115312, 290483, -199425, 31400]
13195B12417o2621P8467J09908a53620B49108I2830N1512J2199r80a27791N274
13184a22517D1169K28552f3453D9288K3111K01603a8501l3219B180J45857P580
13173A55617a41687C69601j65932Q3870j15612F1248M0942b25327R4815C1578
13162A89273H5286R5156e3705A09518N8266B5662L4218a95247j19362a9920C8821
13150B5511K90902b75013A32274O9783b0367j94045A75134m1562K07115c4626
13139A39857a38961D9100K0615a25778a8112H9351e8391I5810K70498A31699l6976
13128I4723L56428A52936A6443d6646I6096P3267d5947j0440G0133a9499H6860
13116b8237A44180J33645Q713A08774i4908B22860l0514k2165K4414N3078A19902
$$ y = [212417, 149796, 228263, 338171, -153620, 249108, 92830, 144342, 156541, 155561, -127791, -122517, 41169, 269721, -63453, 49288, 72399, 274002, -18501, -51720, 2180, 148037, 155617, -141687, 369601, 203669, 287539, 171927, 61248, 102190, -225327, -130512, 31578, 189273, 85286, 180442, -53705, 109518, 167784, 25662, 59880, -195247, -314609, -19920, 38821, 25511, 316413, -275013, 132274, 202057, -20367, -214412, 175134, 133572, 340687, -34626, 139857, -138961, 49100, 69715, -125778, -18112, 89351, -58391, 95810, 366308, 131699, 94723, 451151, 152936, 16443, -46646, 96096, 169363, -45947, -56387, 70133, -19499, 86860, -28237, 144180, 277825, 286538, 108774, -94908, 222860, 192346, 170181, 194595, 247673, 119902]
13104A41283J54190b05207a1559A85736b5085k341j73199B88744J20721E5470
13093a42300e3954D4768A8199b81649a5904l76934C19177j12221m3350L5694a35264
13081D14260b542I0666k1793K40960C8065K04938a0789r1845d9483A36304a13029
13069A98922I340K89811J52726r0752j71672L0593L6730k1619g7317B10943a43337
13057A03017E0797B2244K92937A19526L4925D5848L98775k13920a37927E2668
13046B41676a10842c3794m8127R889I6614L5989j497R7936B7287J50990K04776
13035C83053b80524A45440p0999i7039K7581B3769h1127j82515B96340h545A80759
13023B44046j15023K15568a97281i112A63727g9177D42983j38431A0781M98007
$$ y = [141283, 295473, -205207, -11559, 185736, -25085, -27426, -200625, 288744, 409465, 55470, -142300, -53954, 44768, 18199, -281649, -15904, -392838, 319177, 206956, 163606, 199300, -135264, 414260, -2542, 90666, 68873, 309833, 38065, 243003, -10789, -102634, -49483, 136304, -113029, 198922, 9340, 299151, 451877, 361125, 189453, 220046, 256776, 235157, -77317, 210943, -143337, 103017, 50797, 22244, 315181, 119526, 154451, 45848, 444623, 230703, -137927, 52668, 241676, -110842, -33794, -81921, -72032, 96614, 132603, 131106, 229042, 27287, 178277, 383053, -280524, 145440, 74441, -97039, -69458, 23769, -81127, -263642, 296340, -8545, 180759, 244046, 129023, 344591, -197281, -9112, 163727, -79177, 442983, 304552, 10781, 508788]
13013E08788a19888b984B72011i8746A81985O2181l4095b00786e4712k00509F370
13001A48214L8616i9318A13752c2312I1566O9483a17548F9070R6118K4088j77
12990A89099b31923B2507K37564O3976p1495H5686b3774j920A87546a5874k71429
12979b87303G7245j6796a69693F8282i8633A52964d2004A24487f7079D8709H13
12967A99696G8686i5494a3306A30894B0887K44562p9813n3087F4914K4716c470
12955f4429A73055E6942a8405D7575J02136d9048B30578a27638d6166r7793L7310
12944a06649A52487D6239J72284m8855a04046j85094b4718E7983Q072K4875N7267
12933A48197O8415J031h2321I1843b24581b8083A01354k3469A8042b04723J3874
$$ y = [508788, -119888, -2984, 272011, -98746, 181985, 244166, 210071, -200786, -54712, -255221, 6370, 148214, 186830, -99318, 113752, -32312, 91566, 161049, -117548, 69070, 165188, 189276, 189099, -231923, 22507, 260071, 324047, 252552, 85686, -23774, -25694, 187546, -15874, -287303, 77245, 60449, -169693, 68282, -98633, 152964, -42004, 124487, -67079, 48709, 813, 199696, 78686, -95494, -13306, 130894, 20887, 265449, 185636, 132549, 64914, 89630, -3470, -64429, 173055, 56942, -18405, 47575, 149711, -49048, 230578, -127638, -46166, -143959, -106649, 152487, 46239, 218523, 169668, -104046, -289140, -24718, 57983, 66055, 90930, 148197, 216612, 217643, -82321, 91843, -224581, -28083, 101354, 77885, 18042, -204723, -190849]
12922a90849A32640b42626B1255N1079N4982c1559A42319a57650B86177e7672
12911i6521c3425A93734b98512d6085M972l59014C73460a87815B12221L17744
12901E29965a00810A16503b5915D5123N5517i6007G7624c2855r6044C29949a44877
12889G3670a27400K028l16623G1160L8606K2047a96019A41785b01859A60688o1427
12878I9261N3737J07970a17497A00173J5045O3908n0128i8207G1398c07547A26877
12866A18316i570o5941A24459c9242B46265A07780N8546i7253A38933e4891D29999
12854g5852j1556a4349A46042d2261k44423B90610I4638k7406J25794K0502q893
12843B04635e4514C7268J68167p4781b48312j5241C17296a13577I7500C9245J54114
$$ y = [-190849, 132640, -242626, 21255, 72334, 127316, -31559, 142319, -157650, 286177, -57672, -96521, -33425, 193734, -298512, -46085, -41113, -400127, 373460, -187815, 212221, 529965, -100810, 116503, -25915, 45123, 100640, -96007, 77624, -32855, -128899, 329949, -144877, 73670, -127400, -125372, -441995, 71160, 109766, 131813, -196019, 141785, -201859, 160688, 99261, 152998, 260968, -117497, 100173, 115218, 179126, 128998, -98207, 71398, -307547, 126877, 118316, -9570, -75511, 124459, -39242, 246265, 107780, 166326, -97253, 138933, -54891, 429999, -75852, -87408, -14349, 146042, -42261, -286684, 290610, 94638, 67232, 193026, 213528, 204635, -54514, 37268, 205435, 130654, -248312, -263553, 317296, -113577, 97500, 39245, 193359]
12832A93359a05167B35869f3904b7655G0002d9260A6230d61272J16432H2751c9196
12820I5826D7756a09807A34104b76618B8992j3752b97108A58867a65996j37835
12810c03831f3239j85792A90474a60788A65215J25502M4983a01804d304C67962
12799I8046a73458D47085d2684G2644K23a32639k3988C23170j20564D4682a30483
12787B65537h8186A78881g6691o1290c1023A14286E948h6918C91295j31597j13371
12776A46327c39244B9669K41878b04084K4368B05700F9335a14856B57529j20472
12766A37057a57024B3991O7617C9573b17582c513q795B09701a6980A28199D4783
12754A93523E9447h7714F6036A5611J68385h1334j62358B49099c9969F7501O5562
$$ y = [193359, -105167, 235869, -63904, -27655, 70002, -49260, 16230, -461272, -344840, 82751, -39196, 95826, 47756, -109807, 134104, -276618, 28992, 15240, -297108, 158867, -165996, -303831, -63239, -249031, 190474, -160788, 165215, 290717, 335700, -101804, -4304, 367962, 98046, -173458, 447085, -42684, 72644, 72867, -132639, -156627, 323170, 202606, 44682, -130483, 265537, -88186, 178881, -76691, -137981, -31023, 114286, 5948, -86918, 391295, 259698, 146327, -339244, 29669, 271547, -204084, -179716, 205700, 69335, -114856, 257529, 137057, -157024, 23991, 91608, 39573, -217582, -3513, -12308, 209701, -16980, 128199, 44783, 193523, 59447, -87714, 66036, 15611, 183996, -81334, -243692, 249099, -39969, 67501, 133063]
12743A33063c19775a865C7165j4454K67084e8933j12587E8935K56478b5156p6159
12732a01315C5427J20084a00741B1438L7271j409L89533c72799C15491e6232A44743
12720b60413a06909H9204J15483a1968l8079C1207i6026A19797L5643a79254L451
12709a75803M3517A09951H896a55268B07766b05644B90353e2891A14282O4232
12699A78514K27548A4127J2273K81151C2367J98239I3380a28469A24396b40272
12688g2131B6965K14158a01512C09440j37075C5054a202A17467b09397e5096C33664
12676B15922G7267J32896F0465a13746A00006a70275n192A94309b0859E3002L33256
12665C86258C6814M7603a33313B13507L2066a42882b6220M044A13939J21979d6114
$$ y = [133063, -319775, -1865, 37165, 22711, 289795, -58933, -171520, 58935, 315413, -25156, -101315, 35427, 155511, -100741, 21438, 58709, 57300, 446833, -372799, 315491, -56232, 144743, -260413, -106909, 89204, 204687, -11968, -50047, 31207, -96026, 119797, 155440, -179254, -175803, -132286, 109951, 8896, -155268, 207766, -205644, 290353, -52891, 114282, 178514, 406062, 14127, 26400, 307551, 32367, 230606, 93380, -128469, 124396, -240272, -72131, 26965, 241123, -101512, 309440, 172365, 35054, -1202, 117467, -209397, -55096, 333664, 215922, 77267, 210163, 60465, -113746, 100006, -170275, -175467, 194309, -20859, 53002, 386258, 36814, 84417, -133313, 213507, 245573, -142882, -26220, -22176, 113939, 235918, -46114]
12653B65952j15083B6453J30339J19275o7102O642H9956C2821K92c6325j50652
12642a86977K1148n6289d165D2176a92280j08259A20072L2401E2746O02999A00498
12630B3126J00500J41092j3193d0869A01299b45381A0458K70946j38182J45999
12620B89221a74218H0371J4667D0474J57231A7561f8790G2802K2342c74684a59932
12608b79438B26932e4226D759N62184A6167c1263A79366Q6663I1497J66374b41644
12596A97799k315j4358L79677A06116k0864b4223B17650I1886c55207A04161a40486
12584e5903C23784r4643G9658B6858J03228a85532A02424c25702a20467d2834
12573e8380j9893k02167G8558J32109p7993b34120m261M2798k4746B5933Q2607
$$ y = [265952, 150869, 26453, 156792, 276067, 208965, 215607, 89956, 32821, 33113, -36325, -186977, -165829, -222118, -4165, 42176, -192280, -300539, 120072, 152473, 52746, 655745, 100498, 23126, 123626, 264718, 251525, -40869, 101299, -245381, 10458, 281404, 143222, 289221, -174218, 80371, 95038, 40474, 197705, 17561, -68790, 72802, 95144, -374684, -159932, -279438, 226932, -54226, 4759, 566943, 16167, -31263, 179366, 266029, 91497, 257871, -241644, 197799, 195484, 181126, 560803, 106116, 85252, -24223, 217650, 91886, -355207, 104161, -140486, -55903, 323784, 229141, 79658, 26858, 130086, -185532, 102424, -325702, -120467, -42834, -58380, -78273, -280440, 78558, 210667, 132674, -234120, -238381, -195583, -220329, 25933, 108540]
12562A08540a03661H1454J55828A733J59799F5751b87014B99113A23891e701o8527
12551g4228L181B25351J09969h6321L0042B97623C1448K6390b36311a0964G0185
12539a44395j11764g6834o0174D1379a90886b561j86267D1011J79295l1810c57182
12527a01528B08364o6735a79062E4330i6469l53927B30213N3952b90308A96005
12516A87525b72838b5853B30947e2437j40510F4082a13438A16417N7461i5254
12505A9579M0404M46294A21484a40766A61210J13679n4223b38337F8605c9766
12494a48563G677K36381I4053K27917e9674C84675F7647J02245J23842i1454A81599
12482A57669n0244b49055c7237q9003G2788J61939a62636M6821A47113K2952b33025
$$ y = [108540, -103661, 81454, 237282, 1733, 161532, 65751, -287014, 299113, 123891, -5701, -74228, -71047, 225351, 335320, -86321, -56279, 297623, 31448, 57838, -236311, -10964, 70185, -144395, -256159, -76834, -137008, 41379, -190886, -2561, -188828, 41011, 220306, 188496, -357182, -101528, 208364, 141629, -179062, 54330, -96469, -450396, 230213, 284165, -290308, 196005, 187525, -272838, -25853, 230947, -52437, -192947, 64082, -113438, 116417, 173878, -95254, 19579, 59983, 506277, 121484, -140766, 161210, 274889, 220666, -238337, 68605, -39766, -148563, 7677, 244058, 94053, 321970, -59674, 384675, 67647, 169892, 293734, -91454, 181599, 157669, 107425, -249055, -37237, -126240, 72788, 234727, -162636, -115815, 147113, 170065, -233025]
12470A17890C0013a192F2777B9734K06172h347k1207l3620B86832c18561A7774
12458b82751b2607A53872g3640k65235a61542k1378M6226B8170b07415C59501
12447A08458P0792A252e6835A31229F0953b84969i7174f437B13338n6468N7334
12436B14204E0771J03748D2377K49502A7680f2706A57615D3002b35464F8343L06620
12425C74963b6800j22973m8142l9317A61004D8292A2204J86394P9452c88280a7170
12413a39968A15470E066i5621e236k14988c695C13969D6415J69225q0817a36860
12401G5165k5596a74091O3780A68917C8889a74418j04337e4195l12859H516f5805
12389h0586J4359A95292q6994C5779M9618n056b23764D08775E1995j520d3613
$$ y = [117890, 30013, -1192, 62777, 29734, 235906, -8347, -29554, -63174, 286832, -318561, 17774, -282751, -22607, 153872, -73640, -338875, -161542, -182920, -136694, 28170, -207415, 359501, 108458, 179250, 1252, -56835, 131229, 60953, -284969, -97174, -6437, 213338, 156870, 214204, 50771, 154519, 42377, 291879, 17680, -62706, 157615, 43002, -235464, 68343, 374963, -26800, -149773, -197915, -237232, 161004, 48292, 12204, 198598, 278050, -388280, -17170, -139968, 115470, 5066, -95621, -5236, -220224, -3695, 313969, 46415, 215640, 134823, -136860, 75165, 49569, -174091, -110311, 168917, 38889, -174418, -278755, -54195, -367054, 8516, -65805, -80586, -66227, 195292, 108298, 35779, 85397, 80341, -223764, 408775, 51995, 50475, -43613]
12377I0066b79262f2560D0284J13022j3194a36050K1563j06394J02850k5302B88655
12365A55287e287A51311f5146m5416j0004J5873k22477D487c71041e7204k60082
12354c17286I540d89k75318A47432a83159A04314a75386C22262a021B24665M4628
12343B69293i6966B01516a1479j15274B9989A4923K9879D321d1858B5137p524
12332A7613f0533j31377e1606j54654Q6061C88441c31429I2967J90113b99133
12321B20202b47621G2029J15190c54481c9193j65527E8604N0777C3950a34680
12310i2335j1249A08377e7249A02137f806k1923C37029g4C5942N5463a53933E7867
12297B94056A13739R994O6171b2341k94965B7176a80685F4187J05656G5583a09737
$$ y = [90066, -279262, -62560, 40284, 153306, 140112, -136050, -114487, -220881, -118031, -143333, 288655, 155287, -5287, 151311, -65146, -110562, -120566, -104693, -327170, 4487, -371041, -57204, -317286, 9540, -489, -275807, 147432, -183159, 104314, -175386, 322262, -1021, 224665, 269293, -96966, 201516, -11479, -126753, 29989, 14923, 44802, 4321, -41858, 25137, 17613, -60533, -191910, -51606, -206260, -120199, 388441, -331429, 92967, 283080, -299133, 220202, -247621, 72029, 187219, -354481, -39193, -204720, 58604, 109381, 33950, -134680, -92335, -103584, 108377, -57249, 102137, -6806, -28729, 337029, -74, 35942, 91405, -153933, 57867, 294056, 113739, 123733, 189904, -22341, -317306, 27176, -180685, 64187, 169843, 75583, -109737]
12285a84386L7342e0163I6364l9797p74b70495E6722a21358M7202B48691c9315
12273A34596B4326a69253A20384k4998L2300a76724e2451k41038a9578B62129
12262A30910j6234h2152A70662K10568A22960k2120Q5294b46857A62431a4318
12251B598b40462q7928d1510A16419g033j64362m9497B07875E4223a58891E5272
12239B38644o2875p2344J8243b84264E8010a2131B69072q3478a61906B52057I3937
12227a00380A98137n849k0333H1202K46452a58980A29785n4718a11928G1523a20494
12215A67967K15181C785L23380m0398m2902d7990C08896H8995d8357A95835K953
12204A98788O4918b34145a12903B81468J90742b0084A65719F381K00407i394k21377
$$ y = [-184386, -147044, -50163, 96364, 56567, 55793, -270495, 56722, -121358, -74156, 248691, -39315, 134596, 24326, -169253, 120384, 95386, 127686, -176724, -52451, -293489, -19578, 262129, 130910, 114676, -82152, 170662, 381230, 122960, 100840, 186134, -246857, 162431, -14318, 2598, -240462, -328390, -41510, 116419, -7033, -171395, -220892, 207875, 54223, -158891, 55272, 238644, 175769, 103425, 121668, -284264, 58010, -12131, 269072, 185594, -161906, 252057, 93937, -100380, 198137, 192288, 171955, 81202, 327654, -158980, 129785, 75067, -111928, 71523, -120494, 167967, 383148, 3785, 327165, 286767, 243865, -47990, 308896, 88995, -48357, 195835, 198788, 263706, -234145, -112903, 281468, 472210, -20084, 165719, 6381, 206788, -9394, -230771]
12193b30771A10612K37081a53894M5803B91346a48326a8480k2391B46131b50575
12182A58471a75697A26148A9001M7029C778a4972b114j37444B06179L8740o013
12171B38906J90505k03918C5911K99395j63621J3753h5412F76528A39328a54099
12160B89366j0051p4935J09588J3523C0659K92691O4829j78315G5992a55836A02968
12148D3948O3209b45146A01099C2452R6243e0861B88426a89774B22067a5340b640
12136A48536A3755Q0328l5841M7921M9803J1229c55151O0860A28944P4356F3615
12124A98179f3916R047B07644G8085Q8724b70211B48258b300B4026a22346h405
12112A33837P2224n9508M1054a25663k33701B93422G7068J59802A1580L9421L04552
$$ y = [-230771, 110612, 347693, -153894, -108091, 291346, -148326, -18480, -40871, 246131, -250575, 158471, -175697, 126148, 19001, 66030, 3778, -14972, -2114, -139558, 206179, 244919, 238906, 429411, 225493, 35911, 335306, 171685, 185438, -85412, 676528, 139328, -154099, 289366, 279315, 204380, 313968, 327491, 30659, 323350, 388179, 209864, 75992, -155836, 102968, 43948, 107157, -245146, 101099, 32452, 128695, -50861, 288426, -189774, 222067, -15340, -2640, 148536, 13755, 94083, 58242, 106163, 155966, 167195, -355151, -294291, 128944, 203300, 63615, 198179, -63916, -54869, 207644, 78085, 166809, -270211, 248258, -2300, 24026, -122346, -8405, 133837, 206061, 146553, 187607, -125663, -359364, 293422, 77068, 236870, 11580, 51001, 355553]
12101C55553a95932k47722f2398a2922j82319j06677J21570H5065e04623A44143
12090A9519e7297n4241B52834n2126f3981A78292f5391i085H7176J0077C3835
12078C9902b28854h4189C07096a21C09757r6478c09694B18392p8610a4118B00328
12066b299D4350a79331e6701A7295c8115n2276C91879b60316H27901o3349C63288
12054B30254q9088o8983b80755B7474d5584a3204F0394P3346L74678a95257c5952
12042e7574q9505C3065P9333a95044A76417a89882A66872N040m793B6757J3155
12031C9912A7728Q0942J21215c03174C2123J27724A3098b03268l5752D2185c9130
12019d9633j59067o3090e4888k7582j61979l2709D58684a66133B18893o8637h0988
$$ y = [355553, -195932, -443654, -62398, -12922, -195241, -301918, -180348, 85065, -504623, 144143, 19519, -57297, -111538, 252834, 200708, -63981, 178292, -65391, -9085, 87176, 97253, 33835, 39902, -228854, -84189, 307096, -121, 309757, 213279, -309694, 218392, 139782, -14118, 200328, -2299, 44350, -179331, -56701, 17295, -38115, -90391, 391879, -260316, 827901, 764552, 363288, 230254, 141166, 72183, -280755, 27474, -45584, -13204, 60394, 133740, 508418, -195257, -35952, -57574, -147079, 33065, 112398, -195044, 176417, -189882, 166872, 171912, 167119, 26757, 39912, 17728, 98670, 219885, -303174, 32123, 159847, 13098, -203268, -239020, 42185, -39130, -49633, -208700, -271790, -54888, -82470, -244449, -277158, 458684, -166133, 218893, 150256, -80988]
12007D9175i4780l71859a05098o1892d9943k19429f087A91910b76561C24966e04268
11995b90646A72748l5183n3034f1115j64659A17862a89243K4552e0605E3229K3044
11984G6273R2171c10253P2180j8118D05120a78733j0545P5161o8645j10627L572
11973b89817M5455C8191L47451A42863K28404H006J13960r43O8657B8870J12688
11962A41558P2658H8990c1417m8224j34292E5130a59411k12853a69615A75972
11951e0290l9361R460l0873B5164c18378c893C9682h9172r6093A29137C7127c79841
11938A37417g6647m73101a91581L3513o3636e7768A28333b08339f3560A8300a42733
11926a37407A93084p2425a28820a9244j37575B64553A04840a38335b4508k8315
$$ y = [49175, -94780, -466639, -105098, -166990, -49943, -269372, -6087, 191910, -276561, 324966, -504268, -290646, 172748, 137565, 84531, -61115, -225774, 117862, -189243, -164691, -50605, 53229, 76273, 168444, -310253, -238073, -256191, 405120, -178733, -189278, -114117, -182762, -293389, -289817, -244362, 38191, 385642, 142863, 371267, 8006, 121966, 121023, 189680, 28870, 141558, 214216, 88990, -31417, -79641, -213933, 55130, -159411, -372264, -169615, 175972, -50290, -89651, -80191, -111064, 25164, -318378, -3893, 39682, -89172, -185265, 129137, 37127, -379841, 137417, -76647, -549748, -191581, -158068, -221704, -57768, 128333, -208339, -63560, 18300, -142733, -137407, 193084, 120659, -128820, -19244, -156819, 264553, 104840, -138335, -24508, -52823]
11916e2823j73580N5608l0000r4952m0020J20005p4790R0767M1491A09391A0153
11904B0628i7974m4535a4660A21727F162R6239O0022m1425d1327p5645E0930a69874
11891f9888J6917r9839f3890m29158B49420e19229a5647F0918O7483b4569k36043
11880b60612B7769R8492B0602g8858A01477K76427A3081a18895A17961a11081
11869B29441M9128c11363A24832a80470B09540a95818H1465b97953E4710J00730
11859A55440l0422J31611a08200I2866J14481D3885M5170f5650B82643E4813A3708
11847c7719o4097A64795a10545b6170j06435o6140c7790C3649K26720F6906b45037
11835A14511m1874a12454h170F8974J3982f9353C0413J37708J94966D3837M2784
$$ y = [-52823, -226403, -170795, -200795, -295747, -335767, -215762, -290552, -199785, -158294, 109391, 10153, 20628, -97974, -142509, -14660, 121727, 6162, 102401, 162423, 120998, -41327, -116972, 50930, -169874, -69888, -52971, -152810, -63890, -493048, 249420, -519229, -15647, 60918, 128401, -24569, -260612, 27769, 126261, 20602, -78858, 101477, 377904, 13081, -118895, 117961, -111081, 229441, 278569, -311363, 124832, -180470, 209540, -195818, 81465, -297953, 54710, 155440, 125018, 256629, -108200, 92866, 207347, 43885, 89055, -65650, 282643, 54813, 13708, -37719, -101816, 164795, -110545, -26170, -132605, -198745, -37790, 33649, 260369, 66906, -245037, 114511, 72637, -112454, -8170, 68974, 82956, -69353, 30413, 168121, 363087, 43837, 86621]
11824H6621a2598I6841b85294j3922b5092B70561F4877c96224c2897D6474i5701
11812b36836J10613b8693q0011k6221D96233a37091a8010B61980b85477O5462
11802b20015O430C98834a95128j1521F9070a30646E8179k6940K57601b73698E0290
11790B48667f7075B14020g0854R314j00447k3794P7840A31643n857O8540D517
11778B9763b08256P3818b4524j07656A7733a09509C5265b7592r0427N7865k22612
11767b82766c1222A96256C6817m633a12256A13393d85502a3776j28983d8815j2979
11756f1794A81345a4781D03368A4028a42585K9625A29847a12448H1606c512B07672
11744A4787i891j7642A85123M1185i7004o7191E7203a60783d5103m9545B89947
$$ y = [86621, -12598, 96841, -285294, -299216, -25092, 270561, 64877, -396224, -32897, 46474, -95701, -236836, -126223, -28693, -108704, -134925, 496233, -137091, -18010, 261980, -285477, -220015, -213585, 398834, -195128, -206649, 69070, -130646, 58179, 31239, 288840, -273698, 50290, 248667, -67075, 214020, -70854, -61540, -161987, -185781, -107941, 131643, 125786, 194326, 4517, 29763, -208256, -134438, -24524, -132180, 17733, -109509, 35265, -27592, -118019, -60154, -282766, -31222, 196256, 36817, 32184, -112256, 113393, -485502, -13776, -142759, -48815, -61794, 181345, -14781, 403368, 14028, -142585, -112960, 129847, -112448, 81606, -3512, 207672, 14787, -9891, -27533, 185123, 226308, -97004, -164195, 57203, -160783, -45103, -94648, 289947]
11732b40161B21090a67642I2905d6889F2798b86570A70867a79045D9721c07086
11721b3831n3798L3123j52116k0341A83300M8138C8160K33932j25370b15320d1029
11709C37341D8266L34188b53781a01382k5113j1192A69874J7137P2667a56144
11698a7668j18884I3717J48631a93233G6213N7279B5541J35693f3189A48496O2188
11687B10684p7490c9064A89614b08627D97635B01669i7811A06520J82416a05272
11676a78618b5911F3470A3951a25376G7496A6593K33173f335j24998A31523N3471
11665A84994m9106b19932G4217C2443K87191j47501B0158K49282a67224B55756
11654A59141d2802B29649g1889B97310j31902K40707I3701l1715O7904b06152
$$ y = [-240161, 221090, -167642, 92905, -46889, 62798, -286570, 170867, -179045, 49721, -307086, -23831, -77629, -44506, -196622, -216963, 183300, 231438, 38160, 272092, 146722, -215320, -41029, 337341, 48266, 382454, -253781, -101382, -126495, -137687, 169874, 187011, 259678, -156144, -17668, -136552, 93717, 242348, -193233, 76213, 133492, 25541, 161234, -63189, 148496, 210684, 133194, -39064, 189614, -208627, 497635, 201669, -97811, 106520, 288936, -105272, -178618, -25911, 63470, 13951, -125376, 77496, 16593, 249766, -6335, -131333, 131523, 184994, 135888, -219932, 74217, 32443, 319634, 172133, 20158, 269440, -167224, 255756, 159141, -42802, 229649, -71889, 297310, 165408, 406115, 93701, 61986, 129890, -206152]
11643G4791N208d1441j87470C7436J1507a37004A43447e158j85922B38546j04525
11632A34021a87093c0008j58948H4318e7649j77683B97706b7498j56053b1966
11621B13171b02945B6274J80024J22127A4921J34611J17457a66243J7193p4989
11611b24039e7648p2452D3231b40051D8993M4175d230j7191j7472A26674l2263
11600I4411d3560r2573a062p7989F5920d5480j24811h874k40991a2020j86941
11589a98961B48106G2324K42670I3558m4633c234k25032A95906a32926A71116
11578H3725a48013j61962E7306g6667j7917m3723e5380j10365e4852k3185A52660
11566i3153j91786B73167A35035h685k15447r2174A33723a00944b3242j41909
$$ y = [74791, 79999, -41441, -228911, 37436, 48943, -137004, 143447, -5158, -191080, 238546, 134021, -187093, -30008, -188956, 84318, -57649, -235332, 297706, -27498, -183551, -21966, 213171, -202945, 26274, 206298, 328425, 14921, 149532, 266989, -166243, -149050, -224039, -57648, -130100, 43231, -240051, 48993, 93168, -4230, -21421, -38893, 126674, 94411, -43560, -136133, -1062, -79051, 65920, -45480, -170291, -8874, -249865, -12020, -198961, 248106, 72324, 314994, 93558, 48925, -3234, -228266, 195906, -132926, 171116, 83725, -148013, -309975, 57306, -76667, -94584, -138307, -55380, -165745, -54852, -78037, 152660, -93153, -284939, 273167, 135035, -8685, -224132, -316306, 133723, -100944, -23242, -165151]
11556a65151D8167a34734A99971b85661A72722c8077k72282O8955Q3322j44493
11546c02575d1955j77534m933B05298o3273J70448a18943P767e1289B7166L405
11535C0571m185O8718f9916j59115F1275Q4043a09202C6978J58133R3965Q7236
11524C76312A9795K37943O4682A23478r252C1866a3261j33016A9972J06804J93705
11513C20481A42974A4405K73581j38865Q3649B5866i2112l6154F4260N8898F957
11501B57867a59595C380K42144a39221A77884D9926L7748K2499K13052A30100
11490f9388o6090F829K14944a0879A00156L69510G7774a38104A58072a05911H1077
11478i5432C46559H119f354F9934a42356k08351C44776h9489F01787B35919I2965
$$ y = [-165151, 48167, -134734, 199971, -285661, 172722, -38077, -310359, -241404, -158082, -302575, -41955, -219489, -224422, 205298, 142025, 312473, -118943, -111176, -51289, 27166, 30571, 26386, 95104, -69916, -229031, 61275, 145318, -109202, 36978, 195111, 289076, 376312, 19795, 257738, 322420, 123478, 114226, 31866, -13261, -146277, 19972, 126776, 320481, 142974, 14405, 287986, 149121, 232770, 25866, -92112, -128266, 64260, 123158, 6957, 257867, -159595, 3380, 245524, -139221, 177884, 49926, 87674, 110173, 323225, 130100, -69388, -135478, 6829, 221773, -10879, 100156, 469666, 77774, -138104, 158072, -105911, 81077, -95432, 346559, 8119, -6354, 69934, -142356, -350707, 344776, -89489, 601787, 235919, 92965]
11466C68760A30139K91276F0250J68994F7941a9070r0398A07103L9339c47571
11455c24645A49586f9866D3639a48291B20574r6743F0120a9776A73254P1454A1025
11443f9322B7732b61594A62026C328R0721g1316A52525Q9843r1182F149J07998
11432A14147D5829K8023a4363A31752i5345o5959A02420C4276l291O2643P954
11421A01582B9755K54708a03135B9785R128b99126a19508k200H322M7263b16374
11409g3096B46738b8231E7026B719a86118M4387B3015P3990M913e6872i565n7619
11397f7184K9590p7792a8796o7038A06487i0499I124c34422D31775a55193p3995
11386b29188l621G1632i1731q292C98071e9057E2348b3008H7601d0362a6687l50483
$$ y = [368760, 130139, 421415, 60250, 229244, 67941, -19070, -109468, 107103, 146442, -347571, -324645, 149586, -69866, 43639, -148291, 220574, 123831, 60120, -19776, 173254, 244708, 11025, -69322, 27732, -261594, 162026, 3328, 94049, -71316, 152525, 242368, 151186, 6149, 114147, 45829, 73852, -14363, 131752, -95345, -161304, 102420, 34276, 30985, 93628, 101582, 29755, 284463, -103135, 29785, 38913, -299126, -119508, -121708, 8322, 55585, -216374, -73096, 246738, -28231, 57026, 2719, -186118, -141731, 23015, 97005, 101918, -56872, -9565, -67184, -37594, -115386, -18796, -85834, 106487, -90499, 9124, -334422, 431775, -155193, -229188, -232809, 71632, -91731, -100023, 398071, -59057, 52348, -23008, 87601, -40362, -16687, -367170]
11374c67170q9299F2873P6099i5630G2333b32298h3658o8607I9884m8129R8225
11363A49980Q9166D3923b0820A77393D6353M1624i2889I845d9983A68408b06093
11351E6577a81451M5347j415l7637A50212a03824E9193J6821c39166A837P138
11340H975J75610A3437b868j86775e4905m8128c5623m0244b1359A91766c92755
11328c46634A884i5151A00067C6652b08792G6941Q3666b490k8677A03056g0586
11316A6252a6085B32633H7533b26033N9431A17542f6797l55938c2105b560D23606
11304b04849B40361P451I1697h2652B37034F9017b7535C5538a47368L961j09274
11293b52681B1614P7358l0023K9961J43428d2769l0735J9210m2828A17756d1893
$$ y = [-367170, -456469, 62873, 138972, -95630, 72333, -232298, -83658, -152265, 99884, 51755, 149980, 239146, 43923, -20820, 177393, 46353, 87977, -92889, 9845, -49983, 168408, -206093, 56577, -181451, -136104, -137519, -175156, 150212, -103824, 59193, 76014, -339166, 1837, 8975, 184585, 13437, -2868, -189643, -54905, -103033, -35623, -75867, -21359, 191766, -392755, -346634, 1884, -95151, 100067, 36652, -208792, 76941, 160607, -2490, -31167, 103056, -70586, 16252, -16085, 232633, 87533, -226033, -166602, 117542, -66797, -422735, -32105, -2560, 423606, -204849, 240361, 247812, 91697, -82652, 237034, 69017, -27535, 35538, -147368, -143407, -252681, 21614, 98972, 68949, 98910, 242338, -42769, -73504, -54294, -97122, 117756, -41893]
11281B73836K5815o1755a71656A61279b78846C54496a6942c885j26246j82726
11271c12857n7773K2566e6947B50033E5101b56880O0633B71234c7829B1736L57374
11260C79110c362A89767J18430j36688f0426k36106A36507a02469B2627M1918
11250F4545a12982A09418a87676j79136C9616A095J38702a29186j23110a6780
11239c09351a13799K6301j42545c5005A85076a57223E14288a31471A56674a9147
11228G8433c235C68493I2500a91992d4527j27063D0886d6169A65947F2666J78941
11217B41607g1766k62732I9494d14718E1736d0879A31862g7992k7198A48233a671
11205A86874b28013k90120Q3464g8194j00009f2030P331I8840b20219N97A06190
$$ y = [273836, 299651, 237896, -171656, 161279, -278846, 354496, -16942, -3885, -130131, -312857, -370630, -348064, -56947, 250033, 55101, -256880, -196247, 271234, -37829, 21736, 379110, -3362, 189767, 308197, 171509, -60426, -296532, 136507, -102469, 22627, 64545, -112982, 109418, -187676, -366812, 39616, 1095, 139797, -129186, -252296, -16780, -309351, -113799, -87498, -230043, -35005, 185076, -157223, 514288, -131471, 156674, -19147, 78433, -3235, 368493, 92500, -191992, -44527, -171590, 40886, -46169, 165947, 62666, 241607, -71766, -334498, 99494, -414718, 51736, -40879, 131862, -77992, -105190, 148233, -1671, 186874, -228013, -518133, -434669, -78194, -178203, -62030, -54699, 98840, -220219, -219622, 106190]
11193A91261E1782d4535k78437f2148b8740J1650A12741I983a23919m824J6382
11182a12361M371I7772b10857A83660c28764B03128a22117M274F0380L4939a81117
11170a27523j34052D8084a5134j07433A58839B4542f7200j86752J18750A49931
11159A09935a40149L4564j35203B46398c3832k35774c2163k60824D1649a99352
11148G7144c14141A25236d22321A21508c03249a42734A9553a15847N2483C33J52757
11137A53090h0841D8161c40248C10217c90125A2165M0207O6664b645C66158A1862
11125f3795A0290J65094q0661K8635d9417m7984o5438C11030e3706A5220g8366
11113A238b07074A97062c42257G2619o036a78447C35634d376j38551A31197a07049
$$ y = [191261, 51782, -44535, -322972, -62148, -28740, -17090, 112741, 9983, -123919, -128743, -112361, -107990, 97772, -210857, 183660, -328764, 203128, -122117, -117843, 60380, 95319, -181117, -127523, -261575, 48084, -15134, -122567, 158839, 24542, -67200, -253952, -135202, 149931, 109935, -140149, -105585, -240788, 246398, -33832, -269606, -32163, -292987, 41649, -199352, 77144, -314141, 125236, -422321, 121508, -303249, -142734, 19553, -115847, -63364, 333, 153090, -80841, 48161, -340248, 310217, -390125, 12165, 52372, 119036, -2645, 366158, 11862, -63795, 10290, 175384, 94723, 123358, -49417, -97401, -162839, 311030, -53706, 15220, -78366, 1238, -207074, 197062, -342257, 72619, 66583, -178447, 335634, -4376, -142927, 131197, -107049]
11101B47190F7739J24588d914E91312b87366A65796k295P4738o803I988O7150
11090G7138B0763M93905E3040L5146h1936E6980O8489C2644L33081c6424A75480
11078e7729C25233A27406K59835A27948J48456G2370M17463A14095J21779p2705
11068A63169J20997L875a4631B11095o364f7867C16744J12574j61961K27487J42180
11057F37024k90718M2468K32620j17194B51408J12024L38751l26496o3391K00888
11047E13184J72729p4184m2475j9877o3692P8881j60090L36792k76175A08741
11036F97945J27701C78254K72432j73625L29221C12359r9075J06164M83165j39790
11026F62823l09352m6657K80739k52131L60407C37750L38641l26198J44023Q5592
$$ y = [247190, 67739, 192327, -4914, 591312, -287366, 165796, 163501, 238239, 231436, 9988, 77138, 20763, 514668, 53040, 88186, -81936, 56980, 125469, 32644, 365725, -36424, 175480, -57729, 325233, 127406, 387241, 127948, 276404, 72370, 489833, 114095, 235874, 163169, 284166, 288041, -14631, 211095, 204731, -67867, 316744, 429318, 267357, 494844, 637024, 346306, 388774, 621394, 504200, 251408, 363432, 702183, 375687, 312296, 513184, 685913, 611729, 569254, 549377, 485685, 564566, 404476, 741268, 465093, 108741, 697945, 825646, 378254, 650686, 477061, 806282, 312359, 213284, 319448, 802613, 662823, 353471, 306814, 587553, 335422, 695829, 337750, 676391, 350193, 494216, 579808]
11016E79808R2871k27771q2254K13846k15354K24954B08741J60925J14679J2983
11006D97328J09897j64637m6656q4457J63365O9489K39300C17852K88467k69912
10996C36407K35386L82030A92967O87262k80690J75451m9178p8098k23390K29272
10986F53596C21038J18983K81284l2860K23803q6462R5611K52340n7545J23659
10976A239851K16965k2947L94745L08198l5547K3448P9207k96967m3007o23307
10966A240639L01494k65543j70483J94624k7791j78013j12926L11786l85618m083
10956I04086K11860k80870j88854K1220j14663M1559A15542L24496I0352M6016
10946A36368f7202E81470A52408K49982j58994b27877B91139L9800B8980K75328
$$ y = [579808, 672679, 444908, 362654, 576500, 361146, 586100, 208741, 369666, 484345, 497328, 607225, 442588, 395932, 311475, 474840, 544329, 783629, 317852, 606319, 336407, 571793, 953823, 192967, 880229, 599539, 774990, 725812, 647714, 424324, 653596, 321038, 440021, 721305, 688445, 912248, 825786, 921397, 1173737, 1116192, 1239851, 1456816, 1433869, 1828614, 2136812, 2101265, 2124713, 2203920, 1906953, 1863946, 1240639, 1542133, 1276590, 1106107, 1300731, 1272940, 1094927, 982001, 1293787, 908169, 904086, 1115946, 835076, 646222, 667442, 552779, 594338, 115542, 440038, 90352, 136368, -67202, 581470, 152408, 402390, 243396, -227877, 291139, 330939, 28980, 304308]
10936C04308H0977K0289k198P3792f0886B2696N7530R2720M609m9487C5890f6102
10923A6277c3631l25014B85583b43213B76152G74J42607c22210C96743o8204b5599
10911d0795j43845G7010b46895B55702C8819c2403A11926b5969o7782F9467b5844
10899d03950D8152a12677F3454h3157B1682f8177F0266p836a70607F9009h4016
10887A78290n8434a5436c611k9336j437C81264a69181B04395H4973J20089F4273
10875A86022H6294a60440a9247j86544a7340o629A6987J26572B3149a40775A68118
10863a15410K5283I1129b3976m1577A13235m0187C5177g1449D9603f8357K3845
10852d4512k0413k25193E4083g082B7864b09961f5951C90790e6592p5306q6948
$$ y = [304308, 80977, 101266, 99068, 172860, -60886, 22696, 80226, 172946, 177555, 128068, 35890, -66102, 16277, -33631, -358645, 285583, -243213, 276152, 774, 143381, -322210, 396743, 328539, -25599, -40795, -184640, 77010, -246895, 255702, 38819, -32403, 111926, -25969, -93751, 69467, -25844, -403950, 48152, -112677, 63454, -83157, 21682, -68177, 60266, 52430, -170607, 69009, -84016, 178290, 119856, -15436, -3611, -32947, -34384, 381264, -169181, 204395, 84973, 205062, 64273, 186022, 86294, -160440, -19247, -205791, -17340, -23969, 16987, 143559, 23149, -140775, 168118, -115410, -90127, 91129, -23976, -65553, 113235, 73048, 35177, -71449, 49603, -68357, -44512, -64925, -290118, 54083, -7082, 27864, -209961, -65951, 390790, -56592, -131898, -218846]
10841b18846o4493A38580b37791i4199B07743N8406a28020C94904h3076F7135
10830a90853A36077g3753B97144G534J54423b47757A17691b7037k1831A01439
10819d56416D0278A2792L25244C449J11570c24751f0591o6115g257A70826d06339
10807b37526k5557N1770K6838A11091a8205k16802A34785a1231C12336b02038
10796C7543J58564a26965J4118j609B83572c18425a54543D08983d39335c0420
10785a49546N9650A08101b05624A89818a78446A00119a10584k13596C1822J0058
10775D1880e7243p2569b3232j78326A9364J66159b00653I1312a87742r2818E769
10763D1283R3362a72714H6703J6937b57930H0129O7480a685B74382f3957l5353
$$ y = [-218846, -283339, 138580, -237791, -94199, 207743, 266149, -128020, 394904, -83076, 67135, -190853, 136077, -73753, 297144, 7534, 161957, -247757, 117691, -27037, -48868, 101439, -456416, 40278, 12792, 338036, 3449, 115019, -324751, -60591, -126706, -7257, 170826, -406339, -237526, -263083, -211313, -184475, 111091, -18205, -235007, 134785, -11231, 312336, -202038, 37543, 196107, -126965, -112847, -114456, 283572, -318425, -154543, 408983, -439335, -30420, -149546, -89896, 108101, -205624, 189818, -178446, 100119, -110584, -324180, 31822, 41880, -57243, -129812, -23232, -201558, 19364, 185523, -200653, 91312, -187742, -280560, 5769, 41283, 134645, -172714, 86703, 103640, -257930, 80129, 147609, -1685, 274382, -63957, -99310]
10752i9310b2693A34786a64097f2056A94444c21041c0673k52000A92943A3855
10741h4230j3318c1821H1217d9238B6554d6981o2876j39506h9188l139A18676
10729b18440f522q7402l20028d3432k74637d385j29785L3099E5499J09935a91016
10717h7218b0458p556j57159R2100B120L6792J49833r1068d2071E617a7931j08124
10705a26055A43814f8553A10104j2952a0246k2418I0308a9591p1991C34122a21353
10693F4733d25143A8909i660k55301R3933K3920A68360h4860K9006E66203G624
10681c9018A07744a93098a7354D06734D612N913Q3874J46598H086e8579n4488
10670a13067A56045D6943a41978M7451A14047c12633a17272j27323I3735h5603
$$ y = [-99310, -22693, 134786, -164097, -62056, 194444, -321041, -30673, -282673, 192943, 13855, -84230, -97548, -31821, 81217, -49238, 26554, -46981, -109857, -249363, -89188, -92327, 118676, -218440, -6522, -93924, -413952, -43432, -318069, -4385, -134170, -101071, 55499, 165434, -191016, -87218, -20458, -28014, -185173, -93073, 2120, 38912, 188745, 97677, -42071, 5617, -17931, -126055, 143814, -68553, 110104, 97152, -10246, -32664, 90308, -19591, -91582, 334122, -121353, 64733, -425143, 18909, -9660, -264961, -171028, -147108, 168360, -84860, -55854, 566203, 7624, -39018, 107744, -193098, -17354, 406734, 4612, 10525, 94399, 240997, 8086, -58579, -113067, 156045, 46943, -141978, -94527, 114047, -312633, -117272, -244595, 93735, -85603]
10659A46303c6169E5154c4110J2769I6381a00080l17036A20965b13714g030A01161
10647i1305B99380c05210a23122k79037A44906b93437A24984d8030J8075j94775
10637b24730A8018Q8162g7659L7559k16497J16256K8517J5065C0728J68277a08512
10625b22132f2439k52904A18475c20049J50825a9522l7130p8593e3817k44079
10615b97896A01872A8115g0474B85906F829J70160F4881b78803B06755c6256E059
10603A65100G783h0592j25613f0794A58005J18773b30546a03073h351k55806H8531
10591c343n0140j02551N5082o0923a4037n5594G3765Q6972a95964C41534j46594
10580A94940A7096h4162H9586b4237C81799A0121b1923k17712A06551D4102b60236
$$ y = [146303, -36169, 55154, -34110, -21341, 96381, -100080, -417116, 120965, -213714, -7030, 101161, -91305, 299380, -305210, -123122, -402159, 144906, -293437, 124984, -48030, -29955, -224730, 18018, 106180, -77659, -40100, -256597, -140341, -111824, -96759, 30728, 199005, -108512, -222132, -62439, -315343, 118475, -320049, -169224, -19522, -56652, -135245, -53817, -297896, 101872, 18115, -70474, 285906, 6829, 176989, 64881, -278803, 206755, -36256, 5059, 165100, 7783, -80592, -206205, -60794, 158005, 276778, -230546, -103073, -8351, -264157, 88531, -3343, -53483, -156034, -100952, -161875, -14037, -69631, 73765, 160737, -195964, 341534, 194940, 17096, -84162, 89586, -24237, 381799, 10121, -21923, -239635, 106551, 44102, -260236]
10568b65395A21767M5638b81032R5217I0001O9357K80086E2819K8172i9085C35377
10556A00779g8423A29057c4813A13634a97267A66861a72240O8783m54531A99169
10545b6086A74559D9188f843j59258q6776C440a53726A371J82562c88098F6457
10533C6716J05739C7248b46761f9131D2357a96250I9772a59919A28878c27935
10522D6402a35838A79062c8781C4782J00860l7725l5985c16295H4180a4140k95459
10511c09599E0130Q3128C2609e1544n141j66453A83915c2825j171j25902B35583
10499A51341n4467a67106A7150P7475d3615A56082a0300A47480b3896o0415j64697
10488b49008B27185b27893A77258B291b0905A30107e2878O75k26257c8173j22676
$$ y = [-265395, 121767, 167405, -281032, -185815, 90001, 159358, 439444, 52819, 80991, -99085, 335377, 100779, -78423, 129057, -34813, 113634, -197267, 166861, -172240, -103457, -557988, 199169, -26086, 174559, 49188, -6843, -166101, -252877, 3440, -153726, 1371, 183933, -388098, 66457, 36716, 142455, 37248, -246761, -69131, 42357, -196250, 99772, -159919, 128878, -327935, 46402, -135838, 179062, -38781, 34782, 135642, 97917, 61932, -316295, 84180, -14140, -309599, 50130, 133258, 32609, -51544, -56685, -223138, 183915, -32825, -33996, -159898, 235583, 151341, 96874, -167106, 17150, 94625, -43615, 156082, -10300, 147480, -23896, -84311, -249008, 227185, -227893, 177258, 2291, -20905, 130107, -52878, -52203, -278460, -38173, -160849]
10477a60849D5529J03983a11183A06361f3308A44648c33315g5257k29353B22299
10466C3552d08071a68315q4822g2582B94341a78880O1688A02100c7546B60031
10455D935c9701B16233b28150e3428A22900d16994J93070J03027A33941g7280
10444h1348n5367A65744a34107K318I759L7559a39806e4588q6355Q100b3890q6864
10432a10754J4173c3654m74877A54215c45666B78493F6482b41399A40241o5075
10422G5166a11856A46514a5098B0151m768h2400A71247a12079k6493c5335l58847
10411c94182C17313H7242b61751A63083b43567d0523k0276A7406a43021O4134
10401g8887A69750J610J30372h3125d0577A47667C2638K5381M4555b68015A4378
$$ y = [-160849, 45529, 149512, -111183, 106361, -63308, 144648, -333315, -75257, -304610, 222299, 33552, -408071, -168315, -253137, -72582, 294341, -178880, -117192, 102100, -37546, 260031, 4935, -39701, 216233, -228150, -53428, 122900, -416994, -223924, -120897, 133941, -77280, -81348, -136715, 165744, -134107, -131789, 9759, 47318, -139806, -54588, -140943, -132843, -23890, -110754, -96581, -33654, -508531, 154215, -345666, 278493, 66482, -241399, 140241, 75166, -111856, 146514, -15098, 20151, 15383, -82400, 171247, -112079, -138572, -35335, -394182, 317313, 87242, -261751, 163083, -243567, -40523, -60799, 17406, -143021, -78887, 169750, 171360, 301732, -83125, -40577, 147667, 32638, 58019, 102574, -268015, 14378]
10389B30482n2697b51014e6253b2414q1029K0634J8748D1872O2949M3900k09a02868
10376B63521k5362J54991d8182D4066r220J99756M2622K52806m2502H3564J37622
10365B21186J71135j45057F7625Q643L59314k09428K92023A60355n1152O7315
10355A76518h4420B06601a68273A96039M38507A95456m1282J34675G1443J89965
10345B61408K09034E1582K60299H0580M32914a49429A39192c8989A73680Q8047
10335B61727A27729O3149a3422A99287R112J9945b65963A0237N4167J99727m3249
10324B20882R100E0527J74037J18796K789b6738j46294A35792e1186C02166N4945
10313C57111G5443c0702A14422e1721q7516F2484a37684A50948E9811f783k49694
$$ y = [230482, 177785, -251014, -56253, -22414, -103443, -82809, -64061, 41872, 104821, 148721, 148512, -102868, 263521, 238159, 393150, -48182, 44066, 34846, 234602, 277224, 530030, 487528, 83564, 221186, 392321, 247264, 67625, 76268, 435582, 226154, 518177, 160355, 109203, 176518, -84420, 206601, -168273, 196039, 634546, 195456, 154174, 288849, 71443, 261408, 470442, 51582, 311881, 80580, 513494, -149429, 139192, -38989, 173680, 261727, 127729, 190878, -13422, 199287, 208399, 228344, -265963, 10237, 64404, 264131, 220882, 229982, 50527, 224564, 343360, 346149, -26738, -173032, 135792, -51186, 302166, 357111, 75443, -30702, 114422, -51721, -139237, 62484, -137684, 150948, 59811, -6783, -256477]
10302b56477B9620J22424A6835a31285h230j91148A92011m6006a18802J3809p8657
10291a83650j80667B13271c14420D295a38593A8117J18594i6553K0962n8999f603
10279b7903o1741B25485b98135p9204G4519J26169I1837a60010G2508f9689H0953
10267a37752F9173K89522b64443i1965l8023A48535j9188L37588k23685e4413
10256a05334A56948K15503d4689m3226C13079A19786k5356b8373C23256C0343
10245A17667a27002M5092A01799f0692o2241k11502A9028Q4128C3056c6655A72927
10233g2072B36909A0676K08527J58274j85562g0784B60213d9478a1525r456B10092
10221a47021k2257A78380b04654e5582j64780E3955b30961A05377h2289C19525
$$ y = [-256477, 29620, 152044, 16835, -131285, -8230, -199378, 192011, 146005, -118802, -104993, -183650, -364317, 213271, -314420, 4295, -138593, 18117, 136711, -96553, -75591, -134590, -6603, -27903, -89644, 225485, -298135, -377339, 74519, 200688, 91837, -160010, 72508, -69689, 80953, -137752, 69173, 358695, -264443, -91965, -129988, 148535, 129347, 466935, 243250, -54413, -105334, 156948, 372451, -44689, -87915, 313079, 119786, 94430, -28373, 323256, 30343, 117667, -127002, -81910, 101799, -60692, -122933, -334435, 19028, 103156, 33056, -36655, 172927, -72072, 236909, 10676, 219203, 377477, 191915, -70784, 260213, -49478, -11525, -20981, 210092, -147021, -169278, 178380, -204654, -55582, -220362, 53955, -230961, 105377, -82289, 319525]
10210d78237A81125h4486j54926a471k79461A29868C0340a70082o3518k06868
10200d40468A68695p6156b75035E8789g3321A83723a23978k24701A74856E6149
10189b45095B27406a50711E2705K298a23003J6211j75785O4849Q6964L5346G9595
10177a00769j3012D04413c24553B8193b19290I5393b90593j02028g7083D0993
10166b44522M0437d5720n791l10545c0746j75916a02625o0302H7130e0314b2930
10154a79720C39461d8232g336m9389l0333j58565A65205d4960A06855m5957l235
10143E7663i5515M2767A51648J04243B2364b39349n728A20310b63329g4871B9688
10131a67078K8152p2831c1581A22830M5161a33468n4101N3015L4495j79270D5861
$$ y = [-478237, 181125, -84486, -239412, -1471, -280932, 129868, 30340, -170082, -233600, -440468, 168695, 92539, -275035, 58789, -73321, 183723, -123978, -348679, 174856, 56149, -245095, 227406, -150711, 52705, 55003, -123003, -106792, -282577, -217728, -130764, -95418, 79595, -100769, -113781, 404413, -324553, 28193, -219290, 95393, -290593, -392621, -77083, 40993, -244522, -204085, -45720, -51511, -362056, -30746, -206662, -102625, -162927, 87130, -50314, -22930, -179720, 339461, -48232, -7336, -56725, -87058, -245623, 165205, -44960, 106855, 60898, 57663, -95515, -52748, 151648, 255891, 22364, -239349, -245077, 120310, -263329, -74871, 29688, -167078, -138926, -211757, -31581, 122830, 167991, -133468, -187569, -134554, -100059, -279329, 45861]
10119F9174C2579Q7266a25797A89099i964l20375J22761A28187d708j38362P0164
10108g2906m3864b32I2054a10025H021K03928b87025G213J71236b2565l33856
10097c56421J20483J354h5939D0486K81878A37652F256c66545a63676A02982J96424
10086B99406J09295a01370L2403l32605B56754O5603b55387M9714A614a29292
10075C0857a64612l1010A12967A9990e1054A69037B4614R7915N6200a0819l1822
10064d2641j79234g3889c1697B7274P2121b14975B13948A2312b51941C5121a38515
10052a00691o190A68407a35368A01826a46448A26946a09376i737B12376A1297
10041A23889J24932A1090a18682I6515c0757B8801J73850b58723J11764r9166
$$ y = [69174, 32579, 119845, -125797, 189099, -9964, -330339, -207578, 128187, -4708, -143070, -72906, -116770, -232, 92054, -110025, 8021, 211949, -287025, 7213, 178449, -22565, -356421, -235938, -234584, -85939, 40486, 322364, 137652, 6256, -366545, -163676, 102982, 299406, 408701, -101370, -68967, -401572, 256754, 322357, -255387, -205673, 1614, -129292, 30857, -164612, -195622, 112967, 19990, -51054, 169037, 24614, 122529, 178729, -10819, -42641, -221875, -73889, -31697, 27274, 99395, -214975, 213948, 12312, -251941, 35121, -138515, -100691, -106881, 168407, -135368, 101826, -146448, 126946, -109376, -9737, 212376, 11297, 123889, 248821, 11090, -118682, 96515, -30757, 28801, 202651, -258723, -146959, -246125]
10031b46125R9941j54542g9214j2682p0130j9209A18377e0537D3668J16519K15352
10020C75539E5448O9131J38373d02180a71585C20452G60L04577b91052J33654
10010a57398J6851c1731E6572f9556j56055j7546C44730h9709F633b27070A39598
9998H0583a023l8769E7857g2789i024A49286c9498D78326a3925l88254a56612
9986c62274O3200B00195a60604B51325b74428E8800d01779b9874k57670B260b35168
9974b59747j5619G1396b2294E37b34355H2292a99555j06230d8571E6584c26968
9962A80104a81428D9963a95162K2564a4471A81907L2203a78949A69526b53979
9951A30215c91403i2251c6967A51447b20640R2609b3646j51396e5384l00536a04989
$$ y = [-246125, -146184, -300726, -79214, -91896, -162026, -181235, 118377, -50537, 43668, 160187, 375539, 55448, 124579, 262952, -402180, -171585, 320452, 760, 305337, -291052, -157398, -140547, -31731, 56572, -69556, -225611, -243157, 344730, -89709, 6633, -227070, 139598, 80583, -1023, -39792, 57857, -72789, -9024, 149286, -39498, 478326, -13925, -402179, -156612, -362274, -299074, 200195, -160604, 251325, -274428, 58800, -401779, -29874, -287544, 2260, -235168, -259747, -275366, 71396, -22294, 537, -234355, 82292, -199555, -305785, -48571, 56584, -326968, 180104, -181428, 49963, -195162, -172598, -14471, 181907, 214110, -178949, 169526, -253979, 130215, -391403, -92251, -36967, 151447, -220640, -128031, -23646, -175042, -55384, -355920, -104989]
9939d3356G6658g7713C7774g0465r4199E2099a26734I7064c03831p303F617b02201
9926b01699o3423O3114H1641k0124a30271b2937C9305j5736K232b06597a6166
9914A6951e46097A6287i7379A18964l6276n575c0793k0547l2497b9694p1542A04408
9901F9663b06356l9674A5248h2155G2425a02315J6743A9313b70096A01504a12512
9889b637B74785b4473m3985B96002j03026F9611a15326J9398q3118c0007a2665
9877b19275B9362d77645A8867K67778g8149m0125a5325l87350H4400k1649Q2744
9866A45495n3951b54923e4183A83653a96915A54591J8837e2481C5844a61361d6878
9854c25572B0517a38003J5018N1255l16368A4758M0039a52325A19353c2515k0252
$$ y = [-43356, 76658, -77713, 37774, -70465, -164664, 52099, -126734, 97064, -303831, -311134, 6617, -202201, -201699, -265122, -202008, 81641, 61517, -130271, -22937, 39305, 23569, 25801, -206597, -16166, 16951, -546097, 16287, -97379, 118964, 82688, 77113, -30793, -51340, -83837, -29694, -101236, 104408, 69663, -206356, -246030, 15248, -82155, 72425, -102315, -85572, 19313, -270096, 101504, -112512, -2637, 274785, -24473, -68458, 296002, 192976, 69611, -115326, -95928, -179046, -30007, -12665, -219275, 29362, -477645, 18867, 286645, -78149, -118274, -15325, -402675, 84400, 62751, 145495, 91544, -254923, -54183, 183653, -196915, 154591, 173428, -52481, 35844, -161361, -46878, -325572, 20517, -138003, -122985, -71730, -388098, 14758, 54797, -152325, 119353, -32515, -52767]
9843e2767l1326k40744A99065c0588C1930a56612K1853M0077k6843j17758j15351
9832c54634a72226A55484d0992A3581K48864A20443B176b57459B50555B9994b70030
9820A4418a25498B11083I7384h8280J7179k28491A11888H943a5412E8940O3055
9809A21995A0196h2951A57021c21933B87745a62683j46245i3874a2880A05057
9798i5184m7445C1621c14002O2097q2515a58269A5412b14215e8037n0446A25223
9786C6979i0209m8665A16270Q718b54651c3022F6807i5603d1374a6862j00162
9775a17024N2458k98027a19691A02910B9463j1969B321J23249b9000j68209Q4512
9764a12697d9880j74966J11635e2253G0587a64414B1739a46103e1311J1431F9121
$$ y = [-52767, -84093, -324837, 199065, -30588, 31930, -156612, -134759, -94682, -121525, -239283, -354634, -172226, 155484, -40992, 13581, 262445, 120443, 2176, -257459, 250555, 29994, -270030, 14418, -125498, 211083, 97384, -88280, -71101, -299592, 111888, 8943, -15412, 58940, 121995, 10196, -82951, 157021, -321933, 287745, -162683, -308928, -93874, -12880, 105057, -95184, -142629, 31621, -314002, -251905, -334420, -158269, 15412, -214215, -58037, -108483, 125223, 36979, -90209, -138874, 116270, 124988, -254651, -33022, 66807, -95603, -41374, -16862, -117024, -64566, -362593, -119691, 102910, 29463, 17494, 2321, 125570, -29000, -197209, -112697, -49880, -224846, -113211, -52253, 70587, -164414, 21739, -146103, -51311, -39880, 69121]
9752e3752k58125J44100O1785H4833J9383e1255k02772n0362J50415E3261d15818
9740c57182j74669b36760A83978a73990j24217b167l313C942i6094j44974H1448
9728d3357k65425b1600C7123b39509P0544j1201A2673f1374j1512n0179A70646
9716h865C2161a64314j04455A71654D6200a06256G4638M0038K08268a61551q6210
9705b47761a6548E5635A2668K07006j05383N894a06042d5756B11058b88889A14062
9693g5079m3833j84001a25482b495l4822a3170B3944c00720f2550J6970j27297
9682a72877e3948C51211E026b76149Q7384I2775b39762B26238e6510A38562D5517
9670B68100F8775e3989j00131A71768m4947a57528A03761b40075A11308b1154
$$ y = [-53752, -311877, -167777, -105992, 84833, 104216, -51255, -254027, -304389, -153974, 53261, -415818, -357182, -531851, -236760, 183978, -173990, -298207, -2167, -5480, 3942, -96094, -241068, 81448, -43357, -308782, -21600, 37123, -239509, -168965, -180166, 12673, -61374, -72886, -123065, 170646, -8865, 32161, -164314, -268769, 171654, 46200, -106256, 74638, 114676, 322944, -161551, -247761, -16548, 55635, 12668, 219674, 114291, 120185, -106042, -45756, 211058, -288889, 114062, -75079, -118912, -302913, -125482, -2495, -37317, -13170, 23944, -300720, -62550, -45580, -172877, -53948, 351211, 5026, -276149, -188765, 92775, -239762, 226238, -56510, 138562, 45517, 268100, 68775, -53989, -154120, 171768, 126821, -157528, 103761, -240075, 111308, -21154]
9659g8829A27194e3531B21513b0297C28742h5829C95735D5743f387B1298M2331
9648F3629b12777p1579A11917a27910L9139M571A51871J43818b30902A69271c42955
9636A52888a4127A59485g1410A19937c4137A23022b32430G2926b5320A10978d2303
9624a04151j13397Q8152K6991j92420k4572a4042k34646b2105m7885G1346R2978
9613A64324e70160A50802d60832c281j05347j46668J07996k996g934p8754C33610
9601b38036A84296E7107a24665N797j37070i6809n8347p8394a14131p7966R4786
9590i7311C04656a86645O2970l9676j22664A7706J91509F7489a3222n5315G1599
9578A06950m417a19938J8853d4649B0039c33956D8640a98872j48629b8126B13914
$$ y = [-78829, 127194, -53531, 221513, -20297, 328742, -85829, 395735, 45743, -6387, 21298, 63629, -212777, -284356, 111917, -127910, -88771, -84200, 151871, 295689, -230902, 169271, -342955, 152888, -14127, 159485, -71410, 119937, -34137, 123022, -232430, 72926, -25320, 110978, -42303, -104151, -217548, -129396, -102405, -294825, -319397, -14042, -248688, -22105, -69990, 71346, 164324, -570160, 150802, -460832, -3281, -108628, -255296, -147300, -150296, -7934, -86688, 333610, -238036, 184296, 57107, -124665, -118868, -255938, -96809, -155156, -233550, -114131, -192097, -97311, 304656, -186645, -123675, -163351, -286015, 17706, 209215, 67489, -13222, -68537, 71599, 106950, 102533, -119938, -101085, -44649, 20039, -333956, 48640, -198872, -347501, -28126, 213914]
9566D830a42605B1270a2792j28256L9522a907C86013C2215b90624L3536b0561
9554a17760j63942A6325i6202k70623B56367r6547b11707J4353A72140g1447n4539
9543a25986J2754o0640J4173M492K5559E7519J43528b73309J00253k67620I340
9531f3944o4286F9765K20176a42631e7289l46795E5406a80326B42283P8215g1388
9519A49328h2775K6164G0514A9122J49184C070b07424H8751J02789k2134f3120
9507d81120a57021L0036A77309a3346B49326b64507a30712d3920q4192G3198i9399
9495B03478p9122i2272B4666P2113h9240B42786a16881d2248j7821j55379C78056
9483b89533h2257b0410A37107b82260J04923C834K05197e3613B15367b68282J24931
$$ y = [4830, -142605, 21270, -12792, -141048, -101526, -1907, 386013, 32215, -290624, -257088, -20561, -117760, -281702, 16325, -96202, -366825, 256367, 159820, -211707, -197354, 172140, -71447, -125986, -113232, -173872, -159699, -155207, -129648, 57519, 201047, -273309, -173056, -440676, 9340, -63944, -128230, 69765, 289941, -142631, -57289, -404084, 55406, -180326, 242283, 320498, -71388, 149328, -82775, -56611, 70514, 19122, 168306, 3070, -207424, 88751, 191540, 169406, -63120, -481120, -157021, -126985, 177309, -13346, 249326, -264507, -130712, -43920, -128112, 73198, -99399, 203478, 124356, -92272, 24666, 96779, -89240, 242786, -116881, -42248, -60069, -215448, 378056, -289533, -82257, -20410, 137107, -282260, -177337, 3834, 209031, -53613, 215367, -268282, -143351]
9472a43351a3334I219O2244a51285A16768K18590f7481r625a6002E6940L28555
9461C85495j56259j10063a71086A12104b15531J06540G7508N0490J1585a04835
9450b2180A29658c17175A0187f7360K8279D4377a83715A28382d30026a23692C7649
9438E1074a11975k38793D3381c47184F6234L7322b12941a05014p7657A16855b08055
9426b42538N4438C4129j4138a69205F9485K1828h1906G4304i0130k1432H1423
9414a00140B9328c66355G6286a16775J5872M1819j07715A55598f2557D4580d02364
9402b47448h5189j19092C48b56593j23217I5388n188K77523D2970d51770D1205
9390f3633F5470N7450b00123B10101b17576J4640j23084i4363B46734l1004j04208
$$ y = [-143351, -13334, 9219, 71463, -151285, 116768, 335358, -67481, -77106, -16002, 56940, 385495, 229236, 119173, -171086, 112104, -215531, -108991, 77508, 127998, 139583, -104835, -22180, 129658, -317175, 10187, -67360, -39081, 44377, -183715, 128382, -430026, -123692, 37649, 51074, -111975, -350768, 43381, -347184, 66234, 103556, -212941, -105014, -182671, 116855, -208055, -242538, -188100, 34129, 19991, -169205, 69485, 91313, -81906, 74304, -90130, -111562, 81423, -100140, 29328, -366355, 76286, -116775, -100903, -59084, -166799, 155598, -62557, 44580, -402364, -247448, -85189, -204281, 348, -256593, -379810, 95388, 90200, 367723, 42970, -451770, 41205, -63633, 65470, 122920, -200123, 210101, -217576, -202936, -326020, -94363, 246734, 215730, 111522]
9379A11522e7984B09812c01760J50370m0434k5397r3678E7963c95155a47518e5098
9367b44860C10076j42429F3572a22043d7319l1597D0653b06732a2966A34485f7714
9355e5041F6990L6621a34451C3040c53541a19319k47814h6265G266a68635I5373
9343c52062a077A4756a92972a0954k83014A40236b86807E802J18227c6913J6372
9332b0541k3489n0213B64804f1891H3667j5992b97956A62268p6264J36309A00384
9320f0835C5463a64235A70698E79b35937F3513L2154e9861A07556M8066a72676
9308a17685A68207k2885b25758C4462a45991J071o9099C58454a91329i2037o5052
9297a57089C61707a35980O4903r4710A61259b62200d4873l1888j402C9727a76130
$$ y = [111522, -57984, 209812, -301760, -151390, -191824, -217221, -310899, 57963, -395155, -147518, -55098, -244860, 310076, 167647, 63572, -122043, -47319, -78916, 40653, -206732, -12966, 134485, -67714, -55041, 66990, 103611, -134451, 33040, -353541, -119319, -367133, -86265, 7266, -168635, 95373, -352062, -1077, 14756, -192972, -10954, -293968, 140236, -286807, 5802, 124029, -36913, -20541, -44030, -94243, 264804, -61891, 83667, 67675, -297956, 162268, 86004, 222313, 100384, -60835, 35463, -164235, 170698, 579, -235937, 63513, 95667, -59861, 107556, 155622, -172676, -117685, 168207, 145322, -225758, 34462, -145991, -144920, -214019, 358454, -191329, -92037, -157089, 361707, -135980, -71077, -165787, 161259, -262200, -44873, -76761, -78163, 39727, -176130]
9285a41390O8191c4040o8421j56233R8090k14252b0583j59607C0359Q1246K1175
9274A32780a63412k90497h1969p264A62890e9132b9358k3059B60005A3299i8276
9262F6781Q4489a48507B22770H9720K183a51097M7171k55759a03900A06748b5676
9250a89083d1947A56897a46347J9703N3720K9715D4967k2051J87707e3705j78577
9239b32282h615A80846J12309c3060A50048a85195C43935p6700e4990j11339B19650
9227c02542d5137A5147b82002C0917h5556B71014f056j30915A19469E8632j188
9216E7444B2207a91590r0057F4985a1038C59805A06579b74617o8477J06935C24360
9204A32146k3119e48576f5076n9585l10945C61684b58834A73547D2204f266A27804
$$ y = [-141390, -73199, -34040, -102461, -258694, -160604, -374856, -20583, -180190, 30359, 111605, 132780, -163412, -453909, -81969, -89233, 162890, -59132, -29358, -52417, 260005, 13299, -98276, 66781, 151270, -148507, 222770, 89720, 91903, -151097, -103926, -359685, -103900, 106748, -25676, -189083, -41947, 156897, -146347, -126644, -72924, -43209, 44967, 22916, 210623, -53705, -232282, -8615, 180846, 293155, -33060, 150048, -185195, 343935, 267235, -54990, -166329, 219650, -302542, -45137, 15147, -282002, 30917, -85556, 271014, -6056, -136971, 119469, 58632, 57444, 22207, -191590, -281647, 64985, -11038, 359805, 106579, -274617, -343094, -236159, 324360, 132146, 109027, -548576, -65076, -124661, -435606, 361684, -258834, 173547, 42204, -6266, 127804]
9192A94792O4836a58597L8104p5165k34537M7107c9488A2252i7098I2295b14038
9180g5892C56712b6509n9781B20296A3603L04935d5906G7308a28566b2833n06594
9169e29427F7532b17309p1707B9248O7554b20751C7681a37976H2566b14364J02612
9158a11752a9006A4844b81801a5294g6r4519J2203G1716J4664c99145f220j47907
9146a54127r7634E5842j5884e9846j36597j88155D26072c38845B60665n4009q6770
9135A19886b07954J7799C0429a26352M3082l25866b662B15056B8119a87033R2452
9124i4581A78808a38110a8363p2666F5243a37057b1656k60326j90221J10100c3551
9112F1346Q4991c70302J50717A84417b05580L1684m4534e7830k27995B81042b82466
$$ y = [194792, 259628, -158597, -120493, -195658, -430195, -383088, -39488, 12252, -97098, 92295, -214038, -75892, 356712, -26509, -86290, 220296, 13603, 318538, -45906, 77308, -128566, -22833, -529427, 67532, -217309, -289016, 29248, 96802, -220751, 37681, -137976, 82566, -214364, -111752, -19006, 14844, -281801, -15294, -76, -94595, -82392, 71716, 86380, -399145, -6220, -154127, -251761, 55842, 39958, -59846, -196443, -384598, 426072, -338845, 260665, 206656, 119886, -207954, -190155, 30429, -126352, -83270, -409136, -2662, 215056, 28119, -187033, -94581, 178808, -138110, -18363, -91029, 65243, -137057, -21656, -281982, -472203, -362103, -33551, 61346, 146337, -370302, -219585, 184417, -205580, -173896, -218430, -57830, -285825, 281042, -282466]
9100a35618l9057L320D6440j6998K675c65152d363j08795e631j89725K4576A63144
9087h9320a172j53278A0208c0889k43934c0605G2575a61675g347p0372K4053A75447
9074f942J008F3407B0271M815K26454b2060j48525B58516a54980a6261q7711c5123
9061A81204G7401L659b28025e0916k7733r0707A96170a80406c1628m636j18474
9050a54738A26083b34224A39101M2758C9585Q732J54487b562j46069E2879A9939
9038A8085J00376f25k13754f312E5876K97460a58165j25253O3270J05066j71746
9027b86828E5917R3746a2004l65632B8840R1159i8666B3821l693g8298l3896A10053
9014D13310D5863c21547J12820M5716A33976o0584Q0660a81058j524H4295g7674
$$ y = [-135618, -174675, -171355, 46440, 29442, 32117, -365152, -4363, -113158, -5631, -195356, -170780, 163144, -89320, -1172, -154450, 10208, -30889, -274823, -30605, 72575, -161675, -7347, -77719, -53666, 175447, -6942, -5934, 63407, 20271, 25086, 251540, -22060, -170585, 258516, -154980, -16261, -103972, -35123, 181204, 77401, 81060, -228025, -50916, -78649, -169356, 196170, -180406, -31628, -36264, -154738, 126083, -234224, 139101, 181859, 39585, 48317, 202804, -2562, -148631, 52879, 19939, 18085, 118461, -625, -214379, -6312, 55876, 353336, -158165, -283418, -220148, -115082, -286828, 55917, 149663, -12004, -377636, 28840, 119999, -98666, 23821, 20128, -78298, -112194, 110053, 413310, 45863, -321547, -208727, -163011, 133976, 73392, 154052, -181058, -182582, 84295, -77674]
9002A50040a75194e6898k57590d0082A9096a28783j83802I4607a65739e2919D3935
8990A77162G9556b10660b8081B02054a18798B0580K75649a46890b4205j4531k07661
8979b46397Q9918a3887m9060D6634h5726k90964C2972M6379K36294a37621i680
8967I6102j6468B7862J6081b8392i00p667j80503j25938A69789a47411j88013
8956c35424A81271h450m4888o7575q793B1828i3756r7174h7803c573B1731g1308
8943d16691G4557l0160P9545a84009A1605a87709n619E5154R7756e976m8064m0204
8931i4244c1027A69238b30669H9389K0592J88928M10931L27980J533543O222790
8921H794153q77783A853983B08286J36056j11888J2758a28781G7782J27736h6375
$$ y = [150040, -175194, -56898, -314488, -40082, 19096, -128783, -312585, 94607, -165739, -52919, 43935, 177162, 79556, -210660, -28081, 202054, -118798, 20580, 296229, -146890, -24205, -38736, -246397, -156479, -13887, -62947, 46634, -85726, -376690, 32972, 79351, 315645, -137621, -9680, 96102, 79634, 27862, 43943, -28392, -900, -8567, -189070, -315008, 169789, -147411, -335424, 181271, -8450, -53338, -120913, -129706, 21828, -93756, -190930, -87803, -3573, 21731, -71308, -416691, 74557, 44397, 123942, -184009, 11605, -187709, -193328, 55154, 152910, -5976, -54040, -94244, -31027, 169238, -230669, 89389, 109981, 298909, 709840, 1037820, 2571363, 8794153, 7916370, 1853983, 208286, 344342, 232454, 245212, -128781, 77782, 205518, -86375]
8910A13456D8638K01563o6624b9933C2856O0208c65310D5351J79207b95241h9722
8898b34452c3575j12543B3741d3455a570p4731j10514D0285c59374E6256a47475
8886c30726a7925o1943A84866a6076D4988a36105j9452A96538a46639A26687d00580
8874G6297b83174J18065g9256E5093g4405j01552k0936Q6205P65H2119a05031
8862b35998L2290b6504j9940p7735A04758k297D1292d98243A84972h8324G5140
$$ y = [113456, 48638, 250201, 183577, -29933, 32856, 93064, -365310, 45351, 224558, -295241, -89722, -234452, -33575, -146118, 23741, -43455, -1570, -76301, -186815, 40285, -359374, 56256, -147475, -330726, -17925, -79868, 184866, -16076, 44988, -136105, -155557, 196538, -146639, 126687, -400580, 76297, -283174, -165109, -79256, 55093, -74405, -175957, -196893, -110688, -109923, 82119, -105031, -235998, -203708, -26504, -46444, -124179, 104758, 102461, 41292, -498243, 184972, -88324, 75140]
$$ [...]
##END NTUPLES=NMR SPECTRUM
##END=
