
##TITLE=UV1206_M3_1292-1211_7185466_C9TVL7FzHI
##JCAMPDX= 6.0         $$ Bruker NMR JCAMP-DX V2.0
##DATA TYPE= NMR SPECTRUM
##DATA CLASS= NTUPLES
##ORIGIN= BRUKER
##OWNER= Administrator
$$ 1.72 TOPSPIN		Version 2.1
$$ 2012-12-06 00:08:40.126 -0500  Administrator@X
$$ Compression mode = diff/dup
##.OBSERVE FREQUENCY= 400.02188249412
##.OBSERVE NUCLEUS= ^1H
##.ACQUISITION MODE= SIMULTANEOUS (DQD)
##.ACQUISITION SCHEME= undefined
##.AVERAGES= 64
##.DIGITISER RES= 22
##SPECTROMETER/DATA SYSTEM= spect
##.PULSE SEQUENCE= noesygpps1d.comp
##.SOLVENT NAME= COFFEE_meoh
##.SHIFT REFERENCE= INTERNAL, COFFEE_meoh, 1, 14.96082
##AUDIT TRAIL= $$ (NUMBER, WHEN, WHO, WHERE, PROCESS, VERSION, WHAT)
$$ ##TITLE= Audit trail, TOPSPIN		Version 2.1
$$ ##JCAMPDX= 5.01
$$ ##ORIGIN= Bruker BioSpin GmbH
$$ ##OWNER= Administrator
$$ $$ E:\/data/COFFEE/nmr/UV1206_M3_1292-1211_7185466_C9TVL7FzHI/12/pdata/1/auditp.txt
$$ ##AUDIT TRAIL=  $$ (NUMBER, WHEN, WHO, WHERE, PROCESS, VERSION, WHAT)
(   1,<2012-12-06 00:08:34.267 -0500>,<Administrator>,<X>,<go>,<TOPSPIN 2.1>,
      <created by zg
	started at 2012-12-05 23:57:04.611 -0500,
	POWCHK enabled, PULCHK disabled,
       configuration hash MD5:
       86 BA 57 50 F2 9D 5C 9B 26 00 A9 28 5F 66 2E 89
       data hash MD5: 64K
       CE B1 56 B5 FE 02 6E 23 12 79 DB 55 A4 92 CB 1C>)
(   2,<2012-12-06 00:08:37.314 -0500>,<Administrator>,<X>,<proc1d>,<TOPSPIN 2.1>,
      <Start of raw data processing
       efp LB = 0.3 FT_mod = 6 PKNL = 1 PHC0 = 0 PHC1 = 0 SI = 128K 
       data hash MD5: 128K
       18 CA 3E A3 3E FB 63 C0 B2 57 69 8C 10 22 88 67>)
(   3,<2012-12-06 00:08:38.376 -0500>,<Administrator>,<X>,<proc1d>,<TOPSPIN 2.1>,
      <pk PHC0 = -78.83789 PHC1 = 0 
       data hash MD5: 128K
       8E F4 B7 74 2E 2B D9 2D 64 BC C1 43 EA AA 6C 89>)
(   4,<2012-12-06 00:08:39.079 -0500>,<Administrator>,<X>,<proc1d>,<TOPSPIN 2.1>,
      <abs ABSG = 1 
       data hash MD5: 128K
       EB AB B4 CC 6A DD D1 FA 77 35 33 D9 BA 2E E3 48>)
(   5,<2012-12-06 00:08:39.267 -0500>,<Administrator>,<X>,<proc1d>,<TOPSPIN 2.1>,
      <abs ABSG = 2 
       data hash MD5: 128K
       B1 7F 61 EF 09 72 F6 8F F2 82 06 63 FF 70 4E 8B>)
(   6,<2012-12-06 00:08:39.454 -0500>,<Administrator>,<X>,<proc1d>,<TOPSPIN 2.1>,
      <abs ABSG = 3 
       data hash MD5: 128K
       AB 16 CC 4E 8C 5F 5B 70 D9 C0 8F 99 66 1D FF 6F>)
(   7,<2012-12-06 00:08:39.642 -0500>,<Administrator>,<X>,<proc1d>,<TOPSPIN 2.1>,
      <abs ABSG = 4 
       data hash MD5: 128K
       76 69 05 3E CA F8 0A DD 12 DB A0 F8 72 5C 54 87>)
(   8,<2012-12-06 00:08:39.814 -0500>,<Administrator>,<X>,<proc1d>,<TOPSPIN 2.1>,
      <abs ABSG = 5 
       data hash MD5: 128K
       EF 6B 91 1E E9 3D 82 C6 47 F6 DF AB 80 F2 F2 6F>)
$$ ##END=
$$ 
$$ $$ hash MD5
$$ $$ 0A 82 8F FF 99 45 72 AB 16 0F 38 1B 59 13 39 B5
##$RELAX= 
##$RELAX= 
##$RELAX= 
##$RELAX= 
##$RELAX= 
##$RELAX= 
##$RELAX= 
##$RELAX= 
$$ Bruker specific parameters
$$ --------------------------
##$DU= <E:\>
##$EXPNO= 12
$$ [...]
##$TP07= 0
##$TPNAME0= <>
##$TPNAME1= <>
##$TPNAME2= <>
##$TPNAME3= <>
##$TPNAME4= <>
##$TPNAME5= <>
##$TPNAME6= <>
##$TPNAME7= <>
##$TPOAL= (0..7)
0.5 0.5 0.5 0.5 0.5 0.5 0.5 0.5
##$TPOFFS= (0..7)
0 0 0 0 0 0 0 0
##$TUNHIN= 0
##$TUNHOUT= 0
##$TUNXOUT= 0
##$USERA1= <user>
##$USERA2= <user>
##$USERA3= <user>
##$USERA4= <user>
##$USERA5= <user>
##$V9= 5
##$VALIST= <valist>
##$VCLIST= <CCCCCCCCCCCCCCC>
##$VD= 0
##$VDLIST= <DDDDDDDDDDDDDDD>
##$VPLIST= <PPPPPPPPPPPPPPP>
##$VTLIST= <TTTTTTTTTTTTTTT>
##$WBST= 1024
##$WBSW= 4
##$XGAIN= (0..3)
0 0 0 0
##$XL= 0
##$YL= 0
##$YMAX_a= 5614029
##$YMIN_a= -10443746
##$ZGOPTNS= <>
##$ZL1= 120
##$ZL2= 120
##$ZL3= 120
##$ZL4= 120
##$ABSF1= 14.96082
##$ABSF2= -5.597362
##$ABSG= 5
##$ABSL= 3
##$ALPHA= 0
##$AQORDER= 0
##$ASSFAC= 0
##$ASSFACI= 0
##$ASSFACX= 0
##$ASSWID= 0
##$AUNMP= <proc_prof1d_extract.lims>
##$AXLEFT= 0
##$AXNAME= <>
##$AXNUC= <1H>
##$AXRIGHT= 0
##$AXTYPE= 0
##$AXUNIT= <>
##$AZFE= 0.1
##$AZFW= 0.1
##$BCFW= 0
##$BC_mod= 0
##$BYTORDP= 0
##$COROFFS= 0
##$CY= 15
##$DATMOD= 1
##$DC= 0
##$DFILT= <>
##$DTYPP= 0
##$F1P= 0
##$F2P= 0
##$FCOR= 0.5
##$FTSIZE= 131072
##$FT_mod= 6
##$GAMMA= 0
##$GB= 0
##$INTBC= 1
##$INTSCL= 1
##$ISEN= 128
##$LB= 0.3
##$LEV0= 0
##$LPBIN= 0
##$MAXI= 10000
##$MC2= 0
##$MEAN= 0
##$ME_mod= 0
##$MI= 0
##$NCOEF= 0
##$NC_proc= -2
##$NLEV= 6
##$NOISF1= 0
##$NOISF2= 0
##$NSP= 0
##$NTH_PI= 0
##$NZP= 0
##$OFFSET= 14.96082
##$PC= 1
##$PHC0= -78.83789
##$PHC1= 0
##$PH_mod= 1
##$PKNL= yes
##$PPARMOD= 0
##$PPDIAG= 0
##$PPIPTYP= 0
##$PPMPNUM= 2147483647
##$PPRESOL= 1
##$PSCAL= 4
##$PSIGN= 0
##$PYNMP= <proc.py>
##$REVERSE= no
##$SF= 400.020009708299
##$SI= 131072
##$SIGF1= 0
##$SIGF2= 0
##$SINO= 400
##$SIOLD= 131072
##$SPECTYP= <>
##$SREGLST= <1H.CDCl3>
##$SSB= 0
##$STSI= 131072
##$STSR= 0
##$SW_p= 8223.68421052631
##$SYMM= 0
##$S_DEV= 0
##$TDeff= 65536
##$TDoff= 0
##$TI= <>
##$TILT= no
##$TM1= 0
##$TM2= 0
##$TOPLEV= 0
##$USERP1= <user>
##$USERP2= <user>
##$USERP3= <user>
##$USERP4= <user>
##$USERP5= <user>
##$WDW= 1
##$XDIM= 131072
##$YMAX_p= 371691452
##$YMIN_p= -12500
##$CURPLOT= <Network HP LaserJet P1505>
##$CURPRIN= <$Network HP LaserJet P1505>
##$DFORMAT= <normdp>
##$LAYOUT= <+/1D_H.xwp>
##$LFORMAT= <normlp>
##$PFORMAT= <normpl>
##$SURQMSG= 1
$$ End of Bruker specific parameters
$$ ---------------------------------
##NTUPLES= NMR SPECTRUM
##VAR_NAME=  FREQUENCY,     SPECTRUM/REAL,   SPECTRUM/IMAG
##SYMBOL=    X,             R,               I
##VAR_TYPE=  INDEPENDENT,   DEPENDENT,       DEPENDENT
##VAR_FORM=  AFFN,          ASDF,            ASDF
##VAR_DIM=   131072,        131072,          131072
##UNITS=     HZ,            ARBITRARY UNITS, ARBITRARY UNITS
##FACTOR=    0.0627417313425164, 1,          1
##FIRST=     8223.62146879497, 1080,         -48550
##LAST=      0,             2640,            -48851
##MIN=       0,             -12500,          0
##MAX=       8223.62146879497, 371691452,    0
$$ Real data points
##PAGE= N=1
##DATA TABLE= (X++(R..R)), XYDATA
$$ [...]
68021 113195 112865 112023 110857 109606 108583 107930 107599 107683 108480 110178 112649 115594 118664 121464 123709 125429
68005 125429 126818 127827 128201 127970 127637 127680 128055 128284 127896 126682 124772 122642 120857 119519 118007 115476
67989 115476 111656 107084 102613 98787 95686 93196 91332 90261 90042 90398 90800 90795 90248 89421 88913 89323 90667
67972 90667 92125 92660 92003 90820 89798 88834 87363 85258 83011 81044 79121 76649 73455 70128 67557
67957 67557 66142 65532 65134 64791 64789 65245 65775 65909 65614 65205 64844 64435 64006 63894 64409 65433 66502 67249 67694
67938 67694 68110 68732 69620 70781 72273 74130 76165 77943 78982 79067 78419 77532 76769 76050 75057 73790 72721
67921 72721 72244 72173 72100 72150 72936 74706 76952 79047 80924 82804 84529 85521 85262 83613 80876 77848 75538
67904 75538 74338 73547 72182 70174 68277 66834 65329 63424 61807 61436 62325 63634 64784 65869 67024
67889 67024 68004 68588 68941 69269 69435 69197 68629 68002 67420 66901 66693 67093 67908 68493 68529 68477 68989 70045 70959
67870 70959 71203 70939 70666 70585 70462 70101 69763 70007 71025 72163 72355 71218 69545 68447 68065 67475 65905
67853 65905 63654 61651 60466 60054 60224 60884 61841 62707 63145 63006 62214 60736 58779 56840 55365 54415 53707
67836 53707 53033 52550 52606 53206 53769 53618 52800 52165 52419 53291 53942 54068 54272 55276 57153 59411 61570 63384
67818 63384 64674 65247 65038 64272 63423 63007 63297 64209 65424 66585 67318 67246 66202 64482 62710 61447 60931
67801 60931 61015 61108 60407 58672 56825 56248 57273 58765 59411 58996 58036 56669 54666 52411 51047 51286 52473
67784 52473 53234 52923 52212 52267 53488 55064 55744 55042 53697 52913 53280 54499 55966 57238 57943 57700 56540
67767 56540 55255 54963 56144 58277 60524 62581 64678 66865 68696 69802 70464 71309 72527 73794 74915
67752 74915 76101 77408 78384 78599 78207 77607 76764 75398 73716 72438 71925 71751 71352 70765 70434 70454 70337 69534
67734 69534 67975 66052 64150 62291 60269 58067 55942 54083 52357 50627 49095 48067 47495 47096 46881
67719 46881 47151 47866 48416 48277 47645 47188 47275 47628 47646 46982 45884 45005 44749 44797 44484 43669 42958 42966 43653 44562
67699 44562 45412 46222 47035 47813 48502 49029 49369 49696 50249 50919 51246 51067 50901 51349 52272 52904 52664 51605 50180
67680 50180 48878 47966 47355 46800 46473 46997 48567 50308 51101 50898 50618 50788 50992 50779 50341 49983 49617 49294
67662 49294 49666 51258 53558 55485 56590 57261 57829 58156 58207 58463 59394 60773 61820 61936 61177 60112 59344
67645 59344 59075 59039 58842 58316 57478 56345 55030 53960 53660 54246 55378 56784 58491 60372 61801 62169 61649
67628 61649 61010 60657 60176 59032 57465 56404 56528 57652 59047 60182 61006 61628 61977 61910 61536 61198 61074
67611 61074 60980 60728 60494 60578 60824 60654 59830 58938 58816 59583 60535 60994 60958 60783 60514 59822 58580 57189 56191
67592 56191 55702 55393 55019 54706 54660 54735 54577 54132 53715 53489 53165 52435 51509 50931 50907 51103 51065 50651 50025 49431
67572 49431 49011 48704 48351 47974 47838 48084 48513 49000 49784 50927 51756 51587 50904 50957 52019 52921 52722 51983 51730
67553 51730 51925 51855 51477 51315 51313 50841 49856 49060 48799 48654 48332 48082 47906 47249 45959 44896 44900 45673 46329 46664
67533 46664 47226 48291 49389 49896 49661 49024 48445 48131 47848 47180 46078 44996 44368 44169 44136 44168 44265 44352 44417
67514 44417 44596 44890 45058 45039 45190 45801 46601 47105 47218 47153 46980 46645 46220 45693 44681 42871 40683 39025
67496 39025 38367 38436 38753 39033 39078 38782 38417 38550 39505 41049 42612 43635 43792 43268 42800 43043 43856 44531 44730
67477 44730 44759 44895 44933 44612 44068 43595 43287 43177 43489 44409 45775 47177 48252 48757 48566 47788 46757 45759
67459 45759 44888 44206 43840 43773 43764 43602 43302 43013 42961 43550 45088 47194 48810 49146 48447 47559 46954 46497 45951
67440 45951 45287 44571 43964 43843 44590 46086 47621 48404 48147 47237 46465 46521 47458 48621 49211 48960 48181 47333
67422 47333 46747 46655 47129 47930 48689 49306 49941 50559 50813 50556 50194 50222 50562 50617 49947 48593 46789 44706 42615
67403 42615 41005 40262 40323 40824 41494 42226 42867 43302 43785 44835 46593 48467 49666 49972 49764 49406 48954 48431
67385 48431 48041 47955 48169 48692 49612 50729 51348 50836 49400 48024 47518 47779 48100 48046 47804 47805 48198 48789 49266
67366 49266 49367 48949 48131 47320 46871 46659 46204 45340 44548 44431 44988 45635 45894 45823 45761 45924 46306 46868 47653 48743
67346 48743 50078 51330 52017 51871 51030 49858 48691 47861 47710 48270 49034 49420 49478 49812 50724 51753 52227 51997
67328 51997 51489 51254 51641 52670 53988 55028 55469 55501 55478 55371 54776 53544 52249 51841 52725 54280 55486
67311 55486 56007 56379 57038 57539 57122 55762 54183 52981 52319 52382 53361 54822 55821 56059 56347 57431 58863
67294 58863 59613 59404 58774 58052 57038 55646 54181 52888 51825 51217 51407 52232 52979 53264 53487 54113 54868
67277 54868 55120 54751 54226 53925 53893 54242 55304 57154 59251 60764 61112 60107 57882 55056 52774 52023 52700
67260 52700 53700 54141 54194 54412 54671 54397 53681 53404 54051 55018 55453 55289 54986 54686 54249 53912 54214 55223 56320
67241 56320 56909 56961 56738 56394 55997 55696 55570 55510 55430 55488 55872 56455 56841 56792 56489 56310 56430 56787 57395 58475
67221 58475 60063 61672 62707 63181 63611 64106 64053 63018 61525 60451 59893 59191 58033 56990 56848 57788 59367
67204 59367 61042 62549 63924 65214 66194 66484 66091 65578 65396 65275 64658 63567 62557 61939 61605 61616 62281
67187 62281 63472 64430 64603 64284 64138 64447 65115 66025 66996 67659 67756 67477 67216 67113 67050 66972 66936 67001 67259 67857
67167 67857 68822 69956 71044 71988 72608 72604 71938 71043 70370 69956 69693 69771 70482 71721 73003 73925 74348 74282 73936
67148 73936 73795 74260 75202 76136 76744 76967 76716 75991 75265 75219 75874 76408 76101 75200 74586 74852 75919 77367 78832
67129 78832 80168 81414 82509 83012 82404 80871 79484 79167 79722 80322 80781 81675 83192 84646 85477 86113 87236
67112 87236 88672 89719 90358 91257 92556 93493 93570 93410 93937 95236 96776 98396 100305 102280 103553 103713
67096 103713 103240 102949 103219 103888 104599 105087 105352 105658 106232 106899 107205 106934 106306 105668 105245 105224 105823 107167 109238
67077 109238 111895 114741 117086 118497 119330 120337 121648 122658 123048 123361 124226 125465 126455 127055 127666 128575
67061 128575 129759 131279 133291 135572 137454 138508 139133 140255 142461 145505 148631 151292 153510 155566
67047 155566 157481 158914 159503 159210 158437 157942 158444 159968 161685 162806 163580 164955 167336 170190 172899 175287
67031 175287 177177 178258 178839 179999 182321 185055 187212 188958 191148 193896 196541 198726 200598 202067
67017 202067 202908 203630 205260 208074 211364 214651 218193 222018 225479 228378 231637 236032 240828 244517 246589
67002 246589 247835 249186 251031 253515 256711 260327 263814 266955 270033 273353 276931 280692 284639 288775
66988 288775 293074 297555 302152 306597 310701 314645 318707 322814 326777 330788 335212 339876 344186 348080
66974 348080 352272 357261 362638 367803 372910 378555 384858 391470 398302 405556 413037 420116 426584 433004
66960 433004 439911 447125 454220 461303 468868 477134 485954 495200 504799 514523 524246 534352 545355 557032
66946 557032 568461 579073 589207 599401 609706 620088 631036 643146 656274 669681 683014
66935 683014 696647 710972 725870 741129 757035 774118 792376 810982 828879 845633 861768
66924 861768 878347 896229 915593 936031 957028 978462 1000702 1024152 1048564 1073017 1096843
66913 1096843 1120480 1145013 1170853 1197334 1223717 1250100 1277092 1305076 1334124 1364163 1394784
66902 1394784 1425362 1455938 1487568 1521086 1555786 1590108 1623434 1656410 1689611 1722918 1756321
66891 1756321 1790309 1824962 1859529 1893471 1927261 1961442 1995445 2028102 2059020 2088759 2117778
66880 2117778 2145931 2172993 2199049 2224150 2247906 2269638 2288803 2305267 2319330 2331428 2341686
66869 2341686 2349836 2355684 2359467 2361549 2361941 2360356 2356566 2350426 2341750 2330475 2316920 2301591 2284722
66856 2284722 2266154 2245582 2222818 2198044 2171954 2145346 2118258 2089757 2059004 2026378 1993126
66845 1993126 1960049 1926993 1893600 1859939 1826245 1792477 1758438 1724098 1689590 1655016 1620428
66834 1620428 1585887 1551509 1517545 1484427 1452551 1421987 1392510 1363838 1335671 1307568 1279132
66823 1279132 1250409 1221913 1194167 1167405 1141639 1116755 1092469 1068466 1044737 1021592 999224
66812 999224 977469 956137 935380 915511 896536 878043 859564 840970 822529 804645 787540
66801 787540 771118 755147 739499 724214 709363 694934 680859 667144 653978 641658 630246
66790 630246 619285 608069 596281 584179 572087 560038 548121 536799 526423 516644 506839 497071
66778 497071 488151 480629 474135 467812 461061 453759 446086 438377 430940 423868 417109 410642 404374 397929
66764 397929 390970 383779 377132 371457 366412 361352 355869 349841 343462 337410 332474 328617 324816 320216
66750 320216 315130 310530 306852 303769 300906 298163 295355 292022 287801 282799 277526 272503 267874 263338
66736 263338 258674 254348 251146 249028 246898 243988 240926 238761 237250 235084 231719 228061 225168 223027
66722 223027 220979 218621 215820 212421 208492 204506 200809 197254 193762 190848 188994 187777 186339 184563
66708 184563 183080 182065 180807 178748 176349 174447 173129 171744 169814 167506 165236 163244 161547 159980
66694 159980 158145 155682 152813 150442 149350 149303 149191 148163 146478 145085 144511 144341 143838 142827 141821 141344
66678 141344 141322 141201 140544 139414 138208 137204 136289 135115 133518 131796 130544 130062 129910 129185 127426 125192
66662 125192 123550 122955 122854 122479 121791 121397 121704 122477 123186 123421 122902 121440 119176 116724 114813 113798 113596
66645 113596 113925 114385 114469 113817 112596 111424 110845 110932 111346 111599 111276 110249 108834 107583 106758 106108 105257 104197
66627 104197 103273 102791 102809 103168 103451 103023 101473 99196 97230 96304 96196 96229 96146 96154 96236 95946 95064 94049 93486
66608 93486 93321 93003 92284 91481 90919 90499 89989 89464 89192 89250 89501 89852 90205 90162 89129 86992 84555 82998
66590 82998 82836 83533 84206 84515 84691 84854 84707 84002 82964 81941 80878 79496 77890 76500 75519 74786 74356
66573 74356 74571 75279 75572 74847 73746 73350 73679 73758 73155 72606 72857 73601 74100 74287 74610 75013 74827 73743 72416
66554 72416 71834 72316 73300 74006 74135 73873 73386 72614 71677 71147 71427 72016 71994 71306 70871 71166 71476 71091 70546
66535 70546 70815 71747 72299 72176 72164 72716 73150 72621 71148 69323 67657 66583 66486 67175 67771 67609 66874 66035
66517 66035 65147 64218 63682 63863 64319 64434 64321 64447 64599 64071 62809 61557 60802 60297 59746 59244 58832 58317
66499 58317 57853 58096 59295 60762 61688 62100 62526 63045 63235 62887 62265 61704 61323 61134 61050 60858 60461 60156 60330
66480 60330 60853 61083 60560 59450 58192 56940 55573 54090 52759 51864 51467 51494 51913 52649 53386 53720 53656 53794
66462 53794 54730 56297 57660 58187 58037 57821 57927 58318 58773 59128 59358 59530 59663 59646 59427 59228 59317 59570 59573 59251
66442 59251 59028 59200 59495 59594 59716 60264 61050 61380 60854 59718 58445 57310 56422 55802 55389 55171 55327 55965
66424 55965 56793 57336 57485 57475 57370 56960 56223 55430 54698 53884 53098 52810 53151 53554 53504 53244 53245 53324 52951 52292 52214
66403 52214 53136 54471 55470 56104 56719 57184 56920 55707 54080 52850 52422 52603 52890 52893 52638 52511 52793 53177
66385 53177 52907 51539 49574 48130 47931 48671 49458 49769 49869 50341 51435 52888 54175 54841 54808 54512 54517 54771
66367 54771 54469 53054 51224 50437 51316 52992 54245 54828 55279 55827 56084 55711 54842 53764 52660 51766 51371
66350 51371 51436 51573 51644 52035 53036 54233 54931 55010 54963 55130 55311 55197 54848 54623 54893 55820 57154 58206 58359
66331 58359 57724 56957 56335 55453 54115 53045 53143 54270 55387 55883 56160 56773 57592 58167 58489 58912 59468 59741
66313 59741 59358 58325 56894 55391 54152 53299 52560 51555 50343 49383 48919 48711 48515 48487 48831 49338 49637
66296 49637 49772 50170 51067 52340 53868 55646 57380 58397 58216 57066 55615 54406 53770 54028 55283 57026
66280 57026 58370 58877 58958 59313 60158 61086 61521 61162 60165 59099 58583 58767 59238 59615 60126 61264 62843 63812
66262 63812 63221 61222 58880 57121 56115 55528 55013 54412 53756 53270 53166 53313 53305 53003 52787 53076 53725 54205
66244 54205 54306 54369 54760 55373 55772 55696 55388 55499 56625 58719 60920 62187 62169 61369 60491 59881 59588 59612 59908
66225 59908 60402 61200 62526 64286 65867 66625 66402 65454 64182 63116 62809 63298 63892 63927 63605 63639 64229 64905
66207 64905 65361 65830 66588 67589 68809 70411 72281 73761 74250 73803 72906 71944 71150 70749 70727 70621 70007 69152
66189 69152 68808 69363 70507 71744 72906 73974 74655 74428 73073 71040 69211 68241 68147 68533 69080 69694 70288
66172 70288 70748 71191 71963 73241 74766 76111 77002 77280 76770 75509 73975 72806 72224 71847 71089 69714 68061
66155 68061 66773 66195 66025 65689 65056 64584 64723 65476 66640 68136 69886 71668 73315 74765 75717 75655 74615
66138 74615 73534 73319 73773 74011 73730 73436 73515 73818 74257 75059 76156 76910 76878 76388 75984 75651 75027 74097 73206
66119 73206 72562 72144 72024 72405 73345 74762 76603 78710 80534 81394 81200 80678 80727 81659 83137 84655 85933
66102 85933 86961 87879 88828 89801 90612 91062 91159 91089 90947 90568 89714 88373 86794 85322 84309 84128 84963 86454
66084 86454 87819 88566 88977 89670 90771 91789 92274 92328 92341 92416 92235 91469 90229 89076 88591 88923 89787 90787
66066 90787 91597 91902 91541 90902 90790 91602 92819 93663 94010 94227 94238 93391 91426 89114 87639 87501 88197 88783
66048 88783 88677 88024 87381 87028 86761 86458 86520 87311 88379 88878 88721 88738 89590 91066 92628 94021 95115 95747
66030 95747 96098 96748 97938 99148 99793 99987 100227 100780 101800 103645 106414 109440 111798 113236 114170 114981
66014 114981 115794 116735 117831 118725 119052 118990 119038 119335 119745 120402 121521 122721 123290 123226 123370 124306 125843 127843
65996 127843 130798 135010 139647 143410 145998 148387 151571 155447 159071 161787 163854 166014 168604 171221
65982 171221 173244 174416 174810 174452 173275 171298 168543 164911 160504 155920 151813 148190 144606 141044 138051
65967 138051 135908 134215 132515 130857 129477 128351 127334 126379 125345 123971 122375 121168 120729 120701 120578
65952 120578 120454 120759 121564 122637 123918 125455 127068 128626 130509 133184 136389 139292 141566 143731 146323
65937 146323 149153 151633 153477 154860 156140 157614 159340 161075 162534 163791 165209 166929 168672 170136
65923 170136 171371 172654 174165 175880 177632 179290 181076 183639 187451 192046 196252 199340 201645 203888
65909 203888 206304 208736 211234 213996 216809 219001 220062 220060 219435 218621 217915 217443 217143 216890 216695 216669 216771
65892 216771 216702 216061 214546 212081 208881 205366 201799 197989 193555 188511 183426 178881 174904 171068 167043
65877 167043 162916 159006 155429 151902 147969 143533 139171 135750 133623 132285 130935 129286 127701 126681
65863 126681 126417 126803 127592 128448 129086 129544 130203 131331 132668 133622 133886 133659 133250 132688 131888 131078 130768 131222
65845 131222 132141 132978 133555 134231 135474 137318 139267 140685 141318 141503 141886 142860 144203 145297 145734 145690 145620
65828 145620 145656 145513 145082 144912 145804 147930 150614 153156 155614 158488 161811 165033 167888 170884 174614 178883
65812 178883 182921 186231 188769 190417 190847 190022 188308 185933 182794 179052 175407 172348 169548 166458 163142
65797 163142 159963 156811 153407 150232 148194 147186 145873 143350 140390 138447 137882 137782 137248 136271 135439
65782 135439 135347 136317 138289 140915 143991 147732 152389 157741 163324 168995 174827 180495 185282 188830 191482
65767 191482 193671 195235 195563 194243 191370 187348 182599 177472 172331 167541 163236 159125 154852 150675
65753 150675 147564 146390 147272 149868 153911 159022 164450 169709 175354 182419 191080 200561 210360 220746
65739 220746 231774 242631 252461 261265 269412 276728 282613 286682 288743 288440 285495 280133 272758 263433
65725 263433 252239 239978 227832 216283 204869 193139 181413 170529 161167 153460 146946 140864
65713 140864 134831 129264 124803 121373 118234 115010 112106 109946 108273 106589 104949 103857 103538 103716 104080
65698 104080 104589 105183 105480 105097 104272 103869 104512 105796 106623 106417 105702 105370 105694 106361 107221 108527 110467 112862
65680 112862 115406 117890 120143 122035 123681 125473 127819 130928 134825 139385 144445 150094 156786 164908
65666 164908 174326 184615 195629 207452 219940 232757 245814 259077 271926 283369 293110 301785
65654 301785 309780 316430 320858 323071 323663 322887 320756 317851 315291 313856 313590 314169 315156 316012 316471 316926
65638 316926 317808 318501 317549 314132 308762 302168 294182 284212 272391 259544 246267 232659 218925 205573
65624 205573 192904 180813 169311 158840 149773 141922 134904 128746 123760 119927 116856 114400 112898
65611 112898 112588 112978 113058 112051 109815 106764 103652 101322 100197 99904 99677 99242 99027 99354 99727 99359 98236
65594 98236 97211 96989 97404 97936 98553 99636 101166 102537 103322 103930 105136 107120 109323 111225 112893 114670
65578 114670 116751 119357 123017 128097 134135 140155 145839 151993 159640 169005 179675 191387 204152
65565 204152 217699 231258 243975 255256 264684 271998 277295 280947 283055 283158 280678 275485 267886
65552 267886 258200 246676 233830 220550 207709 195711 184459 173687 163281 153405 144412 136666
65540 136666 130344 125357 121461 118412 116027 114102 112381 110677 108992 107460 106116 104824 103485 102244
65526 102244 101365 100922 100779 100881 101339 102079 102549 102085 100583 98572 96528 94357 91728 88773 86175 84578
65510 84578 84092 84352 84824 85065 84963 84848 85205 86147 87337 88523 89901 91760 93983 96153 97925 98994
65494 98994 98930 97618 95885 95142 96115 98149 99923 100619 100325 99718 99667 100782 102900 105172 106956 108485 110282
65477 110282 112175 113477 114115 114895 116337 117742 117907 116497 114214 111733 109056 106092 103445 102124 102477
65462 102477 103696 104503 104228 103189 102145 101552 101340 101207 100970 100629 100228 99755 99151 98357 97334 96096 94810
65445 94810 93853 93697 94581 96296 98327 100251 101961 103455 104567 105075 105129 105385 106461 108301 110317 112245
65429 112245 114523 117541 120714 122738 122794 121145 118536 115536 112680 110647 109737 109398 108837 107982 107382 107285
65413 107285 107432 107730 108484 109799 111298 112673 114016 115337 116211 116316 115970 115743 115757 115650 114987 113559 111613
65396 111613 110047 109901 111262 113045 114269 115123 116345 118055 119915 122005 124630 127343 129111 129524 129174
65381 129174 128726 128336 128063 128053 128054 127514 126548 126096 126640 127392 127337 126652 126380 127033 128193 129379 130698 132595 135337
65362 135337 138743 142167 144875 146748 148528 151079 154482 158094 161370 164372 167567 171401 175950 180712
65348 180712 184903 188179 190925 193625 196204 198314 199918 201115 201626 201109 199801 198230 196332 193610 190212
65333 190212 187079 184652 182182 178760 174474 169990 165442 160445 154968 149530 144621 140461 137294 135301
65319 135301 134125 132996 131550 130089 128890 127672 126079 124292 122699 121195 119307 116980 114784 113229
65305 113229 112159 111014 109442 107530 105624 104146 103421 103440 103772 103909 103732 103585 103923 104941 106403 107685
65289 107685 108155 107783 107399 107975 109574 111219 111913 111565 110713 109664 108321 106759 105498 105012 105184 105449 105388
65272 105388 105093 105066 105840 107586 109931 112184 113835 114826 115337 115466 115250 114923 114878 115312 116050 116810 117463 117916
65254 117916 117953 117445 116666 116155 116231 116857 117873 119026 119735 119341 117941 116581 116172 116403 116199 115054 113423
65237 113423 111899 110651 109805 109661 110193 110798 110958 110843 110859 110930 110672 110024 109256 108523 107887 107582 107724 107825 107175
65218 107175 105770 104380 103590 103241 102967 102767 102772 102847 102768 102518 102145 101660 101359 101818 103060 104071 103811 102638
65200 102638 102056 102876 104248 104811 104297 103519 103153 103162 103306 103588 104002 104311 104381 104480 104960 105853 107022 108456 110063
65181 110063 111359 111839 111632 111371 111342 111223 110844 110741 111568 113207 114794 115481 114940 113377 111464 110091 109718
65164 109718 109976 110181 110133 110050 109884 109378 108838 109164 110715 112641 113834 114288 115000 116650 118864 120799 122044
65147 122044 122835 123671 124962 126881 129325 131999 134646 137299 140367 144423 149760 156103 162851 169603 176264
65132 176264 182592 187955 191853 194544 196825 199208 201563 203539 204941 205626 205445 204548 203462 202568 201626
65117 201626 200116 197926 195425 192941 190496 188006 185364 182294 178535 174337 170398 167037 163746 159923
65103 159923 155762 151970 148745 145525 141754 137472 133100 129102 125915 123775 122357 120983 119393 117924
65089 117924 116723 115272 113177 111048 109972 110223 111072 111845 112600 113635 114829 115764 116247 116438 116562 116691
65073 116691 116720 116527 116176 115911 115833 115722 115358 114897 114638 114487 114013 113047 111895 110917 110219 109828 109875 110435 111435
65054 111435 112799 114432 116044 117229 117833 117969 117704 117056 116361 116167 116572 117003 116869 116153 115267 114682 114764 115447
65036 115447 115885 115018 112969 111272 111162 112033 112267 111224 109638 108269 107096 105968 105155 104831 104566 103806
65020 103806 102572 101389 100743 100837 101606 102737 103867 104972 106328 107929 109174 109495 109157 109114 110011 111538
65004 111538 112816 113307 113279 113475 114459 116272 118604 121066 123289 124997 126166 127032 127834 128667 129637 130894
64988 130894 132258 133115 133071 132609 132677 133704 135371 137228 139037 140535 141496 142167 143111 144363 145292 145596 145801
64971 145801 146283 146346 145001 142370 139535 137091 134680 132036 129692 128165 127027 125349 122847 120127 117980
64956 117980 116804 116597 116995 117275 116788 115619 114588 114371 114830 115398 115942 116813 118027 118832 118425 116899 115139
64939 115139 113770 112574 111074 109404 108278 108160 108823 109756 110710 111650 112458 113009 113502 114332 115517 116488 116634
64922 116634 115911 114743 113526 112457 111659 111095 110381 109137 107673 106956 107607 109137 110527 111408 112294 113701
64906 113701 115405 116779 117627 118432 119814 121888 124175 126041 127189 127799 128407 129696 132157 135646 139381
64891 139381 142698 145840 149588 154055 158357 161747 164588 167731 171361 175116 179035 183544 188444 192778
64877 192778 195945 198285 200138 200927 199826 196965 193332 189649 185978 182371 179254 176892 174960 172981
64863 172981 170992 169420 168401 167494 166167 164338 162341 160447 158583 156524 154190 151671 149063 146424
64849 146424 143894 141699 139956 138466 136777 134529 131860 129425 127827 126950 126004 124345 122077 119715 117574
64834 117574 115795 114756 114879 115997 117302 118120 118484 118893 119723 120938 122157 122964 123317 123580 123947 124028 123451
64817 123451 122718 122833 124048 125616 126924 128161 129580 130858 131786 133005 135317 138565 141868 144717 147273
64802 147273 149742 152073 154218 156149 157712 158878 160033 161499 162894 163490 163072 161919 160136 157711 155184
64787 155184 153439 152638 151996 150796 149045 147031 144947 143285 142820 143643 144733 145090 144943 145296 146535 148028
64771 148028 148941 149033 148703 148621 149235 150397 151601 152732 154361 157024 160548 164427 168564 173174 178092 182661
64755 182661 186351 189169 191511 193849 196476 199348 202291 205552 209814 215259 220852 225086 227371 228281
64741 228281 228583 228571 228233 227358 225392 221837 217029 211962 207101 201934 196064 190126 185076 180978 177206
64726 177206 173642 171027 170005 170337 171188 171822 171905 171494 170986 170908 171557 172888 174805 177387 180708 184537 188425
64709 188425 192070 195480 198769 201823 204193 205335 204943 203131 200370 197284 194404 191942 189659 187002
64695 187002 183546 179366 174982 170926 167374 164162 161035 157871 154727 151859 149657 148393 147901 147573 146918
64680 146918 146061 145553 145724 146485 147778 149739 152183 154328 155571 156335 157594 159598 161625 163093 164323
64665 164323 166019 168458 171472 174668 177331 178638 178576 178208 178401 178574 177486 175051 172532 170872 169697
64650 169697 168189 166159 163865 161447 159194 157821 157825 158804 159954 161065 162477 164283 166183 168045 169995
64635 169995 171904 173392 174512 175960 178322 181471 184931 188518 192350 196525 201089 206146 211627 216980
64621 216980 221334 223954 224436 222646 218783 213572 208059 202984 198342 193644 188655 183764 179592 176291
64607 176291 173370 170265 166938 163810 161255 159369 158104 157285 156503 155347 153890 152667 152004 151666 151403
64592 151403 151540 152573 154261 155644 156096 156079 156619 158221 160442 162443 163748 164604 165821 168262 172331 177794
64576 177794 184076 190732 197636 204822 212242 219694 226922 233768 240293 246651 252701 257779 261027 262089
64562 262089 261325 259272 256057 251511 245665 238874 231590 224317 217669 212020 207022 201949 196641 191689
64548 191689 187461 183486 179288 175381 172810 171865 171872 172184 172719 173468 174117 174468 174789 175449 176476 177684 178906
64531 178906 179862 180098 179241 177159 173856 169688 165735 163374 163013 163625 163939 163720 163476 163330 162912 162186 161644
64514 161644 161601 161818 161939 161870 161534 160727 159508 158471 158317 159183 160538 161725 162551 163372 164610 166199 167667
64497 167667 168781 169877 171389 173332 175514 178042 181190 184854 188524 191839 194853 197700 200239 202125
64483 202125 203102 203230 202971 202851 202925 202793 202409 202493 203624 205218 206090 205981 205756 205976 206047 205128 203254 201061
64465 201061 198874 196607 194250 191986 189983 188471 187877 188496 190135 192423 195314 198923 202959 206690 209527
64450 209527 211348 212248 212248 211414 210150 209223 209396 210927 213396 216153 218920 221833 224998 228388 232248 237131
64434 237131 243274 250257 257653 265786 275463 287123 300691 316159 333857 354071 376683 401349
64422 401349 427875 456419 487503 521867 560178 602768 649591 700230 753850 809304 865434
64411 865434 921093 974785 1024647 1069173 1107795 1140369 1166240 1184248 1193592 1194288 1186822 1171824
64399 1171824 1150126 1122615 1089737 1051479 1008060 960372 909500 856117 800733 744394 688739
64388 688739 635285 584838 537674 494087 454637 419889 389957 364326 342174 322911 306441
64377 306441 292966 282520 274593 268120 261938 255395 248624 242179 236479 231624 227498 223782 219897 215310
64363 215310 210013 204575 199607 195312 191568 188208 185101 182117 179180 176251 173225 170045 167045 164911
64349 164911 163961 163669 163284 162937 163688 166298 170232 174124 176984 178686 179553 179954 180276 180817 181428 181541 180758
64332 180758 179222 177275 175018 172494 170032 168099 166941 166694 167588 169523 171609 172739 172773 172663 173241 174405
64316 174405 175604 176533 176998 176723 175896 175536 176592 178833 181141 182729 183560 183726 183141 181884 180213 178082
64300 178082 175168 171566 167929 164673 161488 157935 154147 150619 147661 145404 143997 143371 143023 142479 141877
64285 141877 141731 142248 143251 144608 146238 147701 148368 148285 148476 149992 152851 156167 159212 161966 164690 167347
64269 167347 169712 171879 174354 177539 181231 184744 187463 189234 190179 190389 189931 189102 188380 187997 187758 187475
64253 187475 187444 188148 189464 190502 190327 188667 185787 182078 178038 174380 171598 169422 167093 164266 161362
64238 161362 159069 157846 157919 159243 161272 163154 164474 165571 166917 168568 170518 173198 177069 181836 186594
64223 186594 190773 194590 198493 202561 206611 210636 214824 219149 223200 226578 229440 232362 235506 238195
64209 238195 239662 240000 239810 238992 236673 232489 227261 222003 216907 211759 206676 201763 196631 191110 186003
64194 186003 182263 179700 177400 175180 173644 172929 172486 172194 172642 174061 175946 178105 181173 185601 190909
64179 190909 196383 201721 206496 209810 211224 211416 211148 210069 207318 202905 197726 192424 187028 181587 176483
64164 176483 172077 168510 165814 163808 161952 159729 157109 154377 151728 149402 147915 147624 148181 148899 149543
64149 149543 150326 151265 152078 152715 153495 154656 156119 157732 159452 161301 163341 165634 167960 169783 170779 171220
64133 171220 171540 171790 171854 171808 171529 170307 167647 164339 161938 161117 161176 161242 161197 161228 161239 161185 161489 162649 164645
64114 164645 167050 169524 172067 175013 178861 183777 189124 193853 197505 200562 203757 207457 211679 216147
64100 216147 220157 223027 225032 227325 230500 233786 236218 238187 241069 245546 250966 256262 260805 264239
64086 264239 266153 266338 265138 263184 260800 257756 253532 247821 240845 233263 225794 219000 213308 208865
64072 208865 205216 201489 197280 193232 190329 188755 187810 186918 186234 186142 186565 187001 186973 186285 185078 183857 183247
64055 183247 183488 184265 185213 186360 187872 189552 191023 192313 193913 196161 198883 201716 204512 207348 210434
64040 210434 214139 218742 223901 228649 232133 234200 235072 234944 234262 233888 234193 234219 232616 229431 226126 223713
64024 223713 221863 220254 219652 220727 222484 223067 221910 220197 219339 219887 221789 224609 227180 228005 226535
64009 226535 223592 220267 216984 213896 211399 209666 208228 206669 205352 204859 204922 204575 203245 201166 198796
63994 198796 196413 194340 193026 192680 193105 194054 195533 197591 200036 202547 205049 207840 211289 215429 219849
63979 219849 224119 228260 232661 237540 242717 247967 253278 258602 263702 268531 273573 279406 286075 293197
63965 293197 300543 308158 316009 324019 332502 342035 352751 364134 375794 388164 402144 418359 437076
63952 437076 458632 483445 511633 543134 578385 618573 664972 718237 778588 846553 923235
63941 923235 1009854 1107196 1215427 1334100 1462269 1598793 1742685 1893029 2048515 2207092
63931 2207092 2366059 2522188 2671663 2810260 2934027 3039972 3126096 3191010 3233661 3253286
63921 3253286 3249380 3221704 3170453 3096382 3000752 2885419 2753221 2608090 2454410 2296103
63911 2296103 2136279 1977455 1821844 1671530 1528585 1394828 1271290 1158191 1055728
63902 1055728 964567 885078 816407 756913 705420 661460 624388 593029 566319 543624 524194
63891 524194 506865 490620 475045 460063 445686 432198 419987 408933 398422 388278 379106 371400
63879 371400 364859 359040 354139 350564 348141 346406 345395 345580 347184 350100 354336 360064 367297 375957
63865 375957 386110 397742 410438 423673 437355 451692 466707 482200 498025 514017 529833
63854 529833 545253 560438 575502 590055 603635 616356 628506 639593 648332 653621 655207 653595
63842 653595 649741 644556 638026 628910 615937 599329 580595 561041 541206 521616 502944 485089
63830 485089 467044 448327 429897 413021 397752 383168 368771 354845 341560 328439 315057
63819 315057 301879 289997 279976 271174 262397 253213 244347 236649 230091 224139 218710 214135 210340
63806 210340 206810 203417 200577 198424 196470 194342 192263 190533 189110 188025 187603 187788 187798 186993 185695
63791 185695 184638 183905 182958 181464 179563 177496 175427 173515 171750 169927 168088 166727 166129 165778 164955
63776 164955 163696 162552 161566 160168 158152 156136 154831 154287 154037 153649 153010 152355 152104 152403 152823 152809 152402
63759 152402 152112 152057 151772 151023 150371 150522 151463 152627 153716 154900 156262 157429 157957 157915 157895 158446 159525 160517
63741 160517 160780 160203 159282 158750 159147 160628 162996 165889 168979 172071 175028 177730 180156 182432 184665
63726 184665 186748 188429 189651 190770 192425 195090 198697 202717 206668 210470 214192 217621 220380 222445
63712 222445 224150 225574 226279 225825 224194 221519 217851 213580 209747 207342 206387 206053 205580 204720 203572 202517
63696 202517 202264 203316 205284 207186 208514 209565 210686 211779 212811 214278 216736 220216 224380 228882
63682 228882 233195 236501 238327 239207 240211 241808 243556 244904 245868 246801 247824 248729 249275 249422 249342 249290 249473
63665 249473 250028 251080 252668 254420 255469 255063 253358 251369 249913 248796 247207 244751 241727 238416 234555
63650 234555 229837 224690 220114 216687 214085 211735 209653 208347 208041 208380 208908 209576 210679 212493 215126
63635 215126 218544 222551 226771 230775 234314 237435 240388 243448 246811 250680 255363 261138 267903 275132
63621 275132 282374 289711 297586 306282 315898 326752 339356 353798 369465 385723 402698 421083
63609 421083 441217 462650 484641 506872 529594 553230 577867 603000 627559 650152 669353
63598 669353 683948 693224 697317 697279 694598 690456 685371 679492 673057 666435 659727 652426 643575 632270
63584 632270 618038 600848 581071 559560 537601 516420 496635 478274 461371 446261 433203
63573 433203 421949 412025 403392 396596 392227 390383 390733 392917 396687 401659 407127 412358 417205 422406
63559 422406 429062 437692 447760 458153 468098 477672 487601 498663 511179 524998 539987 556546
63547 556546 575443 597132 621469 648199 677339 708608 740577 770800 796822 816786 829302
63536 829302 833621 830445 822141 811542 800519 789947 780584 773206 767692 762551 755796 746179 733492
63523 733492 717943 699563 678210 653962 627476 599888 572225 544916 518013 491893 467430
63512 467430 445385 425877 408578 393104 379041 365955 353789 342960 333682 325419 317541 310323
63500 310323 304543 300103 295890 291361 287462 285287 284380 283209 281084 278774 277165 276105 274879 273225
63486 273225 271483 270147 269624 270103 271306 272632 273882 275523 277883 280484 282749 285072 288327 292325 295669
63471 295669 297473 298468 299774 301188 301422 299736 296531 292490 288011 283582 279874 276979 274108 270535 266515
63456 266515 262886 260144 258319 257378 257189 257292 257339 257703 259136 261781 264995 268173 271320 274776 278853 283867
63440 283867 290081 297450 305771 315260 326616 340405 356797 376039 398583 424269 451733 479045
63428 479045 504666 527474 546349 560462 570022 576304 580996 585740 592006 600767 612235 626399 643810
63415 643810 665319 690937 719450 749317 779491 809069 836592 860206 878471 890800 897332 898732
63403 898732 896033 890351 882551 873317 863418 853616 844021 833605 820646 803887 783319 759773 733948
63390 733948 706107 676663 646556 616822 588114 560979 536245 514626 496028 479767 465414
63379 465414 452988 442374 433203 425555 420209 417762 417856 419664 422895 427843 434512 442219 450243 458644
63365 458644 468251 479865 493498 508426 523980 540287 558158 578284 600674 624875 650487 677333
63353 677333 705264 734002 763084 791821 819250 844247 865677 882519 894014 899936 900809 897834
63341 897834 892390 885414 877144 867502 856636 844809 831745 816495 798287 777263 754006 728679
63329 728679 701194 672168 643033 615022 588546 563758 541207 521543 504909 491071 479965
63318 479965 471782 466472 463210 460227 455256 446668 434482 420091 404879 389438 374156 359898 347559
63305 347559 337295 328705 321510 315543 310299 305173 300221 296162 293450 291636 289783 287234 283921 280117
63291 280117 276110 272044 268005 264192 260841 257913 255068 252096 249148 246412 243759 240982 238214 235802
63277 235802 233962 232774 232307 232394 232486 232154 231660 231644 232275 233038 233374 233138 232424 231303 229903 228539 227647 227634
63259 227634 228684 230527 232528 234228 235705 237191 238529 239337 239574 239610 239754 240034 240371 240690 240925 241171 241730
63242 241730 242734 243978 245448 247677 250995 254679 257619 259837 262604 266881 272246 277597 282393 286893
63228 286893 291614 296863 302504 307971 312737 316879 320939 325260 329821 334593 339509 344152 348191 352217
63214 352217 357319 363516 369319 373318 375592 377141 378584 380017 381517 382999 383846 383405 381764 379597 377480
63199 377480 375783 374931 375202 376476 378634 382032 387162 394062 402484 412322 423366 435010 446915 459767
63185 459767 474659 491801 510413 529767 549656 569876 590046 610148 630632 651765 673269
63174 673269 694695 715627 735457 753573 770079 785843 801483 816583 830118 841301 849746 855068
63162 855068 856596 853399 844598 829969 810371 787316 761972 734795 706104 676575 646945 617534
63150 617534 588388 559822 532646 507864 486106 467217 450431 435174 421629 410303 401138 393424
63138 393424 386535 380338 374880 370108 366075 362943 360584 358493 356321 354229 352576 351537 351229 351867 353545
63123 353545 356035 358973 362102 365306 368702 372753 377888 383831 389671 394848 399720 404927 410459 415740
63109 415740 420384 424574 428832 433659 439261 445423 451753 458137 464725 471352 477371 482291 486334 490092
63095 490092 493903 497839 502014 506423 510603 513844 515786 516640 516909 516954 516596 514967 511105 505034 498071
63080 498071 491721 486413 481544 476483 471175 465971 461347 457731 455178 453185 451121 448869 446844 445497
63066 445497 445034 445465 446542 447695 448418 448832 449629 451442 454372 458062 462109 466514 471913 479097 488105
63051 488105 498010 507912 517870 528503 539998 552068 564652 578006 592099 606579 621329 636481
63039 636481 651721 666237 679648 692535 705734 719455 733365 747183 760812 774091 786657
63028 786657 797985 807429 814426 818783 820665 820367 818289 815018 811032 806301 800587 794107 787392 780481
63014 780481 773018 765458 759513 756858 757788 761663 768243 778002 791311 807965 827487 849499 873877
63001 873877 900902 931136 964737 1000920 1038482 1076738 1115545 1154580 1193208 1231151 1268707
62990 1268707 1306070 1342784 1378072 1411391 1442462 1471043 1496884 1519590 1538239 1551339 1557467
62979 1557467 1555928 1546631 1529555 1504637 1472107 1432578 1386749 1335317 1279363 1220632 1161163 1102654
62967 1102654 1046235 992743 942899 897141 855501 817842 784144 754393 728262 705071 684048
62956 684048 664498 645889 628091 611530 596681 583229 570033 556210 542057 528601 516333
62945 516333 504770 493198 481489 470028 459090 448550 438166 427976 418329 409479 401268 393391
62933 393391 386011 379794 375035 370929 366214 360608 355228 351344 348994 347177 345161 343169 341724 340832
62919 340832 340033 339010 337795 336535 335391 334660 334645 335211 335744 335729 335261 334844 334834 335270 335982 336600 336537 335445
62901 335445 333809 332803 333363 335457 338305 341131 343611 345799 347859 349899 352034 354541 357791 361796
62887 361796 365872 368980 370473 370392 369099 366918 364116 360920 357446 353820 350397 347513 344954 342035 338413
62872 338413 334476 330707 327086 323455 320168 317847 316598 315891 315200 314380 313454 312380 311133 309770 308330
62857 308330 306872 305662 305096 305277 305696 305472 304005 301448 298598 296252 294678 293747 293393 293628 294141 294253
62841 294253 293466 291851 289927 288393 287947 288814 290276 291211 291357 291554 292418 293429 293850 293901 294239 294733 294675 293959
62823 293959 293110 292224 290838 288973 287432 286780 286779 287088 287827 289093 290535 291826 293029 294153 294819 294791 294472
62806 294472 294533 295359 297073 299641 302620 305217 307008 308283 309444 310490 311407 312566 314274 316296 318268
62791 318268 320260 322459 324650 326539 328399 330873 334336 338832 344440 351187 358826 367214 376789 388157
62777 388157 401259 415388 430001 445098 460810 476999 493230 508836 523119 535838 547354
62766 547354 557855 566587 572332 574528 573513 569792 563702 555668 546096 534883 521713 507018 492051
62753 492051 477713 463855 450033 436454 423673 411763 400256 388729 377159 365916 355668
62742 355668 346973 339634 332787 326024 320145 316271 314380 313295 312029 310573 309348 308532 308227 308717 310063
62727 310063 311752 313184 314438 316190 318987 322903 327792 333416 339345 345222 351289 358235 366320 375055
62713 375055 384088 393972 405606 419205 434494 451683 471463 493915 518209 543846 571683 603189
62701 603189 639000 678663 721607 767869 817882 871940 929875 990995 1054254 1118653 1183546
62690 1183546 1248561 1313251 1376645 1436736 1490401 1534395 1566838 1587533 1596696 1593867 1578386 1550494
62678 1550494 1511479 1463097 1407339 1346361 1281909 1214963 1146446 1078048 1011655 948165 887577
62667 887577 830141 776619 727454 682553 642066 606461 575499 547864 522270 498383 476318
62656 476318 455872 436815 419471 404437 391885 381490 372716 364910 357455 350199 343448 337327 331530
62643 331530 325909 320751 316108 311424 306371 301594 297927 295302 293124 291420 290780 291240 292043 292612 293019
62628 293019 293286 292856 291167 288403 285355 282715 280675 278991 277276 275380 273580 272293 271608 271304 271295 271723
62612 271723 272542 273343 273823 274266 275285 277104 279237 280977 282179 283451 285473 288243 291138 293680 295888
62597 295888 297905 299805 302021 305481 310779 317454 324491 331363 338104 344636 350717 356508 362438 368303
62583 368303 373095 376083 377629 378513 378811 377896 375350 371414 366525 360771 353966 346129 337750 329616 322387
62568 322387 316318 311279 306909 302734 298330 293622 289055 285276 282584 280710 279082 277229 275102 273173
62554 273173 272147 272309 273169 273974 274540 275356 276861 278875 280846 282495 284089 286093 288526 290690 291734
62539 291734 291640 291422 292145 293901 295986 297808 299245 300397 301585 303576 307163 312359 318449 324928 331917
62524 331917 339579 347785 356698 367162 380015 395288 412470 431286 451792 474008 497959 523993
62512 523993 552571 583739 617085 652190 688734 726153 763514 799895 834688 867374 897009
62501 897009 922014 940552 951319 954088 949493 938358 921473 899931 875258 848865 821577 793846
62489 793846 766234 739474 714356 691811 672839 657984 647017 639488 635376 634796 637300 642014 648505
62476 648505 656979 667468 679233 691093 701987 711041 717515 721032 721682 719589 714488 705988 694180
62463 694180 679744 663361 645141 624739 602094 578063 554114 531268 509421 487903 466636
62452 466636 446442 428272 412462 398855 387324 377868 370355 364421 359624 355634 352330 349790 348068
62439 348068 346971 346242 346054 347024 349535 353192 357209 361126 364805 367796 369227 368574 366322 363560 360932
62424 360932 358107 354307 349209 343271 337239 331479 325821 319961 313912 308147 303526 300945 300665 301701
62410 301701 302220 301000 298516 296307 295245 294753 293766 292039 290254 289130 288784 288874 288996 288908 288668 288626 289161
62393 289161 290399 292288 294872 298215 302062 305870 309298 312404 315237 317581 319450 321560 324819 329291
62379 329291 334106 338583 343105 348673 355802 364226 373500 383506 394268 405633 417406 429603 442340
62366 442340 455569 469270 483940 500533 519693 541254 564771 590368 618718 650292 685017
62355 685017 722730 763493 807197 853224 900753 949072 997159 1043194 1085031 1121179 1151044
62344 1151044 1174311 1190583 1199636 1201604 1196764 1185455 1168255 1145809 1118342 1085798 1048790 1009034
62332 1009034 968551 928638 889925 853013 818578 786943 758056 731923 708756 688676 671452
62321 671452 656481 642792 629245 615086 600332 585338 570076 554193 537789 521657 506530
62310 506530 492344 478494 464644 451103 438447 426910 416148 405581 395094 385354 377334 371500
62298 371500 367594 365148 363934 363746 364012 363924 363090 361956 361524 362556 365004 368161 371300 374119 376654 379052
62282 379052 381551 384445 387839 391579 395617 400205 405438 410814 415711 420250 425270 431398 438530 446247
62268 446247 454326 462723 471525 481183 492425 505766 521381 539588 560978 585797 613623 644095
62256 644095 677591 714701 755301 798724 844664 893277 944166 995723 1045603 1091612 1132161
62245 1132161 1166326 1193738 1214185 1227181 1232100 1228869 1218311 1201559 1179105 1150469 1114873 1072410
62233 1072410 1024725 974442 923753 873611 824424 777149 733217 693438 657623 625434 597077
62222 597077 572776 551975 533552 516717 501432 488081 477048 468422 461758 456109 450620 445133
62210 445133 440032 435552 431480 427495 423468 419362 415140 410978 407362 404758 403238 402509 402215 402123 402136 402346
62194 402346 403051 404574 406998 410097 413520 417025 420640 424715 429704 435783 442658 449930 457646 466371
62180 466371 476565 487954 499537 510246 519636 528090 536394 545003 553619 561665 569313 577931 589291
62167 589291 604341 622885 644331 668413 695168 724625 756815 791766 829016 867103 903883
62156 903883 937519 967093 992287 1012723 1027757 1036800 1039664 1036663 1028426 1015579 998505 977361
62144 977361 952328 923862 892755 860040 826833 794266 763499 735678 711629 691458 674604
62133 674604 660453 648849 639885 633398 628935 626156 624965 625198 626468 628422 630958 634127 637996 642647
62119 642647 648161 654574 662013 670741 680649 690704 699339 705580 709432 711080 710372 707502 703634 700167
62105 700167 697554 695304 692748 689108 683128 673710 661145 647020 632689 618547 604989 593160 584100
62092 584100 577738 573478 571402 572070 575278 579858 584853 590338 596931 604989 614537 625594 638169 652066
62078 652066 667003 682999 700528 720168 741976 765196 788772 812247 835938 860109 884342
62067 884342 908119 931729 956007 981178 1006498 1031222 1055484 1079957 1104986 1130273 1155066
62056 1155066 1178291 1198612 1214736 1225854 1231878 1233419 1231414 1226382 1217910 1205150 1187947 1167067
62044 1167067 1143080 1115468 1083342 1046885 1007715 967954 929231 892316 857148 823231 790437
62033 790437 759529 731513 706517 683733 662518 643093 625990 611285 598645 587722 578143 569370
62021 569370 560975 552875 545006 536986 528460 519606 510919 502623 494719 487476 481334 476207 471451 466757
62007 466757 462610 459559 457426 455768 454778 455099 456699 458568 459824 460770 462496 465563 469361 472683 474695
61992 474695 475334 474965 473769 471492 467858 463217 458581 454786 451633 448037 443059 436679 429564 422272 414790
61977 414790 406774 398155 389529 381835 375576 370399 365637 361178 357511 354913 352993 351197 349377 347547
61963 347547 345431 342821 340226 338567 338122 338246 338323 338483 339149 340359 342016 344460 348090 352532 356784 360383
61947 360383 363924 368228 373418 379210 385737 393599 403131 414049 425857 438330 451491 465344 479754
61934 479754 494409 508893 522977 536866 550936 565109 578731 591163 602264 612115 620547 627229
61922 627229 632020 634866 635492 633647 629656 624242 617690 609624 599960 589730 580617 573797 569525 567681
61908 567681 568249 571193 576266 583171 591786 602042 613627 625874 637925 648940 658200 665103 669193
61895 669193 670270 668479 664134 657380 648131 636450 622931 608542 594061 579705 565261 550567
61883 550567 535964 522379 510786 501405 493458 485835 477944 469860 461877 454147 446672 439383 432220
61870 432220 425333 419178 414217 410548 408044 406763 406961 408707 411716 415599 420077 425071 430932 438451
61856 438451 448168 459551 471406 483328 496338 511773 529948 550251 572210 595897 621405 648337
61844 648337 675836 702858 728488 752231 773947 793277 809352 821330 829041 832725 832359 827755
61832 827755 819361 808481 796583 784719 773645 764018 756340 751107 749165 751491 758228 768217 779835
61819 779835 792105 804685 816962 827616 835111 838334 836713 830017 818237 801652 780888 756914
61807 756914 730902 704002 677186 651154 626259 602509 579800 558271 538317 520273 504198
61796 504198 489979 477402 466087 455672 446282 438548 432831 428591 424838 421076 417386 413694 409568
61783 409568 404920 400401 396659 393459 390006 386022 382126 379113 377255 376428 376563 377612 379169 380458 380846
61768 380846 380322 379444 378871 378986 379836 381268 383034 384860 386623 388510 390835 393570 396239 398549 401005
61753 401005 404434 408809 412943 415668 416979 417629 417983 417883 417467 417282 417379 417035 415810 414278 413163 412251
61737 412251 410923 409465 408902 409492 410220 410067 409146 408236 407827 408135 409546 412295 415831 419149 421851 424459
61721 424459 427528 430854 433755 435950 437865 440111 442773 445337 447331 448937 450767 453012 455034 455973
61707 455973 455540 453973 451464 448033 443921 439687 435733 432052 428512 425070 421486 417214 412049 406801
61693 406801 402851 400846 400036 399044 397166 394743 392420 390348 388199 385774 383378 381544 380432 379582 378312
61678 378312 376387 374247 372518 371416 370801 370660 371220 372399 373485 373653 372699 371037 369158 367462 366441
61663 366441 366470 367280 368069 368372 368477 368787 369151 369241 369249 369730 370778 371842 372436 372763 373516 375276 378128 381662
61645 381662 385214 388256 390691 392831 395089 397674 400445 402985 404884 406011 406384 405867 404337 402234 400467
61630 400467 399404 398293 396124 392824 389136 385562 382088 378813 376116 374017 372065 370097 368568 367755
61616 367755 367234 366586 366183 366614 367603 368106 367489 366069 364390 362433 359736 356088 351835 347548 343474 339353
61600 339353 334775 329687 324472 319545 315057 310971 307201 303583 299997 296701 294236 292663 291084 288349
61586 288349 284334 280276 277747 277305 278107 278720 278298 277044 275558 274014 272265 270587 269688 269714 269821 269203
61570 269203 268141 267519 267574 267781 267773 267647 267366 266619 265451 264432 263895 263496 262882 262351 262451 263242 264376 265659
61552 265659 267077 268400 269232 269523 269691 270119 270715 271096 271102 270988 271077 271285 271215 270777 270514 271011 272125 273178 273879
61533 273879 274612 275681 276770 277457 277855 278333 278832 278918 278414 277595 276756 275933 275041 274040 272925 271742 270603
61516 270603 269549 268456 267279 266254 265624 265262 264873 264473 264290 264237 263921 263301 262885 263006 263253 262971 262116 261217
61498 261217 260587 260005 259260 258666 258788 259784 261207 262395 262897 262577 261563 260222 259030 258249 257751 257319 257042
61481 257042 257178 257601 257726 257216 256534 256506 257395 258724 259938 260904 261704 262275 262473 262310 261931 261440 260856 260173
61463 260173 259402 258665 258280 258568 259416 260202 260354 259930 259460 259319 259490 259885 260564 261438 261982 261551 260044 258163
61445 258163 256919 256833 257510 257993 257632 256702 256237 257202 259833 263660 267995 272296 276277 279870 283106 285890
61429 285890 287908 288931 289205 289321 289661 290146 290623 291205 292024 292863 293415 293851 294761 296407 298333 299893 300994
61412 300994 302110 303602 305206 306228 306200 305369 304472 303962 303514 302504 300887 299320 298263 297332 295829 293741
61396 293741 291888 291037 291133 291445 291258 290387 289197 288265 287886 287817 287551 286957 286542 286914 288013 289092 289644 290098
61378 290098 291300 293343 295420 296952 298309 299982 301497 301967 301566 301583 302812 304658 306169 307225 308204
61363 308204 309114 309806 310575 311737 312873 313346 313470 314298 316192 318367 320059 321504 323501 326566 330772 335863
61347 335863 341266 346457 351575 357243 363610 370123 376501 383206 390529 397726 403715 408200 411580 414181
61333 414181 416179 417884 419406 420262 420027 419183 418601 418332 417693 416503 415377 414679 414036 413219 412727 412995 413617
61316 413617 413893 413744 413539 413376 413069 412693 412649 413327 415028 418021 422203 426897 431511 436405 442658 450873
61300 450873 460648 471202 481981 492382 501373 507976 512116 514584 516097 516644 515777 513274 509294 504089
61286 504089 497912 491222 484643 478498 472540 466404 460282 454931 451005 448607 447468 447239 447430 447422 446933 446438
61270 446438 446785 448396 451027 454323 458272 462966 468150 473267 477908 482076 486055 490218 494952 500570
61256 500570 507109 514282 521774 529621 538166 547473 556829 565008 571111 575126 577601 578955 579299 578869 578237
61241 578237 577873 577597 576711 574652 571390 567315 563047 559379 557091 556451 556972 557814 558345 558239 557297 555577
61225 555577 553710 552599 552619 553396 554515 556135 558563 561546 564456 567118 569914 573016 575989 578363 580181
61210 580181 581645 582604 582867 582879 583535 585269 587689 590186 592472 594403 595739 596513 597361 598996 601402 604015
61194 604015 606797 610682 616717 625061 635086 646214 658222 670826 683415 695288 705848 714543
61182 714543 721019 725609 729345 733078 736642 739170 740190 740092 739533 738746 737598 735986 733899 731228 727817
61167 727817 723731 719228 714462 709420 704216 699196 694516 689731 684127 677459 670115 662396 653949 644251
61153 644251 633568 623000 613559 605496 598638 592932 588293 584279 580464 577106 575016 574641 575570 576971
61139 576971 578105 578267 576705 573068 567866 562114 556495 551042 545547 540056 534964 530831 528143 527067
61125 527067 527370 528664 530764 533770 537871 543217 549943 558207 568148 579880 593448 608689 625118
61112 625118 642062 658937 675421 691540 707722 724512 741918 759149 775352 790575 805580
61101 805580 820617 834823 847114 857348 866279 874560 882079 888049 891389 891158 887081 879783 870298
61088 870298 859224 846477 831762 815087 796943 778219 759866 742375 725585 709213 693440
61077 693440 678643 664758 651488 639120 628524 620110 613273 607159 601583 596877 593313 591015 590063
61064 590063 590194 590711 591170 591871 593224 594931 596463 598166 601146 606004 612301 619367 627006 635198 643677
61049 643677 652191 660902 670233 680543 692093 705078 719526 735403 752860 772100 793039 815500
61037 815500 839742 866300 895178 925797 957962 992292 1029410 1069296 1111900 1157807 1207641
61026 1207641 1261080 1317048 1374692 1433709 1494132 1556582 1622749 1695150 1776333 1868580 1974096
61015 1974096 2094847 2232166 2386861 2559829 2752698 2968691 3213715 3496512 3827398
61006 3827398 4217224 4677886 5222894 5866564 6623830 7513003 8559376 9796393 11265484
60997 11265484 13013934 15078168 17439016 19965433 22399296 24423615 25790093 26423482
60989 26423482 26436768 26066720 25589223 25251719 25213139 25481736 25884522 26116914 25869138 24958191
60979 24958191 23386710 21309698 18952488 16535016 14228249 12140207 10320707 8776029
60971 8776029 7486151 6419097 5540634 4819726 4230097 3748977 3355686 3031874 2762367
60962 2762367 2535012 2340033 2170004 2019828 1885782 1764636 1654107 1553717 1464175 1385708
60952 1385708 1317316 1257461 1204757 1157899 1115465 1076042 1038356 1001366 964606 928491 893985
60941 893985 861880 832467 805674 781179 758532 737441 717829 699372 681321 663224 645560
60930 645560 629144 614060 599689 585606 571817 558234 544669 531467 519457 509059 499863 491188
60918 491188 482607 473893 465091 456797 449764 444050 439091 434763 431647 429937 428874 427724 426618 425843
60904 425843 425047 423964 423392 424420 426914 429705 432174 434723 437667 440615 443204 445594 447795 449253 449605
60889 449605 449310 448937 448249 446559 443697 440028 435673 430330 423844 416473 408568 400453 392638 385685 379680
60874 379680 374159 368698 363285 358066 353120 348687 345235 342979 341633 340903 340977 342145 344185 346601 349299
60859 349299 352525 356142 359574 362544 365379 368322 371086 373495 376191 380138 385496 391446 397151 402508
60845 402508 407857 413231 418141 421984 424540 426069 426968 427406 427306 426639 425490 423754 420987 416877 411842
60830 411842 406960 403208 400796 399201 397705 395918 393859 391589 388881 385397 381198 376822 372688 368600
60816 368600 363979 358455 352135 345549 339520 334788 331380 328443 325064 321197 317498 314376 311683 309298
60802 309298 307490 306443 305780 304916 303720 302602 301977 301816 301700 301272 300676 300566 301586 303816 306730 309621
60786 309621 311986 313678 314908 316094 317558 319423 321856 325177 329445 334162 338743 343181 347848 352815
60772 352815 357855 363020 368558 374142 378861 382304 385168 388406 392201 396189 400267 404632 409176 413344
60758 413344 416610 418811 420157 421186 422589 424721 427318 429856 432070 433925 435313 436169 436804 437751 439249
60743 439249 441085 442896 444451 445760 447176 449263 452243 455597 458512 460713 462604 464713 467331 470719
60729 470719 475238 481141 488422 496937 506438 516472 526612 536918 547930 560028 572907 585794
60717 585794 598017 609224 619227 627790 634584 639358 642186 643392 643069 640795 636144 629449 621662 613384
60703 613384 604378 594147 582531 569568 555336 540370 525855 512726 500637 488408 475508 462567
60691 462567 450389 439123 428659 419224 410972 403347 395566 387670 380481 374450 369157 364169 359843
60678 359843 356811 354990 353663 352378 351236 350287 349175 347587 345662 343699 341798 340091 339047 339026 339516
60663 339516 339277 337496 334643 331967 330219 329049 327622 325561 323196 321085 319595 318951 319352 320827 323062
60648 323062 325630 328405 331640 335600 340231 345109 349640 353338 356073 358045 359481 360462 361199 362248 364072
60633 364072 366448 368709 370664 372859 375690 378621 380662 381473 381724 382337 383576 384796 385016 383812 381783
60618 381783 380002 378924 377951 376211 373547 370591 368036 366114 364705 363677 363092 363132 363763 364439 364357 363242
60602 363242 361644 360299 359378 358642 358072 357836 357732 357154 355752 353832 351989 350630 349879 349652 349640 349512 349305
60585 349305 349472 350380 351915 353729 355712 358057 360947 364348 368078 372004 376215 381104 387226 395049 404756
60570 404756 416223 429117 443138 458373 475375 494622 515855 538109 560402 582046 602148
60559 602148 619145 631318 637711 638293 633360 623341 609439 593987 579532 567458 557807 550453 546002
60546 546002 545260 548293 554571 563966 576993 593981 614533 638176 665141 695969 730414 766994
60534 766994 803496 837610 867223 890623 906647 914608 914242 906065 891743 873699 854087 834190
60522 834190 814715 796296 779523 764656 751501 739611 728600 718445 709558 702499 697693 695486
60510 695486 696311 700421 707401 716321 726610 738679 753593 772255 795061 822220 854211 891899
60498 891899 936242 987812 1046510 1111668 1182320 1257240 1334797 1412903 1489087 1560496 1624101
60487 1624101 1677494 1719767 1751408 1773182 1785280 1787537 1779995 1762699 1735016 1695696 1643881 1580013
60475 1580013 1505793 1423559 1335888 1245610 1155801 1069487 989167 916438 851810 794817 744473
60464 744473 699870 660467 625872 595570 569010 545868 525962 508944 494335 481891 471607
60453 471607 463305 456466 450620 445582 441103 436678 432009 427393 423255 419502 415759 412107 409150 407413
60439 407413 406999 407718 409069 410185 410309 409435 408135 406730 405061 403010 400704 398132 395136 391945 389150
60424 389150 386874 384526 381750 379066 377110 375657 374015 372121 370584 369715 369120 368346 367477 366915 366865 367199
60408 367199 367639 367959 368097 368148 368187 368139 367922 367684 367720 368124 368603 368699 368233 367582 367467 368348 369952 371490 372327 372389
60388 372389 372030 371777 372139 373348 375150 377078 378939 380826 382673 384271 385769 387637 389838 391529 392043
60373 392043 391742 391433 391247 390755 390029 389941 391247 393771 396607 398770 399659 399341 398616 398472 399237 400405 401395
60356 401395 402249 403395 404899 406239 406842 406665 406134 405585 404968 404184 403535 403587 404553 406139 408108 410686 414119
60339 414119 417976 421255 423215 423972 424213 424411 424359 423537 421971 420554 420222 420888 421569 421558 421014 420294 419341 418138
60321 418138 417136 416649 416184 415113 413819 413444 414510 416484 418754 421407 424850 429282 434938 442428 452389
60306 452389 464970 479909 497050 516587 538904 564123 591543 619314 644840 665681 680109
60295 680109 686986 685572 675731 658307 635174 608895 582109 556839 534199 514658 498368 484981
60283 484981 473490 462836 452795 443910 436531 430364 425082 420817 417786 415757 414228 412887 411624
60270 411624 410352 409112 408128 407504 406984 406276 405369 404277 402703 400406 397870 396115 395712 396215 396678 396495
60254 396495 395622 394290 392796 391518 390782 390599 390686 390874 391291 392006 392697 393014 393164 393727 394832 395975 396852
60237 396852 397873 399463 401241 402418 402827 403084 403877 405550 408208 411584 414887 417431 419487 421872 424641
60222 424641 426922 428277 429427 431121 432992 434172 434595 434897 435347 435654 435769 436175 437229 438751 440473 442456
60206 442456 444822 447338 449511 451038 452099 453261 455048 457494 460170 462708 465132 467497 469476 470661
60192 470661 471184 471638 472357 473136 473691 474000 474002 473356 471826 469794 468055 467119 466875 466934 467052 467114 466902 466170 464965
60173 464965 463688 462713 462018 461323 460502 459683 459035 458603 458351 458115 457561 456527 455512 455469 456838 458950 460664
60156 460664 461604 462562 464684 468350 472862 477237 481244 485540 490624 495907 500204 503090 505230 507243 508868
60141 508868 509665 510059 511065 513117 515677 517946 519534 520537 521405 522729 524681 526555 527211 526128 523792
60126 523792 521026 518306 515778 513530 511533 509565 507448 505317 503553 502538 502478 503254 504385 505353 506141
60111 506141 507297 509381 512487 516374 520830 525707 530749 535637 540199 544465 548552 552534 556332 559563
60097 559563 561584 561899 560599 558312 555660 552824 549647 546116 542635 539852 538250 537851 538222 538757 539104
60082 539104 539469 540396 542081 543956 545144 545322 544885 544282 543486 542205 540319 537913 535185 532535 530435 528882
60066 528882 527138 524334 520224 515058 509015 502181 494932 487761 480727 473537 466259 459511 453834 449241
60052 449241 445459 442170 438885 435104 430913 427057 424050 421542 418969 416542 415081 414917 415365 415436 414809
60037 414809 414062 414071 415210 417045 418845 420346 421855 423561 425078 425967 426443 427166 428304 429138 428718 426719
60021 426719 423620 420201 416912 413604 409816 405417 400948 397198 394430 392126 389573 386617 383842 382056
60007 382056 381611 382161 382990 383505 383470 383022 382683 383202 384959 387447 389705 391421 393238 395759 398735 401645
59991 401645 404648 408271 412325 415897 418529 420743 423148 425570 427433 428568 429282 429906 430638 431541 432395
59976 432395 432743 432422 431867 431602 431666 431821 432056 432433 432690 432545 432252 432311 432707 432998 433205 433943 435524 437513 439388
59957 439388 441007 442108 442053 440730 439238 438883 439658 440369 440209 439530 439006 438709 438353 438012 438179 439216 440903
59940 440903 442459 443032 442440 441429 440881 440717 439964 438036 435560 433635 432627 432021 431227 430142 429009 428094
59924 428094 427539 427253 426899 426138 424938 423566 422360 421601 421463 421886 422518 423022 423445 424164 425454 427221 429145
59907 429145 430970 432663 434427 436575 439257 442290 445320 448146 450853 453663 456675 459734 462483 464629
59893 464629 466202 467519 468923 470658 472980 476084 479794 483497 486627 489138 491373 493601 495813 497834
59879 497834 499456 500618 501682 503372 506145 509615 512818 515015 516108 516436 516391 516100 515246 513261 509954
59864 509954 505839 501595 497410 493248 489615 487396 486773 486829 486557 485962 485890 487016 489290 492266 495742 500147
59848 500147 506402 515229 526432 538873 551152 562112 570740 576073 577639 575927 572247 568174 565124
59835 565124 564040 564917 566513 566882 564467 558868 550716 540982 530385 519315 508132 497334 487314
59822 487314 478044 469287 461105 453895 447858 442707 438052 433832 430200 427183 424654 422451 420349 418094
59808 418094 415763 413901 412999 412828 412551 411528 409856 408140 406862 405979 405029 403592 401598 399094 395862
59793 395862 391681 387074 383354 381526 381320 381632 381698 381484 381157 380693 380024 379095 377724 375784 373555 371500
59777 371500 369601 367330 364427 361326 358611 356418 354683 353591 353373 353814 354368 354751 355145 355833 356867 358146
59761 358146 359608 361266 363149 365193 367210 369076 371005 373414 376337 379186 381420 383298 385617 388720
59747 388720 392178 395525 398851 402398 405928 408899 411103 412776 414166 415373 416597 418097 419777 421189
59733 421189 422109 422821 423579 424068 423748 422547 420836 418880 416739 414650 412996 411789 410578 409099 407599
59718 407599 406296 404976 403561 402691 403134 404645 406047 406541 406490 406652 407074 407158 406619 405962 405956 406938 408762 411239
59700 411239 414333 417897 421460 424554 427273 430249 433912 437941 441639 444704 447362 449813 451885 453303
59686 453303 454034 454265 454216 454069 453867 453473 452764 451899 451157 450484 449591 448538 447800 447505 447067 445956 444423 442936
59668 442936 441161 438218 433941 429300 425470 422954 421689 421397 421579 421680 421659 421992 422858 423773 424430 425398 427370
59651 427370 430059 432545 434528 436494 438649 440531 441883 443168 444781 446283 446920 446514 445358 443518 440808
59636 440808 437310 433435 429520 425760 422445 419803 417588 415296 412917 411099 410363 410440 410609 410477 410206 410102
59620 410102 410229 410442 410611 410708 410643 410060 408491 405866 402745 399848 397373 395000 392550 390342 388807 387948
59604 387948 387358 386613 385576 384498 383926 384368 385839 387772 389477 390705 391738 392980 394487 395853 396606
59589 396606 396780 397045 398066 399770 401386 402218 402193 401721 401229 400833 400172 398554 395591 391774 388144 385292
59573 385292 382973 380729 378472 376279 374054 371824 369980 368784 367795 366278 364142 362126 361026 360999 361595
59558 361595 362281 362948 364040 366057 368811 371483 373622 375706 378304 381076 383270 385017 387331 390734 394624
59543 394624 398278 401854 406027 411165 417392 425152 435142 447801 463133 480724 499313 516302 528354
59530 528354 533050 530221 521745 510160 497471 485020 474013 465668 460629 458527 458412 459507 461265
59517 461265 463013 464153 464803 465635 466863 467861 468028 467466 466407 464492 461249 456990 452516 448083 443301
59502 443301 438039 432759 427818 423026 418130 413284 408789 404841 401771 400083 399813 400159 400170 399608 398801 397942
59486 397942 397043 396424 396590 397539 398649 399499 400455 402209 405013 408499 412064 415259 418056 420958 424584 428887
59470 428887 432933 435745 437248 438106 438785 439178 439114 438786 438473 438176 437788 437494 437850 439520 442923 447946 453867
59453 453867 459811 465485 471415 478360 486609 495853 505470 514812 523469 531485 539102 546004 551072 553226
59439 553226 552455 549675 545708 540765 534856 528229 521276 514312 507503 500773 493760 486284 478944 472872
59425 472872 468690 466027 464249 463266 463390 464782 467486 471807 478144 486547 496839 509164 524063 541988
59411 541988 563070 587275 614023 641179 664765 680500 686145 682571 672711 659724 646013 633446
59399 633446 623885 619186 620516 627373 636941 644536 645422 637098 620212 597460 571730 545320 520221
59386 520221 498186 480140 465872 454587 445513 437922 431119 424922 419966 416973 415761 415365 415117 415146
59372 415146 415725 416615 417365 417966 418761 419820 420812 421560 422417 423870 425962 428336 430780 433497 436725 440322
59356 440322 443901 447286 450682 454446 458872 464162 470423 477587 485485 494052 503370 513425 524022 535003
59342 535003 546468 558677 571758 585520 599425 612738 624884 635740 645512 654300 661883 667886
59330 667886 671932 673728 673337 671466 669112 666696 663807 659979 655360 650317 644783 638456 631423 624102
59316 624102 616718 609375 602548 596874 592355 588261 584068 580049 576728 574184 572258 571205 571676 574106
59302 574106 578308 583741 590146 598131 609134 624385 643385 663282 679963 690033 692124 686851 675878
59289 675878 660984 643660 625344 607718 592500 580720 572277 566285 561816 558352 555784 554263 554075
59276 554075 555484 558530 562860 567791 572723 577649 583101 589375 595979 602223 608248 614946 622701 630681
59262 630681 637622 642934 646751 649280 650582 650690 649424 646183 640407 632305 622737 612421 601653 590831
59248 590831 580713 571903 564307 557360 550672 544323 538690 534080 530467 527573 525333 524139 524314 525370
59234 525370 526205 526181 525645 525222 524976 524592 523998 523355 522554 521232 519333 517288 515539 514049 512321 509724 505848
59217 505848 500844 495447 490436 485985 481803 477922 474916 473130 472027 470716 468891 466877 464840 462520
59203 462520 459854 457437 455991 455591 455665 455639 455378 455129 455353 456556 458969 462246 465691 468849 471818 474948
59187 474948 478490 482606 487484 493145 499217 505113 510491 515436 520193 524886 529487 533931 538172 542210
59173 542210 546092 549880 553622 557395 561304 565346 569320 573080 576877 581276 586607 592607 598677 604340
59159 604340 609301 613288 616168 618221 619976 621577 622498 622082 620216 617269 613518 608983 603799 598387 593020
59144 593020 587527 581738 576113 571531 568372 566032 563495 560266 556691 553499 551145 549520 548178 546861
59130 546861 545773 545324 545696 546848 548892 552108 556445 561286 566006 570648 575781 581751 588364 595296 602526
59115 602526 610267 618690 627805 637415 647048 656113 664331 671956 679399 686583 692775 697104 699300 699925
59101 699925 699857 699490 698488 696359 693110 689139 684567 679059 672420 665107 657897 651225 645138 639778 635482
59086 635482 632263 629373 625675 620504 614141 607451 601070 594921 588454 581343 573878 566673 560039 553754
59072 553754 547365 540623 533615 526636 520059 514262 509535 505895 502950 499987 496429 492379 488677 486156
59058 486156 484739 483420 481307 478510 475826 473725 472058 470644 469613 468909 467947 466272 464326 462997 462485
59043 462485 462160 461592 461147 461369 462291 463683 465495 467628 469637 471179 472491 473942 475364 476422 477447
59028 477447 479223 481994 485349 489101 493544 498632 503673 508277 513107 519132 526461 534307 541853 548800
59014 548800 555357 562001 569015 575965 581935 586517 590099 592826 593868 592441 589191 585813 583393 581865
59000 581865 580946 580786 581501 582796 584373 586287 588649 591300 593918 596134 597532 597975 597961 598181 598561 598261
58984 598261 596751 594415 591910 589400 586678 583586 580069 576302 573037 571285 571249 572001 572694 573717 576189
58969 576189 580619 586548 593295 600511 608163 616410 625424 634976 644374 653151 661607 670268 679007 687099
58955 687099 693927 699147 702385 703410 702585 700543 697297 692123 684452 674565 663359 651783 640469 629543
58941 629543 618801 608387 599166 591914 586235 580896 575245 569624 564270 558703 552671 546972 542593 539405
58927 539405 536466 533442 531006 529750 529275 528620 527271 525530 524033 523122 522661 522398 522396 523023 524467 526413
58911 526413 528310 529868 531255 532879 535009 537492 539856 541978 544668 549214 556077 564277 572400 580004
58897 580004 587680 595961 604654 613281 621683 629935 638030 646014 654310 663607 674344 686390 699239
58884 699239 712422 725750 739255 752955 766638 779878 792256 803495 813289 821059 826046 827714
58872 827714 825954 820904 812879 802665 791559 780548 769454 757398 744267 731244 719583 709307
58860 709307 699551 689805 680201 670864 661725 652990 645004 637515 629744 621486 613487 606319 599436 591943
58846 591943 583888 576090 568943 562093 555308 548985 543591 539059 534943 530856 526568 522006 517406 513249
58832 513249 509746 506534 503102 499381 495747 492513 489707 487303 485394 484014 482989 482135 481486 481222 481450
58817 481450 482232 483731 486051 488923 491784 494326 496758 499396 502177 504736 506788 508240 509114 509660 510373
58802 510373 511537 512753 513224 512550 511022 509163 507308 505562 503810 501718 499073 496176 493546 491155 488430
58787 488430 485179 482092 480043 479232 479370 480371 482379 485256 488469 491538 494380 497185 500131 503235 506370
58772 506370 509367 512035 514018 514791 514055 512064 509275 505750 501341 496346 491377 486499 481216 475577 470603
58757 470603 467127 464808 462859 461207 460282 460107 460349 460992 462233 463905 465693 467728 470246 472885 475159
58742 475159 477546 481185 486390 492306 498218 504408 511402 519124 527229 535564 543810 551230 557375 562774
58728 562774 568437 574854 581755 588530 594539 599329 602955 605933 608624 610882 612511 613745 614946 616086
58714 616086 616961 617774 619151 621659 625458 630240 635276 639710 643147 645782 647728 648451 647230 644073 639745
58699 639745 634849 629122 621691 611801 599372 585107 570197 555742 542256 529588 517289 505180
58687 505180 493707 483693 475554 468825 462739 457132 452376 448463 444787 441036 437686 435163 433026 430548
58673 430548 427786 425485 424064 423367 423361 424498 427136 431000 435420 439926 444519 449524 455234 461575 468116
58658 468116 474386 480008 484358 486506 485922 483195 479647 476242 473099 469912 466418 462530 458519 455053
58644 455053 452607 450766 448628 445970 443476 441555 439532 436547 432903 429877 428309 427826 427520 426971 426500
58629 426500 426730 428089 430527 433516 436324 438420 439704 440435 441052 442014 443690 446245 449586 453362 457057
58614 457057 460306 463222 466380 470338 475158 480417 485576 490264 494260 497437 499800 501465 502523 502987
58600 502987 502886 502354 501541 500577 499695 499290 499572 500116 499992 498615 496476 494884 494965 496956 500312 504285 508399
58583 508399 512718 517883 524688 533318 543000 552601 561535 569927 577942 585329 591769 597363 602435 606997
58569 606997 610767 613767 616603 619996 624316 629717 636514 645063 655348 667025 679830 693583 707736
58556 707736 721356 733852 745420 756391 766374 774491 780335 784200 786350 786604 784858 781576 777354
58543 777354 772256 765914 758151 749206 739464 729313 719174 709301 699525 689504 679243 669063 658961
58530 658961 648431 637254 626209 616579 608990 603084 598318 594624 592073 590251 588525 586882 586118 587003
58516 587003 589481 592753 595886 598147 599150 599102 598860 599270 600395 601697 603054 605110 608325 612016 614868
58501 614868 616325 616953 617332 617139 615778 613579 611707 610771 610093 608671 606476 604357 602944 602262 602283 603185
58485 603185 604877 606881 609054 611886 615665 619804 623588 627273 631747 637244 643085 648726 654373 660409
58471 660409 666825 673494 680399 687144 692607 695603 695844 694043 691251 688234 685231 682107 678845 675967
58457 675967 674201 673657 673760 674162 675225 677264 679769 682013 684183 687237 691588 696510 700891 704110 706012
58442 706012 706537 705829 704535 703549 703281 703325 702948 701953 700952 700781 701726 703455 705650 708520 712569 718032 724618
58425 724618 731649 738436 744723 750941 757830 765598 773589 780871 786994 792017 796043 799034 800977 801890
58411 801890 801717 800526 798822 797370 796586 796285 796081 795863 795767 795844 795922 795765 795298 794671 794145 793907 794009 794473 795441
58392 795441 797180 799894 803549 807905 812736 817941 823353 828515 832917 836494 839688 842883 846011 848924
58378 848924 851844 855071 858432 861468 864089 866572 869018 871401 874214 878408 884333 891193 897922 904284
58364 904284 910817 918059 926211 935262 944935 954692 964210 973875 984391 995841 1007402 1018149 1028030
58351 1028030 1037856 1048304 1058996 1068721 1076585 1082751 1088029 1093116 1098603 1105294 1113856 1124150 1135446
58338 1135446 1147304 1159710 1172457 1185105 1197660 1210626 1224196 1238087 1252360 1267615 1283976
58327 1283976 1300572 1316546 1332035 1347692 1363756 1380029 1396235 1411985 1426963 1441546 1456651
58316 1456651 1472420 1487716 1501482 1513968 1526033 1538050 1550260 1563422 1577968 1592991 1607229
58305 1607229 1620837 1635182 1651055 1668058 1685588 1703471 1721693 1740406 1760201 1781509 1803765
58294 1803765 1825995 1848210 1871355 1895957 1921693 1948340 1976214 2005422 2035509 2066073 2097126
58283 2097126 2128745 2161024 2194445 2229615 2266506 2304536 2343359 2382955 2423117 2463749 2505685
58272 2505685 2550255 2597828 2647601 2699023 2752551 2808743 2867459 2928380 2991668 3057681 3126505
58261 3126505 3198047 3272192 3348852 3428349 3511620 3599248 3690342 3783303 3877800 3975052 4075966
58250 4075966 4180071 4286683 4396126 4509183 4626232 4747687 4874721 5008821 5150918
58241 5150918 5301394 5460607 5629017 5807133 5995607 6195097 6405943 6628469 6863790
58232 6863790 7113863 7380555 7665088 7968520 8292313 8638386 9009107 9407279 9835668
58223 9835668 10296722 10793370 11330032 11912147 12544918 13233478 13984315 14805768 15707357
58214 15707357 16699962 17797104 19015373 20373638 21892807 23596638 25512155 27669669
58206 27669669 30104029 32856919 35977966 39524071 43558738 48152408 53383983 59344597
58198 59344597 66143635 73913188 82807280 92998126 104674777 118044899 133335580
58191 133335580 150788533 170642679 193088769 218173015 245629863 274653534 303691917
58184 303691917 330435010 352161861 366414494 371691452 367772193 355533830 336485169
58177 336485169 312362996 284936744 255923077 226878557 199066740 173375054 150314966
58170 150314966 130077259 112609483 97701673 85065984 74392972 65382706 57762637
58163 57762637 51298110 45793040 41083728 37034274 33534827 30497328 27848633 25526536
58155 25526536 23479478 21665400 20048861 18599774 17293892 16111972 15037826 14058212
58147 14058212 13163795 12347932 11603997 10924864 10304408 9737746 9220041 8746429 8312890
58138 8312890 7915502 7548693 7205568 6880344 6569765 6272573 5988857 5719741 5466240
58129 5466240 5228019 5003938 4793496 4596727 4412937 4240763 4079408 3928605 3787345
58120 3787345 3653859 3527136 3407419 3294881 3188699 3087760 2991530 2899864 2812555 2729407
58110 2729407 2650298 2574909 2502739 2433481 2367148 2303841 2243636 2186458 2131751 2078501 2026020
58099 2026020 1974451 1924216 1875327 1827674 1781542 1737275 1694808 1654121 1615638 1579519 1544973
58088 1544973 1511079 1477944 1446299 1416310 1387668 1360479 1335023 1310756 1286631 1262456 1239006
58077 1239006 1216646 1194747 1172711 1150799 1129640 1109497 1090291 1071845 1053835 1035867 1017742
58066 1017742 999431 980914 962451 944851 928892 914500 900992 888065 875931 864484 852974
58055 852974 840697 827592 814094 800779 788110 776138 764449 752784 741520 731115 721296 711481
58043 711481 701894 693503 686713 680757 674508 667366 659264 650438 641482 633095 625443 618040 610415 602540
58029 602540 594482 586092 577308 568412 559718 551170 542485 533583 524718 516209 508116 500193 492235 484422
58015 484422 477143 470512 464396 458940 454540 451027 447474 443269 438884 435039 431573 427853 423916 420350
58001 420350 417248 414132 410907 408105 406054 404398 402508 399768 395443 388938 380466 371073 361849 353433
57987 353433 346184 340298 335732 332416 330569 330372 331444 333133 335241 337949 341135 344325 347220 349651
57973 349651 351136 351245 350422 349748 349765 350177 350724 351561 352661 353582 354074 354282 354142 353337 352096 351313 351490 352090
57955 352090 352222 351423 349544 346594 343061 339657 336314 332059 326428 320455 315702 312789 311382 311069 311551
57940 311551 312336 313022 313825 315263 317383 319725 321957 324201 326882 330609 335987 343006 350622 357359 362456
57925 362456 366237 369368 372033 373882 374543 374021 372581 370362 367280 363384 359060 354588 349643 343666 336687
57910 336687 329388 322319 315495 308871 302728 297352 292637 288238 283871 279352 274582 269590 264337 258521
57896 258521 252019 245535 240235 236521 233607 230577 227409 224660 222568 220859 219181 217416 215702 214415
57882 214415 213931 214262 215040 215927 216831 217743 218735 220096 222009 224054 225445 225796 225164 223449 220551 217220
57866 217220 214831 213820 213057 211295 208655 206185 204558 203848 204009 204864 205990 207269 209269 212517 216743
57851 216743 221366 226331 231788 237414 242863 248623 255460 263070 270139 275802 280282 283950 286550 287701
57837 287701 287618 286905 285899 284465 282205 278770 274204 269121 264330 260228 256696 253542 250741 248225 245749
57822 245749 243100 240342 237789 235869 234916 234978 235878 237527 239970 243011 246004 248225 249215 248634 246183 242055
57806 242055 237168 232504 228317 224346 220503 216890 213405 209934 206845 204688 203426 202476 201557 200923 200644
57791 200644 200200 199037 197136 194830 192366 189907 187714 186082 185129 184724 184552 184362 184299 184827 186042 187298
57775 187298 187931 188241 189248 191488 194566 197922 201347 204589 207152 208988 210823 213159 215215 215557 213723
57760 213723 210676 207558 204554 201185 197289 193244 189380 185686 182225 179560 178428 178980 180507 182020
57746 182020 183087 184097 185756 188339 191379 194053 195861 196843 197185 196849 195805 194379 193094 192192 191579
57731 191579 191152 190818 190294 189357 188385 188129 188788 189752 190511 191346 192740 194460 195717 196020 195481 194419 193051
57714 193051 191509 189837 188010 186158 184610 183564 182872 182303 181740 180964 179681 178056 176834 176471 176483 176143
57698 176143 175520 175248 175536 176073 176807 178083 179900 181602 182530 182648 182380 182080 181764 181217 180407 179915 180666 183035
57680 183035 186512 190636 195904 203325 213448 226416 242592 262424 285965 313385 345753 384444
57668 384444 429948 482262 542121 609992 682825 752584 808846 842795 849262 827197 780178 716095
57656 716095 644556 573487 507714 449656 400098 358343 322859 292540 267218 246979 231365
57645 231365 219403 210039 202452 196154 190887 186354 182200 178442 175665 174352 174071 173784 173009 172319 172508
57630 172508 173625 175037 176195 177012 177531 177519 176615 174816 172659 170797 169432 168303 167144 165918 164558
57615 164558 162825 160679 158576 157041 155970 154672 152738 150597 148992 148017 146951 145118 142718 140640
57601 140640 139526 139232 139114 138603 137491 135955 134520 133730 133573 133343 132283 130280 127811 125429 123456 121917
57585 121917 120434 118409 115690 112899 110733 109128 107577 105986 104629 103411 101945 100378 99336 98804
57571 98804 97849 95846 93341 91198 89465 87741 86208 85554 85958 86821 87490 87802 87849 87640 87163 86592 86320
57554 86320 86777 88102 89836 91107 91329 90712 90034 90002 90810 92061 93021 93194 92800 92493 92537 92598 92417 92223 92323
57535 92323 92767 93671 95289 97320 98755 99056 99061 99921 101457 102487 102640 102810 103595 104260 103791 102298 100726
57518 100726 99620 98838 98236 97956 98006 98085 98004 97994 98450 99508 100885 101931 101892 100497 98499 97315 97732 99015
57500 99015 99614 98755 96954 94925 92571 89511 86222 83910 83123 83038 82402 80836 78933 77333 76097 74938
57484 74938 73775 72909 72656 72827 72759 72080 71316 71378 72437 73719 74539 75067 75874 77088 78328 79210 79582 79501
57466 79501 79294 79461 80211 81220 82036 82539 82785 82673 82045 80964 79638 78308 77337 77076 77289 77132 76119
57449 76119 74806 74010 73670 73036 71761 70189 68682 67275 65975 64847 63788 62729 61966 61734 61530 60623
57433 60623 59260 58598 59135 59926 59800 58816 58065 58391 59735 61378 62429 62330 61291 60094 59268 58650 57931
57416 57931 57224 56758 56370 55764 55108 54901 55311 55999 56552 56823 56893 56943 57178 57644 58103 58222 57883 57256 56691 56551
57396 56551 56966 57622 58021 58053 58099 58447 58913 59227 59475 59861 60372 61050 62289 64388 66942 69137 70535 71188
57378 71188 71138 70427 69547 69226 69553 69833 69569 69110 68973 68921 68199 66513 64316 62148 60115 58132 56388 55345
57360 55345 55267 55870 56478 56579 56208 55728 55360 55097 55012 55333 56095 56973 57699 58472 59730 61629 63876 65922
57342 65922 67140 66997 65418 63004 60590 58551 56780 55274 54419 54548 55525 56916 58319 59334 59457 58392
57326 58392 56435 54310 52625 51586 51131 51100 51243 51241 50829 49901 48607 47452 47102 47795 48904 49376 48737 47533
57308 47533 46699 46617 46826 46526 45293 43429 41771 41036 41258 41822 42051 41665 40705 39236 37306 35135 33227
57291 33227 32161 32204 32960 33524 33168 32028 30940 30569 30810 31106 31116 30929 30857 31258 32499 34771 37917 41592
57273 41592 45660 50249 55406 60861 66257 71514 76789 82039 86802 90620 93699 96916 101011 105862
57259 105862 110633 114512 117151 118663 119627 120931 123045 125294 126419 126106 125462 125594 126305 126781 127149 128360
57243 128360 130536 132362 132620 131724 131169 131766 132956 133784 134002 134128 134745 135952 137349 138491 139461 141057
57227 141057 144204 148961 154196 158470 161292 163429 166007 169526 173816 178609 183786 189188 194603 200094
57213 200094 206051 212743 219977 227316 234458 241226 247468 253222 258957 265381 272910 281375 290251 299113
57199 299113 307975 317223 327221 338016 349537 361947 375491 389952 404619 418907 432751 446244
57187 446244 459316 472014 484738 497819 511106 524289 537403 550675 564199 578156 592976
57176 592976 608704 624437 639083 652619 665965 679632 693222 706369 719375 732595 745795
57165 745795 758609 771219 784099 797379 810834 824298 837722 850982 863922 876463 888469
57154 888469 899729 910312 920730 931441 942313 952874 963002 973088 983554 994387 1005149
57143 1005149 1015368 1025003 1034571 1044672 1055369 1066285 1077383 1089306 1102634 1117133 1132033 1146876
57131 1146876 1161753 1176897 1192481 1208715 1225771 1243611 1262255 1282251 1304531 1329682 1357610
57120 1357610 1388041 1421113 1457398 1497631 1542594 1593068 1649630 1712578 1782296 1859702 1946241
57109 1946241 2043457 2152703 2275316 2412911 2567462 2741140 2936184 3154905 3399694 3672948
57099 3672948 3977113 4314976 4689988 5106181 5567567 6077432 6638119 7251380 7918825
57090 7918825 8641955 9421836 10258598 11150071 12088478 13056052 14023743 14956875 15825809
57081 15825809 16613695 17314844 17925631 18435979 18827327 19076317 19160166 19061206 18770180 18288158
57071 18288158 17626839 16807578 15859614 14817399 13717132 12593516 11477757 10396571
57063 10396571 9371308 8417228 7543644 6754966 6051607 5430256 4884322 4405485 3985781
57054 3985781 3618585 3297855 3017103 2769797 2550891 2357403 2187236 2037869 1906434
57045 1906434 1790547 1688381 1598210 1518562 1448647 1387817 1334584 1286919 1243757 1205552 1173139
57034 1173139 1146740 1126372 1112386 1105006 1103889 1108878 1120858 1141353 1171653 1212676 1264508 1324133
57022 1324133 1382930 1427528 1444762 1427322 1376234 1299351 1207619 1111386 1018253 932737 856829
57011 856829 790641 733172 683350 640608 604439 573762 547276 524256 504473 487367 471870
57000 471870 457210 443395 430802 419641 409942 401605 394213 387116 379951 372906 366360 360484 355297
56987 355297 350852 347221 344502 342968 342981 344516 346830 348699 348991 347108 343109 337475 330649 322789 314037
56972 314037 304870 295983 287899 280868 275005 270227 266256 263064 261217 261343 263330 266533 270727 276302
56958 276302 283397 291467 299864 308283 316219 322491 325800 325589 322025 315475 306432 295781 284609 273646
56944 273646 263086 252995 243773 236239 231265 229147 229308 230929 233957 239146 246938 256736 267619 279312
56930 279312 291882 304705 316300 325149 330119 330212 324643 313618 298671 281795 264395 247200 230873
56917 230873 216194 203581 192774 183185 174436 166456 159167 152319 145717 139464 133813 128834 124367
56904 124367 120306 116789 114036 112055 110518 108963 107181 105505 104609 104865 106012 107730 110402 114894 121472
56889 121472 129377 137779 146933 158020 171904 188189 205340 221437 234905 244921 251482 255209
56877 255209 257044 257904 258310 258336 258139 258564 260874 265715 272662 281056 291010 303244 318189 335694 355583
56862 355583 378068 403506 431926 462675 494144 523691 548218 565165 573127 571820 561952 545238
56850 545238 524143 501151 478226 456972 439009 425749 417780 414829 416574 423329 435688 453650
56838 453650 476599 504288 537367 576460 620868 668584 717266 764338 805988 837027 852756
56827 852756 851104 832976 801112 759221 711622 662528 615146 571673 533967 503462 480285 463258
56815 463258 451329 444672 444055 449606 460736 477045 498671 525620 557074 591264 625550 656402
56803 656402 679751 692013 691239 677612 653079 620564 583314 544458 506575 471324 439490 411516
56791 411516 387854 368704 353659 342122 334114 330264 330840 335252 342746 353205 366763 382786 399604
56778 399604 415123 427271 434016 433691 425688 410749 390431 366503 340774 315005 290512 267851
56766 267851 247053 228105 211113 196177 183300 172423 163446 156230 150569 146039 141904 137432 132513
56753 132513 127749 123746 120449 117421 114588 112366 111036 110284 109431 107983 105988 104036 102869 102678 102757
56738 102757 102122 100582 98964 98164 98243 98610 98797 98798 98855 99241 100120 101326 102336 102725 102642 102615 102935 103458 103993
56719 103993 104596 105380 106224 106809 106938 106841 107151 108376 110259 111831 112336 111921 111180 110271 109000 107587 106678
56702 106678 106476 106467 106274 106213 106621 107097 106934 106031 104922 104108 103790 104012 104501 104467 103256 101289 99869 99767 100399
56683 100399 100623 100027 99118 98487 98162 97818 97352 97113 97535 98614 99835 100728 101357 102066 102825 103139 102713 101937
56665 101937 101540 101882 102739 103632 104230 104447 104370 104167 104014 104048 104327 104771 105201 105491 105671 105889 106374 107478 109482
56646 109482 112139 114573 115971 116357 116374 116348 116049 115488 115420 116600 118816 121157 123133 125083 127372 129615
56630 129615 131071 131652 132192 133597 135877 138189 139731 140418 140669 140834 141029 141329 141788 142248 142404 142127 141488
56613 141488 140474 138986 137210 135680 134783 134423 134339 134460 134722 134798 134346 133419 132335 131290 130319 129501 128830
56596 128830 128076 127130 126368 126194 126267 125752 124511 123490 123596 124615 125661 126356 127038 127954 128820 129309 129548 129898
56578 129898 130472 131089 131614 132196 133169 134748 136728 138513 139616 140154 140724 141754 143210 145017 147493 150999
56562 150999 155343 159952 164738 170404 177582 185811 193699 200105 204985 208990 212450 214941 215854 215219 213857
56547 213857 212742 212343 212586 213244 214097 214796 214938 214432 213566 212572 211379 209987 208790 208108 207597 206575 204932
56530 204932 203211 201741 200179 198099 195620 193164 190940 189026 187604 186714 185933 184657 182608 179878 176710
56515 176710 173597 171276 170106 169584 168953 168154 167682 167587 167331 166672 166026 165700 165361 164606 163591 162694 162018 161595
56497 161595 161646 162080 162102 160950 158932 157195 156535 156874 157800 159020 160219 161031 161385 161534 161542 161097 160014 158615
56479 158615 157401 156574 156094 155977 156263 156810 157300 157454 157181 156657 156373 156903 158472 160813 163482 166187 168701
56462 168701 170694 171874 172214 171957 171533 171568 172645 174727 176997 178657 179871 181514 183893 186118 187016 186512
56446 186512 185801 186166 187793 189758 190996 191202 190829 190371 189826 188929 187774 186969 187066 187956 188920 189230 188638 187433
56428 187433 186161 185245 184633 183786 182147 179770 177429 176026 175885 176560 177228 177269 176634 175776 175161 174800 174364
56411 174364 173776 173483 173932 174921 175772 176063 175908 175495 174695 173283 171398 169565 168354 167984 168174 168396 168491 169029
56393 169029 170757 173619 176625 178860 180304 181476 182652 183795 184960 186302 187784 189335 191218 193806
56379 193806 196961 200015 202442 204255 205707 206984 208290 209934 212069 214501 216863 218859 220343 221321
56365 221321 221913 222144 221847 220947 219765 218733 217920 217217 216878 217361 218506 219424 219443 218816 218296 218385 219184 220582
56347 220582 222291 223978 225575 227141 228315 228399 227355 226195 225956 226673 227839 229397 231597 234137 236279
56332 236279 237789 239150 240798 242724 244893 247454 250327 253076 255420 257520 259624 261788 264078 266623
56318 266623 269253 271421 272773 273517 274071 274599 275187 276159 277870 280258 282893 285399 287637 289492 290768
56303 290768 291387 291631 292049 293038 294551 296265 298063 300197 302849 305684 308062 309631 310557 311232 312040 313338
56287 313338 315308 317700 320029 322210 324846 328665 333671 338958 343429 346752 349657 353242 357979 363492
56273 363492 369255 375270 381851 389058 396701 404817 413749 423687 434349 445225 456030 466974 478681
56260 478681 491785 506493 522701 540604 560916 584215 610370 638934 669891 703729 741048
56249 741048 782525 828930 880600 937116 998088 1064035 1135727 1212738 1293369 1375987 1459685
56238 1459685 1543579 1626305 1706385 1782292 1851880 1912541 1962374 2000511 2025989 2037158 2032851
56227 2032851 2013551 1980840 1936246 1881272 1817919 1748337 1674205 1596987 1518434 1440208 1363380
56216 1363380 1288860 1217879 1151282 1088734 1029543 974047 923314 877582 835945 797701 763150
56205 763150 732777 706356 683222 662856 644814 628453 613194 598922 585971 574792 565630 558263
56193 558263 551979 546013 540051 534233 528801 523975 520003 516963 514585 512561 510887 509607 508439 507127
56179 507127 506038 505819 506513 507546 508660 510281 512739 515619 518250 520534 522994 526103 529783 533474 536637
56164 536637 539257 541918 545328 549746 554859 560108 565104 570001 575511 582218 589765 597197 604367 612439
56150 612439 622533 634447 647349 661209 676655 693808 712341 732634 755793 782366 811921
56139 811921 844164 879636 919064 962833 1011488 1066034 1127174 1194593 1267013 1342241 1416879
56128 1416879 1486909 1549306 1602950 1648059 1685648 1717753 1746926 1774358 1798810 1818015 1830611
56117 1830611 1836199 1834448 1825474 1810923 1793499 1775033 1755353 1732833 1705318 1670697 1627615 1576255
56105 1576255 1518303 1456133 1392289 1329566 1270845 1218388 1173334 1135752 1104971 1079960 1059873
56094 1059873 1044371 1033326 1026340 1022753 1021919 1023210 1025984 1029961 1035384 1042307 1049906 1057160 1064197 1072248
56080 1072248 1082071 1093028 1104051 1114942 1126156 1137672 1148802 1159139 1169158 1179577 1190523
56069 1190523 1201737 1213499 1226819 1242437 1259936 1278153 1296345 1314572 1333095 1351933 1371141
56058 1371141 1391077 1412128 1434445 1458044 1482768 1508040 1533153 1558088 1583538 1609715 1635712
56047 1635712 1660622 1684844 1709507 1734938 1760573 1786261 1812661 1840130 1868093 1896033 1924505
56036 1924505 1954666 1987134 2021802 2058406 2096740 2136479 2177383 2219786 2264449 2311784 2361483
56025 2361483 2413104 2466748 2522846 2581341 2641509 2702823 2765804 2831695 2901329 2974598 3051062
56014 3051062 3130655 3213526 3299517 3388280 3480002 3575628 3676123 3781619 3891533 4005589
56004 4005589 4124551 4249682 4381554 4519777 4664085 4815371 4975222 5144631 5323642
55995 5323642 5512247 5711166 5921761 6145579 6384041 6638119 6908319 7195470 7501573
55986 7501573 7829400 8181305 8559140 8965411 9403722 9877851 10391283 10948148 11553938
55977 11553938 12214911 12937662 13730070 14602133 15565515 16633270 17821075 19148281 20637053
55968 20637053 22311128 24196513 26323500 28728130 31453303 34550253 38079160 42108219
55960 42108219 46713573 51982247 58015864 64931924 72863210 81957572 92377971 104302091
55952 104302091 117922307 133443326 151067882 170958233 193158797 217457775 243179893
55945 243179893 268974800 292761565 311991188 324226229 327811328 322319397 308588951
55938 308588951 288398607 263973163 237516631 210885948 185436094 162011491 141028870
55931 141028870 122594018 106613325 92883132 81152505 71161344 62660618 55422811
55924 55422811 49247173 43960933 39417851 35495846 32094227 29130317 26536217 24256285
55916 24256285 22244718 20463038 18878641 17464826 16200386 15067549 14050106 13133595
55908 13133595 12306177 11557888 10879048 10260240 9693654 9173362 8694194 8251188 7840304
55899 7840304 7458722 7103918 6773003 6463392 6173610 5902956 5650744 5416245 5199037
55890 5199037 4998772 4814626 4645443 4490448 4349513 4222637 4109537 4010006 3924351 3852900
55880 3852900 3794738 3746982 3705323 3665185 3622396 3573270 3514776 3444889 3362616 3267698 3160698
55869 3160698 3043626 2920131 2794523 2670421 2550281 2435878 2328747 2229993 2139870 2057739
55859 2057739 1982486 1913070 1848781 1789099 1733492 1681552 1633264 1588791 1547817 1509351 1472424
55848 1472424 1436777 1402573 1369620 1337312 1305307 1273828 1243255 1213773 1185620 1159268 1135003
55837 1135003 1112425 1090721 1069474 1049019 1029921 1012192 995121 977864 960190 942657 926081
55826 926081 910839 896654 882894 868999 854719 840136 825502 811017 796712 782538 768423
55815 768423 754236 739858 725566 712141 700288 689919 680312 670991 662129 654092 647004 640931 636044
55802 636044 632227 628833 625265 621651 618589 616326 614589 613115 611878 610813 609766 608867 608585 609192 610374
55787 610374 611466 611947 611717 611184 610961 610954 609673 604977 595919 583528 569563 554975 540064 525591 512884
55772 512884 502836 495425 490349 487595 487089 488101 489205 488765 485610 479676 472112 464383 457107 450002
55758 450002 442919 436383 430808 425724 420263 414170 407771 401092 393591 384844 375039 364574 353544 341971
55744 341971 330395 319813 310965 303824 297898 292934 289178 286970 286175 286059 285710 284575 282681 280415
55730 280415 278161 276091 274182 272236 269821 266396 261786 256549 251629 247582 244342 241736 239786 238316
55716 238316 236660 234282 231480 229092 227637 227212 228026 230342 233746 237072 239336 240375 240437 239692 238455
55701 238455 237372 236821 236379 235303 233351 230747 227568 223694 219231 214497 209595 204482 199452 195165 192009
55686 192009 189784 188103 186836 186004 185518 185240 185170 185450 186211 187424 188767 189673 189707 188887 187460 185409 182437
55669 182437 178541 174267 170270 166835 163971 161733 160183 159163 158416 157924 157861 158165 158409 158255 157901 157869 158360
55652 158360 159057 159662 160404 161735 163596 165327 166414 167116 168175 170071 172686 175521 178018 179807 180893
55637 180893 181521 181714 181057 179190 176332 172949 169061 164330 158924 153758 149638 146513 143813 141245 138914
55622 138914 136996 135675 135222 135649 136324 136428 135887 135417 135437 135349 134287 132297 130310 128936 127771 126061 123687
55605 123687 121181 119004 117195 115671 114474 113611 112892 112136 111285 110197 108556 106305 104054 102706 102629 103366
55589 103366 104189 104715 104957 105085 105289 105696 106186 106410 106239 106129 106758 108202 109657 110203 109777 109265 109660 111292
55571 111292 113839 116850 120099 123543 127145 130756 134012 136401 137563 137539 136573 134720 131858 128107 123921
55556 123921 119673 115402 111145 107261 104091 101467 98940 96428 94263 92564 90984 89274 87807 87164
55542 87164 87274 87284 86387 84641 82831 81650 81196 81243 81683 82441 83120 83121 82275 81123 80391 80325 80672 81092 81312
55523 81312 80982 79733 77561 75009 72826 71351 70251 68921 67249 65965 66046 67690 70116 72443 74552
55508 74552 76912 79794 82977 85979 88240 89253 88967 88121 87725 88037 88300 87652 86105 84515 83695 83677 83722
55491 83722 83025 81478 79721 78331 77150 75660 73929 72657 72250 72289 72152 71824 71744 72135 72870 73834 74954
55474 74954 75861 75966 75094 73871 73182 73253 73378 72627 70794 68637 67182 66773 66813 66421 65364 64249 63756 63783
55456 63783 63599 62888 62328 62823 64347 65959 66886 67110 66870 66231 65477 65329 66164 67310 67710 67161 66391 66076
55438 66076 66304 66887 67594 68048 67967 67610 67535 67839 68127 68228 68385 68618 68569 68158 67802 67695 67479 66952 66499 66411
55418 66411 66397 66342 66984 69073 72203 75158 77191 78293 78515 77914 77134 77102 77842 78211 77213 75136 73074 71662
55400 71662 70717 69880 69200 68949 69053 68910 67932 66281 64800 64037 63590 62735 61491 60627 60654 61275 61857 62060
55382 62060 61864 61344 60684 60180 60072 60448 61302 62421 63222 63085 62013 60668 59586 58651 57569 56555 56153
55365 56153 56510 57213 57878 58615 59746 61216 62441 62788 62171 61117 60217 59606 59046 58402 57787 57284 56805 56406
55347 56406 56503 57509 59271 61072 62256 62774 63073 63527 64043 64249 63974 63401 62766 62144 61613 61378 61414 61194
55329 61194 60198 58728 57776 57910 58634 59099 59174 59458 60401 61764 62904 63294 62823 61935 61552 62424 64303 65978
55311 65978 66432 65864 65341 65505 65949 65886 65118 64138 63490 63249 63071 62629 62043 61948 62999 65079 67134 68077 67845
55292 67845 67307 67153 67165 66733 65731 64627 63871 63438 63028 62567 62441 63125 64524 65856 66430 66450 66652 67195
55274 67195 67497 67318 67373 68332 69694 70371 70153 69847 69943 69892 69019 67585 66496 66225 66410 66381 65771 64672 63453
55255 63453 62516 62171 62580 63695 65128 66233 66544 66170 65585 65069 64484 63601 62415 61168 60263 60093 60690
55238 60690 61508 61844 61577 61265 61462 62162 62979 63626 64081 64453 64804 64971 64594 63557 62418 62081 62829 63909
55220 63909 64279 63664 62784 62627 63600 65236 66646 67337 67568 67830 68140 68137 67732 67183 66571 65702 64649 63887 63605
55201 63605 63357 62744 62019 61711 61922 62412 63077 63962 65035 66319 67989 69951 71561 72194 71924 71238 70331
55184 70331 69116 67760 66683 66126 66155 66962 68606 70525 71838 72135 71515 69965 67460 64696 62949 62830
55168 62830 63723 64749 65761 66962 68091 68579 68282 67615 67088 67053 67669 68707 69517 69561 68952 68291 68070 68416
55150 68416 69202 70102 70725 70967 71089 71136 70535 68706 66027 63737 62814 63209 64205 65140 65684 65735 65335 64667 64000
55131 64000 63556 63345 63124 62674 62201 62231 62971 64027 64968 65871 66904 67675 67560 66635 65692 65286 65260 65283 65310 65304
55111 65304 65075 64705 64731 65502 66716 67912 69065 70277 71221 71411 70908 70293 70046 70328 71265 72909 74862
55094 74862 76321 76703 76090 75099 74478 74711 75662 76680 77258 77545 77915 78296 78383 78336 78613 79056 78799 77424 75655
55075 75655 74578 74525 75072 75742 76264 76414 76033 75207 74165 73138 72450 72401 72793 72891 72247 71311 70807 70764 70699 70560
55055 70560 70767 71300 71446 70712 69509 68619 68374 68666 69418 70603 71948 72954 73274 72964 72443 72259 72715 73572
55037 73572 74311 74784 75347 76157 76647 76117 74751 73566 73282 73583 73694 73384 73092 73180 73441 73459 73170 72848 72677
55018 72677 72638 72795 73309 74037 74419 74064 73264 72612 72227 71800 71337 71363 72172 73291 74034 74345 74701 75334 75938
54999 75938 76188 76210 76392 76904 77602 78284 78872 79265 79214 78561 77652 77247 77816 79014 80142 81012 81979 83078 83660
54980 83660 83200 82128 81386 81283 81244 80658 79549 78310 77181 76212 75514 75295 75717 76855 78591 80452 81721
54963 81721 82049 81902 82154 83136 84315 84980 85101 85315 86150 87418 88394 88479 87711 86778 86505 87162 88148 88519 87924
54944 87924 86943 86401 86472 86608 86219 85216 83992 83118 83009 83619 84399 84771 84739 84779 85185 85786 86409 87211 88363
54925 88363 89700 91004 92447 94412 96973 99841 102767 105732 108779 111928 115303 119198 124005 130138
54911 130138 137794 146493 154950 161773 166343 168753 168988 166605 161384 153976 145684 137799 131176 126079
54897 126079 122119 118552 114931 111453 108488 106021 103807 101847 100325 99128 97879 96547 95649 95606 96188
54882 96188 96893 97670 98932 100881 103146 105229 107072 109046 111470 114347 117586 121349 126088 132179 139511
54867 139511 147418 155021 161603 166692 169898 170864 169429 165756 160316 153794 146920 140137 133363 126337
54853 126337 119343 113319 108953 105874 103089 100121 97240 94644 92025 89245 86970 86097 86700 87917 88776
54838 88776 88849 88243 87347 86627 86282 85992 85240 83954 82637 81835 81732 82262 83234 84185 84467 83858 82936 82512 82806
54819 82806 83422 84057 84809 85695 86247 85890 84577 82809 81117 79778 78995 79006 79800 80937 81915 82653 83380 84105
54801 84105 84479 84269 83673 83001 82211 81083 79709 78596 78239 78785 80078 81837 83695 85267 86273 86589
54785 86589 86261 85636 85300 85590 86145 86278 85914 85783 86509 87861 89256 90667 92540 94934 97343 99412 101334
54768 101334 103372 105452 107520 109911 113029 116903 121415 126674 132825 139686 147006 154838 163114 170950
54754 170950 177031 180705 182149 181477 178508 173661 168198 162928 157399 151053 144593 139204 134828 130369
54740 130369 125557 121463 118941 117643 116960 116909 117447 117822 117508 117106 117351 117641 116658 114298 112017 111138 111692
54723 111692 113113 115266 118360 122339 126779 131159 135104 138704 142674 147750 153752 159691 164821 169007
54709 169007 171884 172454 170171 165852 160825 155478 149409 142725 136324 130779 125775 120991 116863 113950
54695 113950 111911 109719 106794 103525 100662 98543 96976 95536 93858 91835 89791 88392 88195 89188 90821
54680 90821 92424 93578 94175 94340 94343 94423 94535 94365 93752 93043 92760 92865 92596 91257 89104 87202 86338 86249 86021
54661 86021 85115 83795 82580 81638 80924 80676 81312 82802 84544 86028 87334 88740 90135 91197 91896 92385
54645 92385 92540 92153 91587 91665 92699 94084 95070 95503 95468 94731 93114 91157 89784 89279 89125 88860 88604 88670
54627 88670 89190 90370 92577 95693 98671 100271 100227 99340 98449 97743 97112 96682 96630 96708 96425 95716 95150 95320
54609 95320 96166 97065 97521 97654 97946 98616 99280 99281 98346 96923 95904 95988 97202 98864 100016 100014 98903 97201
54591 97201 95374 93649 92351 92022 92849 94191 95154 95637 96278 97313 98070 97964 97488 97662 98713 99882 100395
54574 100395 100125 99320 98266 97297 96671 96238 95608 94790 94292 94417 94845 95116 95170 95135 94943 94532 94167 94167 94525 95141
54554 95141 96221 97989 100061 101594 102106 101887 101537 101413 101542 101760 101812 101578 101301 101408 102032 102939 103980 105314
54536 105314 107021 108705 109788 110137 110189 110478 111185 112090 112783 112905 112330 111244 110010 108907 108020 107419 107304
54519 107304 107829 108760 109508 109641 109294 108874 108496 107955 107285 106939 107158 107479 107258 106591 106294 106894 107979 108670
54501 108670 108501 107698 106829 106343 106262 106162 105588 104667 104117 104449 105324 105934 105892 105439 104961 104715 104999 106039 107558
54482 107558 108828 109430 109629 109756 109592 108751 107418 106206 105489 105395 106298 108571 111718 114480 116147 117196
54466 117196 118220 118810 118270 117055 116546 117288 118225 118031 116711 115483 115402 116439 117741 118407 118125 117303 116645
54449 116645 116481 116495 116178 115406 114550 114106 114302 114918 115404 115341 114906 114731 115138 115644 115443 114293 112661 111071
54431 111071 109636 108379 107711 108151 109529 110810 111011 110208 109417 109468 110286 111266 111972 112226 111872 110913 109761
54414 109761 108932 108498 108213 108171 108865 110447 112287 113566 114093 114362 114938 115903 116755 116791 115794 114442 113786 114227
54396 114227 115244 116209 117131 118373 119999 121740 123377 124837 126016 126854 127490 128118 128700 129020 128928 128343 127157
54379 127157 125407 123449 121767 120566 119762 119246 118989 118890 118747 118432 118069 118006 118550 119590 120552 120926 120835 120792
54361 120792 120964 121090 121191 121687 122581 123091 122641 121722 121171 120931 120244 118894 117493 116532 115891 115420 115361 115837
54343 115837 116308 115918 114275 111837 109665 108715 109013 109505 109063 107649 106230 105623 105882 106741 108095 109799
54327 109799 111423 112499 112830 112544 112130 112364 113669 115452 116558 116624 116481 117004 118110 119242 120403 122116
54311 122116 124622 127605 130628 133430 135820 137634 138848 139532 139727 139418 138520 136827 134201 130952 127772
54296 127772 125110 122800 120517 118263 116185 114132 111834 109422 107443 106398 106422 107267 108360 109078 109253
54281 109253 109282 109512 109701 109454 109005 109118 110242 112124 114186 115813 116330 115310 113220 111344 110648 110861 110955
54264 110955 110347 109365 108663 108520 108703 108751 108287 107271 106096 105378 105500 106363 107527 108552 109238 109729 110433 111700
54246 111700 113371 114743 115152 114592 113580 112489 111289 109951 108720 107804 107079 106407 105975 105978 106143 106023 105706
54229 105706 105782 106526 107466 107935 107749 107192 106568 105917 105055 103838 102525 101824 102263 103474 104397 104376 103799 103545
54211 103545 104074 105214 106575 107849 108793 109150 108698 107439 105772 104323 103415 102845 102429 102535 103585 105175
54195 105175 106311 106606 106588 106623 106296 105291 104276 104219 105168 106289 106926 107055 106861 106495 106214 106255 106460 106395 105981
54176 105981 105759 106400 107978 109732 110563 110005 108753 108001 108151 108542 108546 108440 108832 109782 110926 112079 113128
54159 113128 113687 113492 112907 112413 111831 110723 109385 108610 108462 108092 106933 105415 104245 103576 103183 102985 103076
54142 103076 103501 104170 104752 104732 104057 103652 104631 106777 108505 108642 107682 106940 107081 107911 109018 109897 109862 108667
54124 108667 107189 106802 107884 109360 109882 109145 107920 107084 106919 107207 107699 108309 108960 109496 109926 110545 111601
54107 111601 112849 113681 113673 112873 111634 110391 109505 108985 108415 107483 106587 106537 107589 109111 110259 110632 110233 109286
54089 109286 108274 107762 107906 108398 108995 109748 110583 111102 111078 110831 110831 111244 112041 113210 114602 115914 117107 118565
54071 118565 120559 122834 124975 126863 128537 129914 130899 131451 131352 130387 129024 128304 128566 128810 127934 126193
54055 126193 124783 124366 124742 125691 127286 129442 131889 134615 137600 140227 141712 142177 142574 143447 144599 146122
54039 146122 148845 153294 158945 165037 171481 178348 185017 190689 195528 200496 206075 211744 216737 220770
54025 220770 223905 226263 228202 230406 233268 236257 238279 238850 238694 238992 240113 241296 241494 240277 237838
54010 237838 234528 230679 226673 222811 219117 215509 212026 208630 204953 200708 196276 192429 189358 186438
53996 186438 183096 179541 176400 173976 172086 170393 168651 166791 165000 163523 162351 161326 160673 160951 162257
53981 162257 163845 164954 165741 166944 168819 170936 173024 175517 179062 183748 189012 194192 198993 203450
53967 203450 207408 210128 210622 208580 204834 200641 196600 192473 188001 183461 179334 175777 172745 170463
53953 170463 169408 169654 170487 170944 170774 170638 171229 172367 173223 173342 173110 173158 173679 174519 175615 177057 178884
53936 178884 181113 183851 187116 190635 194084 197436 200834 204223 207398 210426 213668 217378 221568 226306
53922 226306 231790 237972 244370 250518 256436 262442 268651 274890 281108 287594 294695 302356 310049 317167
53908 317167 323443 328979 333909 338141 341424 343560 344528 344543 344032 343317 342152 339838 336119 331785 327963
53893 327963 324875 321701 317662 312727 307171 300991 294196 287267 280813 274925 269252 263568 257850 251971
53879 251971 245843 239887 234861 231010 227725 224278 220564 216947 213644 210626 207936 205747 204065 202619
53865 202619 201133 199546 197949 196346 194519 192116 188996 185542 182510 180397 179030 177886 176637 175192
53851 175192 173399 171194 169057 167823 167713 167873 167274 165982 165093 165382 166394 167039 166838 166257 165909 165757 165290
53834 165290 164287 163163 162456 162121 161536 160263 158680 157730 158052 159422 161069 162479 163836 165621 167862
53819 167862 169925 171223 172035 173369 175922 179401 183013 186418 189951 194204 199784 207470 217974 231142
53805 231142 245536 259098 270206 278048 282297 282900 280326 275747 270692 266336 263052 260574 258538 256864
53791 256864 255633 254815 254330 254265 254697 255295 255499 255261 255252 255934 256687 256263 254062 250569 246619 242610 238492 234116
53773 234116 229431 224594 220074 216385 213548 210990 208154 205003 201853 198927 196339 194273 192885 191983
53759 191983 191040 189569 187461 185030 182831 181307 180473 179927 179282 178528 177892 177454 177097 176810 176894 177766 179562
53742 179562 181906 184091 185533 186071 185818 184888 183429 181831 180559 179721 179057 178383 177725 176984 175879 174438
53726 174438 173102 172115 171228 170376 170101 170727 171542 171581 171035 171047 172107 173462 174241 174374 174159 173721 173399 173965
53708 173965 175810 178316 180593 182499 184393 186293 187979 189686 191965 194827 197644 199916 201637 202877
53694 202877 203610 204062 204719 205739 206774 207569 208293 209060 209537 209434 209072 209025 209288 209217 208330 206846 205350 204101
53676 204101 202826 201163 199183 197376 196144 195460 195085 194936 195023 195121 194845 194078 193041 191927 190788 189901 189818
53659 189818 190760 192178 193254 193710 193835 193846 193587 192901 191986 191199 190686 190317 189929 189515 189174 188937 188677 188257
53641 188257 187800 187760 188609 190392 192588 194430 195378 195412 195001 194824 195411 196897 199043 201504 204103 206821 209534
53624 209534 211918 213783 215446 217531 220289 223324 226067 228318 230186 231819 233485 235637 238482 241623
53610 241623 244554 247353 250390 253468 255992 258061 260592 263960 267184 269084 269732 270078 270516 270628 270173
53595 270173 269494 268833 267943 266667 265328 264220 263158 261879 260550 259468 258453 256954 254769 252415 250714
53580 250714 250055 249952 249355 247617 245282 243620 243209 243212 242379 240561 238843 238175 238275 238056 236855 234967 233119
53563 233119 231776 231042 230983 231701 233013 234310 234938 234759 234193 233715 233417 233106 232669 232316 232495 233616 235719
53546 235719 238366 240997 243516 246427 250206 254646 259066 263254 267906 273925 281357 289270 296717 303682
53532 303682 310912 319002 327832 336827 345516 353751 361680 369761 378690 388972 400403 412170 423564
53519 423564 434575 445749 457622 470405 484115 498813 514639 531717 550070 569563 589880
53508 589880 610694 631860 653337 674815 695613 715275 734242 753575 773763 794061 813274
53497 813274 831033 847983 864799 881450 897489 912702 927262 941486 955665 969936 984175
53486 984175 998168 1011952 1025750 1039467 1052527 1064508 1075682 1086628 1097453 1107682 1116718 1124087
53474 1124087 1129384 1132397 1133315 1132475 1129869 1125193 1118407 1109943 1100274 1089474 1077276 1063418 1048038
53461 1048038 1031924 1016233 1001551 987268 972185 955750 938289 920135 901190 881564 862068
53450 862068 843611 826384 810004 794177 778820 763805 749076 735028 722373 711536 702357 694428
53438 694428 687453 681299 675930 671487 668359 666942 667148 668195 669224 670394 673060 678387 685947 694282
53424 694282 702852 712582 724211 737045 750102 763804 779476 797394 816491 836041 856609 878969
53412 878969 902993 928184 954612 982602 1012006 1042551 1074655 1109061 1145676 1183480 1221805
53401 1221805 1261148 1302435 1345912 1391045 1437135 1483661 1530263 1576804 1623447 1670356 1717408
53390 1717408 1764427 1811527 1858754 1905375 1950011 1991666 2030329 2066403 2099955 2130799 2158879
53379 2158879 2183972 2205284 2221974 2234138 2242714 2248301 2250512 2248657 2242557 2232406 2218192 2199612
53367 2199612 2176269 2147731 2113735 2074697 2031775 1986056 1937975 1887910 1837038 1786892 1738042
53356 1738042 1689769 1641232 1592569 1544711 1498471 1454100 1411553 1370882 1332186 1295104 1258502
53345 1258502 1221141 1182963 1145359 1109744 1076128 1043659 1012265 982822 955653 929866 904643
53334 904643 880379 857891 837147 817657 799674 783972 770499 758160 746201 735047 725374 717034
53322 717034 709418 702498 696890 693009 690651 689393 689021 689539 691054 693778 697847 703055 708985 715553 723251
53307 723251 732686 743966 756707 770502 785197 800793 817365 835126 854339 875043 897009 920032
53295 920032 944080 969001 994244 1019106 1043254 1066912 1090507 1114145 1137293 1158931 1178243
53284 1178243 1195270 1210697 1224775 1236748 1245724 1251852 1256092 1258838 1259383 1256898 1251379 1243349 1233154
53271 1233154 1221018 1207359 1192426 1175826 1157119 1136797 1115999 1095129 1073373 1049923 1025155
53260 1025155 1000141 975387 950571 925404 900177 875314 850810 826339 801715 777066 752632
53249 752632 728567 704902 681628 658762 636337 614285 592403 570538 548810 527557 507071
53238 507071 487504 469020 451838 436074 421713 408797 397399 387360 378270 369910 362445 355855
53226 355855 349454 342423 334750 327127 319912 312759 305451 298501 292470 287062 281444 275274 268918 262799
53212 262799 257102 252136 248431 246194 244930 243827 242285 240061 237177 233868 230401 226889 223472 220666
53198 220666 219061 218473 217777 215999 213330 210690 208567 206763 205177 204198 204107 204498 204658 204291 203574 202639 201385
53181 201385 199874 198574 197905 197643 197132 196160 195298 195107 195197 194543 192767 190694 189394 189006 188783 188092 186953
53164 186953 185711 184603 183790 183482 183772 184443 185092 185463 185603 185705 185820 185761 185315 184539 183750 183185 182820 182539
53146 182539 182279 181888 181098 179923 178929 178696 179082 179372 179175 178782 178540 178368 178139 178164 178887 180279 181852 183161
53128 183161 183970 184138 183759 183314 183151 182731 180954 177609 174153 172542 173308 175121 176230 176068 175367 175014 175103
53111 175103 175040 174343 173131 171885 170888 170075 169303 168571 167882 167133 166288 165546 165142 165091 165307 165845 166732 167627 167982
53092 167982 167608 166864 166192 165744 165471 165269 164913 164208 163452 163301 163804 163949 162743 160575 158820 158086 157509 156067
53074 156067 153949 152177 151277 150934 150813 151073 151910 152974 153565 153290 152356 151250 150234 149245 148245 147534 147511
53057 147511 148110 148681 148594 147888 147219 147182 147809 148680 149415 149972 150470 150847 150838 150419 150052 150213 150748 151046 150885 150700
53037 150700 150912 151325 151477 151276 151006 150926 151129 151585 152005 151884 151035 149903 149005 148281 147429 146647 146473 146948 147595
53018 147595 148193 148908 149510 149208 147698 145739 144208 143013 141576 140011 139103 139229 139952 140759 141621 142627
53002 142627 143562 144111 144231 144041 143512 142537 141235 140017 139294 139131 139231 139311 139518 140304 141745 143192 143869 143746
52984 143746 143457 143437 143483 143272 142908 142738 142948 143556 144532 145631 146367 146538 146605 147173 148183 149066 149653 150439 151777
52965 151777 153273 154290 154721 154890 154941 154828 154762 155179 156076 156801 156698 155731 154323 152826 151365 150023 148877
52948 148877 147905 147031 146216 145365 144296 143026 141944 141415 141238 140850 140060 139238 138689 138242 137629 136921 136333 135899
52930 135899 135688 136059 137205 138516 138938 138122 136829 136036 135951 136080 135983 135645 135251 134921 134672 134493 134426 134610 135138
52911 135138 135742 135809 134906 133277 131670 130686 130394 130509 130815 131414 132666 134831 137644 140305 142056 142763 142859
52894 142859 142819 142821 142826 142728 142438 141965 141394 140677 139618 138325 137501 137845 139175 140567 141401 141821 142079 142053 141744 141743
52874 141743 142591 143935 144838 144816 144134 143253 142457 141999 142139 142960 144393 146370 148632 150527 151491 151676 151664 151594
52856 151594 151067 149904 148455 147056 145778 144761 144234 143961 143330 142277 141484 141259 140911 139813 138464 137740
52840 137740 137531 136985 135834 134601 133585 132517 131322 130402 129884 129240 128018 126533 125570 125683 126965 129107
52824 129107 131445 133246 134162 134253 133613 132382 131132 130718 131424 132579 133240 132998 132065 130967 130344 130600 131464
52807 131464 132247 132769 133725 135833 138898 141934 143919 144200 142659 139924 137179 135334 134414 133942 133575 133112
52791 133112 132305 131145 130088 129517 129147 128400 127204 125984 125096 124697 124952 125805 126689 127039 126999 127112 127445 127653
52773 127653 127758 128121 128596 128604 128256 128526 129854 131349 131960 131864 132008 132696 133416 133840 134215 134733 135139 135141 134792 134349
52753 134349 134033 133978 134107 134071 133585 132900 132574 132734 132856 132378 131263 129866 128579 127807 127971 129177 130946 132581
52735 132581 133746 134507 134902 134869 134667 134995 136334 138330 140181 141610 143065 144814 146246 146442 145297 143679
52719 143679 142512 142031 141920 141742 141132 139986 138760 138253 138701 139315 139080 137966 136916 136678 137024 137239 136975
52702 136975 136433 135956 135744 135890 136447 137410 138747 140393 142163 143680 144504 144377 143348 141712 139883 138263
52686 138263 137120 136432 135886 135135 134209 133623 133948 135219 136890 138398 139580 140467 140884 140556 139588 138532 137950
52669 137950 137992 138402 138749 138683 138200 137745 137894 138879 140522 142542 144674 146523 147705 148344 149070 150274 151639
52652 151639 152704 153671 155174 157377 159707 161490 162407 162329 161203 159343 157436 155972 154855 153768 152602
52637 152602 151303 149673 147741 146032 144972 144231 143251 142323 142377 143570 144791 144988 144438 144154 144529 145221 146097
52620 146097 147451 149247 150866 151787 151995 151493 150002 147582 145118 143639 143345 143750 144545 145810 147411 148827
52604 148827 149735 150388 151161 152029 152726 153173 153470 153600 153441 153048 152697 152654 153058 154024 155657 157830 159999 161413
52586 161413 161658 161038 160356 160230 160557 160773 160573 160274 160436 161314 162760 164415 165800 166457 166326 165925 165793 165774
52568 165774 165215 163999 162909 162692 163049 162982 161970 160384 158843 157645 156944 157002 157894 159228 160398 161000 160885
52551 160885 160057 158827 157790 157287 157038 156647 156328 156626 157531 158462 159195 160118 161304 162042 161852 161408 161694 162527
52533 162527 162763 161928 160830 160368 160515 160817 161186 161634 161752 161207 160499 160452 161031 161315 160754 159780 158964 158239 157438
52514 157438 157137 158223 160637 163078 164153 163619 162481 162137 163470 166392 169925 172803 174304 174642 174502
52499 174502 174211 173489 172005 170020 168318 167534 167626 168015 168133 167845 167441 167294 167468 167611 167284 166444 165565 165203
52481 165203 165556 166457 167639 168777 169466 169522 169346 169591 170301 170686 170044 168714 167765 167838 168590 169248 169424 169392 169802
52462 169802 171198 173532 176117 178213 179692 180946 182223 183384 184299 184957 185087 184192 182376 180583 179449
52447 179449 178293 176023 172900 170485 169698 169775 169615 169347 169746 170608 170723 169545 167993 167232 167254 167172 166535 165771
52429 165771 165395 165323 165153 164789 164491 164404 164352 164184 164164 164771 166148 167919 169605 171048 172319 173417 174297 175123
52411 175123 176292 178188 181087 185112 190010 195050 199565 203682 208143 213266 218408 222590 225223 225990
52397 225990 224584 221157 216686 212267 208171 204125 200305 197270 194950 192606 190113 188473 188544 189843 191165
52382 191165 191859 191904 191268 190081 189165 189445 190787 192213 193415 195251 198400 202199 205305 207123 208137 209147
52366 209147 210590 212445 214406 216129 217447 218281 218410 217654 216342 215171 214430 213825 213268 213296 214312 215838
52350 215838 217040 217688 218037 218132 217870 217603 218028 219412 221438 223761 226223 228547 230420 231976 233750 236096
52334 236096 239087 242984 248180 254562 261476 268502 275725 283163 290563 298063 306346 315721 325557 335104
52320 335104 344401 353875 363441 372538 380762 387991 394196 399628 404863 410177 415159 419484 423704 428609
52306 428609 434002 438843 442561 445581 448570 451785 455099 458119 460294 461515 462607 464556 467237 469582
52292 469582 471027 471980 472686 472586 471255 469230 467298 465529 463607 461646 460086 459141 458875 459531 461233 463619
52276 463619 466315 469547 473777 478921 484422 489875 495161 500216 505218 510745 517123 523737 529612 534631
52262 534631 539559 544911 550409 555586 560278 564433 568070 571647 575888 580942 586190 591117 595879 600810
52248 600810 605886 611048 616516 622288 627671 631863 634827 637184 639426 641606 643601 645319 646821 648625
52234 648625 651642 656332 661977 667253 671534 675279 679190 683466 687958 692537 697086 701451 705688 710185
52220 710185 715316 721106 727380 734002 740772 747223 752850 757594 761982 766650 771802 777183 782615 788455
52206 788455 795348 803460 812072 820079 826791 832158 836381 839719 842651 845842 849638 853710 857385 860259
52192 860259 862403 864116 865617 866925 867893 868418 868704 869186 870026 870752 870617 869330 867243 864766 861812 857984
52176 857984 853165 847693 841900 835707 828879 821616 814667 808709 803764 799393 795420 792208 790141 789061
52162 789061 788387 787723 787167 787023 787328 787688 787567 786823 785989 785877 786718 787807 788171 787539 786441 785420 784553 783744
52144 783744 783084 782645 782214 781600 781001 780693 780362 779158 776524 772763 768711 765120 762468 761114 761294 762901
52128 762901 765432 768300 771326 774964 779956 786695 795103 805154 817168 831197 846326 861268 875741
52115 875741 890690 906857 923647 939729 954179 966546 976315 983183 987764 991166 993763 995002 994595
52102 994595 993241 991765 990122 987763 984685 981581 979015 976874 974721 972533 970917 970563 971354 972192 971995
52087 971995 970812 969515 968372 966550 963263 958861 954299 950069 946222 943186 941766 942334 944516 947702
52073 947702 951406 955207 958885 962759 967441 973089 979245 985442 991549 997335 1002169 1005463 1007188 1007733
52059 1007733 1007441 1006444 1004712 1002125 998654 994590 990387 986247 982049 977665 972977 967573 960909 952976
52045 952976 944437 935902 927452 919079 910992 903083 894640 885259 875753 867455 860786 855173 850320 846770
52031 846770 845042 844857 845602 847089 849384 852126 854507 855943 856534 856843 857324 857928 858108 857159 854578 850215
52015 850215 844336 837655 831124 825323 819999 814296 807378 798741 788182 775906 762580 748858 734749
52002 734749 719829 704108 688242 672742 657413 641819 625894 609765 593367 576722 560374
51991 560374 545101 531293 518969 508193 498924 490531 482124 473565 465697 459232 453775 448304 442346
51978 442346 436276 430570 425229 420018 414859 409696 404205 398040 391431 385258 380343 376835 374441 373060
51964 373060 372868 373808 375480 377702 380810 385122 390351 395976 402013 408933 416723 424430 430837 435337 438026
51949 438026 439204 439030 437508 434641 430734 426712 423969 423602 425729 429647 434572 440115 446212 452926 460450
51934 460450 469059 478769 488995 498710 507096 514079 520017 524780 527284 526243 521338 513349 503124 490837
51920 490837 476512 460796 444753 429044 413813 399287 385938 373987 363235 353574 345176 337935
51908 337935 331223 324647 318700 314114 310777 307890 305211 303525 303666 305553 308475 311949 315905 320257
51894 320257 324787 329405 334053 338160 340528 340085 336742 331425 325363 319533 314640 311139 308981 307548
51880 307548 306270 305345 305544 307218 309853 312808 316263 321052 327686 335865 344845 353929 362646 370887 379044
51865 379044 387704 396952 406160 414574 421883 428209 433919 439704 446397 454179 461961 467880 470405 468826
51851 468826 462992 453110 439889 424543 408504 393170 379689 368551 359310 351034 343183 335903 329511
51838 329511 324035 319268 314915 310602 306053 301427 297207 293690 290875 288862 287925 288073 288998 290631 293120
51823 293120 295916 297568 297118 295309 293673 292702 291700 290238 288765 287657 286575 285184 283834 283083 283138
51808 283138 284200 286793 291050 296030 300367 303504 305730 307180 307429 306141 303636 300625 297684 295064
51794 295064 292773 290742 289001 287646 286496 284987 282710 279901 277060 274307 271596 269440 268710 269536 270916
51779 270916 271708 271621 271008 270163 269222 268438 268091 268169 268413 268536 268320 267818 267646 268748 271486 275187 278952 282669
51761 282669 286883 291877 297325 302663 307387 311115 313799 315759 317008 316714 313972 309081 303412 297908
51747 297908 292391 286566 281000 276572 273390 270817 268385 266343 265385 266102 268495 271921 275773 280402 286876
51732 286876 295503 304954 313313 319692 324368 327718 329766 330786 331690 333479 336546 340485 344244 346489
51718 346489 346237 343387 338616 332832 326928 321836 318272 316266 315176 314179 312594 309979 306422 302756 299992
51703 299992 298434 297696 297599 298452 300274 302314 303750 304471 304753 304514 303471 301927 300898 301302 303303 306496
51687 306496 310376 314337 317338 318029 315626 310770 305274 300741 297417 294458 291113 287464 284227 282237
51673 282237 282021 283469 285903 288767 292207 296619 301878 307557 313757 320910 328671 335856 341758 346667
51659 346667 350666 352754 351875 348174 342519 335442 327462 319976 314656 312051 311640 313018 316022 319641 322010
51644 322010 321967 319915 316799 312904 308025 302202 295735 288869 281841 274982 268504 262487 257210 253046 249884
51629 249884 247103 244394 242103 240534 239436 238576 238244 238660 239275 239266 238517 237594 236917 236424 235935 235375 234689 233907
51611 233907 233234 232819 232528 232232 232132 232412 232750 232618 232073 231846 232608 234408 236799 239245 241411 243339 245446
51594 245446 248281 252280 257742 264695 272522 279946 285698 289171 290372 289666 287877 286180 285273 284858 284443
51579 284443 284432 285824 288997 293504 299040 305832 313961 322962 332367 342149 352421 363222 374781 387415
51565 387415 400922 414570 427892 440963 453749 466034 478483 493006 511296 533427 558558
51554 558558 586403 616996 649193 680418 708027 730245 745863 754026 754720 748764 736849 719126
51542 719126 696045 668999 639432 607751 573875 538811 504968 474607 448353 425457 405225
51531 405225 387783 373516 362152 352730 344360 336791 330225 324831 320588 317311 314569 311725 308402
51518 308402 304853 301556 298484 295235 291907 289305 287977 287400 286552 285044 283260 281506 279601 277397 275222
51503 275222 273448 271889 269967 267436 264661 262186 260246 258746 257435 255902 253701 250907 248512 247781
51489 247781 248942 250824 252117 252772 253743 255561 257748 259665 261311 262958 264533 265755 266528 266664 265557
51474 265557 262811 259107 255764 253280 250893 247837 244446 241628 239699 238323 237299 236740 236468 235905 234854
51459 234854 233984 234178 235623 237817 240272 242841 245412 247719 249664 251564 253824 256443 259095 261734 264900
51444 264900 269211 274620 280432 286156 292185 299374 307898 316673 323978 328554 330119 329155 326569 323492
51430 323492 320904 319078 317423 315038 311400 306472 300394 293410 286084 279298 273837 270079 268059 267613
51416 267613 268319 269518 270615 271367 271757 271754 271342 270735 270346 270494 271254 272582 274423 276678 279203 281897 284698
51399 284698 287397 289543 290678 290768 290393 290375 291045 291903 292247 292178 292794 295223 299684 305683 312815 321019 330265
51382 330265 340622 352711 367528 385558 406460 429899 456331 486571 520825 558427 598232
51371 598232 638715 677824 713403 744009 769053 788038 799986 803818 799115 786406 766891 741973
51359 741973 712791 679998 644104 606146 567768 530410 494597 460375 428386 400083 376665
51348 376665 358014 342920 330209 319366 310175 302193 294888 288037 281631 275495 269347 263248 257595
51335 257595 252598 248118 244135 240953 238617 236546 234180 231748 229888 228702 227762 226970 226759 227242 227792
51320 227792 227782 227368 227178 227538 228342 229404 230548 231439 231754 231551 231276 231325 231700 232044 232039 231807 231889 232609 233578 234213
51300 234213 234745 236101 238519 240868 241818 241298 240220 239120 237782 236047 234141 232096 229585 226666 224144
51285 224144 222772 222459 222610 222920 223453 224197 225024 226031 227510 229508 231662 233542 234992 236022 236589 236708
51269 236708 236765 237478 239302 241953 244754 247486 250576 254289 258104 261252 263568 265289 266178 265558 263375
51254 263375 260539 257844 255045 251473 247174 242889 239134 235923 233362 231926 231909 232893 234016 234598 234457
51239 234457 233835 233148 232685 232400 232012 231371 230610 229927 229332 228728 228171 227928 228202 228871 229584 230120 230556 231054 231608
51220 231608 232208 233134 234803 237243 239927 242235 243895 244897 245262 245135 244941 245154 245960 247242 248771 250285
51204 250285 251542 252591 253907 256059 259250 263248 267562 271474 274149 275181 275039 274669 274598 274672 274574 274252
51188 274252 273823 273442 273296 273443 273557 273215 272540 272183 272471 272908 272796 272071 271212 270581 270191 269989 269941 269792 269078
51169 269078 267565 265554 263699 262497 261942 261635 261280 261052 261286 261868 262215 261976 261438 260988 260472 259438 257792
51152 257792 255790 253491 250762 247854 245486 244071 243226 242348 241456 241113 241617 242559 243231 243269 242889 242607 242823
51135 242823 243601 244738 245986 247152 248032 248392 248120 247417 246767 246678 247382 248681 250071 251106 251680 251978 252209
51118 252209 252497 253019 254062 255861 258395 261399 264519 267502 270325 273205 276335 279616 282750 285596 288193
51103 288193 290397 291858 292668 293751 296062 299355 302173 303251 302638 301276 299855 298413 296776 294897 292760
51088 292760 290388 288096 286441 285706 285610 285635 285452 284957 284184 283443 283362 284421 286445 288792 291029 293217 295569
51071 295569 298070 300517 302683 304410 305722 306967 308621 310826 313297 315773 318432 321684 325764 330674
51057 330674 336314 342326 347851 351804 353642 353845 353565 353827 355038 357208 360475 365200 371384 378188 384416
51042 384416 389583 394151 398543 402341 404853 406234 407514 409556 412376 415434 418023 419246 418085 413917
51028 413917 406872 397608 386976 376042 366039 357879 351696 347013 343278 340175 337662 335947 335414 336355
51014 336355 338753 342250 346203 349853 352808 355474 358712 362842 367262 371275 374991 379079 383887 389209
51000 389209 394763 400420 405933 410840 414786 417738 419907 421675 423547 425880 428639 431655 435056 439139
50986 439139 443853 448856 454227 460732 469177 479626 491401 503590 515378 526088 535246 542649 548297
50973 548297 552270 554638 555418 554651 552655 550132 547873 546404 546071 547278 550267 554799 560541 567840 577611
50958 577611 590269 605222 621578 638918 657123 675966 695350 715645 737293 760293 784534
50947 784534 810363 838284 868222 899600 932132 966095 1001836 1039492 1079115 1120472 1162429
50936 1162429 1202927 1239839 1271770 1298107 1318826 1334481 1345996 1353948 1358029 1357308 1350969 1338778
50924 1338778 1321049 1298259 1270658 1238307 1201680 1162076 1121020 1079231 1036621 993395 950619
50913 950619 909472 870470 833860 800264 770302 743837 720231 699245 680980 664935 649877
50902 649877 635017 620789 608069 596978 586865 577240 568185 559922 552393 545390 538855 532919 527752
50889 527752 523395 519642 516144 512795 509945 508041 507051 506470 505896 505319 504781 504123 503295 502640 502541 502954 503600
50872 503600 504509 505997 508170 510826 513903 517672 522339 527811 533978 540909 548517 556402 564324 572628
50858 572628 581898 592376 604012 616855 630975 646145 662060 678887 697232 717540 739882 764303
50846 764303 790943 819737 850408 882903 917411 953785 991419 1030011 1070127 1112484 1156830
50835 1156830 1201898 1246509 1290471 1334527 1379674 1426531 1475151 1525394 1577463 1631999 1689605
50824 1689605 1750543 1815003 1883341 1955734 2031785 2110679 2191437 2272596 2351803 2426149 2492699
50813 2492699 2548310 2589384 2612929 2618149 2606279 2578471 2534571 2474458 2399788 2313504 2218112
50802 2218112 2115592 2008951 1902582 1800399 1704209 1614306 1531028 1455129 1387131 1327078
50792 1327078 1274779 1229724 1190960 1157737 1130212 1108863 1093176 1081612 1072954 1066926 1063187 1060509
50780 1060509 1057551 1053942 1049962 1045567 1040433 1034627 1028436 1021532 1013033 1002460 990081 976261 961063
50767 961063 944626 927359 909502 890940 871650 851897 831776 811104 790026 769306 749697
50756 749697 731479 714960 700862 689629 680655 672786 665503 659182 654414 651540 650684 651702 654136
50743 654136 657697 662757 669883 678907 688986 699749 711939 726667 744244 763878 784360 805022
50731 805022 826227 848834 872964 897401 920597 942278 963583 985583 1008100 1030141 1051002
50720 1051002 1070636 1089318 1107360 1124989 1142115 1158331 1173345 1187378 1201004 1214785 1229262
50709 1229262 1245120 1263056 1283585 1307154 1334310 1365471 1400564 1439129 1480682 1524648 1569868
50698 1569868 1614447 1656150 1692776 1722178 1742384 1752093 1751028 1739578 1718272 1687887 1650022 1607129
50686 1607129 1561727 1515750 1470743 1428329 1389881 1355752 1325279 1297824 1273674 1253745 1238648
50675 1238648 1228266 1222145 1220059 1222202 1228947 1240370 1255955 1274781 1296025 1319111 1343395 1367947
50663 1367947 1391749 1413893 1433560 1450284 1464561 1477820 1491308 1505158 1518808 1532006 1544908
50652 1544908 1557532 1569876 1582439 1595863 1609964 1623921 1637714 1652757 1670702 1692071 1716427
50641 1716427 1743387 1772920 1804953 1839172 1875135 1912256 1949752 1986728 2022099 2054363 2082032
50630 2082032 2104675 2123134 2138308 2150198 2158718 2164859 2169791 2172610 2169820 2157556 2134058 2100058
50618 2100058 2057833 2010706 1963011 1919339 1883082 1855530 1836251 1824186 1818485 1818617 1823765 1832119
50606 1832119 1840910 1847390 1849718 1846691 1836783 1818092 1789572 1751956 1706997 1656016 1599697 1539241
50594 1539241 1476954 1415260 1355511 1298112 1243431 1192039 1144288 1100267 1060232 1024564 993288
50583 993288 966083 942877 923938 909192 897927 889511 884047 881954 883109 886764 892205 899278 908287
50570 908287 919474 932458 946113 959199 971164 982166 992376 1001746 1010560 1019617 1029502 1040107
50558 1040107 1051347 1063983 1079220 1097684 1119184 1143328 1169868 1198608 1229413 1262265 1296892
50547 1296892 1332405 1367690 1402123 1435593 1467996 1499264 1529991 1561584 1595567 1632902 1674010
50536 1674010 1719235 1769136 1824355 1885166 1951245 2022252 2098799 2182338 2273665 2371880 2475211
50525 2475211 2582402 2692725 2805057 2917893 3030113 3140738 3247792 3348195 3438986 3517971
50515 3517971 3583085 3632054 3663176 3675758 3669432 3643746 3598999 3536942 3460100 3370907 3272060
50504 3272060 3167166 3060200 2954478 2852777 2758266 2674567 2604762 2550723 2513325 2492771
50494 2492771 2488502 2499088 2522316 2555290 2594464 2635792 2674813 2706643 2726284 2729433 2713198 2676226
50482 2676226 2618669 2542424 2451074 2348981 2240203 2128221 2016221 1907028 1802706 1704493
50472 1704493 1613106 1528891 1451792 1381433 1317229 1258448 1204503 1155388 1111442 1072320 1036663
50461 1036663 1003366 972922 946893 926163 910260 898176 889023 881861 875758 870502 866800 865389
50449 865389 866269 868958 873026 878061 883609 889555 896317 904237 913018 922077 931229 940582 949900 958556
50435 958556 966212 973215 980154 987282 994527 1002002 1010327 1020336 1032473 1046474 1061683 1077680 1094620
50422 1094620 1113093 1133726 1156794 1182037 1208981 1237679 1269108 1304580 1344839 1389928 1439813
50411 1439813 1494541 1553654 1615983 1680343 1746136 1812871 1879359 1943794 2004574 2060659 2111237
50400 2111237 2155485 2192767 2222670 2244570 2257277 2259252 2249146 2226161 2190210 2142098 2083671
50389 2083671 2017578 1946678 1873537 1800406 1729529 1663196 1603381 1551428 1508238 1474522 1450599
50378 1450599 1435977 1429540 1430285 1437528 1450192 1466176 1482731 1497264 1507577 1511610 1507567 1494510
50366 1494510 1472594 1442635 1405549 1362237 1313747 1261485 1207309 1153317 1101273 1052107 1006101
50355 1006101 963457 924443 888995 856599 826808 799673 775450 754100 735383 719252 705784
50344 705784 694667 685154 676720 669616 664528 661737 660666 660224 659540 658459 657558 657690 659340 662209 665345
50329 665345 667872 669702 671547 674085 677170 680059 682444 684964 688492 693112 698190 703304 708706 714713
50315 714713 721058 727017 731953 735542 737799 739234 740723 742801 745134 747076 748721 750999 754688 759680
50301 759680 765336 771157 776952 782677 788418 794392 800792 807765 815511 824123 833195 842012 850389 859007
50287 859007 868589 878994 889437 899290 908188 915579 920831 923936 925835 928092 932487 940560 952647
50274 952647 966941 979803 987395 987256 978871 963577 944093 923431 903552 884976 867593 851443
50262 851443 836682 823339 811470 801158 792121 783779 776096 769868 765649 762754 760015 757343 755819
50249 755819 756220 758122 760655 763605 767396 772272 777908 783727 789432 795149 801070 806944 812078 815965
50235 815965 818769 820902 822259 822178 820164 816329 811120 804914 797902 790015 780939 770551 759484 748900
50221 748900 739448 730712 721835 712505 703132 694349 686600 680062 674731 670568 667623 665824 664765 664114
50207 664114 664417 667058 673021 681948 692761 704931 718663 734067 750765 768328 786537 805059
50195 805059 823241 840422 856143 870063 882072 892695 902900 913122 922710 930615 936336 939870
50183 939870 940950 938801 932596 921773 905994 885287 860435 832976 804590 776546 749681 724638
50171 724638 701998 682359 666297 653990 644811 637565 631407 626299 622363 619039 615249 610304 604285
50158 604285 597597 590599 583803 578032 574030 571971 571492 572086 573317 574798 576217 577418 578341 578885 578872 578097
50142 578097 576373 573572 569762 565300 560774 556823 553924 552186 551364 551254 552074 554205 557481 561072 564297
50127 564297 567307 570642 574374 578069 581491 584839 588257 591584 594794 598330 602726 608062 613953 619940
50113 619940 625723 631156 636211 640934 645375 649601 653711 657718 661533 665308 669729 675530 682630 690075
50099 690075 697032 703533 710155 717381 725539 734892 745430 756927 769710 784983 803747 825618 849425
50086 849425 875020 903771 937048 974791 1015807 1058899 1103194 1147697 1191164 1232492 1270975
50075 1270975 1306270 1338371 1367707 1395118 1421532 1447446 1472428 1495005 1513221 1525381 1530291
50064 1530291 1527005 1514853 1493921 1465150 1429696 1388440 1342410 1293446 1243998 1196131 1150905
50053 1150905 1108567 1069064 1032402 998850 969005 943517 922651 906119 893362 883843 877028 872237
50041 872237 868688 865743 863060 860482 857844 854971 851858 848770 846062 843905 842242 840912 839706 838376
50027 838376 836712 834568 831679 827551 821739 814254 805509 795956 785948 775849 765907 756011 745898
50014 745898 735617 725396 715039 703965 692062 680050 668706 658157 648209 638927 630426 622466
50002 622466 614795 607682 601677 597080 594087 593175 594744 598498 603716 610076 617611 625926 634040 641055
49988 641055 646528 650272 652425 653751 655146 656610 657248 656492 654731 652522 649784 646153 641576 636195 630166
49973 630166 624109 619250 616521 615734 616192 617906 621751 628579 638655 651788 667497 685000 703508
49960 703508 722685 742624 763347 784436 805045 824219 841511 857514 873540 890508 908364
49949 908364 926730 945617 964938 983621 999785 1011658 1017848 1016989 1007978 990819 966847 938052
49937 938052 906515 874289 843026 813361 784960 757246 729782 702095 673884 645754 619144
49926 619144 595176 573869 554707 537509 522364 509180 497839 488595 481811 477330 474426 472337
49914 472337 470625 469165 468042 467423 467321 467574 468157 469270 470946 472849 474817 477387 481361 486962 493760
49899 493760 501305 509398 517854 526555 535787 545932 556540 566182 573605 578734 582152 583975 583806 581689
49885 581689 578395 574513 569745 563435 555471 546274 536104 524914 512877 500618 488719 477308 466360
49872 466360 456165 447201 439657 433326 427916 423266 419324 416137 413895 412803 412901 414140 416564 420203
49858 420203 424817 429970 435436 441286 447558 454049 460614 467449 474962 483410 492739 502571 512260 521079
49844 521079 528594 534777 539682 543141 544986 545495 545312 544744 543218 539658 533502 525304 516299 507490 499309
49829 499309 492016 485975 481306 477613 474495 472194 471288 471776 472969 474392 476361 479405 483556 488513 494245
49814 494245 500924 508410 516236 524163 532407 541176 550144 558527 565627 571286 575876 579893 583510 586441
49800 586441 588115 587899 585348 580566 574353 567602 560426 552157 542412 531839 521487 511746 502317 493052
49786 493052 484297 476423 469474 463389 458219 453990 450585 447831 445447 442899 439737 436260 433454 432003
49772 432003 431623 431717 432389 434327 437747 441925 445963 449746 454017 459637 466796 474717 482007 487525 491158
49757 491158 493757 496243 498866 501322 503272 504468 504520 502906 499299 493685 486194 477116 467135 457201 447968
49742 447968 439559 432096 426203 422612 421355 421658 422600 423619 424428 424808 424681 424219 423790 423908 425126 427669
49726 427669 430999 434001 435851 436711 437531 439237 442184 446231 451202 457242 464681 473577 483572 494296
49712 494296 505625 517122 527399 534646 538069 538414 536912 534077 529842 524492 518880 513721 509000 504184
49698 504184 498904 493426 488462 484458 481037 477344 472926 468056 463244 458876 455443 453579 453449 454404 455653
49683 455653 457042 458898 461471 465009 470042 476904 485080 493695 502715 513102 525556 539539 553639
49670 553639 566484 577098 584828 589440 591269 591091 589816 588188 586587 585024 583543 582654 583201 585674
49656 585674 589640 593676 595770 594071 587726 577172 563548 548037 531892 516639 503520 492652
49644 492652 483199 474450 466418 459473 453973 450334 448878 449334 450863 452771 454814 456666 457620 457166 455539
49629 455539 453407 451269 449327 447551 445581 442943 439671 436371 433405 430423 427070 423720 421016 418979
49615 418979 417165 415496 414409 414217 414762 415660 416488 416846 416691 416579 417208 418745 420857 423236 425656 427705
49599 427705 429067 430038 431190 432445 433068 432772 432260 432386 433249 434496 436069 438143 440532 442681 444249 445349
49583 445349 446230 447054 448049 449537 451539 453511 454750 455194 455649 457108 459889 463568 467653 472025 476722
49568 476722 481713 487181 493630 501232 509295 516926 524102 531454 538978 545772 551325 556258 561127 565119
49554 565119 566793 565935 563775 561393 558757 555610 552472 550208 549095 548964 549899 552133 555278 558302 560379
49539 560379 561383 561523 561019 560358 560365 561556 563610 565817 567990 570641 574423 579667 586374 594284 602982 612259
49523 612259 622419 633955 646796 660117 672890 684397 694158 701805 707350 711374 714748 718213 722288
49510 722288 727268 733090 739403 746064 753415 761762 770607 778596 784162 786072 783662 777025 767067 755040
49496 755040 741835 727832 713400 699308 686562 675930 667544 660778 654564 648162 641697 635791 630740
49483 630740 626306 622271 618742 615791 613274 611251 610084 609631 608734 606263 602710 599993 599323 599770 599406
49468 599406 597565 595352 594091 593973 594457 595344 596812 598653 600158 600820 600720 600133 599228 598347 598069 598563 599146
49451 599146 598912 597602 595442 592351 587956 582411 576610 571376 566853 562920 559736 557511 556015 554740
49437 554740 553408 552074 550880 550028 549804 550310 551255 552378 553946 556437 559830 563693 568057 573666 581134
49422 581134 590271 600628 612339 626005 641803 658922 675666 689723 698693 701183 697837 691096
49410 691096 683681 677249 672264 668665 666488 666164 668435 673771 681676 690916 700630 710933 722157 733963
49396 733963 745720 757432 769528 781731 792913 802391 810764 819036 827316 834794 840652 844442 845790
49383 845790 844397 840541 835197 829412 823649 817765 811463 804689 797769 791289 785811 781619 778696 776858
49369 776858 775944 776012 777432 780589 785293 790569 795218 798571 800585 801369 800872 799025 795950 791923 787224
49354 787224 782039 776459 770661 765106 760345 756446 752814 748911 745114 742506 741799 742702 744394 746353 748634
49339 748634 751608 755523 760146 764671 768106 769866 769965 768676 766233 762907 759160 755547 752498 750166 748316
49324 748316 746446 744314 742460 741885 743027 745218 747345 748838 749832 750587 751160 751595 752114 752958 754178 755629
49308 755629 757058 758200 758911 759339 759848 760714 761920 763268 764632 765986 767261 768330 769210 770164 771451 773064
49292 773064 774925 777301 780630 784803 788927 792189 794774 797578 801099 804981 808624 811821 814689 817404
49278 817404 820180 823256 826691 830391 834504 839487 845635 852802 860752 869415 878490 887161 894680 901097
49264 901097 906939 912311 916872 920636 924146 927595 930280 931391 931072 930386 930395 931677 934536 939158 945445
49249 945445 953126 962242 973196 985906 999030 1010273 1017424 1018937 1013848 1001978 984553 964136
49237 964136 943281 923227 904098 886063 869714 855381 842806 831792 822684 815839 811053 807979
49225 807979 806753 807623 810054 812880 815484 818352 822224 827070 832193 836933 840880 843564 844548 844030 842997
49210 842997 842555 843128 844436 846041 847775 849793 852451 856102 860773 866096 871834 878471 886880 897275
49196 897275 908834 920599 932323 944018 955040 964357 971730 978019 984193 990495 996735 1002855 1008873
49183 1008873 1014707 1020458 1026572 1033348 1040593 1048115 1056325 1065927 1077125 1089497 1102539 1116123 1130775
49170 1130775 1147868 1169200 1195601 1225850 1257201 1286681 1311388 1328220 1334874 1331856 1322712 1311534
49158 1311534 1300436 1289670 1279401 1270447 1263565 1258823 1255724 1253391 1250688 1246869 1242379 1238567 1236340
49145 1236340 1235390 1234878 1234470 1234441 1235074 1236398 1238439 1241463 1245851 1251802 1259107 1267242 1275897 1285432 1296557
49130 1296557 1309369 1322991 1336457 1349764 1363641 1378423 1393662 1408907 1424276 1440018 1456022
49119 1456022 1472263 1489348 1507915 1527539 1546925 1565423 1583821 1603326 1624313 1646653 1670935
49108 1670935 1698602 1730871 1768280 1811560 1862051 1920152 1983255 2046082 2103951 2156106 2205756
49097 2205756 2256426 2307469 2352371 2381430 2387197 2368829 2332112 2285320 2234352 2180753 2123284
49086 2123284 2060858 1994354 1926577 1861037 1800627 1747022 1700940 1662646 1631959 1607918 1588983
49075 1588983 1573869 1561998 1553043 1546403 1541477 1538066 1535994 1534469 1532497 1529983 1527831 1526693 1526126 1525348
49061 1525348 1524405 1524079 1524853 1526498 1528664 1531404 1535005 1539672 1545560 1552820 1561333 1570507 1579603 1588337 1596961
49046 1596961 1605712 1614300 1622126 1628909 1634908 1640517 1645926 1651335 1657201 1663871 1671099 1678321 1685422 1692877
49032 1692877 1701082 1709989 1719484 1729641 1740286 1750713 1760225 1768669 1776039 1781818 1785280 1786362 1785820
49019 1785820 1784571 1783280 1782590 1783156 1785206 1788379 1792253 1796797 1802110 1807937 1813794 1819606 1826007 1833812
49005 1833812 1843117 1853008 1862384 1871088 1879965 1889644 1899548 1908475 1915925 1922351 1928180 1933106 1936512 1938205
48991 1938205 1938495 1937904 1936992 1936198 1935619 1935032 1934282 1933473 1932682 1931803 1930890 1930427 1930984 1932748 1935620 1939591 1944705
48974 1944705 1950697 1956949 1962855 1968152 1972944 1977576 1982395 1987414 1992070 1995418 1996757 1996224 1994872 1994045
48960 1994045 1994397 1995416 1996077 1996029 1996016 1997130 1999879 2004065 2009250 2015159 2022008 2030763 2042708 2058284 2076447
48945 2076447 2095717 2115853 2138044 2163443 2192027 2222957 2255431 2288818 2322512 2356384 2391242
48934 2391242 2428272 2467894 2509435 2551942 2595027 2638894 2683898 2730204 2777665 2825850 2874400
48923 2874400 2923372 2973021 3023159 3073043 3122088 3170381 3218203 3265230 3310536 3353291 3393161
48912 3393161 3430157 3464535 3496861 3527680 3556948 3584029 3608488 3630649 3651182 3670342 3687855
48901 3687855 3703405 3717021 3729051 3739922 3749896 3758928 3766780 3773246 3778131 3781028 3781467 3779473 3775683
48888 3775683 3770584 3763803 3754512 3742376 3727787 3711233 3692834 3672528 3650276 3625926 3599117 3569504
48876 3569504 3537007 3501817 3464317 3424956 3383890 3340695 3294724 3245968 3195389 3144267 3093363
48865 3093363 3042844 2992803 2943522 2895341 2848587 2803749 2761511 2722433 2686634 2653941 2624261
48854 2624261 2597613 2573726 2551893 2531570 2513034 2497093 2484048 2473253 2463905 2455937 2449895 2446193
48842 2446193 2444826 2445653 2448571 2453464 2460334 2469422 2480930 2494622 2509936 2526381 2543611 2561308 2579411
48829 2579411 2598359 2618597 2639824 2661139 2681984 2702481 2722852 2743006 2762894 2782716 2802533
48818 2802533 2822061 2841225 2860573 2880812 2902093 2923987 2945927 2967476 2988432 3008992 3029614
48807 3029614 3050518 3071425 3091951 3112063 3132012 3152030 3172207 3192415 3212314 3231761 3251309
48796 3251309 3271880 3293737 3316238 3338805 3361581 3384646 3407077 3427410 3444892 3459805 3472798
48785 3472798 3484288 3494223 3501898 3506198 3506546 3503483 3497820 3489421 3477287 3460585 3438970 3412148 3380099
48772 3380099 3343841 3305170 3265277 3224142 3181506 3137851 3094012 3050364 3006808 2963327 2920109
48761 2920109 2877350 2835261 2794138 2754174 2715349 2677693 2641554 2607421 2575622 2546280 2519374
48750 2519374 2494761 2472381 2452653 2436386 2424109 2415580 2410038 2406627 2404480 2402828 2401454 2400847 2401472
48737 2401472 2403055 2405031 2407594 2411733 2417960 2425436 2432719 2439157 2445092 2450772 2455597 2458723 2460084 2460347
48723 2460347 2460061 2459403 2458855 2459470 2461994 2466057 2470669 2475275 2479828 2484121 2487791 2491060 2494780 2499496 2504989
48708 2504989 2510973 2517663 2525176 2532869 2539856 2546066 2552226 2558863 2565771 2572522 2579087 2585762 2592740 2599960
48694 2599960 2607305 2614852 2622899 2631656 2640847 2649733 2657720 2664904 2671853 2678815 2685230 2689985 2692112 2691339
48680 2691339 2688176 2683572 2678388 2673102 2667747 2661939 2655021 2646541 2636721 2626109 2614533 2600692 2583190
48667 2583190 2561888 2537889 2512312 2485506 2457455 2428445 2399057 2369804 2341021 2312891 2285323
48656 2285323 2257920 2230233 2201976 2172914 2142890 2112282 2082286 2054234 2028558 2004690 1982069
48645 1982069 1960896 1941803 1925030 1910165 1896439 1883084 1869590 1855906 1842255 1828495 1813828
48634 1813828 1797483 1779611 1761125 1742719 1724477 1706447 1689046 1672585 1656860 1641468 1626231
48623 1626231 1610993 1595412 1579397 1563514 1548474 1534391 1521003 1508413 1497037 1486897 1477639
48612 1477639 1469344 1462698 1458147 1455430 1454285 1455082 1458269 1463470 1469596 1475700 1481369 1486437 1490746 1494203
48598 1494203 1496835 1498734 1500142 1501478 1503130 1505271 1508006 1511476 1515518 1519302 1521609 1521538 1518829 1513602
48584 1513602 1506154 1497062 1487205 1477451 1468288 1459730 1451491 1443325 1435396 1428355 1422879 1419016 1416074 1413261
48570 1413261 1410454 1408296 1407560 1408444 1410528 1413303 1416568 1420268 1424188 1428116 1432108 1436169 1439624 1441282
48556 1441282 1440452 1437404 1432580 1425781 1416627 1405517 1393563 1381641 1370098 1359345 1350037 1342319 1335353
48543 1335353 1328044 1320016 1311507 1302522 1292475 1280739 1267357 1253168 1239350 1226788 1215738 1206025
$$ [...]
##END NTUPLES=NMR SPECTRUM
##END=
