
##TITLE=UV1207_M4_1332-1205_7185600_7oDXSyv6cb
##JCAMPDX= 6.0         $$ Bruker NMR JCAMP-DX V2.0
##DATA TYPE= NMR SPECTRUM
##DATA CLASS= NTUPLES
##ORIGIN= BRUKER
##OWNER= Administrator
$$ 1.72 TOPSPIN		Version 2.1
$$ 2012-12-05 21:27:46.550 -0500  Administrator@X
$$ Compression mode = diff/dup
##.OBSERVE FREQUENCY= 400.02188249412
##.OBSERVE NUCLEUS= ^1H
##.ACQUISITION MODE= SIMULTANEOUS (DQD)
##.ACQUISITION SCHEME= undefined
##.AVERAGES= 8
##.DIGITISER RES= 22
##SPECTROMETER/DATA SYSTEM= spect
##.PULSE SEQUENCE= zg30
##.SOLVENT NAME= COFFEE_meoh
##.SHIFT REFERENCE= INTERNAL, COFFEE_meoh, 1, 14.98509
##AUDIT TRAIL= $$ (NUMBER, WHEN, WHO, WHERE, PROCESS, VERSION, WHAT)
$$ ##TITLE= Audit trail, TOPSPIN		Version 2.1
$$ ##JCAMPDX= 5.01
$$ ##ORIGIN= Bruker BioSpin GmbH
$$ ##OWNER= Administrator
$$ $$ E:\/data/COFFEE/nmr/UV1207_M4_1332-1205_7185600_7oDXSyv6cb/10/pdata/1/auditp.txt
$$ ##AUDIT TRAIL=  $$ (NUMBER, WHEN, WHO, WHERE, PROCESS, VERSION, WHAT)
(   1,<2012-12-05 21:27:38.628 -0500>,<Administrator>,<X>,<go>,<TOPSPIN 2.1>,
      <created by zg
	started at 2012-12-05 21:26:32.206 -0500,
	POWCHK enabled, PULCHK disabled,
       configuration hash MD5:
       86 BA 57 50 F2 9D 5C 9B 26 00 A9 28 5F 66 2E 89
       data hash MD5: 64K
       DF 1F BC 2F A9 E0 E4 D3 91 22 F0 61 4A 71 0B E9>)
(   2,<2012-12-05 21:27:41.769 -0500>,<Administrator>,<X>,<proc1d>,<TOPSPIN 2.1>,
      <Start of raw data processing
       efp LB = 0 FT_mod = 6 PKNL = 1 PHC0 = 0 PHC1 = 0 SI = 32K 
       data hash MD5: 32K
       15 71 F1 B6 32 EC C2 4D 94 9A 58 39 93 0C EC B0>)
(   3,<2012-12-05 21:27:42.222 -0500>,<Administrator>,<X>,<proc1d>,<TOPSPIN 2.1>,
      <pk PHC0 = 95.44373 PHC1 = 0 
       data hash MD5: 32K
       3F BB E9 D9 4E 0F 8E 03 98 42 0A 0A E7 5C E4 6A>)
(   4,<2012-12-05 21:27:42.456 -0500>,<Administrator>,<X>,<proc1d>,<TOPSPIN 2.1>,
      <abs ABSG = 1 
       data hash MD5: 32K
       09 A0 05 55 7B 08 BA 9C D6 28 7A 70 EC A7 57 E9>)
(   5,<2012-12-05 21:27:42.612 -0500>,<Administrator>,<X>,<proc1d>,<TOPSPIN 2.1>,
      <abs ABSG = 2 
       data hash MD5: 32K
       42 E8 B3 69 60 3B C5 46 EE E4 24 20 59 49 02 25>)
(   6,<2012-12-05 21:27:42.753 -0500>,<Administrator>,<X>,<proc1d>,<TOPSPIN 2.1>,
      <abs ABSG = 3 
       data hash MD5: 32K
       FD 6A 61 4A F5 A3 A6 5E 9F 2A F4 72 79 02 B2 D0>)
(   7,<2012-12-05 21:27:42.894 -0500>,<Administrator>,<X>,<proc1d>,<TOPSPIN 2.1>,
      <abs ABSG = 4 
       data hash MD5: 32K
       1C 88 66 88 3A AC B7 B0 BC 63 F6 8C D5 E1 92 41>)
(   8,<2012-12-05 21:27:43.050 -0500>,<Administrator>,<X>,<proc1d>,<TOPSPIN 2.1>,
      <abs ABSG = 5 
       data hash MD5: 32K
       2F 1F F5 7C 4C D3 CD A0 27 84 C8 B3 C2 06 CA BC>)
$$ ##END=
$$ 
$$ $$ hash MD5
$$ $$ A9 50 23 94 EF 25 91 85 FC E4 1E A5 47 47 49 A6
##$RELAX= 
##$RELAX= 
##$RELAX= 
##$RELAX= 
##$RELAX= 
##$RELAX= 
##$RELAX= 
$$ Bruker specific parameters
$$ --------------------------
##$DU= <E:\>
##$EXPNO= 10
$$ [...]
##$TP= (0..7)
150 150 150 150 150 150 150 150
##$TP07= 0
##$TPNAME0= <>
##$TPNAME1= <>
##$TPNAME2= <>
##$TPNAME3= <>
##$TPNAME4= <>
##$TPNAME5= <>
##$TPNAME6= <>
##$TPNAME7= <>
##$TPOAL= (0..7)
0.5 0.5 0.5 0.5 0.5 0.5 0.5 0.5
##$TPOFFS= (0..7)
0 0 0 0 0 0 0 0
##$TUNHIN= 0
##$TUNHOUT= 0
##$TUNXOUT= 0
##$USERA1= <user>
##$USERA2= <user>
##$USERA3= <user>
##$USERA4= <user>
##$USERA5= <user>
##$V9= 5
##$VALIST= <valist>
##$VCLIST= <CCCCCCCCCCCCCCC>
##$VD= 0
##$VDLIST= <DDDDDDDDDDDDDDD>
##$VPLIST= <PPPPPPPPPPPPPPP>
##$VTLIST= <TTTTTTTTTTTTTTT>
##$WBST= 1024
##$WBSW= 4
##$XGAIN= (0..3)
0 0 0 0
##$XL= 0
##$YL= 0
##$YMAX_a= 618010
##$YMIN_a= -525724
##$ZGOPTNS= <>
##$ZL1= 120
##$ZL2= 120
##$ZL3= 120
##$ZL4= 120
##$ABSF1= 14.98509
##$ABSF2= -5.573092
##$ABSG= 5
##$ABSL= 3
##$ALPHA= 0
##$AQORDER= 0
##$ASSFAC= 0
##$ASSFACI= 0
##$ASSFACX= 0
##$ASSWID= 0
##$AUNMP= <proc_prof1d_extract_pilot.lims>
##$AXLEFT= 0
##$AXNAME= <>
##$AXNUC= <1H>
##$AXRIGHT= 0
##$AXTYPE= 0
##$AXUNIT= <>
##$AZFE= 0.1
##$AZFW= 0.1
##$BCFW= 0
##$BC_mod= 0
##$BYTORDP= 0
##$COROFFS= 0
##$CY= 15
##$DATMOD= 1
##$DC= 0
##$DFILT= <>
##$DTYPP= 0
##$F1P= 0
##$F2P= 0
##$FCOR= 0.5
##$FTSIZE= 32768
##$FT_mod= 6
##$GAMMA= 0
##$GB= 0
##$INTBC= 1
##$INTSCL= 1
##$ISEN= 128
##$LB= 0
##$LEV0= 0
##$LPBIN= 0
##$MAXI= 10000
##$MC2= 0
##$MEAN= 0
##$ME_mod= 0
##$MI= 0
##$NCOEF= 0
##$NC_proc= -8
##$NLEV= 6
##$NOISF1= 0
##$NOISF2= 0
##$NSP= 0
##$NTH_PI= 0
##$NZP= 0
##$OFFSET= 14.98509
##$PC= 1
##$PHC0= 95.44373
##$PHC1= 0
##$PH_mod= 1
##$PKNL= yes
##$PPARMOD= 0
##$PPDIAG= 0
##$PPIPTYP= 0
##$PPMPNUM= 2147483647
##$PPRESOL= 1
##$PSCAL= 4
##$PSIGN= 0
##$PYNMP= <proc.py>
##$REVERSE= no
##$SF= 400.02
##$SI= 32768
##$SIGF1= 0
##$SIGF2= 0
##$SINO= 400
##$SIOLD= 32768
##$SPECTYP= <>
##$SREGLST= <1H.CDCl3>
##$SSB= 0
##$STSI= 32768
##$STSR= 0
##$SW_p= 8223.68421052631
##$SYMM= 0
##$S_DEV= 0
##$TDeff= 65536
##$TDoff= 0
##$TI= <>
##$TILT= no
##$TM1= 0
##$TM2= 0
##$TOPLEV= 0
##$USERP1= <user>
##$USERP2= <user>
##$USERP3= <user>
##$USERP4= <user>
##$USERP5= <user>
##$WDW= 1
##$XDIM= 32768
##$YMAX_p= 470556420
##$YMIN_p= -706536
##$CURPLOT= <Network HP LaserJet P1505>
##$CURPRIN= <$Network HP LaserJet P1505>
##$DFORMAT= <normdp>
##$LAYOUT= <+/1D_H.xwp>
##$LFORMAT= <normlp>
##$PFORMAT= <normpl>
##$SURQMSG= 1
$$ End of Bruker specific parameters
$$ ---------------------------------
##NTUPLES= NMR SPECTRUM
##VAR_NAME=  FREQUENCY,     SPECTRUM/REAL,   SPECTRUM/IMAG
##SYMBOL=    X,             R,               I
##VAR_TYPE=  INDEPENDENT,   DEPENDENT,       DEPENDENT
##VAR_FORM=  AFFN,          ASDF,            ASDF
##VAR_DIM=   32768,         32768,           32768
##UNITS=     HZ,            ARBITRARY UNITS, ARBITRARY UNITS
##FACTOR=    0.250966925370066, 1,           1
##FIRST=     8223.43324360094, -298810,      79187
##LAST=      0,             -60708,          -111177
##MIN=       0,             -706536,         0
##MAX=       8223.43324360094, 470556420,    0
$$ Real data points
##PAGE= N=1
##DATA TABLE= (X++(R..R)), XYDATA
$$ [...]
23831 -299045 -6020 -54430 -5693 38719 -316199 -84259 -124529 -167736 37510 190531 -247994
23819 141617 25990 152816 227597 302695 432006 412300 -5901 -189283 504538 3351 -86698
23807 -155549 -65034 21876 -52622 -68271 287423 -58837 -114992 73919 -242392 -4533 119746
23795 73040 13743 140753 -17092 -96614 -183071 166105 -183218 -101372 282946 -76266 -374181
23784 -374181 124422 -314681 80012 -130454 -68258 -179312 -36580 -32632 39486 130509 191674
23773 191674 29151 25637 -92664 122474 38621 250610 -103057 156719 37246 346704 -321057
23761 -172351 -276767 -92069 -43142 206253 -179646 221272 22196 30216 -32154 68994 -434756
23749 15212 -238752 -136388 54150 -157068 153518 -90752 53376 -96858 -213724 136777
23738 -161581 -140650 -21763 72290 -29340 -132031 303483 -169779 50255 -65016 97576 -273533
23726 -7164 92452 13413 -222204 -28756 250532 -84318 -221357 -298886 -7573 30104 154028
23715 154028 52220 -194152 247673 -73512 216595 117551 13796 335875 8168 -163140 317460
23703 -213371 -91908 -235368 -126015 626164 -256021 93456 190686 -308840 -152153 -33840
23692 -116608 -58476 33655 282520 37579 -23686 210329 37981 14854 -112425 42616 -86913
23680 109144 -55590 28465 154610 -154625 -212653 -124552 182529 -58330 -304463 64204 -250195
23668 -162495 47345 -47213 314543 20928 -86336 -22913 2236 -58962 9959 -228419 -52846
23656 -88826 -157748 -350736 39257 -164520 52409 -4136 15017 1345 275992 101947 -60559
23644 7877 191002 54251 36719 -174310 -81829 -263915 -108566 67728 22725 81114 84037
23633 84037 -245850 -921 -11087 136201 -41051 -100002 79214 410859 -75168 -266753 -245649
23622 -245649 107396 54781 -417094 344931 27483 -120871 198333 139371 346876 -228501
23611 -294144 -98057 18358 -41527 91987 266765 -42181 14069 -49239 -108853 91625 51008
23600 51008 -18250 8218 329757 138170 76702 -83161 -36483 -334627 161360 -76359 -125412
23589 -125412 255806 293980 90869 -104976 218048 -128781 -18142 -285920 -265221 -70539
23578 -98296 -179891 -177198 -204686 84099 -130975 -301024 52321 -148597 -285694 173857 31264
23566 178834 -125101 -53160 -2422 -250152 220920 -117883 -83582 245506 127457 -20049
23555 -159421 -120911 -134456 -34674 -51250 -4705 -216478 -16207 -13097 4331 -58459 -191790 228518
23542 -143167 -133321 -17139 -81992 -8888 -9313 121324 -223354 11269 198707 -117881 10561
23530 -18844 -123066 -316158 571818 270972 133386 -121576 7875 156671 -220649 60315
23519 -141667 157695 482300 -35893 -24719 -40701 -27595 50671 120857 -31903 -100026 349356
23507 -87790 126385 -265330 42772 338077 102656 -249937 -113819 -46407 198125 -222765
23496 -165870 258238 218718 234916 -195642 -17855 125665 -89994 -205128 205926 -78278
23485 455949 16462 -245105 9081 24340 407237 127327 312109 183854 75592 -206668
23474 -132987 -425033 -70636 80663 189572 241521 68774 143242 -257467 -257462 -24707 -41075 -294536
23462 -294536 67292 -220151 -30057 -345419 -75064 -15238 2929 -72558 66050 -84958 -58904
23451 -58904 -11755 -257713 95068 382855 -159768 -358325 153692 89872 62087 369180
23441 369180 34374 -282877 98429 396980 -657451 60417 -30209 -125622 -275080 -142591
23431 -142591 19081 405440 36384 -131765 -41358 -175740 136734 -69805 80233 -248719
23420 67839 -156517 -197478 -149201 74643 93489 1711 50780 -256531 193683 -133773 -151102
23409 -151102 130709 -23257 -105637 166388 41176 -202741 -104884 -221981 203321 62247
23398 355161 -265687 253866 -281635 36540 312156 -118348 -41351 -227197 -248463 -112780
23387 -128815 -107424 -366494 27668 72089 111899 104229 81717 -91804 -105465 231703 304588
23376 304588 343881 223779 -303341 2710 -108469 -315055 105318 143491 -87056 173034
23365 126640 -254961 148849 253162 -46306 -244261 -203184 120235 27749 91130 45079
23354 -253060 -134587 -18267 -57833 -847 269091 47592 -36281 -178640 69470 -110625 -89370
23343 -89370 -242520 810 -448752 -190884 38312 -40386 15437 75826 -67725 -48101 41165
23331 -151999 -68243 -179243 -67046 50802 -3564 -290791 -13334 -174654 111207 170017 115483
23320 115483 -43756 38786 -270996 97159 -192601 -20257 -174529 -75578 -188116 185583
23309 -122828 -90583 203042 228051 -283322 -271109 314177 -86807 -32724 16642 -185143 289645
23297 -16267 -300544 13814 41971 -6398 15171 -273795 20826 23850 53564 -48674 314879
23285 153159 -7281 -31950 -149467 42762 -195930 269388 28973 -339781 -48238 -66502 6417
23273 -117455 -219387 -47098 -118419 173382 222331 -4510 -324283 -192779 -209782 69871 -134633
23261 -86789 -262731 -30888 -145292 -72661 29519 426107 -183690 239828 -147238 46679
23250 236512 87668 265807 -49863 207580 -23253 55988 -143427 -252281 -42352 25470 17117
23239 17117 16405 35245 -149066 -309469 200555 44410 -410002 -532744 -241448 150806 200440
23228 200440 4950 171037 25900 9460 213310 34335 -70273 -137011 -8341 -28642 -115598 -385574
23216 -385574 -41724 -51265 211511 145318 -146807 -247510 -171014 41539 20653 403392 94829
23204 5467 -72323 -189536 96430 -50020 -110013 -193492 231453 237860 -217443 -164948 105038
23192 -282467 -92644 177805 -245662 -315575 -79601 369230 -123263 88742 -215423 55927
23181 80135 292210 289269 -59313 246696 -82003 -43944 -244111 339365 40036 -43387 37803
23169 -283105 181582 122221 122281 -53803 144772 -5271 78841 100748 -68737 -9046 -14414 209504
23156 -41987 56980 -4898 -117137 -285463 115188 -62667 -59225 120516 -44535 25661 -208875
23144 96606 -130863 -108389 -118211 38330 -215997 -165765 138630 -17273 -392126 3742 -269586
23132 6158 -128746 240153 -497074 115915 -83638 238766 -258833 100832 -76770 -33656
23121 178379 -115786 6574 -30802 -103952 152199 -336472 303202 131674 190679 37362 89214
23110 89214 -243571 62684 -78909 234781 177502 -15657 -107284 -98848 162856 -147883 -114397
23099 -114397 -30220 -166773 -214642 -152933 -181215 -223668 43180 169839 139791 255486 -66676
23087 346567 -238517 -46080 104455 324703 -119240 -153705 129859 -9792 -181872 -70053
23076 -32352 -206854 -220590 132926 -10865 -271404 -258375 102982 -342131 -24340 -235905
23066 -235905 168506 112998 68096 49625 -50070 -262444 80985 147322 122540 208042 154307
23055 154307 193383 -102934 130175 -238666 -225058 82787 -21321 -198872 -264067 -319969 -73035
23043 -219975 -199423 -121600 -158059 153808 -78107 152183 149591 -91597 -104476 -228748 -589087
23032 -589087 130361 -229823 28125 31426 -198059 -161743 218582 -231448 -318981 160327
23021 -81624 233593 219566 72924 -174331 -120522 -141178 -53396 -82172 -258664 483321 15162
23009 -262727 193928 -229730 -96378 -126358 207048 -73405 77374 -151792 85532 119337 -101899
22997 42298 69259 324820 -13600 14539 -132864 -16848 -183024 -203347 101472 137172 4531
22985 152424 13141 -23263 68565 -73012 -136831 52119 -78732 301938 9676 223189 -10598
22973 -145243 -26059 -36362 298123 -212799 -237188 11880 281127 -10621 51710 43455 -68101
22961 -137418 -24535 97686 7990 54619 -56893 -489813 124221 294086 -333196 -10352 -67689
22950 -67689 109661 41538 145631 79208 -213916 89671 -174820 -29935 101174 198716 65320
22938 264262 -258250 -338045 -29214 -66948 156241 -232829 -167591 -142630 -55019 -168521 198681
22926 -90763 -78592 -89167 -643 272532 153152 418525 -85163 129693 -107745 -180228 365164
22914 -64084 -190607 -401957 -72852 -90461 270993 260097 179823 75298 -106196 73277 -167657
22902 40983 -229709 -14838 75529 -72574 14958 -153637 -40024 -41207 16384 -17620 22205
22890 22179 -356352 21256 -223200 -175839 87052 85233 192170 117140 11422 -25903 -12602
22878 214627 -11414 -333273 -257741 28013 -397865 -143216 -34696 193026 -493928 -331699
22868 -331699 279578 -116570 -117099 165835 -156996 -147227 293207 425855 -85221 186897 173873
22857 173873 111527 -186839 267690 -49755 161929 157591 -117937 -65370 -4770 -154436 449239
22845 -90998 119929 -92727 -157466 59071 125968 -233535 -55207 -777 -163226 227322 -86129
22833 65061 -53460 -90637 23892 153072 59258 142685 -226863 287255 -103365 -138287 -166130
22822 -166130 97814 -134027 226816 -51396 -199089 24739 -101060 -219900 -245661 -137574
22812 -137574 162293 -190865 -83799 -51301 376245 294614 -248898 10288 67081 -315150
22801 211240 131807 -43803 -10768 108960 42990 172738 -36530 -50702 -88931 239970 63310
22789 -237415 -197770 -303851 121040 -349275 232009 -44623 265277 22972 45095 36397 146394
22778 146394 43708 149664 -92271 -158986 -255304 63597 163457 -12715 364588 22254 96251
22767 96251 -190514 -169288 126854 -363923 -61399 65627 228745 154859 -225077 16641 259402
22756 259402 -363912 160960 -138008 363793 -208773 25503 80585 -160582 52660 95256
22746 95256 -49075 -145637 62135 -161397 28231 164534 103566 -129830 -104296 -417532 -14226
22734 67449 -176375 184001 214911 8970 47315 -297260 -297111 -236858 -171149 -17883 243604
22722 -154279 -341509 311075 98384 154776 131074 -184649 -90685 22084 42552 -149166 -1608
22710 -188316 103253 113159 -106195 -22953 -306882 -245394 -22976 -189873 86909 -426190 -70088
22698 -289478 -249271 14796 27905 139956 -126038 -231655 18273 -131541 142688 22330
22687 -14803 36676 -57532 -89732 153917 198087 -198487 -127843 120631 -514374 205293 94123
22675 -162334 -118321 39995 157397 -337651 -356199 -266972 452946 177579 23607 164185
22665 164185 -46952 -56032 158066 109406 17769 370918 882 117190 173006 -17633 93262
22653 -504531 -204884 -428613 -245596 -40220 31009 -410398 -124803 -25924 -182953 -63880
22642 -143991 -212996 317941 -50032 -201338 -121785 292005 -95511 192922 54127 -170315
22631 -49021 185383 -105018 -176637 -71801 -166991 -14176 32040 14184 -20749 56751 -134526
22619 274149 -168435 -136937 64968 -442428 243098 -125421 -246406 -199844 109716 -70331
22608 -104853 -65707 -229394 -18087 54823 -228358 -3398 -700 210878 79909 -95736 -130585
22597 -130585 -142706 -86048 -213437 -63166 536384 -295800 -143145 450788 -13233 -2677 -41207
22586 -41207 91533 -39884 43420 205773 -205718 -239112 23852 139139 338436 301072 -40076
22574 185058 186202 -103909 46352 -114652 -121031 195242 -296188 485048 -52792 -261138 -87543
22562 -67594 -15074 -132254 -27173 -114129 45950 -54229 -261428 -307885 19787 -83038 -203965
22551 -203965 -266158 -366749 -46670 -158161 266027 125092 -19374 -24521 326552 23027 106777
22540 106777 -27138 -230110 -116168 -52747 104027 41961 141452 -147409 -158120 78140 -27805
22528 -28979 70520 -297517 103029 -207780 -268662 -172345 -452345 -153701 154929 250274
22518 250274 -18501 -106544 -48965 213661 3132 -49197 -4338 -270997 38410 151072 -16805
22506 52429 -86607 191203 84016 92738 37432 -68793 -133197 -87474 -266510 -120801 -107655
22495 -107655 241518 -118889 -78297 -192710 100686 -150029 281100 13474 217568 -108781
22484 32687 -208274 39654 96240 280807 -102248 -305531 160959 149934 -140 -151836 204679
22472 -312987 -52996 -378782 182601 -86389 -258104 -113871 -54098 -129222 28736 -153898
22461 -394931 -216907 -72855 333955 -109637 -85909 -285645 -181332 -81616 -41755 105010
22450 -30703 10 39895 23838 -118479 -66065 -116080 -302470 -41560 358820 -95390 -29874 180909
22437 152369 -219320 -403647 -42471 -68642 -8940 32918 152119 14421 -126028 136246 -32074
22425 12412 31067 115063 33150 -211592 50810 -467718 190256 -7805 -309680 205652 -201933
22413 -97478 -120572 -313793 -161522 -74303 49669 -41277 -286093 24138 62313 156745 220328
22402 220328 -221016 279993 -143541 193781 -49923 -269770 -112549 8028 37097 54517
22392 54517 -55266 -203631 -27522 162952 -211061 246724 -54399 212464 211620 74350 215754
22381 215754 -254668 185140 -105503 -14040 -186240 98026 25769 19734 9722 61470 62223
22370 62223 129617 -163743 -33931 -113628 107667 -291774 201511 -17544 -106903 -312959 -158759
22359 -158759 -176167 140062 -17059 162323 -35717 -322267 100559 -57768 -264453 37613
22348 -92582 -181889 -173201 -199032 4340 197853 -302610 -275121 -3065 -21896 86607 180081 -7502
22335 44644 -207431 -121138 57349 -170294 -9191 -142258 258847 -59471 -178643 -87133 -207374
22324 -207374 -61268 23282 189578 27147 -79513 416926 36020 217856 61836 3017 129105
22313 129105 18508 -161098 -45112 -37526 15636 246567 117376 -122385 23910 -204447 -18152
22301 -1072 -4475 -338242 7223 -33085 -181105 87671 28460 187506 -175740 -69435 23776
22289 -80492 -68351 109756 -161241 -433963 -192468 -196448 -59277 -58310 41880 88349 178606
22278 178606 173732 267853 -241262 69521 121346 237470 87191 -114070 130650 -84163 -4952
22266 -5068 -105113 -31458 -241216 33496 -475773 -195973 -210198 -309874 -168745 100522 82934
22255 82934 260420 -6637 40144 -147731 -5430 131017 -127919 107822 -219825 155572 -77470
22243 -98149 -2428 38148 -247124 -235741 2934 14149 -410932 -81660 138754 -135104 -123 -192003
22231 -192003 164957 79371 -402000 -48321 14022 -272581 -129198 174335 -43518 -75574
22221 -75574 -196703 182540 74929 -90467 -242345 -57014 182539 116363 98518 168209 -215172
22209 -914 90132 95774 -55872 -276431 28366 242103 260176 115510 104209 37466 417722
22198 417722 301808 -72396 -106418 -79761 293319 250512 -137339 -236329 -121376 -39685 -152184
22187 -152184 -359038 174944 -129624 -43099 153368 35377 -117135 -144262 102818 -289513
22176 -114433 -74841 133227 -21546 -118076 -311937 328782 -18445 -250493 -86406 136945
22165 -246575 -444485 -74321 -226468 -56737 41640 109290 37993 19795 54082 56440 -138055
22153 233865 -131268 169052 246301 -164197 91165 55087 95917 -196120 236833 -135568
22142 -1556 -260960 51426 -131606 5375 -149005 179424 203436 -88776 7363 -326266 284676
22130 283350 105792 -316327 148297 -216922 23724 -163968 -142122 334971 -17112 38469
22119 -221844 1852 -123238 54729 -539306 205739 -45339 -243411 -264965 -118240 -96100 -185176
22108 -185176 -83295 -410917 -48221 -12355 -37753 -89016 -461238 -47 -86119 132196 -4197 -110955
22096 -110955 -20142 62896 -56392 -142791 -130336 -197529 12556 -112273 157631 -137954 -38967
22084 2075 -333540 178745 -224090 -3770 237888 106838 -273727 -190335 123114 -121951
22073 106802 186573 60622 183359 68027 -67902 75152 -120598 -291684 84138 -78404 -151150
22062 -151150 -109821 -189467 2354 -30606 124797 32518 -28248 95176 45511 -124631 -453649
22051 -453649 -142742 296719 -115750 131666 263545 -290748 -293811 10915 -356439 -92523
22040 -142361 156599 -236322 -251765 -52773 -181010 52366 74379 -118156 -36672 -137781
22030 -137781 194587 20499 -174254 -117705 -52027 -1339 -115887 72254 -274723 -257966 101747
22018 189727 -210870 -105918 83105 7797 144623 280684 34901 -33312 40022 -80401 129835
22006 47754 -346781 -140011 -16474 139854 118104 253479 34493 85600 -150106 98499 94209
21995 94209 139651 -257986 34313 -273967 -66724 -332639 375173 -55245 -170016 229777
21984 107536 -94009 -86391 155636 5118 -176378 -116911 -268258 -160162 -403483 -72741 112253
21972 -126706 -30535 170679 -138071 311313 103795 -36197 157671 -23134 -479456 -174221
21961 137470 54627 -266559 -86736 -335065 -132582 -242043 -54248 -33173 -72086 -72849 91033
21949 47179 -309771 133915 188674 319788 -2975 -282051 18953 -24219 -128169 -144762 17867
21937 77535 -43498 -97699 22537 -13694 88388 -244057 230709 203043 -107014 -351118 133429
21925 -34595 624 -205750 -11711 -79339 11322 41757 -136027 -34649 -138505 -138304 -154726 16562
21912 -136425 55130 -40458 -269653 -98823 -255012 12892 11011 -39227 -100724 55868 269112
21901 269112 -20139 15134 -263 -65460 54504 -290759 -136432 24008 -229971 -57229 -367256
21890 -367256 -24350 -58524 -99321 -348071 -104702 -116699 -151968 -203025 -37195 76913 258711
21879 258711 -49675 430646 -294095 297567 -70992 -232693 -113232 -74622 277415 -203404
21868 -269128 -99104 -83057 -97091 -47321 16567 -171246 -181934 82526 157862 -474327 117369
21856 223092 200956 -17389 -455620 -17360 -181474 -302442 -52060 391845 -99667 51069 -178883
21844 698 -16829 -168634 86016 -342090 24630 147375 -10517 214131 -325548 -233163 55555
21832 -83465 -319291 78843 485356 -132935 156615 173780 200935 -82138 -261781 -20382 -84134
21821 -84134 -94027 15020 -33453 -224893 -9821 197849 -96077 49364 131319 -186390 95712
21809 -30415 -125213 153782 -196752 -269940 163912 -178220 -147009 -247836 -204487 -157873 10326
21797 138665 -262222 -187852 136562 -300351 -74776 -67576 163492 305553 58019 -109238
21786 201306 -6049 -146876 -86640 -352133 -38444 5301 85101 201742 -110890 -158218 -448186
21775 -448186 104736 -174797 125864 30763 -55720 -316752 165843 223978 84034 39280
21764 146227 -50096 212375 -82714 74045 -97037 -197675 41384 -39132 125278 99492 104969
21753 104969 173736 150715 -293070 -88515 -142175 229614 51070 224584 -45891 103422 -30677
21741 -219301 -146534 226192 -225001 194699 -38684 170865 64350 -96756 459797 32596
21730 -78490 -15390 92311 170141 7235 -296711 46076 301149 -38807 -290988 188710 -82142
21718 -14955 110091 110782 4077 -180926 171029 107885 153257 109091 91218 -369957 200130
21706 -455988 -114567 -74683 -250404 -270358 -516144 113024 -129445 -100704 -201827 -34494
21695 -207143 -52757 84887 -8504 254248 75515 83753 65046 -144775 20544 149811 -369654
21683 51765 -84078 -102259 55485 87152 -203222 -284822 185478 26944 -38712 -33824 -63 -336082
21671 -336082 -270478 39369 -24812 -86096 -150090 -18540 129081 68757 -148987 224440 429658
21660 429658 -143305 -255213 -126571 67447 -94512 -121442 104107 -87392 292278 -189111
21649 -52053 -196702 136062 -164945 267557 -132711 214255 -287349 73372 -401505 175684
21638 11244 344085 -261014 -11386 29578 -308130 -227923 -62394 -10937 279294 -117702 -278342
21627 -278342 -194953 -198997 76067 19269 -24758 23731 -9279 60862 239105 -501475 225981
21615 35656 -82969 409090 -44151 153392 -5413 244739 -179054 -286186 -171037 -60411 24586
21603 -31791 97819 -101322 -159743 -49009 106489 -11604 -145662 85746 -148842 -161422 -199390
21592 -199390 240547 -151487 -28522 -55871 101143 49829 -209570 147443 -27233 -50082
21582 -50082 -301501 -380786 -438367 58599 -105268 175991 -338902 -117312 -164379 51671 9004
21570 -145729 -259516 -32765 26395 -242781 26985 -240926 -240425 -176047 74146 -228342 -72747
21558 -29777 -24727 -90906 -29245 50768 -254031 51109 -135968 -205707 -136239 -27430 -77754
21547 -77754 -76679 2256 -110874 -243231 66838 7252 31797 37667 -36553 -152927 -78502 -128295
21535 -128295 54389 -314774 311645 -78151 -143415 -29605 -83759 89313 -74048 55372 164652
21524 164652 -317733 -117 -152847 -121064 196086 -239489 147073 -27810 -20227 92232 -333935
21512 53882 121108 -62502 -304756 254431 14837 -178041 -123595 -182687 -137230 189548 59664
21500 125557 173666 74337 -251307 -106996 -9298 328785 113091 48782 55122 114311 29570
21488 40396 272794 64666 7032 159361 196312 -29815 203776 -84527 -1786 477 -128518 -169838
21476 -169838 54194 -349337 -90977 185710 -190731 -302458 41490 94846 20927 -193167
21465 66713 26451 -68444 -266036 -277222 -119874 56442 -36711 -253569 -132154 -342739 -135089
21453 -129427 -126320 215703 -61797 80588 -209824 388203 -44027 -50768 156851 -178301 -248549
21442 -248549 615294 -73907 514928 545305 259603 -142903 -40765 221598 -35048 -19551
21432 -19551 111698 123204 86605 -112325 -214228 59905 -231447 -121913 144309 -63892
21421 -68452 -9994 43329 -283640 -63190 37702 -358608 -152411 143927 232107 -96609 61005
21409 -265214 -83032 2965 43836 -335922 -275049 -91196 27755 57282 19675 -444256 -95223
21397 178728 -217554 -237558 218945 -282098 -99990 -48773 290349 70765 -338209 102148
21386 -173119 37337 -274848 -231251 -41880 120457 -323852 -158123 -16645 -84652 -218225
21376 -218225 -35755 245944 140831 -85009 11403 -177105 -263159 -387873 411278 30151
21365 120343 32215 -308240 -100235 -21723 -125414 211348 -100726 126070 315394 -40707
21354 -2359 -128810 -177514 -173983 318692 -122242 -6930 -137742 -101499 2172 296294 -334438
21342 24450 -93269 -68771 -334261 -484301 18871 201636 -115128 -79084 -197482 620551
21331 172015 105790 -52889 -93084 -161798 -299873 178350 -181082 230990 -122856 112924
21320 -16015 -227013 154559 -198447 -163000 35271 297807 -236614 -2532 -104316 -146562 -94090
21309 -94090 117809 204747 158716 178970 -189384 -21250 -121227 -116142 -239476 197314 338830
21298 338830 624 -148736 -141400 -139046 -193276 46045 -189583 185795 110778 -68902 39402 99417
21286 99417 -17102 46173 -359176 37760 131129 -230074 138498 -71054 -200926 -232000 94132
21274 -277892 -344620 -296924 2160 36961 -304764 -224190 -66355 23038 -119779 314104 -101404
21262 66848 8993 181650 237965 -38573 -141911 106369 -338678 -142052 -276636 164363
21251 145022 160367 200855 -259105 -187938 -154068 87445 -272229 41932 -158139 195025 -75094
21239 -59694 -71851 -68957 -33119 -6540 -32930 105705 -116657 -120623 -102143 234772 -153236
21227 -47927 11019 42778 -134285 382021 -278001 21501 348477 145239 39361 -152367
21216 -206302 79776 65273 -19837 46389 24548 -471987 56714 -180272 -46705 -60370 -32243
21205 -32243 98144 152380 49531 288811 -87650 -164766 -228177 192649 -124801 81071 -134250
21193 -198662 491917 51626 6871 -430514 219792 -50216 -105287 52864 -496250 -192705 156995
21181 153503 -290633 -38882 151844 85189 -47500 -107933 124411 -155531 -333980 151278
21170 -262699 -167317 122229 169500 -50518 -7080 24700 -127294 -99010 92729 222715 14307
21158 -403526 -76484 -109137 6865 -26667 -54160 -270203 14252 11570 -58989 -26632 -83256 -69113
21146 -69113 96705 -242300 66864 -174032 -211614 -185689 -10583 168668 255911 172393 -180857
21134 46244 -146821 123627 126562 -59800 -209283 -183635 185241 -175569 137466 37750 -425271
21122 66649 -64778 -163324 -265413 318422 -31561 12777 -102520 -113854 -248498 -83932 -215819
21111 -215819 -122129 -9740 -130949 -24666 -57329 27212 -12455 -113472 67057 90118 -51461
21099 -114531 -61846 56968 16184 35442 -9722 218932 -147574 164843 -235391 309534 -147989
21087 -28099 130324 -93349 109387 126643 76923 -246825 -87066 240512 20233 206387 -91147
21075 12421 162279 -143530 -99367 69379 1642 106962 -77453 37675 203440 -94297 -141326
21064 -141326 -83261 -163192 58833 -348012 -69543 -105179 -124562 103888 -356886 -37120 23380
21052 139432 -97033 -209348 124618 -112571 35636 245164 -3179 117869 -22570 -28051 -250453
21041 -250453 -35629 -313069 65484 -232933 135056 -94512 -112670 271579 -112208 159279
21030 -223715 -303651 158638 -67546 -110750 34008 -227656 -53600 -222348 172832 127389 -58020
21018 6390 -150902 73809 124670 106145 109100 158891 236069 -302423 -287029 288735 -310994
21006 -349988 -156447 -375292 -51777 -115930 -46912 133601 -343181 -114725 -206059 341359
20995 -30106 -408436 202070 -42740 -256467 -156210 -54211 -1214 60561 181181 16999 29817
20984 29817 220648 102617 61237 -49683 -65335 18300 -388721 -25489 -126334 148821 -127900
20972 -337864 -308501 201938 103529 -233093 43125 41737 -32335 -364437 83788 -260353 -62469
20960 -37904 -124030 -78299 -159090 -319518 -119310 187649 -59768 -57384 76632 -365230 -141947
20948 129173 328375 25891 -209128 312271 -35338 -177285 -50782 48616 -32926 33878 154618
20937 154618 -162154 -264926 226900 -24787 -27985 -98131 -115105 -186024 15882 77807 4164
20925 -405389 63248 336444 51190 119487 -66276 -164909 -396067 -276079 -41960 -128704 23826
20913 47887 392471 -305073 122032 121069 -22050 -54366 -86463 130285 -302620 -28725 -164631
20902 -164631 19165 97541 -158139 -86869 -355551 -49897 -503006 -15502 -227047 -153729 64083
20890 338038 -58420 4566 -5498 -45886 -61336 69982 -43610 -156973 -25726 -198337 -212215
20879 -212215 -365817 -4055 170483 -148482 199373 -133352 -237387 69986 -110229 -349794
20869 -349794 31789 52746 -65657 -208372 -76100 -199091 -217488 171464 211447 -102543 21371
20857 79903 31374 -49073 81737 -127679 -174738 -316256 -82477 -472655 -10135 152908 -36172
20845 -224577 5322 -82475 286162 -140199 110154 -70174 -519956 -288052 -7930 -70003 -120559
20834 -120559 -189669 470977 148418 244380 -111698 -178496 -154106 176284 208473 -371703
20823 274143 26592 26894 -148787 -27989 -173550 196651 17539 -25464 28879 -202278 -156737
20812 -156737 -240641 -143722 98602 -126787 -287604 -175171 -224628 -33781 -141644 66617 -250079
20800 -133933 -230799 -82845 -107203 -127196 -43635 18328 -287253 -325940 -247998 -116823 -263462
20789 -263462 81106 -100735 935 106818 -14801 -13265 161584 -108383 -92182 66150 206312
20778 206312 30176 275605 35891 177809 -69185 -49657 -80005 12737 -159021 -56550 -114971
20767 -114971 -24231 -246581 -193768 -278834 -82342 137238 -173075 13453 -101639 -100258 -30280
20755 -17341 -8714 54210 232633 -209271 300913 209626 45209 179333 307464 292158 -74034
20743 4854 97385 -179372 -226926 -94400 -71968 -38803 151077 -78232 -67355 92293 -154252
20731 -172310 -384489 160900 -55407 -45014 83057 70156 -265291 -147455 -392107 69896
20720 -23015 -291566 43984 101598 -154934 -94853 -89805 -38005 248886 224135 -273051 -131619
20708 -105956 123816 175809 -55780 -91456 -102582 -212887 -83290 -95374 -238535 -300942 -273051
20697 -273051 -2149 87945 -228222 136828 -160085 -298527 -22255 65732 -199240 -143343 -101737
20686 -101737 79451 -277020 123276 110416 -74712 -224892 159214 172350 -9232 -94705 77583
20674 132698 40432 -185632 -332902 -442732 -254432 -204764 -366856 -24851 126414 67103
20664 67103 79030 -287853 126466 61120 422320 160389 50519 19464 -69561 4774 -103226
20652 -17163 -152576 72590 -121332 240383 -305671 -222193 -119386 -172067 32895 39691 162030
20641 162030 325496 85997 -21511 -117417 181438 3140 -95228 -54770 -137475 -2048 -356570
20630 -356570 -8299 -132468 -233127 119484 -176874 -332444 -48191 281583 -127626 -171227
20620 -171227 -184464 -157500 24576 -70908 26226 -42557 -75972 43758 -106490 -2549 187439
20608 72087 -219678 132207 -431050 -277964 -113833 -140835 -107010 -176275 286281 -26344
20597 -74966 -37757 -132466 -53091 25716 -203137 -110771 -276362 -168691 69826 156810 30728
20585 -266262 252112 -122834 -5351 -8454 174278 -227815 216406 149463 152978 -174579 -332245
20574 -332245 -113383 -262284 -61611 -317158 152503 -16106 34001 138233 56479 179350
20564 179350 -47803 -26515 -295281 -199481 223860 20127 413012 -106918 -409369 -29600
20553 109360 -139006 168725 118116 73029 -110006 32056 -25200 -56261 -125006 221445 -387347
20541 45400 -115659 61964 -168560 -17991 -201435 -237729 -157309 -306146 -117544 247197
20530 -134257 -365375 -50747 58065 -420676 -145301 233391 144842 -149138 -325245 29612
20519 40201 -23257 85037 -3558 247502 -23897 -134100 -41617 -291893 47299 193733 -241819
20507 -162819 86757 -258888 -455185 -186993 -357004 -100484 -196985 159492 64306 -400013
20496 5853 185800 -136301 -16484 -304926 30880 -330195 123805 179655 -630776 -67406 222024
20484 34973 -45119 -38121 -244217 -226240 138442 -44573 208409 18822 -96161 113144 329219
20473 329219 -233537 56960 50790 234207 57408 -264862 168813 112858 -179917 119335
20462 153510 21405 39313 -302470 79175 444082 206490 321492 45606 -64588 281620
20451 124935 113862 286952 96055 -371536 -223969 203538 130450 -33539 58354 -55204 128636
20439 -37156 -266351 -173420 -84718 85395 -255831 374 43263 -232168 89645 15398 16073 -37343
20426 9683 81023 -199807 -295796 -105884 68192 -4311 172061 54571 7988 -358700 -265220
20415 -265220 -67219 -153848 -308850 -6238 261552 152580 78203 314417 11544 -224251 -76044
20403 87974 -47327 37880 -86742 21522 -76474 296278 -243372 -32644 -142137 -129305 -30939
20391 279526 -46362 93275 100192 -20733 -174529 199758 -23203 -205291 -134405 268299 -20292
20379 -278355 -23754 155350 -337508 171610 237709 -58943 -349754 28625 -41125 -94958 -12653
20367 -268621 73786 24345 -133863 -345982 -22737 90116 72371 -26166 259874 -397228 128712
20355 -343734 16251 54822 -87442 -130991 -155148 86586 -74166 -148442 48905 124866 141870
20344 141870 -275308 -80095 -248767 -204628 -18081 35799 -301542 75771 63564 42335 -210301
20332 -20166 -267786 -49239 -7859 10968 -34255 -476447 125662 891 237989 -347700 -73318
20320 156405 -318402 327738 15374 -95035 -186054 82681 211175 199511 174618 -29454 -277049
20309 -277049 54028 -76894 -182274 -203159 -196258 9567 -410758 -137386 -93395 -156808 72234
20297 -198575 119034 -68881 -122072 -273490 -144445 -226971 -162369 -64437 -27183 14327 -328562
20285 94964 29014 -82119 -143863 -212630 143611 -19718 -29035 -102408 -227397 -54656 -58111 25421
20272 43588 -73584 -248440 -155128 8744 -65936 -82844 -393495 -63009 -37883 296201 -23997
20260 118793 -132951 -80260 -30497 -72795 -85376 -56800 123239 -130275 50173 -127823 -82710
20249 -82710 95942 79666 229024 10455 13353 -485365 -56424 -55409 138043 -137194 160008
20237 -150413 -5669 3416 -299886 56825 -133536 -392859 -386545 223716 -366682 -400304 -32562
20225 -195907 -72092 -17088 110862 -188954 -144221 22110 -18315 91221 -20408 5953 141896
20214 141896 -446262 -382566 -14878 413467 -179826 121417 -281159 65025 -49698 -378900
20204 -378900 34234 -369220 -239721 -502080 190838 -39948 -68728 -203628 -273724 51120
20193 -32641 -260013 30670 -129512 -149550 -68909 69912 87809 -202515 -133244 180978 -245235
20181 -141671 10281 -248652 -134704 25985 116306 -309579 104128 175096 27956 -155042
20170 120276 -123322 237249 -295858 -347057 -166299 -281568 -112322 -781 19852 144575
20160 144575 193116 -27058 -64356 -154713 -113700 -227252 -63608 -215647 -324800 751 360503
20149 360503 153313 -68315 119094 -111481 78853 134855 84139 -286747 -127537 273327
20138 -60500 -50103 -58189 194008 14957 -95036 93148 -329223 233487 -71472 -151589 -86780
20127 -86780 -220466 54757 105105 -93462 68480 270078 -188723 -165265 -111809 -318206 -376672
20116 -376672 -177609 -159212 -26915 -195826 164540 -73477 -186477 88642 -96557 -90576 -168046
20105 -168046 152586 -48280 -427854 -179691 -19603 -64969 188593 57904 27081 -200944
20094 -22910 -70356 -218436 134781 312788 -391352 -556293 -225133 -538746 -34813 302786
20083 -110349 -170534 -48620 -316870 -94254 -130813 72766 -59114 241044 -237085 -54908 -4590
20071 298738 184318 152928 -143482 -266065 -174069 -212418 301475 -299507 -24065 91408
20060 -101939 -188083 -77938 -25665 366031 121622 82355 -57580 -304431 -450704 -197026
20049 -99532 247436 -190414 -15976 41001 218992 -19887 -14543 -98070 -12543 26388 86463
20038 86463 -141715 -289883 -423425 -175378 -99932 241944 -43620 -68217 -130911 34585 52843
20027 52843 236740 179716 -47875 -202767 209453 -174685 164393 189689 -396881 -27467
20016 -173151 -452330 61283 -174231 163121 92125 -65773 -257900 54731 -83768 -168170 -51136
20004 -59149 -229263 -35418 -119240 25792 -223464 273688 -188953 -196071 -242489 -339505 -274021
19993 -274021 -19199 -36203 81795 157521 -378253 -25992 -271751 -52866 -504014 199474 -132905
19981 108397 -42809 25955 -53447 -49714 151771 -255241 33199 157742 122802 46106 -189648
19969 -313096 -27042 -6601 15101 -66827 59872 -348960 95114 -108757 65635 -38770 -118280
19958 -118280 65198 180002 -217157 -4436 -436986 -167225 -104552 236147 -131775 273694
19947 -233860 -107503 74987 134121 -192421 -241405 201189 -60015 -331216 -123881 170477
19936 -120956 -86548 141969 133353 -44587 72100 92680 290149 -115809 436742 -396262 45057
19924 27526 -41534 -179687 173997 63937 426260 -67657 -83502 -15735 93248 -106030 -175494
19913 -175494 -3657 82874 172392 -158392 20798 87540 -21400 92821 -46379 305363 49407
19901 178151 -348706 -56745 -258196 -53628 -36993 -262438 -79490 -43880 -67781 -375058 -201003
19890 -201003 -222181 -140565 -9732 -65520 85148 17511 301759 -74897 15003 -135715 -70209
19879 -70209 177338 -181848 77177 55088 -26603 131070 -362893 -95039 -168639 -166888 -253687
19868 -253687 99671 -201028 -356178 -118964 -45151 40622 58419 30121 -65364 -170889 -60443
19856 -109620 -196584 219626 -7216 -81188 -145410 -20004 -23829 128923 -466942 30385 -164602
19844 -86063 -69076 -200505 85662 165232 123169 126484 -18854 198540 -11937 -224862 -213370
19833 -213370 -139447 -169458 -214070 -190022 -71505 -124588 -326917 67898 -33112 8256 -93900
19821 -306577 -318482 61698 -87933 29938 -93622 -16195 -187414 45135 151761 -141864 -316094
19810 -316094 246486 -172057 -297914 -144289 -254535 -86655 -301846 119526 236445 -189817
19799 54661 -507516 -7350 -188487 -22697 211433 -266475 -21707 -85794 -190292 -147496 -42304
19787 88566 9382 -29400 75478 42887 -159113 -219755 -214723 -292884 -235625 -231450 134902 -95178
19774 -1302 305300 -141088 46144 -78969 176213 44005 -28323 -327227 -63973 -177710 -179787
19763 -179787 -196123 -85290 116856 136703 -189846 31027 -258702 90907 98408 -72464 -268634
19752 -268634 -224193 137471 -47826 196650 -137147 48174 -346871 98822 -296983 308916
19741 43677 -100464 -225129 69653 -114227 90405 -56524 138655 -16843 -199464 -133612 -201148
19730 -201148 -356884 -175334 261613 284819 -194048 18807 -258831 -357592 438033 65011
19719 155504 223863 -86281 43839 -149620 -57753 -232754 199326 182842 22018 -258431 -278732
19708 -278732 -88803 -220012 -54369 -381896 24528 -58023 119073 -126153 337395 -365785
19697 83628 36752 -182593 296832 -55551 1189 -422935 114302 138116 88054 -380914 -106347
19685 -153301 -117603 -157968 -357970 -228846 -227532 -449402 85084 107468 132974 370698 -646649
19673 -343404 67296 -67256 487672 -60896 134647 -44087 -171724 -152787 -292646 382566
19662 110937 -253020 119638 78184 -51879 -131088 -280369 -109398 -65434 -135250 128819
19651 -42587 181153 222272 -239976 192833 -74586 -241334 -240278 138173 150352 -27233 -304170
19640 -304170 -103872 -43451 -125796 -297785 268491 -114569 -156150 -101637 265970 124206
19629 -187045 -181850 464869 -115153 -84359 -26189 -69555 308813 -308835 -52329 -173572 -58623
19617 75154 -55022 -223134 -10378 458255 -90929 176079 155798 -71991 -126738 91736 -256063
19605 -345664 -121559 -73906 -130087 87573 109433 121964 44773 -76391 -27440 -9365 -36226
19594 -36226 -176026 -293313 -306962 5971 -179605 -15799 -178495 -315603 -213654 168201
19583 91411 -145570 36718 -206295 -75416 13833 -67489 -228922 -358050 150999 21963 -50274
19571 -123938 124729 -90178 -149583 -294320 4951 -7788 142891 -338492 -149749 -30658 -251124
19560 -251124 -82142 -438911 53656 91131 5301 -52340 265637 -71698 -129042 -227678 -199553
19549 -199553 -119437 146988 -134665 -299009 -2293 75754 62605 61578 -230390 -3707 -111551
19538 -111551 -211048 -341983 -196720 -130562 87457 -17299 104514 -89498 -93385 -219220 371516
19526 66712 299723 -115763 225035 -222522 25180 -5156 -156626 -143074 -89066 -381892 -190135
19514 206572 -39775 171704 -119027 -166378 177504 161219 -23572 164106 -132262 -174547
19504 -174547 86854 -33220 -480028 79008 13685 -198228 98365 -75347 -482817 245196 -61345
19492 -177711 -89599 -141716 -178798 -2956 -203129 115007 -378362 -415059 313334 6949 -372265
19480 120704 110510 -283910 -266818 29798 -44011 -241441 -112264 -45087 -10493 74900 -294417
19468 -341773 51574 -107108 260090 -141518 19596 -105950 -582788 -80291 -113243 -140616
19458 -140616 -77925 -177002 -389349 145702 145911 -187959 -212650 37180 109036 -254565 13361
19446 -181438 367485 81060 -43533 877 -75172 304232 -23152 -148169 243715 286691 -60796
19434 127093 -100928 -114572 -135924 -160779 -174321 -136206 143073 38873 -276093 17670 -351713
19422 -465265 -50871 -45215 263184 20080 227922 -439472 -200423 113742 -103076 73857
19411 -41997 -205765 -177622 -88366 -80228 -103058 -178504 290465 -68418 -250981 43325 77197
19400 77197 88833 93834 173386 21670 -91125 184719 -128966 -46246 -56734 69089 -325812
19388 -201036 -129993 -359596 228540 -68510 -144065 104260 -112226 -42911 -384965 -96909
19377 -163180 188725 56971 -109750 -76597 201027 80870 -1039 -250375 -35248 83296 11792
19365 148659 -204425 -360702 195765 -53756 308764 -174929 122703 -347290 27769 -247534
19354 190002 -97696 -131045 -12042 187092 -231045 -122034 -163698 48257 -182907 -152350 3468
19342 51560 39198 80221 -49141 38980 13426 -84899 -274253 21156 -159958 62601 -38866
19330 -277643 22387 -131533 -380476 -30661 225817 195994 -75049 -63444 203826 88262 99505
19319 99505 172260 -133798 202928 230808 -119044 84669 -112771 221720 -484150 -244331
19309 -244331 -105032 26295 -114881 114624 -142550 -238891 -42010 -63758 -97213 -174911 -156719
19298 -156719 -79676 61039 -106096 168553 93139 -22611 -76441 -227270 254856 131322
19288 131322 -352637 -126308 -6469 17122 -13479 93038 -16799 -20717 -43814 262647 -189247
19276 -435172 147374 -125051 -33280 47462 -425880 -247315 -258866 -279246 80210 -79719 -10098
19264 -34377 28863 -379320 256028 -63404 -371033 -248971 -138241 -280305 119982 -365640
19253 194755 -20698 -152879 -93367 12611 279230 -30240 241321 -28776 182977 124096 -273180
19241 67861 -213384 -317090 55964 196523 -397017 -248271 -148285 169566 -122153 -33803
19230 -137995 -294394 27019 183438 -61110 -25673 -230730 95957 -122333 -72746 -217095
19220 -217095 24634 -261652 -68079 -30297 27739 -167279 106965 186697 47074 158619 27118
19208 283968 2913 11604 -72116 194913 174583 -121330 -2153 -96381 -216439 -9663 103978
19196 -194022 82299 -350576 -273045 -255242 160513 -115150 51408 -39459 172629 204663 -57434
19184 -81240 -307661 -50727 136693 180517 -69939 84312 160343 -3312 91424 -71334 -92680
19173 -92680 -312485 -227205 -103926 87202 -264613 -217453 -149314 81070 83043 -95602 -136050
19162 -136050 33849 -8235 -177585 257809 -372484 26290 -252204 -7456 -197760 -83699 179138
19150 -449940 -126801 -86426 -147412 49553 -63443 -211495 -11508 60485 51563 279046 414446
19139 414446 -49808 104271 -26109 -94287 -121797 28705 179299 -188491 -66412 -472982 -391119
19128 -391119 69628 180464 -21356 106949 11141 -9421 42467 -156482 -446389 1725 15666
19117 15666 -119294 93899 -177971 115769 -150690 30234 -92806 -192971 104291 262751
19107 262751 -96454 -67554 -45306 -281935 -165443 125955 -163964 141367 -184374 -82143
19096 121092 80363 22789 123164 94856 -321816 -371484 -305796 -939 -12376 -282549 -205487
19085 -205487 -221452 -76300 167982 -250284 -176996 -120165 77949 -108117 -214753 -86647 -2406
19073 -174458 -312720 -22853 -283056 -85725 -181582 -212899 -113617 -109875 19298 -219075 -184643
19062 -184643 -10439 -285106 12077 212104 -137214 201827 -461562 66084 -25066 -54423
19052 -54423 -244721 14386 86099 -287464 -99715 -62623 -169733 245169 26887 -184841 -277447
19041 -277447 -230245 -332135 61920 104702 -94078 -114394 28149 -172067 102255 216766 425719
19030 425719 50882 -4936 -69065 -155775 33492 148101 -284480 35426 -75057 283266 63350
19018 142324 -131442 176264 -37331 -213033 -12826 -37455 -147071 -317045 313739 -195296
19007 233318 -250454 78667 -10186 108325 -87647 112902 -96170 -28646 133531 61223 -22315
18995 165674 -176120 70146 -48732 274105 -61425 -111196 138509 -125174 165991 -47218
18984 -118535 -41668 -371492 94925 216620 -94846 108088 16081 -72161 -19941 -326527 -27828
18972 -218805 -12503 -168200 -105193 -261141 -561383 -115591 -60135 -254119 -226785 -258475
18962 -258475 321884 60587 -17813 -88968 -57442 175377 -413019 -7357 -71350 149702 145484
18951 145484 122683 -32026 111475 -201940 -135329 258573 -1057 2834 205695 -161238 -352891
18940 -352891 -102346 -91042 -109495 117072 215927 -60953 209947 -32921 274282 280816 -27982
18928 39535 -220270 132476 -196060 66911 -271806 -232450 203990 -80612 -142142 -84797 229520
18916 2752 -42643 475 130968 -169071 -197766 -222840 -39144 -319829 -323231 -113539 -25370 -242681
18904 -242681 134135 -173865 -201924 -290563 -64367 26136 -161294 -428886 -2558 -17914 148744
18892 239241 107066 138791 98572 -177888 -353621 -55646 -147434 -12769 294897 -97235 -124934
18881 -124934 129629 -415151 -49142 -55605 178093 -240161 108182 -36617 7395 88515 -285325
18869 26216 -103586 81369 -219618 -491198 109996 39314 -233789 24196 -109837 -45755
18858 17613 421276 125598 -24414 -263312 -42724 171220 66849 83719 94586 5448 27169
18847 27169 -243830 -36045 8320 -63391 -2105 361098 7216 -224282 38360 -31449 183142
18835 -432077 -274257 -73093 -137623 -125174 -374332 -192930 -184586 262200 -260368 -322086 141621
18823 -61853 -277461 -219755 -215265 -92910 55023 150469 -108841 122074 -66300 -179074 -172112
18812 -172112 211363 99564 -333613 180051 -125517 34822 198344 -90726 235083 -87055
18801 -166342 -2586 -36058 -251071 -240517 -18000 82296 56852 238906 340 -171994 57046
18789 384238 -125313 -218850 -363989 64514 145570 -51064 67571 -188168 -106417 -514365 60383
18777 -308052 192734 -186713 194451 -111964 218606 14298 55960 425618 -48922 265564
18766 132061 200678 17060 -165906 -169148 -224715 65400 -237281 -157692 100932 201165 -286458
18754 219617 -112992 75519 -114921 -187244 -270346 239053 41640 -84144 28682 -241543 106000
18742 52994 -59090 -267970 174701 -45352 -113803 363984 62443 -135488 -191691 -163857 -27778
18730 65563 -150127 148011 12826 57229 -342352 -56424 -82906 -127261 -164341 -270524 107926
18718 14607 -23300 -103601 125200 -264672 117156 -99536 -298649 -210224 -231704 127715 -67166
18706 -93925 -35320 96009 -67078 -294618 -198119 -342700 -33448 -305347 7834 -303259 -174267
18695 -174267 -46185 -174894 52718 162208 -166362 194013 47019 -50599 31418 -183506
18684 -102466 -407138 -189429 164745 -40067 -94724 -216445 103859 -156041 -280256 -499
18673 92928 -48947 -114450 -377633 70015 113447 -180339 140139 -330816 -187376 58623 281601
18662 281601 -174757 175225 -15148 -62826 -157251 -477967 -117054 -111614 -446833 -80579 -15515
18650 27828 -567403 -99489 -184021 11398 -234272 -24004 -3505 53994 -74335 -117651 279771
18638 219236 -30619 38651 -49327 -72817 -85764 -72828 -4752 -391265 26551 27162 -17590 -305497
18626 -305497 210566 106732 -45873 296249 -185815 249346 -130903 -216717 14522 -184891
18615 -121381 -297769 65465 -222447 -16701 -351410 31188 -168745 -223068 -212841 -350915
18605 -350915 -234327 -7182 -114633 25760 146455 -117727 -119494 -47982 -185556 -385054 27612
18593 3705 170186 -84011 116565 -259413 332557 -68998 -105758 33176 -116427 36434 -33375
18581 -69125 41983 -161869 -110499 -7771 131360 132773 162593 -230076 249249 -194005 145213
18569 44866 205446 343832 -43943 516952 28179 -164805 -106374 286747 -135363 -184509
18559 -184509 17882 163050 -5741 -85469 318642 -180363 339 18255 306462 55822 -170010
18547 212602 48968 98610 336252 -120015 71207 -231674 14225 -185704 -126161 295884
18536 -213088 264204 48513 -111269 103574 30570 40534 -88509 -214594 38874 294718 -68675
18524 30798 -12830 -91767 -288113 -223941 -226 -332063 56213 -146030 -501704 226899 89291
18512 -84774 -157152 -213564 43149 -287103 -145869 -281130 120513 229093 -193721 34537
18501 -174241 -86467 -70248 -96037 -176266 -173896 334566 163742 48426 25063 -124903 21025
18489 -202872 -47869 -89812 -85076 3178 -305423 52883 -41384 -183027 -153445 -529980 -531126
18478 -531126 -173191 318439 165037 -112491 10914 -247729 17738 -30009 25318 250248
18468 250248 28936 137504 196564 14546 57159 185468 -6671 174326 -162598 55830 -100191
18456 -240372 -145281 -111087 -174151 305133 -131057 -75761 55682 -204779 18775 -51737 47745
18444 -42827 314901 -390927 -30458 -72 46739 59161 -41123 -53947 -33046 222042 102143
18432 -195961 23968 -252917 -95799 217598 -27390 10611 205612 105209 -203363 -269643
18422 -269643 -67244 157755 -130506 -270061 -229482 -170172 -50810 -209332 150351 108295
18412 108295 -83109 -71776 137286 -89194 -37463 166664 254761 264158 345104 209914 24078
18400 3903 18623 173386 -97796 -51326 18819 -16444 141083 -142576 17186 -89726 -63310
18389 -63310 -17100 -240404 95178 198526 -312259 281649 -26824 -113187 -112294 -11108 69046
18377 -184100 138634 -896 -195122 -60492 -139252 -216342 44464 -2301 132222 -454448 46181
18365 -254673 45513 71367 43481 -101826 -2659 -131248 -188525 -167066 -56921 -245224 -256773
18354 -256773 31037 198914 -32781 314764 -120239 77524 -117597 -296180 -154615 176369
18343 -131397 -95743 20243 -267619 -5908 48240 -17821 25232 172443 -234095 -4845 -29553
18332 -29553 -31604 -35320 -254545 -92976 -78521 104057 20450 10418 -87522 -224271 225600
18320 156864 9240 -81921 -396683 17464 -335329 -8276 -92875 -296609 81079 -137067 -147252
18309 -147252 -175176 -38607 -104643 -163515 82531 122488 -284363 274494 5759 62350 -99996
18297 -180619 -96398 47538 195709 40063 -139129 -91321 -70531 -110363 87581 -96498 -238886
18286 -238886 -126646 88529 -465710 -1726 -96395 -50391 165259 -5961 87336 185022 232722
18275 232722 -90717 278966 -360334 239257 317187 -15661 -266755 -160813 -110744 -28055
18264 32479 -41235 -84117 107247 -144327 78349 -28119 110 -1554 -390021 -331795 -154710
18252 191095 24999 20152 -75600 -49883 32007 -175005 14898 -83637 -140046 -84123 34688
18240 -30231 49639 288958 -39668 -65488 -222739 102590 133551 -201818 26102 -97113 -303188
18229 -303188 -66806 110386 29006 -49520 -412567 -29659 -193670 -115567 -50298 25873 -60110
18217 187414 122434 -237796 -62869 -72336 -162477 -102160 51548 210569 207048 -255616 -85244
18205 -194946 -232353 -51588 78027 -229529 -27048 -360241 253035 -70993 462912 112235
18194 -46532 238174 371663 -143482 -27157 325356 -264279 296040 257135 65480 -137545
18183 -179944 -116515 -28714 -180407 22320 -431770 -247277 185239 -289061 -73811 -199447
18173 -199447 17873 -364513 136675 21322 16834 287139 -187486 -53974 -8228 1222 100871
18162 100871 -73842 -281577 74468 -136066 388749 39498 -115271 30364 -348013 -255908
18152 -255908 -125416 -164615 120196 -1497 22776 -55556 -103275 167490 -53146 522 -343880
18140 147098 -26814 -164048 157447 -48030 -164820 104702 -150418 89803 210539 179984
18130 179984 -105548 -175162 -61752 -214235 -147182 4173 84972 156648 -105738 -61289 9171
18118 -45755 -325838 -350854 -30639 -337330 81094 51253 -147378 -125477 41173 -192387 33595
18106 176190 -121124 -161982 33064 -140879 212202 -440901 -181287 224561 82637 -294507
18095 -216239 2957 -126541 -41673 -247331 -19137 100967 164954 -69435 -12738 131026 -266099
18083 54954 -134414 -454116 110387 38153 -18803 46614 140133 -145089 -454329 12103 -179218
18071 2644 -139364 -460838 -165028 72526 32676 21183 137137 -312388 280310 -83942 -114699
18060 -114699 -22387 117510 -199592 -419837 -175819 265279 332432 -136967 -124093 -227580
18050 -227580 -68512 -50746 136744 -304597 175475 -193651 -171054 -18497 -86181 119995
18039 13842 -153149 -103269 290454 -240872 -179831 258348 -16389 -244763 134384 -34490
18028 56255 11687 356988 195220 276672 -30158 290619 -93253 -77948 -19211 -247108 24822
18016 -78308 107293 67931 -151524 -125757 -145795 101688 76362 -247457 -161464 -128583 -4792
18004 -307078 40308 186509 -73822 12158 -38678 -285421 -123689 -155734 4125 -84991 -55722
17993 -55722 120495 -265349 -35841 -171154 207041 -336524 -239277 41834 -28507 -207210
17983 -207210 -197751 243839 -309477 -25071 -100754 121610 -324184 275982 -445946 -265130
17973 -265130 -201119 76064 -204999 37094 -137249 -225589 -189300 179254 -70028 173215 -65092
17961 -311857 -223486 -85919 245098 21732 -198689 14736 -26782 -103134 -192397 -84622 34256
17949 -108687 -189748 52952 -59957 56689 557166 -141637 -19177 -236436 -25291 -130448 -299528
17938 -299528 75734 423078 260434 127438 108950 138 107036 -166774 256551 -85548 -143751
17927 -143751 280186 193261 17418 -234308 -253872 -36838 96599 467023 50350 89585 316788
17916 316788 315300 -239631 -234626 -23813 -135410 31323 -107002 -195632 110372 -60942 -104363
17905 -104363 -158688 164693 89615 450040 188770 -31777 217086 -142636 -151182 42408 -43703
17893 -73613 -124133 -18315 101468 -101701 4204 -10848 302763 -93169 149552 59267 89726
17882 89726 -65932 -156364 158684 25420 -70843 5293 25033 -349538 -96464 174632 249691
17871 249691 -248972 300084 207020 -118533 -107481 -124480 -39342 258295 97062 37623 -72500
17859 -237384 45878 -268728 74867 -232088 105757 107657 74775 -10700 -225819 -239220 -83278
17847 -56734 -95884 -170387 39031 182718 -7991 -137980 62422 61263 -15336 -37274 132307
17835 72407 -145292 -94481 216186 -96456 -32637 165760 -80030 21699 -115974 132771 141305
17824 141305 -129980 62347 -200831 -249220 43503 179638 89411 -4905 188968 162295 -118352
17812 -182505 378276 261772 -462230 65341 -23199 -123754 -70001 -106871 172659 -192487
17801 109128 253963 -54475 59396 149477 192911 24034 94913 -177961 90304 -233621 -67598
17789 -212132 104798 213824 -328651 -53329 -126071 -76269 -94919 -254781 217439 -52221
17778 -241175 -263348 259749 91820 -59257 -114748 -143549 -40914 68397 -48430 131736 -243254
17766 -348465 90308 164563 -92192 285186 314534 17102 387643 23284 -168908 33876 -31090
17754 -25629 -400586 -377080 -88097 249523 131236 -224137 -46317 238977 -197546 116985
17743 -257644 53231 24689 12466 158206 -86944 4829 -22813 -217359 319302 126546 -52673
17731 35253 -75332 -113688 -36475 169499 -57577 123339 154997 -109435 -171425 -61136 -109404
17720 -109404 217918 -54664 -9424 -158726 66942 -185514 16181 -62924 -138804 -98265 -39196
17708 -83106 118190 -282251 95611 -285880 279742 -111622 -61244 -158426 171261 16299
17697 -394950 87174 -300397 93164 -10081 29371 75569 61490 -8091 450062 157705 40347
17685 -152894 101227 66305 172306 6213 -356988 -84750 -205118 -151842 -237695 149835 98689
17674 98689 -294894 -51024 221479 -29706 193079 60872 231513 77215 159949 -175669 5656
17662 184361 36716 388788 68923 -153719 111905 -21876 -4553 34639 -87670 -32648 -244194
17651 -244194 47271 86419 -62523 -241782 135775 -86237 72984 107680 286901 379819 -20145
17639 -59878 95606 -360185 -470077 -72000 176206 -53210 321025 -236835 190617 -61714
17628 88605 87414 -149567 140704 240381 241570 197114 211242 99904 98242 34278 140481 -132763
17615 264417 233759 -15479 317444 -52242 -238494 169393 4101 -142622 -31459 -148896 -165558
17604 -165558 184739 -152547 -202002 -31918 -59644 72202 22963 81568 -71306 107914 -54682
17592 81731 272375 126927 -84979 -243916 59874 226539 3623 -76853 296341 -100181 85733
17580 -139839 258096 192501 -182145 466149 -228667 -230046 -138324 -25114 177424 188932 111212
17569 111212 119386 -320564 35627 -64572 -51899 194855 -81226 350066 -105927 -37089 224125
17557 -47112 57859 -42704 207949 95287 -368646 -210726 210174 179550 100816 -184460 55580
17545 -174106 -180079 248101 -67312 -187155 -271087 493754 23130 318843 -192864 -411989
17535 -411989 228333 213081 113174 226666 150571 -87697 -14759 418898 132959 -2320 -58270
17524 -58270 -12904 -111496 67305 21439 111341 173027 261314 168547 238843 -210091 56156
17512 35916 216854 244722 248428 -7052 20146 33685 147242 -325720 87938 48899 55239 72496
17500 72496 597931 317598 101826 -261765 79336 235558 159880 -24690 19849 -17697 -195441
17489 -195441 14612 426248 411621 63259 -99962 -129064 238177 86085 -78060 363357 192040
17478 192040 234051 -58863 193002 136927 77384 142134 240009 -310337 114559 146949 118533
17467 118533 308060 -82908 229426 44787 72525 357592 339235 172040 76030 255037
17457 255037 -118574 648545 379540 353501 -93866 275276 284901 -16020 179910 -38263 232727
17445 289835 224541 28647 216096 180468 251565 211771 112467 139124 545572 301563 -128612
17433 326555 116740 -100124 407631 236085 -122259 189821 120636 200165 206944 135966
17423 135966 525931 367926 -36761 306402 24360 149976 99529 306504 -110583 -9321
17412 322926 182138 48905 222859 -58397 12976 231583 287178 334047 -151421 138424
17401 -63920 -108593 24858 -270616 -50324 -95734 65035 -29450 176887 192595 -161458 163374
17389 244930 427310 286006 112539 304924 -43746 290989 -63749 26741 -48705 71479
17378 17999 159053 222872 -107167 151262 -11813 137281 140981 413082 207793 186612 -139459
17366 -318412 88782 -38731 134102 289862 247955 13503 8107 110094 136183 81382 122325
17355 122325 231377 146828 357464 171766 25879 78910 164233 206390 143317 229063 301698
17344 301698 295991 288418 259593 97295 176125 -148725 136848 -34018 170025 233355 136130
17333 136130 189847 -85123 529143 -43095 -171776 99805 227156 10368 328673 -63430 -145853
17322 -145853 116887 475510 212500 157928 68860 208318 248481 -163203 212285 -158895
17311 -35325 180204 282359 -58096 367540 67387 341511 334844 -152248 89001 12394 38224
17300 38224 73453 522605 -11066 197783 173959 352647 94703 218260 -146924 238279
17289 205990 -291391 289498 323905 147542 288219 348624 501143 68388 -109944 151427
17278 12253 369034 -29267 59952 350241 289808 117062 86616 -32494 337537 -21472 272132
17266 138087 443923 494624 138668 342422 -33031 545958 53678 376879 122752 194351
17256 194351 368402 -34027 313742 -153335 9596 336434 9254 -141303 90687 334430 204910
17245 204910 387498 204300 364441 7784 -79279 63400 94667 116020 352895 -189801 435072
17233 137144 280917 2126 88815 207609 482960 342602 141586 130956 -78418 66570 472357
17222 472357 112041 62972 49716 227244 486557 194091 522823 -142352 204257 376393
17212 376393 413071 201454 318349 72581 333800 62285 144022 -96706 318128 316880 -215287
17200 -78493 387802 302457 46152 332680 210154 324264 -64586 128950 369898 277468
17190 277468 267867 320662 -358800 240692 339118 357364 -55567 175915 266551 152873 208550
17179 208550 89455 343791 205424 298923 -58473 57448 -73009 277682 356551 183104 40311
17167 314155 423344 61512 87415 96701 318469 429687 314734 430502 72337 246635
17157 246635 57998 409385 252470 192401 279159 418180 -152174 397963 84888 -2912 31496
17145 388587 39952 489681 59759 588453 232076 426483 333222 424169 266146 144639
17135 144639 311927 414699 -33 397596 171077 39717 138292 439904 333779 165568 311099
17124 311099 427656 -116001 650411 53939 187559 352981 528307 672102 -19355 116542
17113 374154 328481 524288 387683 424307 393644 416012 -19520 519780 368190 304998 -75601
17101 29382 245861 257015 476436 52007 369108 719394 690626 294216 380191 277728
17091 277728 481203 480988 -77609 420892 793498 638592 400155 593943 301298 643432
17081 643432 249449 698417 560435 311887 260038 522062 211382 496490 24799 202197
17071 202197 407472 181011 220723 489209 294018 471379 389745 353011 527876 500535
17061 500535 435652 162121 325044 521186 662795 388518 256879 456091 604216 15551
17050 126568 292792 505685 625354 340214 691333 963274 305043 323353 216455 581535
17040 581535 543287 324053 502943 355212 585613 760870 589710 630493 492722 540896
17030 540896 841481 680251 289458 516567 667296 578200 633597 638684 574810 509911 496954
17019 496954 791321 831145 588775 841628 511278 580283 823899 450133 310395 132173
17008 743582 754215 470226 455910 821268 892628 699844 606171 835586 392492 755684
16998 755684 707128 727860 500853 331331 823848 706156 779353 657167 633048 917817
16988 917817 503092 436481 713527 921370 909711 991891 831860 661121 1101555 869155
16978 869155 940268 724485 745531 903085 892419 1174286 809840 649530 1141975 959074
16968 959074 930810 937167 864606 783982 784569 941548 745722 779676 756507 607270 1134137
16957 1134137 732793 1000412 1078566 1037315 912972 1104838 1109956 1021839 836041 664211
16947 664211 842152 911954 953824 1362068 1035874 1242858 1195178 1195097 1112662 1451915 1147223
16936 1147223 1043841 961852 1370658 1366528 1086586 1364310 1030488 1185544 1255219 1217381
16926 1217381 1169185 1006550 1097986 1576658 1275534 1247593 1332835 1446012 1367791 1297651
16916 1297651 1474365 1496968 1368272 1368109 1211974 1458544 1472929 1506974 1204389 1415566
16906 1415566 1557908 1828419 1655193 1345019 1469719 1725524 1671614 1958393 1668504 2029513
16896 2029513 1637964 1624877 1598457 1540606 1911954 1863102 1561214 1928194 1997911 1955371
16886 1955371 1879359 2242911 1980541 2050173 1876888 1832618 2072112 1792325 1997928 2083250
16876 2083250 1836551 2123526 2364169 2289967 2139679 2505899 2277145 2113221 2032566 2382733
16866 2382733 2443528 2528699 2487598 2865559 2680617 2766524 2236231 2570315 2661892 2611231
16856 2611231 2642086 3031716 2654778 2864852 2902216 3008752 3089995 2972050 3133478 3254241
16846 3254241 3516891 3337399 3301318 3546665 3378581 3438742 3493363 3665964 3768843 3900913
16836 3900913 3992115 3851405 4072104 4533612 4168222 4415827 4083490 4408330 4179554 4484674
16826 4484674 4549584 4766563 4699554 4824298 5042306 5062625 4819652 5212441 5209427 5253973
16816 5253973 5444851 5632952 5977162 5888261 5942756 6088970 6241302 6275697 6455268 6489519
16806 6489519 6570753 7027185 6906353 7042574 7058777 7261409 7579146 7785358 7890136 8441348
16796 8441348 8511368 8407966 8821099 9137562 9192854 9484345 9492528 9675154 10330295 10301905
16786 10301905 10803126 10936754 11511903 11633896 11923456 12381771 12806363 13069104 13661788
16777 13661788 13951971 14206844 14614711 15188585 15770856 16652847 16752262 17393565 17975715
16768 17975715 18409343 19160668 19733010 21035564 21500847 22311068 22830294 23717430 24786153
16759 24786153 26172669 26672175 27853369 29168359 29961624 31679856 32838714 34874822
16751 34874822 36311452 38091216 39477573 41878995 43597704 45812797 48264520 50907215
16743 50907215 53154108 56174986 59141439 62683256 66204504 69842808 73612526 77742251
16735 77742251 82269621 87065780 92378359 97485030 103061873 108709219 115164310 121488272
16727 121488272 127967946 134544153 140944354 147546561 153462212 159268523 164248099 168969098
16719 168969098 172757260 175658890 177581051 178377021 178460735 176763125 174557814 170927809
16711 170927809 166750374 162011037 156387990 150492609 143989950 137520037 131175287 124530678
16703 124530678 118046321 112062041 105684293 100133319 94754839 89278517 84050850 79781745
16695 79781745 75000508 70901269 67188634 63648574 60468289 56731310 53984087 50917290
16687 50917290 48419111 46282684 43971159 41549501 39649753 38165934 36179920 34711052
16679 34711052 33096495 31456744 30237460 28943286 27522288 26570435 25595985 24565048
16671 24565048 23432421 22913354 22102788 20961056 20371375 19710726 18575258 18290287 17343836
16662 17343836 16949543 16275804 15659487 15406923 15049215 14332907 14039656 13535807 13149701
16653 13149701 12642560 12394544 11951369 11388037 11214448 10853975 10706062 10303320 10061022
16644 10061022 9536704 9671619 9579940 8756404 8503324 8570577 8503747 8346133 8292230 7653287
16634 7653287 7738576 7243666 7172137 7075420 7019882 6474411 6447872 6323338 6172068 6013178
16624 6013178 5958255 5767090 5888152 5510020 5643109 5273505 5287429 5088539 5231289 4808798
16614 4808798 5067138 4802641 4914557 4346800 4551798 4699618 4472332 3839673 3951762
16605 3951762 4187843 3817093 3891516 3557193 3663173 3562333 3781961 3606045 3608059 3559136
16595 3559136 3719889 3263186 2985530 3685252 3044049 3217138 3298804 3035023 3245047 2883206
16585 2883206 2954205 2787224 2647037 2743540 2596203 2887386 2531252 2637533 2315677 2511256
16575 2511256 2665329 2505425 2202885 2573867 2497061 2356043 2237661 2139220 1991480 2057829
16565 2057829 2258882 2095686 2117060 2032862 2209208 2170463 2131769 1791504 2271234 1682800
16555 1682800 1749807 1653784 2199861 1758791 1735065 2137478 1631109 1586248 1625500 1640127
16545 1640127 1716905 1623747 1735813 1612524 1512821 1513318 1641146 1627002 1415326 1661860 1559355
16534 1559355 1453464 1352040 1612301 1382670 1470193 1780672 1421867 1597333 1403652 1125322
16524 1125322 1139346 1231848 1269012 971638 1225670 1057099 957608 1476127 1110952 998165
16514 998165 944165 854903 1211271 867190 1077529 1273952 866973 1008943 1031644 1128717
16504 1128717 910051 1049311 911246 1071827 1156949 1135585 1438818 1041283 1467872 1011416
16494 1011416 1108202 807426 991618 883226 1225909 982621 955056 996772 899535 1067104
16484 1067104 1030617 1230330 1266428 881369 955665 699946 535674 763429 769005 571576
16474 571576 1068142 920768 953402 1094099 689702 732794 805399 741408 982003 562741
16464 562741 621407 1021701 823690 728904 671202 702042 450027 773360 529504 747902
16454 747902 869895 914153 330985 581127 854345 537615 316203 525055 533072 756286
16444 756286 501109 667252 755519 469888 458525 806179 620111 546326 413635 555085
16434 555085 388025 609736 452191 296461 355139 239107 457462 520280 532288 593463
16424 593463 521016 289716 405730 511754 550742 417886 473659 645112 200615 598938
16414 598938 541803 497529 414912 299408 205251 521845 514884 665828 308090 312201 460120
16403 460120 507376 326209 191743 517469 498816 420359 251436 675158 281528 565838
16393 565838 219649 351227 494838 312395 345961 886764 420292 111876 441545 556279
16383 556279 557323 457707 -9201 384620 406799 173200 570969 485969 303899 264846 689942
16372 689942 712389 280166 491373 653104 317326 378063 506651 121308 299284 421119
16362 421119 297035 260301 407697 445694 290718 581690 584471 356644 43801 -3929 552598
16350 233048 455509 328525 309943 367765 216308 77796 161723 156873 202367 161503 213901
16339 213901 132551 119732 159321 54262 245324 268444 309954 263984 321286 243618 141155
16328 141155 146567 67831 202549 91292 69367 368905 230845 511226 257970 379335
16318 379335 251846 641017 223721 97956 375237 209626 195498 221933 362375 427867
16308 427867 132884 358408 378763 312184 92208 374166 183585 288031 424738 219934
16298 219934 141505 532236 65044 269517 185366 267854 120958 159673 465001 50648 -7425
16286 126174 258929 -204108 -238661 22488 362792 -135206 -103757 -240060 393000 386990
16276 386990 265759 -188129 -212963 277134 269516 21516 326158 151672 286760 66824
16265 302997 126405 528079 124547 510761 258740 145741 177003 187318 257667 357056
16255 357056 198083 49458 416370 120174 276298 364401 119261 371842 39349 99085
16245 99085 276082 72870 49994 272264 -89555 397926 139907 147924 244669 64770 165100
16234 165100 271715 260533 113000 -883 349953 496381 -64502 137845 182964 379151 91678
16222 219343 480900 4439 100967 -402034 312649 -9587 101166 -112000 23115 -7706 207029
16210 79897 126062 277654 190525 -4771 159134 -312019 184945 113134 -111068 136146 -65474
16198 36380 168860 234260 72437 -63988 184283 -321650 303912 -287499 -276365 30684 452216
16187 452216 252340 51987 122772 -70822 69668 37535 75037 63515 8195 241262 272680
16176 272680 -197331 -14071 203165 59930 -258027 -206955 22662 38285 165589 -259176
16165 76758 72099 490851 281407 -160370 -104493 365643 206633 186039 227942 -162467 465852
16153 151136 173295 117077 348731 426575 -191504 -117838 14355 286672 126873 39010 273037
16142 273037 55051 272552 -283855 -84209 109655 274812 -111036 92990 46214 146875
16132 146875 -93099 391547 61307 -97575 -24035 123915 142022 -220457 -78270 -112140 -139639
16121 -139639 325637 -113036 102603 -132516 -107614 51427 -286774 245026 -164267 -232528
16111 -232528 -182144 -338197 169370 73724 13918 248779 262401 -55974 6318 -33126 -138318
16100 -138318 -31952 224658 137604 -108178 330366 15135 51915 -228002 86494 270246
16090 270246 -391914 -262158 -58499 96985 5696 25720 -156964 49194 235708 63786 87934
16079 87934 34072 -80316 388370 87805 208635 1034 -195769 341739 -11587 230677 -322878
16067 116028 281579 13096 -165152 4753 -169428 49666 -116459 -86062 202504 113618 -50698
16055 451869 83395 -99804 174912 66669 -72649 -93069 -86595 -86938 -179597 -83385 296998 -104675
16042 -201821 -132923 140492 -54406 -210010 295080 -3070 329022 60119 192495 304454
16032 304454 436502 -94825 251811 -211191 201378 527074 352860 -33310 -87618 -681 90318
16020 34149 223798 -219191 -33804 88054 48424 286569 75812 149772 -8761 -146753 394648
16008 -232298 37565 -122933 180659 19359 330579 132175 378714 -54324 82644 136993
15998 136993 -253436 -117261 -78630 -188388 -163874 -75084 310400 -154750 -1863 -85483 -209466
15987 -209466 31978 -26239 246029 134744 35313 185136 292807 -82030 165960 118515
15977 118515 141967 149303 -164650 41485 1252 -92133 -268090 49165 -182674 22625 -239125
15965 65994 122645 -86696 -56705 -11965 -189215 -249018 -121736 11119 -19294 249075 140454
15954 140454 -293556 -71150 151119 290517 20651 74721 36399 -615941 49254 -10455 -141077
15943 -141077 170072 41419 -182572 300968 56610 -91713 -50505 89041 173916 -88257 -272307
15932 -272307 -96815 86700 241002 69530 -155372 -32872 -157138 304474 15880 -152668
15921 79481 28194 50133 70942 -325618 -216308 -85668 10832 -512789 -227263 -141964 -280076
15910 -280076 -355545 65504 241527 270 186379 -142915 -102208 65222 252960 -151450 -51532
15898 -26647 61288 102677 -12117 -88544 -287617 13365 87908 -93036 -168658 2164 -149090
15886 -185652 42240 203970 82824 -57812 79848 1770 -41034 -79607 104875 366826 124443
15874 -42018 47517 -178345 224015 -215356 -69645 -262078 56398 -27565 -246321 -71414 -231977
15863 -231977 -42724 -101066 -161840 32910 -152649 -194800 46875 -25378 11712 171315 181884
15852 181884 -225347 14249 -293994 85317 5226 194661 145278 -109251 41821 25285 -29527
15840 73046 -8445 -26693 -232750 385764 -64914 -254061 -130756 -227523 -196312 -75495 -187563
15829 -187563 192177 -246573 -168079 274736 -30078 -80881 -145037 184989 16810 -235570
15818 -19929 -127780 -66191 148550 -177244 -269264 -251822 55612 -70016 -32255 -188375 -309140
15807 -309140 617 267556 -244047 195164 81500 -143306 -44973 -162728 -129138 -22122 -46004
15796 -46004 122950 -10702 -155507 118512 -101917 256481 -273928 -174914 -248296 -71128
15785 -114158 25765 -7722 -309758 159558 28728 29850 -299192 -10549 -41722 -131405 277726
15773 209098 18498 -165681 -17514 -162346 -61174 -79421 -185649 48785 257831 -4239 -282681
15762 -282681 139242 -71402 -297236 71286 136826 148072 17662 -156731 -251110 89841 -158058
15750 15182 154358 -71071 252712 -186047 -219576 35521 253631 -12370 -84528 -194492 313053
15738 301710 315788 404213 10515 -39257 216597 -191965 -95627 -46818 -303080 -95122 35966
15726 50563 50279 -341838 30687 28080 -127532 143367 -433225 -345466 -128409 -138504 121240
15714 -135209 127903 -297859 -38753 149858 -131999 92371 42479 -39106 198947 127875
15704 127875 193328 137191 964 384848 -1186 -203808 144260 -192365 -22820 200428 170919
15693 170919 -109374 56740 84031 27620 -263187 3672 -59448 -34698 62677 1985 -20206
15681 -274746 -201841 -101083 -38913 -232958 -162549 -21093 332726 -187699 -329624 -177595
15671 -177595 38822 -18165 226724 68495 24884 33646 -91876 22613 -284447 -540463 208770
15659 -150650 -95850 -48074 158502 288604 -2902 -308280 165697 -22217 45464 -101310 287910
15647 -99699 -146520 -52823 13624 151244 -64249 133553 -362385 42402 -139711 -249507 -111287
15635 52362 -317928 -22057 -77309 -143990 195321 266305 -115726 -328314 -74711 -1401 -160095
15624 -160095 191105 89495 -234882 -152513 -121293 -127804 -167083 95244 21371 166984 46296
15612 163285 -18454 -20036 -88975 444 -199640 118680 -54937 90832 -39527 -228202 274612
15600 130752 -335093 63014 230001 -54835 -313202 48760 -147999 2203 -250363 -243142 125313
15588 -148178 -50415 54323 -35045 -27383 176468 -9638 -63040 91723 -121627 -243510 111667
15576 -76495 -12028 -119317 2032 -193832 -150541 -125810 -26076 22088 -188398 141655 -394722
15564 316175 -103857 240140 -167848 187956 35133 148206 81129 -355171 -20122 -29572
15554 -29572 -245959 -257454 -314036 -172424 92681 -144090 214257 -97011 -256089 158930
15543 -288378 -14373 198276 6385 214872 -200673 -30375 289281 20988 -68822 49174 130488
15532 130488 142326 5639 46381 193433 75711 110819 -260704 140585 41114 -65812 -36898
15521 -36898 -103061 -179371 -125849 132329 -62217 65050 -187841 206476 20003 -354233 245442
15509 383672 -37685 33370 -283090 -56146 -278480 394333 -100429 221344 48611 -124646
15498 169601 -57261 16169 -84073 383136 -173363 182655 -25249 -42540 -52076 -91450 -106077
15487 -106077 -84488 -139738 -36707 283438 -36830 294556 -156006 80778 -37265 13343 -87275
15475 -169427 -139441 14395 -348562 -189607 253066 -263752 -124597 129893 369222 -65112
15464 52909 -447763 -2866 -57536 164880 -176153 -344998 -72872 -156065 359114 -190914 179900
15452 124391 -228816 46668 29939 -141760 -144834 -99938 96927 -52731 27829 -287852 301690
15440 -265189 176315 -19470 -102516 155322 -340241 -275385 -71404 18785 130920 -86462 197671
15428 -255297 71044 132643 237103 68529 -261027 -95219 -316514 26484 -439473 -102767
15417 -295489 -184376 -124296 138786 -229319 315929 133955 -74840 -175353 -100611 -147766
15407 -147766 54941 47722 -31339 282954 311486 143242 99182 64657 40030 109296 29551
15395 3722 133195 -15199 81702 108823 22466 -98432 91394 -154311 101318 -215537 -102475
15383 -47722 111019 -37391 32628 54410 150310 48883 -169552 16907 -40592 -47625 109664
15371 -105186 -42473 185803 188506 161318 369546 220160 73325 31461 25623 -342877 -39918
15359 69640 -115378 -19378 90643 91855 -320900 -228791 -159103 -100938 -85682 184527 136912
15348 136912 -106733 -109336 226141 2488 350079 -13428 108933 -73945 100100 -294949 243159
15336 78694 199968 149554 23081 -20589 8062 320085 -194750 78986 -20739 -76399 31289
15324 195698 -40129 86348 324000 121925 97972 65825 59700 240405 -94833 -114633 138280
15312 -234889 -16973 -33803 164841 -78727 -52780 102905 405873 251808 -108069 324702
15301 114764 -120757 51951 73320 -519509 -47511 -9038 -197380 -162615 -413029 214176 -14047
15289 -66911 85092 -160543 161687 -230377 -125511 -110085 -208008 -169426 139901 45202 -123437
15277 296752 -179827 -204885 -368828 307393 -101079 163145 356663 -56994 -85846 198572
15266 218221 -9072 281890 -279901 66345 252874 9503 -139606 73954 103627 116478 172849
15255 172849 -77108 -115279 287866 137965 393590 275783 1176608 1528175 928438 838997
15245 838997 701293 303803 233036 283099 153338 58962 -95092 66678 -336659 117834
15234 -131359 6288 -6560 418490 52581 16498 28494 -196281 121901 -74205 -14713 -177281
15223 -177281 51809 9674 5115 -150352 221242 375761 114665 -67794 -22995 -147891 477650
15211 100866 155588 129796 -234886 126384 235027 461355 -78486 41221 18168 -117159
15200 8783 522751 12397 24010 57827 -141386 -219418 -98531 282608 181323 56100 94241
15189 94241 271068 163544 -50998 -28862 24995 182172 5622 101391 -25296 124842 76963
15178 76963 -400791 161476 272613 -52132 241610 67500 114169 434053 176180 -313232
15167 -47623 -70298 80137 105481 238290 166762 -157521 -114014 126541 232806 -60742 -3197
15155 -89967 234098 157913 287924 216584 -54443 154967 73894 80607 95846 62344 -12709
15143 -81010 -242657 -56000 107802 93317 140241 -35295 -13073 119456 251116 15226 18174
15132 18174 -47439 -23045 -174905 43981 109066 428108 218423 154152 275910 179745 182551
15121 182551 187641 179632 -73051 256878 -144908 115513 132304 -180444 -109664 -21973 283155
15109 233003 615588 174317 -118879 -80614 23349 -101731 196959 -58870 195555 29479
15098 183040 236269 7844 265046 402897 38419 368700 325922 -250750 159201 -47785 18326
15086 244143 -123315 145154 52361 104979 193613 210081 -16038 46496 215089 66966 -44799
15074 384001 -97696 -96592 170718 -45513 20540 195874 127235 319877 237437 144555 172111
15063 172111 137823 164974 333906 -77964 -143843 43121 -64164 121694 172034 319085 197514
15052 197514 143132 190408 113838 -84152 331694 191795 30400 254061 -129722 -42575 229536
15040 229661 117206 21351 241633 186731 230379 301039 -264338 204055 301123 198058
15030 198058 256325 94569 161515 120076 93279 215523 283602 295872 242238 -64912 93676
15018 309046 349040 -7911 365466 322280 122494 435161 157262 369301 -178712 433400
15007 327891 43245 396902 258429 -2467 475269 103887 150740 200828 86980 263871 148893
14996 148893 34815 -123302 144354 115808 41298 170767 418028 258419 198613 128258
14986 128258 554853 252707 301943 151492 257485 156391 6263 -126270 243831 132278
14976 132278 -62102 474419 82452 554741 219619 278455 146610 324949 273538 456505
14966 456505 -38011 252448 121993 -150983 219698 161625 -78775 -54629 441664 -71098
14955 27796 292673 384699 128751 340685 -55223 334259 -14082 260423 267991 461157 272569
14944 272569 243752 248314 146156 77754 -56392 393949 386594 24862 431742 142439 196783
14933 196783 161343 157118 374775 390232 339495 22499 150648 156464 75527 238407 428296
14922 428296 353692 271227 -135754 125215 149296 184797 -16555 320770 265522 -14417 119331
14910 314717 303702 434783 95255 484600 365698 -54900 522210 47912 191687 320855
14900 320855 224082 278773 268037 166020 237689 14966 371862 466000 217433 529830 446442
14889 446442 -147869 281679 522723 684 268803 265088 83449 234365 326272 73443 10522
14877 323951 436351 557405 322206 82206 215642 185309 343167 266315 79139 399069
14867 399069 252300 435307 -124377 480755 320770 502364 316383 39641 341545 458913
14857 458913 281905 166097 139437 148777 312778 103373 635147 741999 445812 767379
14847 767379 585569 431201 293378 78837 497799 394860 356131 383146 449862 322869
14837 322869 195854 547733 247674 532374 168910 484918 442712 345831 38507 654925
14827 654925 684882 788694 289268 759270 476959 445644 216190 244636 364418 579893
14817 579893 731732 420417 353075 453166 449864 609516 334186 296635 639988 617832
14807 617832 482945 438818 285434 726655 590164 790758 408169 363060 495899 511762
14797 511762 528740 513526 578448 333242 649685 433079 417947 507080 278406 648439
14787 648439 177041 616506 726810 492575 631609 435233 67602 719938 680280 260695
14776 374064 314414 610764 871599 344608 416920 403266 636407 528858 185152 467186
14766 467186 491705 439480 211327 346991 696442 1099639 701407 636659 834566 692464
14756 692464 603816 852645 484288 589248 719894 634773 585670 470208 598135 827373
14746 827373 756531 585113 599698 463917 466012 486976 382874 824859 645450 443814
14736 443814 290440 231202 864172 654209 723374 188220 586788 390502 218759 790824
14726 790824 916069 802982 604875 391359 766289 458691 668143 599603 557231 1009437
14716 1009437 234214 504264 668542 916494 590622 486090 737132 538508 905028
14707 905028 927481 667411 875458 1066480 599195 977860 1145918 618293 842593 754626
14697 754626 675607 700716 768645 614054 908611 926219 962291 682122 819028 710295
14687 710295 804276 526638 837579 645612 895777 529339 1060277 822843 1039850 633990
14677 633990 804786 819716 869693 925383 665227 1030779 562829 999618 1063713 832185
14667 832185 965423 911100 1151685 508526 1077577 1071961 1087242 854389 809848 847288 1052533
14656 1052533 1096690 1074015 1089069 747735 1286579 703996 894467 657560 876625 1282307
14646 1282307 924458 1114446 1228122 1509035 1201214 1089149 1179521 1279386 1101687 1271783
14636 1271783 1487933 1017913 1292241 1145607 1047969 1184880 1297143 1335621 1272447 995914
14626 995914 1005135 1062203 1142404 1099644 716798 1384293 1335599 1455864 1173254 959421 1356957
14615 1356957 992097 1276961 1267367 1371796 1244619 1077860 1548724 1340049 1600570 1393013
14605 1393013 1325168 1445234 1387465 1747694 1752083 1402220 1318764 1622463 1498973 1572470
14595 1572470 1400094 1583986 1591603 1568397 1736316 1439001 1698311 1843864 1648932 1749282
14585 1749282 1836310 1735627 1836311 1667799 1563106 2130231 1392796 1644993 1650779 1747271
14575 1747271 1675595 1880931 1884544 2011036 1923382 1926976 1842516 1742970 1943223 2328792 2320756
14564 2320756 2140537 2365816 2353903 2174165 2390313 2007617 2331466 2695015 2816897 2664363
14554 2664363 2900808 3085267 3800740 4422080 5330069 7455790 11649755 20233454 35162713
14545 35162713 45202829 23003447 8796074 4327487 2710366 2007431 2125513 1957684
14537 1957684 1556218 1439519 1624459 2014774 1864540 1908145 1982201 2021318 2116326 2468471
14527 2468471 1694561 2186670 2359883 2153318 2117703 1934933 2268330 2348385 2449905 2281123
14517 2281123 2353401 2509049 2350306 2722272 2236967 2267202 2588461 2498986 2614955 2336767
14507 2336767 2864691 2517278 2692407 2471157 2754910 2598665 2825531 2692161 2673764 2865127
14497 2865127 3003626 2822935 3075919 2854042 3192135 2754199 3125899 3143502 3067567 3063964
14487 3063964 3274287 3299961 3203683 3269747 3426045 3561269 3338056 3702552 3613559 3506378
14477 3506378 3517494 3725308 3486438 3810227 3870462 3500915 3475997 3723023 3971516 3980088
14467 3980088 3924055 4119886 4287332 3990466 4311593 4582807 4165289 4287854 5011569 4378994
14457 4378994 4467408 4476849 4672264 4837720 4941373 4957762 4634599 4752264 4632008 4814543
14447 4814543 5232089 4957489 5104179 4984922 5140529 5501208 5209786 5432124 5450276 5937088
14437 5937088 6139934 5734731 5954267 5892747 6219788 6141828 6405140 6298656 6375893 6577975
14427 6577975 6305445 6535048 6674896 6873522 7004970 6996292 6984217 6933897 6885568 7523876
14417 7523876 7692521 7466037 7852353 7796903 7837451 7715889 7989145 8237765 8506724 8317204
14407 8317204 8656634 8735553 8724886 9020635 9215674 8888645 9425151 9583190 9732723 9930039
14397 9930039 9798059 10427377 10186143 10388269 10844785 10710050 10975068 11583006 11649697 11675911
14387 11675911 11815899 12229602 12433614 12566004 12936062 13390547 13559239 13670629 13673406 13919177
14377 13919177 14235046 14457353 14879848 14907072 15358276 15888094 15967641 16584522 16489805 17052896
14367 17052896 17436193 17935122 18049846 18655420 18920422 19129353 19741223 20096965 20308691
14358 20308691 21093743 21457750 21918013 22665516 22686845 23445040 24015781 24314628 25048642
14349 25048642 26005581 26286378 27133389 28093203 28253111 28990345 29792516 30913204 31571535
14340 31571535 32470717 33764990 34335028 35292536 36424879 37420651 38756258 39980437 40828993
14331 40828993 42261257 43507309 44616960 46391883 47794065 49627627 51125245 52761340
14323 52761340 54506309 56456483 58609704 60316803 62664136 65294640 67627304 70319232
14315 70319232 73453375 75922414 79005768 82137352 85775175 89174098 93218542 97167502
14307 97167502 101775744 106199303 111207784 116199243 122059880 127381933 134052924 140585654
14299 140585654 147668862 155528052 163490040 172116635 181615156 191329525 201455850 212499786
14291 212499786 224184135 236456534 249716520 263332702 277533529 292679429 308404025
14284 308404025 324605985 340902153 357547728 374545924 391148342 407105424 422431005
14277 422431005 436519405 449302891 459976818 466821194 470030837 470556420 468822165 466531739
14269 466531739 464830067 461662141 457592329 448552010 437141973 424308010 409617963
14262 409617963 393450216 376921113 359976521 342728254 326088723 309796461 294334653
14255 294334653 279764772 265003740 250971970 237962693 225413656 213549288 202334961
14248 202334961 191975437 182133289 172890774 164332599 156513255 148573673 141127615 134467195
14240 134467195 128016941 122558797 116781968 111765929 106691217 102062548 97273215 93556315
14232 93556315 89785896 86338667 82550011 79408288 76141786 73062199 70208449 67685775
14224 67685775 65427391 62748229 60369952 58384376 56366368 54574705 52919503 50952846
14216 50952846 49278371 47935429 46263177 44970886 43928139 41964384 40903811 39472864
14208 39472864 38861713 38199942 37217655 35860937 34499126 33284070 32881694 31975284 31677400
14199 31677400 30370425 29160882 28760180 27666598 27208052 26857712 26030896 25188479 24563141
14190 24563141 24130833 23354839 22882231 22410639 21836357 21231703 20863194 20458025 19315581
14181 19315581 19535083 18926253 18546338 18121532 17821264 17494566 17245537 16681238 16343934
14172 16343934 15955172 15463158 15660157 15149311 14783664 14724102 14324257 14138126 14003779
14163 14003779 13320970 13292044 13256717 12795725 12600443 12300681 12202219 11914733 11615001 11689104
14153 11689104 11461330 11505891 10995038 11115836 10932835 10499263 10100661 10223716 9912491
14144 9912491 9810837 9672239 9537183 9505158 9155367 8940727 8793896 9262677 8538439 8668480
14134 8668480 8656107 8711344 8340820 8366140 8068624 7859956 7427480 7726543 7444691 7613458
14124 7613458 7312510 7649181 7225493 6904960 6645595 6941705 6747381 7068752 6803841
14115 6803841 6389803 6523509 6362875 6371763 6109991 6272295 6261378 6063848 6446564 6075831
14105 6075831 6034829 5675597 5517286 5571501 5726340 5652734 5136539 5514362 5339299 5283040
14095 5283040 5120131 4932845 5108533 4778377 4945281 5039894 5126810 4443446 4615279 4741895
14085 4741895 4611889 4470625 4730355 4258863 4637280 4244534 4280441 3889258 3978264 4086358
14075 4086358 3925053 4035020 4088686 3670385 3723987 4131241 3593143 3784822 3761726 3607176
14065 3607176 3292552 3849112 3597714 3618645 3711338 3633582 3632159 3771559 3532083 3656339
14055 3656339 3429032 3487669 3425032 3396313 3451053 3394287 3366840 2953412 3124668 3172610 3060860
14044 3060860 3174645 3198380 2880408 2945696 3100914 2879643 2685261 2880328 2848403 3036162
14034 3036162 2864917 2886223 3083864 2595835 2826961 2669309 2846451 2569565 2608832 2224379
14024 2224379 2533565 2199640 2490197 2366359 2619702 2349737 2374081 2443315 2331417 2331564
14014 2331564 2351028 2522478 2340677 2183739 2181002 2136068 2169601 2124524 1964393 2076289
14004 2076289 2015366 2430613 2102202 1740421 1911017 1839890 1787963 2113207 1549102 2094007
13994 2094007 1844794 2001406 2111516 1828720 2855543 3942527 6733877 13615082 28003248
13985 28003248 43278702 27869467 13517146 7558379 5650619 4775373 3588021 3509481
13977 3509481 3014046 2637085 2607353 2722617 2400897 2645390 2604095 2093190 2402321 1992554
13967 1992554 2050995 2018148 2112690 2235058 2123714 2067843 2026154 1726748 1476160 1846454
13957 1846454 1921351 1815009 1581018 1778632 1877707 1772227 1891174 1490482 1477607 1675551
13947 1675551 1852919 1991871 2191118 1844600 1432911 1730731 1569334 1786906 1354131
13938 1354131 1469309 1458250 1553222 1710131 1454236 1613393 1454724 1633101 1087515 1646789
13928 1646789 1462322 1544622 1220631 1521619 1559731 1657079 1372122 1050662 1457847 1666801
13918 1666801 1449634 1217671 1557044 1353045 1423830 1276008 1464751 886370 1448920 1269655
13908 1269655 1297956 1379283 1390161 1157179 1313904 1393750 1750222 1295795 1212417 1435772
13898 1435772 1110683 1036507 799542 1030453 953638 1077529 1194143 1544894 1050776 1278981
13888 1278981 1377746 1125473 1384600 1264961 997634 1091020 982424 1337794 734382 1168752
13878 1168752 808326 1112594 1372153 1182841 1060666 1249488 1087091 1010413 996125 1121499
13868 1121499 891588 909227 785239 886145 1112497 899011 1067999 829095 883801 1285142
13858 1285142 735311 1113274 991808 1038432 799864 1075873 665112 835890 1459434 883169
13848 883169 805851 1321121 1266103 922353 924551 882812 604887 999455 753080 1204017
13838 1204017 788748 812893 1061912 1062189 1073220 773136 644953 693822 743442 772319 638538
13827 638538 872689 747368 907316 837366 517320 1147976 612853 813220 906587 956959
13817 956959 698699 663337 778542 911228 752052 1154093 1220003 546365 875410 991774
13807 991774 733492 629241 509820 604872 784264 838709 704114 537207 791504 584142
13797 584142 638103 514917 740476 664627 752760 712777 1026152 731821 1026021 774448
13787 774448 677936 788625 851204 673717 608141 724527 522054 621188 479778 695042
13777 695042 546522 302624 414305 759748 847419 790600 829447 246295 710850 260906
13766 506701 850653 321786 773069 433770 617787 563084 749229 907560 711544 991362
13756 991362 617010 249414 561144 463906 712296 497858 628731 705440 731217 485261
13746 485261 620582 669182 588941 532073 494906 457404 529617 214098 445594 620848 609021
13735 609021 162670 513132 241063 593796 844890 501617 75281 673952 637024 551868
13725 551868 660262 259540 1169945 615637 608012 106440 590381 495264 663551 367947
13715 367947 515326 292505 752386 369595 515644 266475 712298 461175 306995 302673
13705 302673 367557 540242 499754 512304 464581 666141 503530 450416 327622 598111
13695 598111 380214 545394 620261 226121 595985 579576 880135 1060 578722 664045
13685 664045 389522 418490 510054 614393 355106 445383 300676 542472 368719 779034
13675 779034 172758 388672 679721 62482 477051 322120 233765 194874 318918 522069
13665 522069 469256 177734 301691 603236 612057 446071 535032 615293 571861 425180 233026
13654 233026 438247 229016 244979 495780 190409 431606 271822 374730 228093 418693
13644 418693 390650 955021 279316 665404 477835 244999 476405 333604 277825 360373
13634 360373 456983 304918 289911 608752 353570 509213 284787 234394 525411 632151
13624 632151 478528 505087 428775 143892 184241 204289 265388 53223 392405 186429 467397
13613 467397 216912 590107 358794 235766 319258 519564 296742 547235 415269 467919
13603 467919 457611 395926 330536 391929 166254 99975 231890 271357 564762 392714 -22952
13591 222971 350128 343045 226662 251486 293589 273254 183349 480988 206978 -290715 208104
13579 235103 488316 332880 320618 261197 373817 569393 366734 351703 432299 435890 295938
13568 295938 337753 163708 274001 140871 456220 571669 176497 -29327 38199 419554
13558 419554 499986 175136 221297 51963 198622 644498 244871 347810 440672 279339
13548 279339 130552 297619 -17848 12465 444572 234102 103624 253519 -75082 13342
13537 31492 309700 222542 28157 280418 -23263 350967 477453 453144 342834 602872
13527 602872 137083 299362 319533 331667 319018 245629 105284 4340 175082 147842 127077
13516 127077 270845 371224 148815 219749 -60214 533693 78560 384031 67850 476732
13506 476732 298754 60831 113421 24762 256375 312905 363491 306874 420834 172929 140424
13495 140424 358673 73570 181450 66035 216581 147282 261911 118689 671220 90966
13484 237473 275418 82080 73228 349548 -208475 376312 52864 249496 159687 193164 635284
13473 635284 386157 237431 132481 144463 864 147292 -46081 72902 156750 204178 351290
13462 351290 -88119 284760 24921 200515 377669 374817 491319 120915 269736 -70106
13451 140450 315381 270163 233317 197331 378423 82262 -140766 54113 -61920 389915 284489
13440 284489 315176 -166878 293408 123594 52098 23373 272867 137985 310432 116623
13429 -146801 301046 82205 123049 227943 199462 255319 359965 -70461 273972 139304
13419 139304 486239 390260 -69219 370784 -12490 46009 300169 216742 226986 109283 125358
13408 125358 218842 -46228 17738 622069 -175635 147293 136059 151394 270491 -171974
13397 13294 -90396 345541 459468 351085 -230211 376583 110210 21087 112871 -316747
13386 108843 202696 162307 190303 584900 -24864 280786 87116 335770 -42432 244544 243414
13375 243414 226288 5866 3291 213008 352504 -74333 513218 369376 145592 123871 497504
13364 497504 171828 322979 63996 407211 154393 102238 317868 495880 -24121 82106
13353 191660 207204 -178077 -191601 179199 205733 103164 233753 46641 304579 475530
13343 475530 276713 417470 145214 143336 492426 2666 280586 4853 323362 -129532 252246
13331 452715 131423 83680 257625 279829 -82699 125345 -163254 201356 198110 491492
13321 491492 257356 40318 189958 340695 307764 42432 223755 193466 102156 116004 65113
13310 65113 239534 414966 468783 285458 298506 72238 72922 428004 350790 74042 198106
13299 198106 24526 256165 146170 136363 214546 20437 -207307 46096 -54731 31959 -26257
13287 396582 233053 94443 169197 -38663 -178371 41384 51975 49792 -50044 259110 201466
13276 201466 268803 313122 -158034 322179 187572 365223 144634 22975 179089 179174 -34676
13264 11756 37525 309080 -191981 -222826 51885 994 117071 -160856 -129925 186634 264577
13253 264577 65042 105044 253009 406512 -213593 -16797 -41890 24092 -122853 26078 216635
13242 216635 31126 -57513 77051 315464 175356 242717 6992 303935 -135901 252835 -156389
13230 -8150 26828 527 204314 -29991 -75799 -377439 102943 187405 78094 298895 48257
13218 77369 32071 79354 114649 -103660 544587 -34410 361532 -30327 -214443 184692 -123009
13206 89676 331176 401661 342893 380260 -15044 -119321 134128 27327 -5388 -25576 156076
13194 126668 199913 -243136 67248 110506 204813 181156 -222742 -59509 113904 -298957 144047
13182 145859 9415 34658 229329 166565 468539 -215518 -68691 -99139 218234 109002 221297
13171 221297 438385 396176 257630 94482 -47058 -299083 -57545 78154 180776 -2141 207851
13159 25702 23441 1937 509680 109806 -75383 -89535 -28352 132660 170425 32696 205326
13148 205326 23254 -34849 336179 -58128 -158919 91676 -55478 -329710 -176852 -1752 9687
13136 95040 153771 413887 142620 -132564 9251 302330 154467 -156171 182372 -279253
13125 -94689 283850 30664 261634 83594 247679 174032 -142806 141797 98868 508464
13115 508464 -31525 83288 -203212 201990 -124004 51528 -86481 205927 -142461 147833
13104 -10833 486173 257346 387258 -166734 151255 48950 -198384 -253464 79394 -283459
13093 37122 94827 -87454 -22251 -68020 114259 178232 -104622 303660 42984 -247814 38041
13081 -372991 121694 106180 -114891 249771 -159871 -101486 25510 112414 -313146 258033
13070 -133089 -253794 37922 44600 -71602 438265 58762 544007 271462 165604 402052
13060 402052 91964 24700 255949 176270 439106 330839 54145 201767 84830 -211880
13049 -253662 64661 135213 210579 112941 34916 -59428 87828 25143 360122 335756 -17328
13037 303941 102682 28990 279434 266092 147106 17550 -35962 220038 153737 -155844
13026 -144773 6585 -36095 -37914 136144 65446 -100101 -75893 -23638 185767 312521 19180
13014 382840 123906 162958 164600 106480 379488 242931 -204637 32575 201384 151940 -22875
13002 -172548 61274 -72615 17782 308128 170969 284217 26572 186074 -97192 269327
12991 -3286 -193297 -34845 -24483 -41642 -25745 7092 -63805 127983 10895 194469 118306
12980 118306 6192 92983 18892 118344 52267 101695 215114 -59460 148572 66840 -323248
12968 -64885 -402120 59032 261374 206282 85734 -250062 435602 132217 85108 -139427
12957 208572 169417 -164 323365 -97942 483167 219099 -334078 -189311 -152552 256188 -106059
12945 106145 -60261 23618 23844 132486 273631 -29705 425128 106822 29117 131473 -364479
12933 -130204 156273 -5399 141698 304229 115152 436125 -1183 190892 112093 138470 81949
12922 81949 -29127 -117039 -102949 -125273 -202289 179385 341370 56560 -139113 224978 60290
12910 -54267 245055 100081 -15299 -146195 336693 134116 30959 5848 52766 -45607 -137790
12899 -137790 -142801 4029 146375 186241 50439 -79322 -25393 -45338 -85974 -177578 204147
12887 -51030 -155229 -51026 123858 -50631 131266 340658 185683 516691 -31698 -118879
12877 -118879 101669 -122263 -34860 159101 -262296 10200 379905 -99993 3451 246795
12867 246795 -291626 -223707 175160 241917 70669 138437 131764 -125912 468930 -270412 -73857
12855 -84540 -5460 16325 -11178 127101 113638 472277 92666 -158031 369813 -177789 167572
12843 41152 -304910 -23401 97502 -2365 -276982 86104 -201468 661 -47249 142422 -92887
12831 388890 -99765 34140 426678 -301282 86290 229127 -155541 417742 -37319 -49121
12821 -49121 219 -78708 69227 -10386 105648 -160641 -262810 -87137 125880 49112 104410
12810 104410 148329 114915 91354 80813 -228923 -160130 -32913 84700 -71625 -5579 -161636
12799 -161636 -98479 80660 -206017 85808 -178292 64787 -152649 -96227 -333803 -15314 42001
12787 -142634 131835 66857 -50629 87356 -31812 -91652 341219 46566 -85835 83479 269318
12776 269318 -213729 319591 31592 203474 -11286 112495 -14214 21445 -327709 105199
12765 -110977 -7925 -148080 -110024 -136783 70773 -16635 -224152 -113151 -12993 -135861 95608
12753 -182432 166764 89542 159686 -80801 -128993 131357 175970 -215375 -86611 181400 -1922
12741 205537 -280112 -55189 -263456 226012 4945 52593 115942 -76051 -5225 113433 121571
12730 121571 -75973 -133355 152553 -205846 335825 242960 151992 -65264 48797 -29393 74679
12718 -77560 -312441 71492 20215 46237 84994 24264 463872 470280 -216329 302242 141066
12706 304283 190068 283215 -98976 91270 -13209 300646 100524 -143043 268636 -161612
12695 87060 -309416 -101530 -122089 57937 -310727 68968 -79615 43954 269809 146879 156970
12684 156970 360094 -304971 39649 300231 140011 171942 -80120 78826 259932 192348
12674 192348 222006 47223 -153555 4794 164380 22597 30670 355420 -82945 218749 136519
12663 136519 -19536 135838 100655 -14600 -142868 -422907 261274 71196 149007 169640 189899
12652 189899 161240 247843 452090 -57529 418459 10051 116743 60874 113333 -173742 72593
12640 -156305 -12239 45477 -30653 97039 315928 -189378 409736 -237493 51292 165750
12630 165750 111053 -58351 96004 282716 129622 90179 128815 162935 327908 45654 -23297
12618 -268667 98040 163079 122892 -123036 236387 304895 -14101 14138 -20842 258968 53740
12606 -162827 44059 96357 305115 110504 80429 141510 340929 65560 -408996 -139462
12595 -246561 51274 102073 310237 -59290 185580 -254707 10324 -262463 -219224 -107469
12584 94781 -379153 110958 -182022 86557 120676 309616 140378 -87733 148348 -14230
12573 142420 331678 -44881 -190033 -184956 251984 72021 142870 31796 239713 -147812 -1798
12561 -268842 43726 154501 96036 84180 26637 -126001 73623 -42660 53386 124304 -49105
12549 -96098 42239 -266972 76974 203178 -113702 483854 38310 192393 127185 -243618
12538 -228176 -78330 31141 253300 -52494 -229054 -129532 110292 36830 -197378 27216 201549
12527 201549 108378 -75930 -76011 -20343 33799 -177171 -272138 373722 198896 83035 259814
12516 259814 -265476 251039 -328210 -280606 182284 -308541 233514 73657 188812 -4242
12505 -404487 151172 30740 37795 -299963 137571 -44468 13375 126254 288518 57147 358920
12494 358920 69732 179832 -202477 52711 -7684 40164 -465562 31219 -256411 183976 182689
12483 182689 88583 -3469 -81571 -256274 519758 -24160 -323903 -60480 337340 63476 164948
12472 164948 -57628 112089 95694 143392 339221 -154238 -201205 182939 56793 150124 -67543
12460 -8796 -126285 341349 121817 11876 47868 -173415 44141 -27961 189884 -38153 -63398
12449 -63398 -308050 -36854 179073 -36729 94541 -115949 12414 -126835 -96499 247762 -187494
12437 -30902 145078 16488 -39405 -252951 -82001 130559 -78811 -153413 -220679 -148030 -525318
12426 -525318 -57711 74715 206166 123703 41760 219660 74861 -41333 166040 -30431 -43817
12415 -43817 -97793 96681 -113352 25273 -43871 41873 57042 -1157 108196 12895 -12217
12403 207709 -299569 -10969 -12707 -113372 68036 -188206 94595 134441 -414067 -162042 111572
12391 -324112 -248062 -305979 -177282 7226 238443 -33918 265604 -199984 17623 -407488 234703
12379 -77703 126137 -366 259959 171163 35847 -19563 -90179 181779 -118961 -143169 134500
12367 354804 -299109 133538 309357 -153377 -200372 -335134 -37156 -100531 -46491 280600
12356 -90911 2182 27495 281943 93874 -262086 -17137 294 -127594 11217 -128269 -147618
12345 -147618 67931 25834 34860 -25617 242228 399315 -43064 97123 258894 -22663 254965
12333 23116 -49667 -159330 -337332 227238 -152174 -47228 70622 197636 7228 35053 -323079
12321 -91220 -158387 -134730 -192678 294469 -305008 -85151 247629 -26028 82661 -113311 -117126
12310 -117126 -97903 -194459 53902 165444 23080 304286 224005 370758 -47637 8515 37854
12299 37854 124402 252288 218209 -222530 420439 111036 229712 116682 15012 144453
12289 144453 13654 192065 146438 -268621 179948 48510 80936 -197929 -112048 374754
12278 -45213 454114 448315 -106319 -9690 35836 361992 354475 -18452 299182 -24611 -19599 -137901
12266 -137901 -220516 80990 -48642 -2616 23535 -281194 -133432 105987 -170853 54720 77767
12255 77767 310984 491701 82944 298934 -107043 24516 296462 -284957 20682 11680 107462
12244 107462 -278295 157749 -77613 -254718 201595 -13011 273020 275665 117906 87321
12234 87321 -69532 -102357 186167 71370 226565 38728 -34703 130052 252823 227523 427293
12223 427293 -219832 244483 -2800 25175 597678 370233 226450 90214 55933 671927
12213 671927 1415 -15042 -132754 93742 98491 56786 306964 31338 -101959 141987 132631
12202 132631 -1979 366572 206985 -199706 118313 138926 262318 291688 213992 27324 112002
12191 112002 125334 281487 44932 62601 185227 -103366 126931 98906 38303 177572
12181 177572 -49713 508442 180681 59012 88088 32753 400302 2041 21231 219707 257022
12170 257022 149669 -118409 -73316 83986 306583 155662 -197836 -222838 -173846 13174
12159 132251 -81001 -104190 127928 -31320 -20563 161105 -147211 211227 6658 49905 164280
12148 164280 330517 57130 35315 -118200 239538 266973 57174 2859 -33966 248084 -71710
12136 107491 -90566 -21354 21960 -135769 -84707 24867 230330 -92996 266503 -6125 -173743
12125 -173743 -283549 379843 217651 104661 -137649 282269 14622 -30537 -82217 -30585
12114 65509 -44928 305174 31435 -138419 -142476 32719 -80731 -34069 -122297 -2251 5079 85001
12102 85001 -310100 -96724 42338 -42270 87138 -321798 -246470 148542 385837 446407 -129111
12090 -93961 -210646 177610 363685 -183231 62197 121850 12084 -64779 13517 -452751 -9078
12078 -185541 -15593 364136 322295 174532 1261898 2026480 889781 244378 -6442 -349721
12068 -349721 -146057 110975 40960 214334 196606 -88399 28640 214328 -126797 -98506
12058 -98506 197050 39138 -146236 148676 -89519 -83828 2337 -250667 109484 -372479 -201610
12047 -201610 48351 -193093 -284993 92034 -7156 87704 -396348 -148218 271165 122755 173360
12036 173360 -121127 -109833 287 231137 53030 -336914 -147045 -232469 -70781 -169357 -73752
12024 -156472 -109694 -115357 217782 -262435 307954 -91514 -91389 112719 -106850 -4183 81191
12012 -6829 270244 -24295 -382941 -327725 11586 152914 -128767 182228 147910 398061 -19737
12000 -139156 62523 -70164 -123951 -223137 72083 136410 174489 9357 -40059 -223942 182805
11988 -138452 390530 93398 -126447 -17318 -14513 -86697 -26823 -124819 -6379 114290 51878
11976 133182 -3871 54939 -107847 -214626 100358 -119388 -106862 84627 -98855 122831 4101
11964 -7110 24777 3942 150917 -259407 304226 -82109 160760 424682 -113296 117491 -452007
11952 136809 -178730 45350 91695 -369012 -76160 197377 52478 -146217 124210 -226875
11941 -246091 -12510 377 -145468 -194570 53086 70207 -324523 -39696 -10348 80970 58824
11930 58824 -357549 95186 108171 -112901 -73737 -164200 -146360 -240532 -138839 164892 204842
11919 204842 73942 9507 194317 -356735 -33458 244206 375227 -139871 -423126 -72706
11908 231520 -355944 -5251 130692 22781 61587 -29860 -584780 5886 265646 -115971 -36479
11896 -169271 -200168 -115450 -44763 202725 26528 -95004 -162474 -40444 -203695 242315 -134805
11884 -24336 81621 -460289 -249741 -107576 -19404 -104322 -43522 -229223 -304485 101632 -251952
11872 -156590 390361 87422 -382369 88946 -133694 199335 -16940 -69122 224359 -179261
11861 48103 -157230 -248583 -105958 303094 146620 31599 -142771 137629 133450 -53990 -131050
11850 -131050 68862 -63710 21606 -427509 116978 198466 25217 -61906 -4281 -182994 -1664
11838 62754 -81397 31977 -276811 63887 176641 121852 161582 42815 -350084 50146 -54541
11826 -11819 -193053 172748 -299890 -14378 98166 -102664 104460 -135722 -179960 -67084
11815 67236 37096 43750 126743 -158601 73182 -446040 -272825 254198 211797 -36933 -136995
11804 -136995 99561 34312 141138 260344 -47550 71074 305813 -23463 -18882 -193169 -115249
11793 -115249 -225668 -343407 -554503 75103 -4441 -216562 -12448 -53543 -141274 -52000 -138006
11782 -138006 254314 136675 -422939 36594 -411602 167726 -145270 -268097 -81449 37039
11771 -42327 132468 35092 108734 -150188 -184130 -39544 -16786 54795 44629 -54622 85402
11759 -71418 38872 -183058 -111134 114004 -683 135817 -162694 -45810 -76267 64375 -126696
11747 94519 -53514 -24358 19085 -67148 33421 -10177 -336634 203930 56677 43705 -111174
11735 134288 110770 90020 49797 -59097 161302 -98843 -63572 -52849 -82604 150659 14012
11723 69901 -83155 -239136 237961 6820 -134787 -202713 -36691 164915 178234 -153254 255658
11711 209570 -156291 -41555 178373 -92222 -34308 222830 154232 -113618 -43540 263393
11700 172447 62929 -95968 -31502 211168 -290133 -142193 92282 45792 -106212 253643
11689 164259 261543 -83795 328230 18880 -68722 308589 -31323 -34822 46304 -142832 -70522
11677 241154 190117 -172101 -238075 83617 45474 24540 100620 -79842 -39704 -222200 15179
11665 110351 -6654 217494 163922 -73670 -8357 111814 37765 150522 -25842 184429 -139774
11653 -198476 -309313 193198 128311 -150330 156699 -93501 -218547 -204127 83739 29950
11642 -75176 -256998 327986 142607 -80962 -82562 140106 82043 -43278 187663 2210 189107
11631 189107 3333 71312 66322 115784 278604 168855 13607 213185 143145 116372 72936
11620 72936 166948 -25500 109965 23136 107754 232842 -80624 -3244 116935 -323795 283671
11608 -574482 79618 -284334 211248 43168 34759 -4017 341848 16367 212480 139296 -34324
11596 -24459 46953 216798 145150 -116493 235081 26522 35819 346372 341187 289594 -108100
11584 192807 -196889 -252875 132384 342317 29413 -283017 7858 1233 2012 123931 244650
11573 244650 38576 408 422376 -35906 228266 183085 -56576 299203 -49592 219540 117550
11562 117550 -223016 686541 34927 149341 -278803 199342 264101 -48374 -222655 -118257
11552 -118257 -226435 201891 416969 -187882 79278 -103304 31444 34398 43716 44843 130524
11541 130524 324556 16411 -1101 234353 66233 55755 -138192 -76800 122745 165548 -100588
11529 -5047 153074 137233 16521 144986 -127527 -175784 82751 147056 60027 -41335 252356
11517 -39432 -52108 294919 265776 84209 370766 99313 107194 380795 290675 88725 -30086
11505 150581 97228 -92982 156537 145802 253391 114015 -194522 -181201 -39637 200236
11494 375795 230042 36314 -40366 16996 124848 14823 44771 146971 144592 208475 92049
11482 316895 61768 -30528 -73426 375811 -234799 299980 -3212 173698 -24253 264397 -36592
11470 338632 284730 165015 -664 17336 175998 368967 -109369 101640 413251 -44302 6380
11458 205287 308961 280857 -98201 74798 92575 34071 262878 125735 -257646 -129574
11448 -129574 238648 148294 13850 136047 273021 285612 329869 162430 33067 -192738
11437 -59905 -61373 247942 -18047 -33031 156773 63807 82249 15297 -89041 -153673 138323
11425 -3908 -299 255580 -109445 -199973 232999 96811 -29457 44933 211197 -321619 -206722
11414 -206722 -3749 -85427 219093 198865 170238 -142012 -150936 -159592 112308 80175 128413
11403 128413 49857 -190043 -69596 525226 123318 -220705 163689 -267134 -199471 -15638
11392 21505 -421732 -195033 129420 119435 212088 -179026 -110923 176609 82437 19221 -170515
11380 184191 8370 323682 367231 -16719 -89228 209121 -156719 35783 58184 74975 -29336
11368 -196677 207634 -396193 690 381595 -413827 58188 243696 -24213 50854 -154702 -198943
11357 -198943 148966 108603 -31208 -49474 54503 -43785 132653 -205231 -179063 -502261 -19269
11345 -185954 137158 -337888 31202 319231 206844 97863 -171620 -310721 -282721 -8444
11334 287364 296644 -21411 44941 -98935 9479 -178801 55014 212307 36258 -336588 -144052
11322 90544 -20953 -107107 -164858 157283 -30475 -408593 -280767 88081 -162460 -144706 163258
11310 185709 -24498 -212990 10116 -341610 -163123 86616 -321625 -67219 -187178 45738
11299 3239 75911 28773 125425 246346 33103 222253 -99331 -72116 -97363 266904 -181054
11287 220726 112732 -293359 -39351 39531 -51800 -278257 -140054 34427 153638 -200399
11276 35692 -257000 -56061 -48542 -146425 -35999 39035 -107744 -91029 -48211 64101 69498 -170168
11263 -207975 -322234 -61314 83257 164402 -6215 -132538 -140972 283218 100582 261465 -170589
11251 228240 -186343 38533 134549 -112797 85362 77109 150214 -264267 418448 -162580 -285949
11240 -285949 -81839 80756 83535 82862 -11349 -206183 272156 -79859 -360655 -359222 -269815 99625
11227 -29088 -458582 -169648 -261822 -3251 71662 -97807 -191249 -116185 -90 245143 35985 26991
11215 26991 -245165 -63659 161522 -192155 93701 -62223 -313246 146309 -261206 109631
11204 -75070 -467464 -19172 107306 22120 152052 -12588 52937 246272 -169607 59295 10290
11192 -70548 108116 -213333 -261653 121856 -256310 -331474 97017 -22311 -152647 -209032 -65848
11180 -177609 102053 -219795 122847 -85279 266932 200483 -19184 215730 -66191 -130182
11170 -130182 -304939 -97769 -110288 159354 174106 -48982 28991 102753 -211285 -200158 228252
11158 -318661 242573 -68155 171246 -249554 64929 -244646 -372356 62612 366816 194996
11148 194996 -77093 97160 8503 -19207 94726 -81412 129947 20395 36484 -25996 12767
11136 -98910 86364 -164007 -7216 -426771 -117292 85753 69184 377639 85584 -183506 -123283
11125 -123283 -33685 -315326 185079 166537 217515 80043 153815 59635 -214056 -189999 151000
11113 -96602 -32486 -32078 155564 -88732 30101 22471 30918 -62751 231303 -45389 267259 -85380
11100 86527 398868 386703 -104831 148342 192154 117858 -38017 232609 90143 39945 75504
11089 75504 -80842 307427 181843 157131 -17280 441800 167694 -36214 46133 117424 399423
11078 399423 251548 -60987 309315 411604 245637 185510 504266 35153 10672 481575
11068 481575 145281 39952 344777 559278 481562 469118 569715 633286 446103 756183
11058 756183 748931 397965 554673 350341 371732 623976 833188 312920 724949 354481
11047 698940 674924 914787 701881 751362 456817 684192 563646 834405 646754 654300
11037 654300 542484 626309 577053 467417 661098 613364 532560 453820 412647 406156 1022773
11026 1022773 953450 671520 588073 792964 495635 482923 693797 378778 461743 415856
11016 415856 532025 744001 388562 668517 698456 855107 488153 380166 499235 129553
11005 537198 386043 620664 601551 500088 153537 729304 566764 765929 756235 673783
10995 673783 727504 719044 554568 654058 667610 473293 406548 861236 564738 687148 1098281
10984 1098281 1018899 876376 938713 864607 1004199 1259892 1330279 1231049 1746874 1880987
10974 1880987 2106449 2384707 2222431 2463477 2169539 2427913 2430065 2019124 1725345 1538434
10964 1538434 1545379 1352836 1306956 1302733 1626428 1701191 1697454 1587237 1666046 1639419 1177063
10953 1177063 1123347 721097 1287499 677496 818095 696106 656070 61643 77166 170455
10943 170455 -99884 171410 -51916 -16175 296330 212577 60298 5199 266469 311076 -195250
10931 86871 -8124 -28086 -219434 -111074 56778 -238964 218572 -31787 -102641 37316 150456
10920 150456 170423 40709 404434 -52603 -152246 -230474 66040 -63770 -132138 -345855 -61745
10908 218644 173066 270709 78183 -33361 -121001 48039 -41530 214909 -100043 -54699 107810
10896 -43523 -38764 19080 212081 -96533 -177496 -115607 -372796 -170476 154296 -175435 173544
10884 -10708 -413568 -160535 431882 -77565 -96469 148458 150139 295052 -100917 -198989 70548
10872 -154546 -205169 -221254 15406 304754 -28028 -16543 -237887 22320 -43754 -106692 57999
10860 26892 -235061 44866 -19561 -384164 172011 -284555 315799 -84022 -88421 299176 -114879
10848 -185758 -96481 -11773 22060 -55617 43894 200077 -114384 8633 -28466 -79998 -95357
10837 -95357 -51280 191855 -252460 168386 -165881 -325030 -273018 -69965 -394549 -137346
10826 -64758 126755 157160 278855 197604 -34270 -51075 72769 204914 -70865 -234168 -31798
10814 -35674 -113015 -158703 -126389 -60012 -142527 145473 -237803 -63512 -360041 11326 -19445
10802 -11276 24717 -5740 -134655 -132511 73018 61216 -216111 6368 -98693 -32276 -194132 -144093
10790 -144093 149458 -126409 250478 -129502 -187843 -192233 65278 -138419 -124892 -274295
10780 -274295 60278 -256440 241578 222657 -39861 -5665 30718 -102798 -225009 35727 109550
10769 109550 -54209 181239 71080 -217820 28141 14163 66363 -36898 171027 -265975 -177463
10758 -177463 90906 2447 -172331 -15483 131082 -259908 23547 -215627 -37292 -72205 -119683
10747 -119683 222114 186585 209298 84600 -179997 -99163 -213903 -151343 -199634 -193848 -112975
10736 -112975 2280 -318587 40704 104110 -195544 175278 -70436 -512244 -130156 24308 -20668
10724 -236196 -34515 -192830 71956 -430002 -6703 -364501 11132 -269520 -216760 -161952 -250494
10713 -250494 87893 82216 390934 -75418 153885 42178 41505 57752 -45893 73870 -357467
10701 -8390 144904 -366394 -206951 119279 -259379 140704 195038 222339 365912 86815
10690 -211671 19697 -5196 -115589 20441 -315805 187213 87127 -134784 111833 168748 -123025
10678 122536 -215845 29865 185430 -140893 -88744 212353 77841 324634 -5547 29593 315327
10667 315327 -21119 -58943 -24113 179307 -194701 -116289 -32949 -234760 -336354 26200 -29456
10655 50043 -120174 172951 -290387 137881 -14689 97326 68763 108612 -158516 -160729 65406
10643 -86974 -312147 -153395 105998 28298 -229117 186244 -139986 -237508 -36338 -315586
10633 -315586 42680 140114 -114722 -91608 -267050 125286 70453 -30275 -73481 84110 163679
10622 163679 -201877 -30039 36095 -251168 338861 -414204 -223631 -5928 70240 -132333
10611 151783 77330 131114 26068 518690 41080 -85041 -154675 -55938 128915 204771 -141650
10599 77225 -75540 -239555 -204017 -164802 -101924 -115440 -129280 205560 -236343 63354 -280286
10587 242553 -208257 -6247 -488665 -113651 76692 -86877 -141696 -180141 -143924 153144 -130906
10575 -290479 -53467 55406 -115220 77657 109453 -140178 239674 37378 212613 -225610
10564 -158236 -44852 305956 202945 -20296 -195065 -140698 -21991 105310 -144453 -204187
10554 -204187 -45712 114853 -154762 141905 139558 79247 8791 -281295 61812 -25254 43912
10542 372764 157617 160978 34873 116977 -88407 169085 49420 -303094 256174 -238539 -20169
10530 71376 193394 -29908 124968 -150927 -341547 159713 264491 34256 163448 151757
10520 151757 -67052 69849 -103629 -168957 -124767 -27152 -47160 -40926 -149506 156286 -74683
10508 -114148 -185612 119001 -196017 82661 -131719 -10111 -218902 -423413 -54012 112297
10497 -22006 36706 -1203 344707 -80682 12419 390739 -159551 9577 -107057 -292496 134072
10485 318440 263632 121592 259460 230113 158850 583058 534134 389934 34336 87277 -103772
10473 141243 39129 -108311 -510410 -267549 66517 153531 -81323 -171330 -285327 129873
10462 -172384 160269 -50358 36434 -141429 157381 -39708 153949 -388637 293438 -3869
10451 -145600 -81359 -90981 15816 -58146 -100574 -52788 -148176 344428 -105101 270217 -7908
10439 190336 -171670 114165 13647 139102 114391 214850 -142549 -379053 -188119 88639
10428 -30319 -24423 60279 -122078 15694 21334 55844 264612 14093 -76285 -294268 -27143
10416 -380427 -65422 100978 100388 35636 -137191 96945 -58991 97851 -216923 105445 189572
10405 189572 161260 -66619 -73779 -138147 437936 22779 -89100 -165917 -105254 293936 176095
10394 176095 208643 -121945 66745 64810 71830 44532 52338 42244 187201 54930 113383 124046
10382 124046 699 -109382 338158 51428 438717 177512 -57525 481531 142539 -141804
10371 -62667 362499 22814 50651 224370 182570 553817 100569 -209471 184820 43228
10360 121994 227205 -64813 339124 54124 281893 83925 188611 184272 105909 774828 350074
10348 221647 202716 130643 180167 249675 335648 -3025 -71445 508963 156201 103948 545588
10337 545588 288687 148753 27139 30513 430800 -89633 -77511 377477 -95867 608778 201531
10325 -74699 260388 56290 207951 241970 401846 -184764 218959 109153 -408246 -121597
10314 -2898 -13616 644290 389800 2752 -95438 82178 -37634 160508 -222382 -38495 -46882
10303 -46882 173317 -321102 -15291 347114 35305 -107929 -347263 -161942 134126 58796
10292 -121665 -25366 160136 111511 -145552 71945 22432 -1497 23511 210835 250994 -382651
10280 -101709 123643 -324879 32876 125105 -372771 -121237 155946 -107702 -152539 -193536
10270 -193536 63174 -96302 -119140 48048 312531 95317 -16343 -104616 249811 331857 232657
10259 232657 254332 178719 131257 399636 44437 196797 68496 -28774 -23454 91839 -120997
10247 -164797 -343188 -123871 -421423 30522 -130753 103073 146804 -138447 -64983 120181
10236 -15565 9669 277369 -500011 292381 -141762 -80103 -66439 -18671 11749 181661 106631
10225 106631 -200733 240772 -344136 78815 -175841 -210727 -203960 -148970 -289407 60999 -186755
10213 -424346 -128536 -183534 -73871 -158898 -411406 261415 17482 -282066 61384 16037 123067
10202 123067 -195113 21503 5644 -27733 263902 -53463 270039 -128706 -152836 -127411 -346438
10191 -346438 -22551 -311987 -148402 -128183 -33859 -156649 -109333 109042 -148824 -145401 -112521
10180 -112521 -141407 -117124 203335 -243839 -201715 -65901 860 -373386 -165776 103433 119995
10169 119995 -18563 -91452 -8611 60172 6085 -12703 -3722 -153341 346980 -108801 -34178
10157 -130685 -10458 5108 -52011 227530 -247583 -484261 28710 -45635 -140746 -235053 149490
10145 124279 -330833 -272683 21776 -351 180545 -81610 72134 -44802 -55287 -144199 -149928 -28695
10132 187825 -104184 -229038 239474 54685 100553 -244062 -519907 46866 344158 -69212
10121 -272599 -609449 21722 -150567 -43207 -92249 -7412 213292 134789 -342188 -284875 -416296
10110 -416296 -301004 55936 114235 -98565 -201801 -195972 -51100 -3952 266240 -102141 211922
10098 -192539 65757 158318 138187 -194181 -181295 26537 -11359 259074 -79983 -196734 271651
10086 70453 238555 -104490 -5836 -6944 36151 -58919 10226 -58184 -38613 -88407 -252967
10075 -252967 30604 -254346 109891 36181 174300 -350058 54054 59569 86286 -226407 6206
10063 -23841 -103859 -84634 -22072 251568 -83504 -259291 -294698 304296 -30191 146614 71713
10051 38460 -121440 32994 -125835 51649 -223947 37581 37989 118093 79312 78640 -82220 -125793
10039 -125793 -93205 -128560 -511377 -376202 191704 199415 -124094 -220025 234176 260734 25421
10027 -301881 65068 -100641 159495 149030 -49566 -241369 181401 -127120 -111474 242206
10016 -547141 -232262 8530 -273439 -203443 208845 114544 -43706 55683 -183568 -302164 -2625
10004 -89734 -86734 -163415 -92385 -77405 -477875 -34639 72856 198423 -279853 -87412 -180309
9993 -180309 -55467 -65093 -199136 -143063 50360 -92069 39791 271891 -100085 -126708 -120268
9982 -120268 -149844 13128 169017 -184118 -433151 -252987 -40234 -163322 29840 49424 -279776
9970 104717 8008 -380100 -125546 -36874 134974 -303127 -122150 -100374 -78596 -372801 141584
9958 40829 368886 85413 -63307 79160 -217451 -112842 50920 35992 -58363 -242560 -17695
9946 10776 106303 147351 54218 -360717 -52237 161708 -325964 122523 -212279 -63344 -172454
9935 -172454 -116936 75878 -64376 -87494 -135908 -43534 -135235 131220 130956 -91361 13458 91684
9923 91684 -245473 261126 105552 -272778 -16033 -167766 43883 -215675 -22833 162031
9912 -4661 -241680 -189525 -197490 49008 -157386 -19651 -31135 395165 -173043 -143616 -196846
9901 -196846 -210715 -54324 -126783 -194081 -15559 194570 92039 108759 310033 -375099 -139432
9889 -318146 -68497 -167719 -171264 179957 -202973 -171560 -132547 3436 65784 51023 170133
9878 170133 -285894 342558 105009 111265 -155479 142643 -118258 102392 -273470 227731
9867 -44739 85887 6312 -17234 55650 68665 193377 157871 -309559 20306 50018 210008
9856 210008 46694 157706 -75186 -297975 -108184 -147964 -61114 -8103 -359714 185749 -500120
9844 -86703 -85950 -169163 -227348 -293727 195472 312868 -18178 -202306 -198940 24710 -25151 -33810
9832 -33810 -179505 487 53595 -290506 -426977 -245860 2461 -367062 -25272 -155057 -394841
9821 -394841 103400 143658 -19007 -299958 57464 73410 46693 -34534 -86278 -12801 103531
9809 -177163 -304394 -174077 -221149 83055 -217565 -44089 -24359 -184567 -346382 7365 59898
9798 59898 44904 -79522 16515 -171935 36084 -94942 291889 -172298 174864 -35464 -327979
9787 -327979 -23316 -34791 -54544 103425 22249 76276 -185929 124415 139214 153626 -206681
9775 -58735 26412 -212940 -66763 26070 -245601 -306415 -288063 -339168 -263025 18570 -324513
9763 -68418 160948 288837 -266722 -74646 -253480 -59147 167324 233368 96055 -147067 21283
9751 -106858 -268518 94739 -141863 -87708 -407295 -151980 8880 155290 67827 405707 81602
9739 -88710 -111960 -104194 238921 -154331 -69124 -141199 230209 185957 -233929 -212198 220545
9727 163729 -296285 -5067 -94784 -89550 -63232 -9880 -19897 -98411 -63688 -369871 -267519 35234
9714 -79306 241758 -238560 -80613 -79773 -75913 377234 -93991 33532 -194482 119316 -92586
9702 -6873 -200234 37596 -403 -214408 259712 -221910 -57344 25780 -434954 169683 125986
9691 125986 -192983 102714 -15773 21923 151582 -149376 -214183 6497 -103082 -75818 -164457
9680 -164457 -76985 -326886 -363140 -192747 -423519 -229080 -108602 -81197 3607 156981 188061
9669 188061 -224748 -388421 -102271 -21040 -255503 23191 14388 -144846 -293314 -145009
9658 24518 -134413 -171210 51483 -111387 -82087 8206 29856 -118334 -120409 -47224 119190
9646 197588 -221849 -283361 -23489 15449 251370 58921 -167627 -257286 -146487 -35609 -242922
9635 -242922 120994 46090 -300714 -36760 -1759 39101 -518941 -277178 -45888 189816 -174417
9623 15408 -279758 -371964 -199101 443492 145086 -52141 349689 66796 75252 -102887 -135503
9612 -135503 46327 94005 119981 156552 -151399 -14349 -20234 -441081 36388 -209625 126018
9600 -217327 -224967 -31608 -143326 -193652 -110955 -86471 108277 189306 228717 252614 -155268
9588 95292 32693 -34640 -159868 265160 -277935 169177 9558 -179288 188384 35659 -276725
9576 -354730 -147337 -103274 -9395 260153 2351 223309 322576 -90265 65178 -458014 -51367
9564 -2623 92866 -273373 -179624 -71789 18217 -113201 145327 78872 -320995 -173708 -88203
9553 -88203 -235591 -42945 -341133 68554 121911 186022 3363 17299 26192 -326774 -45812 -34925
9541 -34925 259051 197031 -113137 38612 341308 -248852 -78495 336879 25279 145465 -298842
9529 -368809 -171349 -20106 216687 -27963 -364904 -209368 -195904 -142621 -177026 4386 -42655
9517 -171565 -7303 157936 246576 424801 33445 133892 -416 -85929 -248746 -97248 65421
9505 248377 -201896 -191131 -416336 -106611 -95423 -31406 22949 -271787 -281833 -285362 -306672
9494 -306672 -140874 -121640 -138399 -192786 32152 -25389 104531 -327666 -80799 -236243 -94137
9482 -180336 -174824 242279 199473 221907 -56224 -93974 206023 21688 -452616 67397 2783
9470 468456 -140942 -397192 -77318 -57677 75224 -375835 168878 -98932 30833 4681 -199848
9458 -208425 73988 64567 275088 39631 -231904 -230696 109446 -62184 -29762 -49096 -223213
9447 -223213 39497 -144028 133187 132626 6781 151539 -165799 -99197 99498 -299570 -78364
9435 -172611 -300560 106067 -130791 161062 83094 -203754 12707 200275 39194 -16804
9424 -90163 59341 -155680 209828 -177896 -46263 150967 -313671 -424165 -71020 112775
9413 -3018 34762 -122616 -38393 -260955 -209813 244127 154559 -74061 -39658 387333 45820
9401 98848 -70837 -77159 -305767 130807 -238786 100592 -487232 -400334 445391 243244 -547613
9389 -180263 -447658 -153026 132361 5279 160715 -251567 -430780 33142 -183261 -336059
9379 -336059 27371 80762 -49784 197891 -390593 217721 52350 -64992 -174822 -372843 -199531
9368 -199531 -42644 60644 88716 -135985 -211440 -202587 118699 -4778 -81780 -195937 -335118
9357 -335118 -333494 -16657 -265831 19771 124600 149107 65970 336235 -90127 -181857 -64380
9345 -317934 -120364 -21360 -194194 537082 113101 378501 86888 94768 187737 -253999 53785
9333 -36202 158000 103647 -45236 -132525 69682 287128 37395 76151 -301047 -112614 110229
9321 -245519 -172475 50787 -201353 -229770 -335737 297886 -7973 -84663 140902 -499970 63944
9309 -4333 57173 177917 175619 -146250 -104168 91952 44227 -315873 -40321 418440 274222
9298 274222 197818 181126 -205890 -171379 138758 29785 -444148 105528 -6803 -185512 -61367
9286 -6509 -100431 107228 -2419 -439527 191697 92423 -108839 -43397 -103177 -161983 -244954
9275 -244954 31867 123632 -181628 -459648 69114 -88265 93191 -275250 -323117 -272920 153934
9263 -299315 213951 -66206 -196971 44407 -449248 -27003 -39282 61682 27039 -59476 247369
9251 -50119 32095 -310646 -281257 -139746 -314670 316011 101844 -10864 -21519 -117423 -255252
9240 -255252 221853 212572 31695 -90214 -361711 -37850 241085 -306682 -17174 -212201 269275
9228 201243 -85104 128866 -102383 -268508 43330 -209012 254518 -256227 -125284 -410551
9218 -410551 186389 -190751 -152191 -4736 14446 17134 141432 -193533 -31881 -118849 -375724
9207 -375724 -52535 66153 -50476 35573 -101619 -20673 -45579 71104 -148683 -42623 85831
9195 299614 68171 165555 -327305 10421 -120759 -160989 -538609 -51790 -228608 -396409 328
9183 -28977 -262391 -95388 -168457 106766 297685 -69921 69386 28695 -108794 -30097 154571
9171 38105 -237896 228188 19694 -228451 -244097 120669 158960 -35613 -476942 184080 106367
9160 106367 27301 -64587 -327795 -206444 94545 93444 -25998 54226 -65707 -49191 138856
9148 -145245 -193226 -207807 -201013 136663 21582 -234583 -300676 153361 52383 -83306 154559
9136 -114708 -263912 152717 -7104 -159925 10187 -48351 52709 -43766 153412 -233536 183321
9124 -287696 117609 -94196 -150688 12321 44397 -104726 9287 -35159 150782 -308783 -82681
9112 -47842 -350365 83507 -144162 -204864 50868 -50305 -62820 232183 -291376 -194052 -119070
9101 -119070 -162466 402497 98155 232399 120981 36786 -201853 -307271 -205465 -63955
9090 177666 -42961 85933 -117269 20295 -227141 121004 -191892 -80296 107152 168486 -398565
9078 -300266 -148930 -188858 55723 -144670 -12212 -243461 -118556 28308 331148 229760
9068 229760 -119163 -368192 6004 149166 113398 82761 60339 28697 -53754 -70023 181433
9056 153280 -263780 218114 -170603 -124647 153269 -237284 17462 204729 62239 -99749
9045 -54723 -125181 138444 48643 -197173 62137 -19272 -90993 -10194 153327 189177 -187073
9033 -171032 61602 64972 136808 -29804 -69728 -189151 -74083 -119007 99734 142940 696 -238324
9020 -126561 136668 265599 375231 -301610 -120679 -239533 -211971 -193120 -171752 103997
9009 -285925 -102552 192412 -221591 -26005 -247542 120480 49759 -171512 -391230 124193
8998 95158 112696 178435 196120 -310755 -1782 180232 -148949 -5934 -60041 127049 -90696
8986 -329288 42304 -348626 -59415 -131565 -238822 -162156 -221106 34092 -110358 165870 -467711
8974 -125214 203158 -8525 -312209 -218540 -103670 -213188 144098 40697 -127788 -214838 -117748
8963 -117748 -113428 -423529 -33322 39558 -209822 -256228 77430 -61090 72279 35733 -83835
8951 96779 185505 -154918 -645682 83147 5054 135293 100450 -37764 219491 -29519 -153165
8940 -153165 98061 -311556 62575 -108961 -282987 1793 280551 146967 -79321 -220873 -71740
8928 -51941 -158942 112483 269180 149822 1248605 2484559 7033217 9587115 2775442
8918 835612 -4681 110443 19724 -93314 -133677 -188623 339774 19460 89732 -242085 539509
8906 234916 157647 -63857 -232456 -18683 -219539 311758 -214029 199390 165488 -348387
8895 -273228 324174 223929 -313673 61769 115947 54606 -256447 119274 412122 98102
8884 64755 -305987 273947 1070 -142096 -11570 311194 160842 280224 -177876 9292 61003
8873 61003 279821 171959 -3074 170319 80802 112230 32394 470453 -175854 -206503 27820
8861 -65966 -303855 -139401 -112832 -204652 353823 106453 -14004 6573 -6374 -357648 -241167
8850 -241167 117656 -73427 44771 130668 -170779 -180277 -75303 161421 -249936 7727 -4541
8838 134482 -36351 88081 -167656 48685 84193 -25604 -374131 -14323 167923 -131325 -62246
8826 -343395 -233290 189314 -127780 -239471 14094 42827 -251648 -130178 -109280 -369053
8816 -369053 -188976 76803 62188 -274033 -38775 91338 -33523 91534 -161185 -97375 -123817
8805 -123817 -220968 226388 171152 -99894 51436 30376 25052 -189998 -335307 -161746 27285
8793 129348 -128347 -29054 -74237 -172518 -87416 125794 -1955 200977 -173059 52907 -230340
8781 137076 168199 -107717 -14206 -157202 -212520 -279049 22599 -176176 -295613 62428 -58332
8769 264577 -493126 -308319 -47456 219205 -39137 20509 -7455 -260777 95346 -148422 -82183
8758 -82183 113152 205049 155960 174835 -113455 289353 -125200 -150274 155242 -259 328786
8746 -15336 -10126 -190744 -215066 -2902 157959 -237568 -74309 -60701 -21592 98100 45322 -241393
8733 -250837 -155886 -111129 3395 206338 170272 -160449 259723 15236 70602 154449 194282
8722 194282 -91507 -352946 243890 -166230 -292699 246597 -351176 22851 98962 -170705
8711 -272868 101846 165534 -92980 202247 -131169 12844 -22198 51903 1535 -340976 -249543
8700 -249543 71610 -104552 -125467 40759 -308198 209902 -60178 -54111 -58696 -131740 -32160
8688 24926 -24050 174466 183592 161618 455533 90332 27809 31038 -232071 -210694 -74675 48366
8675 -182797 436583 -172059 -431024 -305339 10352 -8066 -205034 -308656 -119863 374135
8664 -230460 230586 -249561 -594244 360266 278147 -133299 -188029 108974 -166923 135403
8653 36948 -111064 -34593 -78086 -214939 64407 403744 -163583 210808 -102546 -200963 -22334
8641 189097 -178226 272265 -46565 169138 -170062 -211660 -67930 -51938 10073 208327 -10821
8629 -33911 61814 -272301 -49395 -164577 -68089 -59634 -254259 -313023 1940 -103689 -222043
8618 -222043 12712 65087 -99816 305763 241346 -77702 185487 -233947 -73521 -228509 -78289
8606 -139815 21757 215296 174792 346279 -120092 1017 64850 14925 219903 -25107 60828
8594 -29788 10431 19805 -362807 -167373 -152052 -205193 -38444 68161 86844 -67642 -224431
8583 -224431 -174406 353854 25390 16927 19011 200425 -175738 137060 -70909 27873 -90697
8571 423279 -46118 -363716 -302070 -144214 -298312 51294 179711 -181842 -53157 -45832 -364526
8560 -364526 145407 144637 439033 -290112 -18703 -74750 49085 11168 -196057 117041 -25531
8548 -215676 -12786 -72914 185808 -194758 -335752 -146300 -514488 -233901 -34774 -183343
8538 -183343 -135942 -35504 -83987 157044 -165481 -205692 -174576 250451 -76372 -66210 -105295
8527 -105295 -282189 -74946 -137956 40029 -411195 -68998 197249 -303914 -53165 220847 41211
8515 -265071 137590 60262 81264 -276508 -28292 132510 -145863 249250 -280233 -77254
8504 17467 -60787 151636 175921 193263 -162829 -21961 -134861 105164 -333621 139027 7107
8492 -208351 -345652 -146414 34307 191327 -277014 -43391 -222897 -236346 -109310 53534
8481 -317848 30181 -116626 117408 254971 -113120 109543 208664 86820 250345 -210624
8470 -200414 -184025 -132108 -327390 42776 192204 -113214 55929 57559 169044 165701 -520007
8458 -155796 79051 -55213 -140504 -130903 -38901 -291619 -253762 -176763 73452 -191040 -314755
8447 -314755 -25808 169056 117222 -36195 144147 32175 14637 -246835 -48421 37991 -53126
8435 83905 11490 -172492 -148628 -34539 -5328 92127 21983 -139912 -241363 62682 -185020
8423 93149 -256999 4192 34740 -234571 -375749 -198428 -44534 35806 -111579 130203 81571
8412 81571 -183641 230683 -292893 -512554 -47284 217660 -21008 42356 115613 -16359 -113670
8401 -113670 -14520 -31775 -101557 171547 -240830 165108 221751 -87088 -178499 123454 -84290
8389 80825 -62147 -127079 -37581 -57102 -12935 9461 -64934 -194463 -140409 -43689 -4520 -178458
8377 -178458 -196314 148005 -128640 -103321 -124943 282183 76552 86520 -18749 150894 124869
8366 124869 -32942 -104267 169356 -218966 320651 -68334 114833 83541 140012 -122595 -188332
8355 -188332 -45837 -103980 263193 34643 -54788 -262507 306272 -134281 -128281 -146030 16108
8343 29691 -166348 -58595 -49248 236574 -12462 -130389 -251314 41368 170604 -245609 -148137
8332 -148137 45197 -253019 187562 -264 -34951 -107469 41410 -381816 -182957 -405885 -104017
8320 117037 129846 -69835 -47627 -171161 18403 40403 31319 -35694 119906 107887 -223114
8308 -15975 194586 35610 303299 217628 72432 -79740 114989 -169092 67100 111649 3973
8296 -28859 -26167 -32076 262808 62205 68920 203162 68497 -274344 -118396 -12298 -14818 -255457
8284 -255457 -46140 127649 -283185 -167859 55948 370318 -270748 96432 -219736 408929
8273 119466 61010 8060 -161898 54467 -242137 -28183 289725 -135746 80870 58233 86972
8262 86972 -62701 -75330 136258 12738 -34933 106713 -207108 260130 -133996 73693 -319903
8250 -223363 30150 -7352 260948 -398704 -440467 -438997 -8723 53045 -178588 -391395 45311
8238 240627 -173313 -34123 -76130 -69713 -2597 -92671 -52502 103165 -122615 -330810 70250
8226 226192 -288386 -36880 27007 -380704 -216498 10370 23001 193735 -15743 -96910 101229
8214 83363 13123 1325 -55224 80252 364600 20607 164622 -181453 -250018 -436700 -41592
8202 -50054 111311 -215281 49139 131100 312794 -17274 -158616 -109413 96686 -230075 107765
8190 1635 -22439 -72132 153252 -312951 -377156 -139584 -222833 -211209 -37860 -75333 283141
8178 23164 -5173 -203354 -57385 319315 -129460 201669 -125510 54750 38649 53435 76426
8167 76426 111340 41174 -5179 -217631 -179334 -152381 -227811 -125953 42783 -8703 136881 67428
8154 -447196 -100191 -342972 -49931 -173666 140873 -173662 -377446 89636 -170408 -5619
8143 -153812 210958 -60737 -120685 58800 220009 -105624 -292740 -257654 167350 -119279
8132 -23952 -163298 45758 44377 -80257 -18250 68718 -30867 112937 -296381 -28134 199596
8120 -5132 133289 -99618 91025 33539 26750 13232 -173047 -162499 -396862 313362 -27861
8108 150923 -327562 -36241 -159823 -48084 -58703 108162 -204724 -164797 -80581 -168140 -46118
8096 145173 113208 -36540 161922 -304259 311921 24572 -17485 -304244 -107244 -103250 430278
8084 -106786 -35902 -320299 -183113 -127878 -345018 -176195 80087 -145971 -147346 -19291 -137941
8073 -137941 95639 -292846 -74113 -318695 73127 -159194 142721 -93233 208422 -78198 -31777
8061 147181 104334 288907 236622 -224155 175182 -20245 247309 -411141 153283 -7359 -90631
8050 -90631 -26541 336384 -50436 235649 -16177 381871 -362253 140034 -148400 -197088 -80683
8038 235270 367773 -145543 -176509 68814 -270371 28446 99258 162197 -317314 -81402 161010
8026 -296489 17115 -181138 65795 167061 -298146 -128347 -25117 -139901 162573 222824
8016 222824 -201141 -57022 383105 -246647 26814 -313779 -301813 -229143 -171192 106309 11230
8004 -56906 141616 -50878 138399 339289 296262 171344 -61767 -42509 -535576 55974 -276377
7992 -143467 -193997 302472 200507 140768 -179173 43284 5661 -38523 313595 -117275 -123267
7981 -123267 -183641 -111839 12826 33716 -179380 -262167 -82987 18397 -366297 -194406 41406
7969 -167514 -189514 -232833 -124651 69066 262084 125765 -587721 -329 129159 1706 -133548
7957 -213256 -362549 183425 104201 -340897 103423 -359045 -176265 -16840 97888 -157079
7946 -18762 33905 -30762 -127855 44017 -183383 -61905 66842 -31832 -43329 4003 -119693 -198595
7934 -198595 -97523 73253 -15503 -240933 -104703 -169229 99179 366499 192972 -112510 202670
7922 -327174 11605 -201700 451840 -63937 -159968 31421 107421 36432 193138 188212 122215
7911 122215 -177359 -304790 148652 233178 13116 167421 -478333 -139572 -263554 -241696
7901 -241696 -144537 -73241 -403206 222922 232762 -99823 -207053 206761 -181729 -92635 -18985
7889 101291 -284316 -88631 -120473 106793 -3363 85797 10638 200276 -4970 62364 184945
7878 184945 -303420 -208727 -23770 28053 -134648 7796 -41161 -108888 121495 -33726 -92574
7867 -92574 301523 -210727 -13984 -152777 85665 -7378 -59669 -160152 96653 -244672 83469
7855 58559 -200373 79099 58586 -66466 -42099 -19815 -56389 -567661 -10940 260231 -79526
7843 -49571 -6092 -112844 -15543 -108207 -41438 94169 214493 -256393 226256 202337 16218
7831 59439 -211937 -197722 201243 114055 -155252 -80465 -166965 -82371 -215173 -63387 23696
7819 10016 3874 -408509 -109641 -50438 -281797 -91688 -213417 41155 -47465 -22899 -190315
7808 -190315 310379 -186717 -22696 -53761 -311310 -194297 709 -53607 162602 -90589 -207670
7797 -207670 155610 -35040 168113 -130164 56644 -15157 -356496 28174 115958 -47530 -281546
7786 -281546 -96163 25237 181609 -39684 424392 -146098 -153816 -150509 -53023 -132706 -301332
7775 -301332 -272047 382116 94940 93886 -255852 -264476 65789 -85435 -102994 -69405 -75995 44180
7762 -209439 -116663 26090 148702 -207217 87935 -41264 -1654 6478 19931 -27986 -419414
7751 -419414 -84336 -123266 118947 -208259 -233970 184180 -162950 -133192 41024 -71873 -267196
7740 -267196 -172205 157478 224584 -322274 109141 -279515 123048 388193 -144275 208458
7729 37141 -4532 -93183 -232641 -161881 -198242 -429033 -368433 143297 -348453 147640 -20558
7717 1422 375836 -198136 -10205 -137396 68111 1686 108390 1844 -179041 17317 326795
7706 326795 -267007 -402680 151234 -109963 -310929 -131264 -121125 8201 283736 11540
7695 -17895 -393393 -81191 168404 -323134 64353 -142491 -95608 -263330 -86402 19853 -218494
7683 -257658 1907 152124 60064 52771 64102 111418 99384 29360 100405 47445 -177607 -164638
7671 -164638 -109047 -109529 248661 148595 -258735 257434 87349 -206864 -47802 -13238 339416
7659 -3319 139977 -352588 -323153 -93988 -81663 5391 -210646 -199700 -43304 -23682 53321 93472
7647 93472 -134463 -291119 -124387 -329706 -136480 -272888 -90025 142298 -7877 -53551 -199721
7636 -199721 -358956 -60644 76779 406029 212694 -359730 99209 287907 139336 -359747
7625 -216550 -439890 -219676 -78025 -109520 -153568 -134463 -23898 -191416 -42498 104162 -195039
7613 -93480 -326744 -223839 46659 -182030 5807 36524 219404 28044 -159350 20032 -72474
7601 171802 -72314 -48140 -222245 -57046 -69368 541529 -13823 50895 56575 -254596 177038
7589 170724 80427 247430 -113148 -27902 126742 -4001 322966 -49721 -67497 -308699 18733
7577 -186954 141680 10481 -55172 -86243 -72420 78241 160575 -190360 -117014 -405487 47357
7565 -218158 174401 207626 -84477 315201 212135 78671 297980 -200476 -342796 137831
7554 67711 189909 -102507 12456 100583 132515 -223550 -45146 -7598 -168707 -112840 -28519
7542 -47749 153776 172147 -467084 -161091 -175782 -43068 332206 159524 -306764 241176
7531 -176578 203014 -29466 196782 -4195 153059 -56356 5943 -53809 -95948 74633 26931
7519 -204910 36444 -332799 -160643 178670 -83439 26995 -152203 -180024 40221 -223588 105066
7507 -121588 -121243 24848 -85487 -311646 254776 -341578 -112623 8813 87111 -132802 217760
7495 90310 93204 -256905 51892 -224503 72203 37273 -14481 44107 212441 280880 60492
7483 -49446 -248175 -30686 169274 -64461 260724 52295 40898 -36551 -145924 12838 -60602
7471 -352148 40440 13741 177761 -208057 174610 -226079 -284215 65361 45470 47919 59022
7460 59022 64014 -292679 140796 -184043 71604 -333229 125115 -20658 -107206 171307 361344
7449 361344 -73794 -2127 24551 -6510 55483 -301548 154566 -115960 -161209 -170988 -88108 -28890
7436 -8578 -11275 -257520 -701 20818 -286116 -16794 -137617 -168667 -77853 -224902 -91483 181550
7423 112046 171589 120846 20738 -204359 -246670 32564 60527 -173302 -13799 -130308 165981
7411 60422 -186018 122090 -205641 -106323 115333 -58186 321914 -6579 -13787 -78874 44308
7399 -149251 -60939 22055 -126925 295239 -131932 141199 217828 87460 25633 136737 -141493
7387 -164699 29705 78323 -13520 210981 39428 -124084 -4871 102828 190492 -83313 123471
7375 -187118 10562 75803 -199698 -103678 43832 -118636 172025 -68927 -73906 -6522 114517
7363 99372 -142285 52347 -94471 -206535 35927 28217 49288 -99441 -117502 -118459 -104205 230998
7350 -176217 -70150 6302 48368 -88011 52485 152657 -219595 -81964 81787 -95222 -66009
7339 -66009 81804 40451 -142858 -103660 263204 415292 89052 204257 37998 97612 15911
7327 30357 -292232 -342772 -223951 17394 -331717 237144 39431 -36221 -74626 174149 2885
7315 -21376 -222880 -250223 24622 -268882 -13827 -193699 -103015 -244102 169157 -4800 316889
7303 23839 287222 306099 -86813 -111733 -154070 158030 -97700 -45140 -208923 181654 -298335
7291 -12069 -216307 -27680 128078 -112808 148700 -96638 185853 14427 -377298 79575 73532
7280 73532 93858 -22060 -140992 -88010 233879 258396 -41940 -1160 134571 -7998 205278
7268 -364464 195437 -126064 334011 -114608 123200 108824 -203520 24086 -96368 -275507
7258 -275507 -271068 491689 -199068 -23762 -214328 123386 -90680 35208 -373061 -79380 -237661
7247 -237661 -6390 -288288 -131505 6781 235386 235821 -191286 -78274 125573 -96196 -108159
7236 -108159 -60701 -93768 262309 247137 -107056 263253 -76275 44612 101539 -428256 533951
7224 131284 181209 166395 -118509 -119443 94430 275513 -444040 455835 -35537 -100981 -126433
7213 -126433 123234 224636 -90743 -239229 -3609 -47949 -325123 -85678 -36402 97559 90357
7202 90357 -378066 873 -40824 -226033 -31952 561569 -66554 -109632 9847 -209548 175589
7190 -93617 -121013 -296986 -108627 -284841 -268035 -162811 -175151 -143197 -78428 125409 -71929
7178 56155 -493463 -222872 49537 143479 234495 -23971 -169559 308054 -249358 166611 -150928
7166 -91140 -150274 126674 -237121 -2800 -82442 172541 -28814 35672 209571 -71893 -250117
7155 -250117 79335 -129138 -105706 -79909 98297 258302 -66335 21568 -66039 209759 -134298
7143 160333 -143968 -36872 232668 140572 -220419 170999 44159 99997 -187410 -229075 309453
7131 -159036 -147834 -472703 -49553 59481 95990 -90864 -132046 139000 -33553 -135409 -102008
7120 -102008 -348151 -36259 96201 -22800 106944 152557 -392301 57830 173981 -267178 70225
7108 34305 81618 -117842 -223326 -124020 155910 -66524 59011 259945 38222 -186779 -38844
7096 -85450 3908 -159950 -33948 240475 -310354 47923 -57157 -121474 129601 -223958 197515
7084 -41028 1811 -28821 264581 65526 -147494 -215498 -39207 -273612 -33017 66161 -393375
7072 -195146 -156014 94372 84092 -324401 174732 196050 389058 -310173 360772 48887 -14888
7060 101537 -2801 286406 196494 1629 44515 64406 -103500 -105447 280570 -239797 -88733
7048 189588 -125665 -30327 189677 168936 -75184 106463 -281726 -17849 -205750 -198368 -277818
7037 -277818 111627 189784 -80501 -145475 273552 -178803 103980 245377 -279668 12634
7026 -163464 14719 -114559 41622 -175094 81080 -315223 175690 25747 -15504 -49727 7496
7014 -155505 248203 -117618 178326 -129146 22580 428487 142318 104811 82421 -194245
7003 69117 42815 -18501 -225721 151248 -9364 105134 -243992 -111273 201013 78352 -202557
6991 108985 -567 51535 -260672 -62393 178167 -4498 46598 -13532 204072 -578971 -78468
6979 182358 -80218 195320 217263 135065 -60260 -21587 105346 -199527 205570 293529 -325422
6967 9122 101136 -116018 -164609 -180012 111948 159040 58084 53799 -112806 35146 -179512
6955 -150396 -20388 -191348 512 -142477 -275105 -280955 201460 -247108 25166 -181370 -137116
6944 -137116 317693 -134470 129102 -4567 186275 90986 -65312 -19090 -33370 -1977 75585
6932 -335418 287325 35074 -93984 6474 -174258 179415 -61945 -4089 -51179 -362393 -78303
6920 315407 359431 200024 -67778 -223348 192475 324836 59999 -48212 -161215 -134928 190531
6908 -264208 -78226 -49035 415255 10932 79787 -224233 31244 -239602 -118700 53202 -69576
6896 -526698 -143222 334710 113916 48876 -108598 161365 -86596 -123243 -85863 154817
6885 -12342 -71963 -122548 61864 -240343 -35672 31366 -147284 -250774 313734 154628 32704
6873 -45137 152465 4029 -150002 313618 241715 14589 190015 -266194 201047 58763 -113569
6861 -93949 103561 -31914 -256384 -227003 -35009 -159570 -119300 -141760 -106157 -122973 48 -82919
6848 100801 -7521 -188743 221210 -94199 117588 -373624 -93721 -155475 -244197 257944 -36490
6836 130187 15588 146501 276944 7595 -5149 80644 -70729 -52388 95699 -279065 -79226
6824 -165964 119484 134376 -62517 -152665 70631 146446 -40011 -2100 27186 101024 59728 -154043
6811 -149978 -107586 -404950 23835 -95667 29499 -42240 66621 -538613 -47787 -47604 -216069
6800 -216069 54273 138684 49156 -154143 -325569 -59578 211532 -218619 58648 -271147 -231048
6789 -231048 144978 158001 -473155 -286369 397678 131434 -83913 -216448 -47960 -102324
6779 -102324 -247692 -27678 142076 148995 74013 -326682 -522271 248180 -213539 -93126 -128481
6768 -128481 -228417 -40670 38391 26638 156612 -100931 -125393 122903 2510 -15153 -110388
6757 -110388 151350 -233826 -174337 -143327 61110 -197061 -48511 82204 117883 -197615 227581
6745 239752 31770 -186213 -361749 -187454 112356 31743 -7248 391630 -139189 -71171 71200
6733 318161 26682 -345216 216960 -241110 14408 -304197 -41996 -469701 -126529 183311
6722 248768 56464 -354313 -285724 15067 21048 335750 45438 -42250 71484 253449 -81564
6710 -126585 186425 -122011 266991 22351 24794 -63020 155373 -480488 12643 313111 138543
6698 44055 -245011 91813 159501 -98252 68673 -235077 178876 74428 85620 -94386 -297994
6687 -297994 92695 -86591 -440743 -127586 49996 302545 -276323 18911 126410 211754 84462
6675 226747 373278 211848 41764 -190324 -54826 172232 278256 -162467 -137905 -79495
6665 -79495 15668 66157 43044 -280027 -149620 -72635 63416 30973 96111 141732 -57176
6653 -127654 405871 -192181 5105 -274014 45757 40885 80502 -53773 132958 -239551 210171
6641 86735 -7612 -1833 66862 158145 -142264 90442 -292922 232979 -259095 14627 -25534
6629 330102 89371 681 107007 -58645 -249123 113494 -201518 177238 20516 33472 -68676
6617 -355570 -85866 -122337 167184 -4066 7934 19932 -34276 -42285 134083 419021 -3197 100348
6604 -393470 -310816 -297114 -48133 -202138 -76389 -119937 241964 -211260 -3549 -72654 411079
6592 152905 21854 105416 42163 -86365 83851 -197105 -234354 -250116 -193386 -421243 28923
6580 193995 387000 17375 -65023 338013 -189289 83349 -360586 390184 -134355 17435
6569 140254 -83757 -64501 21465 -121565 5610 140116 228964 -104117 -269251 -77639 164130
6557 -79208 -128989 -68280 -28013 -368207 92353 120099 163203 -195262 108967 19577 -430164
6545 -17098 209136 43524 11277 -267252 -149046 -69492 194618 74909 -5374 238685 13218
6533 270665 -273305 -21463 143784 125812 -281898 -29445 -47880 -35862 141395 -367434 61206
6521 33133 216087 -176035 -113035 21564 -62434 -96657 171103 -37335 -323985 73164 -129504
6509 182986 172002 -95284 63653 5674 163321 -14251 23634 -6331 392485 878 -311639 143242
6496 -177272 -110094 210058 -24150 -258624 -97053 276526 -247372 6076 395999 -183659 -380914
6485 -380914 -76630 94129 -125311 57932 164976 -85466 190932 56253 -27252 -92054 256435
6473 73499 -204226 -56692 -119557 -204251 -65430 224077 -255052 -244499 -108780 347647 185266
6462 185266 25069 -163661 -30582 57081 -148768 150797 -132190 40535 269240 -419770
6451 -170325 -107599 68269 245540 -326497 2584 73518 80317 -209802 132532 -95962 129893
6439 -63747 -45474 77970 350605 74998 -324841 -85013 253147 -481363 16823 32130 -172051
6427 -151958 -171155 -159519 151579 -96839 -20150 71313 -158332 241817 -234443 -64583 -35653
6416 -35653 100868 47552 -85441 27444 -210824 -221706 100955 -57485 -65817 -36597 -51598
6405 -51598 -118445 223178 88572 30482 152310 -24059 -91951 19495 190355 128689 -277186
6393 -140978 48436 157941 170320 -196619 -305358 -98882 67227 185238 -10340 368826 -85005
6381 287352 273486 210136 -217785 -129069 102537 -26733 25593 -51649 -153918 264928 45978
6369 124697 -41797 90755 184092 137433 -133471 229869 -138019 -115317 -141174 -146299 -66642
6357 -123560 -212905 -297137 -85991 56178 -48807 -73195 -184429 -216648 -28215 -153684 -183437
6346 -183437 -80425 -46018 -160173 30418 187518 14939 -228308 -439229 -219715 232787
6335 113769 491853 102389 308613 34961 14964 -5015 24030 4553 88342 -70558 -312419
6324 -312419 75960 -128789 -359467 -134557 -71113 -276998 27688 290944 -162947 -65199
6313 3735 -77643 -24298 -26777 -348732 -31763 -29354 72774 41235 11158 51772 133320 296580
6301 296580 269121 15705 -71531 19427 21764 61134 -17410 25352 537443 -4598 -97749 -157564
6289 -157564 195305 197137 3451 74507 -60535 2577 53705 -16902 127942 -154816 -140848 246692
6276 432593 -121174 -115441 5900 -274931 7105 85308 166207 158366 -279764 9356 168583 -430467
6263 12451 -85649 267076 -195576 107440 60946 141630 -285939 -606137 254070 -174479
6252 111862 -87377 -142716 106868 -199042 181228 -127910 397728 136581 -432253 150827
6241 21734 -23953 367 -146274 130751 -77682 -109978 4914 54393 92589 110805 157288 -50055
6228 371124 124436 -68137 -72183 101874 -212936 -16415 439581 -225699 51917 60060 12303
6216 -10244 -45306 62599 -16112 -101455 -85718 -32887 88198 -29504 -9296 77929 196745 -158745
6203 -110132 92675 -278440 1020 23565 -41459 206168 19241 -343096 -156702 185403 -19416
6191 -64803 -181289 8508 328059 -19763 132758 -423993 113998 9181 -186171 -236857 -162623
6180 -162623 130895 224336 276874 163810 -221199 163393 -90342 37140 239797 -179035
6169 -97619 193553 79579 -311954 -239146 -120757 24554 -262827 18124 -18340 -247994 243300
6157 189328 -137743 -88426 -171208 184175 -295823 -87311 128559 -260953 -34207 97835 -97615
6145 -303690 174121 -9167 8938 198932 70050 127102 43788 -156643 -169584 141033 387575
6134 387575 -277734 24921 -25129 10303 -108804 -91351 -110511 -173457 -68685 33526 215816
6123 215816 -156251 235000 370026 -359586 111097 -167768 -161758 -192634 -209194 18567 -69216
6111 -319581 -67507 -147058 93386 52779 -163694 -156171 27850 -18918 -252789 128776 263381
6100 263381 127220 -172790 85887 147438 -248786 -2714 -112789 138482 -27450 3521 173522
6089 173522 -125078 -261349 115647 61748 157199 227671 17799 -4269 232340 431279 314009
6078 314009 -193172 15373 -248336 55022 -114689 -9840 -92598 -293152 -328842 70608 -7303
6066 -76884 51030 84971 167365 -86560 -151482 -263302 161678 97115 345776 163917 -211478
6054 -53092 7128 -13841 -88824 77486 36916 -303889 -2267 22188 -17958 84637 229862 -221901
6041 173102 -88140 103649 -274050 222677 -126162 89652 133056 190603 -142459 -49166 130428
6029 146054 -58670 -87037 250290 -53241 24486 90488 -343304 -86387 -48192 -59955 -209062
6018 -209062 -205214 -267749 -151999 139908 4959 134980 180863 77268 -68913 253287 69393
6006 -113525 -92213 165003 -42027 249486 211098 -204827 -78366 -139503 114501 -63410 -135516
5995 -135516 -87181 228393 10225 -148118 -78735 -353986 59385 49897 128417 159381 -180225
5983 404618 162475 156205 62997 9048 -176529 2013 -61420 3267 347216 290848 25751 49593
5971 49593 84598 -1623 -109665 -55018 -26388 -25457 -314146 -234861 128210 -9895 -157738 316898
5958 -46630 7532 72101 55756 -330730 -141589 277327 -177911 24100 132921 -93309 -77391
5947 -77391 -95288 24837 3681 -24208 104563 40481 222579 50832 -263799 -399474 210627
5935 145476 -115558 153906 -174364 -355795 -211509 249751 -119722 226966 -138491 301449
5924 60337 -306228 -6963 138169 -205312 -108441 128289 67494 -149173 -56484 89917 71688
5913 71688 -307626 126238 -318429 71145 69467 197766 50823 -163557 219491 -34523 30246
5901 -77201 -175029 127510 -257369 -335252 -209547 208985 142322 2904 -164756 155487 -67034
5889 209043 -214409 102089 -68261 -179827 -141445 -139077 68740 -88480 -25049 149465 -254640
5877 -22573 35095 98919 -200326 151037 65867 -51649 -228702 -295062 -291525 277281 -440 50831
5864 -25840 473499 155014 169473 -72261 -334013 118716 -116510 205635 -201224 255439
5853 69046 295040 -43658 -22100 185969 -5751 395569 -63856 124213 34906 -5447 132485
5841 106604 449327 56819 -125717 188933 -94276 -58671 -97963 38384 173351 138395 -13939
5829 -62792 48552 -231890 -112279 106727 -348379 -133305 184449 183948 -11998 161774 129499
5818 129499 -87730 67404 340531 306145 41812 -131339 -191154 1225 217266 -106290 423569
5806 219878 -189565 35621 362458 -11520 -259088 -164785 -26634 -424990 -45193 -424735 128618
5794 19448 88729 131448 195006 16273 166009 94947 -188193 -194573 -115217 148789 -317373
5782 -155214 -390924 112138 226618 -92066 -171560 -166396 -189878 114835 10184 -122285 -221098
5771 -221098 -134281 28843 220741 180828 146881 46529 -461817 69309 75422 -59854 -65435 96295
5758 -104570 -46418 217368 191562 422031 -12119 103895 15419 -22986 -17163 69382 317899
5747 317899 -169789 90625 -128156 191685 90230 132505 185085 137045 -311549 3801 -391547
5735 53932 8152 -86688 -124429 -9136 -19653 -22387 -142762 -47058 -220933 216145 97317 319253
5723 319253 50313 -137957 71625 -94266 -133520 -62351 60072 101330 12890 124304 -21299
5711 74539 -11913 -321876 232154 -196128 40112 -234387 36997 -101155 -101706 -123509 107645
5699 55667 -83380 69620 124108 65008 171245 -11212 -214769 32656 73499 116738 65639
5688 65639 118053 36710 -194266 -283430 -58774 -97768 -124452 -60467 -166649 -84921 177245
5676 118849 30052 116649 -44973 47275 -7829 -34340 -29823 192372 -341465 -23674 257480
5664 101060 36200 323644 137899 -42671 -135883 158427 -241754 289780 -173124 -45312
5653 -417577 -197813 -200388 100515 -224245 8292 110425 23784 102845 -70635 273529 -67431
5641 -51945 -361116 -50053 -32113 56141 27606 237813 -155170 -247005 108953 -23589 -114960
5630 -114960 108488 145830 121039 -45247 -123935 -22602 -140550 -58266 151323 -174219 337130
5618 -76238 -251224 206312 -196001 -258371 -48708 18652 189948 22087 -22506 253190 -135117
5606 -51702 -78913 80598 -221230 -95559 -674 -252785 -114071 -192030 -144824 -118618 -117899 -53798
5593 -208448 -224637 80465 -140281 -85320 18368 -212943 -13963 -151384 127923 -221559 83073
5581 42701 134319 -192 151438 -45078 -171046 93890 -9512 137953 -117084 -129170 -86250 220252
5568 178225 -77650 283832 117951 246818 -23116 285918 -121382 333985 -42315 -152166
5558 -152166 5998 -216215 20408 88305 32456 -90190 429181 -153475 158151 -174065 102744
5546 66493 -34702 -9504 116541 15773 168404 129380 44987 -98203 -199842 -121507 -148807
5535 -148807 -82718 542981 63648 63091 12410 -73014 -201 221135 -200173 240483 282332 -455925
5522 138495 106716 -151085 349267 82355 195488 -236072 -11623 -8248 131879 22297 -67574
5510 71919 40434 63551 -126767 -47002 5155 -4428 293712 -77864 36766 3295 -39605 112364
5497 -71293 -101050 -104513 110720 -160398 381437 -133296 -41739 -113553 -198426 -197272 -440859
5486 -440859 -317247 9539 432087 161081 116867 -18983 -292675 -110712 -90386 376131 21184
5474 -27152 -195724 -293321 293991 194414 -50357 -218308 11088 -401337 258599 -106370 255421
5462 62692 -87518 162285 15552 225210 -82387 -318962 -319772 -196259 167342 38587 -61651
5450 127494 100944 -332511 46468 -76386 -132029 33535 -306311 -144894 -105545 84701 -239708
5438 255765 -68662 -236098 172083 -27233 282252 226620 276697 -132015 76953 199475 226617
5427 226617 52747 -23085 -22130 -54454 -73924 -252810 -264104 301932 -85554 200229 -221367
5415 -84921 118497 -207309 -328493 54946 -278835 94688 54438 -46373 38929 -113594 -309023
5404 -309023 17642 130413 -8005 166618 36942 -5449 156140 44183 11472 -89323 -51408
5393 -51408 56188 214375 -241306 -121479 71116 -89382 -69720 120247 2180 220980 -226754
5381 -185032 -123057 130653 81644 317718 233771 51233 124075 138062 -13693 299276 -215520
5369 34594 82063 214044 38826 -124981 -50763 211843 -29194 -38982 -227443 387905 -28603
5357 -76541 363556 125724 67214 -80321 -201361 -53804 -52505 -31884 -103878 152146 -201108
5345 -209149 68565 -30759 -26427 -8028 -371450 -115624 -53218 -117349 -114478 59128 -130020 121613
5332 28272 -249749 -13278 -59494 157672 76861 -13098 -197712 -95822 -51346 -105199 133541
5320 44574 389626 163868 -392952 138777 26729 -65498 193207 -12063 87087 130427 -43180
5308 28280 21015 47220 -83288 55081 -219737 175910 -72539 69631 507470 22668 -195174
5296 150120 179983 -127825 -124582 49529 97409 187355 396003 104427 167991 -163327 -324958
5285 -324958 -68641 148990 -217407 188442 36979 138099 -73288 -10653 -52136 -178522 140332
5273 -264081 129986 -134198 -115223 -363458 157312 276788 31687 -9175 -171324 -326513
5263 -326513 10976 -24023 -340880 -202035 169124 151735 477498 -42324 -118171 9239 -87270
5251 256150 1617 -202307 -79574 -110689 26923 -282928 65465 185 -36473 -165795 -40916 13978
5238 -225289 -37485 49030 -128557 -42150 -132527 -22619 -142151 -12076 404308 159521 -80375
5226 123331 -185507 -297953 189600 68489 246602 -75214 -147501 -188227 -150157 -66070 -111490
5215 -111490 7894 -118161 264791 -110571 154956 -96300 -96975 -220629 366736 248937 -110921
5203 106579 288360 133227 -133132 -71140 -54406 -17214 -75725 132820 54011 95593 258631
5192 258631 -46921 195404 -172804 249539 164107 152769 112688 -128636 -172869 -172549 -9708
5180 133471 -149941 -82937 46665 178618 191240 -89712 79989 159735 118130 167971 -157452
5168 -162611 37237 128508 -217526 -79413 -203751 199775 147104 -300553 -145777 -144206 47404
5156 -34002 -202399 -16679 -230167 56430 -101920 -67469 -211999 177214 47833 -79468 -169233
5145 -169233 96724 206335 -209599 26676 46231 33046 103848 234742 46693 153104 41519
5133 27221 -32411 38843 -246682 65853 -225733 -140963 94680 -356701 -8048 -249073 33493
5121 162148 -5511 227641 -252508 -518791 -513421 -41412 -276570 -89571 64248 -73593 -114288
5110 -114288 148753 -100194 -157350 60822 -286068 60987 117369 -48366 238553 -95385 249649
5098 -61163 -268211 -173604 -36100 -60833 1926 -72875 -30048 -41221 72680 -238431 180782
5086 287169 199467 -1557 -156666 29843 -57332 -108545 251434 -168070 -77190 31082 155137
5075 155137 18828 47933 133485 -169399 146900 45585 -4522 52329 223600 -276922 -178440
5064 -178440 -38797 -299793 63601 -11667 75726 172966 -138499 62105 66437 -9861 112571
5052 205245 -144220 -8957 -116197 -16624 27150 130024 -386295 74356 -113271 -193103 38113
5040 -72675 112329 96664 178259 129020 -238777 143687 -120509 -82811 -41857 203784 28235
5028 -103802 99537 -235974 -175072 2098 -308686 -58201 -164451 -123743 159716 -105398 257824
5016 -46308 24408 -311938 -60400 17627 -298244 -395925 168792 -211235 -125104 124103 189680
5005 189680 -75675 203147 -77070 25203 223644 181144 209650 -202599 33530 -86783 221220
4993 -62946 82754 25279 156730 156622 -151425 -485032 136408 -143277 24423 38778 -65756
4981 946 102333 216488 61854 35867 16272 368899 141116 220642 304410 -128758 220111
4969 -125151 -102625 -80373 6265 -62560 210157 -103627 281503 -17568 60987 -234191 33475
4957 -17796 -223089 108230 131871 52324 276648 33698 -12388 -229933 -154516 80390 65384
4946 65384 109561 196731 -149414 371502 81128 222416 -31912 -324274 131736 -200194 10955
4934 -120891 281150 -258369 -24727 -128519 -200453 -26970 42660 -369712 134644 160846 27069
4922 107919 105911 9678 310214 -79292 -221579 -166246 -215386 125441 100267 -103034 50788
4910 92521 -289886 103101 -39372 101580 302032 -144391 99461 341802 7704 -30789 -53473
4899 -53473 -307564 166970 -462803 -199825 -74598 79299 -41477 264532 -47083 134917 6933
4887 55979 -178236 13294 209915 -279877 -176531 -296059 -157279 -336980 297182 -205456
4876 -194927 -135844 -92392 24624 -96041 84377 123315 -11197 -129596 147062 138325 32156
4864 -170544 113069 222970 56558 -207323 -268590 -289717 97412 87389 4581 -95298 -1970
4852 -69443 -130549 -83288 -79497 43749 -91982 369231 -152744 -100014 -32820 169910 -1073 -183319
4840 -183319 -159101 -58611 -234507 -130284 -148237 -448184 124802 512514 61431 -108802
4829 235025 347841 163282 13840 35984 99222 -17893 -117637 44801 -128315 -31150 -133139
4818 -133139 106929 225008 -18915 274450 321375 101804 32311 129053 165641 -339847 -99833
4806 166873 -421391 220894 -176605 91733 -125284 -28260 -161184 79127 385960 41886
4795 7023 371466 -70061 31667 -29951 -95956 -217653 74254 -38833 -52444 -256106 328303
4783 -18966 118613 349254 -114360 24869 -456255 -183 -107335 124737 -79183 -75143 -239166
4772 -239166 -166965 -19486 -176397 116085 383005 165336 203425 532542 -331766 -158976
4761 91535 164877 -13380 300029 -163870 -95681 77900 66820 273908 57078 -77673 166348
4749 -129780 -49448 76446 -151565 101886 -28858 352897 260979 113984 -150057 386800
4738 -119985 235780 328718 -99317 158388 94968 83234 -135810 -276708 -215215 154517 217762
4727 217762 300799 -197462 137674 337275 -50199 197707 533430 21650 -120383 -20510
4716 -289697 138420 -251679 84537 4998 205638 81768 -90742 189424 92719 55995 147526
4705 147526 -304292 -64805 -221740 215318 -213718 -255814 -417137 -148214 143481 -137555
4694 -66201 -42661 31175 -167440 136242 346899 139561 84977 171192 48012 200059 250082
4683 250082 170966 -192803 287933 -216539 -104182 -134718 25492 22303 -269222 -132140 -11074
4671 51253 -416 118292 -81964 -353049 -58420 -246443 -335223 -367267 6344 -265217 149706
4659 -162031 32952 202046 -111448 -174079 110458 130537 96042 -6430 199694 145138 19637
4647 32295 97622 146657 -144022 189803 -170792 44767 -31695 -271086 196911 -141713 216341
4635 102815 27306 -173240 -112696 -125246 154235 -302958 -294598 279855 -11301 -54919 56364
4623 264977 164268 323204 38772 110138 121096 -278863 319500 -133050 7793 326873 -67727
4611 162991 28144 102503 -73211 -160305 -245739 227724 347974 -75753 -105263 58542 163621
4600 163621 221863 85132 -19006 -84915 164185 147547 98891 -183224 96154 148191 -60893
4588 -177890 -252167 16642 59202 219835 -138041 -181559 134659 158726 43522 95650 47720
4576 -184779 290254 -337863 -334047 -41105 370096 -25285 151 122755 -184470 -24599 18095
4564 -325381 -138172 -37714 75573 254755 178092 265174 42027 -70918 145092 245443 293801
4553 293801 187670 49867 -143062 107102 -12804 -16769 306798 -3401 47185 60158 114521
4542 114521 55492 86524 -272189 38510 -15656 140059 -79587 -2122 309718 -240916 -217874
4531 -217874 286323 215835 114110 -121089 -213075 242631 48846 111687 453509 30084 -108987
4519 -207858 -9028 -197102 116898 139884 34800 11926 -157920 -27300 57312 -214719 132810
4507 -49024 -216127 74071 84751 81686 36712 152854 -114128 93284 172956 -248427 -96210
4495 248370 172961 -182743 -290059 -315911 289167 139679 -290743 -249027 -405200 -291700
4485 -291700 -75602 86374 -226678 -97101 25998 137691 13892 -31539 131968 68232 -126311
4473 274054 111757 142695 -87752 -60023 115240 106896 311553 324010 -12338 72699 39594
4462 39594 220884 81522 -211233 126907 -182906 -148432 184893 18453 -63078 323547 68048
$$ [...]
##END NTUPLES=NMR SPECTRUM
##END=
