
##TITLE=UV1207_M4_1332-1205_7185600_7oDXSyv6cb
##JCAMPDX= 6.0         $$ Bruker NMR JCAMP-DX V2.0
##DATA TYPE= NMR SPECTRUM
##DATA CLASS= NTUPLES
##ORIGIN= BRUKER
##OWNER= Administrator
$$ 1.72 TOPSPIN		Version 2.1
$$ 2012-12-05 21:40:48.833 -0500  Administrator@X
$$ Compression mode = diff/dup
##.OBSERVE FREQUENCY= 400.02188249412
##.OBSERVE NUCLEUS= ^1H
##.ACQUISITION MODE= SIMULTANEOUS (DQD)
##.ACQUISITION SCHEME= undefined
##.AVERAGES= 64
##.DIGITISER RES= 22
##SPECTROMETER/DATA SYSTEM= spect
##.PULSE SEQUENCE= noesygpps1d.comp
##.SOLVENT NAME= COFFEE_meoh
##.SHIFT REFERENCE= INTERNAL, COFFEE_meoh, 1, 14.96092
##AUDIT TRAIL= $$ (NUMBER, WHEN, WHO, WHERE, PROCESS, VERSION, WHAT)
$$ ##TITLE= Audit trail, TOPSPIN		Version 2.1
$$ ##JCAMPDX= 5.01
$$ ##ORIGIN= Bruker BioSpin GmbH
$$ ##OWNER= Administrator
$$ $$ E:\/data/COFFEE/nmr/UV1207_M4_1332-1205_7185600_7oDXSyv6cb/12/pdata/1/auditp.txt
$$ ##AUDIT TRAIL=  $$ (NUMBER, WHEN, WHO, WHERE, PROCESS, VERSION, WHAT)
(   1,<2012-12-05 21:40:42.911 -0500>,<Administrator>,<X>,<go>,<TOPSPIN 2.1>,
      <created by zg
	started at 2012-12-05 21:29:13.175 -0500,
	POWCHK enabled, PULCHK disabled,
       configuration hash MD5:
       86 BA 57 50 F2 9D 5C 9B 26 00 A9 28 5F 66 2E 89
       data hash MD5: 64K
       CD B9 CC CB 0C DF 92 76 40 EC B8 91 00 22 42 96>)
(   2,<2012-12-05 21:40:46.036 -0500>,<Administrator>,<X>,<proc1d>,<TOPSPIN 2.1>,
      <Start of raw data processing
       efp LB = 0.3 FT_mod = 6 PKNL = 1 PHC0 = 0 PHC1 = 0 SI = 128K 
       data hash MD5: 128K
       75 41 99 8A 89 A7 DE F2 33 90 37 34 AF 71 48 40>)
(   3,<2012-12-05 21:40:47.098 -0500>,<Administrator>,<X>,<proc1d>,<TOPSPIN 2.1>,
      <pk PHC0 = -82.64465 PHC1 = 0 
       data hash MD5: 128K
       5E 5B DB 08 FF D1 79 8A BA 9B 34 E6 3D 82 CD 47>)
(   4,<2012-12-05 21:40:47.770 -0500>,<Administrator>,<X>,<proc1d>,<TOPSPIN 2.1>,
      <abs ABSG = 1 
       data hash MD5: 128K
       44 B8 1B 27 C3 18 11 94 0D 91 09 60 6F 0C E5 73>)
(   5,<2012-12-05 21:40:47.958 -0500>,<Administrator>,<X>,<proc1d>,<TOPSPIN 2.1>,
      <abs ABSG = 2 
       data hash MD5: 128K
       51 82 6F 8A B5 67 1E 95 10 A2 01 CE 85 F7 02 E2>)
(   6,<2012-12-05 21:40:48.130 -0500>,<Administrator>,<X>,<proc1d>,<TOPSPIN 2.1>,
      <abs ABSG = 3 
       data hash MD5: 128K
       C7 93 82 B2 04 A8 8C 93 64 C7 9A BD 4A 31 F6 63>)
(   7,<2012-12-05 21:40:48.302 -0500>,<Administrator>,<X>,<proc1d>,<TOPSPIN 2.1>,
      <abs ABSG = 4 
       data hash MD5: 128K
       1A FD B4 8A BF 6C 3E BE FD 43 FB FD E3 39 DA BA>)
(   8,<2012-12-05 21:40:48.489 -0500>,<Administrator>,<X>,<proc1d>,<TOPSPIN 2.1>,
      <abs ABSG = 5 
       data hash MD5: 128K
       7C A0 04 62 5F D8 18 F1 69 92 60 6C 00 0D 79 23>)
$$ ##END=
$$ 
$$ $$ hash MD5
$$ $$ CE 08 7A 72 52 06 B3 96 D5 59 35 78 D0 AD 0F EF
##$RELAX= 
##$RELAX= 
##$RELAX= 
##$RELAX= 
##$RELAX= 
##$RELAX= 
##$RELAX= 
##$RELAX= 
$$ Bruker specific parameters
$$ --------------------------
##$DU= <E:\>
##$EXPNO= 12
$$ [...]
##$TP07= 0
##$TPNAME0= <>
##$TPNAME1= <>
##$TPNAME2= <>
##$TPNAME3= <>
##$TPNAME4= <>
##$TPNAME5= <>
##$TPNAME6= <>
##$TPNAME7= <>
##$TPOAL= (0..7)
0.5 0.5 0.5 0.5 0.5 0.5 0.5 0.5
##$TPOFFS= (0..7)
0 0 0 0 0 0 0 0
##$TUNHIN= 0
##$TUNHOUT= 0
##$TUNXOUT= 0
##$USERA1= <user>
##$USERA2= <user>
##$USERA3= <user>
##$USERA4= <user>
##$USERA5= <user>
##$V9= 5
##$VALIST= <valist>
##$VCLIST= <CCCCCCCCCCCCCCC>
##$VD= 0
##$VDLIST= <DDDDDDDDDDDDDDD>
##$VPLIST= <PPPPPPPPPPPPPPP>
##$VTLIST= <TTTTTTTTTTTTTTT>
##$WBST= 1024
##$WBSW= 4
##$XGAIN= (0..3)
0 0 0 0
##$XL= 0
##$YL= 0
##$YMAX_a= 5951894
##$YMIN_a= -11352922
##$ZGOPTNS= <>
##$ZL1= 120
##$ZL2= 120
##$ZL3= 120
##$ZL4= 120
##$ABSF1= 14.96092
##$ABSF2= -5.597261
##$ABSG= 5
##$ABSL= 3
##$ALPHA= 0
##$AQORDER= 0
##$ASSFAC= 0
##$ASSFACI= 0
##$ASSFACX= 0
##$ASSWID= 0
##$AUNMP= <proc_prof1d_extract.lims>
##$AXLEFT= 0
##$AXNAME= <>
##$AXNUC= <1H>
##$AXRIGHT= 0
##$AXTYPE= 0
##$AXUNIT= <>
##$AZFE= 0.1
##$AZFW= 0.1
##$BCFW= 0
##$BC_mod= 0
##$BYTORDP= 0
##$COROFFS= 0
##$CY= 15
##$DATMOD= 1
##$DC= 0
##$DFILT= <>
##$DTYPP= 0
##$F1P= 0
##$F2P= 0
##$FCOR= 0.5
##$FTSIZE= 131072
##$FT_mod= 6
##$GAMMA= 0
##$GB= 0
##$INTBC= 1
##$INTSCL= 1
##$ISEN= 128
##$LB= 0.3
##$LEV0= 0
##$LPBIN= 0
##$MAXI= 10000
##$MC2= 0
##$MEAN= 0
##$ME_mod= 0
##$MI= 0
##$NCOEF= 0
##$NC_proc= -2
##$NLEV= 6
##$NOISF1= 0
##$NOISF2= 0
##$NSP= 0
##$NTH_PI= 0
##$NZP= 0
##$OFFSET= 14.96092
##$PC= 1
##$PHC0= -82.64465
##$PHC1= 0
##$PH_mod= 1
##$PKNL= yes
##$PPARMOD= 0
##$PPDIAG= 0
##$PPIPTYP= 0
##$PPMPNUM= 2147483647
##$PPRESOL= 1
##$PSCAL= 4
##$PSIGN= 0
##$PYNMP= <proc.py>
##$REVERSE= no
##$SF= 400.020009667615
##$SI= 131072
##$SIGF1= 0
##$SIGF2= 0
##$SINO= 400
##$SIOLD= 131072
##$SPECTYP= <>
##$SREGLST= <1H.CDCl3>
##$SSB= 0
##$STSI= 131072
##$STSR= 0
##$SW_p= 8223.68421052631
##$SYMM= 0
##$S_DEV= 0
##$TDeff= 65536
##$TDoff= 0
##$TI= <>
##$TILT= no
##$TM1= 0
##$TM2= 0
##$TOPLEV= 0
##$USERP1= <user>
##$USERP2= <user>
##$USERP3= <user>
##$USERP4= <user>
##$USERP5= <user>
##$WDW= 1
##$XDIM= 131072
##$YMAX_p= 440162693
##$YMIN_p= -43991
##$CURPLOT= <Network HP LaserJet P1505>
##$CURPRIN= <$Network HP LaserJet P1505>
##$DFORMAT= <normdp>
##$LAYOUT= <+/1D_H.xwp>
##$LFORMAT= <normlp>
##$PFORMAT= <normpl>
##$SURQMSG= 1
$$ End of Bruker specific parameters
$$ ---------------------------------
##NTUPLES= NMR SPECTRUM
##VAR_NAME=  FREQUENCY,     SPECTRUM/REAL,   SPECTRUM/IMAG
##SYMBOL=    X,             R,               I
##VAR_TYPE=  INDEPENDENT,   DEPENDENT,       DEPENDENT
##VAR_FORM=  AFFN,          ASDF,            ASDF
##VAR_DIM=   131072,        131072,          131072
##UNITS=     HZ,            ARBITRARY UNITS, ARBITRARY UNITS
##FACTOR=    0.0627417313425164, 1,          1
##FIRST=     8223.62146879497, 1683,         -56980
##LAST=      0,             3768,            -56747
##MIN=       0,             -43991,          0
##MAX=       8223.62146879497, 440162693,    0
$$ Real data points
##PAGE= N=1
##DATA TABLE= (X++(R..R)), XYDATA
$$ [...]
63955E79075K8462L2926L7832M3481N0379N8431O7163P6553Q7153R9247J12246
63944A272948J25152J37365J48826J59503J69043J76979J82944J86573J87330
63935B746663J84620J78011J67233J52084J32626J09539Q4056N7342L0000K137
63925C844311k6150n4578q2672j09643j34217j54883j70517j80825j86235j87550
63915B557041j85598j80866j73369j63162j51048j38394j25999j13547j00608
63906A224450q7821p6484o7068n8890n1276m4379l8541l3510k8819k4535k1035
63895F92092j8310j6004j4108j2970j2601j2366j1621j0346r021q025p312o531
63883E52877n298l456j175J169L322N321P432R887J2609J5225J7437J9384K1428
$$ plain form
63955 579075 607537 640463 678295 721776 772155 830586 897749 974302 1061455 1160702 1272948
63944 1272948 1398100 1535465 1684291 1843794 2012837 2189816 2372760 2559333 2746663
63935 2746663 2931283 3109294 3276527 3428611 3561237 3670776 3754832 3812174 3842174 3844311
63925 3844311 3818161 3763583 3680911 3571268 3437051 3282168 3111651 2930826 2744591 2557041
63915 2557041 2371443 2190577 2017208 1854046 1702998 1564604 1438605 1325058 1224450
63906 1224450 1136629 1060145 993077 934187 882911 838532 799991 766481 737662 713127 692092
63895 692092 673782 657778 643670 630700 618099 605733 594112 583766 574745 566720 559408 552877
63883 552877 547579 544123 542948 544117 547439 552760 560192 570079 582688 597913 615350 634734 656162
63870F56162K3553K5279K6388K7411K8942L0621L1357L0659K9234K8034K7064
63859I64704K5536K2934J9499J5722J1854Q016M325O09l663q691j3718j7578k0010
63846A009539k2000k4587k7704l0465l2289l3296l3816l4020l4033l3982l3811
63835F69536l3360l2578l1469k9843k7580k5115k3123k1675k0221j8468j6752
63824C89352j5331j3969j2523j1313j0454r451q027o830o571o836o610n736n019
63811B70682m866m761m215l490l018k712k348k124k333k749k800k328j834j864
63797B29240k429l065l367l252k758j832o33J18l98k021l445l493k353j182p41
63782A98389q56j118j408j661j593j008j92K75J59j70j72J64L49K44M61J421K307
$$ plain form
63870 656162 679715 704994 731382 758793 787735 818356 849713 880372 909606 937640 964704
63859 964704 990240 1013174 1032673 1048395 1060249 1068265 1072590 1073199 1069536 1060845 1047127 1029549 1009539
63846 1009539 987539 962952 935248 904783 872494 839198 805382 771362 737329 703347 669536
63835 669536 636176 603598 572129 542286 514706 489591 466468 444793 424572 406104 389352
63824 389352 374021 360052 347529 336216 325762 316311 308284 301454 294883 288047 281437 275701 270682
63811 270682 265816 261055 256840 253350 250332 247620 245272 243148 240815 238066 235266 232938 231104 229240
63797 229240 226811 223746 220379 217127 214369 212537 211904 212022 211624 209603 206158 202665 200312 199130 198389
63782 198389 197533 196415 195007 193346 191753 190745 190553 190828 190987 190817 190645 190809 191158 191402 191863 193284 195591
63765A95591J869L59m72K60J252R08l85j069p98o30j090j440j076l85J17N19R86
63748A94516J315J391J403J346R62M32L70R17J473J634J652J732J659J416J445
63733B13663J885K281K404K640L098L203K669K177K378K920L144L177L537M158
63719B53334M517M409L935L044J804P09J29l49j326k622l472l517l036k413j892
63704B53254j636j564j278n99J00M45O08Q86J134J189J380J971K496K397K020
63689B62803K145K745L084K931K789K846K568J592M02k52j89J65K83j9m68o37
63673B82788m63l12k73J75J290K260K026P97q0J86R48J142N40k98r25j412k060
63656B86329k949l804m297m475m687m995m951m212l070j999j052j02N88O74M56
$$ plain form
63765 195591 197460 197819 197347 197607 198859 199767 199382 198313 197515 196885 195795 194355 193279 192894 193011 193530 194516
63748 194516 195831 197222 198625 199971 200933 201365 201735 202652 204125 205759 207411 209143 210802 212218 213663
63733 213663 215548 217829 220233 222873 225971 229174 231843 234020 236398 239318 242462 245639 249176 253334
63719 253334 257851 262260 266195 269239 271043 271752 271881 271532 270206 267584 264112 260595 257559 255146 253254
63704 253254 251618 250054 248776 248177 248277 248722 249330 250216 251350 252539 253919 255890 258386 260783 262803
63689 262803 264948 267693 270777 273708 276497 279343 281911 283503 283905 283653 283464 283629 283912 283893 283425 282788
63673 282788 282325 282013 281740 281915 283205 285465 287491 288288 288208 288394 289342 290484 291024 290726 289801 288389 286329
63656 286329 283380 279576 275279 270804 266117 261122 256171 251959 248889 246890 245838 245736 246324 246998 247454
63641B47454O79J564K487K698K049J059N02Q44J849K847L548M244N063N609N715
63626B88211N959O807P774Q215Q435R193J0415J1398J2073J3090J4720J6563J8375
63613D31228K0300K2177K3456K4056K4621K5735K7349K8915K9586K8457K5345
63602G11225K1177J6961J2490P010R06m287p586r215r618q941p727o971p144q041
63588G00239r803j3003j7314k1203k3524k4515k4766k4127k2323j9824j7410j5426
63576D67001j3852j2500j0779q103m938k573j428n03J042K762L990M948N975O730
63562D37772P074P842R563J1297J1858J1659J2036J3275J4567J5645J7216J9763
63550E89567K3011K6646L0696L5049L9180M2317M3323M0719L3754K3521J2387
$$ plain form
63641 247454 248133 249697 252184 254882 256931 257990 258492 259336 261185 264032 267580 271824 276887 282496 288211
63626 288211 294170 300977 308751 316966 325401 334594 345009 356407 368480 381570 396290 412853 431228
63613 431228 451528 473705 497161 521217 545838 571573 598922 627837 657423 685880 711225
63602 711225 732402 749363 761853 768863 769769 765482 757896 748681 739063 730122 722395 715424 708280 700239
63588 700239 690436 677433 660119 638916 615392 590877 566111 541984 519661 499837 482427 467001
63576 467001 453149 440649 429870 421767 416829 414256 412828 412325 413367 416129 420119 425067 431042 437772
63562 437772 444846 452688 462251 473548 485406 497065 509101 522376 536943 552588 569804 589567
63550 589567 612578 639224 669920 704969 744149 786466 829789 870508 904262 927783 940170
63539I40170K288o083j2605j7026j8992j8393j5668j1970q682o519n434n547p446
63526H08093j1133j5518j9649k3677k7789l0952l1896l0843k9151k7604k6066
63515E33815k4419k2725k0701j8151j5739j4220j3215j1817j0166r135q666p918
63503C56943o952o678o878o053l758j666j384k415l189l117k612j964j238p43
63489C08296o84o25k8R71J860K466K891L096L081L167L572M035M261M368M482
63474C45209M287L474K384J600J103K65j298l210m633n000m506l934l818l952
63460C27971l884l707l727l613k701j208j98r0q0N82J537K157K642L560M810N925
63444C29976O998Q601J0903J3436J5630J7212J8348J9805K2559K6681L0823L3215
$$ plain form
63539 940170 942458 936375 923770 906744 887752 869359 853691 841721 833039 826520 821086 815539 808093
63526 808093 796960 781442 761793 738116 710327 679375 647479 616636 587485 559881 533815
63515 533815 509396 486671 465970 447819 432080 417860 404645 392828 382662 373527 364861 356943
63503 356943 349991 343313 336435 330382 326624 324958 323574 321159 317970 314853 312241 310277 309039 308296
63489 308296 307612 306987 306959 307930 309790 312256 315147 318243 321324 324491 328063 332098 336359 340727 345209
63474 345209 349496 352970 355354 356954 358057 358322 357024 353814 349181 344181 339675 335741 331923 327971
63460 327971 324087 320380 316653 313040 310339 309131 308933 308843 308763 309345 310882 313039 315681 319241 324051 329976
63444 329976 336974 345575 356478 369914 385544 402756 421104 440909 463468 490149 520972 554187
63432E54187L2941K9945K4478J7251R735L430j084l797m312k103K330P492J2347
63419F82840J7031K1870K6444L0065L2649L4426L4977L3213K8559K1825J4596
63408I78495P880J683m023q478j0789j1191j0972j1090j1506j2097j3459j6176
63396H78277j9846k3479k6657k9598l2264l3997l4203l2887l0534k7774k5141
63385E61897k2785k0394j7680j4884j2483j0482q403o005l632j767n01M81J558
63372D44920K901M414N970P746J0030J2555J4380J4954J5099J6359J9318K3002
63360E91648K5989K7780K8941L0321L2283L4475L6065L6319L5011L2277K8125
63349I39234K2376J5115P091m17o187r701j1421j2296j2858j2924j2309j1607
$$ plain form
63432 554187 587128 617073 641551 658802 668537 671967 670883 667086 662774 660671 663001 670493 682840
63419 682840 699871 721741 748185 778250 810899 845325 880302 913515 942074 963899 978495
63408 978495 986375 988058 984035 975557 964768 953577 942605 931515 920009 907912 894453 878277
63396 878277 858431 834952 808295 778697 746433 712436 678233 645346 614812 587038 561897
63385 561897 539112 518718 501038 486154 473671 463189 454786 448781 445149 443382 442881 443362 444920
63372 444920 447821 452235 458205 465951 475981 488536 502916 517870 532969 549328 568646 591648
63360 591648 617637 645417 674358 704679 736962 771437 807502 843821 878832 911109 939234
63349 939234 961610 976725 983816 983399 977212 967511 956090 943794 930936 918012 905703 894096
63337H94096j1860j3665j6818k0751k4829k8295l0461l1153l0746k9608k7723
63326F28187k4921k1294j7227j3047q761m277l0K653K265j473p082j2503j6604
63313E05886j9300k0618k0353j8657j6345j4270j2638j1054r137p002n288m637
63301C46587m922n167m522l271k458k568k965k757j775n81J98L54J22j34l14o83
63285C15144j405k083k128j492p38l12j41l2r8n39j274j981k366k293j807j142
63269B95313n92k74j45j44k12k00L3M89J143J982K745K901K357J894K323L365
63253C12978M014L946L844M216M728M904M791M544M161M051N118P577J0216J1616
63239C90704J1705J1523J1814J2643J4056J6183J8671K0805K2278K3251K3678
$$ plain form
63337 894096 882236 868571 851753 831002 806173 777878 747417 716264 685518 655910 628187
63326 628187 603266 581972 564745 551698 542937 538660 538630 541283 543548 542075 534993 522490 505886
63313 505886 486586 465968 445615 426958 410613 396343 383705 372651 363514 356512 351224 346587
63301 346587 341665 336498 331976 328705 326247 323679 320714 317957 316182 315601 315799 316153 316275 316141 315827 315144
63285 315144 313739 311656 309528 308036 307298 306986 306845 306813 306715 306176 304902 302921 300555 298262 296455 295313
63269 295313 294721 294447 294302 294158 293946 293746 293779 294268 295411 297393 300138 303039 305396 307290 309613 312978
63253 312978 316992 320938 324782 328998 333726 338630 343421 347965 352126 356177 361295 368872 379088 390704
63239 390704 402409 413932 425746 438389 452445 468628 487299 508104 530382 553633 577311
63228E77311K3240K2107K1092K0725K0631K0143J9143J8086J7506J7705J8583
63217G96272J9569K0024J9883J9547J8980J7354J3999R401M762O86l290p879j3116
63204I16192j8350k2838k6188k8328k9298k9164k8141k6653k5098k3453k1293
63193F37388j8245j4448j0505p034m254j851O91L535O255Q381J0132J2186J4585
63180F36816J6329J6500J5589J5175J6192J7965J9097J8959J7980J6793J5557
63169H22952J4179J2770J1556J0400Q715N980K262j919o178j0482j4785j8787
63157H36663k2242k5294k8102l0259l1050l0373k8977k7580k6130k4251k2081
63146E40324k0115j8414j6520j4221j1943j0139q781p647o761o187n626m699l550
$$ plain form
63228 577311 600551 622658 643750 664475 685106 705249 724392 742478 759984 777689 796272
63217 796272 815841 835865 855748 875295 894275 911629 925628 935029 939791 940477 937187 929308 916192
63204 916192 897842 875004 848816 820488 791190 762026 733885 707232 682134 658681 637388
63193 637388 619143 604695 594190 587156 582902 581051 581742 585277 591532 599913 610045 622231 636816
63180 636816 653145 669645 685234 700409 716601 734566 753663 772622 790602 807395 822952
63169 822952 837131 849901 861457 871857 880572 886552 888814 886895 880717 870235 855450 836663
63157 836663 814421 789127 761025 730766 699716 669343 640366 612786 586656 562405 540324
63146 540324 520209 501795 485275 471054 459111 448972 440191 432544 425783 419596 413970 409271 405721
63133D05721k743k508k429k013j298p26n20m26n3P02J579K302K816L197L352L120
63117D10073K655K482K931L673M061L889L426K866K136J394J177J730K468K591
63103D47552K066J540J329J078N41J46L59Q61R03L98N9L95J012J191P32j7p05
63086D59440j109r52m7J295K354K678K442K168K234K693L292L687L836M207N306
63071D93524O917Q217Q696Q701Q844R271R789J0386J1296J2712J4731J7361K0292
63058F40737K2873K4775K6512K8881L1930L4946L7422L9643M2188M5219M8405
63047A023531N1140N2795N3038N2272N1450N1247N1434N1248N0230M8657M7227
63036A584269M6433M6185M5951M5258M3991M2172L9602L5884L0748K4121J5957
$$ plain form
63133 405721 402978 400470 398041 396028 394730 394004 393484 393058 393005 393707 395286 397588 400404 403601 406953 410073
63117 410073 412728 415210 418141 421814 425875 429764 433190 436056 438192 439586 440763 442493 444961 447552
63103 447552 449618 451158 452487 453565 454106 454252 454611 455472 456375 456773 456832 457227 458239 459430 460162 460145 459440
63086 459440 458331 457379 457332 458627 460981 463659 466101 468269 470503 473196 476488 480175 484011 488218 493524
63071 493524 500441 508658 517354 526055 534899 544170 553959 564345 575641 588353 603084 620445 640737
63058 640737 663610 688385 714897 743778 775708 810654 848076 887719 929907 975126 1023531
63047 1023531 1074671 1127466 1180504 1232776 1284226 1335473 1386907 1438155 1488385 1537042 1584269
63036 1584269 1630702 1676887 1722838 1768096 1812087 1854259 1893861 1929745 1960493 1984614 2000571
63025B000571O281m564j5941k7204l7893m7723n6467o3779o8947p1172p0410o7662
63013A475090o3990n9467n3666m6854l9909l3022k5556j7468r905l782J445O817
63001A129733J2290J6960K0472K3264K5614K7393K8783L0286L1818L2499L1844
62990A410956L0544K9633K9241K8673K7344K5190K2254J8475J3944Q896L284l365
62978A645069j1322k0023k8420l5989m2987m9522n4830n7976n9033n8951n8278
62967A167738n6663n3821n0250m6562m2649l8187l3583k9681k6752k4373k2257
62956G42960k0565j9357j8393j7519j6778j6026j5013j4001j3653j4065j4419
62945E63171j3904j2633j1316j0423j0015r996j0052r627q407o769n385m556m209
$$ plain form
63025 2000571 2006852 2002288 1986347 1959143 1921250 1873527 1817060 1753281 1684334 1613162 1542752 1475090
63013 1475090 1411100 1351633 1297967 1251113 1211204 1178182 1152626 1135158 1125253 1121471 1122916 1129733
63001 1129733 1142023 1158983 1179455 1202719 1228333 1255726 1284509 1314795 1346613 1379112 1410956
62990 1410956 1441500 1471133 1500374 1529047 1556391 1581581 1603835 1622310 1636254 1645150 1648434 1645069
62978 1645069 1633747 1613724 1585304 1549315 1506328 1456806 1401976 1344000 1284967 1226016 1167738
62967 1167738 1111075 1057254 1007004 960442 917793 879606 846023 816342 789590 765217 742960
62956 742960 722395 703038 684645 667126 650348 634322 619309 605308 591655 577590 563171
62945 563171 549267 536634 525318 514895 504880 494884 484832 475205 466798 460029 454644 450088 445879
62932D45879m274m625m739m079k849j941j841j995j572o15k5l38r30p26M29J482
62916D17241J391K86q82j582k072k542k589j913j068q96j423j816j508q75o92
62901C99060j229k052k520k287j471m76L63R41J287J403J295J011N33j84q85j049
62885C93740m91K44N23M83O84J071R63J51o49p59l84j11o6p1k06o02j011j135
62867C92374j159j372j492j036k34J62kj17P9M1n78j187j025j96O45J202J563
62850C87668J636J216N66K75N13Q48R21Q80J002J178R94K41o95j104p25k10m38
62833C94766j329j814j293n25m68p93l80R11J988K171K091K564L304L412K729
62818D07334K030K007K499K777K400J754J740K745M034M550M234M053M635N487
$$ plain form
62932 445879 441605 436980 432241 428162 425313 423372 421531 419536 417964 417349 417324 416986 416056 415330 415759 417241
62916 417241 418632 418918 418036 416454 414382 411840 409251 407338 406270 405374 403951 402135 400627 399752 399060
62901 399060 397831 395779 393259 390972 389501 389025 389388 390329 391616 393019 394314 395325 395858 395674 394789 393740
62885 393740 393249 393493 394016 394499 395183 396254 397217 397368 396719 395960 395576 395465 395399 395328 395122 394520 393509 392374
62867 392374 391215 389843 388351 387315 387081 387243 387241 387124 387203 387244 386666 385479 384454 384258 384903 386105 387668
62850 387668 389304 390520 391086 391361 391874 392722 393643 394523 395525 396703 397697 397938 397243 396139 395414 395204 394766
62833 394766 393437 391623 390330 389805 389337 388544 388164 389075 391063 393234 395325 397889 401193 404605 407334
62818 407334 409364 411371 413870 416647 419047 420801 422541 425286 429320 433870 438104 442157 446792 452279
62804D52279N881N959O449P635R053J0042J0293J0067J0068J0799J1905J2629
62792E63059J3078J4391J7190K0560K3360K5862K9230L3635L8066M1894M5692
62781H66017N0232N5567O1370O7374P3136P8014Q1771Q4634Q6441Q6314Q3699
62770A674569P9122P3323O5986N6035M3105K8137J2525k833j7585l1490m4234
62759A936660n5528o5161p2951p8635q1884q2583q1158p8538p5585p2556o9190
62748A122891o5289o1053n6833n2696m8403m3881l9480l5584l2099k8621k5085
62737F33867k1867j9135j6603j4130j2156j0983j0103q766p034n631m835m213
62725D98411l381k416j417m02L32M19K84J030L068N452P056P857Q622R728J0973
$$ plain form
62804 452279 458160 464119 470568 478203 487256 497298 507591 517658 527726 538525 550430 563059
62792 563059 576137 590528 607718 628278 651638 677500 706730 740365 778431 820325 866017
62781 866017 916249 971816 1033186 1100560 1173696 1251710 1333481 1418115 1504556 1590870 1674569
62770 1674569 1753691 1827014 1893000 1949035 1992140 2020277 2032802 2029969 2012384 1980894 1936660
62759 1936660 1881132 1815971 1743020 1664385 1582501 1499918 1418760 1340222 1264637 1192081 1122891
62748 1122891 1057602 996549 939716 887020 838617 794736 755256 719672 687573 658952 633867
62737 633867 612000 592865 576262 562132 549976 538993 528890 520124 513090 507459 502624 498411
62725 498411 495030 492614 491197 490795 491127 491546 491830 492860 495928 501380 508436 516293 524915 534643 545616
62710E45616J2206J3537J5134J7254K0332K4468K8922L2654L5339L7613M0304
62699H23379M3804M7956N2282N6299N9915O3422O6805O9231O9610O7550O3450
62688A483703N7800N0782M2409L2602K1160Q137n657j8961l0941m1491n0595n7861
62676A491087o2920o5941o7501o8029o7573o6024o3421o0009n6106n1908m7519
62665H14136m3128l8947l4916l0783k6707k3498k1732k0802j9378j6903j4155
62654E23187j2169j1054j0182r175q259p758p669p784p891p716o958n657m412
62641D16503l912m099m151l443k264j285n92J92R74J031M4j312k150k250j861
62626C91425j128k83J47p7l29J48J141J773J800J827K192K470K318K097K291K820
$$ plain form
62710 545616 557822 571359 586493 603747 624079 648547 677469 710123 745462 783075 823379
62699 823379 867183 915139 967421 1023720 1083635 1147057 1213862 1283093 1352703 1420253 1483703
62688 1483703 1541503 1592285 1634694 1667296 1688456 1696593 1690936 1671975 1641034 1599543 1548948 1491087
62676 1491087 1428167 1362226 1294725 1226696 1159123 1093099 1029678 969669 913563 861655 814136
62665 814136 771008 732061 697145 666362 639655 616157 594425 573623 554245 537342 523187
62654 523187 511018 499964 489782 480607 472348 464590 456921 449137 441246 433530 426572 420915 416503
62641 416503 412591 408492 404341 400898 398634 397349 396757 396949 397923 398954 398998 397686 395536 393286 391425
62626 391425 390297 390014 390161 390084 389755 389903 391044 392817 394617 396444 398636 401106 403424 405521 407812 410632
62610D10632L407M185N423O932Q154Q835R287J0027J1311J2988J4726J6485J8696
62597E41088K1761K5405K8855L1715L4264L6774L8971M0411M1086M1312M1112
62586I22754L9952L7058L1958K4915J6881Q807R28p044j4983k2054k7549l1638
62574I79985l4969l7744l9587m0113l9342l7651l5599l3667l1920k9995k7640
62563E91758k5145k3003k1240j9397j7162j4749j2606j0906r457q038o708n699
62551D17648n057m547l954l348k899k615k508k782l380l560k505m37J404K091
62537C83551J838J339R08N56M41P00J182J751K560L671M685N227N461N832O594
62522D26296P931J0092J2890J5486J7316J8884K1039K3751K6413K9028L2142L5548
$$ plain form
62610 410632 414039 418224 423647 430579 438733 447568 456855 466882 478193 491181 505907 522392 541088
62597 541088 562849 588254 617109 648824 683088 719862 758833 799244 840330 881642 922754
62586 922754 962706 999764 1031722 1056637 1073518 1082325 1083253 1076209 1061226 1039172 1011623 979985
62574 979985 945016 907272 867685 827572 788230 750579 714980 681313 649393 619398 591758
62563 591758 566613 543610 522370 502973 485811 471062 458456 447550 438093 430055 423347 417648
62551 417648 412591 408044 404090 400742 397843 395228 392720 389938 386558 382998 380493 380056 381460 383551
62537 383551 385389 386728 387636 388192 388633 389333 390515 392266 394826 398497 403182 408409 413870 419702 426296
62522 426296 434227 444319 457209 472695 490011 508895 529934 553685 580098 609126 641268 676816
62510F76816L8082L9031L8907L8424L7408L5218L1703K7260K2196J6556J0316
62499A011917L503l670j0582j6428k0900k4293k6708k7615k6596k4135k1208j8326
62487G94959j5389j2302r095n608j527L040P436J0983J3486J5210J6547J7613
62475H35353J7956J6770J3726R525N278J361k686p139j1630j5852k0083k4556
62463H18023k8656l1435l2684l2944l2533l1270k9210k6940k4860k2668k0032
62452E04791j7266j4889j2900j1014r302p977o741n085l110j428j99R97K300L321
62438D21498L884M319M695M629M111L774L789L321J756k60j842l206m969o670
62424D38829p230o731o488p200q101q151p262n994m841m087l752l430k693j804
$$ plain form
62510 676816 714898 753929 792836 831260 868668 903886 935589 962849 985045 1001601 1011917
62499 1011917 1015420 1011750 1001168 984740 963840 939547 912839 885224 858628 834493 813285 794959
62487 794959 779570 767268 758173 752565 751038 754078 761514 772497 785983 801193 817740 835353
62475 835353 853309 870079 883805 893330 898608 899969 897283 890144 878514 862662 842579 818023
62463 818023 789367 757932 725248 692304 659771 628501 599291 572351 547491 524823 504791
62452 504791 487525 472636 459736 448722 439420 431443 424702 419617 416507 415079 414880 415877 418177 421498
62438 421498 425382 429701 434396 439025 443136 446910 450699 454020 455776 455516 453674 450468 445499 438829
62424 438829 431599 424868 418380 411180 403079 394928 387666 381672 376831 372744 368992 365562 362869 361065
62410C61065j429j636j890k048k494l116l092k104q98k38p9j68n57r41l91J421
62394C41405L401M239L888L139K379J617J265J816L002M025M484M429L945L350
62380C86384L420M573O136P197P821Q603R464R885J0058J0630J1484J1922J2032
62367D99609J2724J4291J6069J7643J9359K1384K3431K5709K9028L3472L8003
62356G50722M1867M5464M9190N2377N4061N3958N2021M7836M1304L3248K4628
62345A246676J5745O894r95p297j2657j8042k3347k7976l2124l6333m0007m1832
62333A028705m1608m0513l9312l7406l4028k9511k4885k0936j8037j6336j5619
62322G10514j5362j5225j5286j5627j6056j6336j6349j5990j5275j4608j4438
$$ plain form
62410 361065 359636 358000 356110 354062 351568 348452 345360 343256 342358 342120 342041 341873 341316 340375 339984 341405
62394 341405 344806 349045 352933 356072 358451 360068 361333 363149 366151 370176 374660 379089 383034 386384
62380 386384 389804 394377 400513 407710 415531 424134 433598 443483 453541 464171 475655 487577 499609
62367 499609 512333 526624 542693 560336 579695 601079 624510 650219 679247 712719 750722
62356 750722 792589 838053 887243 939620 993681 1047639 1099660 1147496 1188800 1222048 1246676
62345 1246676 1262421 1269315 1268320 1261023 1248366 1230324 1206977 1179001 1146877 1110544 1070537 1028705
62333 1028705 987097 946584 907272 869866 835838 806327 781442 760506 742469 726133 710514
62322 710514 695152 679927 664641 649014 632958 616622 600273 584283 569008 554400 539962
62311E39962j4626j4525j3799j2675j1423j0115r016q456q111p082n050k877j599
62298D20608j285j250r79m39K13P18Q28O69P11J106J398J340J478K389L646M235
62282D35386L942L579L846M527N017N126N128N306N684O023O064N945O291P522
62268E09386R114J0074J0296J0940J3112J6570K0184K3408K6728L0692L5157L9650
62256G55311M4014M8327N2462N6074N8856O0406O0017N7073N1771M4984L7352
62245A326647K8893J9825J1156L825k408q639j5421k2323k8874l5172m1253m6506
62233A189750n0156n2035n2444n1588m9571m6759m3618m0324l6894l3599l0750
62222G02012k8159k5296k2121j9330j7528j6485j5476j4149j2758j1630j0690
$$ plain form
62311 539962 525336 510811 497012 484337 472914 462799 453783 445327 437216 430134 425084 422207 420608
62298 420608 419323 418073 417094 416655 416868 417586 418414 419083 419794 420900 422298 423638 425116 427505 431151 435386
62282 435386 439328 442907 446753 451280 456297 461423 466551 471857 477541 483564 489628 495573 501864 509386
62268 509386 518500 528574 538870 549810 562922 579492 599676 623084 649812 680504 715661 755311
62256 755311 799325 847652 900114 956188 1015044 1075450 1135467 1192540 1244311 1289295 1326647
62245 1326647 1355540 1375365 1386521 1390346 1387938 1379299 1363878 1341555 1312681 1277509 1236256 1189750
62233 1189750 1139594 1087559 1035115 983527 933956 887197 843579 803255 766361 732762 702012
62222 702012 673853 648557 626436 607106 589578 573093 557617 543468 530710 519080 508390
62211E08390r624q356p227o645o595o544n861m421k755j582j112q54j77R56K059
62196D49652K883L749M858N745N945N927O611P994R058R228R104R399R938J0280
62182E50371J0624J1295J1863J1659J0808R921Q998P604O016N199N538O508P772
62169F64176R741J2756J6559K0918K5970L1440L6240L9439M1157M1840M1202L8510
62157A019948L3674K7366K0316J2942N634j086o744j1130j4555j7962k2211k6997
62145A019195l0951l3174l4117l4504l4135l2502k9927k7108k3977k0057j5798
62134G02945j2322r863p543m849k300l46J258K547K902K321K241M071P392J0568
62120F99022J2797J4530J5979J6250J4375J0560O069K199l72j572j709j303r35
$$ plain form
62211 508390 498766 490410 483183 476538 469943 463399 457538 453117 450362 448780 447668 446814 446637 447593 449652
62196 449652 452535 456284 461142 466887 472832 478759 485370 493364 502422 511650 520754 530153 540091 550371
62182 550371 560995 572290 584153 595812 606620 616541 625539 633143 639159 644358 649896 656404 664176
62169 664176 673917 686673 703232 724150 750120 781560 817800 857239 898396 940236 981438 1019948
62157 1019948 1053622 1080988 1101304 1114246 1119880 1118794 1112050 1100920 1086365 1068403 1046192 1019195
62145 1019195 988244 955070 920953 886449 852314 819812 789885 762777 738800 718743 702945
62134 702945 690623 680760 673217 668368 666068 665722 666980 669527 672429 674750 676991 681062 688454 699022
62120 699022 711819 726349 742328 758578 772953 783513 789582 791781 791409 789837 788128 786825 785890
62107G85890j090k015l730o261r648j3426j6185j6350j3790j0214p492n803l925
62094F75961j067K202M855O546P613Q364Q811Q896Q721Q457Q165P774P304P017
62080G69619P199P764Q444R427J1336J4189J6922J8527J9355K0511K2114K3105
62068I48512K2897K2196K1765K1335K0429J9623J9964K1476K3029K3605K2924
62057A187755K0909J7377J2481O883J230m100q651j1949j4237j6570j9723k3367
62045A148038k6752k9731l2556l5006l6491l6979l7054l6936l6076l4087l1500
62034G74870k9119k6993k4611k1926j9550j7812j6231j4262j2169j0714j0146
62023E71337r948r562q958q397q011p823p839p925p752p258o903p160p805q090
$$ plain form
62107 785890 784800 782785 779055 772794 763146 749720 733535 717185 703395 693181 685689 679886 675961
62094 675961 674894 677096 681951 688497 696110 704474 713285 722181 730902 739359 747524 755298 762602 769619
62080 769619 776818 784582 793026 802453 813789 827978 844900 863427 882782 903293 925407 948512
62068 948512 971409 993605 1015370 1036705 1057134 1076757 1096721 1118197 1141226 1164831 1187755
62057 1187755 1208664 1226041 1238522 1245405 1246635 1242535 1233884 1221935 1207698 1191128 1171405 1148038
62045 1148038 1121286 1091555 1058999 1023993 987502 950523 913469 876533 840457 806370 774870
62034 774870 745751 718758 694147 672221 652671 634859 618628 604366 592197 581483 571337
62023 571337 561389 551827 542869 534472 526461 518638 510799 502874 495122 487864 480961 473801 465996 457906
62009D57906p531o211m457k652j302n84J43J709L775M923M552L788L842M184L483
61994D65568J787L80k75j050k324l211l191l228m243n574o074o002o411p143o913
61979D12096n332l477k291j639j324j796l111m129l751k437j598j744k016j529
61965C75922m50L66M03j14o42q95j000j080q81q1J082J891J980J786J988K802
61949C83077M001N278O377P166P826Q702R823J0896J1939J3456J5589J7661J8924
61936E20715J9439J9640J9537J9044J8673J9008J9588J9173J7310J4842J2702
61925G19671J0882Q811O201L131j65l260n685p412q807r903j0158r225p505n455
61911F81121k919L45L862O838R209J1601J4216J6335J7099J6397J4769J2715J0278
$$ plain form
62009 457906 450375 444164 439707 437055 435753 435169 435312 437021 440796 445719 450271 454059 457901 462085 465568
61994 465568 467355 467735 467460 466410 464086 460875 457684 454456 450213 444639 438565 432563 426152 419009 412096
61979 412096 406764 403287 400996 399357 398033 396237 393126 388997 385246 382809 381211 379467 377451 375922
61965 375922 375472 375838 376241 376127 375485 374590 373590 372510 371629 371548 372630 374521 376501 378287 380275 383077
61949 383077 387078 392356 398733 405899 413725 422427 432250 443146 455085 468541 484130 501791 520715
61936 520715 540154 559794 579331 598375 617048 636056 655644 674817 692127 706969 719671
61925 719671 730553 739364 745565 748696 748531 745271 739586 732174 723367 713464 703306 694081 686576 681121
61911 681121 678202 678547 682409 689247 698456 710057 724273 740608 757707 774104 788873 801588 811866
61898H11866P122K987j819o387r835j1994j3290j4102j4566j4899j5403j5974
61886G03706j6054j5371j4435j3881j3563j2811j1458j0173r631r808j0212j0456
61874E55853j0329r713q819q192p985p415n566k736l35P52J127J909L332M858
61860E06741O206P554Q977J0309J1612J3167J5022J7041J9383K2372K5764K8706
61848F92854L0635L1772L2476L2659L2081L0805K8942K6305K2656J8031J2582
61837I91798O509M15m744q549j1503j4056j5635j5360j3410j0793p868m002J074
61824H93876O372J0575J3278J4826J5307J4308J1540P232J870m159j0503j6634
61812I57888k1902k5935k8917l1281l3055l3725l2971l1273k9396k7457k5016
$$ plain form
61898 811866 818988 821975 820156 813769 803934 791940 778650 764548 749982 735083 719680 703706
61886 703706 687652 672281 657846 643965 630402 617591 606133 595960 586329 576521 566309 555853
61874 555853 545524 535811 526992 518800 510815 503400 497834 495098 494763 495515 496642 498551 501883 506741
61860 506741 512947 520501 529478 539787 551399 564566 579588 596629 616012 638384 664148 692854
61848 692854 723489 755261 787737 820396 852477 883282 912224 938529 961185 979216 991798
61837 991798 998307 998722 993978 985429 973926 959870 944235 928875 915465 904672 896804 892802 893876
61824 893876 900248 910823 924101 938927 954234 968542 980082 987314 989184 985025 974522 957888
61812 957888 935986 910051 881134 849853 816798 783073 750102 718829 689433 661976 636960
61801F36960k2081j9380j7417j5796j3899j1828j0219r284q544p493o204n161
61789D89654m725m787m910m720m210l571k849k041j500j779k845l814l896l316
61775D40691k895k879k774k231j613j466j860k433k807k777k349j758j248p26
61761D10875O9R65J306Q46K92M80J200J448Q11K5r8K38K70j22l37j68l15j363
61743D16422k653k799j410K64P00j89j147j196n88r1J34M77J042J421J332J031
61727D12750R24J087J298J380J381J515K015K821L440L360K719K204K152K180
61713D41226J947J787K043K198J477J91m76j88j13j298l153m290m372m276m585
61698D28118m864m566l880l298k954k815l053l636l914l286k199j798k474l341
$$ plain form
61801 636960 614879 595499 578082 562286 548387 536559 526340 517056 508512 501019 494815 489654
61789 489654 484929 480142 475232 470512 466302 462731 459882 457841 456341 454562 451717 447903 444007 440691
61775 440691 437796 434917 432143 429912 428299 426833 424973 422540 419733 416956 414607 412849 411601 410875
61761 410875 410944 411909 413215 414061 414353 414833 416033 417481 418292 418317 418219 418457 418727 418605 418268 418100 417785 416422
61743 416422 413769 410970 409560 409824 410524 410335 409188 407992 407404 407313 407447 407924 408966 410387 411719 412750
61727 412750 413674 414761 416059 417439 418820 420335 422350 425171 428611 431971 434690 436894 439046 441226
61713 441226 443173 444960 447003 449201 450678 450869 450393 450205 450092 448794 445641 441351 436979 432703 428118
61698 428118 423254 418688 414808 411510 408556 405741 402688 399052 395138 391852 389653 387855 385381 382040
61684C82040l465l027k798k861k597j860j405j857k763l106k470j364n72n38j137
61669C50220j765j734j023m02n42j200j696j907k076j957j016L61R83M87J7N95
61653C37345J667K015J510J057J165J588K125K823L396L371K925K798L235L715
61639C70735L887L973L989L362J767k42j901l048l852m250m161l831l524l138
61625C59766k576k177k241k460k277j676j137r02p44m28j1K81K39j38m75k56L91
61608C43179N36n45k366l759m301m624n340o225o628o277n381m303l357k801k730
61593B85078k958l086k796k141j553j378j412j172o90o24j258j854j510m02M50
61578B62694M87P1l20o32q84q91o60n63q41j251j484j540j536j447j288j183j028
$$ plain form
61684 382040 378575 375548 372750 369889 367292 365432 364027 362170 359407 356301 353831 352467 351895 351357 350220
61669 350220 348455 346721 345698 345296 344754 343554 341858 339951 337875 335918 334902 335263 336246 336733 336750 337345
61653 337345 339012 341027 342537 343594 344759 346347 348472 351295 354691 358062 360987 363785 367020 370735
61639 370735 374622 378595 382584 385946 387713 387471 385570 382522 378670 374420 370259 366428 362904 359766
61625 359766 357190 355013 352772 350312 348035 346359 345222 344320 343576 343148 343137 343418 343657 343519 343044 342788 343179
61608 343179 343715 343170 340804 337045 332744 328120 322780 316555 309927 303650 298269 293966 290609 287808 285078
61593 285078 282120 279034 276238 274097 272544 271166 269754 268582 267892 267268 266010 264156 262646 262244 262694
61578 262694 263181 263252 262932 262300 261416 260525 259865 259302 258461 257210 255726 254186 252650 251203 249915 248732 247704
61561B47704m71M60J164J255J131J308J541J250N97L79Q42J307J239J014J185
61546B61905J546J477J055J022J616K063J644Q11O21J211J594J073K40R0O34J073
61530B79675J078J092J313J232N39j63j42L59M63j00p57j039j168j495j873j880
61514B77134j416p27n7M29N28J15n27q16l99M39J066J101N93k07j033j526j328
61497B73369n05K85M24K7k21L8M56N71M18L39M53N84N52L22j9k41r6L67P34O96
61477B78553M11J86L4j05M3P81J773K202J794J180J061J335J368Q69J36m37p56
61460B90428r65j120j076o12K03Q74Q54J99l86l10K85P98R12Q06P81R07J061J091
61442B94730R48Q55J217K228L565M618N007M727L937K914K128J986K419K915L041
$$ plain form
61561 247704 247233 247693 248857 250112 251243 252551 254092 255342 255939 256318 257160 258467 259706 260720 261905
61546 261905 263451 264928 265983 267005 268621 270684 272328 273139 273760 274971 276565 277638 277878 277968 278602 279675
61530 279675 280753 281845 283158 284390 284929 284766 284624 284983 285446 285346 284589 283550 282382 280887 279014 277134
61514 277134 275718 274991 274934 275363 275891 276006 275479 274663 274264 274703 275769 276870 277463 277256 276223 274697 273369
61497 273369 272864 273149 273573 273600 273379 273417 273873 274444 274862 275201 275654 276238 276790 277112 277093 276852 276756 277123 277857 278553
61477 278553 278964 279150 279184 279079 279122 279903 281676 283878 285672 286852 287913 289248 290616 291485 291621 291184 290428
61460 290428 289463 288343 287267 286655 286858 287732 288586 288785 288399 288089 288374 289172 290084 290890 291671 292578 293639 294730
61442 294730 295678 296533 297750 299978 303543 308161 313168 317895 321832 324746 326874 328860 331279 334194 337235
61427C37235K756K192J394L80o99j512j601o07J144K514K501J432O65Q64J241
61412C49899P81l24j113j238j138j114j066j096j564k351k803k628k308k313k407
61397C27217k161j667j328j255j201r76o11l16m18j052j755j746r15j23j41o58
61381C10894p43j4J115K099K659K640K061J268O97M92N54Q45J262J458J210Q44
61365C29341Q75J345J880K219K296K052J669J766K687L775M075L700L690M472
61351C65842N384N895O397P309Q211Q451Q083P597P129O477N591M674L998L856
61337D54894M314M773M363L099K047J861J838J014l93j456k014k695l717m545
61323D63383m696m173l152k010j508k116l086l116j983p28m0O40J991L649M793
$$ plain form
61427 337235 339991 342183 343577 343957 343258 341746 340145 339538 340682 343196 345697 347129 347794 348658 349899
61412 349899 350680 350356 349243 348005 346867 345753 344687 343591 342027 339676 336873 334245 331937 329624 327217
61397 327217 325056 323389 322061 320806 319605 318629 318018 317702 317284 316232 314477 312731 311816 311693 311552 310894
61381 310894 310151 310137 311252 313351 316010 318650 320711 321979 322676 323168 323722 324567 325829 327287 328497 329341
61365 329341 330216 331561 333441 335660 337956 340008 341677 343443 346130 349905 353980 357680 361370 365842
61351 365842 371226 377121 383518 390827 399038 407489 415572 423169 430298 436775 442366 447040 451038 454894
61337 454894 459208 463981 468344 471443 473490 475351 477189 478203 477810 476354 474340 471645 467928 463383
61323 463383 458687 454514 451362 449352 447844 445728 442642 439526 437543 436815 436775 437415 439406 443055 447848
61308D47848N283N597O085O849Q014R496J0719J1085J0594R606Q164O083L564
61295E48987J274k92j180j710k157k767l774n218o826q111q625q216p196o157
61281D88032n509n152m722l995l035k040j146k55R25K509M048M828M721M395M392
61266D87996M349L588K290J542K113L713N539P160Q563R718J0406J0404R590Q004
61252E74975O063M509L809L577K900J303p71k487l392l633l701m055m817n589
61238E68691n805n390m955n032n336n149m344l482k883k190j075J43R76J470J963
61223E27602K418K577K586K859L341L551L341L198L568M363N215N848O015N535
61209E82017M629L781L106K231J064J88J14O17J255K159L740N894Q057R859J1220
$$ plain form
61308 447848 453131 458728 464813 471662 479676 489172 499891 510976 521570 531176 539340 545423 548987
61295 548987 550261 549969 548789 547079 544922 542155 538381 533163 526337 518226 509601 501385 494189 488032
61281 488032 482523 477371 472649 468654 465619 463579 462433 462178 463103 465612 469660 474488 479209 483604 487996
61266 487996 492345 495933 498223 499765 501878 505591 511130 518290 526853 536571 546977 557381 566971 574975
61252 574975 581038 585547 589356 592933 595833 597136 596365 593878 590486 586853 583152 579097 574280 568691
61238 568691 562886 557496 552541 547509 542173 537024 532680 529198 526315 524125 523050 523193 524169 525639 527602
61223 527602 530020 532597 535183 538042 541383 544934 548275 551473 555041 559404 564619 570467 576482 582017
61209 582017 586646 590427 593533 595764 596828 597016 597130 597747 599002 601161 604901 610795 618852 628711 639931
61194F39931J2013J2269J2582J3535J4679J4869J3770J2241J0934R320O793M055
61182G76991K490K353K495J871N85p61j993l157l981m250m437n312o845q084q320
61167G39645p953p912q565r578j0579j1430j1933j1898j1619j1755j2369j2539
61155F11515j1483r713q441p900p054n098k592o25N07J133J123j23k537n020o570
61140E47122p215p484p425o752n670m840m484m037k954j464j92O74J552K837M398
61125E04066N757O716P671R301J1769J4340J6039J6641J6835J7316J8125J8995
61113F63571K0007K1407K3049K4406K5162K5325K4755K3114K0535J7942J6271
61102I05544J5424J4337J2132Q893N249J522k382o327r681j1989j3643j5413j7376
$$ plain form
61194 639931 651944 664213 676795 690330 705009 719878 733648 745889 756823 766143 772936 776991
61182 776991 779481 781834 784329 786200 786785 786024 784031 780874 776893 772643 768206 762894 756049 747965 739645
61167 739645 731692 723780 715215 705637 695058 683628 671695 659797 648178 636423 624054 611515
61155 611515 600032 590319 581878 573978 566924 561826 559234 558609 559116 560249 561372 561249 558712 553692 547122
61140 547122 539907 532423 524998 518246 512576 507736 503252 499215 496261 494797 494605 495279 496831 499668 504066
61125 504066 509823 516539 524210 533511 545280 559620 575659 592300 609135 626451 644576 663571
61113 663571 683578 704985 728034 752440 777602 802927 827682 850796 871331 889273 905544
61102 905544 920968 935305 947437 956330 961579 963101 960719 954392 944711 932722 919079 903666 886290
61089H86290j8830j9402j9590j9994k0445k0507k0345k0341k0120j8820j6446
61078F71450j4149j2834j2181j1373j0189q926p722o584n710n165m477l111j250
61065E67779L96J486K263K942L431L704M042M664N488O377P327Q329R308J0321
61051F37857J1553J2973J4283J5334J6382J7710J9225K0667K2078K3729K5647
61040H37438K7476K8961L0319L1947L3893L5869L7797L9950M2393M4619M6174
61029A236836M7308M8476M9365M9277M8656M9250N2267N7097O2589O8888P7033
61018A847042Q7176R8407J10344J23847J40121J60258J85964K19688K63440L18221
61008C554508L84983M65496N62113O77455Q14137R73444J154954J360091J593069
$$ plain form
61089 886290 867460 848058 828468 808474 788029 767522 747177 726836 706716 687896 671450
61078 671450 657301 644467 632286 620913 610724 601798 594076 587492 581782 576617 572140 569029 567779
61065 567779 568175 569661 571924 574866 578297 582001 586043 590707 596195 602572 609899 618228 627536 637857
61051 637857 649410 662383 676666 692000 708382 726092 745317 765984 788062 811791 837438
61040 837438 864914 893875 924194 956141 990034 1025903 1063700 1103650 1146043 1190662 1236836
61029 1236836 1284144 1332620 1381985 1431262 1479918 1529168 1581435 1638532 1701121 1770009 1847042
61018 1847042 1934218 2032625 2142969 2266816 2406937 2567195 2753159 2972847 3236287 3554508
61008 3554508 3939491 4404987 4967100 5644555 6458692 7432136 8587090 9947181 11540250
60999A1540250J845045K064049K145448J978531J531412R00909K71287j88392
60991B2088539l99875l74728j73960J09200L41751L72916J08783m16241j046396
60982B0609989j594008j937326k055134j995033j823787j598535j360437j135676
60974G110053r37136p68188o27714n12949m20168l45596k86543k41023k06420
60965B764316j79552j58062j40918j27387j16327j06727r8113r0039q1775p3008
60955A592408o4412n6936n0817m5767m1860l9555l8851l8931l8804l8006l6553
60944A101916l4614l2376l0069k7898k6032k4615k3647k2918k2251k1774k1630
60933H14092k1474k0783j9739j9235j9600j9900j9001j7012j5025j3690j2818
$$ plain form
60999 11540250 13385295 15449344 17594792 19573323 21104735 22005644 22276931 22088539
60991 22088539 21688664 21313936 21139976 21249176 21590927 21963843 22072626 21656385 20609989
60982 20609989 19015981 17078655 15023521 13028488 11204701 9606166 8245729 7110053
60974 7110053 6172917 5404729 4777015 4264066 3843898 3498302 3211759 2970736 2764316
60965 2764316 2584764 2426702 2285784 2158397 2042070 1935343 1837230 1747191 1665416 1592408
60955 1592408 1527996 1471060 1420243 1374476 1332616 1293061 1254210 1215279 1176475 1138469 1101916
60944 1101916 1067302 1034926 1004857 976959 950927 926312 902665 879747 857496 835722 814092
60933 814092 792618 771835 752096 732861 713261 693361 674360 657348 642323 628633 615815
60922F15815j2223j2077j2083j1257r164o819n663n858o251n938n156m524m049
60909E14753l255j975n96L76Q11R92J305J795K061J737J111R90J732K665K790
60894E27292J963J031P42Q98P15j50j289k143k643l156l921m701n051m867m613
60879E00107m864n673o508o897o930o999p088o771n893m968m621m788m801m217
60865D19089l253k305j337q7J270K036J743P17k83q92j285j626j692j214l22N28
60849D11087R51Q26K82l75q46j154j508j729j252m5Q40L58j104k154k218k069
60833C99890k336k520k033j361j305j631j416m85M31Q86J153J411J384J002P06
60818C93776O77L75p14k264l404l578k906j945j285j112j038o45j59k23r10j579
$$ plain form
60922 615815 603592 591515 579432 568175 559011 552192 546529 540671 534420 528482 523326 518802 514753
60909 514753 511498 509523 508927 509303 510114 511106 512411 514206 516267 518004 519115 520105 521837 524502 527292
60894 527292 529255 530286 531028 531926 532641 532491 531202 529059 526416 523260 519339 514638 509587 504720 500107
60879 500107 495243 489570 483062 476165 469235 462236 455148 448377 442484 437516 432895 428107 423306 419089
60865 419089 415836 413531 412194 412107 413377 415413 417156 417873 417590 416698 415413 413787 412095 410881 410559 411087
60849 411087 412038 412864 413146 412771 411925 410771 409263 407534 406282 406237 407077 407435 406331 404177 401959 399890
60833 399890 397554 395034 393001 391640 390335 388704 387288 386803 387234 388120 389273 390684 392068 393070 393776
60818 393776 394453 394828 394114 391850 388446 384868 381962 380017 378732 377620 376582 375937 375778 375555 374645 373066
60802C73066j831j947k114j886j017k96p65k288l572l660k878k307k621l472l882
60787C38530l249k088j506j847k326k206j779j637j584j038k28K4l76o24k92R8
60771C17872J47L61J326K652L413L381L213L451L868L855L217K383J870J688J413
60756C54110R01O09R66J639J904J667J482J562J370N59k77k57O36J510J479L13
60740C70173j591l545m930n605n904o128o155n760n080m433l892l351k948k909
60726C07942l060k838k012j082p21r75j253j140r33j162j623j397q3J288J248
60711B92199k54j682j817j150q95j212j212m07O78J381J659J776J779J654J539
60696B94036J567J703J928K301K695K772K448K129K200K503K582K361K238K581
$$ plain form
60802 373066 371235 369288 367174 365288 364271 363975 363210 360922 357350 353690 350812 348505 345884 342412 338530
60787 338530 335281 333193 331687 329840 327514 325308 323529 321892 320308 319270 319042 319066 318690 318066 317774 317872
60771 317872 318019 318380 319706 322358 325771 329152 332365 335816 339684 343539 346756 349139 351009 352697 354110
60756 354110 355011 355620 356586 358225 360129 361796 363278 364840 366210 366769 366492 366235 366871 368381 369860 370173
60740 370173 368582 365037 360107 354502 348598 342470 336315 330555 325475 321042 317150 313799 310851 307942
60726 307942 304882 302044 300032 298950 298229 297254 296001 294861 293928 292766 291143 289746 289663 290951 292199
60711 292199 291945 290263 288446 287296 286401 285189 283977 283570 284248 285629 287288 289064 290843 292497 294036
60696 294036 295603 297306 299234 301535 304230 307002 309450 311579 313779 316282 318864 321225 323463 326044
60682C26044L264L810L936L901M147M573M410L146J368K66K79P52R62Q81O86J14
60666C62539j125k678l840m369m542m554m329l902l495l123k511j504l33N94R78
60651C23806Q01M51N18J191J918K077J824J833K214K298J522N8j591l052l947
60636C31921l964l375l024l325l692l319k145o54P68J721J613M03q00p96K00R27
60620C12459Q95Q13J138J261O39k37o14n84n92n10O3Q56J165Q80N60N69P85J101
60602C20647J523J734J290L91j30J04N50N83L28K78M85O19N79N74P08P98O35J46
60584C31842n61j173j252o74J34N90O11O83J267K314L372M054M285M278M380M935
60568C59085O070P541Q837R703J0448J1385J1977J1093Q436N237K851J071j332
$$ plain form
60682 326044 329308 333118 337054 340955 345102 349675 354085 357231 358599 358865 359144 359896 360858 361739 362425 362539
60666 362539 361414 358736 354896 350527 345985 341431 337102 333200 329705 326582 324071 322567 322234 322828 323806
60651 323806 324607 325058 325576 326767 328685 330762 332586 334419 336633 338931 340453 340511 338920 335868 331921
60636 331921 327957 324582 321558 318233 314541 311222 309077 308423 309191 310912 312525 312928 312128 311332 311532 312459
60620 312459 313354 314167 315305 316566 317205 316968 316354 315770 315178 314668 314731 315587 316752 317632 318192 318761 319546 320647
60602 320647 322170 323904 325194 325585 325455 325559 326109 326692 327020 327298 327783 328402 328981 329555 330263 331061 331696 331842
60584 331842 331281 330108 328856 328182 328316 328906 329517 330200 331467 333781 337153 341207 345492 349770 354150 359085
60568 359085 365155 372696 381533 391236 401684 413069 425046 436139 444575 449812 452663 453734 452402
60555D52402m492o922p397o413n225m255l154j883p70J84J291K574L847N216O828
60540D31831Q314R281J0222J2005J4341J5751J5342J3785J2126J0401Q097N263
60528E66759K396l94l260n813p156o922n814m943m909n473n933n739m907l844
60514E04048k805j739o53K26Q40J466K279L096L919N307P712J0679J3302J5335
60500E63012J7432K0331K4243K8898L3718L7955M1140M3391M4873M5066M3061
60489I43120L8541L1904K3418J2967Q81j1533k2736l1964l9259m4773m8352m9610
60477H02604m8342m5008m0855l7089l3872l0484k6607k2938k0291j8508j6693
60466D61917j4271j1555r448q687r068r370q423o446m801m192l836k791j407o93
$$ plain form
60555 452402 447910 440988 433591 427178 421953 417698 414544 412661 411891 412075 413366 415940 419787 425003 431831
60540 431831 440145 449426 459648 471653 485994 501745 517087 530872 542998 553399 561496 566759
60528 566759 569155 568761 565501 559688 552532 545610 539796 534853 529944 524471 518538 512799 507892 504048
60514 504048 501243 499504 498851 499077 499917 501383 503662 506758 510677 515984 523696 534375 547677 563012
60500 563012 580444 600775 625018 653916 687634 725589 766729 810120 854993 900059 943120
60489 943120 981661 1013565 1036983 1049950 1050831 1039298 1016562 984598 945339 900566 852214 802604
60477 802604 754262 709254 668399 631310 597438 566954 540347 517409 497118 478610 461917
60466 461917 447646 436091 426643 417956 408888 399518 391095 384649 379848 375656 371820 369029 367622 366929
60452C66929p99j109j451k181l092l326k619j770j484j447j024l31k1l04p69j019
60436C44183j029r39p86n84l97l20l61l81k30LPl00n19k46K88M61J07l16m11k67
60416C37963m2L29P72R16O50M71Q38J414J497J047P77J198J939K220J673O70p3
60399C54259q0N63J383K001K354K488K344J928J522J501J930K509K879K872K595
60384C83048K339K309K349K036J278O25P04J373J850J733J567K092L132L662L047
60369D13144J896J343J676K128K048J774J988K637L058L059L161L694M232M300
60355D50138M162M480N491O877Q280R528J0437J0783J0482R565P995N633K489
60342E46340j081m382o696p864q500r259r845r308p490n519m406l820l007k317
$$ plain form
60452 366929 366130 365021 363570 361389 358297 354971 352352 350582 349098 347651 346627 346296 346275 345971 345202 344183
60436 344183 343154 342215 341429 340845 340448 340128 339767 339386 339156 339159 339166 338866 338347 338101 338389 338850 338957 338641 338230 337963
60416 337963 337921 338250 339022 339938 340588 341059 341897 343311 344808 345855 346632 347830 349769 351989 353662 354332 354259
60399 354259 354179 354742 356125 358126 360480 362968 365312 367240 368762 370263 372193 374702 377581 380453 383048
60384 383048 385387 387696 390045 392081 393359 393984 394688 396061 397911 399644 401211 403303 406435 410097 413144
60369 413144 415040 416383 418059 420187 422235 424009 425997 428634 431692 434751 437912 441606 445838 450138
60355 450138 454300 458780 464271 471148 479428 488956 499393 510176 520658 530223 538218 543851 546340
60342 546340 545259 540877 534181 526317 517817 508558 498713 489405 481915 476396 471990 468170 465163 462846
60328D62846k726m062m918m585l941l974m307l982k988k123j642r70K65J663K711
60313D27267L520M606O272Q439J0839J3189J5208J6721J7756J8512J9141J9512
60301E80982J9124J7369J4011R413M270r21o110j1448j6755k1166k3446k2961
60289E42362k0475j7724j5893j4658j2891j0192p349n305m068l007j935j365j625
60276D25875k162k145j621j520k395l619m168l867l377l115k707j712l80O10Q68
60261C94565M84k96j155j590j201k31N06M64m5l00q5J88J75P5K34O16R46J223
60243C94573J680K288K686K633K157J234k36j810k430j498J94J194R83M01M54
60228D04503J250K141K517K203J466Q60P77J043J098P37L80N05J155K080L030
$$ plain form
60328 462846 460120 456058 451140 446555 442614 438640 434333 430351 427363 425240 423598 422628 422893 424556 427267
60313 427267 430787 435393 441665 450104 460943 474132 489340 506061 523817 542329 561470 580982
60301 580982 600106 617475 631486 640899 645169 644248 638138 626690 609935 588769 565323 542362
60289 542362 521887 504163 488270 473612 460721 450529 443180 437875 433807 430800 428865 427500 425875
60276 425875 423713 421568 419947 418427 416032 412413 408245 404378 401001 397886 395179 393467 393087 393697 394565
60261 394565 395049 394753 393598 392008 390807 390576 391082 391546 391501 391201 391116 391304 391479 391554 391788 392404 393350 394573
60243 394573 396253 398541 401227 403860 406017 407251 407015 405205 402775 401277 401471 402665 403648 404049 404503
60228 404503 405753 407894 410411 412614 414080 414940 415717 416760 417858 418595 418975 419480 420635 422715 425745
60213D25745L670L638L069K851L761N392O362N763M167L022L211M340N343N555
60199D85889N118M506L972L499L036K512J788R30M00N81J107J104K19j002j855
60184E11804k229k378k372k196k081k326k818l154l153l003k881k678k239j717
60170D76579j549j991k640k667j786p70n66j032j165o11o6K0K10R54J509J040
60154D65469J73K43J245J807J304P29J045J734J757J123O42O52Q35J049J529K301
60138D83637L081L833M798N872O437O059N057M148L706L528L153K267R39l76j134
60123E35005j116n99j07k9l75p80p42o2R42J694J900J657J139L78n00j093j116
60106E36196q64r53j505j887j539p98o11j442k750l591l521k837k141j808j714
$$ plain form
60213 425745 429415 433053 436122 438973 442734 448126 454488 460251 464418 467440 470651 474991 480334 485889
60199 485889 491007 495513 499485 502984 506020 508532 510320 511250 511650 512231 513338 514442 514661 513659 511804
60184 511804 509575 507197 504825 502629 500548 498222 495404 492250 489097 486094 483213 480535 478296 476579
60170 476579 475030 473039 470399 467732 465946 465176 464610 463578 462413 461802 461736 461756 461966 462920 464429 465469
60154 465469 465642 465885 467130 468937 470241 470970 472015 473749 475506 476629 477271 477923 478758 479807 481336 483637
60138 483637 486718 490551 495349 501221 507658 513717 518774 522922 526628 530156 533309 535576 536515 536139 535005
60123 535005 533889 533290 533183 533154 532779 531999 531257 531195 532137 533831 535731 537388 538527 538905 538405 537312 536196
60106 536196 535332 534379 532874 530987 529448 528650 528039 526597 523847 520256 516735 513898 511757 509949 508235
60091E08235j351l33J064J994J865J040N16Q91J720K041J459N97L70Q10R51j2
60075E21857j683k936l278l214l279l355l230l260l850m692n095m932m674m577
60061D69802m432m163m036m133m133l876l683l782l789l121j715p1J202J689J367
60046D33126Q16R34J980L093L222K460J851J930K100J729J225J395K134K422J697
60031D62114N60j32l17n28r82j455j936k749l887m750m891m720n033n951o730
60016D18613o629n761m901m586m525m032k998k199k344l047l190k393j525j469
60002C69014j945k018j411o52j52J75L72K43j51l43j1O20J210J707K178K519K585
59985C73940K372J930J347R13R03J138J019K72o94j348j629j726j674j450j198
$$ plain form
60091 508235 506884 506551 507615 509609 511474 512514 513030 513921 515641 517682 519141 519738 520108 520918 521869 521857
60075 521857 520174 517238 513960 510746 507467 504112 500882 497622 493772 489080 483985 479053 474379 469802
60061 469802 465370 461207 457171 453038 448905 445029 441346 437564 433775 430654 428939 428868 430070 431759 433126
60046 433126 433942 434876 436856 439949 443171 445631 447482 449412 451512 453241 454466 455861 457995 460417 462114
60031 462114 462674 462542 462225 461697 460715 459260 457324 454575 450688 445938 441047 436327 431294 425343 418613
60016 418613 411984 406223 401322 396736 392211 388179 385181 382982 380638 377591 374401 372008 370483 369014
60002 369014 367069 365051 363640 362988 362836 363011 363383 363626 363475 363132 363121 363741 364951 366658 368836 371355 373940
59985 373940 376312 378242 379589 380502 381405 382543 383562 383834 383140 381792 380163 378437 376763 375313 374115
59970C74115r87o63k22n7l89p15l46O29J456J698J582J364J057Q41J117J710J697
59953C83887N78p30q28L99J618J718Q81j25j005j750k054j693j184j197j457j140
59937C75918l67k91j310k230j894q91o28j275j681j114PJ089K029K788L249L741
59921C77140M817O163O656N908M892M446M070K989J689J262J685J887J383Q07
59907D25794P51R84J133J340J812K243K249K001J985K236K233J606P32M09R03
59892D48411J571J611J139J114K074L435M308M516M344L724K507J286J143K285
59878D83468L671M289M185L905L434K402R83r5n27q78j778k993l707l609l293
59863D89457l371l567l110j909p82l28r6P95K474M261N578O426P042P580Q234
$$ plain form
59970 374115 373128 372465 372243 372186 371797 371082 370736 371365 372821 374519 376101 377465 378522 379363 380480 382190 383887
59953 383887 384465 383735 382907 383306 384924 386642 387523 387398 386393 384643 382589 380896 379712 378515 377058 375918
59937 375918 375551 375260 373950 371720 369826 368935 368307 367032 365351 364237 364244 365333 367362 370150 373399 377140
59921 377140 381957 388120 394776 400684 405576 410022 414092 417081 418770 420032 421717 423604 424987 425794
59907 425794 426545 427529 428662 430002 431814 434057 436306 438307 440292 442528 444761 446367 447099 447508 448411
59892 448411 449982 451593 452732 453846 455920 459355 463663 468179 472523 476247 478754 480040 481183 483468
59878 483468 487139 491428 495613 499518 502952 505354 506337 506242 505715 504837 503059 500066 496359 492750 489457
59863 489457 486086 482519 479409 477500 476718 476390 476294 477089 479563 483824 489402 495828 502870 510450 518684
59848E18684R191J0207J0446R040N869J834j607l283l066j852p30k21l85j348
59834E52779l258n721p757q587q252p365o401n441m466l708l558m098m821m984
59820D74362m314l213k269j780j849k487l401l959l762l054k351j904j806k129
59806D36084k616k640k031j495j603j766j127r4O5q26j475r14K59R11Q08M77K87
59789D22304J94Ln33j473k351k515k037j694j833j922j515r31o09n10n55r26j373
59772D01724j055K31J381J338N30J05L94R74J676K459K791K301J725K014K788
59757D21376K918K500K866M457O034O360N608M636L926L745M328N336N844N513
59743D85447N017M896M792M354M007M034L763K571J065K72J11l00j141j768j938
$$ plain form
59848 518684 527875 538082 548528 557568 563437 565271 563664 560381 557315 555463 554733 554512 554127 552779
59834 552779 549521 543800 536043 527456 519204 511839 505438 499997 495531 491823 488265 484167 479346 474362
59820 474362 470048 466835 464566 462786 460937 458450 455049 451090 447328 444274 441923 440019 438213 436084
59806 436084 433468 430828 428797 427302 425699 423933 422806 422712 422777 421951 420476 419562 419821 420732 421540 422017 422304
59789 422304 422498 422501 421968 420495 418144 415629 413592 411898 410065 408143 406628 405697 405088 404578 404023 403097 401724
59772 401724 400669 400900 402281 403619 404149 404254 404648 405622 407298 409757 412548 414849 416574 418588 421376
59757 421376 424294 426794 429660 434117 440151 446511 452119 456755 460681 464426 468754 474090 479934 485447
59743 485447 490464 495360 500152 504506 508513 512547 516310 518881 519946 520218 520329 520029 518888 517120 515182
59728E15182k141k571k688k117j266p25n76n48n51p47j278k018k521k333j597
59713D91505j100j344j830j724j049n41m32j77M62Q91N90k6k29PR0l08r55j471
59695D82359j658j391o86J29N67M08j24o57r52r17n73r1K49K68P7j06k62n83j079
59676D74978j456j530j637k247l219l925m133m264m551m533l908l302l443l899
59662D28931l539k200r56o03o70l70K51O21O46P98J440K414L182L190K429J697
59646D37261J820K454K332R76n41j104j041j356k098k478k236j805j298m28N78
59631D31036R80O73M20O75R65P46J13o94j687k660l046k776k622l103l640l455
59615D11925k754k303k213j956j367q43o06m28r6L77R97J780K448K631K309J790
$$ plain form
59728 515182 513041 510470 507782 505665 504399 503674 503098 502550 501999 501252 499974 497956 495435 493102 491505
59713 491505 490405 489061 487231 485507 484458 483917 483485 483308 483770 484661 485251 485225 484996 485003 485093 484785 483830 482359
59695 482359 480701 479310 478624 478753 479320 479728 479604 478947 477995 477078 476505 476414 476663 476931 477008 476902 476640 476057 474978
59676 474978 473522 471992 470355 468108 464889 460964 456831 452567 448016 443483 439575 436273 432830 428931
59662 428931 425392 423192 422236 421633 420963 420593 420844 421465 422111 422909 424349 426763 429945 433135 435564 437261
59646 437261 439081 441535 443867 444843 444302 443198 442157 440801 438703 436225 433989 432184 430886 430458 431036
59631 431036 432016 432689 433109 433784 434749 435495 435608 434914 433227 430567 427521 424745 422123 419020 415380 411925
59615 411925 409171 406868 404655 402699 401332 400489 399883 399455 399359 399736 400733 402513 404961 407592 409901 411691
59599D11691J337J145J413J957J959Q83m49n20R49K461K528J388M40M59R41J039
59583D29621N53r1n17p83j169j652j828j490j045j009j224j079n02j66m84r94
59567D16141j033o56l39j48K33P83R99N93p5m10k35J35L35L41M08O91J025J247
59549D20035J533K125K733K695K008J764L066N683Q293J0047J1425J3511J6699
59536E01617K0181K2267K1185J6123Q014q15q035j2509j4252j3705j1443q305
59524E20323n205k603m12J435K688L202L334L480L394K426N09j533k933l873n130
59509E19102o933q563r113q394p073o049n770o013o246o224o113o032n648m572
59495D26359l013j728j234j342j540j611j693j855j859j325j63J188K045K087
$$ plain form
59599 411691 413028 414173 415586 417543 419502 420385 419936 419416 420365 422826 425354 426742 427182 427641 428582 429621
59583 429621 430174 430083 429566 428783 427614 425962 424134 422644 421599 420590 419366 418287 417785 417619 417135 416141
59567 416141 415108 414452 414113 413965 414198 414981 415980 416573 416498 416088 415853 415988 416323 416664 417072 417763 418788 420035
59549 420035 421568 423693 426426 429121 431129 432893 435959 441642 449935 459982 471407 484918 501617
59536 501617 521798 544065 565250 581373 589387 588572 580537 568028 553776 540071 528628 520323
59524 520323 515118 512515 512103 513538 516226 519428 522762 526242 529636 532062 532571 531038 528105 524232 519102
59509 519102 512169 503606 494493 486099 479026 472977 467207 461194 454948 448724 442611 436579 430931 426359
59495 426359 423346 421618 420384 419042 417502 415891 414198 412343 410484 409159 408996 410184 412229 414316
59481D14316J633J206J051J265K057L411M626M839M118L438L439L727L683L387
59467D56196L246L215K968K601K496K599K440J902J446J440J686J864K142L040
59453D89281M788O943Q656R349R103Q457P773O973N869M466K789P19j733m196
59439E59237o295p985r227r591q663o767m782l298k352j895j886j874j171K81
59425D93732J743K728L769N662Q279J0697J2401J3824J5661J7990K0278K2049
59413F28813K3460K5148K7370K8989K7525K0809R142m140j4566j9460j9298j6424
59401G17368j2647q162k566L580Q455R888O524j414j1784k1137k6508k7238k4965
59388F09394k1790j8705j5724j2837j0258q048o076m377l105k164j227k26N40
$$ plain form
59481 414316 415949 417155 418206 419471 421528 424939 429565 434404 438522 441960 445399 449126 452809 456196
59467 456196 459442 462657 465625 468226 470722 473321 475761 477663 479109 480549 482235 484099 486241 489281
59453 489281 494069 501012 509668 519017 528120 536577 544350 551323 557192 561658 564447 565166 563433 559237
59439 559237 552942 544957 535730 526139 517476 510709 505927 502629 500277 498382 496496 494622 493451 493732
59425 493732 495475 498203 501972 507634 515913 526610 539011 552835 568496 586486 606764 628813
59413 628813 652273 677421 704791 733780 761305 782114 791256 787116 772550 753090 733792 717368
59401 717368 704721 696559 693993 697573 706028 715916 722440 721026 709242 688105 661597 634359 609394
59388 609394 587604 568899 553175 540338 530080 522032 515956 511579 508474 506310 505083 504857 505397
59375E05397R21J213J721K243K342J984J652J729K125K571L028L511L757L491
59361E37685K931K632K780L050L347M088N462O880P766Q485R716J1110J1543J0798
59347F28273J0093J0558J1842J2820J3044J2820J2371J1642J0779R950Q807O733
59335G59732L692K90k989o016q470r858j0330j0853j2070j3510j4377j4636j4722
59322F45883j4561j3656j2080j0598r633q772p574o329n490m844l833k539j661
59309E44313j469j323m50J231L364N797Q544J1253J3221J3888J2923R894M427
59296F25613k927j0277j5399j7350j6972j5830j4737j3412j1380q846o538m873
59284D87072l678k712k025j563q54M61J991L026L507M056N042O213P370Q746J0453
$$ plain form
59375 505397 506318 507531 509252 511495 513837 515821 517473 519202 521327 523898 526926 530437 534194 537685
59361 537685 540616 543248 546028 549078 552425 556513 561975 568855 576621 585106 594822 605932 617475 628273
59347 628273 638366 648924 660766 673586 686630 699450 711821 723463 734242 744192 752999 759732
59335 759732 763424 763714 760725 754709 746239 736381 726051 715198 703128 689618 675241 660605 645883
59322 645883 631322 617666 605586 594988 585355 576583 569009 562680 557190 552346 548513 545974 544313
59309 544313 542844 541521 541071 542302 545666 551463 560007 571260 584481 598369 611292 621186 625613
59296 625613 622686 612409 597010 579660 562688 546858 532121 518709 507329 498483 491945 487072
59284 487072 483394 480682 478657 477094 476240 476701 478692 481718 485225 489281 494323 500536 507906 516652 527105
59269E27105J1986J2785J2833J2359J1331R775Q276P456P085O242M441K078k67
59256F33485k438m467o180p343p959q123p803p001o045n446n387n438m879l391
59242E51585j438J93J204J986K935L906M554M897N180N353N177M736M379M187
59228E98834L860L130J975M90j118k489l543m751o440p937q224p443o901p332
59214E52111p993p950p412p083o931o441n645n037m707m378m095m039l801k740
59200D73859j061K55P24P60O98L05m44q75n04K27O74R56J555K284K454J930J388
59183D85185J370J689J959K305L059L986M317L726K935K943L799M597M787M877
59169E31534N421N955N653M800M628N598O729O955O392N794N340M535K941N42
$$ plain form
59269 527105 539091 551876 564709 577068 588399 598174 606450 613906 620991 627233 631674 633752 633485
59256 633485 631047 626580 620400 613057 605098 596975 589172 582171 576126 570680 565293 559855 554976 551585
59242 551585 550147 550340 551544 553530 556465 560371 564925 569822 575002 580355 585532 590268 594647 598834
59228 598834 602694 605824 607799 608289 607171 604682 601139 596388 589948 582011 573787 566344 559443 552111
59214 552111 544118 536168 528756 521673 514742 508301 502656 497619 492912 488534 484439 480400 476599 473859
59200 473859 472798 473053 473777 474537 475235 475540 475096 474221 473717 473944 474618 475574 477129 479413 481867 483797 485185
59183 485185 486555 488244 490203 492508 495567 499553 503870 507596 510531 513474 517273 521870 526657 531534
59169 531534 536955 542910 548563 553363 557991 563589 570318 577273 583665 589459 594799 599334 602275 602817
59155F02817k269m681n937o279o926q488r939r931q746p857p803p634o656n575
59141E04096n417o134o883p115o725n683m237l202l258l999m202l185j487j24
59127D42445N25R23J621K612L423L847M292N241O551P604Q188Q725R531J0307
59113E15835J0635J0613J0578J0496J0080R380Q778Q460Q281Q085P766P071N776
59100F31834M158K795J840Q66l82j574k391l054l796m134l365j713l30ml78p13
59084F19659r09j305j881k296k649l496n022o664p851q607r154r313q804p854
59070E43854o975o250n372m333l584l393l439l281k839k317j874j575j453j482
59056D95687j667k097k686k874k088o26M32M21j96o09o76p21p52n03p2P3j78m15
$$ plain form
59155 602817 600548 595867 589930 583651 576725 568237 558298 548367 539621 531764 523961 516327 509671 504096
59141 504096 498679 492545 485662 478547 471822 466139 461902 458700 455442 451443 447241 444056 442569 442445
59127 442445 442970 443893 445514 448126 451549 455396 459688 464929 471480 479084 487272 495997 505528 515835
59113 515835 526470 537083 547661 558157 568237 577617 586395 594855 603136 611221 618987 626058 631834
59100 631834 635992 638787 640627 641493 641111 639537 637146 634092 630296 626162 622797 621084 620754 620750 620372 619659
59084 619659 618750 617445 615564 613268 610619 607123 602101 595437 587586 578979 569825 560512 551708 543854
59070 543854 536879 530629 525257 520924 517340 513947 510508 507227 504388 502071 500197 498622 497169 495687
59056 495687 494020 491923 489237 486363 484275 483649 484081 484502 484306 483697 483021 482300 481548 481045 480973 481046 480868 480453
59038D80453k75J34N08P24Q00Q04Q67J080J368J676K236L326M677N566N701N786
59022E15431O756Q636J0401J1075J0699J0099R795R414Q261O308M244K555R13
59009F14587j149l250m349l970k815j919j521j084j67J163K667M263N707O421
58995F14584O034N009M246L933L336J957M53k04j32m22j544k695l005k771k889
58980F25890l537l985l611k485j053L00J335K077K914M269O087P867R251J0248
58966F55567J0899J1077J0778J0301R915R484Q670P427O183N372M917M195K654
58953G57439L57k200m789p590j0603j3223j4783j5265j5141j4701j3887j2710
58941F32904j1458j0367r369q295p154o199n673n451n023m043k920k432k667k768
$$ plain form
59038 480453 480178 480312 480820 481544 482344 483148 484015 485095 486463 488139 490375 493701 498378 503944 509645 515431
59022 515431 522187 530823 541224 552299 562998 573097 582892 592306 600567 606875 611119 613674 614587
59009 614587 613438 610188 605839 601869 599054 597135 595614 594530 594363 595526 598193 602456 608163 614584
58995 614584 620618 625627 629873 633806 637142 639099 639552 639348 639216 638794 637250 634555 631550 628779 625890
58980 625890 622353 618368 614757 612272 611219 611519 612854 614931 617845 622114 628201 636068 645319 655567
58966 655567 666466 677543 688321 698622 708537 718021 726691 734118 740301 745673 750590 754785 757439
58953 757439 757796 755596 750807 743217 732614 719391 704608 689343 674202 659501 645614 632904
58941 632904 621446 611079 601710 593415 586261 580062 574389 568938 563915 559872 556952 554520 551853 549085
58927E49085k093j084n27m21j60L79O78M14j55o44q37o52k33m4k69l30L89J504
58909E45000K097K124K410L248M054M649N796P830R710J0301R941R843J0411J0974
58895F38388J0928J0392R842R738J0475J2032J3736J4885J5627J6686J8177J9291
58883H00197J9273J8201J6506J4194J1069P557M644K756J032j803n895j0044j3076
58870H64611j4958j6215j6866j6553j5421j4060j2685j1111r526q443p793o930
58858G14050n842n495o455p989r071r652j0236j0782j0834j0322r473q249o620
58845F03030n136m469m489m574m657n208o183o799o595n973n456n000m377l786
58831E30328l642l984m428m570m217l374k221j073k28K54N97J095J791K446K944
$$ plain form
58927 549085 546992 545908 545381 544960 544800 545179 545857 546271 546116 545472 544635 543983 543750 543706 543437 543107 543496 545000
58909 545000 547097 549221 551631 554879 558933 563582 569378 577208 586918 597219 607160 617003 627414 638388
58895 638388 649316 659708 669550 679288 689763 701795 715531 730416 746043 762729 780906 800197
58883 800197 819470 837671 854177 868371 879440 886997 891641 894397 895429 893626 887731 877687 864611
58870 864611 849653 833438 816572 800019 784598 770538 757853 746742 737216 728773 720980 714050
58858 714050 708208 702713 696258 688269 679198 669546 659310 648528 637694 627372 617899 609650 603030
58845 603030 597894 593425 588936 584362 579705 574497 568314 561515 554920 548947 543491 538491 534114 530328
58831 530328 526686 522702 518274 513704 509487 506113 503892 502819 502591 502845 503442 504537 506328 508774 511718
58816E11718L577M638N748O056N273M051L186K827K765K920L078K656J349k47
58802E59595j312j850k478l260l579l150k577k586l235m118m963n682o054n749
58788E09002m718l433k580k398k355j684k38J393K630L375L751L796L641L484
58774E13666L160K205O58p39j584k451l914n439o009n528m808m387m076l555k747
58759D74452j648l80O24J040J089J142J157J048J273K243L365L587K839K111K084
58744D96026K428K537K278J865J663K190L640N383O450O599O318N938N454N135
58730E53904N365N872N925N459N117N154N189N156N485O099O143N200L935L191
58716F27194L208L898N062O056O216N944O333P359P538N976L564J450n03k748
$$ plain form
58816 511718 515295 519933 525681 531737 537010 541061 544247 547074 549839 552759 555837 558493 559842 559595
58802 559595 558283 556433 553955 550695 547116 543966 541389 538803 535568 531450 526487 520805 514751 509002
58788 509002 504284 500851 498271 495873 493518 491834 491596 492989 495619 498994 502745 506541 510182 513666
58774 513666 516826 519031 519689 518950 517366 514915 511001 505562 499553 494025 489217 484830 480754 477199 474452
58759 474452 472804 472424 473048 474088 475177 476319 477476 478524 479797 482040 485405 488992 491831 493942 496026
58744 496026 498454 500991 503269 505134 506797 508987 512627 518010 524460 531059 537377 543315 548769 553904
58730 553904 559269 565141 571066 576525 581642 586796 591985 597141 602626 608725 614868 620068 624003 627194
58716 627194 630402 634300 639362 645418 651634 657578 663911 671270 678808 684784 688348 689798 689295 686547
58702F86547m770n987p140r358j2272j4448j5379j5858j6529j7097j7011j6036
58690E34662j4180j1819r805q741q206p352o032m734l705k987k911l605m214l665
58676D42706k185j044p72o60j21N85J290K428M133N706O604P205Q027Q880R474
58661D92256J0120J1019J1261R537N796J427k187m699o388p462q075q519q940
58648D95146r077q582p484o060m404k458m26J220K251K931L553M018M085L810
58634D78523L437L043K654K539K884L283L060K190J349R85Q58P23Q20J341J898
58619E09587J996J704J504J732K478L643M740N041M392L546L250L261K785J594
58605E51253K05r04j742k477l106l434l199k398j602j552k176k555k204j788j941
$$ plain form
58702 686547 681777 675790 668650 659292 647020 632572 617193 601335 584806 567709 550698 534662
58690 534662 520482 508663 498858 490117 481911 474559 468527 463793 460088 457101 454190 450585 446371 442706
58676 442706 440521 439477 438705 438045 437924 438509 439799 442227 446360 452066 458670 465875 473902 482782 492256
58661 492256 502376 513395 524656 534193 539989 541416 539229 534530 528142 520680 512605 504086 495146
58648 495146 486069 477487 470003 463943 459539 457081 456655 457875 460126 463057 466610 470628 474713 478523
58634 478523 481960 485003 487657 490196 493080 496363 499423 501613 502962 503947 504805 505528 506348 507689 509587
58619 509587 511583 513287 514791 516523 519001 522644 527384 532425 536817 540363 543613 546874 549659 551253
58605 551253 551458 550554 548812 546335 543229 539795 536596 534198 532596 531044 528868 526313 524109 522321 520380
58590E20380k087j281K23J328J756K350L708N522P293Q792R734R902R797J0182
58576E87599J0774J0386Q735P120O690P045P177P001O984P058P006P470R379J2465
58562G02889J5417J7522J9182K0665K1352K0794J9542J8309J6801J4190J0439
58551H97102O441K917j25k807m890o188o901p237p122o673o657p827r931j1921
58537H28181j3202j4143j5211j6138j6314j5640j4554j3335j1816r779p426n281
58525F75342l740k640j387L02J842K306J581O38L51M57J7j255k605l155k813k209
58509F63032j949k065k173k021j790j737j777j659j527j817k525l003k701j867
58495F34421j240j315j986k682k719j894q34l43l39P9J315K701L567M194N214
$$ plain form
58590 520380 518293 517012 517235 518563 520319 522669 526377 531899 539192 547984 557718 567620 577417 587599
58576 587599 598373 608759 617494 624614 631304 638349 645526 652527 659511 666569 673575 681045 690424 702889
58562 702889 718306 735828 755010 775675 797027 817821 837363 855672 872473 886663 897102
58551 897102 903543 906460 906335 903528 898638 892450 885549 878312 871190 864517 857860 850033 840102 828181
58537 828181 814979 800836 785625 769487 753173 737533 722979 709644 697828 688049 680623 675342
58525 675342 671602 668962 667575 667877 669719 672025 673606 674244 674595 675052 675069 673814 671209 668054 665241 663032
58509 663032 661083 659018 656845 654824 653034 651297 649520 647861 646334 644517 641992 638989 636288 634421
58495 634421 633181 631866 629880 627198 624479 622585 621751 621408 621069 621148 622463 625164 628731 632925 638139
58480F38139O574P796Q771R639J0287J0612J0912J1271J0969R284O658M163J993
58467G47068n70l704o471p932q076p418o372n211m081k752q46J485L536M868N742
58452G09266O604P564Q457Q938Q445O594L816J161p58k206l573m683n131m887
58438G39607m219l285k114q76J43Q26J425K399L937N538O349O138N628N520N519
58423G72535M980M208M279N454O551O315M788K918J288k78k014l732n090o015
58409G96187o671p123p230o928o390n738m809l589k600k345k332j559o1R72J035
58394G40819J279K763M661N291M421L275K583J915R09m8n81q59j013q17j28R02
58378G65372K095L182L672L540L836N608Q238R911R843R057Q834R421J0471J1609
$$ plain form
58480 638139 644713 652509 661280 670919 681206 691818 702730 714001 724970 734254 740912 745075 747068
58467 747068 746498 742794 736323 728391 720315 712897 706525 701314 697233 694481 693635 695120 698656 703524 709266
58452 709266 715870 723434 731891 740829 749274 755868 759684 760845 760087 757881 754308 749625 744494 739607
58438 739607 735388 732103 729989 729113 729256 730082 731507 733906 737843 743381 749730 755868 761496 767016 772535
58423 772535 777515 781723 786002 791456 798007 804322 809110 812028 813316 813038 811024 807292 802202 796187
58409 796187 789516 782393 775163 768235 761845 756107 751298 747709 745109 742764 740432 738873 738812 739784 740819
58394 740819 742098 744861 749522 754813 759234 762509 765092 767007 767916 767868 767287 766428 765415 764598 764470 765372
58378 765372 767467 770649 774321 777861 781697 787305 795543 805454 815297 824354 833188 842609 853080 864689
58364H64689J2153J1329R409P843P687Q510R293R679R816R718R326Q767Q058O958
58350I93235N414L735K188J029R30K522N206P285P814P576P767Q500R241R943
58336A072385J0943J2178J3330J4455J5773J6972J7339J6623J5364J4292J3526
58325A233180J2467J0540Q058O041N034M509L897L564M061M885N095M854N272
58312A311457O735Q536J0103J1492J2589J3088J3464J4677J6600J7918J8014J7822
58300A472495J8290J9106J9534J9506J9362J9317J9627K0376K0929K0578J9942
58289A689062K0380K1805K2616K2213K1933K2760K3828K4252K4804K6456K8640
58278A948749L0385L2007L4163L6238L7273L7716L8724M0265M1386M1985M2901
$$ plain form
58364 864689 876842 888171 897580 905423 913110 921620 930913 940592 950408 960126 969452 978219 986277 993235
58350 993235 998649 1002384 1004572 1005601 1006531 1009053 1014259 1021544 1029358 1036934 1044701 1053201 1062442 1072385
58336 1072385 1083328 1095506 1108836 1123291 1139064 1156036 1173375 1189998 1205362 1219654 1233180
58325 1233180 1245647 1256187 1264245 1270286 1275320 1279829 1283726 1287290 1291351 1296236 1301331 1306185 1311457
58312 1311457 1318192 1326728 1336831 1348323 1360912 1374000 1387464 1402141 1418741 1436659 1454673 1472495
58300 1472495 1490785 1509891 1529425 1548931 1568293 1587610 1607237 1627613 1648542 1669120 1689062
58289 1689062 1709442 1731247 1753863 1776076 1798009 1820769 1844597 1868849 1893653 1920109 1948749
58278 1948749 1979134 2011141 2045304 2081542 2118815 2156531 2195255 2235520 2276906 2318891 2361792
58267B361792M4431M6025M7376M8790N0504N2305N3870N5053N5970N7108N8922
58256B932146O1161O3246O5329O8103P1365P4047P6003P8490Q2219Q6326R0041
58245C748476R4062R9377J05770J12443J19020J25190J30496J35321J41024J48330
58235D959509J56710J65893J76569J88973K02291K16256K31681K48691K66160
58226F812733K83889L03420L25688L49802L75331M03761M36467M73243N14036
58217A0278370N59990O11561O68022P30287Q01718Q84745R79512J087727J214824
58208A7816756J366288J545045J755142K005188K305877K667553L103116L629806
58200C6194771M264580N021600N919574O990063Q274541R815338J1654695J3841746
$$ plain form
58267 2361792 2406223 2452248 2499624 2548414 2598918 2651223 2705093 2760146 2816116 2873224 2932146
58256 2932146 2993307 3056553 3121882 3189985 3261350 3335397 3411400 3489890 3572109 3658435 3748476
58245 3748476 3842538 3941915 4047685 4160128 4279148 4404338 4534834 4670155 4811179 4959509
58235 4959509 5116219 5282112 5458681 5647654 5849945 6066201 6297882 6546573 6812733
58226 6812733 7096622 7400042 7725730 8075532 8450863 8854624 9291091 9764334 10278370
58217 10278370 10838360 11449921 12117943 12848230 13649948 14534693 15514205 16601932 17816756
58208 17816756 19183044 20728089 22483231 24488419 26794296 29461849 32564965 36194771
58200 36194771 40459351 45480951 51400525 58390588 66665129 76480467 88135162 101976908
58192A01976908J6430238J9455115K2904195K6721323L0837689L5124513L9133982
58185B92583963M1720944M0990626L5012847K3106281O748032j0783328k5913995
58178D03465370l6329313m1542519m2404934m0258729l6363871l1701233k6954164
58171A47910607k2536309j8650846j5364265j2659084j0465947q696239p269518
58164E2268399o118846n184401m415799l778764l251056k812909k446015k137767
58156B2122842j879586j662395j477715j320417j185981j067549r59613q61960
58148A1707626p76074p00143o31199n69393n15954m69227m26744l89450l59837
58139F869605l37157l17943l00198k83794k67935k51526k35312k20824k07722
$$ plain form
58192 101976908 118407146 137862261 160766456 187487779 218325468 253449981 292583963
58185 292583963 334304907 375295533 410308380 433414661 440162693 429379365 403465370
58178 403465370 367136057 325593538 283188604 242929875 206566004 174864771 147910607
58171 147910607 125374298 106723452 91359187 78700103 68234156 59537917 52268399
58164 52268399 46149553 40965152 36549353 32770589 29519533 26706624 24260609 22122842
58156 22122842 20243256 18580861 17103146 15782729 14596748 13529199 12569586 11707626
58148 11707626 10931552 10231409 9600210 9030817 8514863 8045636 7618892 7229442 6869605
58139 6869605 6532448 6214505 5914307 5630513 5362578 5111052 4875740 4654916 4447194
58130D447194j94570j81472j69588j58845j48396j38659j30700j24127j17564
58121C083273j10653j03882r7217r0599q4982q1073p7844p3939o9749o6403o3673
58110B163259o0726n8039n6626n5994n4827n3161n1940n0902m8839m5771m3041
58099A583393m1273l9816l8164l6472l4656l2289k9525k7028k5044k3403k2249
58088A233474k1766k1481k0786j9928j9537j9519j9351j9157j9475k0157k0458
58077A011859k0050j9208j8255j7512j7365j7683j7599j6616j5393j4707j4253
58066H23218j3339j2109j1129j0339r420q720q724q978q655p843p358p517p971
58053G01116q403q676q674q655r212j0162j0215q665o618n523n232m783m306m700
$$ plain form
58130 4447194 4252624 4071152 3901564 3742719 3594323 3455664 3324964 3200837 3083273
58121 3083273 2972620 2868738 2771521 2680922 2595940 2514867 2437023 2363084 2293335 2226932 2163259
58110 2163259 2102533 2044494 1987868 1931874 1877047 1823886 1771946 1721044 1672205 1626434 1583393
58099 1583393 1542120 1502304 1464140 1427668 1393012 1360723 1331198 1304170 1279126 1255723 1233474
58088 1233474 1211708 1190227 1169441 1149513 1129976 1110457 1091106 1071949 1052474 1032317 1011859
58077 1011859 991809 972601 954346 936834 919469 901786 884187 867571 852178 837471 823218
58066 823218 809879 797770 786641 776302 766882 758162 749438 740460 731805 723962 716604 709087 701116
58053 701116 692713 684037 675363 666708 657496 647334 637119 628454 621836 616313 611081 606298 601992 597292
58039E97292n855o758p107p431p762p539o783o130n735n239m804m969n570n944
58025E09666o151o811p715p899p163o359n946n501m839m508m772n080m914m374
58011D27634l655k764j942j596j566j309q89r25j391j443o62L71J035J352J471
57996D13721J330J154J450K132K377J705N08q28k473m357n601n472m384l390l064
57981C94808l268l652l926l916l749l758m017m233m250m307m622n044n250n022
57967C35794m246l014j732p42P4R37J568J561J247J347J773J617N86m41o90n66
57951C35073q84j637k160k069j602j167r84r37n68M67J817K731L088L585M636
57936C39389N727O314O770P766R085R792R462Q600P777O867N277K661p33m158
$$ plain form
58039 597292 591437 584679 577572 570141 562379 554840 548057 541927 536192 530953 526149 521180 515610 509666
58025 509666 503515 496704 488989 481090 473927 467568 461622 456121 451282 446774 442002 436922 432008 427634
58011 427634 423979 421215 419273 417677 416111 414802 413913 412988 411597 410154 409492 409863 410898 412250 413721
57996 413721 415051 416205 417655 419787 422164 423869 424377 423549 421076 416719 411118 405646 401262 397872 394808
57981 394808 391540 387888 383962 380046 376297 372539 368522 364289 360039 355732 351110 346066 340816 335794
57967 335794 331548 328534 326802 326060 326134 327071 328639 330200 331447 332794 334567 336184 336770 336329 335639 335073
57951 335073 334189 332552 330392 328323 326721 325554 324570 323633 323065 323532 325349 328080 331168 334753 339389
57936 339389 345116 351430 358200 365966 375051 384843 394305 402905 410682 417549 422826 425487 424754 420596
57922D20596o763q071q287q149q356q961r354q903p691o408n510m785l867k794
57908C22697j708m16J177K522K937K530K032J767J456R75N04n9j015j947j765
57893C31687j39J742K441J833R33N19N26N29K87k48j085k180l331m123m148l484
57877C21759k838k882l505m098m401m599m729m598m308m181m098l526k383j171
57863B70442j39R57K044K588K683L321M958O563O952O466O369O951P246O567N429
57848C39397M755M696M545L529J609m25j753k440l234m408n404n833o068o373
57834C22593o182n037l670l169l515l840l825l754l457k412j005m06q42j053m1
57819B80385J630K827L341L553L254J786q68l850o259p704q241q216q115q150
$$ plain form
57922 420596 413833 405762 397475 389326 380970 372009 362655 353752 346061 339653 334143 329358 325491 322697
57908 322697 320989 320573 321750 324272 327209 329739 331771 333538 334994 335969 336473 336414 335399 333452 331687
57893 331687 331548 333290 335731 337564 338497 339016 339542 340071 340358 340110 339025 336845 333514 329391 325243 321759
57877 321759 318921 316039 312534 308436 304035 299436 294707 290109 285801 281620 277522 273996 271613 270442
57863 270442 270303 271260 273304 275892 278575 281896 286854 293417 300369 306835 313204 320155 327401 333968 339397
57848 339397 344152 348848 353393 356922 358531 358106 356353 353913 350679 346271 340867 335034 328966 322593
57834 322593 316411 311374 307704 304535 301020 297180 293355 289601 286144 283732 282727 282321 281479 280426 280385
57819 280385 282015 284842 288183 291736 294990 296776 295908 292058 285799 278095 269854 261638 253523 245373
57805B45373q009p301o050m591l253k426k474l097l165j879J15J462J781J822
57791B08308K037J938J184M69P19J962L553M997O093O580O375N966N951O355O765
57776B69252P023P233P277O902O245N666N119M210K918J657O02m71j578k391k900
57761C16764l572m658n831o702p090o654n109l152k163k432k599j709p83j232
57747B63078k425k444r31M23L52m42p25l45J89P91J566K242K519K554K543K327
57731B71272J876J619J759J862J679J763K524L187K622Q74j037k641m340o228
57717B76791p601p876p239o059m403k529j190q64j101j188j145j551k531l526
57703B27988m024l997l594k921k231j933k085k212j960j629j693j966j794j009
$$ plain form
57805 245373 237364 230063 224013 219422 216169 213743 211269 208172 205007 203128 203243 204705 206486 208308
57791 208308 210345 212283 213467 213936 214655 216617 220170 225167 231260 237840 244215 250181 256132 262487 269252
57776 269252 276275 283508 290785 297687 303932 309598 314717 318927 321845 323502 324104 323633 322055 319664 316764
57761 316764 313192 308534 302703 296001 288911 282257 277148 273996 271833 269401 266802 265093 264310 263078
57747 263078 260653 258209 257278 257701 258053 257611 256886 256541 256730 257521 259087 261329 263848 266402 268945 271272
57731 271272 273148 274767 276526 278388 280067 281830 284354 287541 290163 291037 290000 287359 283019 276791
57717 276791 269190 261314 254075 248016 243613 241084 239894 239030 237929 236741 235596 234045 231514 227988
57703 227988 223964 219967 216373 213452 211221 209288 207203 204991 203031 201402 199709 197743 195949 194940
57689A94940k08O1j06l36n04o10m07L72J607K942M185N383O656Q232J0410J3165
57673B45782J6077J8990K2423K6922L2272L7877M3639M9610N4643N6002N0628
57662F54865L6914J5887q541l0830m6532n4517n6399n4162m8994m2081l5016k8890
57650C01704k3736j9322j5760j2919j0196p468n502m793m703m373l756l050j982
57637A84144n26M10J41n18k65P75J403J262J078J141R03K47j10J28K70k40j075
57620A89168j794k399k688k048o25K42l70j594j957j381r60j095j018k51N24M91
57604A72245j34n08l22p0k84r66j755k332k538k393k217k546l594m730m907l810
57588A39139k316j589j877k503k783k583k103j677j699k284k904k894k383k236
$$ plain form
57689 194940 194732 194793 194687 194351 193847 193237 192830 193202 194809 197751 201936 207319 213975 222207 232617 245782
57673 245782 261859 280849 303272 330194 362466 400343 443982 493592 548235 604237 654865
57662 654865 691779 707666 699125 668295 621763 567246 510847 456685 407691 365610 330594 301704
57650 301704 277968 258646 242886 229967 219771 212303 206801 202008 197305 192932 189176 186126 184144
57637 184144 183618 184028 184169 183651 183386 184161 185564 186826 187904 189045 189948 190195 190085 190213 190483 190243 189168
57620 189168 187374 184975 182287 180239 179614 179856 179486 177892 175935 174554 173594 172499 171481 171230 171754 172245
57604 172245 172111 171603 171281 171211 170927 169961 168206 165874 163336 160943 158726 156180 152586 147856 142949 139139
57588 139139 136823 135234 133357 130854 128071 125488 123385 121708 120009 117725 114821 111927 109544 107308
57574A07308k828l436l192k239j472j421j826k183k263k120j946j987k362k892
57560G5141l193l031k525k112k227k930l715l940l456k684k060j586j058l92L42
57545D0574J036J514J662J782K465L905N572O834P658Q285Q528P909O452M861
57531A09037L738K996K179J144K38n5M24J334K067K293K249K371K709K896K685
57516A38305K256J949J943K208K605K822K486J520L14o64j371k075k787l087k674
57501A43750j931j696k419l649m459m349l632k986k748k723k643k618k899l328
57487A01670l263k325j039l70o03j038r47m88k58l01j24L77O57L63j57m56o38
57470I1060r84j264j022l60J00K7k65l69k20Q5N39J061J322J012K41n24q33n74
$$ plain form
57574 107308 104480 101044 97852 95613 94141 92720 90894 88711 86448 84328 82382 80395 78033 75141
57560 75141 71948 68917 66392 64280 62053 59123 55408 51468 48012 45328 43268 41682 40624 40232 40574
57545 40574 41610 43124 44786 46568 49033 52938 58510 65344 73002 81287 89815 97724 104176 109037
57531 109037 112775 115771 117950 119094 119332 119277 119701 121035 123102 125395 127644 130015 132724 135620 138305
57516 138305 140561 142510 144453 146661 149266 152088 154574 156094 156408 155744 154373 152298 149511 146424 143750
57501 143750 141819 140123 137704 134055 129596 125247 121615 118629 115881 113158 110515 107897 104998 101670
57487 101670 98407 96082 95043 94673 94070 93032 92085 91597 91339 91038 90914 91291 91948 92311 92154 91698 91060
57470 91060 90076 88812 87790 87430 87530 87557 87292 86923 86703 86788 87327 88388 89710 90722 90963 90439 89606 89032
57452H9032k7L52L24J40K36O65J041J039P57M19K3m90r61j149j048q26n77l66
57434H8584l53o09q63p89n00m05n64n58j58K68K65j08m44n72o15o00l91j3K95
57415H1870L47J82j22n19q48q58m93PM22P84J162J376J194O99K47J7k15p13j320
57396H3219j505r19K09J200J426P40m07j214j062k8J072J368P56n7l03J45Q16
57379H5456J128P93M1m26KJ060J677J162Q0n07m00l08n92p50l04M04P60P17O39
57360I0632O37N40L46K54L37L97J99k95p48m82Q20K370K724J538K20K46J206J465
57342A02406M82n34m71K20M09j25o58o97n11n48q16q68k66Q91J837J742O03p22
57324A02374j436j456j160q75q40j142j484j359p98m42m88k00R14K011J847N48
$$ plain form
57452 89032 89005 89357 89681 89821 90057 90722 91763 92802 93559 93978 94001 93511 92550 91401 90353 89527 88950 88584
57434 88584 88231 87622 86759 85970 85470 85065 84501 83943 83785 84053 84318 84210 83766 83194 82579 81979 81588 81575 81870
57415 81870 82217 82399 82277 81758 80910 80052 79559 79566 79988 80772 81934 83310 84504 85203 85450 85467 85252 84539 83219
57396 83219 81714 80795 81004 82204 83630 84370 83963 82749 81687 81659 82731 84099 84855 84798 84495 84640 85456
57379 85456 86584 87377 87418 86992 86994 88054 89731 90893 90973 90466 90066 89758 89166 88416 88112 88516 89276 89993 90632
57360 90632 91269 91809 92155 92409 92746 93143 93342 93047 92299 91817 92637 95007 97731 99269 99489 99735 100941 102406
57342 102406 102888 102354 101883 102103 102512 102387 101729 101032 100521 99973 99157 98289 98023 98914 100751 102493 103096 102374
57324 102374 100938 99482 98322 97447 96607 95465 93981 92622 91824 91382 90894 90694 91608 93619 95466 96014
57308I6014n43o55k27K04P25J313J461J050P71J006J051K08r39j285p93m22o76
57291I8263j181j649k282l148l949m667n673o975q020q518q839r265r596r756
57277A4745D694e631r705p827n762m743m477l690j989j67J257K675M442O195P466
57262b1956Q267d981C700Q232P704P282O781O139N594N117M313L230K548K564
57248F3204K634K216J822K152K773K758K329K715M241N551N196L363J436M05K38
57233A03033N49J141J835K226J967J241O90Q26J532K261K622K629K416K033J606
57218A28607J424J560J647J339Q90R21J621K433K643K107J334R91J331K065K706
57203A53619K979K924K698K477K447K637K765K553K174K015J978J585Q91P30J598
$$ plain form
57308 96014 95471 94816 94589 94793 95518 96831 98292 99342 100113 101119 102170 102378 101439 100154 99361 98939 98263
57291 98263 97082 95433 93151 90003 86054 81387 75714 68739 60719 52201 43362 34097 24501 14745
57277 14745 4694 -5631 -15336 -23163 -28925 -33668 -38145 -41835 -43824 -43991 -42734 -40059 -35617 -29422 -21956
57262 -21956 -13689 -4981 3700 11932 19636 26918 33699 39838 45432 50549 54862 58092 60640 63204
57248 63204 65838 68054 69876 72028 74801 77559 79888 82603 86844 92395 97591 100954 102390 102795 103033
57233 103033 103582 104723 106558 108784 110751 111992 112682 113508 115040 117301 119923 122552 124968 127001 128607
57218 128607 130031 131591 133238 134577 135467 136388 138009 140442 143085 145192 146526 147517 148848 150913 153619
57203 153619 156598 159522 162220 164697 167144 169781 172546 175099 177273 179288 181266 182851 183742 184472 186070
57188A86070K882L675L960M344M909N168N006M999N667O948Q433R701J0378J0371
57174B72511J0126J0264J0920J1709J2292J2622J2717J2654J2696J2978J3093
57163D04582J2525J1454J0658J0597J1073J1757J2525J3230J3733J4192J4800
57152E41126J5265J5183J4911J5285J6314J7069J7170J7478J8723K0270K0981
57141G29775K0822K0809K1579K2745K3496K3332K2356K1310K1190K2370K4154
57130I73938K5530K6268K7000K8358L0369L2566L4361L5515L6492L8189M1055
57119A329641M4590M8004N1130N4394N8196O2677O7950P4048Q0769Q8004R6191
57108B055594J06161J18459J33117J50109J69728J92619K19846K53117K94747
$$ plain form
57188 186070 188952 192627 196587 200931 205840 211008 216014 221013 226680 233628 242061 251762 262140 272511
57174 272511 282637 292901 303821 315530 327822 340444 353161 365815 378511 391489 404582
57163 404582 417107 428561 439219 449816 460889 472646 485171 498401 512134 526326 541126
57152 541126 556391 571574 586485 601770 618084 635153 652323 669801 688524 708794 729775
57141 729775 750597 771406 792985 815730 839226 862558 884914 906224 927414 949784 973938
57130 973938 999468 1025736 1052736 1081094 1111463 1144029 1178390 1213905 1250397 1288586 1329641
57119 1329641 1374231 1422235 1473365 1527759 1585955 1648632 1716582 1790630 1871399 1959403 2055594
57108 2055594 2161755 2280214 2413331 2563440 2733168 2925787 3145633 3398750 3693497
57099C693497L47060M11551M88427N76846O75667P84138R01885J028012J160026
57090A0067109J293435J422250J539421J636313J702735J731110J724517J700042
57082B2816932J677592J658292J612711J494580J270762R41350N35816R5303l41833
57073C1761505p46456j101357j400961j645669j834268j961661k023042k018645
57065A9029446j955047j844277j702003j544011j382392j224682j075913r39784
57057G361337q17759p09058o12757n28977m57508l96675l44504l00031k62626
57048B931442k30951k03625j80137j60193j42732j26576j11559r8132q6170p5024
57038A516343o4467n4807m6181l8278l0633k2763j4281n172M504J5206K6905L6456
$$ plain form
57099 3693497 4040557 4452108 4940535 5517381 6193048 6977186 7879071 8907083 10067109
57090 10067109 11360544 12782794 14322215 15958528 17661263 19392373 21116890 22816932
57082 22816932 24494524 26152816 27765527 29260107 30530869 31472219 32008035 32103338 31761505
57073 31761505 31015049 29913692 28512731 26867062 25032794 23071133 21048091 19029446
57065 19029446 17074399 15230122 13528119 11984108 10601716 9377034 8301121 7361337
57057 7361337 6543578 5834520 5221763 4692786 4235278 3838603 3494099 3194068 2931442
57048 2931442 2700491 2496866 2316729 2156536 2013804 1887228 1775669 1677537 1591367 1516343
57038 1516343 1451876 1397069 1350888 1312610 1281977 1259214 1244933 1239761 1244265 1259471 1286376 1322832
57026A322832L7261K3859k432l3299n9256p5363q2017q2112p8413p2733o6099
57015H32228n9139n2371m6141m0486l5353l0942k7405k4345k1167j8029j5838
57004D61012j5011j4794j4215j3246j2527j2262j1918j0986r577q179p121o278
56992C24898n177l432j234P16J968K865M065N633P016P900Q571R162Q899O619
56978C78469K099l421q154j1140j2683j3607j4220j4088j2819j0753q649o739
56966B64295m583j948O55K699M513O790R535J2123J4413J6893J9514K1019J9855
56953C85773J5420Q207n84r205j5774j9348k0469k0244j9146j7098j4256j1168
56941B62108q333o000m121k039J193N604R930J3191J6071J9774K3920K6801K7381
$$ plain form
57026 1322832 1360093 1383952 1381520 1348221 1288965 1213602 1131585 1049473 971060 898327 832228
57015 832228 773089 720718 674577 634091 598738 567796 540391 516046 494879 476850 461012
57004 461012 446001 431207 416992 403746 391219 378957 367039 356053 346476 338297 331176 324898
56992 324898 319721 316289 315055 315771 317739 320604 324669 330302 337318 345218 353789 362951 371850 378469
56978 378469 380568 377147 368993 357853 345170 331563 317343 303255 290436 279683 271034 264295
56966 264295 259712 257764 258419 261118 265631 272421 281956 294079 308492 325385 344899 365918 385773
56953 385773 401193 409400 408816 399611 383837 364489 344020 323776 304630 287532 273276 262108
56941 262108 253775 247775 243654 241615 242808 248412 258342 271533 287604 307378 331298 358099 385480
56928C85480K5657K1131J2810J329j0295j9106k4483k7377k8312k7265k4705k1498
56916B63366j8052j4470j1243q986p633o675n974n645n307m285k521o54P52J591
56902A74264J969K158K712M013N697P058P951Q829R998J1384J2930J4613J6109
56889B79685J7017J7538J8353J9704K1007K1349J9928J6070R522J037p776j5423
56877D18011k1122k4488k5278k3697k0553j6734j2665q359l714J367O840J2357
56865B81965J7543K2458K7579L3179L9095M5094N0907N5414N6146N0265L6626
56854G16271J7043m348k3181l6738m4284m6153m3043l6278k7952j9945j2728n633
56842D33031J823R421J7027K5075L3923M3159N2143O0987P0452Q0599Q9391R2558
$$ plain form
56928 385480 411137 432268 445078 446407 436112 417006 392523 365146 336834 309569 284864 263366
56916 263366 245314 230844 219601 210615 202982 196307 190333 184688 179381 175096 172575 171921 172673 174264
56902 174264 176233 178391 181103 185116 190813 197871 205822 214651 224649 236033 248963 263576 279685
56889 279685 296702 314240 332593 352297 373304 394653 414581 430651 440173 441210 433434 418011
56877 418011 396889 372401 347123 323426 302873 286139 273474 265115 261401 262768 269608 281965
56865 281965 299508 321966 349545 382724 421819 466913 517820 573234 629380 679645 716271
56854 716271 733314 728966 705785 669047 624763 578610 535567 499289 471337 451392 438664 433031
56842 433031 434854 444275 461302 486377 520300 563459 615602 676589 747041 827640 917031 1009589
56830A009589Q5272O4966L3477l244l7814o4492q0782q7161q5792p9198o9545
56819F85276n8574m7521l6874k6475j6289o797J723R940J8790K8240L7509M6364
56807F35312N5152O3046O7079O3655N0880K9521K711k4751m7718o2880p0077p1232
56795F90698o8228o2109n3784m4460l5205k6641j9132j2771p098j334M785J0768
56783C75489J6104K1003K6036L1108L4844L5055K9908J9091M188j1949k6329l6818
56771E17730m2647m4325m3004l9737l5308l0522k6153k2453j9085j5827j2988
56760A85681j0868r237p818o832o469o106m973l366k422k544k982l098l196l563
56746A12207l601k623j026J51N12M08P8n25j107j122o22l15n32p21k99N18J068
$$ plain form
56830 1009589 1094861 1159827 1193304 1190060 1152246 1087754 1006972 919811 834019 754821 685276
56819 685276 626702 579181 542307 515832 499543 492746 494469 504409 523199 551439 588948 635312
56807 635312 690464 753510 820589 884244 935124 964645 967356 942605 894887 832007 761930 690698
56795 690698 622470 560361 506577 462117 426912 400271 381139 368368 361270 359936 364721 375489
56783 375489 391593 412596 438632 469740 504584 539639 569547 588638 592826 580877 554548 517730
56771 517730 475083 430758 387754 348017 312709 282187 256034 233581 214496 198669 185681
56760 185681 174813 165576 157758 150926 144457 138351 133378 130012 127590 125046 122064 118966 115770 112207
56746 112207 108606 105983 104957 105108 105620 106028 106106 105581 104474 103352 102730 102415 101883 101162 100863 101381 102449
56729A02449R82L00o94j442j378o57j81m41p43k28Q48J530J593J646J921J984
56713A07489J691J511J540J176J86o85p26k18K59P12J224J242L20q65j210o56
56697A12990J5N68J401K312K410J525O63O20R70R59O27M17L95M50P37J277J515
56680A29851R40j25r07j092q52k58P28J742K134J680Q44L13M27J005J554J734
56664A39718J732J984K440K564K164J798J957K370K568K632K827K901K444J735
56650A71834J456J705J938J843J624J435J198R83R59R46N77l4l81l50k64j18L84
56633A85735R24O69l66r45l59L32l21k067l403l792m229n473o797p119o533o062
56617A40194o304p007p752q261q102o805m631k673j735j486j103m68l9K16Q64
$$ plain form
56729 102449 103431 103731 103037 101595 100217 99560 99379 98938 98195 97967 98815 100345 101938 103584 105505 107489
56713 107489 109180 110691 112231 113407 113593 112908 112182 111964 112223 112935 114159 115401 115721 114856 113646 112990
56697 112990 113005 113573 114974 117286 119696 121221 121884 122504 123474 124433 125060 125477 125872 126322 127059 128336 129851
56680 129851 130791 130666 129759 128667 127815 127557 128285 130027 132161 133841 134685 134998 135425 136430 137984 139718
56664 139718 141450 143434 145874 148438 150602 152400 154357 156727 159295 161927 164754 167655 170099 171834
56650 171834 173290 174995 176933 178776 180400 181835 183033 184016 184975 185921 186498 186464 186083 185733 185469 185351 185735
56633 185735 186659 187328 186962 186017 185658 185990 185669 183602 180199 176407 172178 166705 159908 152789 146256 140194
56617 140194 133890 126883 119131 110870 102768 95963 91332 88659 86924 85438 84335 83867 83828 84044 84908
56602H4908J905K493K160J610J654K040K157K279L082M158M283L209K112J851
56588A19901J877J389O52L68M69M19K68M85R75J159R16P14P72Q13P09O78P68P14
56570A34046N25O01R87J152Q22O00J174K287L036L100L080L566M366M834M635
56555A68811L882K759J444L25j26P6L19R7l77o17o63q99j197r10M4P64M86l73
56537A73845q83q79q63r45p30k70k00p26j186j019n19j61K02Q31J278Q74j15o37
56519A67897j87O27R95P87K62n36j594k485k634j998j143n74k88k1L08N50N83
56502A60549M12J45n8l3K23M63M34K33K36N63Q03N37l4k89q6Km57j051j051m43
56482A61098P8R2j02j14l8o8m3K22M11J14m44n84j06N38J013J410J644J238J72
$$ plain form
56602 84908 86813 89306 91466 93076 94730 96770 98927 101206 104288 108446 112729 115938 118050 119901
56588 119901 121778 123167 123819 124187 124656 125075 125343 125828 126803 127962 128878 129592 130364 131177 131886 132564 133332 134046
56570 134046 134571 135172 136159 137311 138133 138733 139907 142194 145230 148330 151410 154976 159342 164176 168811
56555 168811 172693 175452 176896 177221 177095 177171 177490 177587 177210 176593 175930 175031 173834 172924 172968 173732 174218 173845
56537 173845 172962 172083 171220 170275 169545 169275 169075 168349 167163 166144 165625 165464 165666 166497 167775 168649 168534 167897
56519 167897 167710 168337 169332 170119 170381 169845 168251 165766 163132 161134 159991 159417 159129 159108 159416 159966 160549
56502 160549 160961 161106 161048 161015 161238 161701 162135 162368 162604 163167 163970 164507 164473 164184 164098 164100 163643 162592 161541 161098
56482 161098 161176 161268 161166 161052 161014 160946 160903 161125 161536 161650 161206 160622 160516 161054 162067 163477 165121 166359 166531
56463A66531o32l57N14P81J21o16o76j79M65J148J699J627Q09n6k08K41O60P97
56445A72669P87N76M0m08j02R56J990K409K307J952J368O49J66J58M29P23J007
56428A87676J178R44K95k61k69J03M25N22M15J00k67l73k93n74j300j603q63J
56410A85856o10k858n164o079n702m931m127k989j284P84K659L664L455K517J756
56395A66947J492J214N96J80O03J606K333K349J952J586J447J546J775J923J832
56380A89381J506J014M75K06M97J126J456J223P80M00k4l06K51J725K931K761
56364B05402J667R75J073J330J414J519J423O18m58n81M72J452J429J018J155
56349B19908J678J886J711J424Q62m4n18J88J480J971J298M88M62J049J595J883
$$ plain form
56463 166531 165899 165542 166056 166837 166958 166342 165666 165487 165952 167100 168799 170426 171235 171179 170971 171212 171872 172669
56445 172669 173456 174032 174072 173664 173562 174518 176508 178917 181224 183176 184544 185193 185359 185517 185946 186669 187676
56428 187676 188854 189798 190093 189832 189563 189666 190091 190613 191028 191128 190861 190488 190195 189621 188321 186718 185855 185856
56410 185856 185246 182388 177224 171145 165443 160512 156385 153396 152112 152896 155555 159219 162674 165191 166947
56395 166947 168439 169653 170249 170429 171032 172638 174971 177320 179272 180858 182305 183851 185626 187549 189381
56380 189381 190887 191901 192376 192582 193079 194205 195661 196884 197664 198064 198040 197734 197985 199710 202641 205402
56364 205402 207069 208044 209117 210447 211861 213380 214803 215421 214963 214382 214854 216306 217735 218753 219908
56349 219908 221586 223472 225183 226607 227469 227425 226907 227095 228575 230546 231844 232332 232794 233843 235438 237321
56333B37321K088K345K635K848K863K731K724K923K959K504J856J547J499J179
56319B70022N63L12P79J352J150Q6j027j306o01M53J151J389J525J647J450R86
56303B79931R52J727K681L078L265M018N068N317M537L689L382L083K386K025
56289C25139K814M340N461N729N489N048M491M071M041M205M274M555N626P326
56275C92609Q701R083Q754Q424Q574R423J1068J3194J4971J5625J5263J4872J5463
56262E46024J7213J9511K1736K3871K6320K9326L2851L6884M1518M6633N1898
56251H93785N7305O3336P0346P7981Q5512R2593R9323J05666J11107J14994J16930
56240A888878J16729J14128J08771J00522Q9679P6605O1201M3107K2702J509j8804
$$ plain form
56333 237321 239409 241754 244389 247237 250100 252831 255555 258478 261437 263941 265797 267344 268843 270022
56319 270022 270585 270897 271676 273028 274178 274264 273237 271931 271330 271783 272934 274323 275848 277495 278945 279931
56303 279931 280883 282610 285291 288369 291634 295652 300720 306037 310574 314263 317645 320728 323114 325139
56289 325139 327953 332293 337754 343483 348972 354020 358511 362582 366623 370828 375102 379657 385283 392609
56275 392609 401310 410393 419147 427571 436145 445568 456636 469830 484801 500426 515689 530561 546024
56262 546024 563237 582748 604484 628355 654675 684001 716852 753736 795254 841887 893785
56251 893785 951090 1014426 1084772 1162753 1248265 1340858 1440181 1545847 1656954 1771948 1888878
56240 1888878 2005607 2119735 2228506 2329028 2418707 2495312 2556513 2599620 2622322 2623831 2605027
56229B605027l7609n4897p0069q2036r0600r6737j01111j03290j02976j01153
56219A764549r9073r6687r3037q7880q2024p6224p0632o5253o0108n4934m9516
56208I29181m4331m0174l7043l4133l1009k8024k5438k2931k0361j8125j6389
56197F11223j4588j2343j0310r391r416r280q256o651n194m278l823l540l147
56184E11006k553j869j289r31q33r11r08n75M0O39J065J421J761J982K092K250
56168E12387K445K510K541K881L490L856L804L944M851O210P301P958Q536R148
56154E81862R611J0051J0946J2483J4398J6418J8522K0768K3356K6813L1608L7495
56142H14331M3834N0577N8345O7286P6452Q4552R0715R4094R3435Q7839P7890
$$ plain form
56229 2605027 2567418 2512521 2442452 2360416 2269816 2173079 2071968 1968678 1865702 1764549
56219 1764549 1665476 1568789 1475752 1387872 1305848 1229624 1158992 1093739 1033631 978697 929181
56208 929181 884850 844676 807633 773500 742491 714467 689029 666098 645737 627612 611223
56197 611223 596635 584292 573982 564591 555175 545895 537639 530988 525794 521516 517693 514153 511006
56184 511006 508453 506584 505295 504364 503531 502620 501712 501137 501177 501816 502881 504302 506063 508045 510137 512387
56168 512387 514832 517342 519883 522764 526254 530110 533914 537858 542709 548919 556220 564178 572714 581862
56154 581862 591473 601524 612470 624953 639351 655769 674291 695059 718415 745228 776836 814331
56142 814331 858165 908742 967087 1034373 1110825 1195377 1286092 1380186 1473621 1561460 1639350
56131A639350O5545N3119M2705L5928L3165L2817L2016K8401K1214J1076l82j0746
56119A984208j7796k1145k2652k4932k9721l7628m8549o1414p3877q3181q7637
56108A475676q7222q3045p6568o8964o0612n1283m1224l1805k4556j9698j6197
56097I14502j3090j0178p509n021k811j161p5P46J421J911K471L418M428M858
56083H93910M824N159O129P102P821Q835J0229J0917J0186Q972Q683R399J0248
56070A002414J0946J1789J2550J2645J2245J2186J2733J3380J3885J4631J5864
56059A145268J7319J8666J9699K0079J9636J8858J8427J8339J8114J7707J7405
56048A349517J7069J6407J5906J6418J7823J9090J9805K0586K1868K3329K4788
$$ plain form
56131 1639350 1704895 1758014 1800719 1836647 1869812 1902629 1934645 1963046 1984260 1995336 1994954 1984208
56119 1984208 1966412 1945267 1922615 1897683 1867962 1830334 1781785 1720371 1646494 1563313 1475676
56108 1475676 1388454 1305409 1228841 1159877 1099265 1047982 1006758 974953 950397 930699 914502
56097 914502 901412 891234 883725 878704 875893 874732 874657 875403 876824 878735 881206 884624 889052 893910
56083 893910 898734 903893 910022 917124 924945 933780 944009 954926 965112 974084 982767 992166 1002414
56070 1002414 1013360 1025149 1037699 1050344 1062589 1074775 1087508 1100888 1114773 1129404 1145268
56059 1145268 1162587 1181253 1200952 1221031 1240667 1259525 1277952 1296291 1314405 1332112 1349517
56048 1349517 1366586 1382993 1398899 1415317 1433140 1452230 1472035 1492621 1514489 1537818 1562606
56037A562606K6547K8512L0009L0949L2157L4024L5748L6546L6694L6854L7193
56026A927839L7878L9463M1897M3902M4292M3460M2780M2985M3935M5512M7818
56015B401761N0718N3956N7582O1700O5937O9809P3455P7490Q2124Q6898R1260
56004C172690R5118R8866J03016J07758J12823J17902J23136J28899J35268J42111
55994D337587J49607J58077J67489J77668J88864K01350K14748K28672K43854
55985F067916K61473K81484L02902L25732L51187L79792M10882M44489M82175
55976I308032N25258N73557O26832O86302P54049Q32037R22556J028774J154364
55967A6411761J303759J483244J700773J964553K283263K667740L130477L683036
$$ plain form
56037 1562606 1589153 1617665 1647674 1678623 1710780 1744804 1780552 1817098 1853792 1890646 1927839
56026 1927839 1965717 2005180 2047077 2090979 2135271 2178731 2221511 2264496 2308431 2353943 2401761
56015 2401761 2452479 2506435 2564017 2625717 2691654 2761463 2834918 2912408 2994532 3081430 3172690
56004 3172690 3267808 3366674 3469690 3577448 3690271 3808173 3931309 4060208 4195476 4337587
55994 4337587 4487194 4645271 4812760 4990428 5179292 5380642 5595390 5824062 6067916
55985 6067916 6329389 6610873 6913775 7239507 7590694 7970486 8381368 8825857 9308032
55976 9308032 9833290 10406847 11033679 11719981 12474030 13306067 14228623 15257397 16411761
55967 16411761 17715520 19198764 20899537 22864090 25147353 27815093 30945570 34628606
55959C4628606M336629N107766O023189P118338Q431504J0001298J1870708J4088675
55951A01606713J6692916J9678219K2989473K6557086L0284298L3843003L6327924
55944B87979632L6154523L1613866K1959750Q243868o882404k0365111l0072453
55937C28631671l5369746l6810487l5463817l2406820k8515889k4425745k0541305
55930A15097862j7077749j4117591j1659909r654456q030362o718340n658242
55923D2181213m797312m091160l506801l020535k613115k269002j977740j731818
55915A8173730j523421j345115j191966j060483r46614q46823p59732o84635o19492
55906I195449n62062n11709m68224m30109l95683l64750l37497l12849k89503
$$ plain form
55959 34628606 38965235 44073001 50096190 57214528 65646032 75647330 87518038 101606713
55951 101606713 118299629 137977848 160967321 187524407 217808705 251651708 287979632
55944 287979632 324134155 355748021 377707771 385951639 379069235 358704124 328631671
55937 328631671 293261925 256451438 220987621 188580801 160064912 135639167 115097862
55930 115097862 98020113 83902522 72242613 62588157 54557795 47839455 42181213
55923 42181213 37383901 33292741 29785940 26765405 24152290 21883288 19905548 18173730
55915 18173730 16650309 15305194 14113228 13052745 12106131 11259308 10499576 9814941 9195449
55906 9195449 8633387 8121678 7653454 7223345 6827662 6462912 6125415 5812566 5523063
55897E523063k67661k48191k30991k15441k01493j88975j76796j64183j51878
55888C677454j40826j30498j19807j08918r9127r1669q7468q6934q8846r0432
55878B632929q9716q7002q3242p8302p2244o6883o4281o4241o4841o4865o4352
55867A832960o3352o1677n9501n6970n3582m9109m4644m1532l9636l7796l5566
55856A289595l3325l1168k8869k6644k4843k3188k1363j9949j9663k0124k0443
55845A020016k0679k1471k2580k3092k2853k2515k2241k1480k0051j8424j7011
55834G87619j5889j5103j4454j3384j1831j0663j0346r922q468o833o445o998
55822F57283p059o648p232r137j0844j1252j0954j0787j0567r977r357q919q268
$$ plain form
55897 5523063 5255402 5007211 4776220 4560779 4359286 4170311 3993515 3829332 3677454
55888 3677454 3536628 3406130 3286323 3177405 3078278 2986609 2899141 2812207 2723361 2632929
55878 2632929 2543213 2456211 2372969 2294667 2222423 2155540 2091259 2027018 1962177 1897312 1832960
55867 1832960 1769608 1707931 1648430 1591460 1537878 1488769 1444125 1402593 1362957 1325161 1289595
55856 1289595 1256270 1225102 1196233 1169589 1144746 1121558 1100195 1080246 1060583 1040459 1020016
55845 1020016 999337 977866 955286 932194 909341 886826 864585 843105 823054 804630 787619
55834 787619 771730 756627 742173 728789 716958 706295 695949 686027 677559 670726 664281 657283
55822 657283 650224 643576 636344 627207 616363 605111 594157 583370 572803 562826 553469 544550 536282
55809E36282p238o252n353l936j957k97N36J094J852K522K935L570M461M788M209
55794E37216L523L249K595R00r40j706j670j979k734l053k773k934m545p648j1526
55779E05975j5062j6999j6630j4345j1111p619m260j416R15L316N874P169N354
55766D41161L74n577r919j1589j1177r932q755p657o025l659j409l66n32q91p46
55751C63301m70r01k485m994p599r127q932p643o655o543o449n336l452k136k262
55736B88317l328m148m205l993m066m100l361j986j067j279k002k347k491l208
55722B46736m408n103m820m136l583k841j522NJ085J709K354L196L940M250L946
55707B40808K984J645O41M96Q59P45m52k408m288n543o272o945p703p946o935
$$ plain form
55809 536282 529044 522792 517439 513503 511546 511249 511785 512879 514731 517253 520188 523758 528219 533007 537216
55794 537216 540739 543988 546583 547483 546543 544837 543167 541188 538454 535401 532628 529694 525149 517501 505975
55779 505975 490913 473914 457284 442939 431828 424209 419949 418533 419448 422764 428638 435807 441161
55766 441161 441535 435958 426039 414450 403273 393341 384586 376929 370904 367245 365836 365470 364938 364047 363301
55751 363301 362831 361930 359445 354451 346852 337725 328793 321150 314495 307952 301503 296167 292715 290579 288317
55736 288317 284989 280841 276636 272643 268577 264477 261116 259130 258063 256784 254782 252435 249944 246736
55722 246736 242328 237225 232405 228269 224686 221845 220323 220328 221413 223122 225476 228672 232612 236862 240808
55707 240808 243792 245437 246078 246574 247433 248178 247726 245318 241030 235487 229215 222270 214567 206621 199686
55692A99686m951l370l155l653l437k144o74K03O49J008J220J306J719K589L266
55677A90262L151K633K420K409J942R61O0n30j205k027k403k013j453j418j716
55662A91073j629r75k86k2n5QK70M74L85J67K61Q38J561J995K154K323K475K233
55644B03250J410K30r81k004k614k755k818l355m354n284n848o184o189n472m254
55629A52778l509l665l805k894j321m08o42j213j213o20m7l9o51j396j625j256
55613A28474q95r25r55o19m65j214k404k784j991r82o54q91j184j399j571j557
55597A07984j338j194j243j223j006q61r54j017q57p40q70q96l65N72J325J550
55581I8867J375J101R20Q53P27M22K08N72J499K270K253J694J337J439J546J213
$$ plain form
55692 199686 194735 191365 188210 184557 181120 178976 178302 178505 179154 180162 181382 182688 184407 186996 190262
55677 190262 193413 196046 198466 200875 202817 203778 203838 203308 202103 200076 197673 195660 194207 192789 191073
55662 191073 189444 188469 188183 188161 188106 188114 188384 188858 189243 189410 189671 190509 192070 194065 196219 198542 201017 203250
55644 203250 204660 204890 203909 201905 199291 196536 193718 190363 186009 180725 174877 168693 162504 157032 152778
55629 152778 149269 145604 141799 138905 137584 137176 136534 135321 134108 133488 133441 133402 132751 131355 129730 128474
55613 128474 127579 126654 125699 125080 124615 123401 120997 118213 116222 115240 114586 113695 112511 111112 109541 107984
55597 107984 106646 105452 104209 102986 101980 101119 100165 99148 98291 97551 96681 95785 95420 95992 97317 98867
55581 98867 100242 101343 102263 103116 103843 104265 104473 105045 106544 108814 111067 112761 114098 115537 117083 118296
55565A18296N49q0n90j135j657j820j553j338j680k380k795k721k538k366j822
55550I4370q24J7L34O16J234J546R15J6PO84Q10J64j13N87J444J648J527J614
55532A06596J657J338J000R07N99k05q50p32l31l30m40j04J81m81j845k788k994
55515A01178l160l565l609k992k309k070j948j529j051r01r03o15k4N26Q64J042
55499G8934J001O26N3l17k48K3L8l31o78n63o2M20Q50J622K739L445L030J788
55481I2370P75O91J290J742J394L02p71j074p53o57j219j872j927j485j084r45
55465H6777j051j493k060j922n50J258K076J515M51k87o20o11j06P06J103O69
55449H5855j35n86n21k53p1j09l91p04o98l03J01J57q4l40m37l45r8J85L56M24
$$ plain form
55565 118296 118845 118765 118175 117040 115383 113563 112010 110672 108992 106612 103817 101096 98558 96192 94370
55550 94370 93546 93563 93897 94513 95747 97293 98208 98224 98231 98915 99725 99889 99776 100363 101807 103455 104982 106596
55532 106596 108253 109591 110591 111498 112097 111892 111042 110310 109979 109649 109209 109105 109286 108805 106960 104172 101178
55515 101178 98018 94453 90844 87852 85543 83473 81525 79996 78945 78044 77141 76526 76502 77028 77892 78934
55499 78934 79935 80561 80614 80297 80049 80072 80110 79779 79101 78538 78476 78896 79746 81368 84107 87552 90582 92370
55481 92370 93145 93836 95126 96868 98262 98564 97793 96719 95966 95309 94090 92218 90291 88806 87722 86777
55465 86777 85726 84233 82173 80251 79701 80959 83035 84550 85001 84714 84094 83483 83377 84083 85186 85855
55449 85855 85720 85134 84613 84360 84289 84180 83789 83085 82387 82084 82185 82342 82258 81918 81481 81136 81038 81223 81579 82003
55429H2003N32O81P31O48N65N14L31p4n29p41n49k8N44Q73R44R88J116J151J005
55410I0705Q85Q40M69m65j413j661j335j215j573j847j569r73m80j77K8N7j97
55393H0079o70j151j286o82N94J663J566M17o40p92l55k3K9M6J11R2o7l18n88
55374G8025p49p00n18l33l9N14J044J028M30k46o76r98j254j180p93n43n49l04
55356G2159L34N18m60j857k097o95J132J934J479O13Q4q2k37n11o98o68o09p25
55338F9614p96m05L88R31P60K35J92R90K094K504J620j72j677j866p82N88J276
55321G5494J025K05n73p44j21Q62J446J221M30l60p03n51l37o55j505k053j571
55304G1510m30L83N83P38J184J574J656J631J526R85N1n95n78l07j64J16O27P19
$$ plain form
55429 82003 82535 83216 83947 84595 85160 85674 86005 85931 85402 84661 84112 84084 84628 85501 86445 87433 88549 89700 90705
55410 90705 91590 92430 92899 92434 91021 89360 88025 86810 85237 83390 81821 80848 80368 80191 80219 80276 80079
55393 80079 79409 78258 76972 76290 76884 78547 80113 80530 79890 79098 78743 78720 78749 78795 78906 78998 78931 78613 78025
55374 78025 77276 76576 76058 75725 75686 76200 77244 78272 78702 78456 77780 76782 75528 74348 73555 73012 72463 72159
55356 72159 72493 73011 72551 70694 68597 67902 69034 70968 72447 73060 73144 73062 72825 72314 71616 70948 70339 69614
55338 69614 68818 68413 68801 69732 70492 70727 70919 71909 74003 76507 78127 77955 76278 74412 73630 74218 75494
55321 75494 76519 76724 76151 75407 75286 76148 77594 78815 79245 78885 78182 77631 77294 76639 75134 73081 71510
55304 71510 71080 71463 72046 72784 73968 75542 77198 78829 80355 81340 81391 80796 80218 79911 79747 79863 80490 81209
55286H1209k2q60p92N2P05P74O82P29P26N92N75P81R48P95K89m24j057j285j082
55267H3335q31p97q24p47p75j022j077n65K07P13R72J240J282O94k42q13q60q09
55249G9081p87m80J18N52O47P30R16Q03J51o37j021r13n73k39k8P2K07M37N39
55230G9575L64J86L52O61O37L44K90N74O68K47m01q88j091r22l49J52j10r44j168
55211G8177j16J313J735R88Q4k64k84l79m83l91k35k68l96l19l0J36J7q3K07P09
55191H0118Q74N57K68M18O69M24k41o12k69M28Q98R60Q21O75N10J77l55p49n25
55172H5046K61Q10N01j87j97O71J476J348M40m88r46q65m12O3J64j10l12j29K40
55153H7374M36L89J77k25p43j018p46p5N42P81O60M99P40J523K331K349J347o
$$ plain form
55286 81209 81187 80327 79535 79587 80292 81066 81748 82477 83203 83795 84370 85151 86099 86894 87183 86759 85702 84417 83335
55267 83335 82504 81707 80883 80136 79361 78339 77262 76697 76904 77617 78589 79829 81111 81805 81563 80750 79890 79081
55249 79081 78294 77814 77932 78484 79131 79861 80777 81580 81731 81094 80073 79160 78587 78348 78320 78392 78599 79036 79575
55230 79575 79939 80125 80477 81138 81775 82119 82409 82983 83651 83898 83497 82609 81518 80596 80247 80399 80289 79345 78177
55211 78177 78061 79374 81109 82097 82181 81917 81633 81254 80771 80380 80145 79877 79481 79162 79132 79268 79285 79202 79409 80118
55191 80118 80992 81549 81817 82235 82904 83328 83087 82475 82206 82634 83532 84492 85313 85988 86498 86675 86320 85571 85046
55172 85046 85307 86117 86618 86431 86234 86905 88381 89729 90169 89681 88735 87870 87458 87521 87685 87575 87263 87134 87374
55153 87374 87810 88199 88376 88151 87408 86390 85644 85569 86111 86892 87552 88051 88791 90314 92645 94994 96341 96335
55135I6335q37q17k07N00P66L01o04j253j248p62r4N80Q81K82j071k110j945r07
55117H7790l5J68l1k81m44l98j18J04L8m7K57P46Q46M84P3k98r40j696j751p41
55097H3726N34J033P17L91N78J094J558J777J622J064M29K86P17J019M41q31j739
55080I4416j509m74M12O89O77P14O04M8o94j110j195j362j576j173J33J601K280
55063I2481K140J842J627J115K36m21l89P6N47R91J341J062j35j484j915j480
55047I7634j192j444j480p65K7K5n48q19n60k40q9O7J45k09q94j292j063m72K03
55028H7034R83J673J676P62l63p32k21L75L00m04r79o76N39J830K187J413L00
55011I5697k45j22M0k46p78r44m32M42J151J507J668J676J340P09K17J14K0m44
$$ plain form
55135 96335 95498 94681 94474 94974 95740 96041 95437 94184 92936 92174 92080 92660 93541 93823 92752 90642 88697 87790
55117 87790 87755 87923 87892 87611 87167 86769 86651 86755 86793 86746 87003 87749 88595 89079 89152 88854 87914 86218 84467 83726
55097 83726 84260 85293 86010 86401 86979 88073 89631 91408 93030 94094 94523 94809 95526 96545 96986 96155 94416
55080 94416 92907 92433 92845 93534 94211 94925 95529 95577 94883 93773 92578 91216 89640 88467 88600 90201 92481
55063 92481 94621 96463 98090 99205 99441 99020 98631 98707 99254 100245 101586 102648 102513 101029 99114 97634
55047 97634 96442 94998 93518 92753 92780 92805 92257 91438 90878 90638 90549 90616 90761 90552 89658 88366 87303 86831 87034
55028 87034 88017 89690 91366 92128 91765 91033 90812 91187 91487 91083 90104 89428 89967 91797 93984 95397 95697
55011 95697 95452 95330 95370 95124 94346 93402 92970 93412 94563 96070 97738 99414 100754 101463 101680 101794 101814 101370
54993A01370r34q09j67J89j57p19q06k54O39J426J652J176M74J78K31J2n96q91
54975A02014l77N16J112J296J249Q83J54m64m19J56O43P10M95J97n6j23n2j80
54957A07754o63j014o28L56J120J132O30J24k19n20q58j112j151r93p37l97R4
54940A02918N72N85l4o99o77k4N43P69J045J458J443P85J78K47P24J155J698K472
54922A15158K835K351J882K593M181N337N757O332P261P372N784L120M21k119
54908A68265m558o177o174m952l886l781m244m469m056l053j768p42n09j125k001
54893A16770k368j939j086l88l5K42O56R71Q49M12J61L57Q32J369J956K576L127
54876A24462L662M411N337N947N786M963M010L228K426J270j99j556k508l337
$$ plain form
54993 101370 100436 99627 99460 99649 99492 98773 97967 97713 98352 99778 101430 102606 103080 103258 103489 103501 102905 102014
54975 102014 101637 102153 103265 104561 105810 106693 106847 106383 105964 106120 106763 107473 107968 108165 108109 107986 107934 107754
54957 107754 107091 106077 105449 105805 106925 108057 108687 108811 108592 108072 107214 106102 104951 103958 103221 102824 102918
54940 102918 103490 104075 104041 103342 102665 102641 103184 103953 104998 106456 107899 108684 108862 109109 109833 110988 112686 115158
54922 115158 117993 120344 122226 124819 129000 134337 140094 146426 153687 161059 166843 169963 170384 168265
54908 168265 163707 157530 151356 146404 142518 138737 134493 130024 125968 122915 121147 120405 119896 118771 116770
54893 116770 114402 112463 111377 110989 110954 111196 111852 112823 113672 114084 114245 114602 115434 116803 118759 121335 124462
54876 124462 128124 132535 137872 143819 149605 154568 158578 161806 164232 165502 165303 163747 161239 157902
54862A57902m487n746o285n688m550l685l132k503j924j871k193k143j472q53
54848A11370r17j455j884k002j949j824j662j485j149m69L69Q82Q98O88L04n69
54832I9146j798k420j711k20Q12Q31K37m11q65r34m51L97J113J413J419J301J029
54815I8888N66K5m74q94j108q34j1Q96J144N10l04l64L38P57J91o13l58R12J677
54796A00944R57l39o26L34J374J515R08K41o5Q3O12J238J516J257P65N35P57J135
54778A13141J234R60O61O70Q10P15N12Q00J766K816L381L635M004M434M677M929
54762A49145N494N972N621M463L319K542J450n80l030m706n060m661m423m751
54748A50795n282n386m849m044l405k859k102j275r14j151j469j404j050o32p3
$$ plain form
54862 157902 153415 147669 141384 135696 131146 127461 124329 121826 119902 118031 115838 113695 112223 111370
54848 111370 110453 108998 107114 105112 103163 101339 99677 98192 97043 96574 96943 97825 98723 99411 99715 99146
54832 99146 97348 94928 93217 92997 93809 94640 94877 94466 93601 92667 92216 92613 93726 95139 96558 97859 98888
54815 98888 99454 99479 99005 98111 97003 96169 96158 97054 98198 98708 98404 98040 98378 99135 99326 98713 98355 99267 100944
54796 100944 101901 101562 100936 101270 102644 104159 105067 105308 105243 105326 105938 107176 108692 109949 110714 111249 112006 113141
54778 113141 114375 115335 115996 116666 117476 118191 118703 119503 121269 124085 127466 131101 135105 139539 144216 149145
54762 149145 154639 160611 166232 170695 174014 176556 178006 177426 174396 169690 164630 159969 155546 150795
54748 150795 145513 140127 135278 131234 127829 124970 122868 121593 120679 119528 118059 116655 115605 114973 114900
54733A14900O38J074R64P96J218J918J845O95m19j51J561L542M661M750M375M135
54717A46502M255M561M629M070K778R64j047k953m437n204n213m809m451m279
54703A35366m025l399k489j701j338j301j232r18n02k72k94l59l26l12m93q05
54687A15600j029j104j121j069q03l28K1r1o22j148j274r50n09l42m86n45j78
54670A04022M20P19N97N05P78J108R60L35k73n53o13o19n04j84K50O76J030J127
54652A09781O67l04j131j142m70N9n0l68k08M44J045J347J593J797J478M25o99
54635A14264j078p81n12m70j83M79Q55L90n33j117j100p40k07M54R56R32M97J99
54617A12305K46K02m05j365j917j495l56N80N50k48p92k93R87K071K280J711Q53
$$ plain form
54733 114900 115538 116612 117576 118372 119590 121508 123353 124048 123629 123478 125039 128581 133242 137992 142367 146502
54717 146502 150757 155318 159947 164017 166795 167759 166712 163759 159322 154118 148905 144096 139645 135366
54703 135366 131341 127942 125453 123752 122414 121113 119881 118963 118461 118189 117895 117536 117210 116898 116405 115600
54687 115600 114571 113467 112346 111277 110474 110146 110167 110076 109454 108306 107032 106082 105573 105231 104745 104200 104022
54670 104022 104442 105161 105758 106263 107041 108149 109109 109444 109171 108618 108005 107386 106882 106698 106948 107624 108654 109781
54652 109781 110448 110144 109013 107871 107401 107460 107410 107042 106834 107278 108323 109670 111263 113060 114538 114963 114264
54635 114264 113186 112405 111893 111423 111240 111719 112574 112964 112431 111314 110214 109474 109267 109721 110677 111609 112106 112305
54617 112305 112551 112753 112348 110983 109066 107571 107215 107795 108345 108097 107305 107012 107999 110070 112350 114061 114914
54600A14914J05m24q55j310j596j264k08R42J385J015M24R3K5Q4K77M98M81J71
54582A14757j11j67l37j078k244l025k656j133P00J780J641P38n0j93K15P93J185
54565A10815J085L79o31j344j329o26L93J256J545J131L50l04o54p86o48j49L87
54548A10870M49J92M06J349K165J980J093M68M19M97M15L59L67J50l00n45l61
54531A19973r9j43l92n40n17m34l50k46o6L15Q88J261J008L68Q8M26P69N64O5
54512A22938k74n43r35j046m64K89K70m25p11j12N53M42j59n17n17m81l56O6M58
54493A18476K50m82j027r88n68L7R17J858K162J476M53J09O41J215R81L3p40o85
54475A24118p1L40K79J72L28M00K4m10k82J78J82k65j48R62K007J730M11n21m17
$$ plain form
54600 114914 115019 114595 113740 112430 110834 109570 109362 110304 111689 112704 113128 113221 113246 113330 113607 114105 114586 114757
54582 114757 114646 114479 114142 113064 110820 107795 105139 104006 104706 106486 108127 108865 108815 108622 108837 109630 110815
54565 110815 111900 112279 111648 110304 108975 108349 108742 109998 111543 112674 113024 112720 112066 111280 110632 110483 110870
54548 110870 111319 111511 111917 113266 115431 117411 118504 118972 119391 119888 120303 120662 121029 121179 120879 120334 119973
54531 119973 119874 119731 119339 118799 118282 117848 117498 117252 117186 117501 118389 119650 120658 121026 121114 121540 122309 122873 122938
54512 122938 122664 122121 121186 120140 119676 119965 120235 119810 119099 118987 119540 119982 119823 119306 118789 118308 117952 118018 118476
54493 118476 118726 118244 117217 116229 115661 115698 116615 118473 120635 122111 122564 122673 123314 124529 125510 125543 124803 124118
54475 124118 124047 124387 124666 124838 125166 125566 125590 125180 124898 125076 125258 124993 124845 125807 127814 129544 129955 129434 129017
54456A29017o7l81j117j289m89O18J026M31n05q84n62k25m43r13r30l65K34M49
54438A23605M62O13R05J124J223J289J261R00O4j023j879k121j784j230p08j21
54422A22580O85J507J931J850J506J072M42l71r67r00k46M28O78N65M45M83N52
54405A32240N17M82O46R52J044O10k33r89j263j106q76p32m42K48J158J771J848
54388A35875J646J462J187N93j59o85q97r60q38l51K78N06K21l5J68O06Q87R65
54370A40469R11O52L28M33J144J900K115J950J896J962J891J852K160K576K589
54355A64828K321K342K641K471J430j0j180j918k391k744l084l431l604l436l120
54340A51115k876k479j667q46o83j030j107q12q61j425j630q75K07O70M61R0k33
$$ plain form
54456 129017 128950 128569 127452 126163 125674 126292 127318 127749 127244 126360 125798 125573 125130 124217 123287 122922 123156 123605
54438 123605 124067 124680 125585 126709 127932 129221 130482 131382 131446 130423 128544 126423 124639 123409 122701 122580
54422 122580 123265 124772 126703 128553 130059 131131 131573 131202 130235 129335 129089 129517 130195 130760 131205 131688 132240
54405 132240 132757 133239 133885 134837 135881 136491 136258 135269 134006 132900 132024 131292 130850 131098 132256 134027 135875
54388 135875 137521 138983 140170 140763 140604 139919 139022 138062 137224 136873 137151 137657 137878 137843 138011 138617 139504 140469
54370 140469 141380 142032 142360 142793 143937 145837 147952 149902 151798 153760 155651 157503 159663 162239 164828
54355 164828 167149 169491 172132 174603 176033 176023 174843 172925 170534 167790 164706 161275 157671 154235 151115
54340 151115 148239 145760 144093 143247 142564 141534 140427 139615 138754 137329 135699 134824 135031 135701 136162 136252 136019
54323A36019m70l63J94P50Q77P12M47j24j025j607j342o68l30l10j97p5k53m66
54305A31769l00m5k63o85n82n9Q3l08n22k75o4r4J33P59J123Q46M85N65P69O95
54285A34030P18J253J762J425M72p8J65N47M97K44K04K02k11r23j172m35Q27J538
54267A41065J189M02J44N59Q93N60j74o60n69OQ00J381J305N71j84l18J16N42
54249A47628N79L03r8n52r56j101r41p42q55j308j730j727j258n57J77Q99J457
54232A39218J534J062M47J12nj80k68J48J037J768J827J286N26j52n25m16M8M46
54214A47913M27l8q15j659k145j970j417j131j307j480j267q22m47j79l6j32l30
54197A33165k56O7J44q8N7Q72J495J014p6m48K89J182J253M95m81j068r23k09
$$ plain form
54323 136019 135549 135186 135380 136130 137007 137719 138166 138042 137017 135410 134068 133400 133070 132760 132563 132488 132235 131769
54305 131769 131469 131424 131161 130476 129894 129835 129918 129610 129088 128813 128749 128655 128788 129547 130670 131516 132001 132566 133335 134030
54285 134030 134748 136001 137763 139188 139660 139582 139747 140294 140791 141035 141239 141441 141230 140307 139135 138700 139527 141065
54267 141065 142254 142656 142800 143359 144252 144812 144638 143978 143409 143415 144215 145596 146901 147472 147288 146970 147086 147628
54249 147628 148207 148510 148412 147860 146904 145803 144862 144120 143265 141957 140227 138500 137242 136685 136862 137761 139218
54232 139218 140752 141814 142261 142373 142368 142188 141920 142068 143105 144873 146700 147986 148512 148360 147835 147419 147467 147913
54214 147913 148340 148302 147487 145828 143683 141713 140296 139165 137858 136378 135111 134289 133842 133663 133627 133495 133165
54197 133165 132909 132976 133120 133032 133089 133961 135456 136470 136394 135946 136235 137417 138670 139165 138684 137616 136693 136484
54179A36484L39R6o22q93l53M40Q35P63M51R0j54k09k82n51p26m48p3l22j040
54160A33825j127n5J321J877J504Q18K14j26J35J022J720J350J84o04m48pj35
54143A41468p56j083o18L22R52Q13K08j45L1K73R5k71k19K93O29L13l96r21j016
54124A39972p86l20L94J209J759J775J405J080J004R44O22J79%J18J55q1k32J22
54106A49319R12J696K082J869J052l7p84q26m26r6n4k14l77k24N34J632K291K222
54088A60571K190L020M401N376N750O151O858P518Q007Q573Q851P766M902J203
54074B41137k180m989p253q452q162p016o118n769n458m910m289l576k548j361
54060A69056m57J05O08R55P09J4k72L40J360K080K444K756K955K739K191J845
$$ plain form
54179 136484 136823 136919 136297 135404 135051 135491 136326 137089 137540 137630 137476 137267 136985 136434 135708 135260 135187 134865 133825
54160 133825 132698 132643 133964 135841 137345 138163 138377 138251 138386 139408 141128 142478 142662 142058 141610 141603 141468
54143 141468 140712 139629 139011 139333 140285 141098 141306 141161 141192 141465 141560 141289 141070 141363 141992 142305 141909 140988 139972
54124 139972 139186 138866 139260 140469 142228 144003 145408 146488 147492 148436 149058 149237 149237 149355 149510 149429 149197 149319
54106 149319 150231 151927 154009 155878 156930 156893 156109 155283 154857 154761 154707 154493 154116 153892 154426 156058 158349 160571
54088 160571 162761 165781 170182 175558 181308 187459 194317 201835 209842 218415 227266 235032 239934 241137
54074 241137 238957 233968 226715 218263 210101 203085 196967 191198 185740 180830 176541 172965 170417 169056
54060 169056 168599 168704 169312 170267 170976 170990 170718 171058 172418 174498 176942 179698 182653 185392 187583 189428
54044A89428K144L014L972M503M447M171M308N208O656Q088R010R307R237R169
54030B72662R086Q539P208N424L818K520J139m76j816k238j759j234j710l437
54016B97726n365o045n323m698n384o592o677n609m984n483n865n095m035m014
54002B22557m695m721l753k628j900j503j585k337l069k768j714j343k204l200
53988A85137l275k702k141j471l97O35J032R92J013R55M14l53p12n97l70n3M65
53971A78572P45K70m65l82M89Q42k8j073r20K51J045P55J15K46J348K642L204
53954A87656K843K211K109K585K968K883K870L680N245O857Q128R233J0289J1185
53940B60742J2082J3311J4392J3874J0866O343K214p36l130n317o462n823m161
$$ plain form
54044 189428 191572 194586 198558 203061 207508 211679 215987 221195 227851 235939 244949 254256 263493 272662
54030 272662 281748 290287 297495 302919 306737 309257 310396 309920 308104 305866 304107 302873 301163 297726
54016 297726 292361 286316 280993 276295 270911 264319 257642 252033 247049 241566 235701 230606 226571 222557
54002 222557 217862 213141 209388 206760 204860 203357 201772 199435 196366 193598 191884 190541 188337 185137
53988 185137 181862 179160 177019 175548 175151 175786 176818 177810 178823 179778 180192 179839 179127 178530 178160 178107 178572
53971 178572 179317 179587 179122 178740 179229 180071 180043 178970 178050 178301 179346 180101 180216 180462 181810 184452 187656
53954 187656 190499 192710 194819 197404 200372 203255 206125 209805 215050 221907 230035 239268 249557 260742
53940 260742 272824 286135 300527 314401 325267 331610 333824 333088 329958 324641 318179 312356 308195
53927C08195l032k937k993k327j121n0O93J433K419L613M854N941O591O652O358
53912C34289O181O314O417N971M848L466K341J544P21l10j208j589j678k041k770
53897C62496l332l387l300l488l788l880m065m962o479p724q090p958q017q325
53883B85701q375p841o844n655m492l582l067k835k691k750l321m244m705m014
53869B21285k483j218r89j541k058k056j707j436j506j839k103j955j402r15r65
53854A97112j484j951k028j854j636j260o00M7J85k07n85m81m7K02K3l77p03q49
53836A83507p99m57J58O59N71%l19Q2P14P66L02J59O01Q16J70o43m26Q67K108
53817A88836K459K185J923J902K112K564K998K900K265J912K473L473L926L609
$$ plain form
53927 308195 305163 302226 299233 296906 295785 295735 296428 297861 300280 303893 308747 314688 321279 327931 334289
53912 334289 340470 346784 353201 359172 364020 367486 369827 371371 372092 371782 370574 368985 367307 365266 362496
53897 362496 359164 355777 352477 348989 345201 341321 337256 332294 325815 318091 310001 302043 294026 285701
53883 285701 277326 269485 262641 256986 252494 248912 245845 243010 240319 237569 234248 230004 225299 221285
53869 221285 218802 217584 216595 215054 212996 210940 209233 207797 206291 204452 202349 200394 198992 198077 197112
53854 197112 195628 193677 191649 189795 188159 186899 186299 186346 186531 186324 185739 185258 185211 185413 185436 185059 184356 183507
53836 183507 182708 182251 182409 183068 183639 183639 183320 183402 184116 184882 185184 185343 185944 186760 186930 186287 185861 186728 188836
53817 188836 191295 193480 195403 197305 199417 201981 204979 207879 210144 212056 214529 218002 221928 225537
53803B25537L112K808K586K521L033M094M923M914M331L743L265K872K921L604
53789B74264M145L476J758M25L61P79L84r71k359l158l579m012m563n244n962
53774B55744o249n612m315l303l141l525l977m401m615m139k985k075k114k473
53760B02820k062j001m42q51j440j467j129r27r14j012j297j620j591j293j323
53745A84451j644j292J17J429J472Q35R52J845K133J180p1o45o71n35KJ056J877
53728A92491J667P27J2r2J08M07Q67J355J610J784K253K831K751J694M28N8Q23
53711B11774J932K514K472K298K311K294J951J422J100J080J141J212J466J947
53697B36914K453K915L472L979L969L410K989L218L648L478K634J637O99l65j362
$$ plain form
53803 225537 228649 231457 234043 236564 239597 243691 248614 253528 257859 261602 264867 267739 270660 274264
53789 274264 278409 281885 283643 284068 284429 285208 285592 284621 282262 279104 275525 271513 266950 261706 255744
53774 255744 249495 243883 239568 236265 233124 229599 225622 221221 216606 212467 209482 207407 205293 202820
53760 202820 200758 199757 199315 198464 197024 195557 194428 193501 192587 191575 190278 188658 187067 185774 184451
53745 184451 182807 181515 181632 183061 184533 185368 186320 188165 190298 191478 191407 190762 190091 189556 189558 190614 192491
53728 192491 194158 194885 194897 194805 194913 195320 196187 197542 199152 200936 203189 206020 208771 210465 210893 210951 211774
53711 211774 213706 216220 218692 220990 223301 225595 227546 228968 230068 231148 232289 233501 234967 236914
53697 236914 239367 242282 245754 249733 253702 257112 260101 263319 266967 270445 273079 274716 275415 275050 273688
53682B73688j696j259p19p30j271j983k613k896k523j658j070j238j602j218j0
53667B51202J058J172N96K75P26J513J773J190K90k24l10m73q72r87m41K11Q6
53650B56785p66j214m63Q83J472Q34j78n10n4N68J012J490K130K547K281J404
53634B68221M81P9M28J299K110K355K176K237K811L280K958K144J838K551L864
53619B98832N095N914O259O228O150O325O575O418N763M971M167L099J808Q39
53605C68443M81L84K57L18O49P17J71m15k95L31O67N07K80J29k57q66j273j367
53587C68861j496j690j499q64m30o26r89r17o18o98j139j302r03m43n33j145j726
53570C51843j893j742j577j511j483j506j631j659j202k90M11K92l79p16j86R45
$$ plain form
53682 273688 271992 270733 270014 269284 268013 266030 263417 260521 257998 256340 255270 254032 252430 251212 251202
53667 251202 252260 253432 254028 254303 255029 256542 258315 259505 259795 259571 259261 258788 257916 256929 256488 256699 256785
53650 256785 256019 254805 254342 255225 256697 257531 257353 256843 256789 257357 258369 259859 261989 264536 266817 268221
53634 268221 268702 268781 269209 270508 272618 274973 277149 279386 282197 285477 288435 290579 292417 294968 298832
53619 298832 303927 309841 316100 322328 328478 334803 341378 347796 353559 358530 362697 365796 367604 368443
53605 368443 368924 369308 369565 369883 370532 371249 371420 371005 370710 371041 371708 372215 372495 372624 372367 371501 370228 368861
53587 368861 367365 365675 364176 363312 362882 362256 361267 360350 359732 359034 357895 356593 355690 355247 354714 353569 351843
53570 351843 349950 348208 346631 345120 343637 342131 340500 338841 337639 337349 337760 338052 337673 336957 336771 337716
53554C37716K064K684K560J843J217J347K058K449K019J286J022J292J578J600
53540C62735J530J620J947K507L235L931M426M846N480O406P358Q025Q404Q815
53526D31265R492J0230J0552J0377J0275J0837J1921J2889J3465J3913J4397J4784
53514E74397J5176J6044J7514J8992J9936K0532K1185K1812K2179K2575K3378
53503G93720K4178K4070K2866K1386K0404J9850J9283J8570J7844J7212J6830
53492A016213J6940J7454J7770J7391J6584J6089J6215J6587J6770J6762J6722
53481A201497J6561J6117J5563J5240J5019J4266J2611J0493Q580O912M991K661
53469A340511K83j931m213o654q870j0611j2181j3773j4843j4775j3944j3396
$$ plain form
53554 337716 339780 342464 345024 346867 348084 349431 351489 353938 355957 357243 358265 359557 361135 362735
53540 362735 364265 365885 367832 370339 373574 377505 381931 386777 392257 398663 406021 414046 422450 431265
53526 431265 440757 450987 461539 471916 482191 493028 504949 517838 531303 545216 559613 574397
53514 574397 589573 605617 623131 642123 662059 682591 703776 725588 747767 770342 793720
53503 793720 817898 841968 864834 886220 906624 926474 945757 964327 982171 999383 1016213
53492 1016213 1033153 1050607 1068377 1085768 1102352 1118441 1134656 1151243 1168013 1184775 1201497
53481 1201497 1218058 1234175 1249738 1264978 1279997 1294263 1306874 1317367 1325947 1332859 1337850 1340511
53469 1340511 1340794 1338863 1334650 1327996 1319126 1308515 1296334 1282561 1267718 1252943 1238999 1225603
53457A225603j3583j4124j4749j5675j6866j7706j7882j7987j8655j9527j9719
53446A039130j8977j7811j6648j5501j4500j3940j3596j2547j0198p129m539k996
53434H90748k161j532r96n66q3O04J423K305L408M858O419P725Q745R718J0745
53419I41360J1763J2898J4445J6380J8213J9484K0248K0920K1931K3581K5852
53408A147075K8143K9593L0089L0608L2139L4467L6550L7971L9390M1517M4189
53397A531731M6681M8424M9244M9329M9345N0101N1668N3033N3163N2223N1253
53386B086195N0687M9781M7729M4820M2064L9980L8146L5916L3135L0075K6931
53375B525459K3625J9978J5914J1532P002K369k596q180j4380k0836k7186l3268
$$ plain form
53457 1225603 1212020 1197896 1183147 1167472 1150606 1132900 1115018 1097031 1078376 1058849 1039130
53446 1039130 1020153 1002342 985694 970193 955693 941753 928157 915610 905412 898283 893744 890748
53434 890748 888587 887055 886059 885493 885410 886014 887437 889742 893150 898008 904427 912152 920897 930615 941360
53419 941360 953123 966021 980466 996846 1015059 1034543 1054791 1075711 1097642 1121223 1147075
53408 1147075 1175218 1204811 1234900 1265508 1297647 1332114 1368664 1406635 1446025 1487542 1531731
53397 1531731 1578412 1626836 1676080 1725409 1774754 1824855 1876523 1929556 1982719 2034942 2086195
53386 2086195 2136882 2186663 2234392 2279212 2321276 2361256 2399402 2435318 2468453 2498528 2525459
53375 2525459 2549084 2569062 2584976 2596508 2603510 2605879 2603283 2595103 2580723 2559887 2532701 2499433
53363B499433l8853m3451m6704m8811n0272n1250n1512n1013n0173m9462m8923
53352A969009m8217m6978m5049m2618m0232l8449l7415l6927l6856l7151l7389
53341A521728l6766l4846l2115k9508k7529k5961k4273k2146j9808j7868j6611
53330A234297j5461j3570j1090r279r071j0095j1466j2870j4243j4976j4401j2845
53318A084930j1298j0063q650p003n907n809n960n259l488j325N40J908K980M096
53304A029692N421O710P574Q089Q853J0345J2492J4907J7266J9278K0706K1653
53292A182986K2595K3843K5206K6280K6824K6698K5758K4065K2025K0087J8421
53281A444788J6979J5595J3941J1654Q686N400K169q56l624o124q553j1195j3962
$$ plain form
53363 2499433 2460580 2417129 2370425 2321614 2271342 2220092 2168580 2117567 2067394 2017932 1969009
53352 1969009 1920792 1873814 1828765 1786147 1745915 1707466 1670051 1633124 1596268 1559117 1521728
53341 1521728 1484962 1450116 1418001 1388493 1360964 1335003 1310730 1288584 1268776 1250908 1234297
53330 1234297 1218836 1205266 1194176 1184897 1175826 1165731 1154265 1141395 1127152 1112176 1097775 1084930
53318 1084930 1073632 1063569 1054919 1047916 1042009 1036200 1030240 1024981 1021493 1020168 1020708 1022616 1025596 1029692
53304 1029692 1035113 1041823 1049397 1057486 1066339 1076684 1089176 1104083 1121349 1140627 1161333 1182986
53292 1182986 1205581 1229424 1254630 1280910 1307734 1334432 1360190 1384255 1406280 1426367 1444788
53281 1444788 1461767 1477362 1491303 1502957 1511643 1517043 1519212 1518356 1514732 1508608 1500055 1488860 1474898
53268A474898j6372j8120j9409k0565k1698k2899k4356k6023k7491k8460k9008
53257A220497k9182k8802k7971k7341k7416k7821k7807k7138k6083k4744k3082
53246I23110k1478k0646k0834k1481k1829k1598k0998k0326j9655j8854j7819
53235F97592j6717j5775j4851j3449j1398r200p480o406n886o018o867q019q896
53222E66630r449j0101j1014j1783j1922j1379j0590j0177j0540j1414j1985j1681
53210D34595j0734r739q891q021p174o591o234n830n387n210n379n635n905o423
53196C37442p197p741p560o699n641m803m193l509k583j795j837k810l832l960
53182B73282l280k583k172j654q87m44q09j707k470k710k419j776j132q38q78
$$ plain form
53268 1474898 1458526 1440406 1420997 1400432 1378734 1355835 1331479 1305456 1277965 1249505 1220497
53257 1220497 1191315 1162513 1134542 1107201 1079785 1051964 1024157 997019 970936 946192 923110
53246 923110 901632 880986 860152 838671 816842 795244 774246 753920 734265 715411 697592
53235 697592 680875 665100 650249 636800 625402 616202 608722 602316 596430 590412 583545 575526 566630
53222 566630 557181 547080 536066 524283 512361 500982 490392 480215 469675 458261 446276 434595
53210 434595 423861 414122 405231 397210 390036 383445 377211 371381 365994 360784 355405 349770 343865 337442
53196 337442 330245 322504 314944 308245 302604 297801 293608 290099 287516 285721 283884 281074 277242 273282
53182 273282 270002 267419 265247 263593 262706 262262 261453 259746 257276 254566 252147 250371 249239 248401 247523
53167B47523r60j017j290j740j918j625j266j196j158p59j91Ql18q32j200j273
53151B30788r69l51K18L19n2m84o23m78l20m34q73j310j242n24L82Q48P13L29
53133B25937Q7O6J43K02K09J78J69K76N61R37J126Q88L74Q0L25Q41J139J042O51
53114B35231j1q61j435j283o97m34o31o54j93J46k52j099j695j849j803j598j115
53097B19767n11r5R2J19j17n78p82m03N4j97j058j609j347p06k72n6J85M68P38
53078B13692J064J367J282O22j89m67qP00R64M93l80j041j223j243j482j774j528
53061B10849n33O77J312J006M2q83j105m66N48J264J369R46J88o07r61o66k55
53044B12725m96j337j883j544p15p1L04O85J074J217J051P06K60k17n82q41j216
$$ plain form
53167 247523 246563 245546 244256 242516 240598 238973 237707 236511 235353 234594 234403 234411 234093 233261 232061 230788
53151 230788 229819 229468 229686 230005 229953 229469 228846 228368 228048 227614 226741 225431 224189 223665 224047 224895 225608 225937
53133 225937 226024 226090 226233 226435 226644 226822 226991 227267 227828 228765 229891 230779 231153 231233 231558 232399 233538 234580 235231
53114 235231 235220 234359 232924 231641 230944 230510 229879 229225 229032 229178 228926 227827 226132 224283 222480 220882 219767
53097 219767 219256 219161 219253 219372 219255 218677 217895 217492 217546 217349 216291 214682 213335 212629 212357 212301 212486 212954 213692
53078 213692 214756 216123 217405 218027 217838 217371 217363 218063 219027 219520 219140 218099 216876 215633 214151 212377 210849
53061 210849 210316 210993 212305 213311 213353 212470 211365 210899 211447 212711 214080 215026 215214 214607 213646 212980 212725
53044 212725 212229 210892 209009 207465 206750 206679 206983 207668 208742 209959 211010 211716 211976 211759 211177 210336 209120
53027B09120j677j744j113j92M28P99J299J768J711J228R86J132J051M85J19N21
53011B15921J129J053M42J99N08N99O2l99MR57J416R36J11k63J3N42Q59Q16O09
52992B25514M48K61j73p66j044p68l68m29r08j262j196r08n86k18R4J41R6M81
52974B18409J347J965J693P71j01n40m55K88J504K380K247J561J280J390Q89n85
52958B34043k019k337j788j370j439j502j191p51n80p53j053j196j018o32l79
52943B16035m56o02l83K55Q49Q70K65l97m09L07R40O23n07j366j197l02N15Q04
52925B15844N22j86q38p53Q7P38M70q5J76J064J216J04j071j016q9K97m43j516
52907B14521j968j749j366j021m82K66O97L33n02r07m91J64L89L79P55J472J808
$$ plain form
53027 209120 207443 205699 204586 204394 204822 205621 206920 208688 210399 211627 212613 213745 214796 215281 215400 215921
53011 215921 217050 218103 218545 218744 219252 219851 219913 219514 219518 220475 221891 222827 222938 222675 222688 223230 224089 224905 225514
52992 225514 225962 226223 226050 225284 224240 223472 223104 222675 221767 220505 219309 218401 217815 217597 217691 217832 217928 218409
52974 218409 219756 221721 223414 224185 224084 223544 223089 223377 224881 227261 229508 231069 232349 233739 234628 234043
52958 234043 232024 229687 227899 226529 225090 223588 222397 221646 221066 220313 219260 218064 217046 216414 216035
52943 216035 215579 214977 214594 214849 215698 216568 216833 216436 216027 216334 217274 217897 217390 216024 214827 214525 215040 215844
52925 215844 216366 216180 215342 214589 214676 215414 215884 215799 215975 217039 218255 218359 217288 216272 216183 216480 216037 214521
52907 214521 212553 210804 209438 208417 207935 208201 208898 209231 208729 207822 207331 207495 207884 208263 209018 210490 212298
52890B12298J396O15n9m76m72J55J094J528J194P65P79P74J48o47o32K21R22Q46
52872B20449L96J70J53J07J17L76P50J023J313J826K285K065R62m20j236j256
52856B29080r92r82j244j509j734k020k140j691q93o76j567k817l185k387j301
52841B03942p66p60p87o11l81l20n01p92r22p42m35k70j84J54Q45J548J885J786
52823B02689J412R23M54J15p9k53n33q48q47r3J379K716K942K158J592J977K448
52806B18152J697j09j532j730j294j119j365j776k144k186j635q50o68j223j677
52791B00541j476j147j273j465j043j29P36J480K159K284J473M39K72R07J252
52776B05010Q07J29l03o80j020p79K27J179J149J80r03j457j458j286j335j584
$$ plain form
52890 212298 213694 214309 214250 213774 213302 213457 214551 216079 217273 218038 218817 219591 219739 219092 218460 218681 219603 220449
52872 220449 220845 221015 221168 221275 221392 221768 222518 223541 224854 226680 228965 231030 231992 231572 230336 229080
52856 229080 228088 227106 225862 224353 222619 220599 218459 216768 215875 215199 213632 210815 207630 205243 203942
52841 203942 203176 202416 201629 201018 200637 200317 199816 199024 198102 197360 196925 196655 196471 196625 197470 199018 200903 202689
52823 202689 204101 205024 205478 205593 205514 205261 204728 203880 203033 202940 204319 207035 209977 212135 213727 215704 218152
52806 218152 219849 219740 218208 216478 215184 214065 212700 210924 208780 206594 204959 204109 203441 202218 200541
52791 200541 199065 197918 196645 195180 194137 194008 194744 196224 198383 200667 202140 202579 202851 203758 205010
52776 205010 205817 205946 205643 204963 203943 203164 203391 204570 205719 205899 204996 203539 202081 200795 199460 197876
52760A97876j459m33J169K341K452J767P92k55j175j566j273o31M8Q70J870K529
52744B04922K316J470P72O50Q76J098J281J529J770J791J549J235R58N35j90q04
52728B21758n89M62J333J153L27j60j63l17q14j223j552k349l447l703k569j010
52712B07137j55J77P55J482J610R61N0p21j146q79R3Q93O75p6j45O07J087P27
52694B13132K12J45P5m54q41k74Q91J538J326R50R61J043P00P3l28l83m23n96
52676B17747n60l8N49M65l32r77p60nM68M33K99K94K33Q9J63N02O99M83J17m5
52656B19824L5L83J233K511L475L347K291J239P76N21k64j685k972l202k223q54
52640B24435l3Q3Q9L75O17L80j61m22j60L16O30P65R54J370J937K291J988Q82
$$ plain form
52760 197876 196417 195984 197153 199494 201946 203713 204505 204250 203075 201509 200236 199605 199653 200523 202393 204922
52744 204922 207238 208708 209480 210130 211006 212104 213385 214914 216684 218475 220024 221259 222217 222752 222562 221758
52728 221758 221169 221631 222964 224117 224444 224284 224121 223804 222990 221767 220215 217866 214419 210716 208147 207137
52712 207137 206982 207159 207914 209396 211006 211967 212017 211296 210150 209271 209364 210257 210932 210856 210711 211318 212405 213132
52694 213132 213344 213489 213564 213110 212269 211995 212886 214424 215750 216700 217661 218704 219404 219477 219149 218766 218343 217747
52676 217747 217187 217149 217698 218163 217831 216854 216094 216089 216557 216990 217289 217583 217816 217905 218068 218570 219269 219752 219869 219824
52656 219824 219859 220242 221475 223986 227461 230808 233099 234338 235114 235635 235371 233686 230714 227512 225289 224435
52640 224435 224402 224485 224574 224949 225566 225946 225785 225363 225203 225519 226149 226914 227868 229238 231175 233466 235454 236336
52622B36336o14j854k512k686k558k172j569r40m18O2N13O52K29m13n10K01J042
52605B22789J277J157J513K354K622J640J52o76p91r74j364j250m16L10L08J92
52589B28843Q49J974K370J521K03n47m66J9M12M78K25j49m62p00q76p95k50M97
52571B33146Q43N51M4j98k75n71j001j009k72Q52J677J736R49l79j584j936j309
52554B31264m31j32l20j04R39J988J868N35p82r95l53M1l98j208j626j430q54
52537B28002p2Q44J575J665J152O59O65R19Q84M93R2j45k89k55O9L26j1p13q61
52518B34999j40N45K58p22j398j355q64r1R94K057K603K742K983L250K875J733
52502B50469O15J61R4j17m66p51j117j742k352k553k346j935j355p06l56m00l75
$$ plain form
52622 236336 235722 233868 231356 228670 226112 223940 222371 221431 221013 221075 221588 222240 222469 222056 221546 221747 222789
52605 222789 224066 225223 226736 229090 231712 233352 233504 232828 232037 231063 229699 228449 228033 228343 228651 228843
52589 228843 229692 231666 234036 235557 235760 235213 234747 234766 235178 235656 235881 235732 235270 234570 233694 232899 232649 233146
52571 233146 233989 234540 234584 234386 234111 233540 232539 231530 231258 232110 233787 235523 236472 236093 234509 232573 231264
52554 231264 230833 230701 230381 230277 231216 233204 235072 235607 234825 233830 233477 233518 233120 231912 230286 228856 228002
52537 228002 227930 228774 230349 232014 233166 233825 234490 235409 236293 236786 236878 236733 236444 236189 236258 236584 236573 235860 234999
52518 234999 234859 235404 235662 234940 233542 232187 231323 231232 232226 234283 236886 239628 242611 245861 248736 250469
52502 250469 251084 251245 251339 251222 250756 250005 248888 247146 244794 242241 239895 237960 236605 235899 235543 235143 234768
52485B34768L6L79J16l82l30K16N12M31O87J502K044J599O59J88L48N78O33P93
52467B44777J156J327J007M52J93M63J075J662J950J901J640J227N50m46j539
52452B57395k382k850k954k586j681p21n74j492k561k595j497l31j9m53r13r79
52436B32807p12k97R5K72J48j50m61p32q01l68N32J247J206O81L61L67L01J74
52418B34670N23J376J973J909J919K860M393N410N489N288N534O390P750R448
52404B94932J0931J1242R787O852L139q67m822q080r856r888q716p156n669m317
52390B77512l124k252j761j455j133q90q86r67p72k68J90M42Q19J604K473K792
52374B72324K346J543R62R86J686K745L540L672L404L341L576L526K677J294J31
$$ plain form
52485 234768 234804 235183 235299 234917 234587 234803 235315 235746 236433 237935 239979 241578 242237 242425 242773 243351 243984 244777
52467 244777 245933 247260 248267 248719 248912 249375 250450 252112 254062 255963 257603 258830 259380 258934 257395
52452 257395 255013 252163 249209 246623 244942 244221 243647 242155 239594 236999 235502 235171 235152 234699 233786 232807
52436 232807 232095 231798 231893 232165 232313 232163 231702 230970 230169 229801 230333 231580 232786 233467 233828 234195 234496 234670
52418 234670 235193 236569 238542 240451 242370 245230 249623 255033 260522 265810 271344 277734 285484 294932
52404 294932 305863 317105 326892 333744 336883 336016 331194 323114 313258 303370 294654 287498 281829 277512
52390 277512 274388 272136 270375 268920 267787 266897 266011 265044 264272 264004 264194 264636 265455 267059 269532 272324
52374 272324 274670 276213 277175 278161 279847 282592 286132 289804 293208 296549 300125 303651 306328 307622 307753
52359C07753l46l05j93k46l52k32L01J177K026K371K017J355J021J202J449J435
52343C20433J561K422L791M777N021N062N421N869N999N960O178O789P778R185
52329C96246J0669J1445J1299J1246J2335J4159J5500J6163J7025J8267J8844
52318E53198J8146J7075J6794J7223J7514J7401J7237J7136J6897J6573J6336
52307G41530J5910J4806J3174J1791J1121J0852J0438R720Q863Q080P510P118
52295H70913O482M947K270r75l731n358o135o862p889q636q329p164o260o286
52281H16987o537n802l898j768k03R59K255L827N415O817P982Q907R655J0363
52267H54959J1070J1641J1942J1987J1848J1619J1545J1874J2431J2604J2011
$$ plain form
52359 307753 307407 307102 306909 306663 306311 306079 306380 307557 309583 311954 313971 315326 316347 317549 318998 320433
52343 320433 321994 324416 328207 332984 338005 343067 348488 354357 360356 366316 372494 379283 387061 396246
52329 396246 406915 418360 429659 440905 453240 467399 482899 499062 516087 534354 553198
52318 553198 571344 588419 605213 622436 639950 657351 674588 691724 708621 725194 741530
52307 741530 757440 772246 785420 797211 808332 819184 829622 839342 848205 856285 863795 870913
52295 870913 877395 882342 884612 883637 879906 874548 868413 861551 853662 845026 836697 829533 823273 816987
52281 816987 810450 804648 800750 798982 798779 799738 801993 805820 811235 818052 826034 834941 844596 854959
52267 854959 866029 877670 889612 901599 913447 925066 936611 948485 960916 973520 985531
52256I85531J1020J0297R985R636Q884P867O942O198N307L674R38k516n587p419
52242A050757q244q913r687j0055r814r577r841j0226j0174r851r699r516q922
52229I26238q342q512r051q629o865m994m143l932l455k758k389k044q34J268
52215H61558L240M211M167L540K908L044M349O053O783O113M960M239L930L678
52201I22773L503L419L081K410K021K361K911K966K800L219M106M345L283J620
52187I64818N64N21Q89P52m03k375m402n817o626p294p917q025p337o398o019
52172I04931o222o161n236l879k968k689k388j519k97P39J427J889K108K020J968
52157H83723K411L186L518K977K015J323J010P40L86K03M56J179K189L129L569
$$ plain form
52256 985531 996551 1006848 1016833 1026469 1035353 1043220 1050162 1056360 1061667 1065341 1066279 1063763 1058176 1050757
52242 1050757 1042513 1033600 1023913 1013858 1004044 994467 984626 974400 964226 954375 944676 935160 926238
52229 926238 917896 909384 900333 891704 884839 879845 875702 871770 868315 865557 863168 861124 860290 861558
52215 861558 864798 869009 873176 876716 879624 882668 887017 893070 899853 905966 910926 915165 919095 922773
52201 922773 926276 929695 932776 935186 937207 939568 942479 945445 948245 951464 955570 959915 963198 964818
52187 964818 965382 965903 966792 967544 967141 964766 960364 954547 947921 940627 932710 924685 917348 910950 904931
52172 904931 898709 892548 887312 883433 880465 877776 875388 873869 873572 874311 875738 877627 879735 881755 883723
52157 883723 886134 889320 892838 895815 897830 899153 900163 900903 901289 901492 901948 903127 905316 908445 912014
52142I12014L287K441J411N11j00m01m42k20M16J509K715L649M504N890P965J0218
52126I55367J2311J4593J7379K0164K2177K3354K4236K5098K5715K5921K5859
52115A192174K5649K5219K4476K3362K1781J9787J7711J5851J4125J2323J0505
52104A402963Q838P235N542L901K454R62p52k270l111l674m898o971r101j0700
52090A390418j2064j3679j5511j7221j8492j8821j7677j5275j2632j0477q550
52079A230019o320l843j415J042L593N761P059P782Q599R623J0559J1544J3012
52066A297015J4734J5792J5705J4919J3977J2847J1401J0022R169Q653P848O583
52054A438665N335M504L836K680O67k003m822p336r324j0900j2479j4492j6868
$$ plain form
52142 912014 915301 917742 919153 919664 919564 919163 918721 918501 918917 920426 923141 926790 931294 937184 945149 955367
52126 955367 967678 982271 999650 1019814 1041991 1065345 1089581 1114679 1140394 1166315 1192174
52115 1192174 1217823 1243042 1267518 1290880 1312661 1332448 1350159 1366010 1380135 1392458 1402963
52104 1402963 1411801 1419036 1424578 1428479 1430933 1431895 1431143 1428873 1425762 1422088 1417190 1410219 1401118 1390418
52090 1390418 1378354 1364675 1349164 1331943 1313451 1294630 1276953 1261678 1249046 1238569 1230019
52079 1230019 1223699 1219856 1218441 1219483 1223076 1228837 1235896 1243678 1252277 1261900 1272459 1284003 1297015
52066 1297015 1311749 1327541 1343246 1358165 1372142 1384989 1396390 1406412 1415581 1424234 1432082 1438665
52054 1438665 1444000 1448504 1452340 1455020 1455687 1453684 1448862 1441526 1432202 1421302 1408823 1394331 1377463
52041A377463j8889j9882j9966j9828j9735j9214j7916j6323j5147j4374j3438
52030A182751j2196j1205j0954j1305j1803j2151j2281j2249j2264j2482j2677
52019A051184j2417j1665j0908j0464j0056r344q564q249q509q964r314r638j0122
52006I22970j0804j1566j2237j2755j3362j4446j5912j6977j7036j6479j6067
51995G65329j5559j3914j1038q450p546p864p995p682p883q879r611r273q535
$$ plain form
52041 1377463 1358574 1338692 1318726 1298898 1279163 1259949 1242033 1225710 1210563 1196189 1182751
52030 1182751 1170555 1159350 1148396 1137091 1125288 1113137 1100856 1088607 1076343 1063861 1051184
52019 1051184 1038767 1027102 1016194 1005730 995674 986330 977766 969517 961008 952044 942730 933092 922970
52006 922970 912166 900600 888363 875608 862246 847800 831888 814911 797875 781396 765329
51995 765329 749770 735856 724818 716368 708822 700958 692963 685281 677398 668519 658908 649635 641100
$$ [...]
##END NTUPLES=NMR SPECTRUM
##END=
