
##TITLE=UV1208_M4_1332-1205_7185158_9ul7dUagAP
##JCAMPDX= 6.0         $$ Bruker NMR JCAMP-DX V2.0
##DATA TYPE= NMR SPECTRUM
##DATA CLASS= NTUPLES
##ORIGIN= BRUKER
##OWNER= Administrator
$$ 1.72 TOPSPIN		Version 2.1
$$ 2012-12-05 22:42:11.170 -0500  Administrator@X
$$ Compression mode = diff/dup
##.OBSERVE FREQUENCY= 400.02188249412
##.OBSERVE NUCLEUS= ^1H
##.ACQUISITION MODE= SIMULTANEOUS (DQD)
##.ACQUISITION SCHEME= undefined
##.AVERAGES= 8
##.DIGITISER RES= 22
##SPECTROMETER/DATA SYSTEM= spect
##.PULSE SEQUENCE= zg30
##.SOLVENT NAME= COFFEE_meoh
##.SHIFT REFERENCE= INTERNAL, COFFEE_meoh, 1, 14.98509
##AUDIT TRAIL= $$ (NUMBER, WHEN, WHO, WHERE, PROCESS, VERSION, WHAT)
$$ ##TITLE= Audit trail, TOPSPIN		Version 2.1
$$ ##JCAMPDX= 5.01
$$ ##ORIGIN= Bruker BioSpin GmbH
$$ ##OWNER= Administrator
$$ $$ E:\/data/COFFEE/nmr/UV1208_M4_1332-1205_7185158_9ul7dUagAP/10/pdata/1/auditp.txt
$$ ##AUDIT TRAIL=  $$ (NUMBER, WHEN, WHO, WHERE, PROCESS, VERSION, WHAT)
(   1,<2012-12-05 22:42:03.013 -0500>,<Administrator>,<X>,<go>,<TOPSPIN 2.1>,
      <created by zg
	started at 2012-12-05 22:40:56.217 -0500,
	POWCHK enabled, PULCHK disabled,
       configuration hash MD5:
       86 BA 57 50 F2 9D 5C 9B 26 00 A9 28 5F 66 2E 89
       data hash MD5: 64K
       73 DF 9A 89 C8 EB 1F 45 A4 52 D3 56 04 0A 94 FD>)
(   2,<2012-12-05 22:42:06.092 -0500>,<Administrator>,<X>,<proc1d>,<TOPSPIN 2.1>,
      <Start of raw data processing
       efp LB = 0 FT_mod = 6 PKNL = 1 PHC0 = 0 PHC1 = 0 SI = 32K 
       data hash MD5: 32K
       39 C2 05 62 C9 60 19 D4 88 B0 6C BE 55 7F 8B 67>)
(   3,<2012-12-05 22:42:06.545 -0500>,<Administrator>,<X>,<proc1d>,<TOPSPIN 2.1>,
      <pk PHC0 = 93.27942 PHC1 = 0 
       data hash MD5: 32K
       17 11 E5 B1 1F CA 7B B6 09 71 78 07 01 B7 6E BE>)
(   4,<2012-12-05 22:42:06.779 -0500>,<Administrator>,<X>,<proc1d>,<TOPSPIN 2.1>,
      <abs ABSG = 1 
       data hash MD5: 32K
       C0 5D DF 32 EC 06 35 04 38 A5 38 B2 01 5D 5B B6>)
(   5,<2012-12-05 22:42:06.935 -0500>,<Administrator>,<X>,<proc1d>,<TOPSPIN 2.1>,
      <abs ABSG = 2 
       data hash MD5: 32K
       EA 60 E3 34 F3 FE 24 9A BF 69 D2 E5 98 F7 02 24>)
(   6,<2012-12-05 22:42:07.076 -0500>,<Administrator>,<X>,<proc1d>,<TOPSPIN 2.1>,
      <abs ABSG = 3 
       data hash MD5: 32K
       A4 C0 BD 59 46 02 38 FE 00 00 23 5B 22 9D CB 97>)
(   7,<2012-12-05 22:42:07.217 -0500>,<Administrator>,<X>,<proc1d>,<TOPSPIN 2.1>,
      <abs ABSG = 4 
       data hash MD5: 32K
       05 39 90 E4 40 FE EC 48 3D 5D BD BB 43 88 AB 57>)
(   8,<2012-12-05 22:42:07.373 -0500>,<Administrator>,<X>,<proc1d>,<TOPSPIN 2.1>,
      <abs ABSG = 5 
       data hash MD5: 32K
       08 92 10 DA 7F D5 0E 8A 46 AB E2 ED DE 4C C9 14>)
$$ ##END=
$$ 
$$ $$ hash MD5
$$ $$ 1B 09 60 BB 89 24 1F A9 1C 75 74 FF 2B D3 8B 01
##$RELAX= 
##$RELAX= 
##$RELAX= 
##$RELAX= 
##$RELAX= 
##$RELAX= 
##$RELAX= 
$$ Bruker specific parameters
$$ --------------------------
##$DU= <E:\>
##$EXPNO= 10
$$ [...]
150 150 150 150 150 150 150 150
##$TP07= 0
##$TPNAME0= <>
##$TPNAME1= <>
##$TPNAME2= <>
##$TPNAME3= <>
##$TPNAME4= <>
##$TPNAME5= <>
##$TPNAME6= <>
##$TPNAME7= <>
##$TPOAL= (0..7)
0.5 0.5 0.5 0.5 0.5 0.5 0.5 0.5
##$TPOFFS= (0..7)
0 0 0 0 0 0 0 0
##$TUNHIN= 0
##$TUNHOUT= 0
##$TUNXOUT= 0
##$USERA1= <user>
##$USERA2= <user>
##$USERA3= <user>
##$USERA4= <user>
##$USERA5= <user>
##$V9= 5
##$VALIST= <valist>
##$VCLIST= <CCCCCCCCCCCCCCC>
##$VD= 0
##$VDLIST= <DDDDDDDDDDDDDDD>
##$VPLIST= <PPPPPPPPPPPPPPP>
##$VTLIST= <TTTTTTTTTTTTTTT>
##$WBST= 1024
##$WBSW= 4
##$XGAIN= (0..3)
0 0 0 0
##$XL= 0
##$YL= 0
##$YMAX_a= 675002
##$YMIN_a= -572076
##$ZGOPTNS= <>
##$ZL1= 120
##$ZL2= 120
##$ZL3= 120
##$ZL4= 120
##$ABSF1= 14.98509
##$ABSF2= -5.573092
##$ABSG= 5
##$ABSL= 3
##$ALPHA= 0
##$AQORDER= 0
##$ASSFAC= 0
##$ASSFACI= 0
##$ASSFACX= 0
##$ASSWID= 0
##$AUNMP= <proc_prof1d_extract_pilot.lims>
##$AXLEFT= 0
##$AXNAME= <>
##$AXNUC= <1H>
##$AXRIGHT= 0
##$AXTYPE= 0
##$AXUNIT= <>
##$AZFE= 0.1
##$AZFW= 0.1
##$BCFW= 0
##$BC_mod= 0
##$BYTORDP= 0
##$COROFFS= 0
##$CY= 15
##$DATMOD= 1
##$DC= 0
##$DFILT= <>
##$DTYPP= 0
##$F1P= 0
##$F2P= 0
##$FCOR= 0.5
##$FTSIZE= 32768
##$FT_mod= 6
##$GAMMA= 0
##$GB= 0
##$INTBC= 1
##$INTSCL= 1
##$ISEN= 128
##$LB= 0
##$LEV0= 0
##$LPBIN= 0
##$MAXI= 10000
##$MC2= 0
##$MEAN= 0
##$ME_mod= 0
##$MI= 0
##$NCOEF= 0
##$NC_proc= -8
##$NLEV= 6
##$NOISF1= 0
##$NOISF2= 0
##$NSP= 0
##$NTH_PI= 0
##$NZP= 0
##$OFFSET= 14.98509
##$PC= 1
##$PHC0= 93.27942
##$PHC1= 0
##$PH_mod= 1
##$PKNL= yes
##$PPARMOD= 0
##$PPDIAG= 0
##$PPIPTYP= 0
##$PPMPNUM= 2147483647
##$PPRESOL= 1
##$PSCAL= 4
##$PSIGN= 0
##$PYNMP= <proc.py>
##$REVERSE= no
##$SF= 400.02
##$SI= 32768
##$SIGF1= 0
##$SIGF2= 0
##$SINO= 400
##$SIOLD= 32768
##$SPECTYP= <>
##$SREGLST= <1H.CDCl3>
##$SSB= 0
##$STSI= 32768
##$STSR= 0
##$SW_p= 8223.68421052631
##$SYMM= 0
##$S_DEV= 0
##$TDeff= 65536
##$TDoff= 0
##$TI= <>
##$TILT= no
##$TM1= 0
##$TM2= 0
##$TOPLEV= 0
##$USERP1= <user>
##$USERP2= <user>
##$USERP3= <user>
##$USERP4= <user>
##$USERP5= <user>
##$WDW= 1
##$XDIM= 32768
##$YMAX_p= 484684900
##$YMIN_p= -754114
##$CURPLOT= <Network HP LaserJet P1505>
##$CURPRIN= <$Network HP LaserJet P1505>
##$DFORMAT= <normdp>
##$LAYOUT= <+/1D_H.xwp>
##$LFORMAT= <normlp>
##$PFORMAT= <normpl>
##$SURQMSG= 1
$$ End of Bruker specific parameters
$$ ---------------------------------
##NTUPLES= NMR SPECTRUM
##VAR_NAME=  FREQUENCY,     SPECTRUM/REAL,   SPECTRUM/IMAG
##SYMBOL=    X,             R,               I
##VAR_TYPE=  INDEPENDENT,   DEPENDENT,       DEPENDENT
##VAR_FORM=  AFFN,          ASDF,            ASDF
##VAR_DIM=   32768,         32768,           32768
##UNITS=     HZ,            ARBITRARY UNITS, ARBITRARY UNITS
##FACTOR=    0.250966925370066, 1,           1
##FIRST=     8223.43324360094, -71202,       -169416
##LAST=      0,             21239,           -71261
##MIN=       0,             -754114,         0
##MAX=       8223.43324360094, 484684900,    0
$$ Real data points
##PAGE= N=1
##DATA TABLE= (X++(R..R)), XYDATA
$$ [...]
19510f5598A88314a99036n7059b2810j68466M9809B6604a44938E2644b12629N736
19499b06893B7240a5651E704R66c9978A27025b52768i5013j60j11468P3348A85731
19486b7341j99990B9202P1106m1825M5308f7346j93614N5734L2829e4366n597
19475e9963p0482c3821A33274b36651g1878a1122j97260d7090G1441a83418k12236
19464c95654a19687c6851j4587A92766c8012A0231K5450L25596H2662d11905f6252
19452b45322D9172K19221j32107b62270A79054B2775c3954j970j4294k97280a65976
19440B72575i8186A53699h6569b9686j27244j13284P8350m7380h8017q4617O5433
19429a07201o5245A09278E1404K79845f6913l4627B19154q916b19644l6178A15826
$$ y = [-65598, 188314, -199036, -256095, -22810, -191276, -141467, 26604, -144938, 52644, -212629, -206893, 27240, -15651, 5704, 6670, -39978, 127025, -252768, -95013, -95173, -206641, -133293, 185731, -27341, -227331, 29202, 100308, 58483, 103791, -67346, -260960, -205226, -172397, -54366, -59963, -130445, -33821, 133274, -236651, -71878, -11122, -208382, -47090, 71441, -183418, -395654, -119687, -36851, -51438, 192766, -38012, 10231, 35681, 361277, 82662, -411905, -66252, -245322, 49172, 268393, 136286, -262270, 179054, 22775, -33954, -35924, -50218, -347498, -165976, 272575, -98186, 153699, -86569, -29686, -156930, -270214, -191864, -239244, -88017, -172634, -107201, -172446, 109278, 51404, 331249, -66913, -101540, 219154, 210238, -219644, -255822, 115826]
19417D4952a77030L6227j00060R4087c3887A3873e01938B82417b27326J08946
19407a18380k47031a71688L0805k58718d7895p1530B152e0062A3723M3347O80
19396E7750A5525a1296I495a55899j87048B02878q5038C5878h3050F4701b7964
19384A02580D3343N4258c9292B24521h625E3629c97451E8812J9304a6860B02158
19372c2255H6755b61914A33905f8024k1810B8769b58702f990r1932l2890j39046
19361b70858h8389J0437A48807m9016h0613j70613J4415Q2826B52337j12495a05866
19349a46460B43419a52289J30l1480j88507J19564O9192A20529a23798E2938M58519
19338E11457a60857e720B23969o5019a90033h9849C192b64929C2266Q5061b89463
$$ y = [44952, -177030, -140803, -240863, -146776, -33887, 13873, -501938, 282417, -227326, -118380, -365411, -171688, -140883, -399601, -47895, -119425, 2152, -50062, 13723, 57070, 57750, 15525, -11296, 9495, -155899, -342947, 202878, 117840, 35878, -83050, 64701, -27964, 102580, 43343, 97601, -39292, 224521, -8625, 53629, -397451, 58812, 78116, -16860, 202158, -32255, 86755, -261914, 133905, -68024, -89834, 28769, -258702, -6990, -98922, -131812, -270858, -88389, -77952, 148807, 99791, -80613, -251226, -236811, -153985, 252337, 139842, -105866, -146460, 243419, -152289, -152159, -183639, -372146, -252582, -183390, 120529, -123798, 52938, 511457, -160857, -5720, 223969, 158950, -190033, -89849, 3192, -264929, 32266, 117327, -289463]
19326B84330a17366B4584c5552l06058M3672A04929K61353a73724j39993a06423
19315A2683b34581q4118a9018j08161H9348e7773A38086L32222a00899A8907c6316
19303a91189j7461q4861a6705l2672j96109L2698g0775j1828a3086E8931J13605
19292A72536m2528a80613n3188f3623A51888a46384j6629B80462I1994g6981D9744
19280C49510a1401C02796b9713l36646G419l173a77135j60402G1377p367L27457
19269C91467b00305d6118k72107d8299B4208b21964A9163a07194J8717k70508
19259c58985J50490d1612B29507a83126b8559p4767j15349f7077A69039p4366
19249I4673k2223K3973C6019b28332A4135J8250d1261F2679J09326a26943j86261
$$ y = [284330, -117366, 24584, -35552, -341610, -297938, 104929, 366282, -173724, -313717, -106423, 12683, -234581, -318699, -19018, -127179, 89348, -57773, 138086, 470308, -100899, 18907, -36316, -191189, -208650, -293511, -16705, -49377, -245486, -212788, -70775, -82603, -13086, 58931, 172536, 130008, -180613, -233801, -63623, 151888, -146384, -163013, 280462, 91994, -76981, 49744, 349510, -11401, 302796, -29713, -366359, 7419, 4246, -177135, -337537, 71377, 64010, 391467, -200305, -46118, -318225, -48299, 24208, -221964, 19163, -107194, -88477, -358985, -208495, -41612, 229507, -183126, -28559, -103326, -218675, -67077, 169039, 94673, 72450, 96423, 36019, -228332, 14135, 32385, -41261, 62679, 172005, -126943, -313204]
19238c13204b0691q2547l7818B51926d56693A19358b95653f2057E555i1980A35738
19226a48724l8033I3311b56200E246d07376O1013C4425b08333H2448d7977B42323
19214e6868b1723A22702b89869i3095k9127j6907o2787O2242C82540j85463b73369
19202d74854f2413F8813K007a86520A95039h9666A32842a691A1432d5941k42568
19191b88509G8557a04388A9274f5449l0449F2710a94884f1464p5672n9654H8027
19179h8273A44647b06878f4120j13299n7667D21533F4832L65759j27734a91617
19168B02722a86434e0177a3101k49412C1850A244d6802B59162A18692K0989a91885
19156a89088N0957d7610j47603P4970B41134a68196k6840G8111j4936b35041A08042
$$ y = [-313204, -20691, -103238, -141056, 251926, -456693, 119358, -295653, -62057, 5555, -91980, 135738, -148724, -186757, 93311, -256200, 5246, -407376, -346363, 34425, -208333, 82448, -47977, 242323, -56868, -21723, 122702, -289869, -93095, -122222, -139129, -201916, -139674, 382540, 197077, -273369, -474854, -62413, 68813, 70820, -186520, 195039, -89666, 132842, -1691, 11432, -45941, -288509, 78557, -104388, 19274, -65449, -95898, 62710, -194884, -61464, -137136, -196790, 88027, -88273, 144647, -206878, -64120, -177419, -235086, 421533, 64832, 430591, 302857, -191617, 202722, -186434, -50177, -13101, -262513, 31850, 1244, -46802, 259162, 118692, 139681, -191885, -189088, -138131, -47610, -195213, -120243, 241134, -168196, -195036, 78111, 63175, -235041, 108042]
19144A43709j7931a27490j57947p1500J06712m7759A84311h1142k66195a66993
19133f8067j63176n527L3438N8150B11078a79784B7932J55949a94895A93717c034
19121A46455b30530a03681R563j29782e4640l47181A10965b78828Q7438q8688
19111b80078A26372d92797J65464g0370j85338D8754a18152q2550A34250a17416
19100a7191A5714B307J15972c28122a04028B56311c37164n4758A71513c2199k47203
19089b79402a36437O3863K4329p4219A5598c53470h013I8128k2207N9122a44232
19077A16807m8712Q7921J40507a65265g3415k78087C2447e6613J0215B92965c68222
19065a65688D15049A15292g7373A78361q5705i589A24296N0771a31367B9727J67066
$$ y = [143709, 125778, -127490, -285437, -356937, -250225, -297984, 184311, -81142, -347337, -166993, -68067, -231243, -236770, -203332, -145182, 211078, -179784, 27932, 183881, -194895, 193717, -3034, 146455, -230530, -103681, -94118, -223900, -54640, -401821, 110965, -278828, -191390, -280078, 126372, -492797, -327333, -70370, -255708, 48754, -118152, -200702, 134250, -117416, -17191, 15714, 2307, 118279, -328122, -104028, 256311, -337164, -391922, 171513, -32199, -279402, -136437, -72574, -48245, -122464, 15598, -353470, -8013, 98128, 75921, 135043, -144232, 116807, 68095, 156016, 296523, -165265, -73415, -351502, 32447, -56613, -46398, 292965, -368222, -165688, 415049, 115292, -77373, 178361, 92656, -9589, 124296, 175067, -131367, 29727, 196793]
19054A96793E3217a9570k02146j66606h7496A54704l4382J5353a77276k2251D198
19042b5062A47719L7954b859p7225A05339g8452K4671A15205J67928g702I1453
19030c1322I0708K22314c4396H6507J21702F7687a54720j12075L3836h8935O121
19019h2814q5803b9756B40077a15766o9885r6755A75289J92756f2804O004B60769
19007c19014C4843O3662J01490I3128d7429B249J97306a45528c7403A5170N1685
18996F6855a80734k57390e7861j18262n3353b9561k50723b1804A02920d4383C15696
18984E5033b40471j2807E2208a32552m0691C3527a10210A79594a97587C7797e9286
18972d38589H1100O6722f6174B85737j06831a62810j19122J10702A39677a93052
$$ y = [196793, 53217, -19570, -221716, -388322, -87496, 154704, 120322, 135675, -177276, -199527, 4198, -25062, 147719, 185673, -2859, -80084, 105339, -78452, -53781, 115205, 283133, -7702, 91453, -31322, 90708, 313022, -34396, 86507, 208209, 67687, -154720, -266795, -232959, -88935, -82814, -168617, -29756, 240077, -115766, -185651, -282406, 175289, 368045, -62804, -56800, 260769, -319014, 34843, 98505, 199995, 93128, -47429, 2249, 199555, -145528, -37403, 15170, 66855, -180734, -438124, -57861, -176123, -229476, -29561, -280284, -21804, 102920, -44383, 315696, 55033, -240471, -253278, 52208, -132552, -173243, 33527, -110210, 179594, -197587, 37797, -59286, -438589, 81100, 147822, -66174, 285737, 178906, -162810, -281932, -171230, 139677, -193052]
18961a08237A49468h0892l40552b09087B05824j8180b50057A43258e6760J5655
18951d1105k9485m73203b68574K3354J11916m2487q7418i4757c7614I5398a8048
18939a70467l3247B7470K0327f1474q2227O9134K4317A10534h9451B2779g4369
18927a425C32827b24907a07398C27549a74237A6281a11599j32071N8448k5942
18917b11164f5047j15946h5092A07104A2318J45964o8854c7946k45r6967m6816
18906a81974p3576a01591a6815j81344A49994m5985C3837J44303c5396j10993
18896a46389D3017Q1960a04700k11304A07779J66537A04330N18i2769A30448M3491
18885A73939C7330e7014I3288a79961r0537g39B69220o1759a71401j29262J39258
$$ y = [-108237, 149468, -80892, -421444, -209087, 205824, 187644, -250057, 143258, -56760, -41105, -70590, -543793, -268574, -245220, -133304, -175791, -263209, -94757, -37614, 95398, -18048, -170467, -203714, 27470, 47797, -61474, -143701, -74567, -50250, 110534, -89451, 22779, -74369, -1425, 332827, -224907, -107398, 327549, -174237, 16281, -111599, -243670, -185222, -211164, -65047, -180993, -85092, 107104, 12318, 158282, 89428, -37946, -38191, -135158, -181974, -255550, -101591, -16815, -198159, 149994, 104009, 33837, 178140, -35396, -146389, 43017, 124977, -104700, -316004, 107779, 274316, 104330, 104848, -92769, 130448, 173939, 37330, -57014, 93288, -179961, -270498, -739, 269220, 207461, -171401, -300663, -161405]
18874a61405A55654f539A97358b4596C7095i4538B08614a31134A48044e8028b1839
18862D2721J84948a56460H4085a94000I0611a0728A99861P1851O9655A21120d3845
18850b58737A73992c5035a754E3939J82607N7076m4944m5111L9230a28179k0185
18839a48364L6674j07160I9323A027J45025d4739j41415f8058I6812a32275G1037
18827b13234h5121o8970P1475j39538L9986F990K12010H8220J44392b11567A1860
18815A04300J07977a56123B0786L9225g9366E09016B6117R3079b43667K3050C20173
18803i0299n6471N3398K0903j15097p0103A49863b16765G7661a36202j51005A08670
18791a34204D5446b37808i7312c6986k50200I2922k2927a44304o9563N994j8334
$$ y = [-161405, 155654, -6539, 197358, -24596, 37095, -94538, 208614, -131134, 148044, -58028, -21839, 42721, 227669, -156460, 84085, -194000, 90611, -10728, 199861, 271712, 341367, 121120, -43845, -258737, 173992, -35035, -1754, 53939, 236546, 293622, 248678, 203567, 242797, -128179, -148364, -111690, -218850, 99323, 1027, 146052, -44739, -186154, -68058, 96812, -132275, 71037, -213234, -85121, -154091, -82616, -222154, -182168, 6990, 219000, 88220, 232612, -211567, 11860, 104300, 212277, -156123, 20786, 60011, -79366, 509016, 26117, 119196, -243667, -220617, 320173, -90299, -146770, -93372, -72469, -187566, -257669, 149863, -216765, 77661, -136202, -287207, 108670, -134204, 45446, -237808, -97312, -36986, -287186, 92922, 69995, -144304, -213867, -207873, -226207]
18780b26207l1421A21003A6655d44963g7563G6854b39405j12346g4742j52964
18770b27706C14960d4309j82739d2404j3546A43149n1403f667r4064L3669A78597
18758c2456G3915j8270M8828A3162b2769k03107H2252b3899q7110D5186i7472
18746B60952D3547h293j43618B04366C3771M9807b28002J1458A87553F478b45779
18734H6217e3995a8213o3782D3846c2337D844P6292b92351b4739B8566a31868
18722h8601c4083D8266b83633A54044b8591A02351C9065d02228D9410a02858o227
18711a09085L1527E0321c25805A42272o322c30808R4445M8313A40389i6933j64451
18700b61384J22611D5513m187d46471b4059A61425c34120A43042J6986J68177
$$ y = [-226207, -257628, 121003, 16655, -444963, -77563, 76854, -239405, -351751, -74742, -227706, 314960, -44309, -227048, -42404, -55950, 143149, 91746, -6667, -100731, -67062, 178597, -32456, 73915, 55645, 104473, 13162, -22769, -225876, 82252, -23899, -111009, 45186, -97472, 260952, 43547, -8293, -151911, 204366, 33771, 83578, -228002, -216544, 187553, 6478, -245779, 86217, -53995, -18213, -81995, 43846, -32337, 4844, 81136, -292351, -24739, 28566, -131868, -88601, -34083, 48266, -283633, 154044, -28591, 102351, 39065, -402228, 49410, -102858, -109085, -77558, 50321, -325805, 142272, 135950, -330808, -236363, -188050, 140389, -96933, -261384, -138773, 45513, 41326, -446471, -24059, 161425, -334120, 143042, 160028, 328205]
18690C28205b18487J1933D26990a07104c2515H2748h8977B22483e5130M91j27475
18679a82114N0305j44762a03670k03376c4383r3774F7214a64249M6671k43353
18669c60931e7595B27093a11655A10544b7518A78386c0084B41249q6868D6586
18658f5437k7493l43403A55149a25427A9556L54657A45411n4926d1487B2529J83482
18647B06011d65960B9910o548b06540C6595e805F7258P9778B2987b00035P7462
18636a22573l3748G9498e57475a36489A12434c48983B8499E050J50242e6148A4978
18624B22133o8824o6470k047k3205b01169P2111B32915j12963D26J08515h4562
18612b61034R4547A5450k63K10441d1200B91149B877a7449Q142A88015a19230
$$ y = [328205, -218487, -206554, 426990, -107104, -32515, 82748, -88977, 222483, -55130, -54639, -182114, -131809, -276571, -103670, -307046, -34383, -128157, 67214, -164249, -117578, -360931, -57595, 227093, -111655, 110544, -27518, 178386, -30084, 241249, 154381, 46586, -65437, -92930, -436333, 155149, -125427, 19556, 374213, 145411, 90485, -41487, 22529, 206011, -465960, 29910, 23362, -206540, 36595, -5805, 67258, 147036, 22987, -200035, -122573, -156321, 79498, -557475, -136489, 112434, -348983, 28499, 5050, 155292, -56148, 14978, 222133, 153309, 86839, 84792, 61587, -201169, -129058, 232915, 119952, 426, 108941, -84562, -261034, -166487, 15450, 15187, 225628, -41200, 291149, 2877, -17449, -9307, 188015, -119230]
18600F6885g0003l73436L3794J76314d7451m6971n2931A46102c84687P0861G8316
18588A48249a4566j84844j50394J20084f4800B10722I7846b0471l11809J53610
18578a78670q574C424a91384B36379e7008I9759J583m4768J94218a38049a5711
18566D9631d2205G4043c2979j15189j05648g5926A65448c58582h1766B11150o6165
18555A44985G968Q8291a52251p9108B08550c28848C0194A2809i8456j03108D5456
18543A28072N4668n6801E4367L16304H0924L8120a73522A6091d1965F9106b88005
18531A933P4708C2977a12939G3236j3136b40804J13648J7702B2316c16039G056
18519a42479A03654h3055j2888k7197k11335A22445d36158B01912J02193e3483
$$ y = [66885, -70003, -443439, -409645, -233331, -47451, -94422, -147353, 146102, -384687, -313826, 78316, 148249, -14566, -199410, -349804, -229720, -64800, 210722, 97846, -20471, -332280, -178670, -187244, 3424, -191384, 236379, -57008, 99759, 101342, 56574, 250792, -138049, -15711, 49631, -42205, 74043, -32979, -148168, -253816, -75926, 165448, -358582, -81766, 211150, 144985, 7968, 96259, -152251, -231359, 208550, -328848, 30194, 12809, -98456, -201564, 45456, 128072, 182740, 125939, 54367, 370671, 80924, 119044, -173522, 16091, -41965, 69106, -288005, 1933, 76641, 32977, -112939, 73236, 60100, -240804, -127156, -109454, 22316, -316039, 7056, -142479, 103654, -83055, -95943, -123140, -334475, 122445, -436158, 201912, 304105, -53483]
18508a49567a4268l34291B924b03093a3479j07909A92839a84410B31673c10358
18497A93555b7783I8441A3195J29049R5391I9447K24152d6845C0367i7442C21795
18485a49610p2477A52075b24694p5546E0663d57865f9683n9320B75680a96765
18474a7753o4231B21364b29623I282c0368A28318a18535j26874R8165C36995b24518
18462A54953b47915K0804J08035c3500m3476A99327e7582A49893m6623f3921k22069
18451b85990e7527r486q0770B75963a84904h7188r012A81666a84529C3620b45194
18439a69666p9695A44345c1085A91897f1997N249G146K09712E2207a82340A13657
18427B41381l0922g5604o9341d3078p3855d6826J2577j36918N0438o6940l87123
$$ y = [-149567, -14268, -348559, 2924, -203093, -13479, -121388, 192839, -184410, 231673, -310358, 193555, -27783, 98441, 13195, 142244, 237635, 99447, 323599, -46845, 30367, -97442, 321795, -149610, -222087, 152075, -224694, -300240, 50663, -457865, -69683, -129003, 275680, -196765, -17753, -81984, 221364, -229623, 9282, -30368, 128318, -118535, -245409, -147244, 336995, -224518, 154953, -247915, -227111, -119076, -33500, -76976, 199327, -57582, 149893, 103270, -63921, -285990, -57527, -67013, -147783, 275963, -184904, -87188, -96200, 181666, -184529, 33620, -245194, -169666, -249361, 144345, -31085, 191897, -61997, -56748, 7146, 216858, 52207, -182340, 113657, 241381, 210459, -75604, -144945, -43078, -116933, -46826, -34249, -171167, -120729, -187669, -574792]
18416e74792C9216b91762A43447J9170b10974g0023A664d9744r4202g1237m4924
18405a16161e2024A08813D5280K35085b11759A5350D737a46545j95792A52269
18394B2685b72329E16255B03425F1939a29252M6002m5151c558C292L5085A1611
18382e8321j8881C29972g0222k55767a22012k87797F8319c71623J33102a04587
18371b44173A9620K81024b55301a3743G085h1714j4621j01G368J90316g0345r6187
18359a66532f3774j87755J25405d09A17804K03018a34568e5842i845C03611c6946
18347B20619a41521H1195b24515P0560D6785a26110M4933k4799D8797M12541A12021
18335B12613G1193a52072k65842e5927A01368e5090k27859c2272r4193p9706e5760
$$ y = [-574792, 39216, -291762, 143447, 162617, -210974, -70023, 1664, -49744, -143946, -71237, -116161, -52024, 108813, 45280, 280365, -211759, 15350, 4737, -146545, -342337, 152269, 22685, -272329, 516255, 203425, 61939, -129252, -83250, -128401, -3558, 3292, 38377, 11611, -58321, -77202, 329972, -70222, -325989, -122012, -409809, 68319, -371623, -238521, -104587, -244173, 19620, 300644, -255301, -13743, 7085, -81714, -96335, -96436, 7368, 197684, -70345, -166532, -63774, -251529, -126124, -409, 117804, 320822, -134568, -55842, -9845, 303611, -36946, 220619, -141521, 81195, -224515, -153955, 46785, -126110, -81177, -105976, 48797, 461338, 112021, 212613, 71193, -152072, -417914, -55927, 101368, -55090, -282949, -32272, -126465, -206171, -55760]
18323b66613a2268A47493B5065a39523N0197n8265J9801A48739j0360P1395D1788
18311A00708a49347d8125k6403j15515A12019a57060r0783D42585A32841b30206
18300b70399B18721b16236A17921C2212h3688b195A72261b58998N6937j74129
18290c76190P8953Q6927A43704a21167N9644K9075m11801e5570n135C8384L4878
18279G3262J47337C7522L65015a76182o510g3175A88293a12956j171j82816J12233
18268a84710H959a8781A21038k1529J87574A32066C8449N5951m3797c18957l3673
18257c52630g0908k1870A58240i5765E8271b55029a12884A26196b94678i8856
18246A50517Q5947a9496k5850j59514A14780b09823C41170e4821o3091A92548
$$ y = [-266613, -12268, 147493, 25065, -139523, -89326, -147591, -127790, 148739, 138379, 209774, 41788, 100708, -149347, -48125, -74528, -190043, 112019, -157060, -247843, 442585, 132841, -230206, -270399, 218721, -216236, 117921, 32212, -83688, -2195, 172261, -258998, -202061, -376190, -297237, -210310, 143704, -121167, -61523, -32448, -444249, -55570, -60705, 38384, 73262, 220599, 37522, 402537, -176182, -182692, -73175, 188293, -112956, -114127, -296943, -184710, 8959, -18781, 121038, 99509, 287083, 132066, 38449, 94400, 50603, -318957, -352630, -70908, -92778, 158240, -95765, 58271, -255029, -112884, 126196, -294678, -98856, 150517, 236464, -19496, -45346, -204860, 114780, -209823, 341170, -54821, -117912, 192548]
18235i4411A6499L1K7362Q8017J05275A0057a84355Q3172d7910p5995E5909a57665
18222h8725n0155H158g9916L8359B9996P6637h5120K3990A60014g7467j99877
18211b77344C9779P2876A0168K27319J82182E2279N3622J8456m8588K10968a47642
18199B05257A0869a65353C0757e8570B49250c87756J53511B3845i4628c2529E8493
18187B0785b05446m8105c2334l2753B38249h3866G6287d01098A5919E293a19315
18175d3528E2836a75668q5971r5801A22897c71675D58960C2900N0660a57657d3051
18163a20978m2948p5557q6918f8980C1169b55598C21319A56654p1994g6072j23772
18152a99844B32941F5889a26368B05957r3189a76840N1438D26085a78838D7949
$$ y = [-94411, 16499, 16530, 43892, 131909, 237184, 10057, -184355, -101183, -47910, -123905, 55909, -157665, -88725, -138880, 8158, -79916, -41557, 29996, 106633, -85120, -61130, 160014, -77467, -277344, 39779, 112655, 10168, 237487, 419669, 52279, 105901, 124357, 75769, 286737, -147642, 205257, 10869, -165353, 30757, -58570, 249250, -387756, -234245, 23845, -94628, -32529, 58493, 20785, -205446, -253551, -32334, -65087, 238249, -83866, 76287, -401098, 15919, 5293, -119315, -43528, 52836, -175668, -261639, -357440, 122897, -371675, 458960, 32900, 83560, -157657, -43051, -120978, -163926, -239483, -326401, -68980, 31169, -255598, 321319, 156654, 84660, -76072, -199844, 232941, 65889, -126368, 205957, 112768, -176840, -125402, 426085, -178838, 47949]
18141a23260C0445d1984D2756b54629M4118C16806A9203B108J6545c00270c0218
18129d6477j83754g4494b0096c796p1578E0165i8760l0899n4006N4059C04019
18117A99876F4783i5105B3454b90137B8080c4593k15079B17029i3776C31493b206
18105C11101g6587F9094f8232j91100a20391h492D0943a8905p6186A8711p976
18094A0735a91226n9553A10218c20398A23407a83077d0730A87241a23012A26569
18083B36358g3635E3499J6611J07925p4154J22771a17379A66358d21659J68350
18073b53309A6692L54644a36766j77873A15892h9424k2354M1737D88078A71703
18062a8875A20229c16896A18780b5158l34944J78545j08153J01552A22824a00111
$$ y = [-123260, 30445, -41984, 42756, -254629, -210511, 316806, 19203, 2108, 18653, -300270, -30218, -46477, -230231, -74494, -20096, -3796, -75374, 50165, -98760, -129659, -183665, -129606, 304019, 199876, 64783, -95105, 23454, -290137, 28080, -34593, -249672, 217029, -93776, 331493, -2206, 311101, -76587, 69094, -68232, -259332, -120391, -8492, 40943, -18905, -95091, 18711, 10735, -191226, -250779, 110218, -320398, 123407, -183077, -40730, 187241, -123012, 126569, 236358, -73635, 53499, 70110, 178035, 103881, 226652, -117379, 166358, -421659, -253309, 16692, 371336, -136766, -314639, 115892, -89424, -111778, -70041, 488078, 171703, -18875, 120229, -316896, 118780, -25158, -360102, -181557, -289710, -188158, 122824, -100111]
18051a57414F1985J15522a15542j41588d6218B40393e3016G9252J26209e30956
18040G2546d2017r7563K22L7212o7629B70175b50274g4460I1483K31861b77211
18028b07492Q4128D402a86174D9464a65613B30423B6670b40375L7798b0606I6500
18016g6325k20708B17290f3617j60218p5216f8961b754l3099k53016J0534A39723
18004G6377M0260J74886n897a17002B93709J2566h6626j32A50442F6472J37976
17993B04448C4910c88096a46212g2766A20721n3984P7256P9777d1049j16687k92743
17982d50479H120K4905g1246j49576A39842o1535b47774O1828C7429a94922B13399
17970D3157a19241l8154E3585a61624N7589r8371Q0708A23617J47318d77845F3415
$$ y = [-157414, 61985, 177507, -115542, -257130, -46218, 240393, -53016, 79252, 205461, -530956, 72546, -42017, -139580, -139358, -102146, -169775, 270175, -250274, -74460, 91483, 323344, -277211, -207492, -123364, 4402, -186174, 49464, -165613, 230423, 26670, -240375, -202577, -20606, 96500, -76325, -297033, 217290, -63617, -223835, -299051, -68961, -2754, -35853, -288869, -278335, 139723, 76377, 116637, 291523, 285626, -117002, 293709, 306275, -86626, -86758, 150442, 66472, 204448, 34910, -388096, -146212, -72766, 120721, 66737, 143993, 223770, -41049, -157736, -450479, 8120, 33025, -71246, -220822, 139842, 78307, -247774, -185946, 37429, -194922, 213399, 43157, -119241, -157395, 53585, -161624, -104035, -202406, -121698, 123617, 270935, -477845, 63415]
17958g4340C10627b20260h2A81828a4097l09640B79395e4842B51454a19430c5698
17946a03823c7535j92208P0833j06915A33435b85223P1169i642k38404q4384a30543
17934A32162n117e9566k69274i9115B61407c5648a6747m0614A51877c43853f6562
17922c5942k5686C6345b24975B39707i643B88385a75209A25601N8226B9888d3126
17910g5968C34276c6163m828A82761m3263b20891A46389a29579k905G2004R2284
17899A64288f4924N743K6354A83914q5085i1794a1505n5248D7277K75779b54913
17887c90867J78937i5800C5227M7337k9784J82316b6788B87181a35144G9056a30396
17875a79655c6129j15468e9564j38695A5164b65147A1957K36328d7121k65114
$$ y = [-74340, 310627, -220260, -82, 181828, -14097, -323737, 279395, -54842, 251454, -119430, -35698, -103823, -37535, -229743, -158910, -265825, 133435, -285223, -214054, -9642, -248046, -332430, -130543, 132162, 127045, -59566, -328840, -99115, 261407, -35648, -16747, -57361, 151877, -343853, -66562, -35942, -61628, 36345, -224975, 239707, -9643, 288385, -175209, 125601, 183827, 29888, -43126, -75968, 334276, -36163, -40991, 182761, 139498, -220891, 146389, -129579, -132484, 72004, 164288, -64924, -59181, -32827, 183914, 98829, -91794, -11505, -66753, 47277, 323056, -254913, -390867, -211930, -95800, 35227, 82564, 52780, 235096, -26788, 287181, -135144, 79056, -130396, -179655, -36129, -151597, -59564, -198259, 15164, -265147, 11957, 248285, -47121, -312235]
17865c12235A59576h4015a1447r0099A32888a32722H6456M944K00350a72124j52582
17854c24706H2171k8241f7478A58391K68247a4477F6478k1298A0275e1192p0874
17843a22066C823P3139c66318e6489I4042h3487m8534j45047B11819J6725B8491
17831A56127b10913D6557J36164b28343H7835j8528a42450A98587m5024b9771
17820B32631D2447d5207E6555J11A8026J74857B3526g9289N041H1232a14086b0792
17807b9672D0738a49907j98891a25899D65664j05934a02859B8202J71518L3269
17797B32989a71226e3893H5954J94499C7652a10274A28530J11034f4379A75035
17786a09698A33539E6819K80361A1316b01855j12635g941E9463J61313a46995
$$ y = [-312235, 159576, -84015, -11447, -101546, 132888, -132722, 86456, 91400, 291750, -172124, -324706, 82171, 53930, -67478, 158391, 426638, -14477, 66478, 45180, 10275, -51192, -122066, 3823, 76962, -366318, -56489, 94042, -83487, -132021, -277068, 211819, 228544, 28491, 156127, -210913, 46557, 182721, -228343, 87835, 69307, -142450, 198587, 153563, -29771, 232631, 42447, -45207, 56555, 56666, 18026, 192883, 23526, -79289, -74248, 81232, -114086, -20792, -29672, 40738, -149907, -348798, -125899, 465664, 359730, -102859, 28202, 199720, 232989, -171226, -53893, 85954, 280453, 37652, -110274, 128530, 239564, -64379, 175035, -109698, 133539, 56819, 337180, 11316, -201855, -314490, -7941, 59463, 220776, -146995]
17775B81597h7313N655j13510h1746M0062p2486A29517C7159J86370G6002l1569
17764D4433K41583D2129d0025j6575R875j74906C3950L12454I6476L422c9107
17752b02543B3912a61695N5785A6575i3242j47803D2739N9421i4586B3998a06082
17740b20508q9081J36995B10571b5874A6099a06905j88261D2697a75901B74712
17729F5930O8529c16138F105J29739K17976c72442B49978f6093k9345d335B00902
17717a87184A00379m0872q90D50J25847b29002C45887d82043F8642K382R206b9312
17704E8730E405b3540k45848A58549o6676J9741b8656B7642L1075K8281K9655
17693A16653j2929a37592B6489J25930a38370E9729g0260A22454C6417M6497M0196
$$ y = [281597, -87313, -81658, -195168, -81746, -41684, -114170, 129517, 37159, 223529, 76002, 44433, 286016, 42129, -40025, -56600, -46725, -221631, 33950, 346404, 96476, 99898, -39107, -202543, 23912, -161695, -105910, 16575, -93242, -241045, 42739, 102160, -94586, 23998, -106082, -220508, -309589, -172594, 210571, -25874, 16099, -106905, -295166, 42697, -175901, 274712, 65930, 134459, -316138, 6105, 135844, 353820, -372442, 249978, -66093, -95438, -4335, 200902, -187184, 100379, 59507, 58617, 450, 126297, -229002, 345887, -482043, 68642, 71024, 80230, -29312, 58730, 5405, -23540, -269388, 158549, 91873, 111614, -28656, 27642, 58717, 86998, 116653, 103724, -137592, 26489, 152419, -138370, 59729, -70260, 122454, 36417, 82914, 123110]
17682A23110E440b4068n17049C22448d8741B25916j6263F8951K70148A09003k7618
17671H1385c0593C33418A07983b61096C82446M1903k05084A2552N0604E606a65525
17659A09622c44922g3514K9156A02333K40347b19450E4426M01798d2607G5038
17648C37105e3211A35525a9792H9817O9455J4040e1144B40658k2724a03305j94416
17637b97721A19685K15944A48735o1123j9538b1069G6649a90433A47343G57h8143
17625a41020A26622j8192a58224D16580b5516A64021J99370h1167A11645J99411
17615C11056H854d7799B34215a56033A73306a91265A63298D938O3038b3898E0215
17603a17414B48i5606F644M5610a39413B65873A07923m5159h5007k18683A357
$$ y = [123110, 5440, -24068, -541117, 322448, -48741, 225916, 209653, 68951, 339099, 109003, 81385, -30593, 333418, 107983, -261096, 382446, 424349, 219265, 12552, 63156, 5606, -165525, 109622, -344922, -73514, -44358, 102333, 342680, -219450, 54426, 456224, -42607, 75038, 337105, -53211, 135525, -19792, 89817, 159272, 173312, -51144, 240658, 217934, -103305, -297721, 119685, 335629, 148735, 87612, 68074, -21069, 76649, -190433, 147343, 757, -88143, -141020, 126622, 108430, -158224, 416580, -25516, 164021, 363391, -81167, 111645, 311056, 8854, -47799, 234215, -156033, 173306, -191265, 163298, 4938, 67976, -23898, 50215, -117414, 248, -95606, 6644, 52254, -139413, 265873, 107923, 62764, -85007, -303690, 1357]
17591A79283C3021N2368J32830b36544H8102C7172A4235J61908h389B64005B3526
17579A09492J21417C3716K23489c074j08247d7051C03828D0848J41254b0294A59915
17567C46000A52008k0537C405J62403B5387N9118a27772H8182K73275A53388J29763
17556B83151C4810J63632i2543C58650A5055d1213j83277C26773a17892A10090
17545B41152I0867a32697L910A94372r4208R1951e1803b5069j01254A13148e8770
17533a37243A13461b85053a01917B15135k9723l6457c03994C9100J84380j02332
17523A21148e3972C96652P5341a02872L9107A3698a03256C94641r9411j18125
17513A77105J72100r3997h0822A32850a98641R3892E2420J34040b596A31209m8552
$$ y = [179283, 33021, 85389, 218219, -236544, 88102, 37172, 14235, 176143, -8389, 264005, 23526, 109492, 230909, 33716, 257205, -3074, -111321, -47051, 303828, 40848, 182102, -20294, 159915, 346000, 152008, 131471, 3405, 165808, 25387, 84505, -127772, 88182, 361457, 153388, 283151, 34810, 198442, -92543, 358650, 15055, -41213, -224490, 326773, -117892, 110090, 241152, 90867, -132697, -128787, 194372, 100164, 192115, -51803, -25069, -126323, 113148, -58770, -137243, 113461, -285053, -101917, 215135, 185412, 148955, -303994, 39100, 223480, 121148, -53972, 396652, 471993, -102872, -63765, 13698, -103256, 394641, 295230, 177105, 349205, 255208, -80822, 132850, -198641, -104749, 52420, 186460, -2596, 131209, 82657]
17502H2657K15789n6664o7496J97096c2879B53310O3548a19216A14554h3352m7777
17491a31129G6859K94142c29442J39236B63683b26401c2259B33174j07682k1270
17481A04222J08267a80902A14181A7431M3980L4609O1717K50913j84933J26000
17471C49717P8154D3578a0815G0065J07538H6638l0703J39099f1391j91565A70788
17459I8110k25K49270j05795J89937A02811n0380Q8362J4149J52244M02A21154
17447B91374k4082K63624H3602K45670j53873l4277J17986J97040m7525J30867
17437E39490A96397q7292J46980E9489K56961j01567n8300R6174J8893J80986
17427D52636J3879K3093N2522k67670K13551Q8736A28627L59831L4318m2367I3935
$$ y = [82657, 298446, 241782, 174286, 371382, -32879, 253310, 316858, -119216, 114554, -83352, -131129, 76859, 371001, -329442, -190206, 263683, -226401, -32259, 233174, 125492, 104222, 212489, -180902, 114181, 17431, 61411, 96020, 157737, 408650, 223717, 349717, 427871, 43578, -10815, 70065, 177603, 86638, 55935, 195034, -61391, -252956, 170788, 98110, 97885, 347155, 241360, 431297, 102811, 52431, 140793, 154942, 307186, 307588, 121154, 291374, 267292, 530916, 83602, 329272, 175399, 141122, 259108, 456148, 408623, 539490, 196397, 109105, 256085, 59489, 316450, 214883, 156583, 252757, 271650, 452636, 466515, 489608, 542130, 274460, 488011, 576747, 128627, 488458, 522776, 480409, 93935]
17415F6045L59854j72878J43174a36065A46004m7378P8417L708l5623N854L49929
17404E00911i3096K335A47225J42756E4080J99360E9212J50647r4948F052R3177
17393I9229J15314N7800A23858J64296j10991M75141a88453c7270A00465K83501
17383C83966J75146A31382k0164M8495a30994M5658A92400O4890A14092b033B06995
17371B30195E8190K34384K1336D2997b20798f8574A01589c85363a63754A14594
17360a27956J8016Q543D27556c508k33016A30216a8071j79774C67836r9221C1369
17348H7562c42761B00552a3272B80021j1347M05169a0065B14586H6383B3482J32044
17337A55526L6622l3123R743H0194J79304b9222j51743B7336j2572N32080a9921
$$ y = [66045, 425899, 253021, 396195, -136065, 146004, 98626, 177043, 180751, 145128, 150982, 500911, -93096, -90761, 147225, 289981, 54080, 253440, 59212, 209859, 114911, 6052, 99229, 214543, 272343, 123858, 288154, 177163, 652304, -188453, -37270, 100465, 383966, 559112, 131382, 111218, 159713, -130994, -85336, 192400, 257290, 114092, -2033, 206995, 230195, 58190, 292574, 313910, 42997, -220798, -68574, 101589, -385363, -163754, 114594, -127956, -109940, -101397, 427556, -3508, -236524, 130216, -18071, -197845, 367836, 268615, 31369, 87562, -342761, 200552, -13272, 280021, 268674, 673843, -10065, 214586, 86383, 23482, 155526, 192148, 159025, 168768, 80194, 259498, -29222, -180965, 27336, 14764, 546844, -19921]
17325A19882J2458a69328A06112L35497d245A24842J13365i2872B27528C9122
17314b1883F00321B90616A09443R3154g7264I1239a28338E63162B06247J88566
17304C94813A13571J5018J65341J80723A9969J13891B8160d9992A05504l5579
17294F9925Q9154o8229K40676j04087o9968l4708J14713K63766k26406o8705Q288
17283B14419j3395K25794Q3598q7571J20763A35635m572i6410n2274A41333K71842
17272D13175d700A07012l0431K04986j12328A397L19030A55254L12575k08713
17262B59116d318B91924q4641b52059A67957f6423E62115B47636j08452b0373
17251B96372Q4494j08930J03653A34377Q493n6438K6950m3517J56969G0446L00008
$$ y = [119882, 132340, -169328, 106112, 441609, -4245, 124842, 238207, -92872, 227528, 39122, -21883, 600321, 290616, 109443, 202597, -77264, 91239, -128338, 563162, 206247, 394813, 113571, 128589, 293930, 474653, 19969, 133860, 28160, -49992, 105504, 69925, 159079, 90850, 331526, 227439, 157471, 122763, 237476, 501242, 274836, 206131, 214419, 201024, 426818, 510416, 422845, 543608, 135635, 131063, -96410, -148684, 141333, 413175, -4700, 107012, 76581, 281567, 169239, 1397, 320427, 155254, 467829, 259116, -4318, 291924, 207283, -252059, 167957, -66423, 562115, 247636, 139184, -20373, 296372, 380866, 271936, 375589, 134377, 142870, 86432, 113382, 69865, 226834, 70446, 370454]
17240C70454k1316J11941A91395N5699R5929A5530M90041G1547c4861l6381B66295
17228b21423e578A58245l2279P3732J13289J22755j44225H7344J9151Q7298n0850
17217A42943o7187A8838L1690M12101j46887H4461J44359J10416I515L98683A36829
17205D23290J9952G9434M93091a7444B61831A12941K74268A67503P2419H9887
17194A80855F6755K80820j55794L3017F2311M11099L3402B03198J79248N3706
17184D36152A39844K37162g4429D25742A22630L64674A63099M72636A18578L68814
17174D87392B5837K11256K54160m7969B19935E8579J96326A15960J73389c4129
17163B69199n5265L39606a809A06304J94129m1619L95728A47196K70588B05387
$$ y = [370454, 349138, 461079, 191395, 247094, 343023, 15530, 505571, 71547, -34861, -71242, 266295, -221423, -5578, 158245, 125966, 199698, 312987, 435742, 291517, 87344, 106495, 193793, 142943, 75756, 18838, 50528, 462629, 315742, 84461, 228820, 339236, 9515, 408198, 136829, 423290, 443242, 79434, 572525, -17444, 261831, 112941, 387209, 167503, 239922, 89887, 180855, 66755, 347575, 191781, 224798, 62311, 473410, 506812, 203198, 382446, 436152, 139844, 377006, -74429, 425742, 122630, 487304, 163099, 635735, 118578, 487392, 25837, 237093, 491253, 443284, 219935, 58579, 254905, 115960, 289349, -34129, 269199, 213934, 553540, -1809, 106304, 300433, 258814, 654542, 147196, 417784, 205387]
17152G9675M63572j03058j84752L23432B63228K25813c0875B40158J85798j8635
17142D07321J25375j53850k6312j30498L4397L23972h451F06350k63822l6863
17132C05665M28181j93600B69977K06395l8908K82947o2462k60167A97548l5425
17122A62123L62946A14082J50862K86277j40897i2081G88446k76419j52933n0911
17112C08183j2363m5722J00432K11774j53987K8034r8771p8681J28677A18899
17101C47089A44205J29850N59915k16254C08249M54330j53945k80605J77382K21499
17091G26910C12933J44211A33536M58698B24924p4681Q4372C4581O23179M663
17081F62423R821l5210K9165k90773K37794k4568k04420A69956M30839r8361L0988
$$ y = [79675, 543247, 440189, 255437, 578869, 263228, 489041, -30875, 240158, 425956, 407321, 532696, 378846, 352534, 222036, 256433, 580405, -8451, 606350, 342528, 305665, 733846, 540246, 269977, 476372, 437464, 720411, 657949, 397782, 197548, 162123, 525069, 114082, 264944, 551221, 410324, -92081, 788446, 512027, 359094, 308183, 295820, 250098, 350530, 562304, 408317, 436351, 337580, 258899, 387576, 118899, 347089, 144205, 274055, 833970, 617716, 308249, 762579, 608634, 328029, 505411, 726910, 312933, 457144, 133536, 592234, 224924, 150243, 234615, 34581, 657760, 662423, 672244, 637034, 666199, 375426, 613220, 588652, 384232, 169956, 600795, 502434, 533422]
17070E33422J53045C36355j23950K54331K09710k6488j30756P0764n8824j54790
17060C76352Q1348R146K57515j49647j42982L0129K40672k15668j92020K30609
17050E25454K7394k39802K3883J02303J01317M9737n9739M1427K88785k50832
17040F09927J28717l43980r6020L75634j56603L1643L119j34923J86731J18105
17030G22350l43151L04181k26513M75948D21561L54789k04903J61553n287j69715
17020E57998J75419M03197m91094J13348j7046J50837k35861K65261m02762M47831
17010I67128k10786L82640j81404m30198L22980k37244K86884m08727N36903k12068
17000H16108j51472L3815n488K80589n6030j70772k32812K56717J03603j27545
$$ y = [533422, 686467, 336355, 212405, 466736, 676446, 649958, 519202, 589966, 531142, 376352, 457700, 466846, 724361, 574714, 431732, 461861, 702533, 486865, 294845, 525454, 552848, 313046, 336929, 439232, 540549, 590286, 530547, 571974, 860759, 609927, 738644, 394664, 298644, 674278, 517675, 549318, 552437, 417514, 604245, 722350, 379199, 683380, 456867, 932815, 421561, 776350, 571447, 733000, 727713, 557998, 733417, 1136614, 645520, 758868, 741822, 892659, 656798, 922059, 519297, 967128, 756342, 1138982, 957578, 527380, 850360, 613116, 900000, 491273, 1028176, 816108, 664636, 698451, 692963, 973552, 917522, 746750, 513938, 770655, 874258, 746713]
16990G46713M2331O6206M34869k07385p3031j99850J48062j94524K5575l5775
16980G53191J64450L82645n38614J71267j23401j29449L32887m4705J29739N1837
16970A149847L2218j0744n2550Q2577l18518O7134J56357r205j45793N8879L6879
16959A047081J5583j53140L65745j33866m51J30229j82140m1914J23775J8999
16949A189901l5329k60810N57313m06045J8568Q7390K31976m7630n2187k9820
16939A253327R5889m99825N01507r5738K37554l37151L25100n26739J56105L86232
16929A496261n000j23637J09364O833o5124J91255l66853K05333O901K06320O1505
16918A723158k06034P0471j60814Q8245L1013M2010L34138q8229j9435p7144M12036
$$ y = [746713, 789044, 855250, 1290119, 1082734, 1009703, 809853, 957915, 763391, 788966, 753191, 917641, 1300286, 761672, 932939, 809538, 680089, 1012976, 968271, 1098010, 1149847, 1182065, 1171321, 1118771, 1201348, 882830, 949964, 1106321, 1097116, 951323, 1010202, 1047081, 1062664, 909524, 1275269, 1141403, 1140952, 1271181, 1089041, 1047127, 1170902, 1189901, 1154572, 893762, 1451075, 1045030, 1063598, 1150988, 1382964, 1335334, 1283147, 1253327, 1349216, 849391, 1350898, 1255160, 1492714, 1155563, 1480663, 953924, 1110029, 1496261, 1491261, 1367624, 1476988, 1483821, 1418697, 1609952, 1243099, 1448432, 1455333, 1661653, 1723158, 1517124, 1587595, 1426781, 1515026, 1546039, 1588049, 1922187, 1833958, 1814523, 1737379, 2149415]
16907B149415o66994O19607l75194j94989M33461k21436j3109J03547n7203j93046
16897A584059N20459j38176k88157L16621K30138j61698K40346l97685L05618
16888B211525Q4416l27230J84826K5371K17755j33799J75151J63266P5849k40248
16878B436882P0129J57323Q920l00993L39500l6269J08636k92484K73897M82898
16868C248439m28231j2047m1023R1445L69372j09040j92506K40029j06066m7116
16858C013256K82915j53180K83268k6254m35377Q76748m80466K96327K4257n636
16848C675858J5019m2238j23760M84054K94554j72254O2193P8091j05844Q3160
16838D248833Q4271j49459L32009M7046J10283L19084K9119K6234j76623K92753
$$ y = [2149415, 1482421, 2102028, 1726834, 1531845, 1965306, 1743870, 1730761, 1834308, 1777105, 1584059, 2104518, 1966342, 1678185, 1994806, 2224944, 2063246, 2303592, 1905907, 2211525, 2295941, 1968711, 2153537, 2178908, 2396663, 2262864, 2438015, 2601281, 2677130, 2436882, 2507011, 2664334, 2673254, 2372261, 2711761, 2675492, 2784128, 2491644, 2765541, 3248439, 2820208, 2808161, 2767138, 2858583, 3227955, 3118915, 2926409, 3166438, 3060372, 3013256, 3296171, 3142991, 3426259, 3400005, 2964628, 3841376, 3360910, 3657237, 3681494, 3675858, 3690877, 3648639, 3524879, 4008933, 4303487, 4131233, 4193426, 4271517, 4165673, 4248833, 4333104, 4183645, 4515654, 4562700, 4672983, 4992067, 5021186, 5047420, 4870797, 5163550]
16828E163550j8967K70549K0430R270P24652k46559l40559M58856l6777R2001
16818F096446k6923L93801J59674j07292K08529P8580J84811M16945k55461O42652
16808G791762j12624J08445J56938l07052Q43824J45565O7291L95784J98956K37126
16798I526015L01335m00216M58152J10005N60562L48099J3086M49855R7644M54479
16788A1919016L29532L88424M67894K378O67245L97764N03065N77139J6460O62982
16778A5931899P14132l5752N72625P63534Q14468K94041P05248L56782J117023
16769B1234000R05482O08333O86299O96564J248751P62877J165700P56910J081933
16760B9146849J437694J122648J330322J348688J588757J344929J891969J808884
$$ y = [5163550, 5144583, 5415132, 5435562, 5444832, 6169484, 5922925, 5582366, 6041222, 6004445, 6096446, 6069523, 6463324, 6622998, 6515706, 6724235, 6802815, 6987626, 7404571, 7149110, 7791762, 7679138, 7787583, 7944521, 7637469, 8481293, 8626858, 8694149, 9089933, 9288889, 9526015, 9827350, 9427134, 9885286, 9995291, 10555853, 10903952, 10917038, 11366893, 11464537, 11919016, 12248548, 12636972, 13104866, 13107244, 13774489, 14172253, 14675318, 15252457, 15268917, 15931899, 16646031, 16610279, 17182904, 17946438, 18760906, 19054947, 19760195, 20116977, 21234000, 22139482, 22747815, 23434114, 24130678, 25379429, 26142306, 27308006, 28064916, 29146849, 30584543, 31707191, 33037513, 34386201, 35974958, 37319887, 39211856, 41020740]
16752D1020740J808176K426692J477197K552818K718787K269299L311165K645694
16744F0230568L071684L305899L662714L574582L814906M103621M922253N377156
16736I2063383M646513N499524N658057O100282O165826O275011O311994O821544
16728A39542134P093137O541896O658426O025868O047346N331656M352043L965225
16720A85557731K629366J843586R18861m01892j772620k061567l864696l673757
16712A79175012n019522o252986o014715o607108o748291o716610o991553o764864
16704A28059363o369696o852862n606959o347369n480225n461504m887632m538222
16696H2514894m722417m222263l802075l881526l353594k869274l387893k936371
$$ y = [41020740, 42828916, 45255608, 46732805, 49285623, 52004410, 54273709, 57584874, 60230568, 63302252, 66608151, 70270865, 73845447, 77660353, 81763974, 86686227, 92063383, 96709896, 102209420, 107867477, 113967759, 120133585, 126408596, 132720590, 139542134, 146635271, 153177167, 159835593, 165861461, 171908807, 177240463, 181592506, 185557731, 188187097, 190030683, 190949544, 190547652, 188775032, 186713465, 182848769, 179175012, 174155490, 167902504, 161887789, 155280681, 148532390, 141815780, 134824227, 128059363, 121689667, 114836805, 109229846, 102882477, 97402252, 91940748, 87053116, 82514894, 77792477, 73570214, 69768139, 65886613, 62533019, 59663745, 56275852, 53339481]
16688E3339481k381190k605786k228026k246866k109050j840038j656697k218887
16680C6052941j199204j660874j300190r44002j115486j605812j059604r49311
16672B6218458j046252j153912o31514j122214m54245n91530r82296n96849p69947
16663A8869699p73529m81206q04645m13742p37827m55862q4689m19987p77085
16654A3921127j35241m63296k91273l04701n97712m74667l8703k43884l85669
16645A0985981k43252m69663l81969p9473o1996m45715Q5632m42555k42491l21858
16635H382641k09224P0596m47643k44258J7527l81969J77249k25060o22677J07583
16625F624765p118k06639j60205m78646J60077k24021k82171L88219l63600m3494
$$ y = [53339481, 50958291, 48352505, 46124479, 43877613, 41768563, 39928525, 38271828, 36052941, 34853737, 33192863, 31892673, 30948671, 29833185, 28227373, 27167769, 26218458, 25172206, 24018294, 23386780, 22264566, 21810321, 21218791, 20236495, 19639646, 18869699, 18096170, 17614964, 16810319, 16396577, 15658750, 15202888, 15118199, 14698212, 13921127, 13785886, 13322590, 13031317, 12726616, 12128904, 11654237, 11615534, 11371650, 10985981, 10742729, 10273066, 9891097, 9811624, 9749628, 9303913, 9389545, 8946990, 8704499, 8382641, 8173417, 8244013, 7796370, 7552112, 7569639, 7187670, 7364919, 7139859, 6517182, 6624765, 6617647, 6411008, 6250803, 5772157, 5932234, 5708213, 5426042, 5814261, 5450661, 5407167]
16615E407167j87710r4164J8964m6371k55259P068k59931K18231k63647L22455
16605D866803m61734Q9671m37359J97176m8234l88603J85900q1720j24112l6355
16595C761433j25780O0956p3752R993k43129j41167K82954k18658j21873J06023
16585C297000p1511k62902O9354j45198J05347j11031m33537M45821o4953o5681
16575B762709J27923l91062K96081k04331m85046K11392L38221j91560P9113m3893
16565B499547q5329j10709L39583l41857n61134N45739J25035l06888j94106N71504
16555B481385k12642l91678J88444j72727r5279N50617l67791j72689r9524K95723
16545B003839l04687J41538l77552O66371n67963L87796j98976k48191M23101
$$ y = [5407167, 5219457, 5125293, 5144257, 5097886, 4842627, 4849695, 4589764, 4807995, 4544348, 4866803, 4405069, 4494740, 4057381, 4254557, 4206323, 3817720, 4003620, 3921900, 3797788, 3761433, 3635653, 3696609, 3622857, 3632850, 3389721, 3248554, 3531508, 3312850, 3190977, 3297000, 3225489, 2962587, 3031941, 2886743, 2992090, 2881059, 2447522, 2893343, 2828390, 2762709, 2890632, 2499570, 2795651, 2591320, 2106274, 2317666, 2655887, 2464327, 2543440, 2499547, 2414218, 2303509, 2643092, 2301235, 1740101, 2285840, 2410875, 2103987, 1909881, 2481385, 2268743, 1877065, 2065509, 1892782, 1797503, 2348120, 1980329, 1807640, 1708116, 2003839, 1699152, 1840690, 1463138, 2129509, 1561546, 1949342, 1750366, 1502175, 1925276]
16536A925276p13720M10166K17075m9131k58941q4487K78222m54922L81867N0284
16526A701689k00567o4865j33970K44756l44020M35256k67026p6698j11697L9695
16516A222553K52019l14513K39916m54042K16856l437J42790n12453O71820m62453
16506I99056K12126j16716K71210o458m22326L47695k14264N38115n77546J32038
16496A162930q1698J45403j70064k810j41693J00831n436L38337l48934k54415
16486G42451P9062l6742K4961n8335K3229L99125m24285p5630K30851K61882l16347
16475H50222M7387K4741l29028K1470K95757j83440J08828j71791K61645k61589
16465F64202K88939j78400J44824Q9544k72506k12416K04837J16359j86978o7170
$$ y = [1925276, 1211556, 1621722, 1838797, 1789666, 1530725, 1446238, 1724460, 1269538, 1651405, 1701689, 1501122, 1436257, 1302287, 1547043, 1203023, 1638279, 1371253, 1294555, 1182858, 1222553, 1474572, 1160059, 1399975, 945933, 1162789, 1159352, 1302142, 789689, 1461509, 999056, 1211182, 1094466, 1365676, 1359218, 936892, 1284587, 1070323, 1608438, 1030892, 1162930, 1081232, 1226635, 1056571, 1053761, 912068, 1012899, 1007463, 1345800, 996866, 742451, 821513, 784771, 809732, 751397, 774626, 1173751, 749466, 673836, 904687, 1166569, 850222, 897609, 922350, 593322, 614792, 910549, 727109, 835937, 664146, 925791, 664202, 953141, 774741, 919565, 1009109, 736603, 524187, 729024, 845383, 658405, 591235]
16455E91235K59942p4746l15885L72380l2225P90k80637K71813J3335j87519j5377
16444F03106J82894q5149L6840k91761P6687j21659K85461K22936C08073L32137
16434F40210j99107L10154J52197j50980n2175j69635l1403J09913N828J6389
16424F31391J68447l45516R1607J60489k96290l3813J78684J25855j53937K42172
16414G69089C69015J11513o8974A09456L18047K08975R6045l35157K92511k51335
16404D38542j4070R2596J754j69340J2238O8951J74803D9295L54418J60316k7901
16393E36128j32413J91754A65907N53809l29011K2050N9998p243J21623j41276
16383D45857p3151n3101J13667n4723o8109L29883k70573J05847N0683m8669K20901
$$ y = [591235, 851177, 776431, 460546, 832926, 800701, 801491, 520854, 792667, 806002, 618483, 603106, 786000, 700851, 737691, 445930, 522617, 400958, 686419, 909355, 308073, 640210, 441103, 751257, 903454, 752474, 700299, 530664, 499261, 609174, 615002, 631391, 799838, 454322, 545929, 706418, 410128, 376315, 554999, 680854, 526917, 769089, 369015, 480528, 411554, 109456, 427503, 636478, 732523, 397366, 689877, 438542, 424472, 517068, 518822, 349482, 361720, 430671, 605474, 49295, 403713, 564029, 536128, 403715, 595469, 165907, 719716, 390705, 412755, 472753, 465510, 587133, 445857, 372706, 319605, 433272, 378549, 310440, 640323, 369750, 475597, 526280, 477611, 698512]
16372F98512p4257B40147O9735J66344k3801G3551J27366J27726J01704A28201
16361E76770A34350M72642k288k47883p6922J81994n3439J87299H4182L8592C9345
16349B43018M7344O4152J51318r8057M7552J2909A8051L06519P6575H5569L13241
16338C98810A96965L8411L38199B30990P2725p12J60126j4661A57268K55512M1702
16327D54482j11960M6228j08570K60517B64459n314K05708A49157J88808J6284
16317C54249A25575m8199L30417K28775A67986J43894J59402A66866Q182k6314
16307A48734J56648a09103A76022L10750k36307f7649B36416K1301J28238j66853
16297B19102J10549J80911A77895b2268C50109I0491J97340j36195L2336D6201
$$ y = [698512, 624255, 240147, 309882, 476226, 452425, 73551, 200917, 328643, 430347, 128201, 576770, 134350, 606992, 604704, 356821, 279899, 461893, 408454, 595753, 84182, 122774, 39345, 243018, 290362, 354514, 505832, 407775, 455327, 468236, 18051, 324570, 401145, 85569, 398810, 196965, 235376, 573575, 230990, 303715, 303003, 463129, 448468, 157268, 412780, 454482, 342522, 388750, 280180, 540697, 264459, 259145, 464853, 149157, 337965, 354249, 125575, 77376, 407793, 636568, 167986, 311880, 471282, 166866, 175048, 148734, 305382, -109103, 176022, 486772, 250465, -67649, 236416, 257717, 385955, 219102, 329651, 510562, 177895, -22268, 350109, 90491, 287831, 151636, 183972, 46201]
16286b6932A50313P5828j4295b41387C36817j29966k239J88249A48241K34610
16276C82851J89766G926M36182k20902A05986K1628J63020F709J40587l5461l5671
16265G6164a975B50384D7622k2011h2257I9655K26480C6370K3174J61620F4956
16253D22669b7107B69170j17280R7001i404A22891b54319B79749j01470K27764
16243D06043d7096G6549K91314A68879K18622a03740A2589a33673i288I9139L4145
16232A33284A940h964C43216A52351H8K92884H9047K53717j24468g4701C0590
16220a66242C17567a0489B07768I8434c4586A60959m1822B9195P731K95333l7917
16209B94342p387j05136D5633d4734H8275O6684j3613B2185J38702J36938O731
$$ y = [-26932, 150313, 226141, 211846, -241387, 336817, 206851, 204612, 392861, 148241, 382851, 572617, 7926, 444108, 223206, 105986, 127614, 290634, 6709, 147296, 111835, 76164, -1975, 250384, 47622, 25611, -82257, 99655, 326135, 36370, 59544, 221164, 64956, 422669, -27107, 269170, 151890, 248891, -9404, 122891, -254319, 279749, 178279, 406043, -47096, 76549, 367863, 168879, 387501, -103740, 12589, -133673, -9288, 99139, 133284, 1940, -8964, 343216, 152351, 88, 292972, 89047, 342764, 218296, -74701, 30590, -166242, 317567, -10489, 207768, 98434, -34586, 160959, 119137, 29195, 36926, 332259, 294342, 286955, 181819, 45633, -44734, 88275, 154959, 141346, 22185, 160887, 297825, 304556]
16198C04556F611J14120J04921H5857M30578A67865K1969I1086g0355A31599L9890
16187A71489Q7101j22398L14596A77146a36299D09176H8370B0798J85441q7869
16177A18370J21070a59904D7668j9370M21029a63614f5112H7098f9697G0528J83876
16166B54404p6627a61775C2391Q7704a28995l6063A3776a5080j25393j30744c0768
16154f5246B95664L1810P1977j21474j13028l3759l1542K51255f4587B57970b36261
16142b12879B70976A19984g9094I7048L9981A9673M35968D7036K54655C3316J03308
16131A36624D2027d01395D0851K2232d8908r4097A97937g1592B92646f5185l38251
16120d03436e3803k6760I4375a7446k15466A4444J88927O5368Q6655i7061K0681
$$ y = [304556, 6611, 120731, 225652, 85857, 516435, 167865, 189834, 91086, -70355, 131599, 171489, 258590, 136192, 450788, 177146, -136299, 409176, 88370, 20798, 206239, 118370, 239440, -159904, 47668, 28298, 449327, -163614, -65112, 87098, -69697, 70528, 254404, 177777, -161775, 32391, 120095, -128995, -165058, 13776, -15080, -140473, -271217, -30768, -65246, 295664, 327474, 399451, 277977, 164949, 131190, 99648, 350903, -64587, 257970, -236261, -212879, 270976, 119984, -79094, 97048, 137029, 19673, 455641, 47036, 301691, 33316, 136624, 42027, -401395, 40851, 63083, -48908, -143005, 197937, -71592, 292646, -65185, -403436, -53803, -80563, 94375, -17446, -232912, 14444, 203371, 268739, 355394, -97061, -76380]
16109g6380A93885o9706N615P8403g4411b4245C4621L2425Q570Q8417c9827E8067
16096A55606k5497a47795A2818L78236b8399m3715K0000i067M430C2623c40760
16084B6411K3692j3979a9885k55366c096j29159n1128C44686F6449J78637E4658
16072G3261P6479b62040B59817J38291I2937b13833o9835C1805K02354B7456E040
16060a08331d2858A13507a83637H8916b6094k86570C13305A42191a87127I9287
16049c11558C5241a3461j31708A9271R9552R4889K4893a13687B12251C4689c39343
16037h0093j11339r7620F8859c8755j3225n854n6537M8545A49338a10057j44473
16026b54530R9482L6482k11393B0141M4681A2442J95612G2045B1468a03533J9101
$$ y = [-76380, 193885, 124179, 129794, 208197, -74411, -24245, 34621, 67046, 75616, 164033, -39827, 58067, 155606, 130109, -147795, 12818, 391054, -28399, -72114, -52114, -9067, -4637, 32623, -340760, 26411, 50103, 36124, -19885, -275251, -3096, -132255, -183383, 344686, 66449, 245086, 54658, 73261, 149740, -262040, 259817, 398108, 92937, -213833, -283668, 31805, 234159, 27456, 5040, -108331, -42858, 113507, -183637, 88916, -26094, -312664, 313305, 142191, -187127, 99287, -311558, 35241, -13461, -145169, 19271, 118823, 213712, 238605, -113687, 212251, 34689, -339343, -80093, -191432, -289052, 68859, -38755, -51980, -57834, -114371, -65826, 149338, -110057, -254530, -155048, -118566, -329959, 20141, 64822, 12442, 208054, 72045, 21468, -103533, -84432]
16015h4432j4295C551J27448m4095h6338H818R6162Q3158k6068N3985A0527K9796
16003D0323c12846b6956k67874R8125m5111A090d03049a74863F9531N5245K0214
15992A44990M81304B2082a17058C92883a66450d5509r2941C7961f7196B68001
15981a46031A42666d7034B54618j12924n0292a16936j7891D9913J7563b50125
15970a08442j15980P2821A41448a36386L1849c6066k09707B35960d3035J7473
15960b5562R031l3904k74961B31210J80271D6538a4409r0307j37995A76199a44420
15948D26b65057D25042f0939F5937K18900c5050q5666C081L6685c34849A44814
15936I8076a0837k71377o3272F4621b8152j03353C6504h6749n1701D6493b02275
$$ y = [-84432, -98727, 3551, 130999, 86904, -86338, 8818, 104980, 188138, 162070, 216055, 10527, 40323, -312846, -26956, -294830, -196705, -241816, 1090, -403049, -174863, 69531, 124776, 144990, 626294, 22082, -117058, 392883, -166450, -45509, -138450, 37961, -67196, 268001, -146031, 142666, -47034, 254618, 141694, 91402, -116936, -134827, 49913, 67476, -250125, -108442, -224422, -151601, 141448, -136386, -104537, -36066, -245773, 235960, -43035, -25562, -16531, -50435, -325396, 231210, 411481, 46538, -14409, -104716, -242711, 176199, -144420, 426, -265057, 425042, -60939, 65937, 284837, -35050, -120716, 3081, 39766, -334849, 144814, 98076, -10837, -282214, -345486, 64621, -28152, -131505, 36504, -86749, -138450, 46493, -202275]
15924A42518l8415e7474C7195b24214a01852A995b80527a36671d7608k0785j23848
15913a92241O5965d3665l7014b4823A74628f1940E9261a72717C65289A50344a97591
15901a04085A75520f9777B36221D2653d37316b08543D3698b368l8897j53511A34001
15889a02087M2439D6635f101B56488a15881H8342c8092j70920l15305N429B1256
15877a57193c7324q5955A38998a30062b102G1748a12063j03717A68801b37815
15866h8730D0770b70456G423N53311b77798g5833l14887J19897K0165D3781K57064
15855C00845k0273h5937I4408J18588G4622i3954j80870b573B43577A09223d7551
15843B82732h0271A15274c23128B05525A897O3060R0762K34617a81358A9307e5222
$$ y = [142518, 104103, -57474, 37195, -224214, -101852, 1995, -280527, -136671, -47608, -68393, -192241, -126276, -43665, -80679, -24823, 174628, -61940, 59261, -172717, 365289, 150344, -197591, -104085, 175520, -69777, 236221, 42653, -437316, -208543, 43698, -2368, -41265, -194776, 134001, -102087, -59648, 46635, -6101, 256488, -115881, 88342, -38092, -209012, -524317, -518888, 21256, -157193, -37324, -123279, 138998, -130062, -2102, 71748, -112063, -215780, 168801, -237815, -88730, 40770, -270456, 7423, 560734, -277798, -75833, -390720, -270823, -250658, 43781, 300845, 280572, -85937, 94408, 212996, 74622, -93954, -274824, -2573, 243577, 109223, -47551, 282732, -80271, 115274, -323128, 205525, 1897, 64957, 155719, 390336, -181358, 19307, -55222]
15831A71572I653c16677J42125j7374d6493r1545K9747A36119K17174a65781C01849
15819b171k03712b4326B27104B2783J01011b4006m7410G2247b64237A08726J61912
15808B70638n4370c13191F6560b4830p1853M339j33572A10156a30570N9294D6790
15796A25172o0284Q1504p1781J38503B2956E09K92211a74119c3233k45152a4010
15784B6001J2558L5225i0952l4783e2442H7762d67343g3388r0034n1329L2021
15773a82730B2433a09489C2189K1263a04741a9988A69912f5545B76616A05844
15762A12661J417h1587l3164I2996b91107D2592a8520E7654K8837D1009o244i362
15749H4361a62488C7425J85677b17113N6525A4281J23233m6077b40622g7765A52152
$$ y = [171572, 9653, -316677, -174552, -191926, -46493, -138038, -108291, 136119, 353293, -165781, 301849, -2171, -205883, -24326, 227104, 22783, 123794, -24006, -71416, 72247, -264237, 108726, 270638, 216268, -313191, 66560, -24830, -96683, -92344, -225916, 110156, -130570, -71276, 46790, 125172, 64888, 146392, 74611, 213114, 22956, 509, 292720, -174119, -33233, -278385, -14010, 26001, 38559, 73784, -90952, -125735, -52442, 87762, -467343, -73388, -163422, -214751, -182730, 22433, -109489, 32189, 53452, -104741, -19988, 169912, -65545, 276616, 105844, 112661, 114078, -81587, -114751, 92996, -291107, 42592, -18520, 57654, 86491, 41009, 34765, -9362, 84361, -162488, 37425, 223102, -217113, -160588, 14281, 137514, 91437, -240622, -77765, 152152]
15737I3852c36303C2945a61804r428L9456k90756C0697b17566n3565H3196h5607
15725c40545B21980J73206A16597c21155A299J55424H752a6832j18251H425J15319
15714A23744e55462F5406J83280g2116A89410Q9095c66199h9197c356k68992m9303
15703c21651h484A4410c8530A79494a05822k16120A56491a09204B95211F975c35063
15691f3743B21174P83F5435b8094K676l4885o0439A00361a87572q7137C8992a33311
15678a58326I5857a77005G8381g781E3855e7347H8374O2695L82395d0987B28022
15666C60595b17884R8438K351A21209a62539P2735a8335A75436a01564q0635A54233
15654c05600j9186f5468i265j32244a0462D4754a96094N1180C01656a47041j54243
$$ y = [93852, -336303, 32945, -161804, -171232, -131776, -422532, 30697, -217566, -271131, 83196, -85607, -340545, 221980, 395186, 116597, -321155, 1299, 156723, 8752, -16832, -135083, 8425, 123744, -555462, 65406, 248686, -72116, 189410, 278505, -366199, -89197, -3356, -272348, -321651, -8484, 14410, -38530, 179494, -105822, -321942, 156491, -109204, 295211, 6975, -335063, -63743, 221174, 221957, 65435, -28094, -25418, -60303, -120742, 100361, -187572, -274709, 38992, -133311, -158326, 95857, -177005, 78381, -7781, 53855, -57347, 88374, 151069, 533464, -40987, 228022, 360595, -217884, -119446, -117095, 121209, -162539, -89804, -18335, 175436, -101564, -182199, 154233, -305600, -324786, -65468, -9265, -141509, -10462, 44754, -196094, -144914, 301656, -147041, -301284]
15643c01284a25314c6717G0329d6357k99120i7625A54873g7019l51966h7977I4768
15631I9632j4554b5734m23379a00309o0192A94733G1760P6534i1630B62331m2141
15620B20190c73332e6458j4886B32349b8329I154a5745k30933B43695b72581L5862
15609b36719G0788J81489a83641A19388L87J74421c16895a14969B1251L4392L1916
15598H7559c74370f2296K442A40394a15391B3069l529a08028A65842n8479d4251
15586H611a06044E3271K32773B7230b03359H6218b5057k29154a4931q3611B8630
15574a62523A59246d5961k61472J24019B6979c6304k19132A17599J64417a98989
15563A69069j5561a6767A53806E5062a15705B1445J43413b33796C53282F5116
$$ y = [-301284, -125314, -36717, 70329, -46357, -345477, -97625, 154873, -77019, -428985, -87977, 94768, 99632, 85078, -25734, -449113, -100309, -160501, 194733, 71760, 148294, -91630, 262331, 220190, -373332, -56458, -71344, 232349, -28329, 9154, -15745, -246678, 243695, -272581, -236719, 70788, 252277, -183641, 119388, 119775, 294196, -316895, -114969, 21251, 55643, 87559, -374370, -62296, -59854, 140394, -115391, 23069, 19540, -108028, 165842, 107363, -44251, 8611, -106044, 53271, 286044, 27230, -203359, 86218, -25057, -254211, -14931, -98542, 28630, -162523, 159246, -45961, -307433, -183414, 26979, -36304, -255436, 117599, 282016, -198989, 169069, 153508, -16767, 153806, 55062, -115705, 21445, 164858, -233796, 353282, 65116]
15552C2604J33803h725o7735E6403J19364b49312l1603G5083b03249a9151A20077
15540b52985C7495A4250M6106a58842N9883l8605E2449c09362f1806q0782B14324
15528B8427J49683C8025P2939g3273a5026B82879j0262D2153L03902b04113J9728
15517a84385c0250A60314P368a19796A24235c85361C53877b60101A72632L7164
15507B09796e3600r7157M473B13984D2627f5155m9189e0012m2648m0822d1859
15495I2367a47056j16612e3476E2921N5504b0625j65186O2823H5309d6789o821
15484e3610J5796A70485K1672e2745o1548m1350M304j83939A06875M8736l0711
15473A24900a26645A21430B2035h3538k4543D214R952K44760L741b71116c6320
$$ y = [32604, 166407, -8725, -76460, 56403, 175767, -249312, -280915, 75083, -203249, -19151, 120077, -252985, 37495, 14250, 60356, -158842, -98959, -137564, 52449, -309362, -61806, -142588, 214324, 28427, 178110, 38025, 110964, -73273, -15026, 282879, 272617, 42153, 346055, -204113, -184385, -30250, 160314, 167682, -119796, 124235, -385361, 353877, -260101, 172632, 209796, -53600, -150757, -146284, 213984, 42627, -65155, -114344, -50012, -92660, -133482, -41859, 92367, -147056, -263668, -53476, 52921, 108425, -20625, -185811, -122988, 85309, -46789, -53610, -37814, 170485, 192157, -52745, -114293, -155643, -151339, -335278, 106875, 155611, 124900, -126645, 121430, 22035, -83538, -108081, 4214, 14166, 258926, 262667, -271116, -36320]
15461F6364K46706b05843n5727C54232a02036B59150n6043a50658B4891R8299
15451A23190J61188I7488a22047D97311a47853A51309a41997d217l4045j03358
15441a41620o4744G7321b75454A22172K3476G562a60255A49872J12328r5924i3639
15429c95277B57682b83396a07581A434N7355a08821m5041A49540N7632c4262j01048
15418a35310B21576K09122f9188A27599D82J52786n0871g0793C30531c2491j46641
15407a79132E0764e539F7154R1870b08754f5255E9326g9525A0644L2054a0556
15395I7156L912a29214J792G0540a7998E5703p595P4423a7491E7519b29999A57403
15382F2317i4181l2781e0610j38870E42980a67501J1861f5035B07805c05284a51223
$$ y = [66364, 313070, -205843, -261570, 354232, -102036, 259150, 203107, -150658, 24891, 123190, 284378, 97488, -122047, 497311, -147853, 151309, -141997, -4217, -38262, -141620, -206364, 77321, -275454, 122172, 145648, 7562, -160255, 149872, 262200, 166276, -93639, -395277, 257682, -283396, -107581, 1434, 58789, -108821, -153862, 149540, 207172, -34262, -135310, 221576, 430698, -69188, 127599, 482, 153268, 102397, -70793, 330531, -32491, -179132, 50764, -5539, 67154, 159024, -208754, -65255, 59326, -79525, 10644, 42698, -10556, 97156, 101068, -129214, -127422, 70540, -17998, 55703, 48108, 122531, -17491, 57519, -229999, 157403, 62317, -94181, -126962, -50610, -189480, 542980, -167501, -155640, -65035, 207805, -305284, -151223]
15370c04187f3136B58542b19875H508J739L36122b64157i4685L9309k43487i6613
15358F043d8033P346A19418J18924C6277M601K74419A6084J20227C0709L21436
15347C52145a66790B29162G7054J01298b81562A90507M0555d22698a24318K9412
15337i4906A52014h1114B7579c9745j61213D3106b24719B73992H1380C9600e6964
15325A20311J18744a44672A49724N8822J8845e7585A21683n5068b32509B82834
15314H6225J13317b00219A06720h0639A31670K07477j49969i7878B38541l5985
15304B02556m4804b2040j01567J9142L7076B622J29867F775b5629j4835m01672
15293d42136I4640M46686A70590E9301J23184n4163e0979j03668A73846q0622
$$ y = [-304187, -63136, 258542, -219875, 8508, 10247, 346369, -264157, -94685, -55376, -298863, -96613, 6043, -48033, -40687, 119418, 238342, 36277, 40878, 315297, 16084, 136311, 30709, 352145, -166790, 229162, 77054, 178352, -281562, 190507, 231062, -422698, -124318, -94906, 152014, -81114, 27579, -39745, -200958, 43106, -224719, 273992, 81380, 39600, -56964, 120311, 239055, -144672, 149724, 208546, 227391, -57585, 121683, 66615, -232509, 282834, 86225, 199542, -200219, 106720, -80639, 131670, 339147, 189178, -97878, 238541, 202556, 157752, -22040, -123607, -104465, -67389, 2622, 132489, 6775, -25629, -40464, -442136, 94640, 541326, 170590, 59301, 182485, 128322, -50979, -154647, 173846, 93224]
15283I3224c18821C26936o4405a70822C35913a71465B8879R049h438p223m0023
15272e5684D5790J18788d39681B62656l9255a88333G6600a40078D2314a23637
15261a46839D3956J36633a5376C83729i2801C65308F0898L24078j79767e3645
15250A97770N18899K12022N58717j51580J1494k34285B24305N3747c3831A30499
15239B99824j45788M0883J20156A56123a5488A45325c0149J124P966A15476n590
15228A09886i7337L2709D43223j98106p8058f3229h610H2435a183A46029k4331
15217A21698e15541K31238L7195g3877B31380a10277B8048b29501A14451J94405
15207C08856C1172Q6055N7820M326a88478I5907J08983j0429K6561p6193K76035
$$ y = [93224, -318821, 326936, 262531, -170822, 335913, -171465, 28879, 37928, -8438, -15661, -55684, 45790, 164578, -439681, 262656, 223401, -188333, 76600, -140078, 42314, -123637, -146839, 43956, 180589, -15376, 383729, -92801, 365308, 60898, 384976, 205209, -53645, 197770, 716669, 928691, 1487408, 1335828, 1347322, 1113037, 224305, 278052, -33831, 130499, 299824, 154036, 194919, 315075, 156123, -15488, 145325, -30149, -29025, -21059, 115476, 109886, -97337, -64628, 443223, 245117, 167059, -63229, -8610, 82435, -1183, 146029, 121698, -515541, -284303, -247108, -73877, 231380, -110277, 28048, -229501, 114451, 308856, 31172, 117227, 175047, 179373, -188478, 95907, 204890, 194461, 221022, 144829, 420864]
15196D20864r8918A19789n5221O2205Q3733f2953A12448k5626C1323N9645J46988
15185B37956a13175B38482J33055j63581p8469J51900r9043f7602B70773a05952
15174C01739o5682B6585M23631k04734B8230Q624i5254H6062c49A93635n6399
15163A37236e663A47025b21000f1241B31070k7606F2299a9926o0738B0895b293
15151c0890B73996a29305C2652a31264B84360a9906k2967A73500J38121K13580
15141E25201b19679B35781c9227j85868c9202A36077D1096L11941A29309m7695
15131H1614a27527B95100l6607C7905A875N0900R4330R4665A10734J49120d8450
15119F52028A94359q2499L3108a77647Q2179L5233B73157J42581H8715A9871b7273
$$ y = [420864, 321946, 119789, 64568, 126773, 210506, -62953, 112448, 86822, 31323, 90968, 237956, -113175, 238482, 371537, 207956, 129487, 281387, 182344, -67602, 270773, -105952, 301739, 236057, 26585, 450216, 245482, 28230, 36854, -95254, 86062, -349, 193635, 137236, -5663, 147025, -221000, -61241, 231070, 203464, 62299, -19926, -80664, 20895, -2293, -30890, 273996, -129305, 32652, -131264, 284360, -19906, -42873, 173500, 311621, 525201, -219679, 235781, -39227, -225095, -39202, 136077, 41096, 353037, 129309, 81614, -127527, 295100, 258493, 37905, 1875, 52775, 147105, 241770, 110734, 259854, -48450, 652028, 194359, 111860, 144968, -177647, -95468, -60235, 273157, 415738, 88715, 19871, -27273]
15107C267a7988A08167N36159C04302J76774B12611d3026B30697R9071J05456
15097D35224A91723K81665b81845D2159J38797a35610E41853j07796F4092J5181
15087G9273K52762a84007r4611a11791A78049O4511J2894p5820b12520B61249
15076I3529k0932a05543A83657H9514J63850b12952E7865M33442j23757j9341
15066C48209m507n7385j30524H196M10819e9688C69043a830A62166J65316a9714
15054B52566j22959a57228C17996a24827D3681a61841K3226B39260K2160g6941
15043h3666d0185f465A59651m6536b0192C15034m5801j22903m5991m146P2376
15032A68569f2475I2421A9809K08087J2578K73432A71487L47378b12339o0189
$$ y = [3267, -17988, 108167, 644326, 304302, 481076, 212611, -43026, 230697, 329768, 435224, 191723, 473388, -281845, 42159, 180956, -135610, 541853, 434057, 64092, 79273, 332035, -184007, -278618, -111791, 178049, 242560, 255454, 179634, -212520, 261249, 93529, 72597, -105543, 183657, 89514, 253364, -212952, 57865, 491307, 367550, 348209, 343702, 286317, 155793, 8196, 419015, -59688, 369043, -1830, 162166, 327482, -19714, 252566, 129607, -157228, 317996, -124827, 43681, -161841, -138615, 239260, 261420, -76941, -83666, -40185, -6465, 159651, 113115, -20192, 315034, 269233, 146330, 100339, 96193, 168569, -62475, 92421, 19809, 227896, 240474, 513906, 171487, 518865, -212339, -272528]
15022b72528C15372l6275n8764P7027o713I7082K80453A78436L1757R839g5170
15010C70135l5886k1573o3238K42065A37163J10598L6667k5659J16144j42259
15000B32654i2266A94917P9458A13768Q9020P8380Q0792j4309k4830N3383O3487
14989D39691C6435M41014B17157r0195J72379R1835J07035A45837K47497A42836
14978A81066a14830B79805l1598J86847l9008g6247B64786O9738A39338A2288
14967C43153N0602A62892L46917k00806q8093q4680J30031Q2766m3623J22568
14957D27972j22856O3700J00284b49425C24886N19462B09716J8635a53312C03463
14946B84483l3721b8316B50976J23998o5905M917J369j5971J75232I7110K78656
$$ y = [-272528, 315372, 279097, 220333, 297360, 290647, 97082, 377535, 178436, 210193, 220032, -75170, 370135, 334249, 312676, 249438, 491503, 137163, 247761, 284428, 258769, 374913, 232654, -92266, 194917, 274375, 113768, 202788, 281168, 361960, 347651, 322821, 376204, 439691, 36435, 477449, 217157, 126962, 299341, 391176, 498211, 145837, 393334, 142836, 181066, -114830, 279805, 248207, 435054, 396046, -76247, 264786, 334524, 139338, 12288, 343153, 393755, 162892, 509809, 309003, 220910, 136230, 266261, 349027, 305404, 427972, 305116, 368816, 469100, -249425, 324886, 844348, 209716, 228351, -153312, 303463, 284483, 250762, -28316, 250976, 374974, 309069, 313986, 315355, 299384, 474616, 97110, 375766]
14935C75766r0035K79259B2451h0630B77489j23743K90502D1046n698K52541P2831
14924C60720J29625k16318J4337K94579j30080A76655K2342K4090N9077K68736
14914E50900r6071D7673L72287j38242p5126b3330C53889K5911L8737A99610M58992
14903F58602C28207J1877A26576Q2302J68236Q1588J8386j74585l4470J91064
14893D59097j54516j03575H5540N97905f1772B60958L48045B82635d873B97155
14882A46330N03246j25724E4810M02435J65096q5793k05783p2730p4663O6318
14872B49690K42500j5553J13168O9431A64810K223M39163B57960l6461J24171
14862C45670J04641K9015O6966j24354k1962J48573J48114B43841L27047j16851
$$ y = [375766, 285731, 564990, 22451, -80630, 277489, 153746, 444248, 41046, 35348, 287889, 360720, 490345, 274027, 288364, 582943, 452863, 176655, 198997, 223087, 282164, 550900, 454829, 47673, 419960, 281718, 206592, -23330, 353889, 379800, 418537, 199610, 658602, 328207, 340084, 126576, 208878, 377114, 458702, 477088, 302503, 268033, 459097, 304581, 201006, 85540, 683445, -61772, 260958, 609003, 282635, -4873, 297155, 146330, 649576, 523852, 54810, 457245, 622341, 536548, 330765, 258035, 183372, 249690, 492190, 476637, 589805, 659236, 164810, 167033, 606196, 257960, 221499, 345670, 450311, 479326, 546292, 421938, 399976, 548549, 696663, 243841, 570888, 454037]
14852D54037j51006K24199p9564J72913j58618P4700B65084K91370j23631j8332
14842D14491J26040L78121j30909J12996l14770J06570n6799P4385j3617k67507
14832D29001P9318j26940J68159K40205j37587H8825J96695K45065O5206j81927
14822D13864K29004A77454L26006N6421j72027j02734L22645A15221K24749J99218
14812E39188B33092L80981J53676B60415J58702J8908k8302L50357l08667O68371
14802A119784k52393R5726C33679M63530m4267j57901j25476N0230G0993L14397
14792C85390J85134K36326l41330K92806j57749j21566J29126J75454j90566j8949
14782E74076j50473J14077Q818J6810o4115K14194j0741k30991M0287J93378j66803
$$ y = [454037, 303031, 527230, 447666, 620579, 461961, 536661, 265084, 556454, 432823, 414491, 540531, 918652, 787743, 900739, 585969, 692539, 635740, 710125, 696508, 429001, 508319, 381379, 549538, 789743, 652156, 88825, 285520, 530585, 595791, 413864, 642868, 177454, 503460, 559881, 387854, 285120, 607765, 115221, 339970, 539188, 233092, 614073, 767749, 260415, 419117, 438025, 409723, 760080, 451413, 1119784, 867391, 963117, 333679, 797209, 752942, 595041, 469565, 519795, 70993, 385390, 570524, 806850, 465520, 758326, 600577, 479011, 608137, 783591, 593025, 574076, 423603, 537680, 546498, 563308, 499193, 713387, 702646, 471655, 511942, 705320, 538517]
14771E38517J75210j43304J06865r9949J19147K61180j96847j63462m3407L2292
14761E86242J58910K18809k87422A41136N96354K48431k61769k74454M76164k8931
14751H96931j12764j55451L18944j93994k80225M14570j71094R2868l26103M47410
14741I31092p5584l49297J71348O9344J18987M02860k65080j44905J92218Q1511
14731A132494j6324k97761r1503j30830J45647n8964J31109k17389J42724P3666
14721H12869q886j2480l80931N51642j94895L0013K79466k97270L77498l79098
14711G77928l3996K03302j10900J24574j76643K17137R3643k86816J41294J5816
14701I65339J33071o2643m0652o9235N3384r2867K90491C99110N94266J2043M9133
$$ y = [538517, 713727, 570423, 677288, 577339, 696486, 957666, 760819, 597357, 553950, 586242, 745152, 963961, 676539, 141136, 737490, 985921, 724152, 449698, 925862, 896931, 784167, 628716, 947660, 753666, 473441, 888011, 716917, 809785, 483682, 931092, 855508, 506211, 677559, 746903, 865890, 1268750, 1003670, 858765, 1050983, 1132494, 1116170, 818409, 726906, 596076, 741723, 682759, 813868, 596479, 739203, 812869, 803983, 791503, 410572, 962214, 767319, 797332, 1076798, 779528, 1157026, 777928, 743932, 947234, 836334, 960908, 784265, 1001402, 1095045, 808229, 949523, 965339, 1098410, 1035767, 995115, 925880, 979264, 886397, 1176888, 399110, 993376, 1005419, 1054552]
14690A054552k43781K97560P7703n48247J10329K51585L35557m59125K30591R880
14680A116604j65329J53131P9887l17423r8337K79143Q5531j78084j42725L65249
14670A177647j57416m5420j3210K40796p7045J24300Q2457j89309m09439N07099
14660A240460k04286J55416R5803n8836l8707J38519m27028K87163j34985K04995
14650A258514K83009m44813L99046n10773J23774J8571M41919j55530m29111K91300
14640A275906K8001k16029N62181m38334R2908O2859J21036k25637K30668o6852
14630A426707L78506l31249j64673R4978J965P0128j30433L40278k69473r7152
14620A319582n5395K59710j61714L49664k91889M10138k78274k7488K00556n75963
$$ y = [1054552, 810771, 1108331, 1186034, 637787, 748116, 999701, 1335258, 876133, 1106724, 1116604, 951275, 1104406, 1184293, 866870, 768533, 1047676, 1133207, 955123, 812398, 1177647, 1020231, 974811, 961601, 1202397, 1125352, 1249652, 1332109, 1142800, 733361, 1240460, 1036174, 1191590, 1287393, 1228557, 1189850, 1328369, 901341, 1188504, 1053519, 1258514, 1541523, 1096710, 1495756, 984983, 1108757, 1127328, 1569247, 1413717, 984606, 1275906, 1303907, 1087878, 1650059, 1211725, 1304633, 1367492, 1488528, 1262891, 1493559, 1426707, 1805213, 1473964, 1309291, 1404269, 1406234, 1476362, 1345929, 1686207, 1416734, 1319582, 1264187, 1523897, 1362183, 1711847, 1419958, 1830096, 1551822, 1524334, 1724890, 1148927]
14610A148927M76145j47432J47968k50225K84240K19472k41387j71361L22073
14601A788420k05547q4665O4738K47527J50411r0745K0668J17991k57312J28547
14591A880033K31027l93930J49516p9065K15416o7802L47509q4033J73879k62951
14581B109599J42414k92656J01118N9847K23764k41664N84089m92879k29898M33400
14571B397134K11618l96837N53649n97075K78294M9554K16366J14111m94177O71276
14561C003913n34606M36407K38394k88537N08502o587j6975M93887K23202J30519
14551D188119N76759J586785J777003M042151J1348105J3336712O326674j4562466
14543B8619842A2590057E968184k165885j237937l27853j24850K24344k88717
$$ y = [1148927, 1625072, 1477640, 1625608, 1375383, 1659623, 1879095, 1637708, 1466347, 1788420, 1582873, 1498208, 1562946, 1810473, 1960884, 1870139, 1890807, 2008798, 1751486, 1880033, 2111060, 1717130, 1866646, 1787581, 2002997, 1935195, 2282704, 2198671, 2372550, 2109599, 2252013, 1959357, 2060475, 2120322, 2344086, 2102422, 2686511, 2193632, 1963734, 2397134, 2608752, 2211915, 2765564, 2168489, 2446783, 2496337, 2712703, 2826814, 2332637, 3003913, 2469307, 2905714, 3144108, 2855571, 3364073, 3357486, 3340511, 3834398, 4057600, 4188119, 4764878, 6351663, 8128666, 12170817, 23518922, 36855634, 43182308, 28619842, 12590057, 5968184, 3802299, 2564362, 2236509, 2111659, 2336003, 2047286]
14535B047286K47828j87996l70402Q08912m11410L94514k60292K38506M1103P5273
14525B623322J45043l39794k8779J9271J44990L00517j66698Q2791P9161O8315
14515B928139k5570r8287j21069K55277K15462j06086k64221L32846L00041m18089
14505B998443L39848k08578O69217o00769M273K68989K83800l84069j723o5820
14495C303611L09755J78845M7671m75760K43026R6011m5552j95318L41901O3017
14485C867207p5660J69328K58726L587j83157m9291J67269j35682K09818l2061
14475D200084r875J38036l7392M14148k24742j76477L33809J11169K35032j71431
14465D812361k16902O37918n77417R6432J69439N345L3960K69684K15808K87544
$$ y = [2047286, 2295114, 2107118, 1736716, 2545628, 2134218, 2528732, 2268440, 2506946, 2548049, 2623322, 2768365, 2428571, 2399792, 2419063, 2564053, 2864570, 2697872, 2780663, 2859824, 2928139, 2902569, 2804282, 2683213, 2938490, 3153952, 3047866, 2783645, 3116491, 3416532, 2998443, 3338291, 3129713, 3798930, 3198161, 3202434, 3471423, 3755223, 3371154, 3369431, 3303611, 3613366, 3792211, 3839882, 3364122, 3607148, 3703159, 3657607, 3462289, 3804190, 3867207, 3791547, 3960875, 4219601, 4223188, 4040031, 3990740, 4158009, 4022327, 4232145, 4200084, 4190209, 4328245, 4290853, 4705001, 4480259, 4303782, 4637591, 4748760, 4983792, 4812361, 4595459, 5233377, 4655960, 4752392, 4921831, 4927176, 4961136, 5230820, 5446628, 5734172]
14455E734172m69423m561L19251J91648l50500L55795K135j32339J17395J57468
14445E921041K96878k29926M98584L43595n34897J19950q8279K40435L08780P6651
14435F952812J67606J3349l1291K24322N4008J94793j46991L34883N7582j00933
14425G720140J22779R9017N3562K41918L50225j83994m5601L02768O6459K42507
14415H969780J38869J21250K17298j55306L82557L20485k6043O3310L00818l813
14405A0329205K70683n0851M04936R9526L46199J55535L27867k46078M93086R0870
14395A2220978R470N66033J9454M95337k97366K43152N18483J74154J03640J85848
14385A4239183K70250K58919P00149j0672N1781M15058M17344L36740L54497J65241
$$ y = [5734172, 5264749, 5260188, 5579439, 5771087, 5420587, 5776382, 5778517, 5646178, 5763573, 5921041, 6217919, 5987993, 6486577, 6830172, 6295275, 6415225, 6326946, 6567381, 6876161, 6952812, 7120418, 7133767, 7102476, 7326798, 7380806, 7575599, 7428608, 7763491, 7821073, 7720140, 7842919, 7941936, 7995498, 8237416, 8587641, 8403647, 8358046, 8660814, 8727273, 8969780, 9108649, 9229899, 9447197, 9291891, 9674448, 9994933, 9968890, 10032200, 10333018, 10329205, 10599888, 10549037, 10953973, 11053499, 11399698, 11555233, 11883100, 11637022, 12130108, 12220978, 12230448, 12796481, 12815935, 13311272, 13013906, 13257058, 13775541, 13949695, 14053335, 14239183, 14509433, 14768352, 15468501, 15457829, 15509610, 15924668, 16342012, 16678752, 17033249, 17198490]
14375A7198490L69578M52116K56888N77440K3918O08353k9658N25185O71951K68214
14365B0922475O04194K58328M55450L92403R03251L9154J070874M00668J12268
14356B5159065Q88492L34344R44934M66857O31023O67185R63598P39204N02723
14347C1297425J191597O83059K71869J210534J166399R12719O38157J194201J099985
14338C9665945J349635P49450J642395J175586J293489J120379J502309J454330
14330D9953518J570241K049145J512215J740391J842745J945711K145795J593039
14322F4352800K683036K110124K460848K645105K943736K988670K988725L212304
14314H6385348L709700L397029L891211L802783M377010M305927M725930M952692
$$ y = [17198490, 17568068, 18020184, 18277072, 18854512, 18878430, 19486783, 19457125, 19982310, 20654261, 20922475, 21526669, 21784997, 22240447, 22632850, 23536101, 23575255, 24646129, 25046797, 25159065, 26047557, 26381901, 27326835, 27793692, 28424715, 29091900, 30055498, 30794702, 31297425, 32489022, 33172081, 33443950, 34654484, 35820883, 36733602, 37371759, 38565960, 39665945, 41015580, 41765030, 43407425, 44583011, 45876500, 46996879, 48499188, 49953518, 51523759, 53572904, 55085119, 56825510, 58668255, 60613966, 62759761, 64352800, 67035836, 69145960, 71606808, 74251913, 77195649, 80184319, 83173044, 86385348, 90095048, 93492077, 97383288, 101186071, 105563081, 109869008, 114594938, 119547630]
14306A19547630N181341N809519N642942O525654O353870P267664P206820Q094613
14298A71630053Q170712Q972331R347366R764075J0474495J1014368J1730577
14291B41103977J1908029J2899681J3595556J4189245J4244161J5004596J5310502
14284C38255747J5540055J5705796J5758218J5094778J5310644J4092776J3297728
14277D43055742J2084856J0468459Q751400O585528L509682K29233m604412o550500
14269D73529988p37123k576630n836424p011224r745169j2223269j3617558j4488832
14261D07293759j5662290j5811221j6325416j6071232j6252370j5530988j4375788
14254B97264454j4436882j3669463j3290559j2739908j1907021j1508048j0811903
$$ y = [119547630, 124728971, 130538490, 136181432, 142707086, 149060956, 156328620, 163535440, 171630053, 179800765, 188773096, 198120462, 207884537, 218359032, 229373400, 241103977, 253012006, 265911687, 279507243, 293696488, 307940649, 322945245, 338255747, 353795802, 369501598, 385259816, 400354594, 415665238, 429758014, 443055742, 455140598, 465609057, 474360457, 480945985, 484455667, 484684900, 480080488, 473529988, 472792865, 470216235, 464379811, 457368587, 447623418, 435400149, 421782591, 407293759, 391631469, 375820248, 359494832, 343423600, 327171230, 311640242, 297264454, 282827572, 269158109, 255867550, 243127642, 231220621, 219712573, 208900670]
14247B08900670j0038451r966782q752138q088786q409788p411385p175591o883417
14239A42174332o199131n851671n583573n326192n016906m537456m665701m014461
14231A00979241l988848l770714l595476l497704l313238k960278k867490k761128
14223G4224365l037061k328525k185218k458367j947705j851394k378790j576418
14215E6460887j727299j935384j184241j504862j686722j320658j508124j168324
14207D4425273r85506j071519j255264j395312j212984r85370o41067p17662r86893
14198C5173696j234669p26377j322075m88541l82746j038869q33255o91586n93166
14189B7862412p67447o10179p20180m01148p18151k98578p74458j64248j011143
$$ y = [208900670, 198862219, 188895437, 180143299, 172054513, 163644725, 156233340, 149057749, 142174332, 135975201, 130123530, 124539957, 119213765, 114196859, 109659403, 104993702, 100979241, 96990393, 93219679, 89624203, 86126499, 82813261, 79852983, 76985493, 74224365, 71187304, 68858779, 66673561, 64215194, 62267489, 60416095, 58037305, 56460887, 54733588, 52798204, 51613963, 50109101, 48422379, 47101721, 45593597, 44425273, 43439767, 42368248, 41112984, 39717672, 38504688, 37519318, 36878251, 36160589, 35173696, 33939027, 33212650, 31890575, 31402034, 31019288, 29980419, 29147164, 28455578, 27862412, 27094965, 26484786, 25764606, 25363458, 24645307, 24346729, 23572271, 23408023, 22396880]
14180B2396880l25180p65013j23112m75511l07871j04758n69393o14157Q1333
14171A9193218o54178j43588o41445n35753p4220l78516K0026q25509j28548l04530
14161A5526957j30634Q208l17316m50923n78690k3893m84067K80960o04428m14501
14151A2811673P2719m22412L43861j102984M90801l05982j4122j25669k86383
14142A1461502m67458k7390j16219l40747J95073m32446k02077j36312K7068l7358
14132I923636l84336j06631J1744j32031j18671k62697o8211k37533j13460K78946
14122H790756k68965P3384l42188j90610L5387j14710j42729k03108k60859J15621
14112G491979j03108J44903K2805k18027k35043j6846k97282k37258J25628J3420
$$ y = [22396880, 22071700, 21306687, 21183575, 20708064, 20400193, 20295435, 19726042, 19111885, 19193218, 18539040, 18395452, 17754007, 17218254, 17144034, 16765518, 16785544, 15960035, 15831487, 15526957, 15396323, 15404531, 15087215, 14636292, 14057602, 14033709, 13549642, 13830602, 13226174, 12811673, 12884392, 12461980, 12805841, 11702857, 12193658, 11887676, 11873554, 11747885, 11461502, 10994044, 10966654, 10850435, 10509688, 10704761, 10272315, 10070238, 9933926, 9960994, 9923636, 9539300, 9432669, 9444413, 9312382, 9193711, 8931014, 8862803, 8625270, 8511810, 8790756, 8521791, 8595175, 8252987, 8062377, 8097764, 7983054, 7840325, 7637217, 7376358, 7491979, 7388871, 7533774, 7556579, 7338552, 7103509, 7086663, 6789381, 6552123, 6677751, 6691171]
14102F691171k03537P7160j00304m166l83540K93789p464j50911k81516k67652
14092E663030K01248J9342l32984J33190j55308J0249k23252P9205J39677j41516
14082E392881m49627L39295n09675N73425m94132n786j38250M17940k29680m6832
14072D849559o8930m34345M94813k79683J63392r7984k4760k06112J23262K53925
14062D773137n64913L3514J75047l54856J09473J60836k55139K88125m19947l5543
14052C909734J80829k49039J0540q1621K14054l41075j59111J31021K12866l60468
14042C467730J88223K2912j60546j20422O6117k8179k01219K2593P2836j11844
14032C218201j8679K36057k19116N8230J55605l64885J38277l60486J49712k3468
$$ y = [6691171, 6487634, 6564794, 6464490, 6460324, 6076784, 6370573, 6363109, 6212198, 5930682, 5663030, 5864278, 5883620, 5550636, 5683826, 5528518, 5538767, 5315515, 5394720, 5534397, 5392881, 4943254, 5282549, 4772874, 5346299, 4852167, 4846381, 4708131, 5126071, 4896391, 4849559, 4780629, 4346284, 4841097, 4561414, 4724806, 4626822, 4602062, 4395950, 4519212, 4773137, 4208224, 4241738, 4416785, 4061929, 4171402, 4332238, 4077099, 4365224, 3945277, 3909734, 4090563, 3841524, 3852064, 3770443, 3984497, 3643422, 3484311, 3615332, 3828198, 3467730, 3655953, 3678865, 3518319, 3397897, 3464014, 3435835, 3234616, 3257209, 3330045, 3218201, 3199522, 3435579, 3216463, 3274693, 3430298, 3065413, 3203690, 2843204, 2992916, 2969448]
14022B969448k21612L41598N1573l26893N8318k37259J12934j00049J8675J06150
14012B772883m950p8957j48627j28358J80213p7062j96442J77987K25107p24451
14002A997343L42802K96201j96329l16911M53040k97214J69149j92552K4395j25574
13992B154350K17569K04999N35100O51007L183029Q832921J4372180J0454112
13984D0605267q741079j4804661o911974l400687j105213j147991l04298m97738
13976C691626m15822K1459n00615J61931j45143P3125j57264p3297m99992N30971
13966B686979m90236L40923k27253m4456Q4017J09778P4539m87231J94713j2369
13956B229404L497m05354J09970K33167n02768q2264N43197N3298l46292J71567
$$ y = [2969448, 2747836, 3089434, 3141007, 2814114, 2872432, 2635173, 2748107, 2648058, 2666733, 2772883, 2767933, 2688976, 2540349, 2411991, 2592204, 2515142, 2318700, 2496687, 2721794, 1997343, 2340145, 2636346, 2440017, 2123106, 2576146, 2278932, 2448081, 2255529, 2279924, 2154350, 2371919, 2576918, 3112018, 3763025, 6946054, 15778975, 30151155, 40605267, 31864188, 17059527, 10147553, 6746866, 5641653, 4493662, 4189364, 3691626, 3275804, 3297263, 2796648, 2958579, 2813436, 2886561, 2729297, 2656000, 2156008, 2686979, 2196743, 2537666, 2310413, 2265957, 2349974, 2459752, 2534291, 2047060, 2241773, 2229404, 2232901, 1827547, 1937517, 2170684, 1667916, 1585652, 2128849, 2182147, 1835855, 2007422]
13946B007422k0945P57q4341p7017k18937K33583k6461o1462L00727k36766J34881
13935A951441j8516K74636n50219k5207J15230k67114J95945q0142J64291p6880
13925A683465M247k01639K81852l38021K67842k89044M00362m49736M61353j42873
13915A677808J36116j16323k65875J60883l49563K19826M54304n39210L20333
13906A698299j82160l6920R2841j75797K30385J18511r3112k74252M50803n04341
13896A324257r6217M06999l85004J50466j06430J16301J81499j30674o4194j65331
13886A231672p0109J28791M5733J09277k25533J65473m680K8606l42405l55250
13876G11575J90773M92555m60861L32943J5529J08498l1753l12992K28906j81567
$$ y = [2007422, 1986477, 1987234, 1902893, 1825876, 1606939, 1840522, 1814061, 1752599, 2053326, 1816560, 1951441, 1932925, 2207561, 1657342, 1632135, 1747365, 1480251, 1676196, 1596054, 1760345, 1683465, 1687712, 1486073, 1767925, 1429904, 1697746, 1408702, 1809064, 1359328, 1820681, 1677808, 1813924, 1697601, 1431726, 1592609, 1243046, 1462872, 1917176, 1377966, 1698299, 1516139, 1479219, 1572060, 1396263, 1626648, 1745159, 1652047, 1377795, 1828598, 1324257, 1228040, 1635039, 1250035, 1400501, 1294071, 1410372, 1591871, 1461197, 1397003, 1231672, 1161563, 1290354, 1336087, 1445364, 1219831, 1385304, 1380624, 1409230, 1066825, 711575, 902348, 1394903, 934042, 1266985, 1282514, 1391012, 1359259, 1046267, 1275173, 1093606]
13866A093606K26997r5574l66728N22788q9314k05337P8094N6035j41144J94146
13856A273569q0467k36519J08824l66214L57583J80855o3901k8188k38862j8422
13846H88258K17716j28363j47412J48317O7885L35685n33086K56795n9342L4219
13836A080672l17926P91428n30526K84072k92410n4138k88083L42685m4617J211
13826I72368K5612k01835M31590l96708L14949j02454l25770J23006J6737p730
13816H49765j56333K26358j43240J18217K93388l15827N0728j32483K39384j59806
13806H70151l11359L20560L6832j11893j9702q647L0934k70811K85435n1040J70859
13795I41319l58132L10108K96811j72324C83973K20220L0032j9588M1010K34624
$$ y = [1093606, 1320603, 1225029, 858301, 1381089, 1291775, 1086438, 1164532, 1220567, 1079423, 1273569, 1193102, 956583, 1065407, 699193, 1056776, 1237631, 1173730, 1145542, 906680, 888258, 1105974, 977611, 830199, 978516, 1046401, 1382086, 849000, 1105795, 1046453, 1080672, 762746, 1554174, 1023648, 1307720, 1015310, 961172, 673089, 1015774, 971157, 972368, 997980, 796145, 1227735, 831027, 1145976, 1043522, 717752, 840758, 857495, 849765, 693432, 919790, 776550, 894767, 1188155, 872328, 923056, 790573, 1029957, 870151, 558792, 879352, 916184, 804291, 784589, 775942, 806876, 536065, 821500, 770460, 941319, 583187, 893295, 1190106, 1017782, 383973, 604193, 634225, 614637, 655647, 890271]
13785H90271j04140m4565J16468k82799J49110Q4980n31M86218k62132k11216
13775H21664J85726j61088j46033R5702R0912o5580J67873m39619M40083j43640
13765H46000R2251p5439l10210K85778j45407J45316l22002j74570O63306k00446
13755H04577j83388K21697j57650j71264K71066K01278j91774p529o8265P9168
13745G97916k74979J77412J86051C28982M58145J36247k42446q2501J14646J81738
13735H94811k55385K18951j62183j78037j00205J60657K42068l04988K29553q9133
13725F56109M85335D72265r0986j67124L85762j00948L3537J71910j52278J16667
13715F68805k90671L83649R3642C89483j8414K97654D0678P71942C41709M67390
$$ y = [890271, 786131, 741566, 858034, 575235, 724345, 809325, 808794, 1295012, 1032880, 821664, 1007390, 846302, 700269, 795971, 886883, 821303, 989176, 549557, 989640, 846000, 938251, 862812, 552602, 838380, 692973, 838289, 516287, 341717, 1005023, 804577, 621189, 842886, 685236, 513972, 785038, 986316, 794542, 787013, 718748, 797916, 522937, 700349, 886400, 328982, 787127, 923374, 680928, 598427, 713073, 894811, 639426, 858377, 696194, 518157, 417952, 578609, 820677, 515689, 745242, 656109, 1141444, 472265, 381279, 214155, 599917, 498969, 532506, 704416, 552138, 668805, 378134, 761783, 855425, 389483, 371069, 668723, 40678, 812620, 341709, 809099]
13705H09099l21439k1282l003O4508L24156k01040A67962Q08318l40749q5380
13695E50151P7080r7288j27070J05371p6973J90262Q8241L955M0940k58593K2945
13684E19021L14425n1411b8820F27883N0669A99810K80582J57066A62280K14534
13674C76814K74651P9216k61628o571A66777Q7188L81136j24763J02781K4859
13664F37978j49717q2219o121A61709K34275j00505M62249C52538r4193A10706
13653E52092O1660k56638k4867o82R6608J46054B58841L26263j07701J73041j82721
13642D67723P1700M2278k25830O10058C14149j21524K7084K09615J35223j76126
13632C88421J87809k19190k4718J84527j32326r2464M41724k55995K04307j91282
$$ y = [809099, 487660, 466378, 463375, 527883, 852039, 650999, 167962, 976280, 635531, 550151, 627231, 529943, 402873, 508244, 431271, 621533, 709774, 713729, 754669, 496076, 519021, 833446, 782035, -28820, 627883, 678552, 199810, 480392, 637458, 162280, 376814, 651465, 730681, 469053, 462482, 166777, 253965, 635101, 510338, 613119, 637978, 488261, 406042, 399921, 161709, 395984, 295479, 757728, 352538, 258345, 110706, 552092, 613752, 357114, 332247, 331565, 428173, 574227, 258841, 585104, 477403, 650444, 467723, 539423, 581701, 355871, 965929, 314149, 192625, 219709, 429324, 564547, 388421, 576230, 357040, 332322, 516849, 384523, 292059, 733783, 477788, 682095, 490813]
13622D90813j29089K68497k17819A78350K90967J56739k03468N5028L190B18491
13611B24086K05000J45880A72942J2176L26737M58k28322J18288J26495A69200
13600G0315L4289K01376P65350n25121A66908J1603j9893K54439j97360l147K44999
13589D57549B14634P2844k5947j02500K40269L47189C17705j06862K86510e5928
13578B70291I4307L24120K01348k78677K2886A75364J13355P1335o0640K02513
13568E01927A40180J03095M67943j04314j81262j81453K91694k19508j03488I6151
13557b7750F68665C03134R7671n0396R8370l3521k5442J1250j08804J17679J60358
13546E70299B13112J67558n1454p7213J77822c4800E52761A94708J26826K34866
$$ y = [490813, 361724, 630221, 412402, 178350, 469317, 626056, 422588, 477616, 480806, 218491, 224086, 429086, 574966, 172942, 185118, 511855, 512313, 283991, 402279, 528774, 169200, 70315, 104604, 305980, 1071330, 546209, 166908, 178511, 158618, 413057, 215697, 212550, 457549, 214634, 287478, 261531, 159031, 399300, 746489, 317705, 210843, 497353, -55928, 270291, 94307, 418427, 619775, 341098, 363984, 175364, 288719, 360054, 299414, 501927, 140180, 243275, 711218, 606904, 425642, 244189, 535883, 316375, 212887, 96151, -27750, 668665, 303134, 400805, 350409, 448779, 415258, 389816, 401066, 292262, 409941, 570299, 213112, 380670, 329216, 252003, 429825, -34800, 552761, 194708, 321534, 556400]
13536E56400k67324N3455p050j39720K85043J5828P7193k52636J50680L1137p1664
13525D31342j33183J52501J12679k33742N4487A38826K29164j71513L79432O5050
13515F40959k26679o2031L1024C9222M26391Q0050B03450J53879A5581L31866
13505C47447m7157C8884L10018l6518N7763D5887B2162L96826j93373g3083B26656
13493B54679L27157A35570J51844J27078j72511J29454e7371C18030L6569p5793
13483B78806K5775o8250n5928K36758D7824a55618A36807J65331j23424J880k0549
13472A60045K35280A72258b56425B21487g4396A85252J90349A35983J06111o7598
13462A74496L5735J92730C6887J77838L5346C2002K13460d2850C69296R4940I6241
$$ y = [556400, 289076, 342531, 335481, 195761, 480804, 496632, 573825, 321189, 471869, 503006, 431342, 298159, 450660, 563339, 329597, 384084, 138826, 367990, 196477, 575909, 640959, 414280, 352249, 383273, 39222, 465613, 545663, 203450, 357329, 15581, 347447, 300290, 38884, 348902, 312384, 370147, 45887, 22162, 418988, 225615, -73083, 226656, 254679, 581836, 135570, 287414, 414492, 241981, 371435, -57371, 318030, 354599, 278806, 304581, 236331, 180403, 417161, 47824, -155618, 136807, 302138, 178714, 180594, 160045, 395325, 172258, -256425, 221487, -74396, 185252, 375601, 135983, 242094, 174496, 210231, 402961, 36887, 214725, 250071, 32002, 245462, -42850, 369296, 464236, 96241]
13450h5612D49387L498F8422m860J2886M19602k34100E9211L4113b3883D00835
13438I4176J92049R211q5620n7591M23232A97705k3561J27283I8188D7531J75555
13427B23086j09864n4332K70852o6983K06485j52033L20111A48196J49093J27178
13417D24467E0625k2422g8237B02210R8680o1245J2431P2393j40427q1513L60492
13406D63021F8907B2147a6017C54061A60530a00910C68604p6422I5649k4158L20060
13395C91551j73690j9807J10430a36262B92039N203o1045g661C49828r7399P710
13384B60139E4086K35078L3352G9643J30658l3209i0751E25621k14381J33803
13374D45043A24082R3065k2112c3771C04135n1901j2435K6293N1880r2825k0088
$$ y = [-85612, 449387, 452885, 68422, 63562, 76448, 496050, 261950, 59211, 93324, -23883, 400835, 94176, 286225, 295436, 209816, 152225, 575457, 197705, 174144, 301427, 98188, 47531, 223086, 113222, 58890, 329742, 262759, 469244, 317211, 637322, 148196, 297289, 424467, 50625, 28203, -78237, 202210, 300890, 239645, 252076, 324469, 184042, 102529, 463021, 68907, 22147, -16017, 354061, 160530, -100910, 368604, 292182, 95649, 71491, 391551, 217861, 198054, 308484, -136262, 292039, 297242, 236197, -7661, 349828, 252429, 260139, 54086, 289164, 322516, 79643, 210301, 177092, -90751, 525621, 311240, 445043, 124082, 217147, 195035, -33771, 304135, 252234, 239799, 266092, 317972, 225147, 205059]
13363B05059M99G3757J33357K99390j39164K81354A24915K95046r3854r6415L16763
13352E46455A68365J42484p3625K2263j14977r052M91191r0820A24296a7025C47007
13340C62957p3416a2161B18147G6674J46878f0041A13243F648b53027g609j04318
13329a11927E5250K06486a32219e9393B4654J27580O6175J32438n8697J67830
13319D59980j27856E7514M1044m8200M30819j42340K4590j40856J84266E93M24372
13308D24965K19807a13339A11698A7459b64013k1929J2672A11331L27423A23203
13297B00763g0500A37165n3088J92239L1872o3631h2772D55324p8748J82643B29227
13285F5541r965a79236A7272K9052K11389j16244b6606j8239F532M3436J679A191
$$ y = [205059, 205558, 73757, 207114, 506504, 367340, 648694, 124915, 419961, 326107, 229692, 546455, 168365, 310849, 237224, 259487, 144510, 135458, 626649, 535829, 124296, -17025, 347007, 362957, 289541, -12161, 218147, 76674, 223552, -60041, 113243, 6648, -253027, -7609, -111927, 55250, 261736, -132219, -59393, 24654, 152234, 218409, 350847, 292150, 459980, 332124, 57514, 98558, 50358, 481177, 338837, 363427, 222571, 406837, 593, 424965, 644772, -113339, 111698, 17459, -264013, -285942, -273270, 111331, 438754, 123203, 200763, -70500, 137165, 84077, 276316, 308188, 244557, -82772, 455324, 376576, 559219, 229227, 65541, 55576, -179236, 17272, 46324, 257713, 141469, -26606, -44845, 6532, 49968, 51647, 1191]
13272A33366J19208g2165A34409a50104n7023A98261P814f0437C31705a41967
13261C6193b9675n2380A49122F2600K10512l6487J01717j7374f887A83070J24295
13250C07365O3072I1526L65131k16923M5329H152L43857j34664R6300A04328K39361
13239C43689C8154J6245J3865K39609D1051M9089b49941h6761k5055b7271C37325
13227B5154K83159m531Q6665A3799K47849a39240C47764a04122d2155A42824k5649
13216A17175A989L20325A37798a9221B16108A0017J09318a06114A19078b21771
13205F3229B6120a41035A21172k1307i2661j80233N574g4631I1824e1427j74546
13194b25973B093J29831c87994B44898C3759K26509a90892B4601b99717c8991
$$ y = [133366, 252574, -72165, 134409, -150104, -207127, 198261, 206075, -60437, 331705, -141967, 36193, -29675, -82055, 149122, 62600, 273112, 236625, 338342, 320968, -6887, 183070, 307365, 370437, 91526, 456657, 239734, 285063, 8152, 352009, 217345, 313645, 104328, 343689, 38154, 54399, 68264, 307873, 41051, 90140, -249941, -86761, -111816, -27271, 337325, 25154, 308313, 303782, 390447, 13799, 261648, -139240, 347764, -104122, -42155, 142824, 117175, 1989, 322314, 137798, -19221, 216108, 10017, 119335, -106114, 119078, -221771, 63229, 26120, -141035, 121172, 99865, -92661, -272894, -267320, -74631, 91824, -51427, -225973, 2093, 131924, -387994, 244898, 33759, 260268, -190892, 24601, -299717, -38991]
13183a84864B6964K018D97J55097A8835K67507a08337F8801J05652d1192C8884
13171C84294a18148A60088d1026j14660A31382n1667D478N7769d2072A74020d23835
13159A56668B7495a2546A25020a91153j3595Q7977c6473r5950H2732a3957E9497
13147D42688j25500A07696j9466K26005J8395l2362E8110R0566N2782a8586C86010
13135B94431c51571A46041o4004J08666K01780j32268k8176i6260A62972i0228
13124a69281N6135e6099j35040A59244p1666m0684K62134j51936J9717a11268
13113C54037j25967a39814f4519l51908C1020K29693j03985R0058J29531j44436
13103B31881a48802M2142m13B46288I9399O1922a0319A83421a05175B14307a29692
$$ y = [-184864, 26964, 28982, 497, 155594, 18835, 286342, -108337, 68801, 174453, -41192, 38884, 384294, -118148, 160088, -41026, -155686, 131382, 79715, 4478, 62247, -42072, 174020, -423835, 156668, 27495, -12546, 125020, -191153, -204748, -116771, -36473, -132423, 82732, -13957, 59497, 442688, 317188, 107696, 88230, 314235, 332630, 300268, 58110, 148676, 201458, -18586, 386010, 294431, -351571, 146041, 82037, 190703, 392483, 260215, 232039, -96260, 162972, -90228, -169281, -113146, -56099, -191139, 159244, 87578, 46894, 309028, 157092, 176809, -111268, 354037, 228070, -139814, -64519, -416427, 31020, 260713, 156728, 246786, 376317, 231881, -148802, -106660, -107073, 246288, 99399, 161321, -10319, 183421, -105175, 214307, -129692]
13091g0993A28732K8624Q3903A15242J28099D4514K2202M72625B55161f7099D40748
13079A27104a3094A04421k965n0487J49758o4235R4975B4072Q0560m7224q738
13068D8670m383c491D742K77715a75486C9593L37519q7422j18429H0838n806k6684
13056D8348K0548Q5260M5427i9567G143J76763A1338K2808i284C87513j58890
13045B28623H7321O3944D180i5759q8920A68796f8319A67389b038f61H7883b0254
13032H5900I498J2690J2694a11116C90183F4015R0519M7008a24028o7762B48429
13020A63684e6713A69304O157D4497K57366n0188R0726l2832A40181A9012N01812
13009E20824A94877r5121L55537j40451j46178K9001D3306J94214p1239k9537
$$ y = [-70993, 128732, 157356, 241259, 115242, 243341, 44514, 66716, 539341, 255161, -67099, 440748, 127104, -13094, 104421, 101456, 50969, 200727, 136492, 231467, 24072, 104632, 57408, 48670, 44287, -3491, 4742, 282457, -175486, 39593, 377112, 289690, 171261, 80838, 75032, 48348, 68896, 154156, 199583, -99567, 7143, 183906, 11338, 34146, -9284, 387513, 228623, 87321, 151265, 4180, -95759, -184679, 168796, -68319, 167389, -2038, -661, 87883, -20254, 85900, 9498, 22188, 34882, -111116, 390183, 64015, 154534, 201542, -124028, -191790, 248429, 163684, -56713, 169304, 175461, 44497, 301863, 251675, 342401, 309569, 140181, 19012, 520824, 194877, 99756, 455293, 314842, 168664, 197665, 43306, 237520, 166281, 136744]
12999A36744A6505K06641a65926A87632J94783i1679B13770B4092a26241A14169
12988a32132A68910a24469B14388E1236L5936j1583P0350D3103a00534L8712B7571
12976c9699A010L18299d44652e8950J1909A44752m7077J01485b05962A50112k6226
12965A23886K93671A02365J44282l0058J48603j53110d2261j15471N6580m6680
12955a47832B14145e0328I8358b09625A70105o7362f8045C41974D108d3936A72183
12943G6474R5187K71294A76737R9242J65278i8510k44437A16322i7397d1404q9986
12932a31390j8915A40424a8136j7791F8785J96546G1907K50964m5226i8218j25679
12921b23897J2635B5162c18969c4102k5320j25184G6822h2642j7478B45824c27762
$$ y = [136744, 16505, 223146, -165926, 187632, 382415, -91679, 213770, 24092, -126241, 114169, -132132, 168910, -124469, 214388, 51236, 87172, 75589, 145939, 43103, -100534, -61822, 27571, -39699, 1010, 319309, -444652, -58950, -47041, 144752, 97675, 199160, -205962, 150112, 123886, 417557, 102365, 246647, 216589, 365192, 212082, -42261, -157732, -101152, -147832, 214145, -50328, 98358, -209625, 170105, 102743, -68045, 341974, 4108, -43936, 172183, 76474, 171661, 442955, 176737, 275979, 441257, -98510, -342947, 116322, -97397, -41404, -131390, -150305, 140424, -18136, -35927, 68785, 265331, 71907, 322871, 277645, -98218, -223897, -211262, 25162, -318969, -34102, -59422, -184606, 76822, -82642, -100120, 245824, -327762]
12909B47349c35278A36331g9516Q678k9856j94639d0398m9283a9263i126B05529
12897a37322N7980k1036a5297E7764b51458C2017R8611D0344a09739C21416A59134
12885A07339L6051a7666A70886P2910f3745j89919G5217J30514a561H126b01172
12873d3672a8984j41166j7752J0215j15245Q0085A25017L6303h2466b3894p1078
12862i4972B15260C1731Q1870l2425B4057J2907J45141Q7271i5674k04452I0165
12850A57552A0283a30745B74257j04003A4816J19982K11729j41254i5331A29205
12839B19932o2136c8239j52103d7455A30714a52714d2139J3525j01224B44542
12828a17163A78465d75410J5791h93A07342J44517l4834a790k7122r1735c3463
$$ y = [247349, -335278, 136331, -79516, -70838, -100694, -295333, -40398, -89681, -19263, -9126, 205529, -137322, -79342, -100378, -15297, 57764, -251458, 32017, 130628, 40344, -109739, 321416, 159134, 107339, 143390, -17666, 170886, 243796, -63745, -253664, 75217, 205731, -1561, 8126, -201172, -43672, -18984, -160150, -177902, -167687, -282932, -202847, 125017, 161320, -82466, -23894, -94972, 215260, 31731, 113601, 81176, 24057, 36964, 182105, 269376, -95674, -300126, 90165, 157552, 10283, -130745, 274257, 170254, 14816, 134798, 346527, 205273, -95331, 129205, 219932, 157796, -38239, -190342, -47455, 130714, -152714, -42139, -28614, -129838, 244542, -117163, 178465, -475410, -459619, -893, 107342, 251859, 217025, -1790, -28912, -120647, -33463]
12816A22432a36169j05059C65456F2873b44282B2082e549A32729a40201e7553
12805d1446C7083J8604q593J122c94668C16486A28601J36181a41694d082k59495
12794b63577B80533j9703a32721C8196a03712o5425A8324J28147O7069f3196j4198
12783g7394H1132g4022J8177A22278L0689p4356b9877G2724K08669A03229b69647
12771H6255l5185R9854b35682a0958A51442d0726m8865j51897h5993E2022J40246
12760A92268N523m2226g8330k52181B95745E2520J9273e7916A27061b26060B74356
12748a98139G2448a2910B15615p3536c23936a8140k59601A69128p9408J28712
12738B18432H0456a26226K0008A26766M256K7854R1029a70071B88106G4549K52
$$ y = [122432, -136169, -241228, 365456, 62873, -244282, 22082, -5549, 132729, -140201, -57553, -41446, 37083, 55687, 47094, 48216, -394668, 316486, 128601, 264782, -141694, -4082, -263577, 280533, 260830, -132721, 38196, -103712, -169137, 18324, 146471, 213540, -63196, -77394, 81132, -74022, -55845, 122278, 152967, 78611, -29877, 72724, 281393, 103229, -269647, 86255, 51070, 150924, -235682, -10958, 151442, -40726, -89591, -241488, -85993, 52022, 192268, 197791, 155565, -78330, -330511, 295745, 52520, 71793, -57916, 127061, -226060, 274356, -198139, 72448, -12910, 215615, 142079, -323936, -18140, -277741, 169128, 89720, 218432, 80456, -126226, -106218, 126766, 131022, 158876, 249905, -170071, 288106, 74549, 74801]
12727G4801K0628R926a89503a7646j22334B53320a02332B56743c15496C5792g6388
12715b32050a0779B29228c66500C27061A20221J70687E3692K2280g800H2869A6503
12703A74988J4922B2519J44883o2670L7492k1970c09104A14855a47593J619r0379
12692b36353I5733m3642b0304E3309L72391g4294B95507H8471C4847a9071A34351
12680C63981A65424Q9641Q3515D2097K94943A38618O9024J66412H3080J15490
12670A98570J98415A14934l7034J33675F0534P8553b55642b7054B98535H4506
12659E57265g8823p1904D52488C3461L53870q1457D0848N1805O949M4850a90064
12647a53419d2160j41438Q8518K2342b388j12562D93219A91075a08559C30159
$$ y = [74801, 95429, 105355, -189503, -17646, -139980, 253320, -102332, 256743, -315496, 35792, -76388, -232050, -10779, 229228, -366500, 327061, 120221, 290908, 53692, 75972, -7800, 82869, 16503, 174988, 189910, 22519, 167402, 104732, 142224, 120254, -309104, 114855, -147593, -145974, -236353, 95733, 52091, -20304, 53309, 425700, -74294, 295507, 88471, 34847, -19071, 134351, 363981, 165424, 255065, 338580, 42097, 337040, 138618, 207642, 374054, 83080, 198570, 396985, 114934, 77900, 211575, 60534, 139087, -255642, -27054, 298535, 84506, 557265, -78823, -150727, 452488, 33461, 387331, 305874, 40848, 92653, 99602, 144452, -190064, -153419, -42160, -183598, -95080, -72738, -2388, -114950, 493219, 191075, -108559, 330159]
12636B55765n4614J7271j02565B0507L76607k3292E6430N66333B98517k6389d8611
12624E0528i8551B9827K24336P2143I7069Q3220J33601C6822J89093b5051B14543
12612a17694n2194B87083H9814k0311l2204a41874B71183a85136B70920A01207
12601a21062o745P437C88023a3549q4052A31042E0261e6363D355O1058p095d2383
12588c11484C15752F4324c4639C26846f2173H451d5507m5092B93064A40162b48873
12576B9740a34668k0900c9805J9389B25880b2166J0277j30988D34787b42134Q7870
12565a54264A4201b6298H2001b06142B82361q9723H4881E116L54617j71127d4147
12553I9981J72448a17462d2155C6607M6308e1333n736p8437b532G1401J28264
$$ y = [255765, 201151, 218422, 115857, 20507, 397114, 373822, 56430, 622763, 298517, 272128, -48611, 50528, -98551, 29827, 254163, 326306, 97069, 180289, 313890, 36822, 225915, -25051, 214543, -117694, -169888, 287083, 89814, 69503, 37299, -141874, 271183, -185136, 270920, 101207, -121062, -127807, -120370, 388023, -13549, -97601, 131042, 50261, -56363, 4355, 65413, 58318, -42383, -311484, 315752, 64324, -34639, 326846, -62173, 8451, -45507, -90599, 293064, 140162, -248873, 29740, -134668, -155568, -39805, -20416, 225880, -22166, -11889, -142877, 434787, -242134, -154264, 14201, -26298, 82001, -206142, 282361, 192638, 84881, 5116, 359733, 188606, -44147, 99981, 272429, -117462, -42155, 36607, 82915, -51333, -57069, -135506, -2532, 71401, 199665]
12542A99665P043a48628J0284j24410H5970r439N1484c31333F7908a31568q1746
12531b13314J03546E2516c30406A11860J29884b00972A99270b95720A42025f3420
12520c728C16896A15226a86753j34678J20524R5723h984r4555E4917a83573b6192
12508B04730a61242C36486a20238c3765B89769B1159a66688B12673C7029M4118
12498H1147J00396C8088J0702d0182B6470C578Q7786b0679o1723k43349a59007
12486A34749N3721c17773h7860A66422q639e1606n9596a5068o118C43524f902
12474B3673a6892q224j17304m1721d2339A23044J34974A17400c58541A89969p8010
12463A11959j6337M7658k0027a87739e0055j22215b0264A50222O1330D4594J1430
$$ y = [199665, 206708, -148628, -138344, -262754, 85970, 76531, 128015, -331333, 67908, -131568, -213314, -109768, 52516, -330406, 111860, 241744, -200972, 199270, -295720, 142025, -63420, -3728, 316896, 115226, -186753, -321431, -200907, -105184, -8984, -103539, 54917, -183573, -26192, 204730, -161242, 336486, -120238, -33765, 289769, 21159, -166688, 212673, 37029, 81147, 181543, 38088, 48790, -40182, 26470, 3578, 91364, -20679, -82402, -325751, -159007, 134749, 188470, -317773, -87860, 166422, 157783, -51606, -111202, -15068, -21186, 343524, -6902, 23673, -16892, -25116, -142420, -184141, -42339, 123044, 258018, 117400, -358541, 189969, 111959, 95622, 143280, 123253, -187739, -50055, -172270, -20264, 150222, 211552, 44594, 56024]
12452E6024a86952C15414c25060P3820B67475b29535H2463b3642k52138A12633
12441h6801A1838a9945l3990A30777a09486G4062a58493j58441C05294b62148
12430a7400k1263j84717B28579R4917g3324j7633C4975c74957B09472i174C52937
12418A56566b44995O5547A61132a57642A3909b81242A13055F68c4351k34692a28349
12406E5389h6768a6525j50075F2465c3397j28315A03938a86840A48566h9092B79265
12394b66956C8500b1347A32864J37296c87017B55853b15584h9592J4991B83193
12383G7671K2956p162f8384b4702F2712A5931N7316a34219r3863B8950Q1728a59486
12370A07843J89972P506j01768a83343K6653j35562J21489f5422G1616b84613
$$ y = [56024, -186952, 315414, -325060, -251240, 267475, -229535, 82463, -23642, -275780, 112633, -86801, 11838, -19945, -53935, 130777, -109486, 74062, -158493, -316934, 305294, -262148, -17400, -38663, -223380, 228579, 323496, -73324, -90957, 34975, -374957, 209472, -9174, 352937, 156566, -244995, -179448, 161132, -157642, 13909, -281242, 113055, 668, -34351, -269043, -128349, 55389, -86768, -16525, -166600, 62465, -33397, -161712, 103938, -186840, 148566, -89092, 279265, -266956, 38500, -21347, 132864, 270160, -387017, 255853, -215584, -89592, -74601, 283193, 77671, 100627, 93465, -68384, -24702, 62712, 15931, 73247, -134219, -228082, 28950, 110678, -159486, 107843, 297815, 305321, 203553, -183343, -156690, -292252, -170763, -65422, 71616, -284613]
12359f7154k538k40418M8412a24221c0118A96641B4235a70799d1467C05866o9622
12348B36244g4036j64516A68629K79741j08321a00078L6326H9299P7845A7893
12337a31542k4494m2129e9022J8763k37570c4186A61900I813L701Q7670D5962
12325A49495L0326F860e50B2009K62884N4264a36004n4506J4056C45800a61700
12313A29072L2859b10788D25401I4191J13958a84332b842k01049A65541C4853
12302a63227C51555E8804J65855a19887G0254Q9690A5221a2343A03220N1333E8539
12290b43065C8608c22620J31265B12358g0601J9143j0925j13457D07251A69008
12279B38401R4925b08877A26643O7422r2421f8166B6543J56814o9977J9054P0965
$$ y = [-67154, -69692, -310110, -261698, -124221, -30118, 196641, 24235, -170799, -41467, 305866, 236244, -74036, -238552, 168629, 448370, 340049, -100078, -63752, 89299, 167144, 17893, -131542, -156036, -198165, -59022, -40259, -277829, -34186, 161900, 9813, 13514, 101184, 45962, 149495, 179821, 6860, -550, 22009, 284893, 339157, -136004, -190510, -176454, 345800, -161700, 129072, 161931, -210788, 425401, 94191, 208149, -184332, -2842, -203891, 165541, 34853, -163227, 351555, 58804, 224659, -119887, 70254, 159944, 15221, -12343, 103220, 154553, 58539, -243065, 38608, -322620, -191355, 212358, -70601, -51458, -62383, -175840, 407251, 169008, 238401, 333326, -208877, 126643, 194065, 101644, -68166, 26543, 183357, 113380, 132434, 203399]
12268B03399H9189C0619A4319O6682A2470J84109k6939o5834J74409G9383l7525
12257D1858a68839L2794G3027a13771d7434A92977a36989A7750K73002C3502a29928
12245E0051a69086o4979A55983l2708N7055J43789j58066a31607B28979c64646
12234E38847g386C9905L3384n075M6310a78728A86043J75890H3409j7612K15923
12223B81720a38449H4173h1504N576A95852n236j8179k0582K5488p203M9173K24303
12211D43616m2315h5608C11987A7619J86166K58784A07140J21259o1567k0275
12201A46557J44837L50236k00975H365J63251O3788q0433M92685a18306I3278
12190A02729K15491A1752L25571j42184G5380L6923A4634L06671A22895L4236
$$ y = [203399, 89189, 30619, 14319, 81001, 12470, 196579, 169640, 103806, 278215, 79383, 41858, -168839, -136045, 73027, -113771, -47434, 192977, -136989, 17750, 290752, 33502, -129928, 50051, -169086, -234065, 155983, 123275, 180330, 324119, 166053, -131607, 228979, -364646, 538847, -7386, 39905, 73289, 68214, 114524, -178728, 186043, 361933, 83409, 65797, 281720, -138449, 84173, -81504, -75928, 195852, 190616, 172437, 151855, 177343, 170140, 219313, 443616, 401301, -85608, 311987, 17619, 203785, 462569, 107140, 228399, 166832, 146557, 291394, 641630, 440655, 8365, 171616, 235404, 154971, 647656, -118306, 93278, 102729, 318220, 11752, 337323, 195139, 75380, 112303, 14634, 321305, 122895, 157131]
12180A57131G3170c1986C77582A33565J67079A19264f8094j5511K1588H3550N5516
12169A39066a13472A83462J25853N6099A13709P9741a02250C21631J08637j22602
12159C07666A35665n4330O2386F9877a66954j71251A69896b04681o236Q8223N9916
12148f2778j53953D5020d81702g784B22178K84599f1383B64393A0400K31343I7231
12136A45180J35582Q755b04293N9731d6113F8642b00675e7185j28200e1586k74876
12125c26462H3401J55433F8046b1435F0983Q8666R6827e6350A08464a93669e7226
12113i7030q4917h5496C75990b312j65791A3721K89734c1553j63695B51362r2472
12102A58890k4884a2259B40122c14849b3838A71711B8191M62047b17607H9434
$$ y = [157131, 73170, -31986, 377582, 133565, 300644, 119264, -68094, -83605, -62017, 83550, 139066, -113472, 183462, 309315, 365414, 113709, 193450, -102250, 321631, 430268, 307666, 135665, 81335, 143721, 69877, -166954, -338205, 169896, -204681, -210917, -122694, -62778, -216731, 45020, -481702, -7784, 222178, 506777, -61383, 264393, 10400, 241743, 97231, 145180, 280762, 289517, -204293, -144562, -46113, 68642, -200675, -57185, -185385, -51586, -326462, 83401, 238834, 68046, -21435, 60983, 149649, 246476, -56350, 108464, -193669, -57226, -97030, -181947, -85496, 375990, -2312, -168103, 13721, 303455, -31553, -195248, 251362, 158890, 134006, -12259, 240122, -314849, -23838, 171711, 28191, 490238, -217607, 89434]
12091a71623B33725a13738l19830a69909g5240L091J6768j97000d8731F5511d2508
12079a02841B1410a85089j45367C552b402E90038J052194o3687o36935A31733
12068a12502B77114g2969a3201A86229a06271n5452A55880l4820a71467a773D7188
12056E0929J66983l9384b64512A27875b54282A2459b3674A41241A2748K1988b47467
12044H8356D3467a08750K0531H569Q2593b03969B15117c77217B60152b32714A98869
12032a10970B32288a2042n2723A25758M831J00379j04521l2398J20158a01696
12021a10471p736l9519e7506A80803d2032C96197A4227J01024g404j22360B33805
12009H5498a52297j25936C9311K7640A9960d2646p7792E621a95363a6328A62546
$$ y = [-171623, 233725, -113738, -433568, -169909, -75240, -72149, -55381, -252381, -48731, 65511, -42508, -102841, 21410, -185089, -330456, 3552, -2402, 590038, 1642232, 1578545, 941610, 131733, -112502, 277114, -72969, -13201, 186229, -106271, -161723, 155880, 121060, -171467, -1773, 47188, 50929, 217912, 178528, -264512, 127875, -254282, 12459, -23674, 141241, 12748, 34736, -247467, 88356, 43467, -108750, -88219, 8569, 91162, -203969, 215117, -377217, 260152, -232714, 198869, -110970, 232288, -12042, -64765, 125758, 130589, 230968, 126447, 94049, 214207, -101696, -110471, -118207, -157726, -57506, 180803, -42032, 396197, 14227, 115251, -7404, -129764, 233805, 85498, -152297, -278233, 39311, 66951, 19960, -42646, -120438, 5621, -195363, -16328, 162546]
11997A6038f9739A96906a9876n4912K5446n4143B25048e2176l1413C6681e9499
11985A44242e6928K5q3285D04602i0612H190b85790a41379m9598c3606B26253
11973i5320a0559k70701N9803E6181K66050G7191B6813L10831j62155a52326A52925
11961C2218M7789D791a20326A88709a37261e0636A4271J0008J58950Q59a25579
11949a83755b5468J1598m7916j69660E8056c35376a10399p4679f5397l70869J19214
11938c17052C05461Q8025i4797p0339e0601C2172Q5624b91640h3202I6870b2682
11926a62022B10955f114A63348c79909b9248C77303K6441b51183e5798k90101
11916c45899H4231D530d5041A15343a42538O5318I7052n854a52234B77890D4987
$$ y = [16038, -69739, 196906, -19876, -74788, -49342, -103485, 225048, -52176, -83589, 36681, -59499, 144242, -56928, -56903, -140188, 404602, -90612, 8190, -285790, -141379, -190977, -33606, 226253, -95320, -10559, -281260, -221457, 56181, 322231, 77191, 26813, 337644, 175489, -152326, 152925, 32218, 80007, 4791, -120326, 188709, -137261, -50636, 14271, 24279, 183229, 184088, -125579, -183755, -25468, -13870, -61786, -231446, 58056, -335376, -110399, -185078, -65397, -436266, -317052, 305461, 393486, -94797, -165136, -50601, 32172, 117796, -291640, -83202, 96870, -22682, -162022, 210955, -6114, 163348, -379909, -29248, 377303, 403744, -251183, -55798, -345899, 84231, 4530, -45041, 115343, -142538, -77220, 97052, 91198, -152234, 277890, 44987]
11904a23690J0681B81678h9792L3606j50505B641b43070A3635h1689A04906k0995
11893H3911e4185A97215b95074A41820b37223G0139c19331l1925C7559g979B74843
11881A42485b6669H1950M8374K0184o9655a08394A57967D8994J23517d0087D5936
11869b08642j19430f0241H9978g8690H7873c35159J54673A3457K57282H4160a32418
11857E9370g8751l3727k56685J48294c09j0540A08163R7290p9046b38324A02095
11845a11398p5224C8745j5500K8092a04696c8422j01671e1347A50847i51n8140
11834e9091D74438c9918k31065J25231M4872k19411f629k6F1665d9247m22403
11823d71650a07226A25367c569k18438c403j75012b6405p1494j03742l73681B12086
$$ y = [-123690, -113009, 281678, -89792, -56186, -206691, 2641, -243070, 13635, -81689, 104906, 83911, -54185, 197215, -295074, 141820, -237223, 70139, -319331, -351256, 37559, -7979, 274843, 142485, -26669, 81950, 130324, 150508, 80853, -108394, 157967, 48994, 172511, -40087, 45936, -208642, -328072, -60241, 89978, -78690, 87873, -335159, -180486, 13457, 270739, 84160, -132418, 59370, -78751, -112478, -369163, -220869, -309, -10849, 108163, 205453, 126407, -238324, 102095, -111398, -186622, 38745, 23245, 51337, -104696, -38422, -140093, -51347, 150847, -951, -59091, 474438, -39918, -270983, -145752, -100880, -320291, -6629, -6655, 61665, -49247, -471650, -107226, 125367, -3569, -222007, -3403, -178415, -26405, -97899, -201641, -575322, 212086]
11811A30809g5843j19217l28207e2455A63378c99674A22873I220b76378k48504
11801e24882a89217A22071L6141A2581R773O8123K47635e1206B8025i9931k9125
11790a29056C8276i4944A37786c4144j61363F5574B1631a87959P3758b9163C0481
11778d4879H3464b71599g0689A37630J25230b47224i3995D8399K51062I6696J10734
11767B07430c13498J21897k83504a85941C1568K1972A8115a63167f827A38511
11756a37675K8941A00960i3493F2209P1576c8343k0170M381j61378k1735b8990
11744a3923B7482K75584H4208b31032N1585H0381M11897e6002l1300A3536a6415
11732d30492a59505C17187A41292j4928c83754B9134M920L96409A4217c27549
$$ y = [130809, -75843, -195060, -523267, -52455, 163378, -399674, 122873, 9220, -276378, -524882, -189217, 122071, 158212, 12581, 22354, 90477, 338112, -51206, 28025, -99931, -129056, 38276, -94944, 137786, -34144, -195507, 65574, 21631, -187959, -114201, -29163, 30481, -44879, 83464, -271599, -70689, 137630, 262860, -247224, -93995, 48399, 299461, 96696, 207430, -313498, -191601, -475105, -185941, 31568, 53540, 18115, -163167, -6827, 138511, -137675, -108734, 100960, -93493, 62209, 133785, -38343, -58513, -54132, -215510, -237245, -28990, -13923, 27482, 303066, 84208, -231032, -179447, 80381, 492278, -56002, -87302, 13536, -16415, -430492, -159505, 317187, 141292, 126364, -383754, 29134, 34054, 430463, 14217, -327549]
11721c6858O358k8697H0040g6203A6303J16127a31178B15439a29323C04985a95553
11709C01137b2380H0083g011B53535D1944J01658b88958A73453i7047k88427j9782
11698d05256a30921N0334j78410C4270c01024I8734k9912a78816l201O5718b4624
11686a59775B77182j27446M0668J31582c0638A13957m8408f5899A32710L075B090
11674B8661c06368E23099A54117D9862L37446j09641p6171b59221c3689j8888
11664e2577p2199A60850f310k24843j6678G1821a77132H603K06391G1867j5321
11653E6546P3120M0343a04572a3105p7039d0148H8074A0992N3693a09799k02576
11642c12375b9213A94566J04036C1835K199J54976E7716J05380b62738a6751j53309
$$ y = [-36858, -30500, -59197, 80040, -76203, 16303, 132430, -131178, 215439, -129323, 304985, -195553, 301137, -22380, 80083, -7011, 253535, 41944, 143602, -288958, 173453, -97047, -385474, -405256, -130921, -80587, -258997, 34270, -301024, 98734, 68822, -178816, -182017, -116299, -24624, -159775, 277182, 149736, 190404, 321986, -30638, 113957, 65549, -65899, 132710, 135785, 2090, 28661, -306368, 523099, 154117, 49862, 387308, 277667, 201496, -259221, -33689, -52577, -124776, 160850, -6310, -231153, -247831, 71821, -177132, 8603, 214994, 71867, 56546, 129666, 170009, -104572, -13105, -90144, -40148, 88074, 10992, 64685, -109799, -312375, -29213, 194566, 298602, 31835, 34034, 189010, 57716, 163096, -262738, -16751, -170060]
11631a70060b5247B92458c70046A76017a87411B0094O0012g9317A49560L27525
11621D77085a67070B4245a74071N3445L8689L2937q3796B7184d5196C67151E9309
11609A70615b44740F5410a94350I4725a98138A42377a03077A53607b08823R6781
11599a12042j05593D6811K09592A6908J9557K8871J20331a20169j07015A25412
11588b0342A13075K95494j24918j17183b77877B05581I1823J51824h8869C617
11577E8919a21605A49110C9777J04984K16461D0017a08022A41033c4708q3009
11567a17717e7943j1661B07297p2060K17895i0597C71537a51815A53927n5691
11557I8236J04084c05615d4887D7944a47177B58888a6054E1919k5119J07823J01105
$$ y = [-170060, -25247, 292458, -370046, 176017, -187411, 20094, 80106, -79317, 149560, 477085, -167070, 24245, -174071, -120626, -81937, -49000, -132796, 27184, -45196, 367151, 59309, 170615, -244740, 65410, -194350, 94725, -198138, 142377, -103077, 153607, -208823, -112042, -217635, 46811, 256403, 16908, 36465, 65336, 185667, -120169, -227184, 125412, -20342, 113075, 408569, 283651, 166468, -277877, 205581, 91823, 243647, -88869, 3617, 58919, -121605, 149110, 39777, 144761, 361222, 40017, -108022, 141033, -34708, -117717, -57943, -69604, 207297, 135237, 353132, -90597, 371537, -151815, 153927, 98236, 202320, -305615, -44887, 47944, -147177, 258888, -16054, 51919, 26800, 134623, 235728]
11546B35728i496C0696L21037g053A29500g7831J5292D5677b2226l5888a232D7296
11533b1018I1139C2459c22742e8951L364A1885K70625c29269D5817j2042L23667
11522C57442k2240a1221o0441E4300c3156j55488C12445A33184C4111J12755K14905
11511C61771A46136a89949B7633K83860a31480G5626J51148M678G3969K6095j0915
11500H9149R0254L9257A02943B3854b38240C31391A59656p4751K70275E5694Q7695
11489A43389a49720d200q8474B57844J641B0158J53235R9148h022E301L52105
11478C57406J31421M2658B14483O8133j28318l5786a55033B38881i7568F1561
11467B66814i0245j3903q8927F9746J23901L36597h904m4496a4968A16078J37654
$$ y = [235728, -9496, 30696, 351733, -7053, 129500, -77831, -62539, 45677, -22226, -58114, -1232, 47296, -21018, 91139, 32459, -322742, -58951, -55587, 11885, 282510, -329269, 45817, 33775, 357442, 335202, -11221, -71662, 54300, -33156, -188644, 312445, 133184, 34111, 146866, 361771, 146136, -189949, 27633, 311493, -131480, 75626, 226774, 231452, 73969, 100064, 89149, 179403, 218660, 102943, 23854, -238240, 331391, 159656, 84905, 355180, 55694, 143389, -149720, -4200, -92674, 257844, 259485, 20158, 173393, 272541, -8022, 5301, 357406, 488827, 531485, 214483, 282616, 154298, 118512, -155033, 238881, -97568, 61561, 266814, -90245, -104148, -193075, 69746, 193647, 530244, -8904, -53400, -14968, 116078, 253732]
11456B53732G2783L25711G3529J1579c0873k51199o3348A89080a3904A08486A00
11444a44343f4802A00866J8117C3609N3850l8113a71382B30895b08760g0491A03836
11432A88860O5004a8435C1214L7218b0943k39893H1195M4630n7997a4985j33402
11421a48387L010p8661p745H9607b4369A72672h1683c1759A10691a95741g6466
11409A1028d1083j06123M1935d3927p1449j6556B54660a58217A20087i657C02815
11397B55550A2090J15471b41399F438J45383j6578e7582j52913J03942p7630f2506
11385h0986a5490k12328H6321K50912a48022j95866A8029c4449B10047k7280J61739
11374C44506H9333c4593j13946G301c99974a3809o5404c7819A42762e0433f976
$$ y = [253732, 72783, 398494, 73529, 85108, -30873, -282072, -345420, 189080, -13904, 108486, 100, -144343, -64802, 100866, 118983, 33609, 87459, 49346, -171382, 230895, -208760, -70491, 103836, 188860, 253864, -18435, 31214, 68432, -20943, -260836, 81195, 125825, 67828, -14985, -148387, -145377, -224038, -231783, 89607, -24369, 172672, -81683, -31759, 110691, -195741, -76466, 11028, -41083, -147206, -105271, -43927, -115376, -131932, 254660, -158217, 120087, -9657, 302815, 255550, 12090, 127561, -241399, 6438, 151821, 135243, -57582, -210495, -106553, -184183, -62506, -80986, -15490, -227818, 86321, 337233, -148022, -343888, 18029, -34449, 210047, 182767, 344506, 89333, -34593, -148539, 7301, -399974, -13809, -79213, -37819, 142762, -50433, -6976]
11362a19551J270E9976b97082a3874K213B09054c15302g6005C603b06720P9848
11351a26872B17097c023j11637k3320b6951E9821p962K01961d4558A04820D3952
11339h9032A68289i5135F8903a58857A43943a46599C10810a24782C21390A48494
11328a76607N1081A11688G733b29496h5702l39833a14427n6930A05087b45537
11317C07102F6083b0247q5442A01006h3221L6291H4456J7404d3775E0509a27253
11305a03758B09305a51309C7695J36808a56451B162a86301k27698h8857j6278
11295a05135P93J6324j27368B1849b85994O0578A22938C1267a58219G183e0288
11283A83754k7546a02914A39930L2490a39906a9413k8518B30266a54485L5446
$$ y = [-119551, -118281, 59976, -297082, -13874, -11661, 209054, -315302, -76005, 3603, -206720, -126872, 217097, -3023, -114660, -137980, -26951, 59821, 51859, 253820, -44558, 104820, 43952, -89032, 168289, -95135, 68903, -158857, 143943, -146599, 310810, -124782, 321390, 148494, -176607, -125526, 111688, 7733, -229496, -85702, -425535, -114427, -171357, 105087, -245537, 307102, 66083, -20247, -105689, 101006, -83221, -46930, 84456, 101860, -43775, 50509, -127253, -103758, 209305, -151309, 37695, 174503, -156451, 2162, -186301, -413999, -88857, -105135, -104342, -88018, -215386, 21849, -285994, -225416, 122938, 31267, -158219, 7183, -50288, 183754, 156208, -102914, 139930, 172420, -139906, -19413, -47931, 230266, -154485, -119039]
11273a19039a4082j30956K9465A9368N0299a4964l79263A30374l2969d00692B554
11261A70918e63681a49174B41865i1403J899j13387B1471a10579e5270A22778
11250A64776a40893b5884A24165k8494l6112b4300A43816F4111a01427I4441O1077
11239A55518b17085B54230a47093B53470A4650c10780a03827k5330A90064B1705
11228b32120A14819b40608i2682G9314c10057B63669D7410K55856G3664b50782
11217B15667D8630b59991R8612k01499F2169f6275l7084r0673k09236N0906A35044
11205a35847M5517k10766R9385A14711J8753o5839K42815b28695L2037D7355a74891
11193a81196B41873a50388H5242h7801C5305a5758k07719b3097i077A34414b38579
$$ y = [-119039, -14082, -145038, -115573, 19368, 69667, -14964, -394227, 130374, 97405, -400692, 2554, 170918, -563681, -149174, 241865, -91403, -89504, -202891, 21471, -110579, -55270, 122778, 164776, -140893, -25884, 124165, 95671, 59559, -24300, 143816, 64111, -101427, 94441, 155518, -217085, 254230, -147093, 253470, 14650, -310780, -103827, -129157, 190064, 21705, -232120, 114819, -240608, -92682, 79314, -310057, 263669, 47410, 303266, 73664, -250782, 215667, 48630, -259991, -161379, -362878, 62169, -66275, -103359, -194032, -403268, -352362, 135044, -135847, -90330, -301096, -201711, 114711, 133464, 67625, 310440, -228695, -196658, 47355, -174891, -181196, 241873, -150388, 85242, -87801, 35305, -15758, -223477, -23097, -9077, 134414, -238579]
11181a72045C6151c49738L5938d1712r3004C635g704E5525i3783K2974j11921
11170a82730A65596a75482O9894j69925a14441B03489b32999D0768p371K79726
11160C13123f2883k65556A58070n7718l5645e7065A33606L3970b1259m3120l51891
11149d16270B38021f31D2750j4685J09290f1858k4821K1844A55354D2848b78971
11137A43259l6830m6857j8934d3184n33949d5568A42020b2990A56019d7429B06284
11125b05424E6754K3987a00598A44309J93919c71315A03674E0995o259i3173F443
11113C3540M8227P3801G6418Q5230J04682h9216E8850J25779L26927E459P6334
11102H1793k2080J57336j06969J42693j18633l6244g6098n6183A23105M50684
$$ y = [-172045, 36151, -349738, -313800, -41712, -134716, 3635, -7704, 55525, -93783, -70809, -182730, 165596, -175482, -105588, -275513, -114441, 203489, -232999, 40768, 33397, 313123, -62883, -328439, 158070, 100352, 64707, -57065, 133606, 167576, -21259, -64379, -416270, 238021, -631, 42750, 28065, 137355, -61858, -86679, -64835, 155354, 42848, -278971, 143259, 106429, 59572, 40638, -43184, -577133, -45568, 142020, -22990, 156019, -47429, 206284, -205424, 56754, 80741, -100598, 144309, 338228, -371315, 103674, 50995, 44736, -93173, 6443, 33540, 81767, 155568, 76418, 161648, 266330, -89216, 58850, 184629, 511556, 5459, 81793, 59713, 217049, 110080, 252773, 134140, 97896, -76098, -132281, 123105, 573789]
11092E73789k40360A10421C6851Q3677P9391a32969N3260B78120F1754K08836
11082B70590c6544A72421n4389A4666N8096K85823o9905J4051C472L70050I5964
11070C62342J01169J7894c7288C98751J63613k26386M5214p3854I6020L16380
11060D12400L2298J58909o9472r5785K47563o8139o5604M13402j054r6744m8018
11049H19756N2374o641q4124k46961J30754j19717L33643m15415j29812J39425
11039D73282K24490J97967j21054l01953J39894j70960J32828n0607J42571K01491
11029H67949R3394k05997l6312J4657k50821R5150j7321j07939Q8662M15550k49698
11018G07274j78705L935k6816q2776J30193K5381J22005p5852l0633k59452L25635
$$ y = [573789, 333429, 110421, 36851, 120528, 199919, -132969, -79709, 278120, 61754, 270590, -36544, 172421, 118032, 14666, 72762, 358585, 288680, 302731, 3472, 373522, 95964, 362342, 463511, 481405, -37288, 398751, 562364, 335978, 381192, 307338, 96020, 412400, 444698, 603607, 534135, 438350, 685913, 617774, 552170, 965572, 964518, 867774, 819756, 872130, 865489, 781365, 534404, 665158, 545441, 879084, 463669, 333857, 473282, 697772, 895739, 774685, 472732, 612626, 441666, 574494, 523887, 666458, 867949, 961343, 755346, 719034, 733691, 482870, 578020, 560699, 452760, 541422, 956972, 707274, 528569, 532504, 505688, 422912, 553105, 578486, 700491, 624639, 594006, 334554, 660189]
11007F60189p9688J46052J54183k83541O3121K6305k30030n455M46043l46240
10997E50939j66431L03226Q8209m2034j72801Q2066N7488m615L6544K14423j76276
10986G70738j73986J82985J97663K30089E39462N32547K882j54047L58347M39029
10976A718220k20082L66685P95544K0781l72519N87942j51466j93307j10508n24988
10966A916302M21288m07510l72659O8218L03872J0541p13169M12778r4800r835
10956A535026O5469R2517j63386m2185k69749n57108J29879r563a0258G32594
10945E4742N04562k10640R8957c00157A50559r53J0246A1956b3877A9115L2336
10934E1451K25327b2849F2292M4737K71678a75924I3977F113J38929N8823a48237
$$ y = [660189, 580501, 726553, 880736, 597195, 660316, 686621, 456591, 451136, 897179, 550939, 384508, 687734, 775943, 733909, 561108, 643174, 700662, 696047, 732591, 947014, 770738, 596752, 779737, 977400, 1207489, 539462, 1072009, 1074891, 920844, 1279191, 1718220, 1498138, 1864823, 2660367, 2681148, 2308629, 2896571, 2745105, 2551798, 2441290, 1916302, 2337590, 1930080, 1557421, 1625639, 1929511, 1940052, 1226883, 1639661, 1544861, 1535026, 1600495, 1693012, 1529626, 1487441, 1217692, 660584, 790463, 780900, -10258, 732594, 54742, 559304, 348664, 447621, -300157, 150559, 149606, 159852, 11956, -23877, 19115, 51451, 276778, -22849, 62292, 107029, 378707, -175924, 93977, 6113, 145042, 203865, -148237]
10922B55344A16108J0591d0805k2136k34674d0658I1067a72389B30636a70370
10911a42580N9884k817B48670g33l23075F4859d05289A70724C2460b0839D24138
10899A7736h2726A87241r0996K41410c54195I5618b3233A46727a07692G7726b18107
10887C01779a26931F7893i2362C57590J12924A34221i0721j92460E9625P4336
10877A33961b50741B7642a73522E6035a16848B51394b35506B01816E8083L7565
10867I5648f3661A46558F7908K45775A33645P9571q4326P0972I2633O085J62727
10856B61445I436e8023K5957D6711K5717a1914H4276J12756D3243c7166k89345
10845c26511Q9115C12373a64698N1107A42696B9797N756f8121F6969c3845l6172
$$ y = [255344, 116108, 126699, -40805, -62941, -297615, -40658, 91067, -172389, 230636, -170370, -142580, -82696, -85513, 248670, -733, -323808, 64859, -405289, 170724, 32460, -20839, 424138, 17736, -82726, 187241, 96245, 337655, -354195, 95618, -23233, 146727, -107692, 77726, -218107, 301779, -126931, 67893, -92362, 357590, 470514, 134221, -90721, -283181, 59625, 133961, -250741, 27642, -173522, 56035, -116848, 251394, -235506, 201816, 58083, 95648, -63661, 146558, 67908, 313683, 133645, 213216, 128890, 199862, 92633, 98718, 261445, 9436, -58023, -32066, 46711, 72428, -11914, 84276, 197032, 43243, -37166, -326511, -237396, 312373, -164698, -113591, 142696, 29797, 35553, -68121, 66969, -33845, -70017]
10834g0017p9812j46925a19208A09517a96566j4064A73903a00643A24931a45941
10823a1078k4351A14468m1779b88492A23899b0835l03299R6185A42527a30969
10812b42809R9562C01498H5712l6567l453N6207k8691C1453b40697Q445K3929
10801b08323i3894p2294j548N7138A17627h4256A25966a0396A36528c84006h4789
10789c03798h874j05667A00756a31787H0457d0090j9001k24189c5996o0644m5475
10778a42115A6455b88174J22270D4117J51695a74016h0721H142h9130c5971A70740
10766A78811a23899F8951g1338C07905b46174d3997A62659a58033j92897J20601
10756b30329A75121G9859N2226E2633a63835A14310i1441Q580M217F9777B1754
$$ y = [-70017, -149829, -296754, -119208, 109517, -196566, -210630, 173903, -100643, 124931, -145941, -11078, -35429, 114468, 72689, -288492, 123899, -20835, -324134, -227949, 142527, -130969, -242809, -143247, 301498, 85712, 49145, 45692, 101899, 73208, 31453, -240697, -232252, -208323, -93894, -166188, -167736, -110598, 117627, -84256, 125966, -10396, 136528, -384006, -84789, -303798, -8874, -114541, 100756, -131787, 80457, -40090, -59091, -283280, -35996, -96640, -142115, 16455, -288174, -165904, 44117, 195812, -174016, -80721, 8142, -89130, -35971, 170740, 178811, -123899, 68951, -71338, 307905, -246174, -43997, 162659, -158033, -350930, -230329, 175121, 79859, 132085, 52633, -163835, 114310, -91441, -82861, -78644, 69777, 21754]
10744b33405j03260h2562L6210j06328l0375J5946Q861A3696b21318A68979b8940
10732g1762A34938B6746e07093a78455H9492J49024a28816j56526a39149I6525
10721I671P5176a65148j13545B85999A18609c55363h1012G4141J9370C9555e4137
10709a91599M2662r9249C48751j26046b61799j5976B0192b14577P3798B277J27863
10698A30140J27476g7119H8008D3276a50432n3211f2199C5720e0807H5405b21931
10686B8158R1593f1575j55313F3409K28364a42799B2007d380B41417A13171f0277
10674a13488j38379A12510l3007e5261a0122M138B45346A18477b2333j33277K4566
10663a31044k443J0380C181n63g1040G8301C3956a57319k0146G9158a34281B34734
$$ y = [-233405, -336665, -82562, -46352, -152680, -183055, -167109, -158248, 13696, -221318, 168979, -28940, -71762, 134938, 26746, -507093, -178455, 89492, 238516, -128816, -285342, -139149, 96525, 9671, 84847, -165148, -278693, 285999, 118609, -355363, -81012, 74141, 93511, 39555, -54137, -191599, -148937, -248186, 348751, 222705, -261799, -277775, 20192, -214577, -140779, 2277, 130140, 257616, -77119, 88008, 43276, -150432, -203643, -62199, 35720, -50807, 85405, -221931, 28158, 119751, -61575, -216888, 63409, 291773, -142799, 22007, -4380, 241417, 113171, -60277, -113488, -251867, 112510, 79503, -55261, -10122, -5984, 245346, 118477, -22333, -155610, -131044, -133487, -123107, 3181, 2618, -71040, 78301, 33956, -157319, -177465, 79158, -134281, 234734]
10650a11541q4613B50106H743b00118k05086A13711c33426C38790a72431j7541
10640a89972R390a2972A29259J3398K79384a2084B59736F865d0294k35751k94044
10629e70089i0715B5405J35278p0388d5509A8398P7266a69700k10088d2768H9571
10617a80619E55L6571a48864G5692J01578l8121k2854b76373a33993a8774D2272
10605C341h3708k10026A0500i7779A74048R7249I0469D2882K6053a7114B9866
10593F0035a81488F3897a23967A46661F1703k2046g9097A25309b04237K4588B83462
10581B32071B4216J88918B165K21906A06793b1427B6671d7425K0170B17027j1479
10570B05548b55738A01161b70248a13810k11794A81169d05817i2983a2620j30694
$$ y = [-111541, -196154, 250106, 8743, -200118, -405204, 113711, -333426, 338790, -172431, -189972, -180582, -12972, 129259, 142657, 422041, -12084, 259736, 6865, -40294, -276045, -570089, -90715, 25405, 160683, 90295, -45509, 18398, 95664, -169700, -379788, -42768, 89571, -180619, 555, 37126, -148864, 75692, 177270, 139149, 116295, -276373, -133993, -18774, 42272, 3341, -83708, -293734, 10500, -97779, 174048, 271297, 90469, 42882, 68935, -17114, 29866, 60035, -181488, 63897, -123967, 146661, 61703, 39657, -79097, 125309, -204237, -179649, 283462, 232071, 24216, 213134, 2165, 224071, 106793, -21427, 26671, -47425, -27255, 217027, 205548, -255738, 101161, -270248, -113810, -325604, 181169, -405817, -92983, -12620, -143314]
10560a43314C30120A5757K99310e5060A01708a18134k06097P373E5560b02946
10549a12540E9975b77424P0891d9999f976p0321L5369C545c08509d9767m22699
10538d72466a98564B3977a85526a1824E4595b37919h3811r4299L4564a8936j7085
10527c6021C03585E7528N8389c4167j56907k7371A25976b0451j58882D1284h0336
10515a51856D1394J69667G1977N1794D1403f9473Q338j64217C00148A02026f6041
10503B05712a35698l24938b27121J10601j03435C2066e6514k55964a14929M808
10493a10121c4463l73004n2854B56668a48059E9589a85790A62465d4766A89976
10482B88243M9529r4765M73715l22313j02899j22192D6112d5504C61747j71329
$$ y = [-143314, 330120, 15757, 315067, -55060, 101708, -118134, -324231, -316858, 55560, -202946, -112540, 59975, -277424, -206533, -49999, -6976, -77297, -41928, 3545, -308509, -49767, -472466, -198564, 23977, -185526, -11824, 54595, -237919, -83811, -178110, -143546, -18936, -36021, 303585, 57528, 115917, -34167, -191074, -218445, 125976, -20451, -179333, 41284, -80336, -151856, 41394, 211061, 71977, 123771, 41403, -69473, -61135, -225352, 300148, 102026, -66041, 205712, -135698, -460636, -227121, -116520, -219955, 32066, -56514, -312478, -114929, -110121, -34463, -407467, -460321, 256668, -148059, 59589, -185790, 162465, -44766, 189976, 288243, 337772, 243007, 716722, 394409, 291510, 169318, 46112, -45504, 361747, 190418]
10472A90418b32378A31669J8342c7783k1275D5498a26546B6817a10970j24214
10462b35184C9037c06005a03302j42237A43552A8109c44465j5047A1156c01524
10451d2773j69256M5455C6852J39573a28806j7708H1963b1961j62591k12898A13917
10439G9678a29197J8059i697B4871J01927h4191B7861f2940k7294k02433J268
10428b91399A09416d6068G1026g4447j28180C61965b48231A29734l8434J58351
10418B49651k9499J88417F8211N4518b09607f5441L0988j48940j29432E0706o721
10407D3985J81773B7299e18997b3861j06236A04017a34193q7216O9888j35136
10397b86657a03867A3649a65641J1582b8795j1202l34057a09364q5353f6006I4255
$$ y = [190418, -232378, 131669, 150011, -37783, -59058, 45498, -126546, 26817, -110970, -235184, 39037, -306005, -103302, -245539, 143552, 18109, -344465, -359512, 11156, -301524, -42773, -212029, -166574, 36852, 176425, -128806, -146514, 81963, -21961, -184552, -397450, 113917, 79678, -129197, -111138, -9697, 24871, 126798, -84191, 27861, -62940, -90234, -292667, -291399, 109416, -46068, 71026, -74447, -202627, 361965, -248231, 129734, 91300, 249651, 220152, 408569, 68211, 122729, -209607, -65441, -34453, -183393, -312825, 50706, 43985, 225758, 27299, -518997, -23861, -130097, 104017, -134193, -221409, -151521, -286657, -103867, 13649, -165641, -154059, -28795, -39997, -374054, -109364, -194717, -66006, 94255]
10385C80849j57284I8712l6793j0880d3674Q666l8262E6655R6145K71532I1039
10373D09717A55684J46339D4533J27767L8067L09838q1423l0794J05502q4089
10363D29401M15990l77483B05282O8141J08326N918F3262Q1081L92843j38238
10353C98948A33043L64487j62630K85586C06669K28301Q632k37609n5120O7680
10343C18553J15667A26676J80654A41815J95169p5585J26447D591i8758A72228
10332B02080b17539I4661O7182P1156n5439f0022D9188g827D23670j10792b4619
10320D55335b98927C77570I537J61759M6370A6815E656L2770b92509c9061B83159
10308i7962C4371d7107A36323j7297f7937l0141A25327A4854i7584d5407B63976
$$ y = [380849, 223565, 98712, 61919, 51039, -43674, -35008, -73270, 56655, 152800, 424332, 91039, 409717, 155684, 302023, 44533, 172300, 210367, 520205, 438782, 407988, 513490, 429401, 845391, 467908, 205282, 273423, 381749, 387667, 63262, 144343, 537186, 398948, 133043, 497530, 334900, 620486, 306669, 534970, 543602, 305993, 250873, 318553, 434220, 126676, 307330, 141815, 336984, 261399, 387846, 4591, -98758, 172228, 202080, -217539, 94661, 161843, 232999, 177560, -60022, 49188, -7827, 423670, 312878, -24619, 455335, -298927, 377570, 9537, 171296, 217666, 16815, 5656, 38426, -292509, -39061, 283159, -97962, 34371, -47107, 136323, 119026, -67937, -98078, 125327, 14854, -97584, -45407, 263976]
10296I186J20532B1740K02170D6376K27825a29526E58370A9246a28884H1258a82033
10284g6592q8195a5482C02410a60165p0482h0751B5177f4441J4590J0263A82084
10272e6941r0440f5275A17102K6364e7454p897k59218e8787r841k44349A17982
10260E29625c7455A67221L33068A94035J7206D2188i4599E5836Q8207P4773n8160
10249A60656a6364p3688p0391k06812J76898I4041c52843P9259E4524M6364J8714
10238A19602b28622A03205b69B60780B1949K3413a47274D45012d540H5547c28288
10226I9702h6131q1887B0710b24621k5164b1349j75347R3541q6136A51918b6135
10214A86261b5317E6152f6999j34731O0246G2254B8044R0117f2742b2078A92184
$$ y = [9186, 129718, 21740, 223910, 46376, 274201, -129526, 558370, 19246, -128884, 81258, -182033, -76592, -164787, -15482, 302410, -160165, -230647, -80751, 25177, -64441, -49851, -39588, 182084, -56941, -147381, -65275, 117102, 143466, -57454, -65351, -324569, -58787, -68628, -312977, 117982, 529625, -37455, 167221, 500289, 194035, 211241, 42188, -94599, 55836, 144043, 218816, 160656, -16364, -90052, -160443, -367255, -190357, 94041, -352843, -273584, 54524, 100888, 119602, -228622, 103205, -269, 260780, 21949, 45362, -147274, 445012, -4540, 85547, -328288, 99702, -86131, -168018, 20710, -224621, -249785, -21349, -196696, -103155, -189291, 151918, -26135, 186261, -25317, 56152, -66999, -201730, -141484, 72254, 28044, 118161, -62742, -22078, 192184]
10202D3180b14817h7344A99519r9344e042k15730g3629p6968J0698m3430B152
10190i8585d3809A9206a94747A56527a19255C7841K5761d72083B16965b1370f172
10178C5451K29623a77991C3926L1372J12704b23023L8504e6784m5575j7538r7993
10167b17890e7914E0388M0383b19253J7043A06621e20181E106b5011M473k83187
10156c03725d3462B974c38394G0000d2455H2871b6945C43348I815c22555E24O3339
10144F3863j3675K2038j1068f0265n8862M7845j5358p17o4015c3535l25852a48322
10131f6902j72049f9047j71193a6052m0274l3945n2999j37394b8852A2221a43835
10119A24897m5741b60591D3952c18001B39715b95751d3969D7138K22270G9223
$$ y = [43180, -214817, -87344, 199519, 100175, -5042, -220772, -73629, -150597, -139899, -183329, 2152, -98585, -43809, 19206, -194747, 156527, -119255, 37841, 63602, -472083, 216965, -21370, -6172, 35451, 265074, -177991, 33926, 65298, 178002, -223023, -184519, -56784, -102359, -119897, -217890, -57914, 50388, 90771, -219253, -202210, 106621, -520181, 5106, -25011, -20538, -303725, -43462, 2974, -338394, 70000, -42455, 82871, -26945, 343348, 9815, -322555, 524, 63863, 50188, 72226, 61158, -60265, -119127, -71282, -86640, -87357, -151372, -33535, -359387, -148322, -66902, -238951, -69047, -240240, -16052, -56326, -90271, -143270, -280664, -28852, 12221, -143835, 124897, 79156, -260591, 43952, -318001, 239715, -295751, -43969, 47138, 269408, 79223]
10108h8963D3868J47564p2334a26581A09361a26227C5048J786a1167k23101A36757
10096G2710b28178d2877G5722b75341i9502M50j28011J2971c2411o0492I2081
10084F3652b32727g1911L2661l26112E5387K3975F957J9267c77926b2578j19530
10073a42108E3463K8880g1642C41b79993A16333J6950c99701a33812G0506a30848
10061C13562d40088c4379c403j2097j31666e6822p1472f3749b9837A84410b15804
10049H2b27961Q4710B21121d3632G0021a94499a107o9734j33382e790G0111h9903
10036D5417a71243l1833j10890A42694q613a11042I93a54657j17268F9454b2718
10024C61134A79232a55628c5978K255j136k20163g2100H4330g5180r0244k05532
$$ y = [-88963, 43868, 191432, 119098, -126581, 109361, -126227, 35048, 36834, -11167, -234268, 136757, 72710, -228178, -42877, 75722, -275341, -99502, -99052, -227063, -214092, -32411, -92903, 92081, 63652, -232727, -71911, -39250, -365362, 55387, 79362, 6957, 26224, -377926, -22578, -142108, 53463, 82343, -71642, 341, -279993, 116333, 133283, -399701, -133812, 70506, -130848, 313562, -440088, -34379, -3403, -15500, -147166, -56822, -128294, -63749, -29837, 184410, -215804, 82, -227961, -143251, 221121, -43632, 70021, -194499, -1107, -70841, -204223, -5790, 70111, -89903, 45417, -171243, -203076, -313966, 142694, 134081, -111042, 993, -154657, -271925, 69454, -22718, 361134, 179232, -155628, -35978, -33723, -34859, -255022, -72100, 84330, -75180, -165424, -370956]
10013c70956M9119J48601G5373L6458g8908r2455j58696a44492a4525q1261C2213
10001A48526a47692l11586E0748b28286j04016a53142F8991f369B51498a45452
9990g13700C2592P2733a58335j60136m5626r5987a80931i592C7233e9630k23851
9979b83481j32955b9137q3622M325j68531J5185A14071D6795J54579h9796j97767
9968b87563b5968A04461a84406E5897g4723E9733Q1409J49170B7365b69312A39962
9956A86660b174j318l8519E1564c88389g5138c0425k09676a14574B28561H2177
9944a07625B827J17816a50938A97364K3637B3570J8936c50781A51116a6794A94993
9932a55018k3916L2331L9380F1690P9252b41150e0517A95546N899b77586F1265
$$ y = [-370956, -321837, -173236, 75373, 111831, -78908, -171363, -330059, -144492, -14525, -95786, 32213, 148526, -147692, -459278, 50748, -228286, -332302, -153142, 68991, -6369, 251498, -145452, -713700, 32592, 105325, -158335, -318471, -364097, -460084, -180931, -9592, 37233, -59630, -283481, -416436, -29137, -112759, -108434, -276965, -261780, 114071, 46795, 201374, -89796, -287563, -25968, 104461, -184406, 55897, -74723, 59733, 141142, 290312, 27365, -269312, 139962, 186660, -2174, -3492, -42011, 51564, -388389, -75138, -30425, -240101, -114574, 228561, 82177, -107625, 2827, 120643, -150938, 197364, 221001, 23570, 42506, -350781, 151116, -16794, 194993, -155018, -178934, -146603, -107223, 61690, 140942, -241150, -50517, 195546, 201445, -277586, 61265]
9920c86386a63127J4866b7277j0750c928k96829a7144l69707o461J95898j53014
9909c50428J39183h4212m4515A6441J7975a82482j92816B5098a31520A55428b38605
9897e2038B06061q8696a12362k3036C70536b46792B93145a32680d8252j8050C55376
9885a50372f2696o5333k8234K7478j37242d7893C83970a83269B7413J07376P5635
9874B10424c35657A77831d28089P4414a72889E3105a63213q9066N3096o031G5165
9862b56652B4172Q0163M6112a47141I589R5300a71528A44327a82060j12634C2417
9850b68248a27631B63380b3357k13615F4393d4541C56425d04572a27780L9837
9840h7943C23674d8732l51125J429B70606c3164j08544M1424a637l11806h8292
$$ y = [-386386, -163127, -148261, -27277, -38027, -3928, -300757, -17144, -386851, -393312, -197414, -350428, -211245, -84212, -128727, 16441, 34416, -182482, -375298, 25098, -131520, 155428, -238605, -52038, 206061, 117365, -112362, -135398, 370536, -246792, 293145, -132680, -48252, -66302, 355376, -150372, -62696, -128029, -156263, -128785, -266027, -47893, 383970, -183269, 27413, 134789, 210424, -335657, 177831, -428089, -353675, -172889, 53105, -163213, -252279, -199183, -205214, 75165, -256652, 24172, 104335, 150447, -147141, 9589, 104889, -171528, 144327, -182060, -294694, 32417, -268248, -127631, 263380, -23357, -236972, 64393, -44541, 356425, -404572, -127780, -87943, 323674, -48732, -399857, -398428, 270606, -33164, -141708, -100284, -1637, -313443, -88292]
9828g5290B66484b84121a39651O442r2450B8087B063f1479B37181c25252d3611
9816I8358b76907A66883b48611i8475g74l6711C6952J89009E298a87108H6490
9804B2855a59651A10942b66719R9468J5929A15137g9186A15085J97431I3500D5352
9792a34022j1575B03274H0119b05350r5849b0097p2419L96p7391o1811b2547j31416
9780a53963D36195B1882b03788A29457C5841b384H4375Q3600c53616B04158b23556
9768b94019J26192L0484m6403b3770k68187A67649a46903C3583a34665b5192j9321
9757d4513B12538G2433M1781a49096G6265b71500b9662H5787b61098a7325I5815
9745b26532A93521J80887a06399k05068B26815a78927A20431a13684a6313N032
$$ y = [-75290, 266484, -284121, -139651, -133209, -225659, 28087, 2063, -61479, 237181, -325252, -43611, 98358, -276907, 166883, -248611, -98475, -774, -37485, 36952, 225961, 5298, -187108, 86490, 22855, -159651, 110942, -266719, -167251, -151322, 115137, -79186, 115085, 312516, 93500, 45352, -134022, -145597, 203274, 80119, -205350, -301199, -20097, -92516, -92120, -169511, -231322, -22547, -153963, 436195, 21882, -203788, 129457, 35841, -2384, 84375, 167975, -353616, 204158, -223556, -294019, -167827, -137343, -183746, -23770, -291957, 167649, -146903, 33583, -134665, -25192, -44513, 212538, 72433, 114214, -149096, 76265, -271500, -29662, 85787, -261098, -17325, 95815, -226532, 193521, 374408, -106399, -311467, 226815, -178927, 120431, -113684, -16313, -11281]
9735a1281H8721b63995F06430a42593o4389P6415j08967f6481r8287d6569B54458
9723A30723a29438n1908H0321b8153j16895N0796I8597a39176F3210c68531D0936
9711e6650k58062J11564G2425b45526f575D3332a99087j36317E1220c09706B21335
9699A60312L5258I870m236h3963A73159d468B42693i3779L2633J7491o5095m4782
9687a53532N1266K673A22694n2432a00059j4820J0553j8384m87591A51717a95132
9675a55955L3250N981C15688c0026j7534C0085K0525R974L39543A3874a36127
9663a18744K4838j24440A32611g0928J2093p2772G0870l3703a65815N7436a770
9651D3774J01931a2856E1904b80707R1107B24538I5840J29062c3657D03522h9924
$$ y = [-11281, 88721, -263995, 606430, -142593, -206982, -130567, -239534, -66481, -164768, -46569, 254458, 130723, -129438, -181346, 80321, -28153, -145048, -94252, 98597, -139176, 63210, -368531, 40936, -56650, -314712, -203148, 72425, -245526, -6575, 43332, -199087, -335404, 51220, -309706, 221335, 160312, 195570, 9870, 5634, -83963, 173159, -4468, 242693, -93779, -61146, -43655, -108750, -153532, -102266, -99593, 122694, 70262, -100059, -114879, -104326, -122710, -610301, 151717, -195132, -155955, -122705, -116724, 315688, -30026, -47560, 30085, 50610, 60584, 400127, 13874, -136127, -118744, -93906, -218346, 132611, -70928, -58835, -131607, 70870, 37167, -165815, -108379, -1770, 43774, 145705, -12856, 51904, -280707, -189600, 224538, 95840, 224902, -33657, 403522, -89924]
9639D12241A9103a9420a79j3621m1678k73144L8833A00569b33053R3507D4410
9627A63360d172k09512c6518A16947b3607I5843b4961m73470A12983c5416F3306
9615D3232g8288H6394c1414A56306b40218J16246a311k18232a00879o6010B8761
9603f8872A75741a23888e0837l10495R7719A81634J2014c1106m6855j23378B52748
9591a72980D0566L1155c50737A04328P9552p3850a50851M2098l5290b6566j12451
9580a39017j67434H4229b33354m1777g8507j50939a03318j15955F1480B2512b48542
9568b77919D0732Q9763b71524h7218B79571F7985N5208M0588b60288p073O5101
9557b02260b9344k173A46104L308a80562l3901J05806C8828a70872N223E55a7167
$$ y = [412241, 19103, -19420, -179, -13800, -55478, -328622, -289789, 100569, -233053, -139546, 44410, 163360, -4172, -213684, -36518, 116947, -23607, 95843, -24961, -498431, 112983, -35416, 63306, 43232, -78288, 86394, -31414, 156306, -240218, -123972, -1311, -219543, -100879, -166889, 28761, -68872, 175741, -123888, -50837, -361332, -263613, 181634, 193648, -31106, -77961, -201339, 252748, -172980, 40566, 71721, -350737, 104328, 183880, 110030, -150851, -108753, -144043, -26566, -139017, -306451, 84229, -233354, -275131, -78507, -229446, -103318, -219273, 61480, 22512, -248542, -277919, 40732, 130495, -271524, -87218, 279571, 67985, 123193, 163781, -260288, -267361, -202260, -29344, -31517, 146104, 149412, -180562, -214463, -108657, 38828, -170872, -165649, 555, -17167]
9544B01192a80761n1528N0093e2404j8396k05596P0525A79190C6428g1615j08700
9533a80315J4205P9434j08092R1471A16358m177b92786G3141J13105b07280C23911
9521b94894a08719A49227B9065b2566A86834b3571o0073G516b39905A05805b67083
9509b06284F1275a10181l88711G530J09272c41234J7013d9666A01612B3907a82943
9497b66968A01596a57305A97543p6385B834J23159a09665p3417B02435g1296B3694
9485B84012b16598f100j91611d9936A53797i8193j93359c8888j85645B65332a18437
9473I3163d60806I7351R0520a5752j99008c4073J6546A60500b59927a23091a5391
9461B0526L78250F8110a34598N7983K8590m43150A68044a18496I3325b49154D9303
$$ y = [201192, -180761, -232289, -182196, -52404, -70800, -276396, -205871, 179190, 36428, -71615, -180315, -166110, -86676, -194768, -103297, 116358, 112181, -292786, 73141, 186246, -207280, 323911, -294894, -108719, 149227, 29065, -22566, 186834, -23571, -83644, 7516, -239905, 105805, -267083, -206284, 61275, -110181, -498892, 7530, 116802, -341234, -324221, -49666, 101612, 23907, -182943, -266968, 101596, -157305, 197543, 121158, 2834, 125993, -109665, -183082, 202435, -71296, 23694, 284012, -216598, -6100, -197711, -49936, 153797, -98193, -291552, -38888, -224533, 265332, -118437, 93163, -460806, 97351, 187871, -15752, -214760, -34073, -17527, 160500, -259927, -123091, -15391, 20526, 398776, 68110, -134598, -76615, -48025, -491175, 168044, -118496, 93325, -249154, 49303]
9449c31654A12641a65242K6173J0066H2258a90496B5975a59158l40418a49757
9438b39506C2822J06298R7526Q4208A4267O589h0924A0391a56181I8069P708b82234
9425C8912a56732A1632h2771Q427F0675c08601A50483b12569i4481B13868a31847
9413B34267O5666b4568k9523m8084B05262J21973g3036E2320B4508b63627p5125
9402c38752D27803e1997j82120P767c1939E01670b09681K2089c7444l50918h5679
9390G1393c2741l4058b3374j44472P9139q684l5773B2611N005a86135L3241P3831
9378g9063J545o4414A326a40144A71993k2243B763g68l7736l21818J63351C3064
9365A78017c8045j61258n2467a19201k6056C6153a00631K6457j3875M3524C2395
$$ y = [-331654, 112641, -165242, -139069, -129003, 82258, -190496, 25975, -159158, -499576, -149757, -239506, 32822, 139120, 236646, 320854, 14267, 20856, -80924, 10391, -156181, 98069, 105777, -282234, 38912, -156732, 11632, -82771, -74344, 60675, -308601, 150483, -212569, -94481, 213868, -131847, 234267, 299933, -24568, -54091, -102175, 205262, 327235, -73036, 52320, 24508, -263627, -338752, 427803, -51997, -234117, -226350, -31939, 501670, -209681, -187592, -37444, -388362, -85679, 71393, -32741, -66799, -23374, -167846, -88707, -97391, -133164, 22611, 27616, -186135, -152894, -79063, -77518, -141932, 1326, -140144, 171993, 149750, 2763, -768, -38504, -360322, -196971, 33064, 178017, -38045, -199303, -251770, -119201, -145257, 36153, -100631, -74174, -88049, -44525, 32395]
9353A35366L8614b55693B0052K03314b29664K7234A07321O9421b97691l7811D36618
9341g7512j36316a3406j63958M4349d9330O632B43640j02033a33627B51700a46192
9329C30470B4032P5409a33967N1389q7898n6399b5243C06844A4111b18852A0896
9317A66512q1715a46990H6282B1502Q4569h8713j78752p8366B8135b17976j84440
9306d02416H2170a46611r6276A21858a50291j53524H1480b11388H3031R8804b58085
9294C67800c33060A82994b18425R4114N8790o8698B88470b69279A46443D5655
9283d5711D5543d86210a9286l6229A29572c19458A01275h6015k0455q5146I3190
9271d74696a04703p6861K3954b8095A32336l9297r104B3120a58171R870M3194
$$ y = [135366, 173980, -255693, 20052, 223366, -229664, -202430, 107321, 176742, -297691, -335502, 436618, -77512, -213828, -13406, -177364, -133015, -49330, -42698, 243640, 141607, -133627, 251700, -146192, 330470, 24032, 99441, -133967, -82578, -170476, -226875, -25243, 306844, 14111, -218852, 10896, 166512, 84797, -146990, 86282, 21502, 106071, -88713, -267465, -345831, 28135, -217976, -402416, 82170, -146611, -242887, 121858, -150291, -303815, 81480, -211388, 83031, 181835, -258085, 367800, -333060, 182994, -218425, -124311, -65521, -134219, 288470, -269279, 146443, 45655, -45711, 45543, -486210, -19286, -55515, 129572, -319458, 101275, -86015, -106470, -191616, 93190, -474696, -104703, -181564, -157610, -28095, 132336, 93039, 83935, 23120, -158171, -148301, -105107]
9260a05107j49195j31908a58489A35508b21178d5463a706k14693a0364m5128C7243
9248F216Q1315d1839p0080A48252M2983a37373F5252J25617N6218a34079C8912
9236A78012N9B1174a70340B237i067B50493f6231j54619C69205a85494Q2771j0934
9224a13657Q967F0742N5051a17763d5968H534g1252H0171c22926m8516D7535a02396
9211A63167a0686F6367j7764Q6279b52139a16302e0323l87196G4099M2743J32768
9200B49610e8200q4930k84489a11873k47128A5511b13034b8120j59913j10459
9190b98492f2440j51809h258o871A88163m171E0099P9415k5567J05077B5676K4852
9178E0528K74402a44881N8616C27426E3745a18932I8250g627j36052o3833p3139
$$ y = [-105107, -254302, -386210, -158489, 135508, -221178, -45463, -1706, -216399, -10364, -55492, 37243, 6216, 87531, -41839, -111919, 148252, 191235, -137373, 65252, 190869, 247087, -134079, 38912, 178012, 178071, 21174, -170340, 2237, -9067, 250493, -66231, -220850, 369205, -185494, -102723, -113657, -104690, 60742, 115793, -117763, -45968, 8534, -71252, 80171, -322926, -371442, 47535, -102396, 163167, -10686, 66367, 48603, 134882, -252139, -116302, -50323, -437519, 74099, 116842, 249610, -58200, -143130, -427619, -111873, -359001, 15511, -213034, -28120, -188033, -298492, -62440, -214249, -8258, -15129, 188163, 183992, 50099, 129514, 103947, 209024, 25676, 50528, 324930, -144881, -86265, 327426, 53745, -118932, 98250, -7627, -143679, -207512, -280651]
9167b80651Q8664k55202J55719J2550e2640j41338E4455a03639k2263B46267a83848
9155A3794e6305D5804J00091d55229a57731A93322d02901C6690M06099b64022
9144i0003a7424C018a40859O7283C5752e9943l78342E5144K84617a00877k0806
9133a21683B226b32566d1608j89244F3953j7087a6050A05638a51043f0280A14010
9121e0321p7891A01493c03565h1988r0457h5064o6613M1981r3636f4100p8027
9110a42127A6862b20907A71984a91321j14062a37842L2270j8447m1331m47225
9100f12575g5980A99346n1244E2922O0771M8767b8078k20500H1495a12804J1516
9089a01288q3608I1187a21783M1645k4658d8606j7907k80255H585a81390A10092
$$ y = [-280651, -191987, -447189, -291470, -278920, -52640, -193978, 54455, -103639, -125902, 246267, -183848, 13794, -56305, 45804, 145895, -455229, -157731, 193322, -402901, 36690, 442789, -264022, -90003, -17424, 3018, -140859, -73576, 35752, -59943, -438285, 55144, 339761, -100877, -121683, 2226, -232566, -41608, -230852, 63953, 46866, -16050, 105638, -151043, -60280, 114010, -50321, -128212, 101493, -303565, -81988, -172445, -85064, -151677, -109696, -203332, -64100, -142127, 16862, -220907, 171984, -191321, -305383, -137842, -105572, -124019, -165350, -612575, -75980, 199346, 148102, 52922, 113693, 162460, -28078, -248578, 81495, -112804, -101288, -184896, 91187, -121783, -80138, -104796, -48606, -66513, -346768, 8585, -181390, 110092]
9077d0645m53142c6692B3736a45564n3948b405q0284B3766a3618j76491a2381
9065a9045A91846a28052n2213j22586j1219F2233J86066p9977N0521e9625C8387
9053a05462A53376o1476a22867d7687k99166A41850c07611G0661g6670B13716
9042a95792j23970R333E4404L69034a85130H721c52444B13827D0067J99389I9782
9030c31584J50597a3383o517F426K89c65676j84741a74589F9556b95831B34554
9018b6605C0159b18459A06903d0243F9966l4556a43475A00161j8308I029i498
9006d41819a72252l49720a36171K9031A2008f7434r8933I178K957L16713g4637
8994b01220P8424H21J72507J37777d00719J84952f2138b7437j49328g8045j49161
$$ y = [-40645, -493787, -36692, 23736, -145564, -199512, -2405, -82689, 23766, -13618, -190109, -12381, -19045, 191846, -128052, -180265, -302851, -314070, 62233, 248299, 168322, 218843, -59625, 38387, -105462, 153376, 91900, -122867, -47687, -346853, 141850, -307611, 70661, -76670, 213716, -195792, -319762, -310429, 54404, 423438, -185130, 8721, -352444, 213827, 40067, 239456, 99782, -331584, -180987, -13383, -19900, 6426, 6715, -365676, -550417, -174589, 69556, -295831, 234554, -26605, 30159, -218459, 106903, -40243, 69966, 35410, -143475, 100161, 81853, 9029, -9498, -441819, -172252, -521972, -136171, -107140, 12008, -67434, -166367, 9178, 12135, 328848, -74637, -201220, -122796, 821, 173328, 311105, -400719, -215767, -62138, -27437, -176765, -78045, -227206]
8983b27206h7065K256a2455D9099a27302j85972A15303i9338m49617A12503b08482
8971a18959A62492h9672l8394A38382b33216d4428l8797j3791d4926m602j96454
8960b45982A51203b78442A27561n670C5586P1469a64382g3081n2486A34275j408
8949A32867a99246R8050j09655B72609H2645b89333h8288m4351k9982G6180d5731
8937E1372B1397J4865J02497J25394A9782b10824A48675R7323J07527f536A87951
8925G2460K65636P16732J964583L057276J863839C291983A020402A63330C8731
8915E4607O6767a49674n1475N2606d9769B56050o9258m2557g3193j65017A62525
8903c8544k26212f2488E555K2753b73158O1202k97451D8705d1394J224l7815H0346
$$ y = [-227206, -87065, -84809, -12455, 49099, -127302, -313274, 115303, -99338, -548955, 112503, -208482, -118959, 162492, -89672, -128066, 138382, -233216, -44428, -83225, -97016, -44926, -49528, -245982, 151203, -278442, 127561, 121891, 35586, 107055, -164382, -73081, -125567, 134275, 132867, -199246, -101196, -210851, 272609, 82645, -289333, -88288, -132639, -162621, 76180, -45731, 51372, 21397, 36262, 138759, 264153, 19782, -210824, 148675, 245998, 353525, -6536, 187951, 72460, 338096, 1054828, 3019411, 6076687, 7940526, 3291983, 1020402, 163330, 38731, 54607, 121374, -149674, -201149, -148543, -49769, 256050, 186792, 144235, -73193, -238210, 162525, -38544, -264756, -62488, 5555, 28308, -273158, -211956, -509407, 48705, -41394, -40170, -77985, 80346]
8890b32833G0214B373O5370K9738k6542a91846D05653o6187B5202c3713e781B9270
8877c79711a27551o0022H896d63441a49501A60583d8539E671b70738P9531D6079
8865A13867B6352J21228D2500a51458g0075m5562n1850H5639j3908a67430e8671
8853A29375A0439L17818a69615l73250a09613l29865B09053l4365a04191L254
$$ y = [-232833, 70214, 2373, 67743, 97481, 70939, -191846, 405653, 339466, 25202, -33713, -5781, 29270, -379711, -127551, -187573, 8896, -463441, -149501, 160583, -48539, 5671, -270738, -191207, 46079, 113867, 26352, 147580, 42500, -151458, -70075, -115637, -167487, 85639, 71731, -167430, -58671, 129375, 10439, 328257, -169615, -542865, -109613, -439478, 209053, 174688, -104191, -100937]
$$ [...]
##END NTUPLES=NMR SPECTRUM
##END=
