
##TITLE=UV1208_M4_1332-1205_7185158_9ul7dUagAP
##JCAMPDX= 6.0         $$ Bruker NMR JCAMP-DX V2.0
##DATA TYPE= NMR SPECTRUM
##DATA CLASS= NTUPLES
##ORIGIN= BRUKER
##OWNER= Administrator
$$ 1.72 TOPSPIN		Version 2.1
$$ 2012-12-05 22:55:13.263 -0500  Administrator@X
$$ Compression mode = diff/dup
##.OBSERVE FREQUENCY= 400.02188249412
##.OBSERVE NUCLEUS= ^1H
##.ACQUISITION MODE= SIMULTANEOUS (DQD)
##.ACQUISITION SCHEME= undefined
##.AVERAGES= 64
##.DIGITISER RES= 22
##SPECTROMETER/DATA SYSTEM= spect
##.PULSE SEQUENCE= noesygpps1d.comp
##.SOLVENT NAME= COFFEE_meoh
##.SHIFT REFERENCE= INTERNAL, COFFEE_meoh, 1, 14.96101
##AUDIT TRAIL= $$ (NUMBER, WHEN, WHO, WHERE, PROCESS, VERSION, WHAT)
$$ ##TITLE= Audit trail, TOPSPIN		Version 2.1
$$ ##JCAMPDX= 5.01
$$ ##ORIGIN= Bruker BioSpin GmbH
$$ ##OWNER= Administrator
$$ $$ E:\/data/COFFEE/nmr/UV1208_M4_1332-1205_7185158_9ul7dUagAP/12/pdata/1/auditp.txt
$$ ##AUDIT TRAIL=  $$ (NUMBER, WHEN, WHO, WHERE, PROCESS, VERSION, WHAT)
(   1,<2012-12-05 22:55:07.404 -0500>,<Administrator>,<X>,<go>,<TOPSPIN 2.1>,
      <created by zg
	started at 2012-12-05 22:43:37.638 -0500,
	POWCHK enabled, PULCHK disabled,
       configuration hash MD5:
       86 BA 57 50 F2 9D 5C 9B 26 00 A9 28 5F 66 2E 89
       data hash MD5: 64K
       4C F3 AC A9 E8 D0 F3 E9 FC 0C 5F 87 52 CD 00 F2>)
(   2,<2012-12-05 22:55:10.467 -0500>,<Administrator>,<X>,<proc1d>,<TOPSPIN 2.1>,
      <Start of raw data processing
       efp LB = 0.3 FT_mod = 6 PKNL = 1 PHC0 = 0 PHC1 = 0 SI = 128K 
       data hash MD5: 128K
       20 58 19 3E A9 21 B0 E9 82 AA 73 31 66 00 8C 2E>)
(   3,<2012-12-05 22:55:11.513 -0500>,<Administrator>,<X>,<proc1d>,<TOPSPIN 2.1>,
      <pk PHC0 = -83.82019 PHC1 = 0 
       data hash MD5: 128K
       0D D6 12 A2 8E EB E7 90 4C D8 36 8F D5 C0 4D 1C>)
(   4,<2012-12-05 22:55:12.217 -0500>,<Administrator>,<X>,<proc1d>,<TOPSPIN 2.1>,
      <abs ABSG = 1 
       data hash MD5: 128K
       84 78 17 A6 24 50 74 AD CB 89 00 A8 9A 31 90 80>)
(   5,<2012-12-05 22:55:12.404 -0500>,<Administrator>,<X>,<proc1d>,<TOPSPIN 2.1>,
      <abs ABSG = 2 
       data hash MD5: 128K
       30 E2 16 5F 5D FA 33 3B 26 F0 B1 8D F4 43 E6 28>)
(   6,<2012-12-05 22:55:12.576 -0500>,<Administrator>,<X>,<proc1d>,<TOPSPIN 2.1>,
      <abs ABSG = 3 
       data hash MD5: 128K
       3B 8C 2E 3E 98 28 D7 31 8D 7B 1E 87 93 F6 0D 78>)
(   7,<2012-12-05 22:55:12.732 -0500>,<Administrator>,<X>,<proc1d>,<TOPSPIN 2.1>,
      <abs ABSG = 4 
       data hash MD5: 128K
       C7 A8 E6 35 35 B8 A9 F2 A4 E3 34 79 D7 29 E4 8A>)
(   8,<2012-12-05 22:55:12.935 -0500>,<Administrator>,<X>,<proc1d>,<TOPSPIN 2.1>,
      <abs ABSG = 5 
       data hash MD5: 128K
       93 60 1F EA 91 C7 4D EE 82 66 BA 82 78 74 18 8C>)
$$ ##END=
$$ 
$$ $$ hash MD5
$$ $$ A3 D0 03 A1 FB DE 86 9B 54 30 45 F2 B9 B5 79 05
##$RELAX= 
##$RELAX= 
##$RELAX= 
##$RELAX= 
##$RELAX= 
##$RELAX= 
##$RELAX= 
##$RELAX= 
$$ Bruker specific parameters
$$ --------------------------
##$DU= <E:\>
##$EXPNO= 12
$$ [...]
##$TP07= 0
##$TPNAME0= <>
##$TPNAME1= <>
##$TPNAME2= <>
##$TPNAME3= <>
##$TPNAME4= <>
##$TPNAME5= <>
##$TPNAME6= <>
##$TPNAME7= <>
##$TPOAL= (0..7)
0.5 0.5 0.5 0.5 0.5 0.5 0.5 0.5
##$TPOFFS= (0..7)
0 0 0 0 0 0 0 0
##$TUNHIN= 0
##$TUNHOUT= 0
##$TUNXOUT= 0
##$USERA1= <user>
##$USERA2= <user>
##$USERA3= <user>
##$USERA4= <user>
##$USERA5= <user>
##$V9= 5
##$VALIST= <valist>
##$VCLIST= <CCCCCCCCCCCCCCC>
##$VD= 0
##$VDLIST= <DDDDDDDDDDDDDDD>
##$VPLIST= <PPPPPPPPPPPPPPP>
##$VTLIST= <TTTTTTTTTTTTTTT>
##$WBST= 1024
##$WBSW= 4
##$XGAIN= (0..3)
0 0 0 0
##$XL= 0
##$YL= 0
##$YMAX_a= 5990646
##$YMIN_a= -12119114
##$ZGOPTNS= <>
##$ZL1= 120
##$ZL2= 120
##$ZL3= 120
##$ZL4= 120
##$ABSF1= 14.96101
##$ABSF2= -5.597172
##$ABSG= 5
##$ABSL= 3
##$ALPHA= 0
##$AQORDER= 0
##$ASSFAC= 0
##$ASSFACI= 0
##$ASSFACX= 0
##$ASSWID= 0
##$AUNMP= <proc_prof1d_extract.lims>
##$AXLEFT= 0
##$AXNAME= <>
##$AXNUC= <1H>
##$AXRIGHT= 0
##$AXTYPE= 0
##$AXUNIT= <>
##$AZFE= 0.1
##$AZFW= 0.1
##$BCFW= 0
##$BC_mod= 0
##$BYTORDP= 0
##$COROFFS= 0
##$CY= 15
##$DATMOD= 1
##$DC= 0
##$DFILT= <>
##$DTYPP= 0
##$F1P= 0
##$F2P= 0
##$FCOR= 0.5
##$FTSIZE= 131072
##$FT_mod= 6
##$GAMMA= 0
##$GB= 0
##$INTBC= 1
##$INTSCL= 1
##$ISEN= 128
##$LB= 0.3
##$LEV0= 0
##$LPBIN= 0
##$MAXI= 10000
##$MC2= 0
##$MEAN= 0
##$ME_mod= 0
##$MI= 0
##$NCOEF= 0
##$NC_proc= -2
##$NLEV= 6
##$NOISF1= 0
##$NOISF2= 0
##$NSP= 0
##$NTH_PI= 0
##$NZP= 0
##$OFFSET= 14.96101
##$PC= 1
##$PHC0= -83.82019
##$PHC1= 0
##$PH_mod= 1
##$PKNL= yes
##$PPARMOD= 0
##$PPDIAG= 0
##$PPIPTYP= 0
##$PPMPNUM= 2147483647
##$PPRESOL= 1
##$PSCAL= 4
##$PSIGN= 0
##$PYNMP= <proc.py>
##$REVERSE= no
##$SF= 400.020009631832
##$SI= 131072
##$SIGF1= 0
##$SIGF2= 0
##$SINO= 400
##$SIOLD= 131072
##$SPECTYP= <>
##$SREGLST= <1H.CDCl3>
##$SSB= 0
##$STSI= 131072
##$STSR= 0
##$SW_p= 8223.68421052631
##$SYMM= 0
##$S_DEV= 0
##$TDeff= 65536
##$TDoff= 0
##$TI= <>
##$TILT= no
##$TM1= 0
##$TM2= 0
##$TOPLEV= 0
##$USERP1= <user>
##$USERP2= <user>
##$USERP3= <user>
##$USERP4= <user>
##$USERP5= <user>
##$WDW= 1
##$XDIM= 131072
##$YMAX_p= 405268091
##$YMIN_p= -11671
##$CURPLOT= <Network HP LaserJet P1505>
##$CURPRIN= <$Network HP LaserJet P1505>
##$DFORMAT= <normdp>
##$LAYOUT= <+/1D_H.xwp>
##$LFORMAT= <normlp>
##$PFORMAT= <normpl>
##$SURQMSG= 1
$$ End of Bruker specific parameters
$$ ---------------------------------
##NTUPLES= NMR SPECTRUM
##VAR_NAME=  FREQUENCY,     SPECTRUM/REAL,   SPECTRUM/IMAG
##SYMBOL=    X,             R,               I
##VAR_TYPE=  INDEPENDENT,   DEPENDENT,       DEPENDENT
##VAR_FORM=  AFFN,          ASDF,            ASDF
##VAR_DIM=   131072,        131072,          131072
##UNITS=     HZ,            ARBITRARY UNITS, ARBITRARY UNITS
##FACTOR=    0.0627417313425164, 1,          1
##FIRST=     8223.62146879497, -464,         -60831
##LAST=      0,             1591,            -61107
##MIN=       0,             -11671,          0
##MAX=       8223.62146879497, 405268091,    0
$$ Real data points
##PAGE= N=1
##DATA TABLE= (X++(R..R)), XYDATA
$$ [...]
$$ plain form
63926 3897073 3921736 3918275 3886984 3828595 3744548 3637085 3509145 3364320 3206729 3040439
63916 3040439 2868700 2693931 2518532 2345397 2177360 2016473 1864102 1721496 1589753
63907 1589753 1469333 1360025 1261500 1173551 1095808 1027574 968080 916645 872464 834500 801686
63896 801686 773092 747897 725449 705398 687484 671206 656004 641786 628890 617389 606816
63885 606816 596767 587493 579651 573774 570183 569081 570333 573422 577979 584310 593106 604754 619136
63872 619136 635932 654861 675748 698676 723944 751524 780645 810238 839806 869528 899556
63861 899556 929553 958941 987216 1013871 1038304 1060015 1078728 1094158 1105791 1113049 1115605 1113513
63849 1113513 1107146 1096985 1083317 1066093 1045231 1021060 994211 965089 933761 900520 866114
$$ packed form
63926C897073K4663l461l1291n8389q4047j07463j27940j44825j57591j66290
63916C040439j71739j74769j75399j73135j68037j60887j52371j42606j31743
63907A589753j20420j09308r8525q7949p7743o8234n9494n1435m4181l7964l2814
63896H01686k8594k5195k2448k0051j7914j6278j5202j4218j2896j1501j0573
63885F06816j0049r274p842n877l591j102J252L089M557O331Q796J1648J4382
63872F19136J6796J8929K0887K2928K5268K7580K9121K9593K9568K9722L0028
63861H99556K9997K9388K8275K6655K4433K1711J8713J5430J1633P258K556k092
63849A113513o367j0161j3668j7224k0862k4171k6849k9122l1328l3241l4406
$$ plain form
63838 866114 831063 795076 757739 719779 683117 649391 618730 590181 563011 537241 513120
63827 513120 490580 469364 449342 430530 412965 396771 382211 369447 358239 348093 338685 330036
63815 330036 322208 315013 308211 301922 296608 292447 288817 284699 279675 274336 269571 265680 262423 259661
63801 259661 257414 255333 252726 249393 245966 243083 240595 238067 235637 233789 232423 230805 228525 225955
63787 225955 223625 221639 219896 218450 217408 216771 216574 216862 217364 217539 217201 216734 216381 215717 214355 212869
63771 212869 212387 213195 214257 214310 213164 211732 211033 211337 212160 212897 213413 213994 214747 215242 214953 213984 213096 212977
63753 212977 213678 214798 215927 216755 217020 216747 216506 217113 218828 220987 222590 223242 223385 223692 224440 225503 226751
63736 226751 228223 229930 231680 233209 234474 235811 237752 240577 243971 247154 249438 250713 251533 252838
$$ packed form
63838H66114l5051l5987l7337l7960l6662l3726l0661k8549k7170k5770k4121
63827E13120k2540k1216k0022j8812j7565j6194j4560j2764j1208j0146r408q649
63815C30036p828p195o802o289n314m161l630m118n024n339m765l891l257k762
63801B59661k247k081k607l333l427k883k488k528k430j848j366j618k280k570
63787B25955k330j986j743j446j042o37j97K88N02J75l38m67l53o64j362j486
63771B12869m82Q08J062N3j146j432o99L04Q23P37N16N81P53M95k89r69q88j19
63753B12977P01J120J129Q28K65k73k41O07J715K159J603O52J43L07P48J063J248
63736B26751J472J707J750J529J265J337J941K825L394L183K284J275Q20J305
$$ plain form
63722 252838 255524 259922 265512 271276 276501 281153 285398 289028 291589 292906 293207 292794 291809 290233 287929
63707 287929 284850 281363 278134 275396 272610 269320 266146 264327 264313 265424 266939 268886 271493 274487 277385
63692 277385 280080 282716 285233 287458 289426 291242 292799 294041 295405 297546 300530 303595 305817 306867
63678 306867 307020 306608 305675 304208 302561 301389 301103 301550 302389 303547 305101 306860 308502 310014 311589 313038
63662 313038 313679 312982 311019 308285 305333 302583 300083 297347 293846 289703 285564 281783 278210 274814 271875
63647 271875 269385 266914 264424 262647 262174 262687 263536 264622 266207 268231 270399 272637 274945 277087 279000
63632 279000 281246 284457 288513 292846 297417 302766 309101 315978 322993 330332 338465 347603 357597 368207
63618 368207 379409 391474 404721 419220 435047 452748 472966 495367 518635 541994 566115
$$ packed form
63722B52838K686M398N590N764N225M652M245L630K561J317L01m13r85j576k304
63707B87929l079l487l229k738k786l290l174j819j4J111J515J947K607K994K898
63692B77385K695K636K517K225J968J816J557J242J364K141K984L065K222J050
63678C06867J53m12r33j467j647j172k86M47Q39J158J554J759J642J512J575J449
63662C13038O41o97j963k734k952k750k500k736l501m143m139l781l573l396k939
63647B71875k490k471k490j777m73N13Q49J086J585K024K168K238K308K142J913
63632B79000K246L211M056M333M571N349O335O877P015P339Q133R138R994J0610
63618C68207J1202J2065J3247J4499J5827J7701K0218K2401K3268K3359K4121
$$ plain form
63607 566115 591901 618944 646026 672511 698109 721581 740984 755342 765060 770596 771842 769135
63595 769135 763782 757015 749227 740732 732410 724804 717176 708142 696782 682640 665307 644985 623059
63582 623059 601197 579972 559032 538521 519457 502663 488098 475407 464516 455369 447723 441633
63570 441633 437772 436750 438282 441339 445046 449126 453643 458692 464396 470890 478231 486482 495911 506825
63556 506825 519113 532209 545776 560325 576916 596348 618774 643978 671749 701983 734546
63545 734546 768902 803638 836548 865507 889178 906620 916621 918301 912503 901881 889299 876531
63533 876531 864484 853761 844421 835850 827485 819158 810243 799126 784402 766193 745496 722614
63521 722614 697189 669588 641174 613109 585749 559322 534342 511094 489439 469375 451222
$$ packed form
63607E66115K5786K7043K7082K6485K5598K3472J9403J4358R718N536J246k707
63595G69135n353o767p788q495q322p606p628r034j1360j4142j7333k0322k1926
63582F23059k1862k1225k0940k0511j9064j6794j4565j2691j0891r147p646o090
63570D41633l861j022J532L057L707M080M517N049N704O494P341Q251R429J0914
63556E06825J2288J3096J3567J4549J6591J9432K2426K5204K7771L0234L2563
63545G34546L4356L4736L2910K8959K3671J7442J0001J680n798j0622j2582j2768
63533H76531j2047j0723r340q571q365q327q915j1117j4724j8209k0697k2882
63521G22614k5425k7601k8414k8065k7360k6427k4980k3248k1655k0064j8153
$$ plain form
63510 451222 435051 420547 407633 396537 386994 378145 369591 361899 355601 350311 345409 341079 338001
63497 338001 336255 335072 333564 331311 328433 325523 323434 322711 323115 323748 323629 322274 320035 317978 317143
63482 317143 317798 319594 322320 326055 330621 335529 340615 346037 351356 355306 357075 357303 357220 357158 356474 354667
63466 354667 351897 348493 344514 339863 334529 328705 322949 318045 314464 312031 310359 309414 309411 310436 312427
63451 312427 315295 318680 321884 324529 327170 330833 336068 342837 351133 361166 372974 386418 401693
63438 401693 419423 440050 463382 488810 515648 543102 570175 595803 618970 638682 654046
63427 654046 664576 670466 672674 672888 673308 676045 682483 693214 708500 728532 753103 781214 811267
63414 811267 841750 871655 900257 926569 949149 966528 977883 983347 983743 980023 972889 962900 950894
$$ packed form
63510D51222j6171j4504j2914j1096r543q849q554p692o298n290m902m330l078
63497C38001j746j183j508k253k878k910k089p23M04O33j19j355k239k057q35
63482C17143O55J796K726L735M566M908N086N422N319L950J769K28q3o2o84j807
63466C54667k770l404l979m651n334n824n756m904l581k433j672r45lJ025J991
63451C12427K868L385L204K645K641L663N235O769Q296J0033J1808J3444J5275
63438D01693J7730K0627K3332K5428K6838K7454K7073K5628K3167J9712J5364
63427F54046J0530N890K208K14M20K737O438J0731J5286K0032K4571K8111L0053
63414H11267L0483K9905K8602K6312K2580J7379J1355N464L96l720p134r989j2006
$$ plain form
63401 950894 938146 925749 913671 900640 885162 866590 845091 821018 794697 766670 737650
63390 737650 708237 678989 650574 623467 597655 573154 550655 531034 514339 499960 487746
63379 487746 478091 470838 465101 460563 458021 458010 459762 462282 465784 471062 478013 485801 494348 504576
63365 504576 517152 531847 548351 566978 588185 611849 637373 664283 692561 722569 754616
63354 754616 788292 822115 854068 882614 907137 927528 943575 954697 960239 960211 955884 949322 941967
63341 941967 933820 924205 912948 900374 886439 870569 852339 831842 809330 784904 758657 730907
63329 730907 702354 674239 648196 625532 606612 591117 578666 568849 560992 554455 549076 544723
63317 544723 540471 534764 526478 515273 500963 483397 463428 443371 425668 411030 398204 385638
$$ packed form
63401I50894j2748j2397j2078j3031j5478j8572k1499k4073k6321k8027k9020
63390G37650k9413k9248k8415k7107k5812k4501k2499j9621j6695j4379j2214
63379D87746r655p253n737m538k542j1J752K520L502N278O951P788Q547J0228
63365E04576J2576J4695J6504J8627K1207K3664K5524K6910K8278L0008L2047
63354G54616L3676L3823L1953K8546K4523K0391J6047J1122N542k8m327o562p355
63341I41967q147r615j1257j2574j3935j5870j8230k0497k2512k4426k6247k7750
63329G30907k8553k8115k6043k2664j8920j5495j2451r817p857o537n379m353
63317E44723m252n707q286j1205j4310j7566j9969k0057j7703j4638j2826j2566
$$ plain form
63305 385638 373137 361867 352982 346539 341740 337876 334592 331422 327757 323588 319803 317219 315600 314047
63291 314047 312091 309920 307757 305632 303698 302212 301096 299979 298714 297521 296553 295658 294588 293172 291419
63276 291419 289679 288511 288018 287534 286466 285196 284598 284928 285877 287508 290171 293436 296068 297441 298285 299646
63260 299646 301765 304321 307118 310025 312734 315135 317600 320502 323761 327196 330908 334972 339153 343397
63246 343397 348185 353903 360198 366545 373254 381250 390977 402083 414247 427659 442468 458180 474086
63233 474086 490158 507253 526350 547657 570482 593855 617163 640209 662917 685189 706972
63222 706972 728201 748716 768471 787779 807141 826835 846898 867335 887927 907804 925710
63211 925710 940813 952880 961542 965938 965397 960073 950526 936963 919301 897795 873243 846654 819028
$$ packed form
63305C85638j2501j1270q885o443m799l864l284l170l665m169l785k584j619j553
63291C14047j956k171k163k125j934j486j116j117j265j193r68q95j070j416j753
63276B91419j740j168m93m84j068j270n98L30R49J631K663L265K632J373Q44J361
63260B99646K119K556K797K907K709K401K465K902L259L435L712M064M181M244
63246C43397M788N718O295O347O709P996R727J1106J2164J3412J4809J5712J5906
63233D74086J6072J7095J9097K1307K2825K3373K3308K3046K2708K2272K1783
63222G06972K1229K0515J9755J9308J9362J9694K0063K0437K0592J9877J7906
63211I25710J5103J2067Q662M396n41n324r547j3563j7662k1506k4552k6589k7626
$$ plain form
63198 819028 791393 764734 739771 716875 696167 677659 661468 647960 637567 630376 626091 624481
63186 624481 625627 629649 636412 645612 656936 669991 684358 699842 716426 733808 751261 768230
63174 768230 784865 801752 819215 836991 854395 870634 885200 898126 909712 919845 927785 932649
63162 932649 933776 930584 922648 910223 894231 875266 852958 826846 797630 767030 736525 706768
63150 706768 678066 650777 625071 600846 578139 557280 538459 521463 506127 492810 482076
63139 482076 473858 467159 460707 453914 447215 441485 437209 434165 431745 429409 426927 424536 422874 422479
63125 422479 423188 424290 425370 426745 428871 431678 434752 437938 441365 445031 448758 452540 456569 460836
63111 460836 465012 468798 472250 475625 478986 482051 484491 486365 488161 490280 492578 494693 496733 499217
$$ packed form
63198H19028k7635k6659k4963k2896k0708j8508j6191j3508j0393p191m285j610
63186F24481J146M022O763R200J1324J3055J4367J5484J6584J7382J7453J6969
63174G68230J6635J6887J7463J7776J7404J6239J4566J2926J1586J0133P940M864
63162I32649J127l192p936j2425j5992j8965k2308k6112k9216l0600l0505k9757
63150G06768k8702k7289k5706k4225k2707k0859j8821j6996j5336j3317j0734
63139D82076q218o699o452o793o699n730m276l044k420k336k482k391j662l95
63125D22479P09J102J080J375K126K807L074L186L427L666L727L782M029M267
63111D60836M176L786L452L375L361L065K440J874J796K119K298K115K040K484
$$ plain form
63097 499217 502213 504990 506760 507466 507595 507579 507663 507961 508239 507930 506821 505485 504619 504224 503917 503787 504268 505384
63079 505384 506819 508682 511367 514614 517542 520004 523141 528041 534437 541305 548344 556136 565082 574937
63065 574937 585410 596591 608622 621444 635232 650740 668838 689827 713447 739456 767951
63054 767951 799105 832862 869016 907457 948228 991407 1037034 1085038 1135052 1186342 1238112
63043 1238112 1289882 1341380 1392160 1441728 1490256 1538730 1587955 1637527 1686210 1733315 1779306
63032 1779306 1824937 1870081 1913486 1953277 1987486 2014469 2033244 2043360 2044212 2034695 2013994 1982688
63020 1982688 1942662 1895744 1842757 1784132 1721164 1656307 1592280 1531068 1473613 1420090 1370518
63009 1370518 1325498 1286432 1254696 1230474 1212835 1201143 1195914 1197807 1206126 1218968 1234824 1253513
$$ packed form
63097D99217K996K777J770P06J29j6Q4K98K78l09j109j336q66l95l07j30M81J116
63079E05384J435J863K685L247K928K462L137M900O396O868P039P792Q946R855
63065E74937J0473J1181J2031J2822J3788J5508J8098K0989K3620K6009K8495
63054G67951L1154L3757L6154L8441M0771M3179M5627M8004N0014N1290N1770
63043A238112N1770N1498N0780M9568M8528M8474M9225M9572M8683M7105M5991
63032A779306M5631M5144M3405L9791L4209K6983J8775J0116Q52r517k0701l1306
63020A982688m0026m6918n2987n8625o2968o4857o4027o1212n7455n3523m9572
63009A370518m5020l9066l1736k4222j7639j1692n229J893Q319J2842J5856J8689
$$ plain form
62997 1253513 1275506 1300829 1328751 1358069 1387503 1416287 1444707 1473758 1503952 1534643 1564632
62986 1564632 1593076 1619495 1643310 1663866 1680774 1693679 1701646 1703169 1696950 1682563 1660410 1631295
62974 1631295 1596012 1555087 1508829 1457786 1403233 1347041 1291018 1236345 1183548 1132811 1084288
62963 1084288 1038300 995295 955609 919258 886004 855582 827814 802553 779543 758291 738119
62952 738119 718507 699414 681145 663874 647496 631929 617216 603222 589573 576154 563385
62941 563385 551744 541297 531948 523825 516950 510723 504293 497444 490765 484896 479995 475941 472600 469772
62927 469772 467177 464675 462290 459959 457542 455122 452953 450936 448515 445451 442494 440856 440925 441740 441939
62912 441939 441107 439948 439104 438174 436322 433680 431516 430728 430734 430354 429377 428543 428216 427922 427340 426875 426866 426890 426488
$$ packed form
62997A253513K1993K5323K7922K9318K9434K8784K8420K9051L0194L0691K9989
62986A564632K8444K6419K3815K0556J6908J2905P967J523o219j4387k2153k9115
62974A631295l5283m0925m6258n1043n4553n6192n6023n4673n2797n0737m8523
62963A084288m5988m3005l9686l6351l3254l0422k7768k5261k3010k1252k0172
62952G38119j9612j9093j8269j7271j6378j5567j4713j3994j3649j3419j2769
62941E63385j1641j0447r349q123o875o227o430o849o679n869m901m054l341k828
62927D69772k595k502k385k331k417k420k169k017k421l064k957j638O9Q15J99
62912D41939q32j159q44r30j852k642k164p88Ol80r77q34l27k94n82m65rK4m02
$$ plain form
62893 426488 426119 426673 428212 429770 430435 430102 429167 428025 427047 426584 426631 426758 426686 426712 427206 427839 427768 426666 425200
62874 425200 424293 424111 424063 423651 423032 422654 422535 422115 420855 418903 417072 416026 415573 414966 413897 412859 412403
62857 412403 412406 412400 412333 412468 412733 412816 412929 413811 415735 418048 419965 421281 422019 422000 421342 420863 421166 421626 421014 419077
62837 419077 416783 415042 414010 413723 414464 416037 417392 417658 417164 416861 417025 417177 417108 417221 417799 418567 419318
62820 419318 420476 422598 425510 428367 430527 432133 433883 436488 440292 445088 450252 455349 460622 466555
62806 466555 472946 478940 484238 489715 496253 503433 510175 516504 523769 533006 543895 555633 568026
62793 568026 581215 595025 609342 624798 642470 663138 687249 715222 747227 782976 822376
62782 822376 866173 915348 970063 1029805 1094320 1163674 1237556 1315288 1396373 1480133 1564814
$$ packed form
62893D26488l69N54J539J558O65l33r35j142r78m63M7J27p2K6M94O33p1j102j466
62874D25200r07j82m8m12o19l78j19m20j260j952j831j046m53o07j069j038m56
62857D12403Loo7J35K65Q3J13Q82J924K313J917J316P38j9o58m79L03M60o12j937
62837D19077k294j741j032k87P41J573J355K66m94l03J64J52o9J13N78P68P51
62820D19318J158K122K912K857K160J606J750K605L804M796N164N097N273N933
62806D66555O391N994N298N477O538P180O742O329P265R237J0889J1738J2393
62793E68026J3189J3810J4317J5456J7672K0668K4111K7973L2005L5749L9400
62782H22376M3797M9175N4715N9742O4515O9354P3882P7732Q1085Q3760Q4681
$$ plain form
62771 1564814 1647942 1727727 1803126 1872304 1932151 1980013 2015125 2037653 2047140 2042811 2024849 1994296
62759 1994296 1951970 1898514 1835541 1765806 1691912 1615458 1537561 1459545 1382686 1307755 1235299
62748 1235299 1166152 1101237 1040940 984942 932764 884373 840248 800877 766155 735240 707094
62737 707094 681149 657466 636343 617925 602087 588450 576486 565878 556828 549747 544477 540112
62725 540112 535863 531939 529183 527913 527597 527814 528994 531757 535800 540071 544102 548704 555147 563963 574826
62710 574826 587299 601375 617365 635581 656153 679100 704605 733152 765188 800664 839277
62699 839277 881272 927511 978472 1033636 1092216 1154040 1219040 1286258 1354085 1421270 1486782
62688 1486782 1548764 1604618 1652443 1691481 1720747 1738206 1742215 1733268 1713385 1683993 1645233 1597240
$$ packed form
62771A564814Q3128P9785P5399O9178N9847M7862L5112K2528R487m329j7962l0553
62759A994296m2326n3456o2973o9735p3894p6454p7897p8016p6859p4931p2456
62748A235299o9147o4915o0297n5998n2178m8391m4125l9371l4722l0915k8146
62737G07094k5945k3683k1123j8418j5838j3637j1964j0608r050p081n270m365
62725E40112m249l924k756j270l16K17J180K763M043M271M031M602O443Q816J0863
62710E74826J2473J4076J5990J8216K0572K2947K5505K8547L2036L5476L8613
62699H39277M1995M6239N0961N5164N8580O1824O5000O7218O7827O7185O5512
62688A486782O1982N5854M7825L9038K9266J7459M009q947j9883k9392l8760m7993
$$ plain form
62676 1597240 1541269 1479344 1413473 1345528 1277373 1210561 1146024 1084202 1025373 969750 917570
62665 917570 869289 825476 786231 750871 718491 688751 661770 637341 614734 593479 573981
62654 573981 556995 542670 530397 519477 509516 500242 491450 483241 475916 469403 463117 456639 450239
62641 450239 444489 439659 435812 433130 431637 430818 429976 428929 427922 426947 425661 423959 422203 420760 419690
62626 419690 418887 418191 417349 416283 415416 415296 415872 416577 417177 418018 419373 421135 423406 426750 431375 436554
62610 436554 441383 445892 450864 456742 463204 469880 477056 485530 495923 508245 522129 537477 554809
62597 554809 574873 598103 624650 654721 688273 724395 761641 799296 837792 877513 917597
62586 917597 956308 992192 1024329 1051755 1073294 1088030 1095587 1095973 1089419 1076334 1057195 1032542
$$ packed form
62676A597240n5971o1925o5871o7945o8155o6812o4537o1822n8829n5623n2180
62665I17570m8281m3813l9245l5360l2380k9740k6981k4429k2607k1255j9498
62654E73981j6986j4325j2273j0920r961r274q792q209p325o513o286o478o400
62641D50239n750m830l847k682j493q19q42j047j007r75j286j702j756j443j070
62626D19690q03o96q42j066q67j20N76P05O00Q41J355J762K271L344M625N179
62610D36554M829M509M972N878O462O676P176Q474J0393J2322J3884J5348J7332
62597E54809K0064K3230K6547L0071L3552L6122L7246L7655L8496L9721M0084
62586I17597L8711L5884L2137K7426K1539J4736P557L86o554j3085j9139k4653
$$ plain form
62574 1032542 1003202 970285 934763 897321 858818 820525 783466 747832 713555 681218 651786
62563 651786 625520 601754 579811 559622 541352 524919 510124 496870 485018 474289 464481 455595
62551 455595 447673 440776 435130 430909 427703 424585 421043 417618 415280 414308 414137 414192 414476 415194 416122 416658
62535 416658 416455 415826 415473 415910 417133 418769 420493 422398 425026 428948 434332 440961 448686 457674 468129
62520 468129 480059 493560 509111 527235 547947 570902 596047 623785 654382 687548 722677
62509 722677 759265 796992 835538 874286 911954 946732 977352 1003914 1026983 1045703 1057646
62498 1057646 1061008 1056456 1046277 1032216 1014778 994251 971554 947988 924664 902348 881575 862945
62486 862945 847404 836005 829143 826301 826884 830914 838474 848932 861411 875728 891937 908955 924556
$$ packed form
62574A032542k9340l2917l5522l7442l8503l8293l7059l5634l4277l2337k9432
62563F51786k6266k3766k1943k0189j8270j6433j4795j3254j1852j0729r808q886
62551D55595p922o897n646m221l206l118l542l425k338r72j71N5K84P18R28N36
62535D16658k03o29l53M37J223J636J724J905K628L922N384O629P725Q988J0455
62520D68129J1930J3501J5551J8124K0712K2955K5145K7738L0597L3166L5129
62509G22677L6588L7727L8546L8748L7668L4778L0620K6562K3069J8720J1943
62498A057646L362m552j0179j4061j7438k0527k2697k3566k3324k2316k0773j8630
62486H62945j5541j1399o862k842N83M030P560J0458J2479J4317J6209J7018J5601
$$ plain form
62473 924556 936992 945905 951320 952480 948293 938567 924135 905946 884489 860045 833040 804028
62461 804028 773599 742391 711093 680361 650801 622945 597113 573277 551256 531192 513720
62450 513720 499444 488102 478496 469535 461313 454837 450687 448339 446918 446221 446641 448389 451165 454473
62436 454473 457912 461222 464387 467621 470966 473924 475719 475927 474650 472202 468849 464729 459757 453685
62422 453685 446544 438930 431562 424644 417972 411552 405695 400498 395596 390559 385251 379820 374635 370261
62408 370261 367153 365217 363831 362380 360632 358627 356492 354467 352928 352220 352428 353260 354236 355190 356645
62393 356645 359289 362934 366318 368312 369034 369445 370240 371650 374004 377675 382436 387524 392484 397541 403097
62378 403097 409298 416123 423443 430955 438536 446669 456006 466454 477186 487654 498090 508948 520523
$$ packed form
62473I24556J2436Q913N415J160m187r726j4432j8189k1457k4444k7005k9012
62461H04028l0429l1208l1298l0732k9560k7856k5832k3836k2021k0064j7472
62450E13720j4276j1342r606q961q222o476m150k348j421o97M20J748K776L308
62436D54473L439L310L165L234L345K958J795K08j277k448l353m120m972o072
62422D53685p141p614p368o918o672o420n857n197m902n037n308n431n185m374
62408C70261l108j936j386j451j748k005k135k025j539p08K08Q32R76R54J455
62393C56645K644L645L384J994P22M11P95J410K354L671M761N088M960N057N556
62378D03097O201O825P320P512P581Q133R337J0448J0732J0468J0436J0858J1575
$$ plain form
62365 520523 533363 548429 566340 586870 609586 634728 663145 695593 732310 772963 816763
62354 816763 862823 910589 959662 1009104 1057278 1102555 1143825 1180100 1210059 1232420 1246621
62343 1246621 1252957 1252201 1245234 1232703 1214861 1191933 1164699 1134308 1101466 1066300 1029265 991669
62331 991669 955014 920284 888141 859185 833474 810232 788701 768967 751430 735727 720846
62320 720846 706066 691169 675862 659708 642691 625280 607814 590314 572991 556466 541265
62309 541265 527441 514864 503564 493597 484799 476897 469746 463337 457645 452574 448054 444123 440897
62296 440897 438407 436551 435316 434989 435868 437699 439754 441568 443241 444870 446211 447237 448591 450867 453734
62281 453734 456373 458675 461389 465095 469572 474294 478993 483565 487832 491671 495206 498800 503073 508901
$$ packed form
62365E20523J2840J5066J7911K0530K2716K5142K8417L2448L6717M0653M3800
62354H16763M6060M7766M9073M9442M8174M5277M1270L6275K9959K2361J4201
62343A246621O336p56o967j2531j7842k2928k7234l0391l2842l5166l7035l7596
62331I91669l6655l4730l2143k8956k5711k3242k1531j9734j7537j5703j4881
62320G20846j4780j4897j5307j6154j7017j7411j7466j7500j7323j6525j5201
62309E41265j3824j2577j1300r967q798p902p151o409n692n071m520l931l226
62296D40897k490j856j235l27Q79J831K055J814J673J629J341J026J354K276K867
62281D53734K639K302K714L706M477M722M699M572M267L839L535L594M273N828
$$ plain form
62267 508901 516975 527273 539236 552602 567833 585708 606802 631433 659769 691843 727749 767885
62255 767885 812670 861848 914352 968935 1024552 1079913 1133122 1182182 1225728 1263013 1293403
62244 1293403 1316230 1331042 1337756 1336625 1328241 1313432 1292961 1267406 1237430 1203908 1167564 1128785
62232 1128785 1088174 1047077 1007036 968726 931894 896391 862851 832190 804809 780478 758614
62221 758614 738502 719586 701830 685492 670286 655176 639439 623596 608711 594955 581550
62210 581550 568096 555141 543228 532155 521685 512337 504755 498632 493072 487923 484049 482151 481939
62197 481939 482666 483986 485992 488786 492377 496767 501884 507604 514026 521526 530301 540024 550136 560351
62183 560351 570703 581276 592067 602921 613338 622509 629877 635655 640618 645442 650520 656341 663668
$$ packed form
62267E08901Q074J0298J1963J3366J5231J7875K1094K4631K8336L2074L5906M0136
62255G67885M4785M9178N2504N4583N5617N5361N3209M9060M3546L7285L0390
62244A293403K2827J4812O714j131q384j4809k0471k5555k9976l3522l6344l8779
62232A128785m0611m1097m0041l8310l6832l5503l3540l0661k7381k4331k1864
62221G58614k0112j8916j7756j6338j5206j5110j5737j5843j4885j3756j3405
62210E81550j3454j2955j1913j1073j0470r348p582o123n560n149l874j898k12
62197D81939P27J320K006K794L591M390N117N720O422P500Q775R723J0112J0215
62183E60351J0352J0573J0791J0854J0417R171P368N778M963M824N078N821P327
$$ plain form
62170 663668 673128 684825 698595 714650 733865 757342 785642 818325 854111 891389 928627 964548
62158 964548 998224 1029026 1056334 1079297 1097071 1109280 1116060 1117548 1113553 1103818 1088453 1068045
62146 1068045 1043600 1016466 987927 958575 928287 897134 866156 836918 810431 786885 766287
62135 766287 748834 734486 722601 712411 703758 697104 692821 690639 689827 689828 690708 693058 697476 704078
62121 704078 712432 721941 732292 743501 755465 767508 778582 788030 796044 803147 809321 813870 816144
62108 816144 816172 814507 811718 808109 803713 798316 791653 783738 774938 765695 756368 747559 740371 735987 734878
62093 734878 736507 739808 743910 748520 753783 759845 766549 773584 780812 788240 795671 802673 809131 815633
62079 815633 823098 832106 842789 855207 869488 885559 903010 921368 940414 960145 980478 1001132
$$ packed form
62170F63668R460J1697J3770J6055J9215K3477K8300L2683L5786L7278L7238L5921
62158I64548L3676L0802K7308K2963J7774J2209O780J488l995r735j5365k0408
62146A068045k4445k7134k8539k9352l0288l1153l0978k9238k6487k3546k0598
62135G66287j7453j4348j1885j0190q653o654m283k182q12JQ80K350M418O602
62121G04078Q354R509J0351J1209J1964J2043J1074R448Q014P103O174M549K274
62108H16144K8j665k789l609m396n397o663p915q800r243r327q809p188m384j109
62093G34878J629L301M102M610N263O062O704P035P228P428P431P002O458O502
62079H15633P465R008J0683J2418J4281J6071J7451J8358J9046J9731K0333K0654
$$ plain form
62067 1001132 1021795 1042359 1062917 1083592 1104534 1125967 1147895 1169560 1189579 1207017 1222094
62056 1222094 1235368 1246381 1253826 1256988 1256259 1251987 1243702 1231064 1214855 1196187 1175062 1150607
62044 1150607 1122589 1091865 1059316 1025160 989579 953320 917196 881502 846417 812631 781045
62033 781045 751942 724913 699551 675833 653824 633509 615161 599417 586524 575667 565564
62022 565564 555805 547131 540269 535036 530840 527437 524542 521220 516614 511143 506012 501534 496977 492269
62008 492269 488637 486918 486297 485705 485608 487185 490260 493409 495993 498815 502608 506969 511077 514482 516776
61993 516776 517404 516425 514749 512996 510607 506643 501018 494344 486954 478771 470006 461361 453454 446372 439791
61978 439791 433322 426823 420638 415452 411636 408805 406206 403432 400558 397806 395445 393901 393560 394308 395551
$$ packed form
62067A001132K0663K0564K0558K0675K0942K1433K1928K1665K0019J7438J5077
62056A222094J3274J1013P445L162p29m272q285j2638j6209j8668k1125k4455
62044A150607k8018l0724l2549l4156l5581l6259l6124l5694l5085l3786l1586
62033G81045k9103k7029k5362k3718k2009k0315j8348j5744j2893j0857j0103
62022E65564r759q674o862n233m196l403k895l322m606n471n131m478m557m708
62008D92269l632j719o21n92r7J577L075L149K584K822L793M361M108L405K294
61993E16776O28r79j676j753k389l964n625o674p390q183q765q645p907p082o581
61978D39791o469o499o185n186l816k831k599k774k874k752k361j544l41P48J243
$$ plain form
61963 395551 396749 397775 398700 399548 400437 401769 403902 406594 409066 410719 411751 412913 414769 417396 420655
61948 420655 424490 428854 433660 439028 445417 453371 463233 475138 489027 504520 521061 538423 556838
61935 556838 576335 596278 615903 635063 653965 672393 689735 705645 720109 732899 743596
61924 743596 752192 758977 763652 765225 763187 758297 751845 744601 736897 729280 722511 717092 713355 711888
61910 711888 713407 718096 725474 735009 746633 760427 775839 791434 805653 817891 828544 837733
61898 837733 844306 846634 844326 838501 830293 819817 806930 792285 776952 761367 745352 728961
61886 728961 712747 697259 682826 669743 658132 647540 637115 626392 615601 605201 595447 586510
61874 586510 578675 572100 566425 560873 554890 548798 543650 540221 538127 536325 534572 533917 535478 539215
$$ packed form
61963C95551J198J026R25Q48Q89J332K133K692K472J653J032J162J856K627L259
61948D20655L835M364M806N368O389P954R862J1905J3889J5493J6541J7362J8415
61935E56838J9497J9943J9625J9160J8902J8428J7342J5910J4464J2790J0697
61924G43596Q596O785M675J573k038m890o452p244p704p617o769n419l737j467
61910G11888J519M689P378R535J1624J3794J5412J5595J4219J2238J0653R189
61898H37733O573K328k308n825q208j0476j2887j4645j5333j5585j6015j6391
61886G28961j6214j5488j4433j3083j1611j0592j0425j0723j0791j0400r754q937
61874E86510p835o575n675n552n983o092n148l429k094j802j753o55J561L737
$$ plain form
61860 539215 544395 550790 558668 567906 578096 589666 604005 621978 642950 665801 690417 717581
61848 717581 747552 779468 812158 845027 877833 909892 939858 966347 988633 1006611 1020153
61837 1020153 1028724 1031778 1029439 1022670 1012869 1001468 989750 978669 968705 960143 953626 950246 950997
61824 950997 956222 965515 977851 991705 1005364 1017397 1026758 1032505 1033752 1030042 1021386 1007767 988955
61811 988955 965185 937641 907761 876280 843407 809759 776488 744548 714482 687022 663075
61800 663075 642671 624533 607320 590969 576283 563562 552414 542775 535165 529582 524804 519396
61788 519396 513128 506932 501566 496830 492152 487492 483386 480251 477931 475939 473929 471785 469451 466940
61774 466940 464596 463001 462345 462030 461194 459630 457865 456356 454982 453471 452024 451237 451502 452673 454217
$$ packed form
61860E39215N180O395P878R238J0190J1570J4339J7973K0972K2851K4616K7164
61848G17581K9971L1916L2690L2869L2806L2059K9966K6489K2286J7978J3542
61837A020153Q571L054k339o769r801j1401j1718j1081r964q562o517l380P51
61824I50997N225R293J2336J3854J3659J2033R361N747J247l710q656j3619j8812
61811I88955k3770k7544k9880l1481l2873l3648l3271l1940l0066k7460k3947
61800F63075k0404j8138j7213j6351j4686j2721j1148r639p610n583m778n408
61788E19396o268o196n366m736m678m660m106l135k320j992k010k144k334k511
61774D66940k344j595o56l15q36j564j765j509j374j511j447p87K65J171J544
$$ plain form
61759 454217 455607 456709 457869 459462 461295 462641 462956 462323 461125 459687 458442 457964 458363 458959 458989 458438
61743 458438 457631 456336 454018 450978 448378 446885 445940 444766 443541 443065 443678 445050 446746 448424 449652
61728 449652 450151 450314 450998 452654 454914 457148 459063 460648 461910 462978 464295 466350 469198 472397 475435
61713 475435 478036 480105 481620 482664 483419 483914 483895 483039 481269 478756 475737 472468 469273 466309 463335
61698 463335 459986 456356 452944 449892 446667 442814 438685 435044 432114 429518 427013 424745 422702 420417
61684 420417 417452 413852 409894 405671 401227 396940 393416 390949 389213 387551 385543 383332 381380 379908
61670 379908 378677 377382 376079 375003 374076 372948 371513 370082 368969 368133 367341 366454 365518 364808 364802 365837
61654 365837 367675 369683 371559 373580 375992 378474 380453 381797 382909 384266 386111 388517 391515 395069
$$ packed form
61759D54217J390J102J160J593J833J346L15o33j198j438j245m78L99N96L0n51
61743D58438q07j295k318l040k600j493r45j174j225m76O13J372J696J678J228
61728D49652M99J63O84J656K260K234J915J585J262J068J317K055K848L199L038
61713D75435K601K069J515J044P55M95j9q56j770k513l019l269l195k964k974
61698D63335l349l630l412l052l225l853m129l641k930k596k505k268k043k285
61684D20417k965l600l958m223m444m287l524k467j736j662k008k211j952j472
61670C79908j231j295j303j076r27j128j435j431j113q36p92q87r36p10oJ035
61654C65837J838K008J876K021K412K482J979J344J112J357J845K406K998L554
$$ plain form
61640 395069 398991 402918 406392 409057 410799 411681 411854 411565 410976 409730 406963 402272 396585 391455 387483
61625 387483 383996 380400 377068 374514 372432 370238 368092 366636 365942 365449 364882 364550 364650 364857 364740 364077
61609 364077 362608 359970 356212 352038 348221 344874 341448 337323 332294 326681 321155 316385 312721 310114
61595 310114 308238 306545 304377 301428 298165 295494 293766 292309 290160 287158 284084 281817 280584 280043
61581 280043 279742 279321 278453 277001 275245 273687 272514 271480 270469 269888 270128 270831 271150 270771 270212 270011 270072
61564 270072 270066 270054 270327 270930 271724 272724 273974 275211 276091 276685 277363 278216 278965 279517 280191 281248 282488 283503
61546 283503 284089 284244 284057 283898 284494 286412 289339 292155 293905 294689 295439 296869 298792 300541 301847 303065
61530 303065 304561 306214 307600 308466 308780 308521 307729 306710 305938 305645 305652 305654 305516 305202 304515 303129 300976 298583
$$ packed form
61640C95069L922L927L474K665J742Q82J73k89n89j246k767m691n687n130l972
61625C87483l487l596l332k554k082k194k146j456o94m93n67l32J00K07j17o63
61609C64077j469k638l758m174l817l347l426m125n029n613n526m770l664k607
61595C10114j876j693k168k949l263k671j728j457k149l002l074k267j233n41
61581B80043l01m21q68j452j756j558j173j034j011n81K40P03L19l79n59k01O1
61564B70072oj2K73O03P94J000J250J237Q80N94O78Q53P49N52O74J057J240J015
61546B83503N86J55j87j59N96J918K927K816J750P84P50J430J923J749J306J218
61530C03065J496J653J386Q66L14k59p92j019p72k93PKj38l14o87j386k153k393
$$ plain form
61512 298583 296811 296117 296168 296387 296809 298009 300083 302092 302882 302293 301235 300611 300490 300313 299551 298101 296220
61495 296220 294242 292297 290306 288330 286822 286338 287023 288563 290612 292968 295270 296864 297287 296822 296343
61480 296343 296576 297576 298887 300084 301141 302318 303754 305201 306246 306767 307046 307303 307287 306579 305328 304330
61464 304330 304247 304948 305858 306701 307580 308483 309234 309898 310706 311433 311434 310583 309679 309476 309793 310101 310529 311564 313027
61445 313027 314197 314883 315565 316476 317365 318329 319981 322487 325237 327911 331109 335283 339706 343229 345698
61430 345698 347898 350444 353439 356982 361154 365388 368477 369504 368633 367017 366146 367003 369398 372188 374451
61415 374451 376300 378322 380474 382062 382626 382315 381452 380199 378691 377025 375133 372952 370645 368254 365369
61400 365369 361714 357969 355336 354113 353290 351799 349658 347593 346040 344928 344096 343404 342545 341219 339585
$$ packed form
61512B98583j772o94N1K19M22J200K074K009P90n89j058o24j21j77p62j450j881
61495B96220j978j945j991j976j508m84O85J540K049K356K302J594M23m65m79
61480B96343K33J000J311J197J057J177J436J447J045N21K79K57j6p08j251r98
61464C04330q3P01R10Q43Q79R03P51O64Q08P27Jq51r04k03L17L08M28J035J463
61445C13027J170O86O82R11Q89R64J652K506K750K674L198M174M423L523K469
61430C45698K200K546K995L543M172M234L089J027q71j616q71Q57K395K790K263
61415C74451J849K022K152J588N64l11q63j253j508j666j892k181k307k391k885
61400C65369l655l745k633j223q23j491k141k065j553j112q32o92q59j326j634
$$ plain form
61385 339585 338286 337895 338419 339380 340274 340839 340936 340441 339498 338789 339159 340912 343703 347136 350994 354722 357298
61368 357298 358155 357961 357942 358624 359740 361079 362810 365008 367476 370030 372504 374554 376083 377837 380898
61353 380898 385519 391067 397228 404477 413066 422334 431506 440557 449649 458208 465297 470695 475042 479051
61339 479051 483128 487551 492324 496851 500408 503141 505964 509178 511713 512309 511105 509433 508107 506602
61325 506602 504111 500819 497642 495084 492935 490948 489146 487424 485490 483516 482318 482458 483445 484266 484572
61310 484572 485028 486656 490092 495336 501892 509226 517247 526216 536052 546094 555735 564847 573177 579788
61296 579788 583790 585367 585442 584425 581900 577481 571401 564325 557137 550797 545719 541242 536376 531071 526067
61281 526067 521514 516640 511091 505755 501785 499491 498713 499578 502134 505604 508823 511312 513452 515762 518486
$$ packed form
61385C39585j299l91N24R61Q94N65R7m95r43p09L70J753K791L433L858L728K576
61368C57298Q57j94j9O82J116J339J731K198K468K554K474K050J529J754L061
61353C80898M621N548O161P249Q589R268R172R051R092Q559P089N398M347M009
61339D79051M077M423M773M527L557K733K823L214K535N96j204j672j326j505
61325E06602k491l292l177k558k149j987j802j722j934j974j198J40R87Q21L06
61310D84572M56J628L436N244O556P334Q021Q969R836J0042R641R112Q330O611
61296E79788M002J577P5j017k525m419o080p076p188o340n078m477m866n305n004
61281E26067m553m874n549n336l970k294p78Q65K556L470L219K489K140K310K724
$$ plain form
61266 518486 521719 525394 529242 533231 537970 544114 551343 558546 565261 572414 581122 591084 600760 609185
61252 609185 616916 624837 632489 638309 641449 642637 642997 642668 641055 637979 633925 629427 624781 620221 615747
61237 615747 610870 605153 599040 593584 589226 585403 581463 577451 573840 571016 569259 568756 569319 570429 571825
61222 571825 573797 576718 580565 585007 589641 594077 598153 602198 606737 611830 617090 622358 627808 633213
61208 633213 637688 640531 641911 642428 642438 642206 642331 643504 646015 649843 655112 662135 671118 681973 694307
61193 694307 707529 721196 735295 749899 764482 778002 789780 799907 808669 816062 822092 826989
61181 826989 830766 832991 833473 832827 831949 831068 829640 826987 822867 817667 812194 806967 801509 794719 786134
61166 786134 776438 766531 756604 746412 735900 725017 713376 700750 687648 674906 662840 651309
$$ packed form
61266E18486L233L675L848L989M739O144P229P203O715P153Q708R962R676Q425
61252F09185P731P921P652N820L140J188L60l29j613l076m054m498m646m560m474
61237F15747m877n717o113n456m358l823l940m012l611k824j757n03N63J110J396
61222E71825J972K921L847M442M634M436M076M045M539N093N260N268N450N405
61208F33213M475K843J380N17J0k32J25J173K511L828N269P023Q983J0855J2334
61193F94307J3222J3667J4099J4604J4583J3520J1778J0127Q762P393O030M897
61181H26989L777K225M82o46q78q81j428k653m120n200n473n227n458o790q585
61166G86134r696r907r927j0192j0512j0883j1641j2626j3102j2742j2066j1531
$$ plain form
61154 651309 640411 630638 622440 615988 611265 608014 605689 603755 602002 600378 598690 596654 593968 590197
61140 590197 584922 578240 570767 563018 555254 548210 543124 540393 538795 536944 535086 534623 536118 538878
61126 538878 542453 547450 554534 563506 573842 585483 598554 612819 627981 644292 662346 682424
61114 682424 704355 727806 752265 776890 800930 824452 848252 872808 897517 921133 942797
61103 942797 962391 980041 995658 1008929 1019325 1026029 1028296 1026209 1020723 1012706 1002200 988913
61091 988913 973014 955017 935304 914360 893085 872094 850936 828814 805974 783522 761986
61080 761986 741048 720816 702214 685792 671092 657688 645936 636126 627726 620161 613654 608583
61068 608583 604607 601154 598339 596734 596575 597726 600009 603104 606595 610612 615813 622184 628566 634169
$$ packed form
61154F51309j0898r773q198o452m723l251k325j934j753j624j688k036k686l771
61140E90197n275o682p473p749p764p044n086k731j598j851j858m63J495K760
61126E38878L575M997P084Q972J0336J1641J3071J4265J5162J6311J8054K0078
61114F82424K1931K3451K4459K4625K4040K3522K3800K4556K4709K3616K1664
61103I42797J9594J7650J5617J3271J0396O704K267k087n486q017j0506j3287
61091I88913j5899j7997j9713k0944k1275k0991k1158k2122k2840k2452k1536
61080G61986k0938k0232j8602j6422j4700j3404j1752r810q400p565o507n071
61068F08583l976l453k815j605j59J151K283L095L491M017N201O371O382N603
$$ plain form
61054 634169 639983 647691 657579 668498 679702 691729 705420 720869 737609 755362 774466 795737
61042 795737 819825 846431 874477 903280 933261 965239 999438 1035524 1073112 1111884 1151738
61031 1151738 1193261 1237460 1284535 1333454 1383220 1433939 1486173 1540064 1595859 1654617 1717563
61020 1717563 1785277 1858156 1937177 2023695 2119226 2225951 2346507 2482907 2637190 2814136
61010 2814136 3022018 3269960 3567041 3926334 4368426 4919279 5606992 6462497 7517253
61001 7517253 8789266 10266686 11908432 13661572 15471497 17271632 18972426 20475334
60993 20475334 21705136 22629585 23253751 23608771 23752669 23769615 23743300 23711011 23636756 23429083
60983 23429083 22986204 22231734 21128609 19686778 17973135 16107486 14230336 12458692
$$ packed form
61054F34169N814P708R888J0919J1204J2027J3691J5449J6740J7753J9104K1271
61042G95737K4088K6606K8046K8803K9981L1978L4199L6086L7588L8772L9854
61031A151738M1523M4199M7075M8919M9766N0719N2234N3891N5795N8758O2946
61020A717563O7714P2879P9021Q6518R5531J06725J20556J36400J54283J76946
61010B814136K07882K47942K97081L59293M42092N50853O87713Q55505J054756
61001G517253J272013J477420J641746J753140J809925J800135J700794J502908
60993B0475334J229802R24449O24166L55020J43898J6946k6315l2289p4255k07673
60983B3429083m42879p54470j103125j441831j713643j865649j877150j771644
$$ plain form
60975 12458692 10861384 9463988 8265761 7251338 6397401 5679864 5078869 4577798 4160400
60966 4160400 3811477 3518906 3272791 3063675 2883535 2727457 2592233 2473896 2368331
60957 2368331 2273490 2188957 2113654 2045622 1983670 1927408 1875734 1826871 1779892 1734715 1690601
60946 1690601 1646176 1601171 1556799 1514033 1472581 1431860 1391924 1353064 1315301 1278560 1242674
60935 1242674 1207058 1171180 1135448 1100897 1067796 1035353 1002990 971193 940810 912167 885181
60924 885181 859790 835950 813624 793006 774369 757510 741810 726985 713413 701489 691021
60913 691021 681417 672205 663246 654707 647034 640724 636001 632757 630740 629614 628929 628292 627627 627168 627186 627701
60897 627701 628325 628388 627562 626361 625615 625305 624437 622235 618933 615102 610934 606715 603288 601110 599191 595863
$$ packed form
60975A2458692j597308j397396j198227j014423q53937p17537o00995n01071m17398
60966D160400l48923k92571k46115k09116j80140j56078j35224j18337j05565
60957B368331r4841q4533p5303o8032o1952n6262n1674m8863m6979m5177m4114
60946A690601m4425m5005m4372m2766m1452m0721l9936l8860l7763l6741l5886
60935A242674l5616l5878l5732l4551l3101l2443l2363l1797l0383k8643k6986
60924H85181k5391k3840k2326k0618j8637j6859j5700j4825j3572j1924j0468
60913F91021r604r212q959q539p673o310m723l244k017j126o85o37o65m59J8N15
60897F27701O24O3q26j201p46l10q68k202l302l831m168m219l427k178j919l328
$$ plain form
60881 595863 590548 584072 577336 570420 563083 555479 548102 541383 535490 530298 525581 521338 517751 514675
60867 514675 511563 508192 505037 502496 500201 497669 495205 493392 492017 490306 488071 485801 483666 481269
60853 481269 478496 475832 473679 471972 470631 469757 469169 468371 467246 466267 465715 465137 463905 461926 459525 456946
60837 456946 454329 451902 449797 447690 444978 441470 437860 435290 434237 433900 433044 431501 430418 430820 432449
60822 432449 434341 436026 437574 438911 439873 440702 441760 442799 443163 442704 441844 440802 439416 437734 436105
60807 436105 434552 432751 430773 429174 428093 426880 424958 422521 420046 417577 414900 412004 409003 405928
60793 405928 402978 400615 398995 397483 395191 391910 388232 384849 382020 379633 377445 375177 372587 369585
60779 369585 366327 363209 360728 359279 358931 359390 360166 360790 361030 361021 361193 361979 363619 366167 369518 373333 377074
$$ packed form
60881E95863n315o476o736o916p337p604p377o719n893n192m717m243l587l076
60867E14675l112l371l155k541k295k532k464j813j375j711k235k270k135k397
60853D81269k773k664k153j707j341q74n88p98j125r79n52n78j232j979k401k579
60837D56946k617k427k105k107k712l508l610k570j053l37q56j543j083M02J629
60822D32449J892J685J548J337R62Q29J058J039L64m59q60j042j386j682j629
60807D36105j553j801j978j599j081j213j922k437k475k469k677k896l001l075
60793D05928k950k363j620j512k292l281l678l383k829k387k188k268k590l002
60779C69585l258l118k481j449l48M59P76O24K40rJ72P86J640K548L351L815L741
$$ plain form
60762 377074 380261 382637 384134 384910 385501 386594 388422 390602 392703 394695 396658 398412 399769 400871 401958
60747 401958 403063 404287 406001 408301 410507 411769 411974 411558 410550 408409 404842 400214 395040 389534 383797
60732 383797 378110 372793 367967 363500 359068 354394 349653 345547 342702 341094 340215 339585 338803 337427 335338
60717 335338 333111 331525 330701 330074 329154 327935 326655 325578 324942 324684 324283 323312 322150 321739 322616 324460
60701 324460 326483 327982 328674 328990 329864 331740 333890 335181 335422 335463 336118 337628 340048 343379 347209 350908
60685 350908 354402 358223 362623 367184 371471 375543 379549 383344 386788 390053 393316 396418 399029 400970
60671 400970 402290 403277 404358 405603 406319 405548 403095 399670 396054 392541 389236 386301 383655 380862 377586
60656 377586 373965 370480 367709 366164 365916 366361 366806 367292 368375 370086 371765 373005 374100 375240 375880
$$ packed form
60762C77074L187K376J497P76N91J093J828K180K101J992J963J754J357J102J087
60747D01958J105J224J714K300K206J262K05m16j008k141l567m628n174n506n737
60732C83797n687n317m826m467m432m674m741m106k845j608q79o30p82j376k089
60717C35338k227j586q24o27r20j219j280j077o36k58m01r71j162m11Q77J844
60701C24460K023J499O92L16Q74J876K150J291K41M1O55J510K420L331L830L699
60685C50908L494L821M400M561M287M072M006L795L444L265L263L102K611J941
60671D00970J320R87J081J245P16p71k453l425l616l513l305k935k646k793l276
60656C77586l621l485k771j545k48M45M45M86J083J711J679J240J095J140O40
$$ plain form
60641 375880 375345 373659 371360 368804 366073 363352 360989 359215 358007 357147 356324 355289 353979 352439 350742
60626 350742 349149 348149 348000 348371 348752 349094 349670 350510 351481 352692 354261 355831 356972 357922 359159 360350
60610 360350 360601 359830 358980 358638 358351 357675 357046 357104 357835 358876 360038 361076 361567 361578 361913 363118 364728 366016
60592 366016 366995 368077 369131 369585 369239 368454 367763 367635 368351 369590 370423 370199 369291 368633 368792 369845 371813
60575 371813 374655 378003 381396 384759 388420 392804 398351 405453 414141 424009 434668 445950 457479
60562 457479 468426 478143 486696 494376 500868 505308 506944 505493 501161 494743 487494 480472 474113 468604
60548 468604 464336 461723 460907 462046 465488 471211 478432 486337 494989 504960 516297 528458 541201 554885
60534 554885 569779 585423 600767 614588 625787 633701 638338 640138 639400 636166 630669 623744 616643
$$ packed form
60641C75880n35j686k299k556k731k721k363j774j208q60q23j035j310j540j697
60626C50742j593j000j49L71L81L42N76Q40R71J211J569J570J141R50J237J191
60610C60350K51p71q50l42k87o76o29N8P31J041J162J038M91J1L35J205J610J288
60592C66016R79J082J054M54l46p85o91j28P16J239Q33k24r08o58J59J053J968
60575C71813K842L348L393L363L661M384N547P102Q688R868J0659J1282J1529
60562D57479J0947R717Q553P680O492M440J636j451m332o418p249p022o359n509
60548D68604m268k613q16J139L442N723P221P905Q652R971J1337J2161J2743J3684
60534E54885J4894J5644J5344J3821J1199P914M637J800p38l234n497o925p101
$$ plain form
60521 616643 610391 605217 600557 595650 590206 584527 579247 575181 573100 573081 574116 574959 575487 576711 579373
60506 579373 583266 588185 594793 603975 615937 630630 648621 670796 697405 727976 762074 799595
60494 799595 840368 883916 929553 976303 1022642 1066477 1105279 1136273 1157069 1166607 1165341 1154141
60482 1154141 1133351 1103227 1064908 1020443 972109 922135 872710 825535 781352 740323 702725
60471 702725 668899 638686 611494 586895 564730 544763 526726 510718 497099 485911 476644 468597
60459 468597 461187 454071 447254 441037 435547 430442 425321 420289 415846 412330 409694 407580 405388 402602
60445 402602 399377 396555 394739 393635 392689 391970 391871 392227 392375 391937 390990 389618 387912 386310 385288 384712
60429 384712 384135 383714 384142 385490 386750 386876 385816 384214 382544 380968 379794 379531 380383 381899 383284 384087
$$ packed form
60521F16643o252n174m660m907n444n679n280m066k081j9J035Q43N28J224K662
60506E79373L893M919O608R182J1962J4693J7991K2175K6609L0571L4098L7521
60494G99595M0773M3548M5637M6750M6339M3835L8802L0994K0796R538j266j1200
60482A154141k0790l0124l8319m4465m8334m9974m9425m7175m4183m1029l7598
60471G02725l3826l0213k7192k4599k2165j9967j8037j6008j3619j1188r267q047
60459D68597p410p116o817o217n490n105n121n032m443l516k636k114k192k786
60445D02602l225k822j816j104r46p19r9L56J48m38r47j372j706j602j022n76
60429C84712n77m21M28J348J260J26j060j602j670j576j174k63Q52J516J385Q03
$$ plain form
60413 384087 384515 385082 386042 387301 388777 390494 392288 393769 394718 395208 395251 394726 393899 393514 394032 395136 396378
60396 396378 397931 400229 403209 406404 409512 412451 415040 417143 418966 420819 422774 424868 427283 429899
60382 429899 432134 433788 435595 438217 441042 442873 443611 444336 445777 447677 449811 452623 456374 460320 463341
60367 463341 465028 465831 466441 467367 468818 470630 472346 473609 474522 475598 477371 480000 483278 487187 492402
60352 492402 499815 509448 520268 531243 541972 552011 560392 566570 571193 574974 577204 576457 572600
60339 572600 567055 561084 554797 547943 540704 533404 526283 519829 514568 510207 505703 500559 495414 491081
60325 491081 487685 485107 483483 482657 481722 479863 477384 475333 474292 474017 474153 474817 476518 479795 484936
60310 484936 491859 500293 510266 522378 537410 555626 576427 598660 621236 643348 664039 681747
$$ packed form
60413C84087M28N67R60J259J476J717J794J481R49M90M3n25q27l85N18J104J242
60396C96378J553K298K980L195L108K939K589K103J823J853J955K094K415K616
60382D29899K235J654J807K622K825J831P38P25J441J900K134K812L751L946L021
60367D63341J687Q03O10R26J451J812J716J263R13J076J773K629L278L909N215
60352D92402P413R633J0820J0975J0729J0039Q381O178M623L781K230p47l857
60339E72600n545n971o287o854p239p300p121o454n261m361m504n144n145m333
60325D91081l396k578j624q26r35j859k479k051j041k75J36O64J701L277N141
60310D84936O923Q434R973J2112J5032J8216K0801K2233K2576K2112K0691J7708
$$ plain form
60298 681747 694792 702423 704924 702505 694765 681671 664473 644868 623739 601527 579442 559229
60286 559229 541739 526668 513728 503221 495289 489449 485116 481859 478985 475646 471620 467387 463250
60273 463250 459053 454880 451231 448222 445412 442763 440942 440259 440001 439361 438393 437548 436891 436329 436068 436237
60257 436237 436478 436461 436435 436775 437348 437780 438044 438299 438480 438484 438529 438925 439729 440890 442426 444142 445571 446487 447157
60238 447157 447768 448037 447712 447051 446380 445589 444526 443558 443243 443689 444653 446016 447758 449651 451392 452901 454265
60221 454265 455552 456862 458310 459801 461222 462950 465670 469420 473441 477353 481890 487795 494499 500558
60207 500558 505234 509033 512885 517291 522161 526995 531276 534980 538575 542336 545990 549296 552502 555785
60193 555785 558729 560906 562586 564228 565591 566033 565508 564522 563217 561210 558390 555292 552512 550223 548262
$$ packed form
60298F81747J3045P631K501k419p740j3094j7198j9605k1129k2212k2085k0213
60286E59229j7490j5071j2940j0507p932n840m333l257k874l339m026m233m137
60273D63250m197m173l649l009k810k649j821o83k58o40r68q45o57n62k61J69
60257D36237K41j7k6L40N73M32K64K55J81MM5L96Q04J161J536J716J429R16O70
60238D47157O11K69l25o61o71p91j063r68l15M46R64J363J742J893J741J509J364
60221D54265J287J310J448J491J421J728K720L750M021L912M537N905O704O059
60207E00558M676L799L852M406M870M834M281L704L595L761L654L306L206L283
60193E55785K944K177J680J642J363M42n25r86j305k007k820l098k780k289j961
$$ plain form
60178 548262 546281 543773 540398 536420 532553 529378 527074 525528 524341 522927 521037 519064 517399 515676
60164 515676 513273 510488 508556 508313 509384 510836 512092 512914 512995 512149 510786 509768 509678 510360 511250 512071 513138
60147 513138 514941 517504 520266 522615 524350 525650 526828 528277 530403 533364 537010 541214 546079 551674
60133 551674 557771 564061 570417 576728 582685 587922 592178 595116 596307 595787 594409 593248 592718 592551 592452
60118 592452 592399 592404 592404 592412 592534 592853 593464 594463 595644 596375 596056 594662 592652 590557 588913 588173 588146 587671 585494
60099 585494 581574 577105 573248 570271 568003 566479 565803 565732 565784 565651 565262 564598 563758 563182 563500 565013 567355
60082 567355 569764 571690 573112 574331 575609 577019 578408 579254 578748 576399 572633 568495 564627 560742 556146
60067 556146 550464 543783 536487 529208 522636 517047 512115 507405 502884 498753 494991 491345 487676 484111
$$ packed form
60178E48262j981k508l375l978l867l175k304j546j187j414j890j973j665j723
60164E15676k403k785j932k43J071J452J256Q22Q1q46j363j018r0O82Q90Q21J067
60147E13138J803K563K762K349J735J300J178J449K126K961L646M204M865N595
60133E51674O097O290O356O311N957N237M256K938J191n20j378j161n30j67r9
60118E92452n3N%QJ22L19O11R99J181P31l19j394k010k095j644p40k7m75k177
60099E85494l920m469l857k977k268j524o76p1N2j33l89o64q40n76L18J513K342
60082E67355K409J926J422J219J278J410J389Q46n06k349l766m138l868l885m596
60067E56146n682o681p296p279o572n589m932m710m521m131l762l646l669l565
$$ plain form
60053 484111 480926 478415 476782 476034 476046 476773 478250 480378 482892 485598 488386 491072 493507 495889 498616
60038 498616 501761 504996 508050 510797 512904 513949 514069 513929 513795 513161 511607 509442 507157 504702 501732
60023 501732 498135 493896 488932 483512 478378 473882 469388 464079 458090 452272 447105 442348 437564 432532
60009 432532 427340 422445 418418 415295 412556 410031 408301 407684 407383 406325 404445 402461 400803 399496 398734
59994 398734 398697 399056 399495 400556 403068 406836 410715 413952 416674 419106 421203 423144 425350 427822 430065
59979 430065 431761 432901 433258 432577 431335 430488 430228 429716 428322 426390 424516 422821 421326 420391 420323 420980
59963 420980 422059 423358 424551 425292 425782 426677 428097 429289 429589 429175 428516 427734 426953 426613 426760 426566 425266
59946 425266 423285 421691 420811 420168 419679 419995 421370 422868 423212 422184 420775 420021 420022 420148 419927 419516 419337
$$ packed form
60053D84111l185k511j633p48J2P27J477K128K514K706K788K686K435K382K727
60038D98616L145L235L054K747K107J045J20j40j34o34j554k165k285k455k970
60023E01732l597m239m964n420n134m496m494n309n989n818n167m757m784n032
60009D32532n192m895m027l123k739k525j730o17l01j058j880j984j658j307p62
59994C98734l7L59M39J061K512L768L879L237K722K432K097J941K206K472K243
59979D30065J696J140L57o81j242q47k60n12j394j932j874j695j495r35o8O57
59963D20980J079J299J193P41M90Q95J420J192L00m14o59p82p81l40J47j94j300
59946D25266j981j594q80o43m89L16J375J498L44j028j409p54JJ26k21m11j79
$$ plain form
59929 419337 419558 420085 420902 422135 423793 425671 427576 429552 431844 434709 438227 442234 446505 451076 456211
59914 456211 461929 467756 473139 477885 481959 485101 487079 488186 489114 490279 491613 492936 494197 495307
59900 495307 496017 496072 495411 494304 493390 493320 494153 495363 496667 498452 501035 503939 506459 508564 510639 512634
59884 512634 514269 515875 518213 521537 525533 530099 535287 540489 544669 547625 550143 552649 554547 555271
59870 555271 555142 554631 553596 551876 550037 548724 547645 545918 543282 540447 538306 537237 537067 537450 538320
59855 538320 540113 543290 547566 552011 556120 560442 565865 572604 580075 587364 593578 598144 601191 603355
59841 603355 604962 605674 605167 603734 601879 599695 596992 593723 589898 585327 579826 573462 566413 558908 551545
59826 551545 545226 540364 536513 533106 530129 527649 525221 522445 519776 517980 516923 515594 513363 510571
$$ packed form
59929D19337K21N27Q17J233J658J878J905J976K292K865L518M007M271M571N135
59914D56211N718N827N383M746M074L142J978J107R28J165J334J323J261J110
59900D95307P10N5o61j107r14p0Q33J210J304J785K583K904K520K105K075J995
59884E12634J635J606K338L324L996M566N188N202M180K956K518K506J898P24
59870E55271j29n11j035j720j839j313j079j727k636k835k141j069j70L83Q70
59855E38320J793L177M276M445M109M322N423O739P471P289O214M566L047K164
59841F03355J607P12n07j433j855k184k703l269l825m571n501o364p049p505p363
59826E51545o319m862l851l407k977k480k428k776k669j796j057j329k231k792
$$ plain form
59812 510571 507832 505365 503176 501340 499804 498327 496884 495808 495264 494827 493927 492589 491377 490647 490097
59797 490097 489181 487779 486250 484853 483376 481475 479228 477123 475534 474405 473393 472116 470312 468051
59783 468051 465820 464093 462796 461449 459857 458290 456858 455169 452928 450594 449102 448988 449967 451232 452058
59768 452058 452331 452690 454003 456499 459551 462418 465022 467789 470964 474387 477846 481342 484970 488740 492613
59753 492613 496597 500721 504968 509350 514070 519433 525344 531020 535582 539080 542476 546401 550356 553571
59739 553571 556153 558746 561351 563303 564290 564583 564264 563112 561422 560061 559314 558421 556691 554451 552492
59724 552492 551189 550608 550814 551400 551348 550101 548419 547419 547067 546334 544655 542491 540513 538955 537831 537183
59708 537183 536894 536649 536238 535625 534761 533733 533058 533399 534843 536722 538292 539305 539895 540219 540425 540758 541452
$$ packed form
59812E10571k739k467k189j836j536j477j443j076n44m37r00j338j212p30n50
59797D90097r16j402j529j397j477j901k247k105j589j129j012j277j804k261
59783D68051k231j727j297j347j592j567j432j689k241k334j492j14R79J265Q26
59768D52058K73L59J313K496L052K867K604K767L175L423L459L496L628L770L873
59753D92613L984M124M247M382M720N363N911N676M562L498L396L925L955L215
59739E53571K582K593K605J952R87K93l19j152j690j361p47q93j730k240j959
59724E52492j303n81K06N86n2j247j682j000l52p33j679k164j978j558j124o48
59708E37183k89k45m11o13q64j028o75L41J444J879J570J013N90L24K06L33O94
$$ plain form
59691 541452 542477 543460 543909 543566 542598 541455 540493 539784 539199 538560 537684 536469 535033 533622 532360 531167
59675 531167 529927 528501 526608 523919 520418 516472 512445 508355 504026 499499 495243 491939 489866 488390
59661 488390 486377 483436 480520 478863 478580 478852 479274 480213 481831 483639 485254 486871 488618 490134 491223
59646 491223 492304 493746 495194 496037 496131 495651 494661 493283 491878 490590 489028 486872 484461 482381 480764
59631 480764 479412 478303 477524 476985 476555 476282 476151 475962 475669 475411 474939 473590 471216 468516 465925 462820
59615 462820 458594 453989 450442 448435 447377 446852 446999 447696 448366 448871 449890 452058 455187 458495 461266
59600 461266 463219 464589 465884 467289 468413 468912 469145 469739 470720 471600 472137 472422 472337 471669 470759 470311 470411
59583 470411 470351 469671 468827 468503 468714 468855 468344 467012 465114 463160 461526 460145 458769 457473 456559 455986 455328
$$ packed form
59691E41452J025R83M49l43r68j143r62p09n85o39q76j215j436j411j262j193
59675E31167j240j426j893k689l501l946m027m090m329m527m256l304k073j476
59661D88390k013k941k916j657k83K72M22R39J618J808J615J617J747J516J089
59646D91223J081J442J448Q43R4m80r90j378j405j288j562k156k411k080j617
59631D80764j352j109p79n39m30k73j31j89k93k58m72j349k374k700k591l105
59615D62820m226m605l547k007j058n25J47O97O70N05J019K168L129L308K771
59600D61266J953J370J295J405J124M99K33N94R81Q80N37K85q5o68r10m48J00
59583D70411o0o80q44l24K11J41n11j332j898j954j634j381j376j296r14n73o58
$$ plain form
59566 455328 454453 453857 454069 454930 455699 455794 455425 455508 456880 459369 461739 462757 462302 461271 460608 460700 461480 462654
59548 462654 463825 464842 466138 468455 472224 477449 484150 492597 503111 515838 530618 546695 562654
59535 562654 577102 589467 599800 607775 612325 612462 608203 600654 591563 582887 576256 572307 570495 569799
59521 569799 569757 570779 573424 577441 581631 584719 586263 586595 586033 584481 581702 577535 571709 563966 554654
59506 554654 544777 535168 525971 517219 509430 503083 497851 492948 488084 483568 479637 476197 473173 470610
59492 470610 468430 466441 464610 463013 461595 460227 458908 457710 456800 456718 458182 461190 464687 467744 470682
59477 470682 474412 478928 483372 487490 492058 497600 503449 508477 512240 515036 517260 519117 520736 522198
59463 522198 523503 524680 525918 527548 529916 533159 536992 540970 545147 550243 556825 564533 572508 580433
$$ packed form
59566D55328q75n96K12Q61P69R5l69Q3J372K489K370J018m55j031o63R2P80J174
59548D62654J171J017J296K317L769N225O701Q447J0514J2727J4780J6077J5959
59535E62654J4448J2365J0333P975M550J37m259p549r091q676o631l949j812o96
59521E69799m2J022K645M017M190L088J544L32n62j552k779m167n826p743r312
59506E54654r877r609r197q752p789o347n232m903m864m516l931l440l024k563
59492D70610k180j989j831j597j418j368j319j198r10q2J464L008L497L057K938
59477D70682L730M516M444M118M568N542N849N028L763K796K224J857J619J462
59463E22198J305J177J238J630K368L243L833L978M177N096O582P708P975P925
$$ plain form
59449 580433 588678 597457 606230 614004 619967 623878 626109 627252 627455 626232 623055 617895 611009 602621
59435 602621 593258 584060 576179 569946 564971 560833 557300 554220 551801 550802 551905 555030 559763 566255
59421 566255 574998 585796 597735 610374 624482 641342 661581 684725 709590 734936 759770 782962
59409 782962 802766 817258 825482 827698 824391 815909 803561 790205 778782 770654 765866 764149 764552
59396 764552 764835 762664 757272 748826 736635 719564 698313 675824 654996 636995 621926 609747
59384 609747 599944 591463 583840 577719 573660 571076 568925 566892 565356 564582 564479 564896 565824 567369 569596
59369 569596 572212 574655 576828 579423 582893 586435 588851 590244 591950 594856 598723 603134 608058 613398
59355 613398 618944 624974 631977 639727 647588 655828 665461 676635 688371 700135 712447 725570 738949
$$ packed form
59449E80433Q245Q779Q773P774N963L911K231J143K03j223l177n160o886q388
59435F02621r363r198p881o233m975m138l533l080k419r99J103L125M733O492
59421E66255Q743J0798J1939J2639J4108J6860K0239K3144K4865K5346K4834K3192
59409G82962J9804J4492Q224K216l307q482j2348j3356j1423q128m788j717M03
59396G64552K83k171n392q446j2191j7071k1251k2489k0828j8001j5069j2179
59384F09747r803q481p623o121m059k584k151k033j536p74j03M17R28J545K227
59369E69596K616K443K173K595L470L542K416J393J706K906L867M411M924N340
59355F13398N546O030P003P750P861Q240R633J1174J1736J1764J2312J3123J3379
$$ plain form
59342 738949 752467 766856 782040 796277 807919 817026 824317 829542 832004 831836 829602 825166 818031
59329 818031 808403 796956 783986 769713 755020 740933 727535 714192 700727 687718 675775 665080
59317 665080 655497 646736 638622 631478 625795 621251 616695 611574 606812 603728 602706 603516 606257 611166
59303 611166 617917 625886 634755 644231 653552 661939 669050 674286 676074 672829 664499 652516 638429 623319
59289 623319 608239 594316 582127 571457 561826 553078 545613 540277 537732 537647 538802 540280 542168 544867
59275 544867 548286 552207 556955 563093 570751 579692 589741 600767 612591 625156 638283 651041 662025
59262 662025 670759 678097 684746 690076 692988 693195 690967 686398 679821 672340 664943 657548 649773 642117
59248 642117 635409 629575 624048 619103 615671 613959 613206 612769 612641 613018 614170 616597 620536 625406 630480
$$ packed form
59342G38949J3518J4389J5184J4237J1642R107P291N225K462j68k234m436p135
59329H18031r628j1447j2970j4273j4693j4087j3398j3343j3465j3009j1943j0695
59317F65080r583q761q114p144n683m544m556n121m762l084j022Q10K741M909
59303F11166O751P969Q869R476R321Q387P111N236J788l245q330j1983j4087j5110
59289F23319j5080j3923j2189j0670r631q748p465n336k545q5J155J478J888K699
59275E44867L419L921M748O138P658Q941J0049J1026J1824J2565J3127J2758J0984
59262F62025Q734P338O649N330K912K07k228m569o577p481p397p395p775p656
59248F42117o708n834n527m945l432j712p53m37j28L77J152K427L939M870N074
$$ plain form
59233 630480 635863 641968 648276 653567 657357 660150 662238 663123 662361 660293 657763 655482 653569 651251 647275
59218 647275 641239 634250 627623 621267 614171 606126 597964 590277 583036 576441 571021 566624 562288 557421
59204 557421 552334 547385 542491 537848 534341 532659 532464 532772 532769 532118 530989 530074 530152 531359 533142 534963
59188 534963 536644 538050 538978 539538 540205 541306 542823 544746 547224 550224 553413 556564 559895 563929 569093
59173 569093 575258 581505 586692 590631 594427 599263 605176 611521 618165 625479 633381 641188 648378 654808
59159 654808 660251 664347 667015 668310 667929 665389 660648 654100 646165 637431 628884 621208 614022 606493
59145 606493 598571 590844 583391 575661 567457 559187 551139 543347 536159 530059 524838 519782 514810 510580
59131 510580 507374 504765 502594 501354 501300 501945 502810 503982 505660 507823 510635 514497 519397 524841 530705
$$ packed form
59233F30480N383O105O308N291L790K793K088Q85p62k068k530k281j913k318l976
59218F47275o036o989o627o356p096q045q162p687p241o595n420m397m336m867
59204E57421n087m949m894m643l507j682j95L08lo51j129r15P8J207J783J821
59188E34963J681J406R28N60O67J101J517J923K478L000L189L151L331M034N164
59173E69093O165O247N187L939L796M836N913O345O644P314P902P807P190O430
59159F54808N443M096K668J295l81k540m741o548p935q734q547p676p186p529
59145F06493p922p727p453p730q204q270q048p792p188o100n221n056m972m230
59131E10580l206k609k171j240n4O45Q65J172J678K163K812L862M900N444N864
$$ plain form
59116 530705 537494 545504 554391 563879 574162 585189 596216 606542 616148 625217 633594 641206 648529
59103 648529 656073 663687 670752 676771 681488 684737 686534 687154 686937 686223 685402 684625 683477 681419 678634
59088 678634 675936 673784 671990 670408 669205 668214 666760 664463 661619 658389 654253 648741 642198 635294
59074 635294 628172 620603 612776 605415 599198 594292 590336 586686 582832 578730 574679 570925 567588 564816
59060 564816 562564 560278 557293 553630 549974 546854 544318 542374 541108 540218 539045 537385 535828 534980 534764
59045 534764 534653 534262 533517 532591 531869 531692 531963 532211 532021 531218 529867 528495 528022 528875 530314 531330 532131
59028 532131 533985 537639 542685 548527 555095 562400 570267 578783 588322 598752 609346 619731 630222
59015 630222 640817 650637 658818 665345 670463 673796 674656 672975 669506 665358 661533 658600 656565 655322
$$ packed form
59116E30705O789Q010Q887R488J0283J1027J1027J0326R606R069Q377P612P323
59103F48529P544P614P065O019M717L249J797O20k17p14q21p77j148k058k785
59088F78634k698k152j794j582j203r91j454k297k844l230m136n512o543o904
59074F35294p122p569p827p361o217m906l956l650l854m102m051l754l337k772
59060E64816k252k286k985l663l656l120k536j944j266q90j173j660j557q48k16
59045E34764j11l91p45r26p22j77K71K48j90q03j351j372m73Q53J439J016Q01
59028E32131J854L654N046N842O568P305P867Q516R539J0430J0594J0385J0491
59015F30222J0595R820Q181O527N118L333Q60j681l469m148l825k933k035j243
$$ plain form
59001 655322 655241 656885 660114 664007 667817 671516 675304 679169 683105 687207 691391 695426 699196 702384 704078
58986 704078 703547 701404 699103 697209 695061 692160 688725 684774 680064 675507 673253 674465 678006 682207
58972 682207 686922 692859 699843 707017 714219 721928 730121 738249 746218 754571 763794 774031 785198 796723
58958 796723 807451 816469 823757 829442 832867 833137 830281 825028 817684 807987 795935 781972 766486
58945 766486 749869 733082 717392 703385 690724 678977 668164 658450 649804 642138 635437 629660
58933 629660 624735 620654 617311 614340 611440 608878 607308 606943 607134 606845 605536 603556 601750 600636 599988
58918 599988 599208 598041 596714 595511 594493 593675 593216 593356 594313 596188 598842 602032 605830 610602 616339
58903 616339 622533 629207 637456 648121 660336 672404 683841 695368 707112 718229 728548 739192
$$ packed form
59001F55322q1J644L229L893L810L699L788L865L936M102M184M035L770L188J694
58986G04078n31k143k301j894k148k901l435l951m710m557k254J212L541M201
58972F82207M715N937O984P174P202P709Q193Q128P969Q353R223J0237J1167J1525
58958G96723J0728R018P288N685L425K70k856n253p344r697j2052j3963j5486
58945G66486j6617j6787j5690j4007j2661j1747j0813r714q646p666o701n777
58933F29660m925m081l343k971k900k562j570l65J91k89j309j980j806j114o48
58918E99988p80j167j327j203j018q18m59J40R57J875K654L190L798M772N737
58903F16339O194O674Q249J0665J2215J2068J1437J1527J1744J1117J0319J0644
$$ plain form
58891 739192 751100 764184 778517 795033 814110 834434 854382 873838 893666 913850 933076
58880 933076 949848 963331 973285 979767 982743 981794 976590 967820 957013 945126 932008 917564 902565
58867 902565 887769 873095 858361 844114 831018 819075 808144 798579 790494 782959 774770 765684
58855 765684 756257 746902 737716 728800 720087 711230 702196 693527 685496 677548 669116 660457 652164 644452
58841 644452 637473 631565 626465 620979 614239 606787 599716 593363 587551 582413 578099 574201 570305 566576
58827 566576 563097 559357 555308 552227 551446 552697 554656 556639 558735 560896 563100 566033 570436 575902
58813 575902 581349 586440 591566 596665 601039 604207 606099 606630 605977 604960 604250 603434 601767 599506 597523
58798 597523 595823 593508 590074 585847 581296 576789 572792 569387 565803 561344 556545 552475 549249 546287
$$ packed form
58891G39192J1908J3084J4333J6516J9077K0324J9948J9456J9828K0184J9226
58880I33076J6772J3483R954O482K976r49n204q770j0807j1887j3118j4444j4999
58867I02565j4796j4674j4734j4247j3096j1943j0931r565q085p535q189r086
58855G65684r427r355r186q916q713q857r034q669q031p948q432q659q293p712
58841F44452o979n908n100n486o740p452p071o353n812n138m314l898l896l729
58827E66576l479l740m049l081p81J251J959J983K096K161K204K933M403N466
58813E75902N447N091N126N099M374L168J892N31o53j017p10q16j667k261j983
58798E97523j700k315l434m227m551m507l997l405l584m459m799m070l226k962
$$ plain form
58784 546287 543760 542571 542978 544413 546614 549749 553324 556191 557956 559503 561816 564951 568220 570674
58770 570674 571460 570475 568665 566960 565086 562233 558561 554947 551462 547414 542960 539364 537288 535998 534752
58755 534752 534003 534634 536689 539394 541963 544034 545730 547499 549602 551826 554068 556921 560994 565848 570465
58740 570465 574651 579169 584466 590094 595470 600435 605013 609366 614043 619511 625387 630831 635750 640901
58726 640901 646775 653135 659610 666021 671993 677046 681232 685090 688964 692911 697170 702073 707595 713634
58712 713634 720543 728579 737022 744681 751159 756720 761069 763266 762874 760199 755306 747773 737569 725354
58698 725354 711791 697293 682422 667648 652626 636635 619888 603622 588810 575595 564006
58687 564006 554222 545908 538157 530468 523195 516913 511906 508268 505804 503803 501551 499070 496807 494849
$$ packed form
58784E46287k527j189M07J435K201L135L575K867J765J547K313L135L269K454
58770E70674P86r85j810j705j874k853l672l614l485m048m454l596k076j290j246
58755E34752p49O31K055K705K569K071J696J769K103K224K242K853M073M854M617
58740E70465M186M518N297N628N376M965M578M353M677N468N876N444M919N151
58726F40901N874O360O475O411N972N053M186L858L874L947M259M903N522O039
58712G13634O909Q036Q443P659O478N561M349K197l92k675m893p533j0204j2215
58698G25354j3563j4498j4871j4774j5022j5991j6747j6266j4812j3215j1589
58687E64006r784q314p751p689p273o282n007l638k464k001k252k481k263j958
$$ plain form
58673 494849 493185 492413 493259 495577 498727 502713 507954 514297 521408 529880 540521 552530 563816 573350
58659 573350 581932 590360 598052 603907 607391 608350 606711 602908 597837 592108 585963 579974 574960 571086
58645 571086 567793 564593 561165 556908 551462 545619 540670 536955 534122 532498 532808 534583 536322 537392
58631 537392 538417 539771 541188 542961 545853 549441 552123 553301 554136 555642 557451 559043 560778 563012
58617 563012 565432 567939 571070 574932 578901 582842 587441 592781 597815 601788 604974 607472 608635 608308
58603 608308 607378 606406 604969 603001 601387 600463 599222 596909 594218 592045 590188 588203 586435 585285 584434
58588 584434 583688 583718 585217 588231 592883 599665 608320 617544 626559 635861 645766 655443 664186 672377 680274
58573 680274 687118 692497 697477 703384 710454 718591 728262 739564 751474 763215 775494 789424 805167
$$ packed form
58673D94849j664p72Q46K318L150L986N241O343P111Q472J0641J2009J1286R534
58659E73350Q582Q428P692N855L484R59j639l803n071n729o145n989n014l874
58645E71086l293l200l428m257n446n843m949l715k833j624L10J775J739J070
58631E37392J025J354J417J773K892L588K682J178Q35J506J809J592J735K234
58617E63012K420K507L131L862L969L941M599N340N034L973L186K498J163l27
58603F08308r30r72j437j968j614r24j241k313k691k173j857j985j768j150q51
58588E84434p46L0J499L014M652O782Q655R224R015R302R905R677Q743Q191P897
58573F80274O844N379M980N907P070Q137R671J1302J1910J1741J2279J3930J5743
$$ plain form
58560 805167 822582 842058 863457 885157 905331 923466 939652 953299 963711 971139 976141 978563
58548 978563 978180 975658 971894 967075 961163 954546 947417 939352 930234 920599 910342 898273 883954 868775
58534 868775 854124 839700 824835 810308 797340 785818 775039 765433 758004 752734 748959 746683
58522 746683 746117 746361 745989 744666 743097 741823 741011 740875 741208 741006 739535 737286 735001 732485 729290 725825
58506 725825 722722 719837 716887 714261 712110 709542 705941 702280 699795 698075 695866 693118 690813 689203
58492 689203 687606 685683 683743 682056 680851 680695 681954 684268 687224 691003 695667 700679 706004 712807
58478 712807 722083 733335 745495 758201 771125 783094 793037 801050 807458 811786 813662 813650 812051
58465 812051 808088 801647 794632 789061 784808 780751 777009 774408 772780 771734 772244 775563 781098 787194
$$ packed form
58560H05167J7415J9476K1399K1700K0174J8135J6186J3647J0412P428N002K422
58548I78563l83k522l764m819n912o617p129q065r118r635j0257j2069j4319j5179
58534H68775j4651j4424j4865j4527j2968j1522j0779r606p429n270l775k276
58522G46683n66K44l72j323j569j274q12j36L33k02j471k249k285k516l195l465
58506G25825l103k885k950k626k151k568l601l661k485j720k209k748k305j610
58492F89203j597j923j940j687j205j56J259K314K956L779M664N012N325O803
58478G12807R276J1252J2160J2706J2924J1969R943Q013O408M328J876j2j599
58465H12051l963o441p015n571m253m057l742k601j628j046N10L319N535O096
$$ plain form
58451 787194 793455 800527 808102 814891 820276 824399 826982 827570 826604 824869 822307 818624 814453 810602 806866
58436 806866 802977 799919 798788 799174 800208 802252 805827 809944 813480 817389 823384 831073 838587 845489
58422 845489 852809 860559 867514 873332 878750 883627 886795 887962 887987 887208 885144 881840 877904 873298 867635
58407 867635 861510 855976 850911 845456 839770 834748 830375 826102 822604 821353 822540 824977 827910 831430
58393 831430 835440 839813 845219 852225 859900 866795 872824 878666 884104 888699 893355 899117 904979 908985
58379 908985 911048 912604 913944 914060 912858 911395 910192 909296 909653 912345 916784 921646 927147 934268 942347
58364 942347 949808 956900 965246 974934 984549 993925 1004360 1016048 1027651 1038486 1048910 1058561 1066440
58351 1066440 1072818 1078900 1084691 1089268 1092969 1097121 1101903 1106660 1111972 1119047 1127356 1135348 1143161 1152233
$$ packed form
58451G87194O261P072P575O789N385M123K583N88r66j735k562l683m171l851l736
58436H06866l889l058j131L86J034K044L575M117L536L909N995P689P514O902
58422H45489P320P750O955N818N418M877L168J167K5p79k064l304l936m606n663
58407H67635o125n534n065n455n686n022m373m273l498j251J187K437K933L520
58393H31430M010M373N406P006P675O895O029N842N438M595M656N762N862M006
58379I08985K063J556J340J16j202j463j203q96L57K692M439M862N501P121Q079
58364I42347P461P092Q346R688R615R376J0435J1688J1603J0835J0424R651P879
58351A066440O378O082N791M577L701M152M782M757N312P075Q309P992P813R072
$$ plain form
58337 1152233 1162659 1173563 1185619 1200344 1217183 1234142 1251040 1269136 1287788 1304663 1319224
58326 1319224 1332895 1345785 1356514 1365379 1374287 1383174 1389845 1393959 1397955 1403292 1408855 1413856 1419358
58313 1419358 1426101 1433522 1441636 1451372 1462562 1474129 1486524 1501233 1517700 1533628 1548574 1564392
58301 1564392 1581930 1600168 1618686 1637946 1657114 1674756 1691751 1710363 1730580 1750644 1770832
58290 1770832 1792994 1816622 1839430 1861759 1886229 1913006 1939730 1966284 1995104 2026435 2057895
58279 2057895 2089190 2122478 2157469 2191149 2223255 2257104 2293888 2331086 2367785 2406631 2449094
58268 2449094 2493589 2539690 2589402 2642799 2697186 2752037 2810079 2872203 2936155 3001354 3069834
58257 3069834 3141241 3212343 3282802 3355873 3432139 3508425 3584327 3663646 3747756 3833883 3921704
$$ packed form
58337A152233J0426J0904J2056J4725J6839J6959J6898J8096J8652J6875J4561
58326A319224J3671J2890J0729Q865Q908Q887O671M114L996N337N563N001N502
58313A419358O743P421Q114R736J1190J1567J2395J4709J6467J5928J4946J5818
58301A564392J7538J8238J8518J9260J9168J7642J6995J8612K0217K0064K0188
58290A770832K2162K3628K2808K2329K4470K6777K6724K6554K8820L1331L1460
58279B057895L1295L3288L4991L3680L2106L3849L6784L7198L6699L8846M2463
58268B449094M4495M6101M9712N3397N4387N4851N8042O2124O3952O5199O8480
58257C069834P1407P1102P0459P3071P6266P6286P5902P9319Q4110Q6127Q7821
$$ plain form
58246 3921704 4015053 4115161 4218999 4326428 4441960 4567092 4698122 4834073 4979329 5135666
58236 5135666 5299471 5469970 5652321 5849160 6057056 6274855 6507372 6757135 7020996
58227 7020996 7298867 7597142 7919532 8263590 8630386 9027849 9460044 9923434 10418785
58218 10418785 10956233 11543608 12181187 12873728 13635567 14477650 15402582 16419540 17550608
58209 17550608 18815124 20222966 21792466 23559844 25562061 27828281 30400658 33347572
58201 33347572 36747213 40681494 45264088 50658189 57059383 64697401 73886406 85057070
58193 85057070 98722344 115432177 135738714 160062250 188416759 220201563 254270729
58186 254270729 289151202 323101618 354009720 379460497 397132641 405268091 402942011
$$ packed form
58246C921704R3349J00108J03838J07429J15532J25132J31030J35951J45256J56337
58236E135666J63805J70499J82351J96839K07896K17799K32517K49763K63861
58227G020996K77871K98275L22390L44058L66796L97463M32195M63390M95351
58218A0418785N37448N87375O37579O92541P61839Q42083R24932J016958J131068
58209A7550608J264516J407842J569500J767378K002217K266220K572377K946914
58201C3347572L399641L934281M582594N394101O401194P638018R189005J1170664
58193H5057070J3665274J6709833K0306537K4323536K8354509L1784804L4069166
58186B54270729L4880473L3950416L0908102K5450777J7672144Q135450k326080
$$ plain form
58179 402942011 390192387 368147850 339010348 305655011 270948318 237182997 205874298
58172 205874298 177824799 153278938 132108339 114006210 98619947 85591389 74567733
58165 74567733 65232836 57327332 50630029 44938617 40080395 35922158 32352991 29268587
58157 29268587 26581615 24231645 22171138 20351325 18730288 17282317 15987894 14823102
58149 14823102 13767158 12810660 11947342 11165309 10453479 9808185 9225789 8696115 8209699
58140 8209699 7764226 7357541 6981554 6629176 6300269 5994890 5707599 5434331 5178085
58131 5178085 4941735 4721405 4512641 4316965 4136496 3967858 3807179 3655829 3515744
58122 3515744 3384226 3258578 3140859 3032797 2930920 2831914 2738102 2652390 2572195 2493559
$$ packed form
58179D02942011j2749624k2044537k9137502l3355337l4706693l3765321l1308699
58172B05874298k8049499k4545861k1170599j8102129j5386263j3028558j1023656
58165G4567733r334897p905504o697303n691412m858222m158237l569167l084404
58157B9268587k686972k349970k060507j819813j621037j447971j294423j164792
58149A4823102j055944r56498q63318p82033p11830o45294n82396n29674m86416
58140H209699m45473m06685l75987l52378l28907l05379k87291k73268k56246
58131E178085k36350k20330k08764j95676j80469j68638j60679j51350j40085
58122C515744j31518j25648j17719j08062j01877r9006r3812q5712q0195p8636
$$ plain form
58112 2493559 2417209 2345600 2277753 2211747 2148633 2089373 2031514 1973181 1916740 1864426 1814133
58101 1814133 1763735 1715662 1672643 1632560 1592075 1552036 1514800 1479457 1444196 1410341 1379542
58090 1379542 1349809 1318754 1288144 1260949 1236437 1212337 1189274 1168735 1149019 1127593 1105476
58079 1105476 1085154 1065994 1045761 1024899 1005429 987125 968407 949523 931464 913382 894378
58068 894378 876150 860614 846627 832213 818206 806397 796032 785562 776030 769109 763393 756203
58056 756203 747649 739519 731577 722502 713148 705283 698096 689428 679547 670560 662900 655551 648785 643505
58042 643505 638608 632104 624313 617136 610791 603977 596594 589664 583235 576839 571235 567163 563230 557502
58028 557502 550297 542976 535092 525486 515192 506391 499147 491872 484349 477622 471599 465404 459523 455040
$$ packed form
58112B493559p6350p1609o7847o6006o3114n9260n7859n8333n6441n2314n0293
58101A814133n0398m8073m3019m0083m0485m0039l7236l5343l5261l3855l0799
58090A379542k9733l1055l0610k7195k4512k4100k3063k0539j9716k1426k2117
58079A105476k0322j9160k0233k0862j9470j8304j8718j8884j8059j8082j9004
58068H94378j8228j5536j3987j4414j4007j1809j0365j0470r532o921n716p190
58056G56203q554q130p942r075r354p865p187q668r881q987p660p349o766n280
58042F43505m897o504p791p177o345o814p383o930o429o396n604m072l933n728
58028E57502p205p321p884r606j0294q801p244p275p523o727o023o195n881m483
$$ plain form
58014 455040 451412 447535 444226 442892 442495 440753 437918 436419 437056 438396 439830 442374 446218 450032 453024
57999 453024 455551 457602 458771 459759 461816 464687 466940 468118 468640 467937 464879 459864 454363 448535 441405
57984 441405 433248 425630 419085 412792 406541 400985 395909 390252 383980 378125 372895 367493 361810 356616
57970 356616 352175 348311 345623 344797 344877 344091 342307 340971 340817 341432 342836 345481 348747 351314 353033 354671
57954 354671 355955 355786 354304 352759 351305 348809 345002 340958 337369 334127 331707 331127 332319 334227 336612
57939 336612 340059 344276 348282 352461 358498 366884 376146 384911 393173 401314 409367 417446 425365 431715
57925 431715 434903 435221 434346 432813 429647 424508 418353 411762 404443 396668 389485 383154 377004 371139 366634
57910 366634 363780 361783 360482 360608 362036 363539 364707 366375 368674 370401 370869 370715 370284 368913 366514
$$ packed form
58014D55040l628l877l309j334l97j742k835j499O37J340J434K544L844L814K992
57999D53024K527K051J169R88K057K871K253J178N22p03l058n015n501n828p130
57984D41405q157p618o545o293o251n556n076n657o272n855n230n402n683n194
57970C56616m441l864k688q26Q0p86j784j336j54O15J404K645L266K567J719J638
57954C54671J284j69j482j545j454k496l807m044l589l242k420n80J192J908K385
57939C36612L447M217M006M179O037Q386R262Q765Q262Q141Q053Q079P919O350
57925D31715L188L18q75j533l166n139o155o591p319p775p183o331o150n865m505
57910C66634k854j997j301J26J428J503J168J668K299J727M68j54m31j371k399
$$ plain form
57895 366514 364250 362764 361169 358649 355809 353616 352112 350900 349921 349115 348215 347292 346657 346040 344835 343225
57879 343225 341858 340492 338276 335361 332685 330121 326540 321907 317543 314026 310672 307483 305582 305028
57865 305028 304214 302435 301231 302045 304194 306437 309078 313104 318394 324160 330252 336809 343314 349058 353999
57850 353999 358449 362573 366675 371024 374827 376398 375102 372262 369478 366966 364115 360600 356256 350844
57836 350844 344753 339071 334299 329785 324951 320097 315505 310939 306672 303833 302850 302625 302147 301883 302593
57821 302593 303809 304633 305320 306892 309602 312680 315222 316616 316472 314744 311645 307217 301498 295229 289486
57806 289486 284301 278669 272331 266479 262078 258517 254672 250420 246386 242981 240391 238769 237818 236884 235988
57791 235988 235964 237140 238819 240553 242872 246096 249558 252785 256449 261222 266631 272000 277693 284429 291994
$$ packed form
57895C66514k264j486j595k520k840k193j504j212r79q06r00r23o35o17j205j610
57879C43225j367j366k216k915k676k564l581m633m364l517l354l189j901n54
57865C05028q14j779j204Q14K149K243K641M026N290N766O092O557O505N744M941
57850C53999M450M124M102M349L803J571j296k840k784k512k851l515m344n412
57836C50844o091n682m772m514m834m854m592m566m267k839r83k25m78k64P10
57821C02593J216Q24O87J572K710L078K542J394j44j728l099m428n719o269n743
57806B89486n185n632o338n852m401l561l845m252m034l405k590j622r51r34q96
57791B35988k4J176J679J734K319L224L462L227L664M773N409N369N693O736P565
$$ plain form
57776 291994 299553 306684 313358 319492 325265 331186 337121 341824 344137 344113 342458 339619 335938 331884 327404
57761 327404 321830 315041 307955 301309 294898 288595 283026 278441 274077 269624 266222 264777 264218 262824
57747 262824 260611 259120 259292 260758 262860 265163 267205 268751 270223 272142 274393 276647 279034 281721
57733 281721 284351 286713 289430 293127 297276 300668 302719 303705 304122 304425 304922 305347 305051 304070 303270 302894
57717 302894 301868 299326 295959 292977 290531 288081 285468 282566 278684 273524 268038 263122 258035 251488
57703 251488 243848 236943 231936 228599 226455 225326 224756 224015 222869 221613 220388 219101 217810 216514 214861
57688 214861 212734 210771 209593 208939 208261 207681 207619 208094 209299 212161 217274 223868 231050 239650 251587
57673 251587 267818 288229 313246 344059 381030 422995 468255 515248 562081 606197 644572
$$ packed form
57776B91994P559P131O674O134N773N921N935M703K313k4j655k839l681m054m480
57761C27404n574o789p086o646o411o303n569m585m364m453l402j445n59j394
57747B62824k213j491J72J466K102K303K042J546J472J919K251K254K387K687
57733B81721K630K362K717L697M149L392K051R86M17L03M97M25k96r81q00l76
57717C02894j026k542l367k982k446k450k613k902l882n160n486m916n087o547
57703B51488p640o905n007l337k144j129n70p41j146j256j225j287j291j296j653
57688B14861k127j963j178o54o78n80o2M75J205K862N113O594P182Q600J1937
57673B51587J6231K0411K5017L0813L6971M1965M5260M6993M6833M4116L8375
$$ plain form
57662 644572 673691 689784 690323 675487 647642 609753 565118 517913 472330 430781 393812 361686
57650 361686 334943 313378 295727 280810 268291 258142 250140 244065 239678 236369 233393 230560 228123
57637 228123 226089 224229 222636 221606 221033 220510 219860 218996 217550 215395 213278 212166 212094 212310 212248 211669 210314
57620 210314 208305 206527 205681 205260 204393 203258 202551 201965 200499 198157 196017 194619 193454 192116 190795
57605 190795 189571 188281 187259 187156 187946 188970 189957 190991 191600 191148 190166 189989 190818 191360 190695 189303 187843
57588 187843 186114 183789 181191 178727 176252 173529 170646 167654 164428 161174 158417 156267 154348 152590
57574 152590 151368 150764 150391 150010 149565 148683 147044 145191 143921 142881 140962 138239 136199 135682 135770 135235
57558 135235 133953 132358 130577 128891 128106 128665 129993 131300 132485 133791 135214 136719 138447 140332 142054
$$ packed form
57662F44572K9119J6093N39j4836k7845l7889m4635m7205m5583m1549l6969l2126
57650C61686k6743k1565j7651j4917j2519j0149q002o075m387l309k976k833k437
57637B28123k034j860j593j030n73n23o50q64j446k155k117j112p2K16o2n79j355
57620B10314k009j778q46m21q67j135p07n86j466k342k140j398j165j338j321
57605A90795j224j290j022j03P90J024R87J034O09m52r82j77Q29N42o65j392j460
57588A87843j729k325k598k464k475k723k883k992l226l254k757k150j919j758
57574A52590j222o04l73l81m45q82j639j853j270j040j919k723k040n17Q8n35
57558A35235j282j595j781j686p85N59J328J307J185J306J423J505J728J885J722
$$ plain form
57543 142054 143627 145369 147123 148337 149171 150639 153247 156301 158953 161083 162675 163247 162528 161104 159790
57528 159790 158869 158308 158093 158048 157870 157621 157607 157699 157541 157469 158188 159386 159866 159445 159448 160772 162648 164069 165280
57509 165280 166904 168616 169751 170481 171363 172289 172820 173034 173179 172947 171903 170201 168186 165801 163123 160903
57493 160903 159733 159090 158042 156545 155296 154588 154070 153441 152669 151697 150460 149136 148006 147258 147099 147671
57477 147671 148627 149282 149462 149617 149847 149572 148544 147400 146642 145928 144994 144449 144772 145219 144746 143553 142777 142968
57459 142968 143707 144452 144921 144787 143781 142123 140379 138938 137951 137480 137368 137235 136935 136672 136517 136360 136525
57442 136525 137649 139556 141088 141598 141773 142333 142796 142428 141644 141396 141681 141691 141114 140391 140004 140275 141465 143295
57424 143295 144757 145261 145552 146607 148065 148727 148310 147664 147405 147371 147393 147619 147964 148056 147884 147896 148359 149045 149528
$$ packed form
57543A42054J573J742J754J214Q34J468K608L054K652K130J592N72p19j424j314
57528A59790r21n61k15m5j78k49j4R2j58p2P19J198M80m21LJ324J876J421J211
57509A65280J624J712J135P30Q82R26N31K14J45k32j044j702k015k385k678k220
57493A60903j170o43j048j497j249p08n18o29p72r72j237j324j130p48j59N72
57477A47671R56O55J80J55K30k75j028j144p58p14r34n45L23M47m73j193p76J91
57459A42968P39P45M69j34j006j658j744j441r87m71j12j33l00k63j55j57J65
57442A36525J124J907J532N10J75N60M63l68p84k48K85J0n77p23l87K71J190J830
57424A43295J462N04K91J055J458O62m17o46k59l4K2K26L45R2j72J2M63O86M83
$$ plain form
57405 149528 149378 148294 146567 145142 144658 144666 144391 143941 144062 144953 146050 146903 147575 148221 148833 149345 149582 149282
57387 149282 148563 148075 148275 148926 149743 150956 152652 154095 154497 154063 153573 153365 153422 153953 154982 155831 155957 155931
57369 155931 156681 158138 159618 161118 163045 164910 165588 164929 164043 163915 164696 166343 168851 171597 173439 173847
57353 173847 173363 172858 172968 174152 176392 178732 179906 179667 178933 178597 178836 179456 180210 180728 180849 181010 181657
57336 181657 182434 182704 182660 183039 183852 184355 184270 184090 184131 184198 184264 184546 184849 184721 184404 184704 185761 186833 187440 187884
57316 187884 188494 189237 190220 191647 193114 193871 193949 194167 194880 195694 196614 198330 200980 203677 205789 207773 210253
57299 210253 213084 215876 218655 221543 224520 227941 232519 238300 244360 249938 255135 260129 264609 268535
57285 268535 272540 276879 280709 283195 284695 286075 287379 287950 287523 286468 285269 284319 284009 284463 285373 286389
$$ packed form
57405A49528j50j084j727j425m84Qk75m50J21Q91J097Q53O72O46O12N12K37l00
57387A49282p19m88K00O51Q17J213J696J443M02m34m90k08N7N31J029Q49J26k6
57369A55931P50J457J480J500J927J865O78o59q86j28P81J647K508K746J842M08
57353A73847m84n05J10J184K240K340J174k39p34l36K39O20P54N18J21J61O47
57336A81657P77K70m4L79Q13N03q5j80M1O7O6K82L03j28l17L00J057J072O07M44
57316A87884O10P43R83J427J467P57P8K18P13Q14R20J716K650K697K112J984K480
57299B10253K831K792K779K888K977L421M578N781O060N578N197M994M480L926
57285B68535M005M339L830K486J500J380J304N71m27j055j199r50l10M54R10J016
$$ plain form
57269 286389 287416 288292 288622 288285 287682 287208 286900 286881 287609 289335 291769 294578 297689 300910 304004 307509
57253 307509 312655 319800 327600 334397 339949 345179 350782 356828 363278 370072 376912 383638 390661 398448
57239 398448 406812 415225 423610 432290 441372 450728 460425 470606 481063 491419 501745 512530 524076
57226 524076 536215 548578 560848 572889 584926 597586 611419 626309 641464 655986 669529
57215 669529 682649 696548 712225 729757 748489 767776 787180 806195 824422 842110 859949
57204 859949 878187 896489 914762 933416 952582 971756 990609 1009470 1028586 1047475 1065591
57193 1065591 1083231 1101251 1120223 1140299 1161562 1183970 1207177 1230809 1254776 1279063 1303474
57182 1303474 1327844 1352215 1376537 1400464 1423771 1446826 1470454 1495423 1522015 1549812 1578012
$$ packed form
57269B86389J027Q76L30l37o03m74l08j9P28J726K434K809L111L221L094L505
57253C07509N146P145P800O797N552N230N603O046O450O794O840O726P023P787
57239C98448Q364Q413Q385Q680R082R356R697J0181J0457J0356J0326J0785J1546
57226E24076J2139J2363J2270J2041J2037J2660J3833J4890J5155J4522J3543
57215F69529J3120J3899J5677J7532J8732J9287J9404J9015J8227J7688J7839
57204H59949J8238J8302J8273J8654J9166J9174J8853J8861J9116J8889J8116
57193A065591J7640J8020J8972K0076K1263K2408K3207K3632K3967K4287K4411
57182A303474K4370K4371K4322K3927K3307K3055K3628K4969K6592K7797K8200
$$ plain form
57171 1578012 1606375 1635757 1667166 1700326 1733825 1766629 1798702 1830161 1860784 1890647 1920309
57160 1920309 1949974 1979200 2007752 2035993 2064048 2091510 2118380 2145410 2173038 2200923 2229093
57149 2229093 2258520 2289787 2322105 2354561 2387442 2421318 2455610 2489246 2522128 2554687 2586378
57138 2586378 2615882 2642706 2667476 2690656 2712041 2731658 2750340 2769083 2788383 2808405 2829416
57127 2829416 2851877 2876277 2902849 2931525 2962511 2996929 3036267 3081024 3130732 3185639 3247428
57116 3247428 3317521 3395519 3480137 3570956 3668333 3772302 3882905 4001503 4130988 4274934
57106 4274934 4437298 4622566 4835392 5080554 5364311 5695938 6087647 6553741 7110690
57097 7110690 7777539 8575330 9526502 10655296 11987343 13546496 15350653 17409233 19721366
$$ packed form
57171A578012K8363K9382L1409L3160L3499L2804L2073L1459L0623K9863K9662
57160A920309K9665K9226K8552K8241K8055K7462K6870K7030K7628K7885K8170
57149B229093K9427L1267L2318L2456L2881L3876L4292L3636L2882L2559L1691
57138B586378K9504K6824K4770K3180K1385J9617J8682J8743J9300K0022K1011
57127B829416K2461K4400K6572K8676L0986L4418L9338M4757M9708N4907O1789
57116C247428P0093P7998Q4618R0819R7377J03969J10603J18598J29485J43946
57106D274934J62364J85268K12826K45162K83757L31627L91709M66094N56949
57097G110690O66849P97791R51172J128794J332047J559153J804157K058580K312133
$$ plain form
57088 19721366 22272811 25033027 27955102 30978468 34033919 37052455 39975079 42752898
57080 42752898 45332624 47642537 49601030 51146603 52260297 52956310 53249831 53132642
57072 53132642 52574984 51546988 50042108 48090264 45756732 43129122 40300316 37356567
57064 37356567 34374061 31419733 28551177 25814991 23245786 20866828 18691534 16724889
57056 16724889 14964537 13401733 12022519 10809522 9744171 8808558 7986414 7263281
57048 7263281 6626300 6063971 5566057 5123583 4728870 4375564 4058591 3773856 3517798
57039 3517798 3287311 3080101 2894817 2730494 2585940 2459974 2352151 2262948 2193087 2142555
57029 2142555 2109784 2091315 2082413 2078377 2075213 2068805 2053851 2024453 1976149 1907558 1820720 1720604
$$ packed form
57088A9721366K551445K760216K922075L023366L055451L018536K922624K777819
57080D2752898K579726K309913J958493J545573J113694O96013K93521j17189
57072E3132642n57658j027996j504880j951844k333532k627610k828806k943749
57064C7356567k982506k954328k868556k736186k569205k378958k175294j966645
57056A6724889j760352j562804j379214j212997j065351r35613q22144p23133
57048G263281o36981n62329m97914m42474l94713l53306l16973k84735k56058
57039C517798k30487k07210j85284j64323j44554j25966j07823q9203o9861n0532
57029B142555l2771j8469q902m036l164o408j4954k9398m8304o8591q6838j00116
$$ plain form
57017 1720604 1614017 1507731 1406578 1312893 1227452 1150512 1082061 1021662 968473 921458 879630
57006 879630 842254 808722 778269 750126 724129 700632 679463 659509 639963 621542 605673
56995 605673 592669 581528 571396 562376 554889 549051 544898 542580 542076 543152 545734 549905 555493 561987
56981 561987 568742 574761 578455 578310 573834 565399 553362 538056 520496 502213 484238 466977 451050
56968 451050 437382 426303 417437 410789 407158 407198 410790 417705 428053 441590 457167 473454 489743
56955 489743 505601 520140 532034 539887 542314 538236 527638 511882 492964 472650 452295 432881
56943 432881 414880 398552 384661 374496 368900 367740 370599 377504 388562 403417 421540 442668
56931 442668 466382 491477 516165 538675 557221 569659 573922 569109 555973 536280 511874 484400
$$ packed form
57017A720604j06587j06286j01153r3685q5441p6940o8451o0399n3189m7015m1828
57006H79630l7376l3532l0453k8143k5997k3497k1169j9954j9546j8421j5869
56995F05673j3004j1141j0132r020p487n838m153k318n04J076K582M171N588O494
56981E61987O755O019L694j45m476q435j2037j5306j7560j8283j7975j7261j5927
56968D51050j3668j1079q866o648l631M0L592O915J0348J3537J5577J6287J6289
56955D89743J5858J4539J1894P853K427m078j0598j5756j8918k0314k0355j9414
56943D32881j8001j6328j3891j0165n596j160K859O905J1058J4855J8123K1128
56931D42668K3714K5095K4688K2510J8546J2438M263m813j3136j9693k4406k7474
$$ plain form
56919 484400 455698 427973 403064 381446 362335 345067 330076 318193 309351 302538 296819 291864
56907 291864 287630 284201 281916 281040 281307 282285 284160 287544 292517 298538 305322 313132 322135 332158 343226
56892 343226 355699 369776 385472 403170 423334 445446 467899 489291 509112 526800 540787
56881 540787 549037 550177 543869 530586 511480 488193 462576 436716 412975 393260 378073 366882
56869 366882 359575 357020 360237 369813 386343 410602 442834 482339 527999 578575 632232 686306
56857 686306 737714 783081 818598 840772 847823 839918 818245 784989 744249 701534 661408 626192
56845 626192 597116 575522 562294 557327 560666 573522 597424 633054 680602 740308 811515 891629
56833 891629 976761 1062851 1145373 1218642 1276475 1313404 1325101 1308971 1265982 1201680 1124233
$$ packed form
56919D84400k8702k7725k4909k1618j9111j7268j4991j1883q842o813n719m955
56907B91864m234l429k285q76K67R78J875L384M973O021O784P810R003J0023J1068
56892C43226J2473J4077J5696J7698K0164K2112K2453K1392J9821J7688J3987
56881E40787Q250J140o308j3283j9106k3287k5617k5860k3741j9715j5187j1191
56869C66882p307k555L217R576J6530K4259L2232L9505M5660N0576N3657N4074
56857F86306N1408M5367L5517K2174P051p905k1673l3256m0740m2715m0126l5216
56845F26192k9076k1594j3228m967L339J2856K3902L5630M7548N9706P1207Q0114
56833H91629Q5132Q6090Q2522P3269N7833L6929J1697j6130m2989o4302p7447
$$ plain form
56822 1124233 1041265 958734 881591 813649 756576 710157 673904 647925 632524 628003 634992 654155
56810 654155 685269 726962 777257 833725 893042 950997 1003102 1044950 1072201 1081019 1069080 1036496
56798 1036496 986249 923821 855655 787079 721494 661341 608880 565374 530282 502327 481227
56787 481227 467704 462194 464380 473818 490096 512296 538928 568299 598274 625800 647456 660699
56775 660699 664179 657056 638862 610311 573712 532305 489309 447367 408224 372643 340821 312937
56763 312937 289100 268947 251750 236935 224251 213486 204282 196219 188987 182563 177235 173147 169721
56750 169721 166008 161764 157717 154500 151878 149390 147179 145627 144600 143633 142535 141303 139771 137864
56736 137864 135931 134418 133424 132850 132554 132074 130796 128852 127243 126610 126528 126573 127251 129021 131080 132178 132162
$$ packed form
56822A124233q2968q2531p7143o7942n7073m6419l6253k5979j5401m521O989J9163
56810F54155L1114M1693N0295N6468N9317N7955N2105M1848K7251Q818j1939l2584
56798A036496n0247o2428o8166o8576o5585o0153n2461m3506l5092k7955k1100
56787D81227j3523n510K186R438J6278K2200K6632K9371K9975K7526K1656J3243
56775F60699L480p123j8194k8551l6599m1407m2996m1942l9143l5581l1822k7884
56763C12937k3837k0153j7197j4815j2684j0765r204q063p232o424n328m088l426
56750A69721l713m244m047l217k622k488k211j552j027r67j098j232j532j907
56736A37864j933j513r94n74k96m80j278j944j609o33q2M5O78J770K059J098j6
$$ plain form
56719 132162 131785 131431 131176 131720 133974 137623 141126 143367 144499 145136 145578 146018 146738 147767 148870 150033
56703 150033 151533 153376 155049 155953 155898 155236 154644 154569 154731 154516 153996 153975 154725 155426 155369 154971 154911 154995 154731 154308
56683 154308 154003 153232 151421 149364 148483 148925 149547 149663 149681 150031 150562 151080 151567 151808 151626 151464 151884 152627
56665 152627 153073 153440 154492 156109 157297 157667 157801 158032 157966 157497 157207 157371 157487 157200 156909 157103 157836 159136
56647 159136 161174 163670 165856 167391 168734 170308 171883 173051 173668 173574 172467 170436 168131 166098 164242
56632 164242 162096 159383 156282 153482 151796 151355 151382 151210 151143 151732 152631 153015 152765 152308 151550 150057 148150
56615 148150 146653 145621 144436 143204 142815 143455 144221 144552 144907 145621 146226 146437 146845 148005 149604 151107
56599 151107 152534 154049 155377 156150 156350 156045 155203 154083 153322 153377 154284 156014 158422 160804 162194 162317
$$ packed form
56719A32162l77l54k55N44K254L649L503K241J132O37M42M40P20J029J103J163
56703A50033J500J843J673R04n5o62n92p5J62k15n20k1P50P01n7l98o0Q4k64m23
56683A54308l05p71j811k057q81M42O22J16J8L50N31N18M87K41j82j62M20P43
56665A52627M46L67J052J617J188L70J34K31o6m69k90J64J16k87k91J94P33J300
56647A59136K038K496K186J535J343J574J575J168O17r4j107k031k305k033j856
56632A64242k146k713l101k800j686m41K7j72o7N89Q99L84k50m57p58j493j907
56615A48150j497j032j185j232l89O40P66L31L55P14O05K11M08J160J599J503
56599A51107J427J515J328P73K00l05q42j120p61N5R07J730K408K382J390J23
$$ plain form
56583 162317 161654 160582 159240 158224 158389 159702 161167 162173 163098 164305 165486 166359 167259 168558 170211
56568 170211 172124 174322 176524 178375 180291 183207 187235 191509 195635 200204 205377 210092 213412 215749
56554 215749 217891 219588 220043 219304 218258 217473 216782 215920 215072 214766 215345 216419 216953 216301 215067 214364 214336
56537 214336 214212 213727 213504 213805 213939 213324 212290 211365 210552 209813 209547 210031 210911 211644 211962 211696 210798 209733
56519 209733 209123 208814 208036 206716 205677 205234 204625 203336 202032 201476 201362 200979 200448 200580 201824 203825 205700
56502 205700 206482 205786 204256 202910 201916 200664 198959 197324 196037 194886 194078 194243 195158 195530 194635 193276
56486 193276 192543 192482 192516 192437 192386 192483 192831 193261 192945 191129 188441 186458 185801 185748 185906 186863 188721 190443 191434
56467 191434 192517 194509 196951 199019 200622 201810 202247 202061 202131 202708 202886 202263 201900 202691 203954 204712 205114
$$ packed form
56583A62317o63j072j342j016J65J313J465J006R25J207J181Q73R00J299J653
56568A70211J913K198K202J851J916K916M028M274M126M569N173M715L320K337
56554B15749K142J697M55p39j046p85o91q62q48l06N79J074N34o52j234p03k8
56537B14336j24m85k23L01J34o15j034r25q13p39k66M84Q80P33L18k66q98j065
56519B09733o10l09p78j320j039m43o09j289j304n56j14l83n31J32J244K001J875
56502B05700P82o96j530j346r94j252j705j635j287j151q08J65R15L72q95j359
56486A93276p33o1L4p9n1R7L48M30l16j816k688j983o57n3J58R57J858J722R91
56467A91434J083J992K442K068J603J188M37j86P0N77J78o23l63P91J263P58M02
$$ plain form
56450 205114 205454 205033 203413 201765 201479 202231 202800 203000 203393 203807 203684 203380 203675 204344 204543 204298 204358 204858
56432 204858 205277 205449 205568 205489 205053 204769 205139 205681 205645 205323 205576 206405 207062 207352 207758 208475 209281 210218 211498
56413 211498 212870 213859 214508 215210 216032 216815 217596 218371 218833 218898 218918 218853 217991 216232 214844 214991 216245 217500
56395 217500 218614 220067 221688 222993 224282 226221 228675 231041 233378 236112 238910 240928 242000 242666
56381 242666 243296 243982 244961 246288 247464 248130 248720 249723 250904 252072 253819 256452 258855 259645 259005 258209
56365 258209 257781 257334 256886 257083 258222 259976 261988 263894 265039 264985 264087 262961 261816 260883 260838 262014 263795
56348 263795 265547 267411 269415 270764 271010 271061 271907 273154 273950 274507 275461 276542 277295 278345 280501 283130
56332 283130 284855 285429 285647 285918 286158 286589 287392 288081 288367 288982 290591 292693 294735 297278 300617 303399
$$ packed form
56450B05114L40m21j620j648k86P52N69K00L93M14j23l04K95O69J99k45O0N00
56432B04858M19J72J19p9m36k84L70N42l6l22K53Q29O57K90M06P17Q06R37J280
56413B11498J372R89O49P02Q22P83P81P75M62O5K0o5q62j759j388J47J254J255
56395B17500J114J453J621J305J289J939K454K366K337K734K798K018J072O66
56381B42666O30O86R79J327J176O66N90J003J181J168J747K633K403P90o40p96
56365B58209m28m47m48J97J139J754K012J906J145n4q98j126j145r33m5J176J781
56348B63795J752J864K004J349K46N1Q46J247P96N57R54J081P53J050K156K629
56332B83130J725N74K18K71K40M31Q03O89K86O15J609K102K042K543L339K782
$$ plain form
56316 303399 304303 304184 304681 305640 305910 305884 306991 309137 310881 311959 313492 315849 318317 320848 324187 328217
56300 328217 332007 335531 339581 344003 347805 350997 354557 358587 362289 365784 370171 375642 381254 386607
56286 386607 392062 397328 401661 405536 410325 416177 421980 427492 433629 440533 447300 453912 461505 470348
56272 470348 479454 488726 499585 512750 526979 540870 554579 569093 584919 602112 620708 640762
56260 640762 662727 687619 715870 746467 778579 813643 854251 901310 953999 1012273 1077414
56249 1077414 1150163 1230221 1317673 1412997 1515457 1623291 1735644 1852470 1972358 2092312
56239 2092312 2209866 2323551 2431007 2528521 2612889 2682123 2734258 2767357 2780986 2775962 2752526
56228 2752526 2710676 2652406 2581411 2500227 2409622 2311168 2208210 2103747 1999305 1896360
$$ packed form
56316C03399R04j19M97R59K70k6J107K146J744J078J533K357K468K531L339M030
56300C28217L790L524M050M422L802L192L560M030L702L495M387N471N612N353
56286C86607N455N266M333L875M789N852N803N512O137O904O767O612P593Q843
56272D70348R106R272J0859J3165J4229J3891J3709J4514J5826J7193J8596K0054
56260F40762K1965K4892K8251L0597L2112L5064M0608M7059N2689N8274O5141
56249A077414P2749Q0058Q7452R5324J02460J07834J12353J16826J19888J19954
56239B092312J17554J13685J07456R7514Q4368O9234N2135L3099J3629n024k3436
56228B752526m1850n8270p0995q1184r0605r8454j02958j04463j04442j02945
$$ plain form
56218 1896360 1796819 1701393 1609396 1520813 1436978 1358801 1286073 1218782 1157220 1100545 1047311
56207 1047311 997765 953565 914851 879781 847290 818033 792108 768261 746087 726701 710372
56196 710372 695662 681701 669158 658256 648013 638268 630204 624011 618181 611969 606327 601643 596927
56183 596927 592177 589101 588289 587961 586781 585720 585862 586457 586504 586308 586230 585809 585312 586286 589413 593560 597843
56166 597843 602690 608037 612643 616254 620386 625983 632347 639216 647553 657346 667073 676435 687143 699881
56152 699881 713132 726321 741433 760028 781242 804399 831039 862517 898126 937581 983067
56141 983067 1036766 1098367 1166920 1242960 1326683 1415791 1507126 1598813 1689219 1775581 1855387
56130 1855387 1927629 1991536 2046119 2092261 2133032 2170271 2202679 2228430 2247351 2259306 2263037
$$ packed form
56218A896360r9541r5426r1997q8583q3835p8177p2728o7291o1562n6675n3234
56207A047311m9546m4200l8714l5070l2491k9257k5925k3847k2174j9386j6329
56196G10372j4710j3961j2543j0902j0243r745q064o193n830o212n642m684m716
56183E96927m750l076q12l28j180j061J42N95M7j96p8m21m97R74L127M147M283
56166E97843M847N347M606L611M132N597O364O869Q337R793R727R362J0708J2738
56152F99881J3251J3189J5112J8595K1214K3157K6640L1478L5609L9455M5486
56141I83067N3699O1601O8553P6040Q3723Q9108R1335R1687R0406Q6362P9806
56130A855387P2242O3907N4583M6142M0771L7239L2408K5751J8921J1955L731
$$ plain form
56119 2263037 2258248 2246479 2228389 2202594 2168581 2127925 2080870 2024642 1957263 1880518 1797380
56108 1797380 1709465 1619247 1531744 1451100 1377664 1310715 1251633 1201970 1160828 1126643 1099327
56097 1099327 1078350 1061120 1045796 1033534 1025682 1021008 1017857 1016580 1017513 1019119 1020494 1023189 1028208
56084 1028208 1033762 1038364 1043396 1050218 1057589 1064511 1072596 1082893 1093376 1102483 1112142 1124201 1136936
56071 1136936 1148304 1159780 1173521 1188518 1202943 1217624 1233811 1250217 1265678 1282038 1300963
56060 1300963 1320639 1339018 1357445 1377521 1397352 1414768 1431414 1449768 1468831 1486615 1504168
56049 1504168 1523234 1542720 1561360 1581062 1603650 1627152 1649228 1671301 1695332 1719796 1743087
56038 1743087 1767571 1795791 1825909 1855442 1886153 1920484 1956630 1992213 2029407 2071119 2115320
$$ packed form
56119B263037m789j1769j8090k5795l4013m0656m7055n6228o7379p6745q3138
56108A797380q7915r0218q7503q0644p3436o6949n9082m9663m1142l4185k7316
56097A099327k0977j7230j5324j2262p852m674l151j277R33J606J375K695N019
56084A028208N554M602N032O822P371O922Q085J0297J0483R107R659J2059J2735
56071A136936J1368J1476J3741J4997J4425J4681J6187J6406J5461J6360J8925
56060A300963J9676J8379J8427K0076J9831J7416J6646J8354J9063J7784J7553
56049A504168J9066J9486J8640J9702K2588K3502K2076K2073K4031K4464K3291
56038A743087K4484K8220L0118K9533L0711L4331L6146L5583L7194M1712M4201
$$ plain form
56027 2115320 2158528 2201742 2247621 2295035 2341916 2390153 2442023 2495158 2546789 2599563 2657237
56016 2657237 2718185 2779295 2842609 2911645 2984814 3059164 3137000 3221859 3311571 3402406 3496408
56005 3496408 3597399 3703520 3811380 3923770 4045387 4174630 4307669 4446733 4596108
55996 4596108 4753969 4916838 5087971 5272395 5467895 5670272 5883081 6112523 6357435
55987 6357435 6614639 6889266 7188750 7511450 7852829 8217978 8615957 9046858 9507353
55978 9507353 10003959 10547445 11139614 11779961 12479849 13254900 14109304 15044104 16075217
55969 16075217 17226310 18510909 19941043 21547398 23371147 25443878 27799208 30498551
55961 30498551 33623536 37254365 41486407 46463737 52372984 59425480 67894789 78173866
$$ packed form
56027B115320M3208M3214M5879M7414M6881M8237N1870N3135N1631N2774N7674
56016B657237O0948O1110O3314O9036P3169P4350P7836Q4859Q9712R0835R4002
56005C496408J00991J06121J07860J12390J21617J29243J33039J39064J49375
55996D596108J57861J62869J71133J84424J95500K02377K12809K29442K44912
55987F357435K57204K74627K99484L22700L41379L65149L97979M30901M60495
55978I507353M96606N43486N92169O40347O99888P75051Q54404R34800J031113
55969A6075217J151093J284599J430134J606355J823749K072731K355330K699343
55961C0498551L124985L630829M232042M977330N909247P052496Q469309J0279077
$$ plain form
55953 78173866 90761122 106194359 125005933 147634831 174185163 204163244 236481502
55946 236481502 269718994 302269030 332204190 357205040 374911025 383501768 382049786
55939 382049786 370574220 350076605 322587823 290901986 257898421 225858943 196209614
55932 196209614 169654870 146399763 126318059 109109514 94438834 81987232 71439830
55925 71439830 62496059 54905375 48466376 42994990 38320745 34309088 30858956 27878068
55917 27878068 25280979 23006732 21015024 19264734 17713063 16331629 15103975 14008365
55909 14008365 13019160 12122536 11314325 10583880 9915014 9300855 8742751 8235460 7767116
55900 7767116 7332786 6934860 6570760 6232633 5918401 5631222 5368454 5122291 4890752
$$ packed form
55953G8173866J2587256J5433237J8811574K2628898K6550332K9978081L2318258
55946B36481502L3237492L2550036K9935160K5000850J7705985Q590743j451982
55939C82049786j1475566k0497615k7488782l1685837l3003565l2039478k9649329
55932A96209614k6554744k3255107k0081704j7208545j4670680j2451602j0547402
55925G1439830q943771p590684o438999n471386m674245m011657l450132k980888
55917B7878068k597089k274247j991708j750290j551671j381434j227654j095610
55909A4008365r89205q96624q08211p30445o68866o14159n58104n07291m68344
55900G767116m34330l97926l64100l38127l14232k87179k62768k46163k31539
$$ plain form
55891 4890752 4677498 4481499 4297341 4125071 3969378 3829247 3698104 3573970 3460092
55882 3460092 3355776 3255735 3158413 3066247 2977816 2888366 2798130 2711823 2629840 2547977 2465768
55871 2465768 2386978 2311569 2235178 2157186 2081793 2010443 1940415 1871652 1807995 1750633 1696673
55860 1696673 1645004 1597460 1553649 1510682 1468587 1430186 1395154 1359967 1324043 1290219 1258833
55849 1258833 1227152 1195101 1165800 1139762 1113984 1087376 1061843 1037520 1012241 986308 962660
55838 962660 941743 921199 900990 883611 868763 853025 835627 819524 805903 792573 778735
55827 778735 766528 756720 747341 737694 729381 722387 714271 704190 693780 683354 671331 658060 646140
55814 646140 636151 626065 615417 606038 598047 589359 579994 572655 568138 564194 559950 557444 557710 559188
$$ packed form
55891D890752k13254j95999j84158j72270j55693j40131j31143j24134j13878
55882C460092j04316j00041r7322r2166q8431q9450r0236q6307q1983q1863q2209
55871B465768p8790p5409p6391p7992p5393p1350p0028o8763o3657n7362n3960
55860A696673n1669m7544m3811m2967m2095l8401l5032l5187l5924l3824l1386
55849A258833l1681l2051k9301k6038k5778k6608k5533k4323k5279k5933k3648
55838I62660k0917k0544k0209j7379j4848j5738j7398j6103j3621j3330j3838
55827G78735j2207r808r379r647q313o994q116j0081j0410j0426j2023j3271j1920
55814F46140r989j0086j0648r379p991q688r365p339m517l944m244k506K66J478
$$ plain form
55800 559188 561150 564916 570529 575829 580026 584736 590366 594886 597247 598688 599657 598730 595616 591959 588165
55785 588165 582650 575132 567390 559789 550339 538310 525650 513778 502078 490635 481424 475583 472275
55772 472275 471150 473068 477473 481891 484983 487416 489076 488271 484371 478379 470397 459674 447716 437936
55758 437936 431246 425101 417748 410199 403100 395111 385690 376320 367613 358127 347228 336202 325439
55745 325439 313645 301123 290682 283808 278815 274179 270746 269210 268319 267162 266454 266090 264294 260771
55731 260771 257867 256903 256118 253950 251523 249976 248083 244676 241002 238415 235907 232086 227693 224181 221570
55716 221570 219561 219043 220644 223348 226088 229196 232968 236521 239377 242338 245552 247609 247857 247648 247877
55701 247877 247310 244770 241055 237173 232581 226712 220457 214645 208783 202705 197635 194218 191321 188162
$$ packed form
55800E59188J962L766N613N300M197M710N630M520K361J441R69r27l114l657l794
55785E88165n515p518p742p601r450j2029j2660j1872j1700j1443r211n841l308
55772D72275j125J918M405M418L092K433J660q05l900n992p982j0723j1958r780
55758D37936o690o145p353p549p099p989r421r370q707r486j0899j1026j0763
55745C25439j1794j2522j0441o874m993m636l433j536q91j157p08l64j796l523
55731B60771k904r64p85k168k427j547j893l407l674k587k508l821m393l512k611
55716B21570k009n18J601K704K740L108L772L553K856K961L214K057K48k09K29
55701B47877n67k540l715l882m592n869o255n812n862o078n070l417k897l159
$$ plain form
55687 188162 185791 185020 184778 183999 183335 183539 184029 184520 186142 189367 192658 194813 196791 199612 202322 203744
55671 203744 204335 204538 203227 199856 196408 195054 195280 195313 194986 195208 195910 196592 197760 199888 201991 203025
55655 203025 203689 205108 206827 207846 208547 209865 211518 212820 214306 216790 219540 221008 220746 219255 216741
55640 216741 213388 210000 207025 203623 198888 193204 187349 181260 174773 168568 163260 158553 154255 151003
55626 151003 148964 147045 144488 141963 140119 138462 136775 136043 136598 136876 135510 133291 131599 130324 128823
55611 128823 127496 126776 125852 124039 122168 121090 120103 118396 116707 115867 115112 113572 112080 111613 111244 109675
55595 109675 107621 106580 106214 105048 102968 101113 99980 99390 99576 100534 101118 100476 99595 99800 100657 101076 101434
55578 101434 102737 104588 105934 107003 108649 110621 112301 114235 116940 119189 119619 119171 119694 120932 121286
$$ packed form
55687A88162k371p71k42p79o64K04M90M91J622L225L291K155J978K821K710J422
55671B03744N91K03j311l371l448j354K26L3l27K22P02O82J168K128K103J034
55655B03025O64J419J719J019P01J318J653J302J486K484K750J468k62j491k514
55640B16741l353l388k975l402m735n684n855o089o487o205n308m707m298l252
55626A51003k039j919k557k525j844j657j687p32N55K78j366k219j692j275j501
55611A28823j327p20r24j813j871j078r87j707j689q40p55j540j492m67l69j569
55595A09675k054j041l66j166k080j855j133n90J86R58N84o42q81K05Q57M19L58
55578A01434J303J851J346J069J646J972J680J934K705K249M30m48N23J238L54
$$ plain form
55563 121286 120890 121325 122613 123030 121889 120186 118401 115896 112745 110117 108463 107027 105351 103744 102186
55548 102186 100340 98674 98042 98258 98498 98882 100045 101421 101801 101421 101653 102670 103281 103168 103476 104922 106967
55531 106967 109023 110923 112027 111569 110159 109403 109715 109931 109243 108082 106892 105515 104058 102902 101603
55516 101603 99173 95738 92603 90443 88746 87258 86500 86528 86466 85772 84881 84246 83802 83525 83528 83438 82779 82061
55498 82061 82398 83989 86029 88047 90119 91855 92587 92643 93040 93785 93893 93230 92839 93088 92981 91860 90433
55481 90433 89450 88540 87110 85466 84337 83945 84037 84275 84298 83915 83392 83035 82592 81759 80935 80614 80309 79212
55463 79212 77716 76993 77100 76841 75693 74566 74326 74756 75351 76142 77242 78424 79467 80262 80464 79783 78677
55446 78677 77980 77886 78064 78582 79770 81339 82660 83730 84777 85145 83933 81655 79910 79268 78831 78045 77563
$$ packed form
55563A21286l96M35J288M17j141j703j785k505l151k628j654j436j676j607j558
55548A02186j846j666o32K16K40L84J163J376L80l80K32J017O11j13L08J446K045
55531A06967K056J900J104m58j410p56L12K16o88j161j190j377j457j156j299
55516A01603k430l435l135k160j697j488p58K8o2o94q91o35m44k77Lr0o59p18
55498H2061L37J591K040K018K072J736P32N6L97P45J08o63l91K49j07j121j427
55481I0433r83r10j430j644j129l92R2K38K3l83n23l57m43q33q24l21l05j097
55463G9212j496p23J07k59j148j127k40M30N95P91J100J182J043P95K02o81j106
55446G8677o97r4J78N18J188J569J321J070J047L68j212k278j745o42m37p86m82
$$ plain form
55429 77563 77961 78845 79663 80368 80925 81135 81235 81762 82647 83331 83801 84536 85476 86188 86934 88320 89876 90446
55411 90446 90112 90248 91368 92379 92394 91839 91255 90356 88932 87453 86182 84798 83356 82396 81607 79741 76594
55394 76594 73759 72550 72298 71684 70735 70419 70968 71673 71973 71987 72203 73080 74587 75977 76543 76653 77238 78187
55376 78187 78319 77190 75842 75285 75221 74832 73912 72684 71315 70191 69905 70503 71429 72510 74097 75887 76669
55359 76669 75891 74618 74336 75502 77673 80183 82224 83169 83398 83979 85018 85305 84155 82617 82029 82274
55343 82274 82383 82119 81983 82135 82250 82156 81866 81190 79933 78372 77084 76412 76295 76480 76744 77114 77793 78595
55325 78595 78776 78022 77268 77610 78680 79171 78859 78819 79530 80137 79993 79652 79755 79979 79707 78868 77683 76431
55307 76431 75803 76481 77997 79014 79098 79184 79940 80936 81795 82787 83687 83544 82387 81740 82422 83167 82642 81602
$$ packed form
55429G7563L98Q84Q18P05N57K10J00N27Q85O84M70P35R40P12P46J386J556N70
55411I0446l34J36J120J011J5n55n84q99j424j479j271j384j442r60p89j866l147
55394G6594k835j209k52o14r49l16N49P05L00J4K16Q77J507J390N66J10N85R49
55376G8187J32j129j348n57o4l89r20j228j369j124k86N98R26J081J587J790P82
55359G6669p78j273k82J166K171K510K041R45K29N81J039K87j150j538n88K45
55343H2274J09k64j36J52J15r4k90o76j257j561j288o72j17J85K64L70O79Q02
55325G8595J81p54p54L42J070M91l12m0P11O07j44l41J03K24k72q39j185j252
55307G6431o28O78J516J017Q4Q6P56R96Q59R92R00j43j157o47O82P45n25j040
$$ plain form
55289 81602 81657 82859 83962 84391 84547 84622 84398 83923 83343 82442 81283 80849 82002 84139 85866 86677 87082 87405
55271 87405 87421 87058 86590 86200 85961 86076 86588 87144 87515 87980 88673 89115 89016 89004 89738 90701 90760 89719 88518 88006
55251 88006 88150 88411 88298 87560 86219 84520 82755 81276 80573 80903 81795 82477 82819 83177 83323 82504 80832
55234 80832 79582 79607 80315 80722 80652 80377 79972 79646 79901 80768 81619 82189 82927 83861 84234 83879 83813 84669 85697
55215 85697 86155 86468 86891 86307 83838 80723 78996 78923 79226 79301 79649 80415 81045 81371 81804 82383 82670 82540 82248
55196 82248 81919 81731 82203 83426 84452 84482 84199 84769 85943 86433 85954 85559 85934 86602 86924 86828 86388 85653 85065
55177 85065 85206 85998 86837 87510 88213 88764 88661 87942 87227 86881 86804 87042 87847 89134 90506 91774 92918 93722
55159 93722 94056 94259 94578 94522 93546 92042 90864 90119 89334 88546 88257 88419 88438 88098 87588 86746 85238 83503
$$ packed form
55289H1602N5J202J103M29J56P5k24m75n80r01j159m34J153K137J727Q11M05L23
55271H7405J6l63m68l90k39J15N12N56L71M65O93M42r9j2P34R63N9j041j201n12
55251H8006J44K61j13p38j341j699j765j479p03L30Q92O82L42L58J46q19j672
55234H0832j250K5P08M07p0k75m05l26K55Q67Q51N70P38R34L73l55o6Q56J028
55215H5697M58L13M23n84k469l115j727p3L03P5L48P66O30L26M33N79K87j30k92
55196H2248l29j88M72J223J026L0k83N70J174M90m79l95L75O68L22r6m40p35n88
55177H5065J41P92Q39O73P03N51j03p19p15l46p7K38Q05J287J372J268J144Q04
55159I3722L34K03L19n6r76j504j178p45p85p88k89J62J9l40n10q42j508j735
$$ plain form
55141 83503 82548 82762 83734 85178 87082 88906 89710 89345 88717 88634 89063 89692 90465 91313 91968 92345 92633 92900
55123 92900 93025 93023 93042 93124 93306 93682 93868 92863 90225 87077 85083 84633 84892 85380 86470 88364 90578 92549
55105 92549 93930 94271 93304 91691 90669 90820 91790 93127 94621 95934 96798 97621 98980 100523 101247 100955
55089 100955 100483 100397 100397 100173 99930 99775 99503 99259 99600 100604 101641 102258 102560 102509 101780 100606 99924 100227 100927
55070 100927 101255 101140 100852 100410 99765 99103 98608 98327 98408 99006 99860 100516 100991 101536 101802 101103 99689 98800 99075
55051 99075 99700 99605 98813 98080 97807 97844 97912 97737 97123 96202 95323 94551 93687 92919 92884 93812 95111 96053 96431 96348
55031 96348 95870 95149 94515 94212 94339 95016 96129 96984 96873 96041 95465 95567 95896 96152 96649 97449 97852 97317 96323
55012 96323 95829 96227 97141 97851 97757 96871 96033 96160 97132 97940 97946 97392 96668 95949 95761 96964 99605 102519 104539
$$ packed form
55141H3503r55K14R72J444J904J824Q04l65o28q3M29O29P73Q48O55L77K88K67
55123I2900J25kJ9Q2J82L76J86j005k638l148j994m50K59M88J090J894K214J971
55105I2549J381L41r67j613j022J51R70J337J494J313Q64Q23J359J543P24k92
55089A00955m72q6%k24k43j55k72k44L41J004J037O17L02n1p29j174o82L03P00
55070A00927L28j15k88m42o45o62m95k81Q1N98Q54O56M75N45K66o99j414q89K75
55051I9075O25r5p92p33k73L7O8j75o14r21q79p72q64p68l5R28J299R42L78q3
55031I6348m78p21o34l03J27O77J113Q55j11q32n76J02L29K56M97Q00M03n35r94
55012I6323m94L98R14P10r4q86q38J27R72Q08On54p24p19j88J203K641K914K020
$$ plain form
54993 104539 105493 105639 104907 103339 101673 100764 100738 101187 101855 102652 103400 103977 104424 104607 104196 103353 102945 103605
54975 103605 104891 105812 105885 105337 104606 104031 103778 103753 103811 104183 105279 106891 108139 108492 108328 108131 107698 106717
54957 106717 105722 105807 107462 110071 112455 113724 113800 113345 113005 112659 111710 110141 108793 108341 108472 108349 107561
54940 107561 106386 105498 105641 107172 109589 111797 113077 113533 113560 113351 113135 113361 114315 115849 117685 119667
54924 119667 121626 123431 125330 127776 130865 134434 138716 144117 150215 155831 160476 164853 169402 173151
54910 173151 174820 174451 173098 171249 168382 163935 158035 151333 144670 138886 134408 130956 127889 124938
54896 124938 122477 121149 121259 122341 123287 123165 121982 120414 118854 117191 115520 114457 114511 115567 117179
54881 117179 119074 121300 124260 128482 133876 139321 143784 147725 152508 158348 163892 168064 171155 173576
$$ packed form
54993A04539R54J46p32j568j666r09k6M49O68P97P48N77M47J83m11q43m08O60
54975A03605J286R21P3n48p31n75k53k5N8L72J096J612J248L53j64j97m33r81
54957A06717r95Q5J655K609K384J269P6m55l40l46r49j569j348m52J31j23p88
54940A07561j175q88J43J531K417K208J280M56K7k09k16K26R54J534J836J982
54924A19667J959J805J899K446L089L569M282N401O098N616M645M377M549L749
54910A73151J669l69j353j849k867m447n900o702o663n784m478l452l067k951
54896A24938k461j328J10J082R46j22j183j568j560j663j671j063N4J056J612
54881A17179J895K226K960M222N394N445M463L941M783N840N544M172L091K421
$$ plain form
54867 173576 174706 173892 171703 169250 166792 163812 160018 155541 150598 145637 141327 137790 134293 130383
54853 130383 126804 124593 123740 123417 123022 122215 120484 117669 114664 112647 111712 110995 109944 108712 107425 105922
54837 105922 104261 102837 101924 101544 101718 102337 102935 103089 102957 103008 103398 104049 105020 106237 107079 106850 105595 103976
54819 103976 102534 101503 101053 101086 101036 100483 99840 99852 100606 101562 102403 103183 103829 104253 104906 106459 108825 111058
54801 111058 112336 112515 111721 110063 108026 106620 106714 108313 110640 112804 114394 115588 116726 117780 118385
54786 118385 118434 118352 118577 119037 119298 119043 118263 117316 116932 117714 119418 121178 122622 124238 126382 128688 130931
54769 130931 133743 137725 142398 146848 151008 155542 160746 166321 171977 177554 182720 187167 190864 193546
54755 193546 194300 192396 188280 183066 177311 170975 164276 157761 151731 146367 142211 139687 138319 137191
$$ packed form
54867A73576J130q14k189k453k458k980l794m477m943m961m310l537l497l910
54853A30383l579k211q53l23l95q07j731k815l005k017r35p17j051j232j287j503
54837A05922j661j424r13l80J74O19N98J54j32N1L90O51R71J217Q42k29j255j619
54819A03976j442j031m50L3n0n53o43J2P54R56Q41P80O46M24O53J553K366K233
54801A11058J278J79p94j658k037j406R4J599K327K164J590J194J138J054O05
54786A18385M9q2K25M60K61k55p80r47l84P82J704J760J444J616K144K306K243
54769A30931K812L982M673M450M160M534N204N575N656N577N166M447L697K682
54755A93546P54j904m116n214n755o336o699o515o030n364m156k524j368j128
$$ plain form
54741 137191 136100 135470 135304 135075 134553 133871 132857 131188 129256 127987 127653 127682 127708 128046 129044 130746 133301
54724 133301 136886 141099 145172 148963 153034 157640 162417 167093 171628 175472 177632 177830 176882 175569 173877
54709 173877 171569 168639 164858 159777 153760 148243 144311 141568 138987 136339 134149 132644 131441 130127
54695 130127 128636 127191 126093 125469 125087 124663 124354 124487 124832 124764 124275 124087 124494 124851 124621 124129 123710 122847
54677 122847 121003 118817 117580 117670 118259 118472 118158 117589 117036 116771 116906 117096 116784 115921 115104 114871 115111 115295
54659 115295 115106 114657 114210 113809 113253 112425 111564 111138 111431 112333 113530 114743 115838 116809 117706 118472 118932 119063
54641 119063 119190 119678 120454 121004 120841 119873 118466 117352 117221 117997 118651 118188 116771 115497 115097 115388 115953
54624 115953 116721 117674 118519 118938 118796 117946 116277 114263 112994 113210 114505 115825 116533 116717 116658 116451 116159
$$ packed form
54741A37191j091o30j66k29n22o82j014j669j932j269l34K9K6L38R98J702K555
54724A33301L585M213M073L791M071M606M777M676M535L844K160J98r48j313j692
54709A73877k308k930l781n081o017n517l932k743k581k648k190j505j203j314
54695A30127j491j445j098o24l82m24l09J33L45o8m89j88M07L57k30m92m19q63
54677A22847j844k186j237R0N89K13l14n69n53k65J35J90l12q63q17k33K40J84
54659A15295j89m49m47m01n56q28q61m26K93R02J197J213J095R71Q97P66M60J31
54641A19063J27M88P76N50j63r68j407j114j31P76O54m63j417j274m00K91N65
54624A15953P68R53Q45M19j42q50j669k014j269K16J295J320P08J84n9k07k92
$$ plain form
54607 116159 116004 116223 116802 117407 117665 117550 117456 117752 118400 119165 120071 121275 122544 123237 122986 122151 121460 121360
54589 121360 121744 122144 122085 121417 120357 119217 118152 117235 116551 116027 115416 114692 114242 114358 114794 115150 115436 115810
54571 115810 116082 116050 116081 116679 117602 118091 117915 117484 117016 116433 116197 117264 119755 122407 123911 124277 124426 124844
54553 124844 125171 124901 124100 123461 123756 125055 126501 127205 127315 127781 129071 130703 132110 133263 134253 134914 135216
54536 135216 135436 135621 135429 134839 134372 134181 133599 132204 130736 130198 130426 130357 129537 128649 128555 129394 130630 131507
54518 131507 131412 130284 128787 127791 127576 127733 127831 127915 128283 128990 129678 129881 129479 128840 128449 128451 128669 128959 129295 129592
54498 129592 129782 130037 130491 130766 130261 129087 128201 128386 129472 130758 131706 131978 131313 129911 128626 128311 129044
54481 129044 130277 131518 132576 133370 133872 134148 134250 134171 134082 134412 135447 136999 138555 139633 139936 139509 138836
$$ packed form
54607A16159j55K19N79O05K58j15r4K96O48P65R06J204J269O93k51q35o91j00
54589A21360L84M00n9o68j060j140j065r17o84n24o11p24m50J16M36L56K86L74
54571A15810K72l2L1N98R23M89j76m31m68n83k36J067K491K652J504L66J49M18
54553A24844L27k70q01o39K95J299J446P04J10M66J290J632J407J153R90O61L02
54536A35216K20J85j92n90m67j91n82j395j468n38K28o9q20q88r4Q39J236Q77
54518A31507r5j128j497r96k15J57R8Q4L68P07O88K03m02o39l91KK18K90L36K97
54498A29592J90K55M54K75n05j174q86J85J086J286R48K72o65j402j285l15P33
54481A29044J233J241J058P94N02K76J02p9q9L30J035J552J556J078L03m27o73
$$ plain form
54464 138836 138468 138427 138324 138141 138387 139265 140216 140697 140914 141330 141809 141785 141086 140077 139129 138386 137908 137665 137453
54445 137453 137126 136870 136940 137242 137411 137254 136889 136507 136180 135801 135133 134064 132858 131935 131358 130828 130250 129933
54427 129933 130125 130762 131850 133538 135533 136970 137335 137163 137343 138089 139061 140196 141699 143329 144318 144154
54411 144154 143066 141634 140212 138899 137877 137551 138215 139560 140737 141168 141181 141491 142198 142811 143214 143905 145122
54394 145122 146421 147455 148536 149978 151425 152321 152578 152330 151540 150386 149579 149690 150453 151254 151887 152330 152194
54377 152194 151193 149847 149055 149137 149901 151372 153636 156128 157870 158572 158868 159401 160236 161265 162603 164291
54361 164291 165964 167125 167683 168257 169884 173128 177232 180563 182294 183273 184743 186607 187658 187282 186065
54346 186065 184713 183079 180565 176972 172763 168754 165640 163510 161821 160071 158416 157293 156650 156018 155213
$$ packed form
54464A38836l68m1j03j83K46Q78R51M81K17M16M79k4o99j009r48p43m78k43k12
54445A37453l27k56P0L02J69j57l65l82l27l79o68j069j206r23n77n30n78l17
54427A29933J92O37J088J688J995J437L65j72J80P46R72J135J503J630R89j64
54411A44154j088j432j422j313j022l26O64J345J177M31J3L10P07O13M03O91J217
54394A45122J299J034J081J442J447Q96K57k48p90j154q07J11P63Q01O33M43j36
54377A52194j001j346p92Q2P64J471K264K492J742P02K96N33Q35J029J338J688
54361A64291J673J161N58N74J627L244M104L331J731R79J470J864J051l76j217
54346A86065j352j634k514l593m209m009l114k130j689j750j655j123o43o32q05
$$ plain form
54331 155213 154481 153982 153609 153319 153176 153074 152833 152543 152457 152573 152669 152670 152575 152205 151481 150783 150460 150118 149024 147178
54311 147178 145325 143876 142572 141324 140636 140832 141476 141962 142250 142590 142919 143001 142919 142964 143087 142833 141893 140594
54293 140594 139764 140034 141250 142600 143400 143634 143690 143827 144113 144603 145228 145714 145948 146238 146836 147408 147460 147122 146987
54274 146987 147189 147198 146552 145413 144371 144038 144730 146085 147125 147223 146977 147487 148811 149783 149538 148529 147720 147402
54256 147402 147279 147297 147807 149002 150566 151947 152902 153738 155007 156846 158681 159766 159908 159484 158876 158179 157343
54239 157343 156319 155158 154207 153974 154450 154838 154430 153483 152699 152117 151228 150056 149267 149182 149501 150100 151256 152784
54221 152784 153792 153807 153518 153862 154852 155779 156157 155930 155081 153630 151946 150592 149780 149249 148654 147976 147535 147619
54203 147619 148030 148097 147355 146089 144898 143829 142369 140344 138390 137384 137711 139082 140702 141621 141411 140635
$$ packed form
54331A55213p32m99l73k90j43j02k41k90q6J16R6Jr5l70p24o98l23l42j094j846
54311A47178j853j449j304j248o88J96O44M86K88L40L29Q2q2M5J23k54r40j299
54293A40594q30K70J216J350Q00K34N6J37K86M90O25M86K34K90N98N72N2l38j35
54274A46987K02Ro46j139j042l33O92J355J040R8k46N10J324R72k45j009q09l18
54256A47402j23J8N10J195J564J381R55Q36J269J839J835J085J42m24o08o97q36
54239A57343j024j161r51k33M76L88m08r47p84n82q89j172p89q5L19N99J156J528
54221A52784J008J5k89L44R90R27L78k27q49j451j684j354q12n31n95o78m41Q4
54203A47619M11O7p42j266j191j069j460k025j954j006L27J371J620R19k10p76
$$ plain form
54187 140635 140263 140519 140686 140138 139137 138492 138821 140237 142339 144372 145742 146535 147236 147973 148418 148374 147901
54170 147901 146917 145328 143656 142858 143248 144165 144908 145417 145811 145937 145787 145807 146347 147160 147787 148115 148350 148820
54152 148820 149893 151578 153069 153362 152569 151937 152268 153024 153355 153239 153071 152872 152637 152841 153814 154951 155322
54135 155322 154786 154002 153566 153684 154369 155397 156284 156748 156921 156839 156259 155397 155183 156119 157418 158025 157985 158000 158121
54116 158121 157908 157563 157821 158781 159784 160483 161108 161666 161760 161372 161029 160958 160783 160233 159513 158866 158435 158684 160094
54097 160094 162178 163573 163601 163096 163227 164130 165264 166578 168502 171000 173368 175091 176494 178399 181342
54082 181342 185236 189731 194796 200859 208220 216543 225148 233691 242085 249752 255541 258615 259044 257222
54068 257222 253177 246919 239167 231160 223720 216871 210352 204144 198452 193536 189743 187387 186342 185890
$$ packed form
54187A40635l72K56J67n48j001o45L29J416K102K033J370P93P01P37M45m4m73
54170A47901r84j589j672p98L90R17P43N09L94J26j50K0N40Q13O27L28K35M70
54152A48820J073J685J491K93p93o32L31P56L31j16j68j99k35K04R73J137L71
54135A55322n36p84m36J18O85J028Q87M64J73q2n80q62k14R36J299O07m0J5J21
54116A58121k13l45K58R60J003O99O25N58R4l88l43p1j75n50p20o47m31K49J410
54097A60094K084J395K8n05J31R03J134J314J924K498K368J723J403J905K943
54082A81342L894M495N065O063P361Q323Q605Q543Q394P667N789L074M29j822
54068B57222m045o258p752q007p440o849o519o208n692m916l793k356j045m52
$$ plain form
54054 185890 185331 184728 184798 185972 187758 189254 190079 190566 191145 191948 193116 195118 198394 202800 207625 212153
54038 212153 216156 219939 224081 229063 234935 241361 248023 254907 262129 269600 276970 283760 289501 293951
54024 293951 297380 300515 304033 308218 313148 318825 324769 329759 332612 333347 333183 333136 332850 330993 326663
54009 326663 320180 312616 304857 297184 289490 281547 273101 264073 254904 246497 239526 233893 229106 224960
53995 224960 221476 218387 215297 212349 210091 208504 206760 204271 201446 199059 197354 196156 195362 194755 193788
53980 193788 192233 190749 190170 190369 190493 190193 189909 189970 190112 190078 190002 189965 189713 189217 189091 189984 191736 193528 194807
53961 194807 195750 196783 197852 198430 198212 197600 197276 197459 197925 198724 200353 202960 205892 208497 211028 214229
53945 214229 218271 222731 227502 233044 239619 246904 254628 263178 273228 284976 297970 311542 325217
$$ packed form
54054A85890n59o03P0J174J786J496Q25M87N79Q03J168K002L276M406M825M528
54038B12153M003L783M142M982N872O426O662O884P222P471P370O790N741M450
54024B93951L429L135L518M185M930N677N944M990K853P35j64m7k86j857m330
54009C26663o483p564p759p673p694p943q446r028r169q407o971n633m787m146
53995B24960l484l089l090k948k258j587j744k489k825k387j705j198p94o07r67
53980A93788j555j484n79J99J24l00k84O1J42l4p6l7k52m96j26Q93J752J792J279
53961A94807R43J033J069N78k18o12l24J83M66P99J629K607K932K605K531L201
53945B14229M042M460M771N542O575P285P724Q550J0050J1748J2994J3572J3675
$$ plain form
53932 325217 338728 351698 363320 372492 378451 381176 381062 378430 373643 367524 361243 355759 351636 349235
53918 349235 348664 349566 351387 353926 357311 361509 366225 371316 376845 382634 388154 393055 397490 401719 405553
53903 405553 408287 409073 407498 404103 400201 396798 393676 389921 385291 380501 376101 371667 366383 359978
53889 359978 352765 345181 337624 330435 323613 316689 309273 301676 294757 289112 284531 280206 275457 270380
53875 270380 265778 262299 259675 257025 253833 250296 246756 243277 239877 236686 233627 230370 226937 223946
53861 223946 221885 220435 218922 217156 215446 213941 212478 211046 209939 209316 208903 208266 207276 206192 205332
53846 205332 204744 204246 203815 203725 204108 204530 204469 204229 204827 206670 208819 209962 209777 208824 207466 205561 203181
53829 203181 200969 199588 199219 199673 200570 201327 201445 201039 200738 200845 200992 200908 201083 202186 204160 206490 209212
$$ packed form
53932C25217J3511J2970J1622R172N959K725j14k632m787o119o281n484m123k401
53918C49235n71R02J821K539L385M198M716N091N529N789N520M901M435M229L834
53903D05553K734P86j575l395l902l403l122l755m630m790m400m434n284o405
53889C59978p213p584p557p189o822o924p416p597o919n645m581m325m749n077
53875B70380m602l479k624k650l192l537l540l479l400l191l059l257l433k991
53861B23946k061j450j513j766j710j505j463j432j107o23m13o37r90j084q60
53846B05332n88m98m31r0L83M22o1k40N98J843K149J143j85r53j358j905k380
53829B03181k212j381l69M54Q97P57J18m06l01J07J47q4J75J103J974K330K722
$$ plain form
53812 209212 212928 217644 222236 225494 227371 228830 230745 233382 236701 240541 244479 248099 251651 256019
53798 256019 261656 267803 273131 277065 280210 283524 287367 291376 294983 297891 300136 301816 302879 303252
53784 303252 303099 302743 302253 301323 299673 297381 294615 291251 287044 282156 277208 272767 268906 265238 261237
53769 261237 256574 251379 246228 241760 238219 235378 232814 230232 227633 225267 223259 221214 218485 215043
53755 215043 211819 209834 209122 208814 208180 207201 206190 205262 204267 203009 201459 199948 199079 199195 199978 200836 201568
53738 201568 202321 202975 203095 202581 201920 201558 201368 201057 200851 201470 203391 206250 209051 211049 212439 214033 216202
53721 216202 218436 220169 221599 223205 224820 225932 226714 227874 229391 230411 230753 231629 234098 237506 240303
53706 240303 242038 243624 245792 248260 250519 252597 254622 256353 257722 259456 262397 266268 269687 271700
$$ packed form
53812B09212L716M716M592L258J877J459J915K637L319L840L938L620L552M368
53798B56019N637O147N328L934L145L314L843M009L607K908K245J680J063L73
53784C03252j53l56m90r30j650k292k766l364m207m888m948m441l861l668m001
53769B61237m663n195n151m468l541k841k564k582k599k366k008k045k729l442
53755B15043l224j985p12l08o34r79j011r28r95j258j550j511q69J16P83Q58P32
53738B01568P53O54J20n14o61l62j90l11k06O19J921K859K801J998J390J594K169
53721B16202K234J733J430J606J615J112P82J160J517J020L42Q76K469L408K797
53706B40303J735J586K168K468K259K078K025J731J369J734K941L871L419K013
$$ plain form
53692 271700 272882 274564 277245 280244 282799 284882 286650 287696 287501 286363 285220 284452 283478 281741 279583
53677 279583 277790 276635 275758 274788 273689 272594 271629 270917 270520 270373 270418 270741 271416 272213 272622 272233 271114
53660 271114 269825 269015 268886 269022 268881 268420 268054 268062 268278 268423 268440 268358 268095 267623 267161 267003 267246 267819 268664 269684
53640 269684 270660 271420 272092 273030 274499 276461 278614 280596 282272 283900 285889 288340 290933 293359 295689
53625 295689 298160 300746 303172 305326 307502 310139 313425 317191 321161 325208 329335 333565 338006 342953
53611 342953 348646 354924 361387 367942 374769 381597 387522 391980 395443 398599 401139 402092 401265 399570 397887
53596 397887 396271 394473 392641 391187 390367 390134 390017 389147 386992 384174 381962 380823 380164 379608 379581 380165
53580 380165 380283 378890 376365 373932 372136 370734 369692 369275 369199 368588 366996 364920 363190 362332 362478 363358
$$ packed form
53692B71700J182J682K681K999K555K083J768J046j95j138j143p68r74j737k158
53677B79583j793j155q77r70j099j095r65p12l97j47M5L23O75P97M09l89j119
53660B71114j289q10j29J36j41m61l66QK16J45J7q2k63m72m62j58K43N73Q45J020
53640B69684R76P60O72R38J469J962K153J982J676J628J989K451K593K426K330
53625B95689K471K586K426K154K176K637L286L766L970M047M127M230M441M947
53611C42953N693O278O463O555O827O828N925M458L463L156K540R53q27j695j683
53596C97887j616j798j832j454q20k33j17q70k155k818k212j139o59n56k7N84
53580C80165J18j393k525k433j796j402j042m17p6o11j592k076j730q58J46Q80
$$ plain form
53564 363358 364231 364323 363549 362542 361918 361784 361896 361964 361830 361728 362282 363913 366273 368667 370947 373494 376331
53547 376331 378798 380266 380788 380942 381380 382565 384522 386761 388885 391372 395227 400663 406664 412138 417057
53532 417057 422007 427151 432280 437649 444029 451859 460895 470827 481700 493494 505723 517833 529715
53519 529715 541500 553118 564622 576783 590688 606545 623495 640928 659455 679982 702271
53508 702271 725182 748231 771993 796775 821681 845442 867715 889087 910283 931792 953886
53497 953886 976306 998153 1018649 1038009 1057057 1076082 1094597 1112255 1129459 1146868 1164704
53486 1164704 1182768 1200853 1218879 1236766 1254380 1271577 1288246 1304404 1320228 1335857 1351091
53475 1351091 1365405 1378277 1389415 1398666 1405891 1410988 1413938 1414694 1413068 1408832 1402018 1393118 1382828
$$ packed form
53564C63358Q73R2p74j007o24j34J12O8j34j02N54J631K360K394K280K547K837
53547C76331K467J468N22J54M38J185J957K239K124K487L855N436O001N474M919
53532D17057M950N144N129N369O380P830R036R932J0873J1794J2229J2110J1882
53519E29715J1785J1618J1504J2161J3905J5857J6950J7433J8527K0527K2289
53508G02271K2911K3049K3762K4782K4906K3761K2273K1372K1196K1509K2094
53497I53886K2420K1847K0496J9360J9048J9025J8515J7658J7204J7409J7836
53486A164704J8064J8085J8026J7887J7614J7197J6669J6158J5824J5629J5234
53475A351091J4314J2872J1138R251P225N097K950P56j626m236o814q900j0290
$$ plain form
53462 1382828 1371562 1359333 1346183 1332455 1318338 1303438 1287311 1270318 1253324 1236478 1218997
53451 1218997 1200411 1181280 1162204 1142835 1122620 1102078 1082453 1064309 1047310 1031317 1016812
53440 1016812 1004109 992860 982634 973410 965261 958145 952340 948554 947118 947365 948232 949224 950445 951982
53426 951982 953795 956240 960184 966384 974861 984996 996165 1008189 1021296 1035771 1051689 1068945
53414 1068945 1087449 1107286 1128726 1152038 1177253 1204070 1232087 1261088 1291024 1321821 1353469
53403 1353469 1386401 1421472 1459367 1500075 1542953 1587145 1631980 1677327 1723746 1771971 1822095
53392 1822095 1873498 1925725 1978981 2033434 2088409 2142741 2195688 2247119 2297014 2345247 2391787
53381 2391787 2436680 2479784 2520690 2558834 2593564 2624426 2651627 2675799 2696973 2714096 2726008
$$ packed form
53462A382828j1266j2229j3150j3728j4117j4900j6127j6993j6994j6846j7481
53451A218997j8586j9131j9076j9369k0215k0542j9625j8144j6999j5993j4505
53440A016812j2703j1249j0226r224q149p116n805l786j436K47Q67R92J221J537
53426I51982J813K445L944O200Q477J0135J1169J2024J3107J4475J5918J7256
53414A068945J8504J9837K1440K3312K5215K6817K8017K9001K9936L0797L1648
53403A353469L2932L5071L7895M0708M2878M4192M4835M5347M6419M8225N0124
53392A822095N1403N2227N3256N4453N4975N4332N2947N1431M9895M8233M6540
53381B391787M4893M3104M0906L8144L4730L0862K7201K4172K1174J7123J1912
$$ plain form
53370 2726008 2732479 2733786 2729759 2720000 2704734 2684507 2659117 2627715 2590093 2547183 2500278 2450492
53358 2450492 2399061 2347306 2295967 2245172 2195141 2146190 2097950 2049556 2001109 1954044 1909425
53347 1909425 1866583 1824236 1782305 1741708 1702743 1664678 1626927 1589747 1553630 1518764 1485407
53336 1485407 1454235 1425794 1399810 1375433 1352206 1330564 1311244 1294351 1279171 1264940 1251575
53325 1251575 1239381 1228214 1217270 1205716 1193278 1180175 1166852 1153914 1142015 1131480 1122098
53314 1122098 1113456 1105484 1098637 1093550 1090425 1088754 1087857 1087789 1089392 1093151 1098396 1104144 1110396 1117882 1126788
53299 1126788 1136697 1147869 1161544 1178442 1197730 1218011 1238805 1260512 1283504 1307930 1333956
53288 1333956 1361372 1389061 1415533 1440053 1462894 1484528 1504923 1523619 1540142 1554364 1566597
$$ packed form
53370B726008O471J307m027r759j5266k0227k5390l1402l7622m2910m6905m9786
53358B450492n1431n1755n1339n0795n0031m8951m8240m8394m8447m7065m4619
53347A909425m2842m2347m1931m0597l8965l8065l7751l7180l6117l4866l3357
53336A485407l1172k8441k5984k4377k3227k1642j9320j6893j5180j4231j3365
53325A251575j2194j1167j0944j1554j2438j3103j3323j2938j1899j0535r382
53314A122098q642p972o847n087l125j671q97o8J603L759N245N748O252P486Q906
53299A126788R909J1172J3675J6898J9288K0281K0794K1707K2992K4426K6026
53288A333956K7416K7689K6472K4520K2841K1634K0395J8696J6523J4222J2233
$$ plain form
53277 1566597 1577196 1585941 1592082 1595171 1595465 1593216 1588006 1579337 1567562 1553669 1538275 1521384 1502954
53264 1502954 1482998 1461137 1436718 1409722 1381171 1352374 1323982 1295876 1267661 1239132 1210413
53253 1210413 1181854 1153705 1125949 1098607 1072099 1046963 1023139 999822 976157 952007 927958
53242 927958 904763 882778 861744 840977 819931 798720 778074 758714 740866 724369 709083
53231 709083 695050 682298 670663 659886 649814 640426 631691 623499 615712 608123 600279 591529 581454
53218 581454 570126 557791 544547 530618 516717 503560 491013 478322 465389 453293 443159
53207 443159 434889 427447 420150 413208 407087 401750 396585 390836 384107 376606 368900 361325 353807 346369
53193 346369 339601 334250 330364 327091 323364 318712 313502 308584 304692 301979 299983 297953 295259 291657
$$ packed form
53277A566597J0599Q745O141L089K94k249n210q669j1775j3893j5394j6891j8430
53264A502954j9956k1861k4419k6996k8551k8797k8392k8106k8215k8529k8719
53253A210413k8559k8149k7756k7342k6508k5136k3824k3317k3665k4150k4049
53242I27958k3195k1985k1034k0767k1046k1211k0646j9360j7848j6497j5286
53231G09083j4033j2752j1635j0777j0072r388q735q192p787p589p844q750j0075
53218E81454j1328j2335j3244j3929j3901j3157j2547j2691j2933j2096j0134
53207D43159q270p442p297o942o121n337n165n749o729p501p706p575p518p438
53193C46369o768n351l886l273l727m652n210m918l892k713j996k030k694l602
$$ plain form
53179 291657 287476 283517 280451 278207 276130 273828 271593 269915 268905 268338 267942 267449 266607 265411 264148
53164 264148 263052 262102 261237 260474 259649 258401 256625 254659 252807 251023 249274 247744 246412 244838 242846
53149 242846 241016 239994 239604 239214 238676 238341 238361 238636 239355 240856 242898 244643 245582 245951 246154 246256 246276 246487
53131 246487 247081 247762 248049 247862 247613 247756 248349 249058 249547 249821 250102 250410 250536 250495 250675 251298 252035 252473 252675
53112 252675 252877 252918 252482 251751 251266 251150 250974 250403 249552 248653 247812 247153 246737 246271 245320 243917 242631 241840
53094 241840 241328 240684 239770 238637 237358 236115 235246 234965 235208 235758 236337 236604 236401 236013 235894 236074 236192 236063
53076 236063 235818 235455 234779 233971 233661 234110 234694 234548 233484 231986 230607 229671 229261 229156 228949 228561 228433 228907
53058 228907 229605 229788 229225 228299 227349 226337 225255 224468 224377 224848 225196 224798 223732 222784 222730 223579 224564 224943
$$ packed form
53179B91657m181l959l066k244k077k302k235j678j010n67l96m93q42j196j263
53164B64148j096r50q65p63q25j248j776j966j852j784j749j530j332j574j992
53149B42846j830j022l90l90n38l35K0K75P19J501K042J745R39L69K03J02K0K11
53131B46487N94O81K87j87k49J43N93P09M89K74K81L08J26m1J80O23P37M38K02
53112B52675K02M1m36p31m85j16j76n71q51q99q41o59m16m66r51j403j286p91
53094B41840n12o44r14j133j279j243q69k81K43N50N79K67k03l88j19J80J18j29
53076B36063k45l63o76q08l10M49N84j46j064j498j379r36m10j05k07l88j28M74
53058B28907O98J83n63r26r50j012j082p87r1M71L48l98j066r48n4Q49R85L79
$$ plain form
53040 224943 224719 224554 225060 226231 227476 228093 227805 226929 226009 225315 224773 224392 224505 225401 226825 228081 228680
53023 228680 228748 228751 228951 229218 229378 229581 230136 230970 231377 230531 228301 225561 223646 223405 224607 226188 227173 227457
53005 227457 227719 228617 230225 232173 234013 235315 235733 235306 234535 233893 233356 232646 231755 230929 230274 229779 229698 230458
52987 230458 232099 234090 235815 237012 237680 237854 237661 237424 237545 238257 239461 240718 241483 241501 241003 240408 240006
52970 240006 240006 240670 242051 243810 245615 247642 250265 253337 256177 258225 259348 259529 258732 257159 255244 253255
52954 253255 251212 249199 247370 245633 243748 241796 240090 238644 237217 235993 235510 235684 235535 234351 232594
52939 232594 231227 230599 230477 230668 230985 230931 230144 229007 228187 227713 227079 226173 225438 225111 224991 225112 225924 227467
52921 227467 228893 229345 228920 228311 227797 227171 226568 226658 227812 229522 230975 231889 232437 232590 232050 230885 229746
$$ packed form
53040B24943k24j65N06J171J245O17k88q76r20o94n42l81J13Q96J424J256N99
53023B28680O8LK00K67J60K03N55Q34M07q46k230k740j915k41J202J581R85K84
53005B27457K62Q98J608J948J840J302M18m27p71o42n37p10q91q26o55m95q1P60
52987B30458J641J991J725J197O68J74j93k37J21P12J204J257P65J8m98n95m02
52970B40006%O64J381J759J805K027K623L072K840K048J123J81p97j573j915j989
52954B53255k043k013j829j737j885j952j706j446j427j224m83J74j49j184j757
52939B32594j367o28j22J91L17n4p87j137q20m74o34r06p35l27j20J21Q12J543
52921B27467J426M52m25o09n14o26o03R0J154J710J453R14N48J53n40j165j139
$$ plain form
52904 229746 229221 229234 229279 229018 228473 227883 227641 228110 229131 229895 229730 228938 228425 228625 229219 229906 230812 231948 232794
52885 232794 232830 232194 231483 231099 231024 231023 230826 230276 229540 229050 229076 229514 230198 231196 232606 234314 236140 238002 239779
52866 239779 241251 242443 243757 245450 247169 248296 248607 248316 247664 246803 245983 245393 244790 243642 241762 239567
52850 239567 237542 235650 233463 230853 228358 226731 226083 225653 224637 223109 221844 221265 220941 220237 219017
52835 219017 217506 215930 214706 214661 216418 219556 222788 225021 226023 226143 225816 225399 225121 224984 224820 224532
52819 224532 224168 223778 223393 223194 223515 224575 226242 228085 229675 230947 232351 234481 237389 240361 242535
52804 242535 243613 243806 243261 241889 239739 237185 234617 232120 229574 226897 224182 221714 219927 219168 219378
52789 219378 220036 220491 220379 219837 219325 219147 219073 218588 217608 216751 216715 217553 218799 220068 221205 221991 222207 222064
$$ packed form
52904B29746n25J3M5k61n45n90k42M69J021P64j65p92n13K00N94O87R06J136Q46
52885B32794L6o36p11l84p5jj97n50p36m90K6M38O84R98J410J708J826J862J777
52866B39779J472J192J314J693J719J127L11k91o52q61q20n90o03j148j880k195
52850B39567k025j892k187k610k495j627o48m30j016j528j265n79l24p04j220
52835B19017j511j576j224m5J757L138L232K233J002J20l27m17k78j37j64k88
52819B24532l64l90l85j99L21J060J667J843J590J272J404K130K908K972K174
52804B42535J078J93n45j372k150k554k568k497k546k677k715k468j787p59K10
52789B19378O58M55j12n42n12j78p4m85r80q57l6Q38J246J269J137P86K16j43
$$ plain form
52771 222064 222120 222618 223250 223692 223978 224120 223807 222839 221602 220663 220110 219729 219640 220169 221103 221754 221966 222473 223791
52752 223791 225292 225982 225845 225760 226180 226656 226718 226554 226522 226644 226961 227849 229430 231065 232055 232642 233706 235610
52734 235610 237894 240052 241942 243365 243876 243330 242273 241456 241204 241377 241741 242152 242511 242628 242104 240505 237884
52717 237884 235023 232762 231204 229968 229122 229196 230211 231321 231757 231601 231334 231114 230893 230828 231064 231347 231287 230839
52699 230839 230228 229626 229234 229429 230441 231968 233416 234365 234582 233874 232372 230864 230376 231319 233248 235358
52683 235358 237030 237982 238190 237767 236858 235684 234651 234159 234171 234211 233900 233340 232835 232537 232470 232596 232718 232639 232629
52664 232629 233351 235049 237126 238779 239734 240152 240230 240279 240801 242040 243704 245418 247093 248568 249367 249312 248937
52647 248937 248732 248334 247091 245150 243345 242183 241560 241268 241175 240986 240485 239942 239845 240332 241278 242643 244184
$$ packed form
52771B22064N6M98O32M42K86J42l13r68j237r39n53l81q9N29R34O51K12N07J318
52752B23791J501O90j37q5M20M76O2j64l2J22L17Q88J581J635R90N87J064J904
52734B35610K284K158J890J423N11n46j057q17k52J73L64M11L59J17n24j599k621
52717B37884k861k261j558j236q46P4J015J110M36j56k67k20k21o5K36K83o0m48
52699B30839o11o02l92J95J012J527J448R49K17p08j502j508m88R43J929K110
52683B35358J672R52K08m23r09j174j033m92J2M0l11n60n05k98o7J26J22p9j0
52664B32629P22J698K077J653R55M18P8M9N22J239J664J714J675J475P99n5l75
52647B48937k05l98j243j941j805j162o23k92r3j89n01n43r7M87R46J365J541
$$ plain form
52630 244184 245239 245496 245700 246731 248294 249437 250139 251200 252557 252985 251846 249983 248343 246709 244517
52615 244517 242101 240335 239547 239551 240286 241671 243143 244042 244360 244560 244819 244907 244712 244417 244172 243936 243635 243304
52597 243304 243142 243511 244605 245966 246676 246363 245770 245994 247347 249221 250873 252011 252782 253478 254236 254857 255049
52580 255049 254953 255125 255779 256336 256086 255135 254289 254061 254077 253583 252353 251003 250371 250622 251105 251207 251139 251537 252445
52561 252445 253204 253377 253224 253071 252701 251774 250511 249564 249333 249599 249712 249053 247598 246099 245383 245387 245332 244856 244415
52542 244415 244329 244137 243374 242428 242039 242393 243239 244459 245875 246896 247150 247263 248185 249808 250962 250823 249663
52525 249663 248220 247019 246441 246759 247782 248899 249717 250312 250758 250921 250886 251073 251701 252598 253779 255711 258584
52508 258584 261802 264666 267176 269673 272013 273703 274704 275450 276078 276198 275505 274100 272050 269170 265578
$$ packed form
52630B44184J055K57K04J031J563J143P02J061J357M28j139j863j640j634k192
52615B44517k416j766p88MP35J385J472Q99L18K00K59Q8j95k95k45k36l01l31
52597B43304j62L69J094J361P10l13n93K24J353J874J652J138P71O96P58O21J92
52580B55049r6J72O54N57k50r51q46k28J6m94j230j350o32K51M83J02o8L98R08
52561B52445P59J73j53j53l70r27j263r47k31K66J13o59j455j499p16Mn5m76m41
52542B44415q6j92p63r46l89L54Q46J220J416J021K54J13R22J623J154j39j160
52525B49663j443j201n78L18J023J117Q18N95M46J63l5J87O28Q97J181J932K873
52508B58584L218K864K510K497K340J690J001P46O28J20o93j405k050k880l592
$$ plain form
52493 265578 262090 259576 258147 257302 256732 256608 257099 258046 259117 260034 260558 260525 260054 259528 259309 259603 260607
52476 260607 262404 264541 266036 266157 265199 264288 264437 265782 267552 268691 268729 268230 268240 269235 270859 272744 275106
52459 275106 278161 281344 283644 284560 284297 283222 281642 279978 278530 277065 275112 272687 270227 267786 264881
52444 264881 261358 257928 255589 254776 255129 255818 256056 255667 255194 255117 255097 254469 253334 252442 252012 251474 250558 249799
52426 249799 249641 249863 250281 251211 252698 254044 254804 255595 257113 258890 259935 260253 260832 262365 264848 268270
52410 268270 272843 278503 284933 292171 300520 309786 319182 328058 336102 342706 346792 347645 345570 341468
52396 341468 336008 329427 321913 314073 306995 301711 298381 296189 294281 292558 291267 290205 288934 287552
52382 287552 286584 286181 286055 286169 286803 287865 288816 289491 290458 292323 295125 298580 302402 306186 309489 312264
$$ packed form
52493B65578l488k514j429q45n70j24M91R47J071R17N24l3m71n26k19K94J004
52476B60607J797K137J495J21r58r11J49J345J770J139L8m99J0R95J624J885K362
52459B75106L055L183K300R16k63j075j580j664j448j465j953k425k460k441k905
52444B64881l523l430k339q13L53O89K38l89m73p7k0o28j135q92m30n38r16p59
52426B49799j58K22M18R30J487J346P60P91J518J777J045L18N79J533K483L422
52410B68270M573N660O430P238Q349R266R396Q876Q044O604M086Q53k075m102
52396C41468n460o581p514p840p078n284l330k192j908j723j291j062j271j382
52382B87552r68m03j26J14O34J062R51O75R67J865K802L455L822L784L303K775
$$ plain form
52366 312264 314867 317386 319417 320691 321495 322168 322628 322734 322793 323300 324326 325444 326153 326246 325939 325744 326033
52349 326033 326720 327648 329203 331972 335703 339236 341768 343730 346055 349080 352554 356317 360407 364814 369691
52334 369691 375575 382863 391133 399495 407614 416038 425527 436404 448502 461408 474738 488419 502676
52321 502676 517598 532911 548426 564464 581415 599085 617005 635215 654088 673276 691561
52310 691561 708103 723418 738691 754465 770390 786055 801545 817127 832657 847491 860921
52299 860921 872698 883125 892619 901173 908412 914135 918499 921570 923019 922510 920128 916128 910542 903522
52285 903522 895935 888987 883139 877848 872566 867513 863214 859743 856915 854895 854106 854699 856598 859945 864974
52270 864974 871486 878985 887357 896858 907383 918374 929601 941360 953543 965176 975514 985159
$$ packed form
52366C12264K603K519K031J274Q04O73M60J06N9N07J026J118P09R3l07j95K89
52349C26033O87R28J555K769L731L533K532J962K325L025L474L763M090M407M877
52334C69691N884P288Q270Q362Q119Q424R489J0877J2098J2906J3330J3681J4257
52321E02676J4922J5313J5515J6038J6951J7670J7920J8210J8873J9188J8285
52310F91561J6542J5315J5273J5774J5925J5665J5490J5582J5530J4834J3430
52299H60921J1777J0427R494Q554P239N723M364L071J449n09k382m000n586p020
52285I03522p587o948n848n291n282n053m299l471k828k020p89N93J899L347N029
52270H64974O512P499Q372R501J0525J0991J1227J1759J2183J1633J0338R645
$$ plain form
52258 985159 995456 1007065 1019698 1032948 1046587 1060129 1072889 1084620 1095488 1105233 1113029 1118440
52246 1118440 1121996 1124394 1125555 1124861 1122051 1117393 1111155 1103343 1094034 1083669 1072915 1062306 1051958
52233 1051958 1041536 1030652 1019451 1008667 998919 990050 981454 972991 965279 958996 954110 949973 946053
52220 946053 942363 939221 936825 935192 934340 934341 935217 936959 939595 943036 946904 950773 954709 959277 964780
52205 964780 970665 975921 979972 983046 985794 988792 992284 996150 1000057 1003768 1007292 1010726 1014165 1017846
52191 1017846 1022056 1026627 1030824 1034090 1036662 1038988 1040708 1040804 1038739 1034984 1030381 1025499 1020616 1015767
52177 1015767 1010478 1003890 995529 985856 975943 966858 959401 954012 950608 948646 947499 946650 945629 944220
52163 944220 942937 942858 944604 947653 950906 953751 956374 959209 962333 965324 967577 968900 969850 971232 973153
$$ packed form
52258I85159J0297J1609J2633J3250J3639J3542J2760J1731J0868R745P796N411
52246A118440L556K398J161o94k810m658o238p812r309j0365j0754j0609j0348
52233A051958j0422j0884j1201j0784r748q869q596q463p712o283m886m137l920
52220I46053l690l142k396j633q52JQ76J742K636L441L868L869L936M568N503
52205I64780N885N256M051L074K748K998L492L866L907L711L524L434L439L681
52191A017846M210M571M197L266K572K326J720R6k065l755m603m882m883m849
52177A015767n289o588q361r673r913r085p457n389l404j962j147q49j021j409
52163I44220j283p9J746L049L253K845K623K835L124K991K253J323R50J382J921
$$ plain form
52148 973153 974844 975629 975798 976302 977780 980080 982483 984119 984412 983549 982470 982084 982517 983238 983825 984381 985295
52131 985295 986944 989689 994014 1000517 1009696 1021654 1036044 1052416 1070624 1090691 1112331 1134963
52119 1134963 1158296 1182610 1208186 1234732 1261504 1287815 1313236 1337559 1360815 1383073 1404048
52108 1404048 1423072 1439667 1453912 1466159 1476717 1485982 1494397 1501890 1507774 1511744 1514585 1517268 1519524
52095 1519524 1520033 1518021 1513974 1508610 1501709 1492253 1479418 1463313 1445106 1426515 1408822 1392215 1376354
52082 1376354 1361509 1348639 1338266 1329939 1323150 1318198 1315599 1315030 1315592 1317017 1320013 1325294 1332761 1341778
52068 1341778 1351862 1362836 1374566 1386863 1399595 1412681 1426011 1439423 1452748 1465807 1478470
52057 1478470 1490749 1502648 1513806 1523462 1531005 1536488 1540350 1542672 1543063 1541296 1537647 1532321 1524910
$$ packed form
52148I73153J691P85J69N04J478K300K403J636K93q63j079l86M33P21N87N56R14
52131I85295J649K745M325O503R179J1958J4390J6372J8208K0067K1640K2632
52119A134963K3333K4314K5576K6546K6772K6311K5421K4323K3256K2258K0975
52108A404048J9024J6595J4245J2247J0558R265Q415P493N884L970K841K683K256
52095A519524N09k012m047n364o901r456j2835j6105j8207j8591j7693j6607j5861
52082A376354j4845j2870j0373q327o789m952k599n69N62J425K996N281P467R017
52068A341778J0084J0974J1730J2297J2732J3086J3330J3412J3325J3059J2663
52057A478470J2279J1899J1158R656P543N483L862K322L91j767l649n326p411
$$ plain form
52044 1524910 1514859 1502311 1488047 1472647 1456194 1438820 1421058 1403417 1386045 1369106 1353100
52033 1353100 1338372 1324546 1310884 1297095 1283382 1269767 1255908 1241688 1227564 1214081 1201268
$$ packed form
52044A524910j0051j2548j4264j5400j6453j7374j7762j7641j7372j6939j6006
52033A353100j4728j3826j3662j3789j3713j3615j3859j4220j4124j3483j2813
$$ [...]
##END NTUPLES=NMR SPECTRUM
##END=
