
##TITLE=UV1209_M4_1332-1205_7185688_4Yl3yh2TNZ
##JCAMPDX= 6.0         $$ Bruker NMR JCAMP-DX V2.0
##DATA TYPE= NMR SPECTRUM
##DATA CLASS= NTUPLES
##ORIGIN= BRUKER
##OWNER= Administrator
$$ 1.72 TOPSPIN		Version 2.1
$$ 2012-12-06 03:00:23.975 -0500  Administrator@X
$$ Compression mode = diff/dup
##.OBSERVE FREQUENCY= 400.02188249412
##.OBSERVE NUCLEUS= ^1H
##.ACQUISITION MODE= SIMULTANEOUS (DQD)
##.ACQUISITION SCHEME= undefined
##.AVERAGES= 8
##.DIGITISER RES= 22
##SPECTROMETER/DATA SYSTEM= spect
##.PULSE SEQUENCE= zg30
##.SOLVENT NAME= COFFEE_meoh
##.SHIFT REFERENCE= INTERNAL, COFFEE_meoh, 1, 14.98509
##AUDIT TRAIL= $$ (NUMBER, WHEN, WHO, WHERE, PROCESS, VERSION, WHAT)
$$ ##TITLE= Audit trail, TOPSPIN		Version 2.1
$$ ##JCAMPDX= 5.01
$$ ##ORIGIN= Bruker BioSpin GmbH
$$ ##OWNER= Administrator
$$ $$ E:\/data/COFFEE/nmr/UV1209_M4_1332-1205_7185688_4Yl3yh2TNZ/10/pdata/1/auditp.txt
$$ ##AUDIT TRAIL=  $$ (NUMBER, WHEN, WHO, WHERE, PROCESS, VERSION, WHAT)
(   1,<2012-12-06 03:00:15.694 -0500>,<Administrator>,<X>,<go>,<TOPSPIN 2.1>,
      <created by zg
	started at 2012-12-06 02:59:09.569 -0500,
	POWCHK enabled, PULCHK disabled,
       configuration hash MD5:
       86 BA 57 50 F2 9D 5C 9B 26 00 A9 28 5F 66 2E 89
       data hash MD5: 64K
       9F E5 02 F3 F3 63 56 77 6E 84 29 DB 03 B1 F1 34>)
(   2,<2012-12-06 03:00:18.866 -0500>,<Administrator>,<X>,<proc1d>,<TOPSPIN 2.1>,
      <Start of raw data processing
       efp LB = 0 FT_mod = 6 PKNL = 1 PHC0 = 0 PHC1 = 0 SI = 32K 
       data hash MD5: 32K
       63 B6 C6 17 E0 8C 60 CD EA 48 F9 19 46 C1 65 35>)
(   3,<2012-12-06 03:00:19.350 -0500>,<Administrator>,<X>,<proc1d>,<TOPSPIN 2.1>,
      <pk PHC0 = 100.6128 PHC1 = 0 
       data hash MD5: 32K
       71 3E 21 51 15 BB DB B9 7B BE 08 BB FC 1D 09 92>)
(   4,<2012-12-06 03:00:19.585 -0500>,<Administrator>,<X>,<proc1d>,<TOPSPIN 2.1>,
      <abs ABSG = 1 
       data hash MD5: 32K
       7C 8C 88 EC 61 35 DA 62 4E 9F CB FC 37 BB 80 F4>)
(   5,<2012-12-06 03:00:19.725 -0500>,<Administrator>,<X>,<proc1d>,<TOPSPIN 2.1>,
      <abs ABSG = 2 
       data hash MD5: 32K
       B9 19 46 E9 56 B1 B4 48 7B DA DC 4A 06 47 0E 37>)
(   6,<2012-12-06 03:00:19.866 -0500>,<Administrator>,<X>,<proc1d>,<TOPSPIN 2.1>,
      <abs ABSG = 3 
       data hash MD5: 32K
       E2 1C EB 7A 90 9E 23 B6 1A 99 AA 5A A0 12 F5 95>)
(   7,<2012-12-06 03:00:20.022 -0500>,<Administrator>,<X>,<proc1d>,<TOPSPIN 2.1>,
      <abs ABSG = 4 
       data hash MD5: 32K
       36 4A 2D E6 99 57 B1 23 AE B2 B9 E0 B7 4A 47 DF>)
(   8,<2012-12-06 03:00:20.178 -0500>,<Administrator>,<X>,<proc1d>,<TOPSPIN 2.1>,
      <abs ABSG = 5 
       data hash MD5: 32K
       10 75 9F 3A B1 0A D7 F3 DE E2 BE C3 70 50 DC B0>)
$$ ##END=
$$ 
$$ $$ hash MD5
$$ $$ 9B 50 30 E2 7B 27 6F 1E BF 64 B6 94 4A 64 FC 1C
##$RELAX= 
##$RELAX= 
##$RELAX= 
##$RELAX= 
##$RELAX= 
##$RELAX= 
##$RELAX= 
$$ Bruker specific parameters
$$ --------------------------
##$DU= <E:\>
##$EXPNO= 10
$$ [...]
150 150 150 150 150 150 150 150
##$TP07= 0
##$TPNAME0= <>
##$TPNAME1= <>
##$TPNAME2= <>
##$TPNAME3= <>
##$TPNAME4= <>
##$TPNAME5= <>
##$TPNAME6= <>
##$TPNAME7= <>
##$TPOAL= (0..7)
0.5 0.5 0.5 0.5 0.5 0.5 0.5 0.5
##$TPOFFS= (0..7)
0 0 0 0 0 0 0 0
##$TUNHIN= 0
##$TUNHOUT= 0
##$TUNXOUT= 0
##$USERA1= <user>
##$USERA2= <user>
##$USERA3= <user>
##$USERA4= <user>
##$USERA5= <user>
##$V9= 5
##$VALIST= <valist>
##$VCLIST= <CCCCCCCCCCCCCCC>
##$VD= 0
##$VDLIST= <DDDDDDDDDDDDDDD>
##$VPLIST= <PPPPPPPPPPPPPPP>
##$VTLIST= <TTTTTTTTTTTTTTT>
##$WBST= 1024
##$WBSW= 4
##$XGAIN= (0..3)
0 0 0 0
##$XL= 0
##$YL= 0
##$YMAX_a= 641742
##$YMIN_a= -548608
##$ZGOPTNS= <>
##$ZL1= 120
##$ZL2= 120
##$ZL3= 120
##$ZL4= 120
##$ABSF1= 14.98509
##$ABSF2= -5.573092
##$ABSG= 5
##$ABSL= 3
##$ALPHA= 0
##$AQORDER= 0
##$ASSFAC= 0
##$ASSFACI= 0
##$ASSFACX= 0
##$ASSWID= 0
##$AUNMP= <proc_prof1d_extract_pilot.lims>
##$AXLEFT= 0
##$AXNAME= <>
##$AXNUC= <1H>
##$AXRIGHT= 0
##$AXTYPE= 0
##$AXUNIT= <>
##$AZFE= 0.1
##$AZFW= 0.1
##$BCFW= 0
##$BC_mod= 0
##$BYTORDP= 0
##$COROFFS= 0
##$CY= 15
##$DATMOD= 1
##$DC= 0
##$DFILT= <>
##$DTYPP= 0
##$F1P= 0
##$F2P= 0
##$FCOR= 0.5
##$FTSIZE= 32768
##$FT_mod= 6
##$GAMMA= 0
##$GB= 0
##$INTBC= 1
##$INTSCL= 1
##$ISEN= 128
##$LB= 0
##$LEV0= 0
##$LPBIN= 0
##$MAXI= 10000
##$MC2= 0
##$MEAN= 0
##$ME_mod= 0
##$MI= 0
##$NCOEF= 0
##$NC_proc= -8
##$NLEV= 6
##$NOISF1= 0
##$NOISF2= 0
##$NSP= 0
##$NTH_PI= 0
##$NZP= 0
##$OFFSET= 14.98509
##$PC= 1
##$PHC0= 100.6128
##$PHC1= 0
##$PH_mod= 1
##$PKNL= yes
##$PPARMOD= 0
##$PPDIAG= 0
##$PPIPTYP= 0
##$PPMPNUM= 2147483647
##$PPRESOL= 1
##$PSCAL= 4
##$PSIGN= 0
##$PYNMP= <proc.py>
##$REVERSE= no
##$SF= 400.02
##$SI= 32768
##$SIGF1= 0
##$SIGF2= 0
##$SINO= 400
##$SIOLD= 32768
##$SPECTYP= <>
##$SREGLST= <1H.CDCl3>
##$SSB= 0
##$STSI= 32768
##$STSR= 0
##$SW_p= 8223.68421052631
##$SYMM= 0
##$S_DEV= 0
##$TDeff= 65536
##$TDoff= 0
##$TI= <>
##$TILT= no
##$TM1= 0
##$TM2= 0
##$TOPLEV= 0
##$USERP1= <user>
##$USERP2= <user>
##$USERP3= <user>
##$USERP4= <user>
##$USERP5= <user>
##$WDW= 1
##$XDIM= 32768
##$YMAX_p= 479351380
##$YMIN_p= -698458
##$CURPLOT= <Network HP LaserJet P1505>
##$CURPRIN= <$Network HP LaserJet P1505>
##$DFORMAT= <normdp>
##$LAYOUT= <+/1D_H.xwp>
##$LFORMAT= <normlp>
##$PFORMAT= <normpl>
##$SURQMSG= 1
$$ End of Bruker specific parameters
$$ ---------------------------------
##NTUPLES= NMR SPECTRUM
##VAR_NAME=  FREQUENCY,     SPECTRUM/REAL,   SPECTRUM/IMAG
##SYMBOL=    X,             R,               I
##VAR_TYPE=  INDEPENDENT,   DEPENDENT,       DEPENDENT
##VAR_FORM=  AFFN,          ASDF,            ASDF
##VAR_DIM=   32768,         32768,           32768
##UNITS=     HZ,            ARBITRARY UNITS, ARBITRARY UNITS
##FACTOR=    0.250966925370066, 1,           1
##FIRST=     8223.43324360094, -38947,       -212518
##LAST=      0,             251128,          -94799
##MIN=       0,             -698458,         0
##MAX=       8223.43324360094, 479351380,    0
$$ Real data points
##PAGE= N=1
##DATA TABLE= (X++(R..R)), XYDATA
$$ [...]
$$ plain form
19496 -268356 -44665 171902 286790 22742 -126220 -37134 -88214 -328102 -163385 -101257
19486 -101257 -116627 -68813 -517079 -103029 70015 -55757 13031 -33895 -108788 -240627 -7479
19474 -170958 -229593 -31733 -191231 -5099 166169 -150256 -189823 -53990 224305 40393 248545
19463 248545 -29287 15789 -119923 126002 148344 14859 -156507 -62866 17082 -253175 -251986
19452 -251986 213919 -90761 260615 -338959 -232367 -39293 -56241 29166 6970 -238470 104483
19440 -42174 -81513 -548214 -198611 99404 82101 32877 150808 -176753 -26734 142510 117314
19429 117314 -39483 86523 -21216 39857 -166768 83933 80633 113563 -72035 -249690 148948
19417 190975 26072 -1443 -5814 -115222 -71180 -10819 49982 -68652 357498 227432 -102599
$$ packed form
19496b68356d4665A71902J14888B2742a26220c7134n1080k39888a63385O2128
19486a01257j5370M7814m48266a03029G0015e5757A3031c3895p4893j31839g479
19474a70958n8635c1733j59498e099A66169a50256l9567e3990B24305D0393K08152
19463B48545b9287A5789a19923A26002K2342A4859a56507f2866A7082b53175J189
19452b51986B13919i0761B60615c38959J06592c9293j6948B9166F970b38470A04483
19440d2174l9339m66701a98611I9404j7303C2877J17931a76753b6734A42510k5196
19429A17314c9483H6523b1216C9857a66768H3933l300L2930g2035j77655A48948
19417A90975B6072a443m371j09408M4042a0819D9982f8652C57498j30066a02599
$$ plain form
19405 -30191 -79898 -206208 -141737 23054 116032 -218630 -67245 -91094 39280 -180954 -135559
19394 -135559 -74618 5908 50178 -335694 244845 -282136 -143740 -160997 25976 -273412 -87678
19382 157542 97123 -31066 107008 32658 -187843 81604 -78833 -112140 158643 96876 -61743
19370 236268 -152861 -346264 47167 -58196 303272 -100143 164529 -73160 -54619 -203769
19360 -203769 -277099 -84428 -153262 8873 -79020 -70248 -141657 -57707 -134048 -330055 -489209
19349 -489209 -109447 78139 80918 -50622 -229052 281612 -166352 259735 -4296 161995 71856
19337 33664 -26990 -75076 308484 191087 33388 -195563 4896 64685 -141256 -125516 -284901
19326 -284901 -9555 182195 1722 -17119 236881 6020 31456 -146728 -243842 217572 -180049
$$ packed form
19405c0191m9707j26310O4471B3054R2978b18630f7245k3849C9280a80954M5395
19394a35559O0941E908M4270c35694B44845b82136J38396j7257B5976b73412h7678
19382A57542o0419c1066A07008C2658a87843H1604g8833l3307A58643o1767f1743
19370B36268a52861j93403D7167e8196C03272a00143A64529g3160J8541j49150
19360b03769p3330h4428o8834H873g9020Q772p1409e7707p6341j96007j59154
19349d89209a09447G8139K779e0622j78430B81612a66352B59735d296A61995G1856
19337C3664b6990m8086C08484j17397C3388a95563D896N9789a41256J5740j59385
19326b84901i555A82195A722a7119B36881F020K5436a46728r7114B17572a80049
$$ plain form
19314 -23875 13108 -111723 34112 -255999 -188551 124018 -153178 79085 23903 159020 -14284
19302 -107937 -482419 -20047 -262020 8972 -64247 -112414 -76535 77811 69943 192380 -204457
19290 -67699 290059 -58527 -244944 -261272 -340728 -349419 8077 29896 -24578 -208492 229132
19278 -171230 -97636 -285805 -362105 -15123 190690 -178839 241368 -63479 -88085 190455
19267 -22130 36217 -212738 -184203 -154270 -45776 -136032 -527 -103605 -100632 221313 64527 48128
19255 48128 -133753 -124625 -445195 -120717 -229859 -59961 -47843 77919 -108774 149288 -29312
19243 -200297 -146934 87813 -256916 170559 -429198 -335854 59266 -149477 -261236 -273059
19233 -273059 6358 -296953 10911 17779 -94741 285445 210644 -327726 228545 -454491 65892
$$ packed form
19314b3875A3108a11723C4112b55999O7448A24018a53178G9085B3903J35117a4284
19302a07937l74482b0047k41973H972f4247m8167L5879G7811p868J22437b04457
19290f7699B90059e8527j86417j6328p9456q691H077K1819b4578j83914B29132
19278a71230P3594j88169p6300a5123A90690a78839B41368f3479k4606A90455
19267b2130C6217b12738K8535K9933d5776r0256e27j03078K973B21313F4527j6399
19255D8128a33753R128l20570a20717j09142e9961J2118G7919a08774A49288b9312
19243b00297N3363H7813b56916A70559d29198R3344E9266a49477j11759j1823
19233b73059F358b96953A0911O868i4741B85445p4801c27726B28545d54491F5892
$$ plain form
19221 -216021 334723 -10797 -151433 -142353 -349744 123459 -117484 -10462 142568 261887
19211 261887 -176141 138121 -16054 -346911 288011 -199784 68811 -9987 214638 168893
19201 168893 -341615 -353903 -92672 -80492 -254332 133484 -386561 319620 -51409 16412
19190 -32478 -186045 -58877 66687 126030 73840 -139161 -40693 69405 -33516 -14933 21048
19178 -94590 24124 -132443 7782 -49059 -150792 35830 -136904 87285 -142440 148484 -10568
19166 36682 121499 21275 127483 231141 -358669 -16894 -131832 269043 229519 164614 40672
19154 -113801 -193503 104085 218742 -48315 153808 148619 -58899 -178946 29337 39256 -282041
19142 -189997 -201190 125448 -40451 -69515 479114 -106297 -433063 49010 154819 222596
$$ packed form
19221b16021C34723a0797j40636R080k07391A23459a17484a0462A42568J19319
19211B61887a76141A38121a6054l30857B88011a99784F8811i987B14638m5745
19201A68893c41615j2288i2672J2180j73840A33484c86561C19620e1409A6412
19190c2478j53567e8877F6687N9343n2190a39161d0693F9405c3516a4933B1048
19178i4590B4124a32443G782d9059j01733C5830a36904H7285a42440A48484a0568
19166C6682Q4817B1275J06208J03658c58669a6894j14938B69043l9524o4905D0672
19154a13801p9702A04085J14657d8315A53808n189e8899j20047B9337R919b82041
19142a89997j1193A25448d0451k9064D79114a06297l26766D9010J05809O7777
$$ plain form
19132 222596 306164 26392 294970 229927 51513 72207 92933 70540 -296397 -236628 93470
19120 -83386 -181017 18250 -10158 -115642 182548 -76827 71629 46979 -14592 -52731 277083
19108 30465 -250677 -186279 -29201 -25975 -341860 -421622 59273 -47622 4615 68459 -14135 -280695
19096 -280695 -119629 -65206 -144321 -134761 322009 110718 41017 -152728 -83304 -30803 -279461
19085 -279461 126499 -15797 267377 -158540 -34820 -268298 -98271 136411 272249 168216
19075 168216 437415 179855 99628 -291535 260760 -553444 236495 -277715 -113116 271282
19064 82430 -242969 -33823 165101 62335 -370557 -287707 -57664 -244320 -65136 -39003 -90418
19053 -90418 -193221 204826 -300073 -102089 -18968 -167610 119445 -421949 319530 -260044
$$ packed form
19132B22596Q3568B6392K68578o5043E1513K0694K0726k2393b96397N9769I3470
19120h3386r7631A8250a0158j05484A82548g6827G1629k4650a4592l8139B77083
19108C0465b50677O4398b9201L226l15885p9762E9273d7622D615O3844a4135k66560
19096b80695a19629N4423p9115R560C22009A10718D1017a52728O9424c0803k48658
19085b79461A26499a5797B67377a58540c4820k33478i8271A36411J35838j04033
19075A68216K69199A79855q0227b91535B60760e53444B36495b77715a13116B71282
19064H2430b42969c3823A65101F2335c70557Q2850e7664j86656f5136K6133n1415
19053i0418j02803B04826c00073a02089a8968j48642A19445d21949C19530b60044
$$ plain form
19042 182547 -116537 -182661 146839 -411867 150836 -371663 57274 -39827 37387 93316
19032 93316 46444 125806 115736 5018 551085 25205 -263772 98134 30889 45295 93450
19021 93450 8817 249224 7165 -301812 50710 -31851 150192 -66144 112794 -18553 -332498
19010 -332498 -82899 -22783 20450 48627 -137461 56627 243384 187548 -168584 -196272 18505
18998 -133816 207264 -129250 -42096 -160679 128404 27762 205194 242268 -38708 -698458
18988 -698458 -252453 85210 -114073 -213244 -78752 -93482 -25889 72620 -140519 -212272 250736
18976 126412 29356 167555 -57897 -207984 -176854 -443516 -316872 156658 -76769 402023
18965 -106876 30534 -315146 -305938 192901 -74225 -61186 -54612 485082 -55323 -206745 -344292
$$ packed form
19042A82547a16537o6124A46839d11867A50836c71663E7274c9827C7387N5929
19032I3316D6444P9362j0070E018N46067B5205b63772I8134C0889J4406M8155
19021I3450H817K40407G165c01812E0710c1851A50192f6144A12794a8553l13945
19010c32498h2899b2783B0450K8177a37461E6627J86757n5836a68584k7688A8505
18998a33816B07264a29250d2096j18583A28404B7762J77432L7074c8708o59750
18988f98458b52453H5210a14073r9171g8752j4730b5889G2620a40519p1753B50736
18976A26412B9356J38199e7897j50087L1130k66662J26644A56658g6769D02023
18965a06876C0534c15146R208A92901g4225J3039O574D85082e5323j51422j37547
$$ plain form
18954 -344292 -27387 -91077 -482911 -204656 28969 100433 -323016 -233766 -149906 -220325 -7629
18942 -273883 -41566 30336 -220593 -76905 22682 -111676 312047 -124114 142992 27244
18931 236484 -58035 38668 -139171 -21377 112652 -92107 -200378 -278669 -268109 286242 -360778
18919 -519667 262342 -173224 113857 -175885 82230 56524 -20401 90227 202220 -131481
18908 -161608 10250 -84405 102216 224255 -290538 -210847 434996 -207859 209690 -179257
18897 338517 -62805 -69151 8002 -460530 15264 -272804 -176872 -81578 181370 -406956 64296
18885 -163283 129912 7222 116217 -230479 -11306 -137923 6788 -36097 -234470 -183068 -76227
18873 -211603 -276253 -235089 116439 -241997 88789 -7928 -76641 -113678 35969 109341 131221
$$ packed form
18954c44292b7387o3690l91834b04656B8969P1464c23016Q9250Q3860p0419g629
18942b73883d1566C0336b20593g6905B2682a11676C12047a24114A42992B7244
18931B36484e8035C8668a39171b1377A12652i2107j08271p8291J0560B86242c60778
18919e19667B62342a73224A13857a75885H2230k5706b0401I0227J11993a31481
18908a61608A0250h4405A02216J22039b90538P9691D34996b07859B09690a79257
18897C38517f2805o346H002d60530A5264b72804R5932h1578A81370d06956F4296
18885a63283A29912G222J08995b30479a1306j26617F788c6097j98373N1402g6227
18873b11603o4650M1164A16439b41997H8789g928o8713l7037C5969P3372K1880
$$ plain form
18862 131221 127994 -1540 -164423 -109817 -58895 47073 255357 -26832 -83669 186919 -85534
18850 -96530 -460973 24928 -13190 -3797 26480 2327 92084 -88637 308450 -144358 49566
18838 258469 -93246 -130403 35793 -20656 5278 -178852 -219644 245433 -221807 -300080 -188512
18827 -188512 -7567 -294920 303595 204893 -165096 214498 40572 -154923 -41260 52144 138329
18816 138329 -94960 16893 138918 223258 390219 243884 153963 257754 -166423 113908
18805 -406300 -209283 107630 130253 -70146 -312394 83345 -45123 166532 -156900 -156359 -442428
18794 -442428 -34109 -58365 32569 -18421 -39967 172933 -263213 54091 -304830 -270300 -33567
18782 -256108 -57026 21492 -278664 54915 -168419 27496 -26321 -88217 -145752 -249187 -201525
$$ packed form
18862A31221l227a540j62883N4606N0922D7073K08284b6832n6837A86919h5534
18850i6530l64443B4928a3190c797B6480B327Q9757h8637C08450a44358D9566
18838B58469i3246l7157C5793b0656E278a78852m0792B45433b21807p8273J11568
18827a88512g567k87353C03595r8702a65096B14498D0572a54923d1260E2144Q6185
18816A38329i4960A6893J22025Q4340J66961j46335q9921J03791a66423A13908
18805d06300J97017A07630K2623g0146k42248H3345d5123A66532a56900N41k86069
18794d42428c4109k4256C2569a8421k1546A72933b63213E4091c04830L4530c3567
18782b56108e7026B1492b78664E4915a68419B7496b6321o1896n7535j03435M7662
$$ plain form
18771 -201525 116238 164716 -2747 -66471 -101131 34985 13012 -136957 1972 -260498 19993
18759 -158976 122411 -229777 -250750 -46842 14318 -259804 -102827 117853 -125058 -38049
18748 38037 -61086 58054 -305315 -97360 -259503 93778 18940 -17449 -38389 -47397 -52690 -112606
18736 -112606 -22611 171851 330336 -292951 203145 -316358 -169753 87648 -117948 69143
18725 23507 65549 146352 -158889 97845 -54701 -119250 -38403 -345106 -6852 14244 -55123
18713 41710 -265228 -63431 -175501 -44753 86005 -187397 218031 -54781 -104905 120392 -111753
18701 -222239 242190 -162750 496619 26206 -165299 21492 78676 -45 -108184 -358974 -250639
18690 -250639 -283252 -139571 -142258 -36436 103711 164125 252396 -121911 31249 -226248 -133108
$$ packed form
18771b01525A16238M8478b747o3724l4660C4985A3012a36957A972b60498A9993
18759a58976A22411b29777k0973d6842A4318b59804a02827A17853a25058c8049
18748C8037f1086E8054c05315i7360j62143I3778A8940a7449k0940r008n293n9916
18736a12606b2611A71851J58485b92951B03145c16358J46605H7648a17948F9143
18725B3507M2042Q0803a58889I7845e4701o4549c8403l06703f852A4244e5123
18713D1710b65228f3431j12070d4753H6005a87397B18031e4781n0124A20392a11753
18701b22239B42190a62750D96619B6206a65299B1492N7184d5j08139k50790J08335
18690b50639l2613a39571k687c6436A03711O0414Q8271a21911C1249b26248R3140
$$ plain form
18679 -133108 -115362 -202123 -252147 -194558 -302511 -166149 71974 -109691 -142774 11843 -274008
18667 -18271 39568 116976 177311 -43076 204072 -205897 190617 92156 -83711 -138305 -175297
18656 -175297 105195 433073 -203404 327317 -192532 -129910 85243 -239305 9636 195716
18646 195716 -126789 46407 166687 -246012 57418 -227200 29451 125067 -303087 -92205
18635 137986 238867 -108070 -2201 504924 -68270 -30414 302696 -28128 -4158 -235432 19369
18623 -16286 -282256 -86347 -51738 -151794 -148537 120515 228661 -240239 -215979 -234152 -193701
18612 -193701 -9445 68054 -76128 94795 -157591 104774 -69108 -203192 20281 59664 -244411
18600 -128500 -41579 -165409 -50935 -190926 -161611 74163 283372 -119540 268454 -21395
$$ packed form
18679a33108J7746q6761n0024N7589j07953J36362G1974a09691l3083A1843b74008
18667a8271C9568P7408O0335d3076B04072b05897A90617I2156h3711n4594l6992
18656a75297A05195L27878b03404C27317a92532O2622H5243b39305I636J86080
18646A95716a26789D6407J20280b46012E7418b27200B9451R5616c03087i2205
18635A37986J00881a08070b201E04924f8270c0414C02696b8128d158k31274A9369
18623a6286k65970h6347L4609j00056L257A20515J08146b40239K4260j8173M0451
18612a93701i445F8054g6128I4795a57591A04774f9108j34084B0281L9383b44411
18600a28500d1579j23830e0935j39991K9315G4163K09209a19540B68454b1395
$$ plain form
18589 47729 -67453 -195908 -192415 -81553 -129141 -166302 320401 195150 30169 -21413 116563
18577 191724 -212097 -383527 -72404 227535 21818 -108062 -185868 21170 155793 -159334
18566 97872 -124324 85240 -174191 -106619 -257287 -245354 -221737 232687 187390 -135586 -13411
18554 -142318 -47729 -28022 40095 -5793 77340 44810 -2299 44901 92057 253574 -38236 -205425
18542 -205425 -94389 48029 256208 260348 51010 114985 56702 -49333 345666 -245764 -75421
18530 -262912 208776 -31686 -288611 189410 -352201 53356 -135067 -415203 -77265 10871
18519 -103906 34631 -155386 -43565 -43209 -16903 -125915 -282928 -67232 -199158 31710 -198934
18507 37144 -330237 19724 69289 38975 -170738 -17649 231912 24236 -324392 137883 101130
$$ packed form
18589D7729f7453j28455L493h1553m7588l7161C20401j25251C0169b1413A16563
18577A91724b12097j71430g2404B27535B1818a08062p7806B1170J34623a59334
18566I7872a24324H5240a74191O7572j50668J1933K3617B32687m5297a35586a3411
18554a42318d7729J9707D0095e793G7340l2530b299D4901M7156J61517c8236j67189
18542b05425i4389D8029K08179M140E1010O3975E6702d9333C45666b45764g5421
18530b62912B08776c1686k56925A89410c52201E3356a35067k80136g7265A0871
18519a03906C4631a55386d3565L56a6903j09012j57013f7232j31926C1710a98934
18507C7144c30237A9724M9565l0314a70738a7649B31912B4236c24392A37883l6753
$$ plain form
18496 101130 -50200 -55365 171558 -84454 653 -150638 -146900 -381730 276100 45175 -172733
18484 -6736 -368446 -176803 9922 -76482 -86466 -164830 135416 -141171 -147381 -71422 -42517 91090
18471 129650 25224 72859 -320920 241181 -334076 -237742 -159846 -249185 -168806 40414 -22036
18459 -25783 -179819 -138235 152930 -103987 -64633 243251 31835 -12370 -30096 -211810 -136201
18448 -136201 164613 -223938 -294848 -32414 -366290 94250 174721 105290 5925 -69991 -51204
18437 -51204 98755 374555 -171030 337375 130745 -367121 130441 -218294 -113921 -207368
18427 -207368 98289 82634 -369317 153278 -206132 -7254 -440 454971 -188870 -51637 -180658
18416 -180658 43559 -198820 -62039 67122 142398 -283623 -227244 33532 -173195 23557 -127011
$$ packed form
18496A01130e0200n165A71558h4454F53a50638L738k34830B76100D5175a72733
18484f736l61710a76803I922g6482r984p8364A35416a41171o210g1422K8905I1090
18471A29650B5224M7635c20920B41181c34076R6334P7896q9339Q0379D0414b2036
18459b5783j54036M1584A52930a03987L9354B43251C1835a2370j7726j81714P5609
18448a36201A64613b23938p0910c2414l33876I4250Q0471o9431E925f9991J8787
18437e1204I8755K75800a71030C37375A30745c67121A30441b18294J04373r3447
18427b07368I8289j5655c69317A53278b06132g254d40D54971a88870e1637j29021
18416a80658D3559a98820f2039F7122P5276b83623N6379C3532a73195B3557a27011
$$ plain form
18404 82534 -28579 219313 -155039 180042 128796 -135627 -209258 -26859 -127727 -191908 -160711
18393 -160711 -219834 -31670 10237 -173437 -276757 172935 -479399 -19491 104303 49518
18382 -164191 -126271 -326860 -69703 159979 -354199 -20056 -124856 173904 -213328 -104681
18371 146022 -141693 -61064 -113178 89097 -191501 249828 -115759 -29110 146390 -50085
18360 67073 30473 -42121 -187513 -109901 154323 -63385 -146255 343912 -191446 101702 63533
18349 63533 322118 -203487 -11842 -223441 -301578 183979 -2276 117791 364689 -193871
18338 52570 -18783 14350 -279309 102290 -213475 -134147 -6575 366469 210478 55410 146402
18327 146402 277111 -120891 -152218 156512 15302 -264813 -201774 -101103 -40578 -7511 -233402
$$ packed form
18404H2534b8579B19313a55039A80042n1246a35627p3631b6859j00868o4181L1197
18393a60711n9123c1670A0237a73437j03320A72935d79399a9491A04303D9518
18382a64191L7920k00589f9703A59979c54199b0056j04800A73904b13328a04681
18371A46022a41693f1064n2114H9097a91501B49828a15759b9110A46390e0085
18360F7073C0473d2121j45392P7612A54323f3385q2870C43912a91446A01702l8169
18349F3533K58585b03487a1842k11599p8137A83979b276A17791K46898a93871
18338E2570a8783A4350b79309A02290b13475P9328f575C66469j55991E5410R0992
18327A46402J30709a20891l1327A56512A5302b64813O3039J00671d0578g511k25891
$$ plain form
18316 -233402 90372 208404 182546 343298 170900 45398 -56860 84355 -77903 144079 -96857
18304 -198168 28023 -195814 7764 -43396 230702 -48335 -24304 101815 -51835 -78322 -277897
18293 -277897 -154804 -312100 20955 -68051 -17205 -118651 -75455 7046 537005 208540 -241252
18281 25274 17214 -275958 31603 -164150 -23791 -139346 -52322 238285 114047 -75081 396068
18269 79610 175838 -101370 -70320 177658 80795 -29507 125847 379126 18249 -87000 238903
18257 -165533 106599 43264 88301 311091 337113 25466 -22425 -128106 -31869 -81500 -52974
18246 -52974 17492 -352434 -25673 10992 -383151 -183692 99793 68906 114339 -238861 -114636
18234 117728 323906 56133 376445 56252 -201109 -5676 23236 -132535 -49118 -56014 217684
$$ packed form
18316b33402I0372J18032k5858J60752A70900D5398e6860H4355g7903A44079i6857
18304a98168B8023a95814G764d3396B30702d8335K4031A01815e1835k6487j99575
18293b77897J23093j57296B0955f8051a7205j01446M3196G046N29959B08540b41252
18281B5274q060b75958C1603a64150b3791j15555e2322B38285A14047g5081C96068
18269G9610R6228a01370L1050A77658H0795b9507A25847K53279A8249h7000B38903
18257a65533A06599D3264M5037K22790K6022B5466b2425j05681c1869m9631K8526
18246e2974A7492c52434b5673A0992c83151a83692I9793l0887M5433b38861a14636
18234A17728K06178E6133L20312E6252b01109e676B3236a32535d9118o896B17684
$$ plain form
18222 -241407 -37876 -73776 -178030 -143587 -173704 150465 -17644 132227 78269 -159064 -134714
18211 -134714 -239093 -177370 34147 99230 -47941 114460 212478 -318748 -177249 15949 -33729
18199 214915 176889 -333495 30443 201241 172997 -13824 87866 -186098 98146 160330 -161419
18187 -142102 -196335 -328440 -4732 -128511 17092 -159090 -132899 -43489 205087 -127776 -159472
18176 -159472 38425 -187299 -175211 -171811 -54381 -139421 330882 -150748 -421252 -233927 143263
18164 146196 -64923 -146469 -66713 -239439 139879 26113 -110619 -126086 -500704 238792
18153 20041 -151145 -252723 -121515 -63660 -324839 -179303 95242 351413 45154 328717
18143 328717 -28089 -240 91935 -318644 321321 -141773 -226880 -94772 6015 -190289 175902
$$ packed form
18222b41407c7876l5900j04254L4443l0117A50465a7644A32227n3958a59064K4350
18211a34714j04379O1723C4147O5083d7941A14460R8018c18748J41499A5949c3729
18199B14915l8026c33495C0443J70798k8244a3824H7866a86098I8146O2184a61419
18187a42102n4233j32105d732j23779A7092a59090K6191d3489B05087a27776l1696
18176a59472C8425a87299J2088L400e4381q5040C30882a50748k70504J87325A43263
18164A46196f4923q1546f6713j72726A39879B6113a10619j5467l74618B38792
18153B0041a51145j01578a21515N7855k61179J45536I5242K56171D5154K83563
18143C28717b8089b40I1935c18644C21321a41773q5107i4772F015a90289A75902
$$ plain form
18131 -28331 -127113 -157086 -63237 18105 3725 69253 322248 -190595 -11003 169864 -493596
18119 78218 4543 -121026 -133065 148522 -2050 170358 -18138 78116 -216927 -299068 -168511
18108 -168511 -30667 -264422 -137982 -170879 39164 -60107 287432 47829 78799 -219124 -107315
18096 195718 11765 74243 21259 -407575 152736 189552 -177446 -6905 -30610 -210518 127282
18084 236666 -6069 -169566 -170111 -56845 -185400 221494 -25546 -140099 -276972 -347913 29724
18072 40764 -104677 59930 -20610 109879 -229918 -87852 -23760 309752 -141981 -190986 242106
18060 106152 35837 111165 -79535 158263 -92392 117581 -71815 -38675 80268 72392 103619
18049 103619 -481623 -530136 155537 32432 243134 -343494 4946 -16167 -214527 88272 -50784
$$ packed form
18131b8331r8782k9973f3237A8105C725O5528K52995a90595a1003A69864d93596
18119G8218D543a21026j2039A48522b050A70358a8138G8116b16927q2141J30557
18108a68511c0667k33755J26440l2897C9164f0107B87432D7829L0970b19124a07315
18096A95718A1765O2478B1259d07575A52736L6816a77446f905k3705j79908A27282
18084B36666f069j63497n45e6845j28555B21494b5546j14553j36873p0941B9724
18072D0764a04677E9930b0610A09879b29918h7852b3760C09752a41981m9005B42106
18060A06152C5837P5328g9535A58263i2392A17581g1815L3140H0268p876L1227
18049A03619d81623m8513A55537C2432K10702c43494D946a6167j98360H8272e0784
$$ plain form
18037 215060 -79682 -148291 75582 -244716 75499 151350 72145 -49946 116596 -326259 118473
18025 135361 127932 79924 105981 -145369 46411 -118154 93280 -33311 -4131 -7292 -228284
18014 -228284 -21653 35801 -167268 -15822 341651 17085 526885 24841 -307159 -273239 -195529
18003 -195529 -5404 61369 -145605 36385 -130674 62778 134514 -169881 -240425 -203925 -311063
17992 -311063 -139706 25239 127751 -160204 -39095 109752 -2474 -126160 -107979 199578
17981 -24730 25724 5275 -133168 -65239 135528 123354 294458 110559 207797 -145733 -125793
17970 -125793 -193852 -230820 -18723 176974 -204166 -103465 -28451 25086 -141435 103911
17959 -15622 236977 -27033 -29691 -146980 -48372 -115320 202316 153977 -118121 -46185 -146396
$$ packed form
18037B15060g9682o8609G5582b44716G5499P5851G2145d9946A16596c26259A18473
18025A35361p429m8008K6057a45369D6411a18154I3280c3311d131l161k20992
18014b28284b1653C5801a67268a5822C41651A7085N09800B4841c07159L3920P7710
18003a95529e404F1369a45605C6385a30674F2778P1736a69881p0544L6500j07138
17992c11063a39706B5239J02512a60204c9095A09752b474j23686J8181A99578
17981b4730B5724E275a33168f5239A35528j2174J71104A10559R7238a45733J9940
17970a25793o8059l6968a8723A76974b04166J00701b8451B5086a41435A03911
17959a5622B36977b7033k658j17289d8372o6948B02316m8339a18121d6185j00211
$$ plain form
17948 -146396 -37191 103430 -39008 -56933 306816 -153761 81453 -154559 -46401 -552030
17938 -552030 11937 -31112 -105758 88953 231722 -14605 -421845 146520 59003 -171680 130348
17926 -216757 73791 -208132 -27396 -115734 109670 -296702 -86919 -215074 -299202 93612 146385
17915 146385 -162807 -199493 -9612 -19195 -85944 -180435 -151950 171518 -153688 -12912 -248951
17904 -248951 86402 -64237 -52523 125802 -247250 129806 119446 -4395 205480 -11058 -167291
17893 -167291 -60180 -133812 52194 108856 168664 111443 -191040 -11477 388655 -207349 268653
17881 -216407 -335279 -48476 -147429 164760 124566 100661 46482 -183997 -95646 29054 22268
17870 22268 -31991 66041 269171 113482 55023 -145943 -255956 -111580 -36051 46086 130349
$$ packed form
17948a46396c7191A03430c9008j7925C06816a53761H1453a54559d6401n05629
17938e52030A1937c1112p4646H8953J42769a4605m07240A46520E9003a71680A30348
17926b16757G3791b08132b7396q8338A09670b96702h6919j28155q4128I3612N2773
17915A46385a62807l6686i612r583o6749r4491K8485A71518a53688a2912k36039
17904b48951H6402f4237J1714A25802b47250A29806j0360d395B05480a1058j56233
17893a67291f0180p3632E2194N6662N9808n7221a91040a1477C88655b07349B68653
17881b16407j18872d8476r8953A64760m0194k3905D6482a83997Q8351B9054o786
17870B2268c1991F6041K03130A13482E5023a45943j10013a11580c6051D6086Q4263
$$ plain form
17859 130349 -104421 -316023 249398 183513 23491 155643 61722 251612 -26655 -16076
17849 -16076 -54961 -107889 -41930 -136195 177005 -87843 -32945 142943 331386 -26767 -177129
17838 -177129 -299397 -99298 129494 281946 58486 -132220 -108830 -294775 160240 -80731
17827 53532 60299 -79645 -128872 -4165 -25654 -164941 -152537 -306144 7496 -79456 -63832 -226511
17815 -226511 -77659 163898 228610 -88077 117125 82914 -171485 -194045 401517 36264 159501
17804 159501 -85297 136524 -21285 -35166 287144 4130 148119 -16488 117299 -48154 -184505
17793 -184505 -345345 -74970 -300695 182998 -390079 206623 -37726 14604 -389240 114822
17782 -49477 -48602 -306723 -433497 135109 -115139 -52415 75142 -22842 -15157 274236 -13313
$$ packed form
17859A30349a04421k11602B49398o5885B3491J32152F1722J89890b6655J0579
17849a6076l8885n2928d1930r4265A77005h7843c2945A42943J88443b6767j50362
17838a77129j22268i9298A29494J52452E8486a32220K3390j85945A60240h0731
17827E3532O767g9645m9227d165k1489j39287J2404j53607G496g9456J5624j62679
17815b26511g7659A63898O4712h8077A17125l4211a71485k2560D01517C6264J23237
17804A59501h5297A36524b1285j3881B87144D130J43989a6488A17299d8154j36351
17793a84505j60840g4970k25725A82998c90079B06623c7726A4604c89240A14822
17782d9477Q75k58121j26774A35109a15139e2415G5142b2842P685B74236a3313
$$ plain form
17770 210022 -10652 3283 -180701 -4096 -238082 131157 -91460 144087 250313 58466 -9419
17758 -131740 105025 186235 -70649 133531 109327 90396 -106829 208621 49073 93149 289151
17747 289151 -197770 239468 -47411 -347329 489070 109284 -461878 -20766 89468 51891
17737 51891 -189680 204819 15098 -322014 70826 -101045 317861 -62466 -32583 -189380
17727 -189380 43166 179640 74540 -465475 -260194 -27349 69726 122460 104952 -25248 -977
17715 -169798 -88368 -249968 -160 101232 -84301 -12525 -135217 -283823 -47765 15846 50288
17704 50288 -45659 455414 173729 52086 -337325 -105796 82885 24682 182409 -174029
17693 -142025 -28406 -33580 307260 -99185 -162980 181634 68762 -7914 144571 -62446 -476280
$$ packed form
17770B10022a0652C283a80701d096k33986A31157i1460A44087J06226E8466i419
17758a31740A05025Q1210g0649A33531k4204j8931a06829B08621D9073M4076J96002
17747B89151a97770B39468d7411k99918D89070A09284d61878b0766H9468l7577
17737E1891a89680B04819A5098c22014G0826a01045C17861f2466K9883j56797
17727a89380D3166J36474G4540d65475K05281b7349F9726N2734j7508b5248i77
17715a69798Q1430j61600a60A01232h4301a2525j22692j48606d7765A5846L4442
17704E0288d5659D55414A73729E2086c37325a05796H2885B4682J57727a74029
17693a42025b8406n174C07260i9185o3795A81634F8762g914A44571f2446m13834
$$ plain form
17682 -476280 -4208 118081 52932 -116236 -178604 -48197 -164234 -132638 219616 100037 330317
17671 330317 -196505 27197 325571 83166 184204 205043 271485 299817 -3324 -227045 -349384
17660 -349384 -213284 -67341 67625 131047 -125079 283843 23110 120401 123999 132986 -249771
17648 164023 427663 -268802 212357 60225 388496 -369947 -83209 -63564 495550 24618
17637 161170 -74276 111031 -110320 113190 96842 -48795 -80448 105979 38829 80415 201513
17626 201513 144226 -26227 16793 -37366 188319 47091 35714 -159986 23585 323452 1294
17614 63046 254039 247453 69389 263456 150850 90027 306504 271162 234239 -6316 -52782
17603 -52782 -244887 37115 234695 -180534 -68896 165332 -238582 -142578 40793 387428
$$ packed form
17682d76280d208A18081E2932a16236o2368d8197j16037L1596B19616A00037K30280
17671C30317a96505B7197K98374H3166J01038K0839O6442K8332c324k23721j22339
17660c49384J36100f7341F7625O3422a25079B83843B3110R7291L598Q987b49771
17648A64023K63640b68802B12357F0225L28271c69947h3209J9645D95550B4618
17637A61170g4276A11031a10320A13190j6348d8795l1653A05979C8829M1586J21098
17626B01513n7287b6227A6793c7366A88319D7091j1377a59986B3585K99867A294
17614F3046J90993o586F9389J94067j12606o0823K16477l5342l6923f316m6466
17603e2782j92105C7115J97580a80534f8896A65332b38582R6004D0793L46635
$$ plain form
17593 387428 65500 32996 -74108 -188433 -129674 193453 -150796 -661 207603 -74694 -99271
17582 -99271 247111 -298846 -89438 167311 -45564 74363 117664 31046 180696 88975 43485
17570 117036 156743 465509 376183 -146255 109241 -103206 101251 24715 74962 -18684
17559 358822 39768 -126763 133605 -36894 180901 27031 -241222 79790 54738 -20741 309594
17547 303543 -91967 71995 -34050 122703 42949 -91944 -39944 275469 -4035 10756 -88316
17535 305399 184782 196090 214714 -79856 -33025 -216292 204542 85263 369789 -180934
17524 214799 -6427 -24347 105901 208335 -32152 318428 75367 156668 70973 163109 55805
17512 -176329 121912 46106 106983 82195 -108591 66106 -232595 212022 -94935 -245906
$$ packed form
17593C87428F5500l2504g4108j14325N8759A93453a50796f61B07603g4694k4577
17582i9271B47111b98846h9438A67311d5564G4363M3301C1046J49650H8975D3485
17570A17036L9707L08766q9326a46255A09241a03206A01251B4715N0247a8684
17559C58822C9768a26763A33605c6894A80901B7031b41222G9790k5052b0741C09594
17547C03543i1967G1995c4050A22703D2949i1944c9944B75469d035A0756h8316
17535C05399j20617J1308J8624g9856c3025j83267B04542H5263K84526a80934
17524B14799f427j7920A05901J02434c2152C18428G5367Q1301G0973R2136E5805
17512a76329A21912D6106O0877k4788a08591F6106b32595B12022i4935j50971
$$ plain form
17502 -245906 132162 27653 288531 -4220 8669 439602 -122148 40016 -40381 -368860 75843
17490 324009 189816 59537 273282 103454 238535 369301 209686 126938 165217 -31898
17479 37645 118143 -47472 -127556 8724 81490 252721 295768 156660 -63596 12459 102760
17468 102760 -133055 -17315 26791 518238 169401 -181106 -178568 -148748 -28883 107607 125648
17457 125648 354512 253684 192996 46408 269580 351003 183391 280050 939 246644 3172
17445 114038 218391 359364 255764 42292 140242 45463 110799 199398 364903 332716 220501
17434 220501 14086 237564 252345 282877 273379 146265 196848 108286 186311 224500 516909
17423 516909 430613 211889 143320 250381 568954 714740 -41188 230055 493565 146982
$$ packed form
17502b45906A32162B7653K60878d220H669M30933a22148D0016d0381l28479G5843
17490C24009j34193E9537K13745A03454J35081J30766j59615q2748L8279c1898
17479C7645Q0498d7472q0084H724P2766J71231M3047j39108f3596A2459R0301
17468A02760a33055a7315B6791M91447A69401a81106K538K9820b8883A07607J8041
17457A25648K28864j00828o0688D6408K23172Q1423j67612R6659I39K45705C172
17445A14038J04353J40973j03600D2292R7950D5463O5336Q8599J65505l2187j12215
17434B20501A4086K23478J4781L0532r498j27114N0583q8562P8025L8189K92409
17423E16909q6296B11889o8569J07061L18573J45786d1188B30055K63510A46982
$$ plain form
17412 299196 282354 450603 266613 129541 -207461 -271428 232609 -86542 416711 139815
17401 393840 141283 103191 81868 -76421 348335 150878 293239 118494 46913 294722
17391 294722 73000 377007 -69393 129551 183868 -176577 152895 -7758 190648 282306 348630
17380 348630 186499 208400 -16341 89205 11932 470560 -166431 16199 -49325 324226 364176
17369 364176 -17879 70304 223333 242088 443727 17431 64514 332246 -134837 155984
17358 143606 -15917 227530 -183180 198717 259975 197643 155545 358148 -79099 -231188
17348 -231188 -23168 58975 17519 439209 239497 -277454 365733 145354 -329287 -3976
17337 372271 141191 138758 330347 108875 410198 405279 18602 -200043 -162669 273457 219504
$$ packed form
17412B99196j6842J68249j83990A29541b07461o3967B32609h6542D16711A39815
17401C93840A41283l8092k1323g6421C48335A50878J42361A18494D6913K47809
17391B94722G3000L04007f9393A29551N4317a76577A52895g758A90648R1658O6324
17380C48630j62131K1901a6341H9205A1932M58628a66431A6199d9325C24226L9950
17369C64176a7879G0304J53029J8755K01639A7431M7083K67732a34837A55984
17358A43606a5917B27530a83180A98717O1258o2332m2098K02603g9099j52089
17348b31188b3168E8975A7519M21690j99712b77454C65733A45354c29287c976
17337C72271A41191k433J91589A08875L01323m919A8602b00043L7374B73457n3953
$$ plain form
17326 219504 -214187 190065 331342 113082 -228574 -145988 513728 108694 -49651 531323
17315 374246 26502 346619 33565 340044 -269862 259919 19307 138191 -112525 -22334
17304 110606 -51657 137686 35748 -9419 -95515 114124 214709 400520 106991 200506 259472
17293 259472 207037 145132 89914 83825 181427 459328 -144129 450665 303182 226745 328325
17282 328325 19693 -174091 56500 476575 -127696 274818 37948 13185 166522 354701
17272 354701 -137739 190035 177587 135652 178771 144349 20142 330612 463404 323053
17262 323053 303468 119042 163052 463097 424378 331652 321456 261896 31389 287214 -110575
17250 305081 -12886 404044 149310 -85569 9775 199028 -5848 124846 57076 250270 -60425
$$ packed form
17326B19504b14187A90065J41277A13082b28574Q2586E13728A08694d9651E31323
17315C74246B6502L20117C3565L06479b69862B59919A9307J18884a12525b2334
17304A10606e1657A37686C5748i419q6096A14124J00585J85811A06991R3515N8966
17293B59472n2435o1905n5218o089R7602K77901a44129D50665j47483p6437J01580
17282C28325A9693a74091E6500M20075a27696B74818C7948A3185J53337J88179
17272C54701a37739A90035j2448m1935M3119l4422B0142L10470J32792j40351
17262C23053j9585A19042M4010L00045l8719r2726j0196n9560C1389K55825a10575
17250C05081a2886D04044A49310h5569I775J89253e848A24846E7076J93194f0425
$$ plain form
17238 -250255 340046 -74247 292863 186834 69741 252265 138517 11060 79869 264942
17228 264942 -227635 -61571 153049 -166592 -204957 127098 88086 283513 -80816 102893
17217 303153 288935 340674 97896 209524 84255 316688 172040 225910 258856 400231 289736
17206 289736 189730 310619 794484 69546 18234 284949 410346 75026 336786 287572
17196 287572 422024 124850 87396 455464 212919 303847 267359 251490 258183 77371 98405
17185 98405 153996 431560 270620 132529 548469 385595 69873 301001 240623 189270
17175 189270 176526 384148 394234 387168 176822 425654 388668 86367 446091 346053 337458
17164 337458 392546 12205 382838 376177 467497 170156 217386 169921 482584 228821 312000
$$ packed form
17238b50255C40046g4247B92863j06029F9741J82524j13748A1060O8809J85073
17228B64942b27635f1571A53049a66592l8365A27098l9012J95427h0816A02893
17217C03153j4218N1739I7896J11628H4255K32433j44648N3870L2946J41375j10495
17206B89736j00006J20889M83865F9546A8234K66715J25397G5026K61760m9214
17196B87572J34452A24850l7454L68068B12919R0928l6488j5869O693G7371K1034
17185I8405N5591K77564j60940A32529M15940j62874F9873K31128o0378n1353
17175A89270j2744K07622J0086p066A76822K48832l6986H6367L59724j00038q595
17164C37458N5088A2205L70633o661R1320A70156M7230m7465L12663B28821Q3179
$$ plain form
17153 312000 217849 267236 -125878 293173 166881 239248 165864 -68599 -181586 573548
17142 289215 176478 306769 387918 145317 288426 210820 425206 330407 377684 260294
17132 260294 139374 388512 358022 150048 469634 290805 99917 278614 630849 447277
17122 447277 520467 95672 176542 361640 190170 130445 417013 330895 361434 212395 223282
17111 223282 240247 436457 668082 391011 230070 366091 -71725 429606 118684 558843
17101 558843 391196 3653 604783 121251 428342 186785 554636 335916 480451 162557
17090 540328 169246 435210 476255 341176 102956 564001 363337 525536 333408 732932
17080 732932 324196 381468 679238 330438 356817 774638 493892 513682 481013 483497 302948
$$ packed form
17153C12000r4151M9387a25878B93173j26292P2367p3384f8599j12987E73548
17142B89215j12737J30291Q1149A45317J43109p7606K14386r4799M7277j17390
17132B60294j20920K49138l0490A50048L19586j78829I9917J78697L52235j83572
17122D47277P3190I5672Q0870J85098j71470n9725K86568q6118L0539j49039J0887
17111B23282J6965J96210K31625k77071j60941J36021g1725D29606A18684M40159
17101E58843j67647C653O01130A21251L07091A86785L67851k18720J44535A62557
17090E40328A69246K65964M1045j35079A02956M61045k00664J62199j92128L99524
17080G32932C24196N7272K97770C30438K6379M17821k80746J9790l2669K484j80549
$$ plain form
17069 302948 373395 137737 477375 227361 564448 309632 892183 316530 329725 655611
17059 655611 545236 494354 344613 422663 292970 162824 407105 547808 698538 319471
17048 574395 425457 723221 390264 745492 241325 657302 575311 448721 827421 504186
17038 504186 319637 882282 547634 361610 541310 318671 702962 380197 590954 682470
17028 682470 657125 728369 847171 224320 505895 663179 613627 748456 402647 478570
17018 478570 778337 743699 725086 685530 479227 538132 815970 857451 593723 580381 603867
17007 603867 691862 736293 949788 743742 627221 683364 500364 697100 703039 602360
16997 602360 660212 1017483 323420 683797 706094 1060951 838386 752692 1173222 631080
$$ packed form
17069C02948P0447A37737L39638B27361L37087k54816N82551C16530J3195L25886
17059F55611j10375n0882j49741P8050j29693j30146K44281J40703J50730C19471
17048E74395j48938K97764l32957L55228B41325M15977q1991j26590L78700l23235
17038E04186j84549N62645l34648j86024J79700k22639L84291l22765K10757R1516
17028F82470k5345P1244J18802B24320K81575J57284m9552J34829l45809P5923
17018D78570K99767l4638j8613l9556k06303N8905K77838M1481k63728j3342K3486
17007F03867Q7995M4431K13495k06046j16521N6143j83000J96736N939j00679
16997F02360N7852L57271C23420L60377K2297L54857k22565q5694M20530n42142
$$ plain form
16987 631080 941595 763884 617401 629634 823726 776970 553919 760849 678831 735127
16977 735127 861033 947759 942878 636424 790298 901771 993379 1003190 673680 620280 519341
16966 519341 894558 573820 1075298 1009885 1102135 781897 857573 1160013 1158003 971006
16956 971006 892151 818159 1019033 987963 910355 780602 859854 865249 1227022 1339879 1023592
16945 1023592 1414908 1185566 803304 1016563 1043896 1325104 1239822 1019938 1157797 992035
16935 992035 1152556 1045892 1234843 1404643 1203724 1140419 1217022 1238805 1150828 1299427
16925 1299427 1176921 1353366 1215823 1584360 1161092 1429346 1409116 1360926 1434024 1295582
16915 1295582 1664265 1205215 1589786 1616488 1508840 1263998 1616746 1549837 1566548 1564501
$$ packed form
16987F31080L10515j77711j46483J2233J94092m6756k23051K06930q2018N6296
16977G35127J25906Q6726m881l06454J53874J11473R1608R811l29510n3400j00939
16966E19341L75217l20738N01478o5413R2250l20238P5676L02440k010j86997
16956I71006p8855p3992K00874l1070p7608j29753P9252N395L61773J12857l16287
16945A023592L91316k29342l82262K13259K7333K81208q5282k19884J37859j65762
16935I92035J60521j06664J88951J69800k00919o3305P6603K1783q7977J48599
16925A299427j22506J76445j37543L68537m23268K68254k0230m8190P3098j38442
16915A295582L68683m59050L84571K6702j07648k44842L52748o6909J6711k047
$$ plain form
16905 1564501 1691772 1353202 1984353 1641403 1470926 1474230 1695001 1332834 1815940 1501997
16895 1501997 1792569 1828409 1749404 1625936 1833010 1853035 2112606 1794984 1782057 1891165
16885 1891165 2335932 1809200 1847994 2163441 2206525 2117324 2185080 2208198 1964794 2143803
16875 2143803 2378001 2140704 2326312 2576081 2307670 2541698 2280890 2337404 2492061 2446176
16865 2446176 2726211 2587895 2450966 2811583 2393762 2906168 2598646 2934531 3020625 3015059
16855 3015059 2759888 2847013 2923207 3045498 3102141 2875799 3277193 3256466 3278388 3312518
16845 3312518 3199795 3448034 3316375 3291367 3708392 3916153 3564869 3766167 3918221 4084776
16835 4084776 4155941 3871689 4143707 4021415 3933569 4262644 4591183 4293792 4582458 4519493
$$ packed form
16905A564501J27271l38570O31151l42950j70477L304K20771l62167M83106l13943
16895A501997K90572L5840p9005j23468K07074K0025K59571l17622j2927J09108
16885A891165M44767n26732L8794L15447M3084q9201O7756K3118k43404J79009
16875B143803K34198k37297J85608K49769k68411K34028k60808N6514J54657m5885
16865B446176K80035j38316j36929L60617m17821N12406l07522L35885Q6094n566
16855C015059k55171Q7125P6194J22291N6643k26342M01394k0727K1922L4130
16845C312518j12723K48239j31659k5008M17025K07761l51284K01298J52054J66555
16835D084776P1165k84252K72018j22292q7846L29075L28539k97391K88666o2965
$$ plain form
16825 4519493 4605847 4605645 4537239 5053344 5241789 5121517 5242359 5499677 5575676 5221555
16815 5221555 5378655 6150027 5791936 5995598 5773327 6054816 6077795 6461186 6222801 6823799
16805 6823799 6966549 6854597 7298168 7122060 7232192 7816053 7910938 8074461 8066980 8434207
16795 8434207 9166671 8908676 9206489 9496274 9512199 9651324 9887257 10374175 10673696 10816104
16785 10816104 11249095 11483381 11439163 11963464 12500368 12547172 13148203 13424028 13817393 14389502
16775 14389502 15094871 15438499 16094414 16290830 17202453 17593800 17994904 18504860 19385486
16766 19385486 20277026 20904188 21572527 22661443 23207248 23724842 24985678 26114985 27208388
16757 27208388 28339366 29871865 30652888 32306402 33776000 35138125 36563305 38234253
$$ packed form
16825D519493Q6354k02o8406N16105J88445j20272J20842K57318P5999l54121
16815E221555J57100P71372l58091K03662k22271K81489K2979L83391k38385O00998
16805F823799J42750j11952M43571j76108J10132N83861R4885J63523p481L67227
16795H434207P32464k57995K97813K89785J5925J39125K35933M86918K99521J42408
16785A0816104M32991K34286m4218N24301N36904M6804O01031K75825L93365N72109
16775A4389502P05369L43628O55915J96416R11623L91347M01104N09956Q80626
16766A9385486Q91540O27162O68339J088916N45805N17594J260836J129307J093403
16757B7208388J130978J532499P81023J653514J469598J362125J425180J670948
$$ plain form
16749 38234253 39996682 42444628 44333879 46613072 48706322 51412120 54613034 57002455
16741 57002455 59917234 63640754 67059702 70959622 75329631 79503596 84095812 89243636
16733 89243636 94427734 99874481 105839327 111858501 118217720 125171670 131964853 139079309
16725 139079309 146168115 152926426 159269126 165617543 171207288 176149041 180382267 183286651
16717 183286651 185200707 186368677 186147774 185047226 182287468 178733483 174036862 168670379
16709 168670379 162836343 156543951 149634061 142371238 135637631 128799292 121865066 115070480
16701 115070480 108747338 102642449 96840406 91114216 86061958 81087596 76502148 72412469
16693 72412469 68335013 64286753 61092666 57765179 54700525 51954456 49286405 46912229
$$ packed form
16749C8234253J762429K447946J889251K279193K093250K705798L200914K389421
16741E7002455K914779L723520L418948L899920M370009M173965M592216N147824
16733H9243636N184098N446747N964846O019174O359219O953950O793183P114456
16725A39079309P088806O758311O342700O348417N589745M941753M233226K904384
16717A83286651J914056J167970k20903j100548k759758l553985m696621n366483
16709A68670379n834036o292392o909890p262823o733607o838339o934226o794586
16701A15070480o323142o104889n802043n726190n052258m974362m585448m089679
16693G2412469m077456m048260l194087l327487l064654k746069k668051k374176
$$ plain form
16685 46912229 44191245 42362598 40241725 38429898 36634619 34519577 33508254 31927769
16677 31927769 30602286 29636328 28050563 26910424 25882841 24717866 24024772 22855974
16669 22855974 21982841 21227214 20364092 19492612 18964586 18041125 17477188 16809514 16367121
16660 16367121 15875384 15606091 14834416 14421103 14167198 14018290 12793879 12887861 12077061
16651 12077061 12164356 11704866 11304055 11026766 10389066 9974553 10407606 9947907 9518552
16642 9518552 9058578 8806494 8762186 8533361 8375899 8059515 7622754 7656616 8005800 7349176
16632 7349176 7428666 7214861 7002365 6887818 6422539 6169258 6617839 6269948 5946756 5713486
16622 5713486 5822115 5718834 5367479 5325871 5092994 5276014 5277657 5126730 5002586 4938085
$$ packed form
16685D6912229k720984j828647k120873j811827j795279k115042j011323j580485
16677C1927769j325483r65958j585765j140139j027583j164975o93094j168798
16669B2855974q73133p55627q63122q71480n28026r23461n63937o67674m42393
16660A6367121m91737k69293p71675m13313k53905j48908j224411R3982q10800
16651A2077061Q7295m59490m00811k77289o37700m14513M33053m59699m29355
16642I518552m59974k52084m4308k28825j57462l16384m36761L3862L49184o56624
16632G349176P9490k13805k12496j14547m65279k53281M48581l47891l23192k33270
16622E713486J08629j03281l51355m1608k32877J83020J643j50927j24144o4501
$$ plain form
16612 4938085 5029424 4753407 4387975 4778736 4086468 4420982 4500754 4028006 4003650 4083997
16602 4083997 3855241 3422844 3808817 3803044 3662088 3635933 3605350 3417297 3268233 3523752
16592 3523752 3297019 3219019 3084600 3241787 3033596 2973688 2905838 2938498 3012102 2794226
16582 2794226 2643120 2593789 2873192 2609452 2845600 2518043 2435515 2334631 2164236 2385968
16572 2385968 2465316 2563143 2665810 2232807 2539659 2211556 2516925 2147116 2147250 2048265
16562 2048265 2142597 2132641 2022824 2178085 1536169 2044696 2136809 2035644 1728097 2083137
16552 2083137 1911686 2091418 1831072 1665313 1419055 1696705 1953070 1707716 2044515
16543 2044515 1730911 1764252 1779915 1782868 1582647 1863636 1743158 1493644 1425277 1344347
$$ packed form
16612D938085R1339k76017l65432L90761o92268L34514P9772m72748k4356Q0347
16602D083997k28756m32397L85973n773j40956k6155l0583j88053j49064K55519
16592C523752k26733p8000j34419J57187k08191n9908o7850L2660P3604k17876
16582B794226j51106m9331K79403k63740K36148l27557q2528j00884j70395K21732
16572B385968P9348R7827J02667m33003L06852l28103L05369l69809J34r8985
16562B048265R4332r956j09817J55261o41916N08527R2113j01165l07547L55040
16552B083137j71451J79732k60346j65759k46258K77650K56365k45354L36799
16543B044515l13604L3341J5663K953k00221K80989j20478k49514o8367q0930
$$ plain form
16533 1344347 1355916 1379458 1660738 1744754 1210085 1488181 1331993 1356349 1170473 1140860
16523 1140860 1343158 934618 1093785 1327979 1489582 1005833 1245758 947667 1330097
16514 1330097 1066334 1398146 1189416 1144792 1081657 807464 1423926 1189800 1292395 844025
16504 844025 821162 1144300 1150224 895512 998143 1115133 874747 741937 1217545 1058553
16494 1058553 1127761 676687 968087 1309818 1139301 864961 953220 395454 731413 949838
16484 949838 852806 888551 933428 1047474 698636 866919 485535 861599 869923 741871
16474 741871 961372 852229 760498 918358 1021884 760720 663994 870800 589181 600847
16464 600847 631986 714678 648747 407763 523048 726352 312220 800910 636682 658811
$$ packed form
16533A344347J1569K3542K81280Q4016n34669K78096j56188K4356j85876k9613
16523A140860K02298m08540J59167K34194J61603m83749K39925k98091L82430
16514A330097k63763L31812k08730m4624o3135k74193O16462k34126J02595m48370
16504H44025k2863L23138N924k54712J02631J16990k40386j32810M75608j58992
16494A058553O9208m51074K91400L41731j70517k74340Q8259C95454L35959K18425
16484I49838r7032L5745M4877J14046l48838J68283l81384L76064Q324j28052
16474G41871K19501j09143r1731J57860J03526k61164r6726K06806k81619J1666
16464F00847L1139Q2692o5931k40984J15285K03304C12220M88690j64228K2129
$$ plain form
16454 658811 382228 396441 521405 1047982 982251 535001 779037 738769 656536 792456
16444 792456 786478 652013 576378 707659 456334 730232 496414 866516 473470 310058
16434 310058 924566 514846 536936 472697 575828 611711 858662 553216 439849 606797
16424 606797 548557 724540 405032 381265 134284 463731 565964 506298 128449 411430
16414 411430 416133 672939 580893 275177 492651 325186 736570 245302 35603 83554
16404 83554 527099 128899 651050 518679 497523 621365 443716 533902 396456 305332
16394 305332 -25383 400865 412357 536007 652903 538934 771772 629836 714339 112439
16383 161460 360566 340014 288344 509437 480347 375849 156681 474451 429995 379865
$$ packed form
16454F58811k76583J4213J24964N26577o5731m47250K44036m0268q2233J35920
16444G92456n978j34465p5635J31281k51325K73898k33818L70102l93046j63412
16434C10058O14508m09720K2090o4239J03131L5883K46951l05446j13367J66948
16424F06797n8240J75983l19508k3767A34284L29447J02233n9666A28449K82981
16414D11430M703K56806r2046B75177K17474j67465M11384B45302C5603M7951
16404H3554M43545A28899N22151j32371k1156J23842j77649R0186j37446r1124
16394C05332b5383D00865J1492J23650J16896j13969K32838j41936Q4503A12439
16383A61460J99106k0552n1670K21093k9090j04498A56681L17770m4456n0130
$$ plain form
16373 379865 261557 76963 245764 156582 282104 -152916 62864 452052 84525 597278
16363 597278 329421 71454 573897 249454 537834 403443 271973 576645 479976 388911
16353 388911 179757 276737 334963 245930 492372 429854 329523 188071 355087 409055
16343 409055 144737 295926 673285 530188 64014 -15509 379859 376980 27901 119519 -146012
16331 175211 -46687 84266 60771 546611 383693 393163 -111359 332513 242913 183051 -6822
16319 548981 184273 118811 418271 92062 139744 372039 238929 175889 399123 283921
16309 283921 339177 225985 272638 281371 81813 674347 407386 -25989 -112087 325666 378916
16298 378916 95264 284689 258241 310412 255449 300753 -311218 410775 308227 162422
$$ packed form
16373C79865j18308G6963J68801q9182J25522a52916F2864L89188H4525N12753
16363E97278k67857G1454N02443B49454K88380j34391j31470L04672r6669r1065
16353C88911A79757R6980N8226q9033K46442o2518j00331j41452J67016N3968
16343D09055A44737J51189L77359j43097F4014a5509C79859k879B7901R1618a46012
16331A75211d6687H4266k3495M85840j62918R470a11359C32513q9600n9862f822
16319E48981A84273o5462K99460I2062M7682K32295j33110o3040K23234j15202
16309B83921N5256j13192M6653Q733H1813N92534k66961b5989q6098C25666N3250
16298C78916I5264J89425k6448N2171n4963M5304c11218D10775j02548j45805
$$ plain form
16288 162422 219030 -27528 42237 167944 -13739 35717 301887 98907 -51736 -44213 142665
16276 262760 154355 314138 196717 278050 -20949 -96046 195042 549943 249108 495219
16266 495219 6440 339942 385539 396110 -132300 -16390 -63555 238075 -143810 -37318 134969
16254 57462 -74394 103094 327325 70441 110790 -25174 280720 -78215 316407 457651 276593
16243 276593 43063 34316 531334 6022 10704 191829 399637 62284 322084 -18621 99771
16231 353375 134432 193634 -111834 100331 465739 -293961 242128 80108 69387 101580
16221 101580 224418 309729 501941 151693 116301 -211568 -350226 179387 224389 -77628
16210 162131 -253518 58731 29013 234631 45117 224623 178649 -111634 253224 575554
$$ packed form
16288A62422N6608b7528D2237J25707a3739C5717K66170I8907e1736P523A42665
16276B62760j08405J59783j17421Q1333b0949p5097A95042L54901B49108K46111
16266D95219F440L33502M5597J0571a32300a6390m7165B38075a43810c7318A34969
16254E7462g4394A03094K24231G0441M0349b5174B80720g8215C16407J41244j81058
16243B76593D3063q747M97018F022M682J81125K07808F2284K59800a8621I9771
16231C53375A34432N9202a11834A00331L65408b93961B42128H0108j0721L2193
16221A01580J22838Q5311J92212A51693l5392b11568j38658A79387M5002g7628
16210A62131b53518E8731B9013K05618D5117J79506m5974a11634B53224L22330
$$ plain form
16200 575554 -30246 273829 -61353 70150 211922 -139512 38125 -152976 39180 -124063
16189 177063 168112 -283717 219547 212541 97008 -98691 -338900 -99706 303694 464879 -342803
16177 -176967 -266176 -35334 45162 42031 4924 61762 106733 143198 264906 28814 202878
16166 202878 93128 318377 447884 39070 484052 349071 150404 -68224 220214 247186
16156 247186 -82493 -175624 196186 59002 200312 -105765 -212890 -222107 322513 6507 119833
16145 119833 436 207315 55128 128410 -98274 26803 509178 85893 201607 -241228 -9644
16133 176652 378639 -244933 -130659 236621 -248035 -98242 -55205 151433 -94651 -72468
16123 -72468 68921 -159575 -17514 278179 111755 36004 55111 27736 -292733 412503 -302688
$$ packed form
16200E75554c0246B73829f1353G0150J41772a39512C8125a52976C9180a24063
16189A77063q951b83717B19547p006I7008i8691k40209i9706C03694J61185c42803
16177a76967q9209c5334D5162l131D924N6838M4971L6465J21708B8814J74064
16166B02878I3128K25249J29507C9070M44982j34981A50404f8224B20214K6972
16156B47186h2493r3131A96186E9002J41310a05765j07125r217C22513F507J13326
16145A19833D36K06879E5128P3282i8274B6803M82375H5893J15714b41228i644
16133A76652K01987b44933J14274B36621b48035i8242M3037A51433i4651K2183
16123g2468F8921a59575a7514B78179A11755C6004J9107k7375b92733D12503c02688
$$ plain form
16111 -13980 74914 166157 17967 -56161 37301 60017 -153344 371933 130843 128631 99563
16100 99563 274774 124616 33244 192082 131650 175424 -11363 209736 -142837 103200
16089 112645 60785 4121 -21628 87549 303459 98505 201356 -271586 -54106 -137397 40950
16077 -296430 -510190 -380395 26579 199448 -211563 179343 187287 -21455 -50276 220240
16066 -90355 -72256 24001 -31663 270606 3601 181401 -169169 42879 38294 368016 77327
16054 -384503 -33717 -72872 53541 -102026 -74012 -267925 -302356 140476 230990 256816 343108
16043 343108 73190 135451 -190713 -80768 -116103 342719 17806 -337364 111389 -12684 -156841
16032 -156841 221496 6764 10660 243664 -92328 -209239 -105589 -61590 29349 -175054 -42242
$$ packed form
16111a3980G4914R1243A7967e6161C7301K2716a53344C71933A30843k212k9068
16100I9563J75211A24616C3244J58838o0432M3774a1363B09736a42837A03200
16089A12645n1860D121b1628H7549K15910I8505J02851b71586e4106q3291D0950
16077b96430k13760J29795B6579J72869b11563A79343P944b1455k8821B20240
16066i0355J8099B4001c1663B70606C601J77800a69169D2879m585L29722G7327
16054c84503c3717l9155E3541a02026K8014j93913l4431A40476R0514K5826Q6292
16043C43108G3190O2261a90713h0768l5335C42719A7806c37364A11389a2684j44157
16032a56841B21496F764L896K33004i2328j16911J03650M3999B9349a75054d2242
$$ plain form
16020 -129603 -13527 -141570 -125291 43240 54370 -172183 95771 -216838 368083 -190602
16009 -67609 -235284 284013 22423 -120325 -165828 9874 -51479 -3841 -66931 46875 -97546
15997 -493799 -149700 -223760 -92139 -27098 -82662 -261709 -34581 -89191 -200563 218996 123290
15986 123290 -232803 298206 136593 202263 -3971 303398 223362 -152010 124840 22430
15975 -200988 -232710 316765 -82481 -240915 -187336 70699 172355 50310 31943 -166364 -1789
15963 -72510 38215 -316625 37366 -299148 -251248 149674 104208 -21507 -113858 -297751 -172067
15952 -172067 -445167 -96599 -158894 -174128 -144935 40018 -218936 21011 -97958 59669 -166480
15940 164913 -375083 162796 -118144 -26934 -36220 -179048 -180494 -27491 96135 -6840 -52360
$$ packed form
16020a29603a3527j28043J6279D3240J1130a72183I5771b16838C68083a90602
16009f7609j67675B84013B2423a20325m5503I874e1479c841o3090D6875i7546
15997d93799a49700p4060i2139b7098n5564j79047c4581n4610j11372B18996r5706
15986A23290b32803B98206A36593O5670c971C03398q0036a52010A24840B2430
15975b00988l1722C16765h2481j58434N3579G0699J01656E0310j8367a66364a789
15963g2510C8215c16625C7366b99148M7900A49674m5466b1507r2351j83893J25684
15952a72067k73100i6599o2295j5234K9193D0018b18936B1011i7958E9669a66480
15940A64913c75083A62796a18144b6934r286j42828j446b7491I6135f840m5520
$$ plain form
15929 -52360 -680238 77048 -25990 206954 -380991 74448 204987 -206005 81517 162357 186287
15918 186287 -178109 -317969 122097 139684 -125034 169052 155713 86175 74276 -364622
15907 120725 199272 -26603 8689 -324467 -118698 -201416 79299 243739 -129882 145809 -173238
15895 231233 -15927 -283214 -126834 204858 -187328 -84822 -30668 -1522 77879 102089 318193
15884 318193 330535 247821 -154776 268044 -467154 235803 -191391 -67060 -89466 185635
15873 -223698 -117174 52503 114434 -31301 90078 -65459 14256 -207538 -149123 -48531 -251987
15862 -251987 -45729 -67442 -464894 -321962 296667 -129283 -89275 267244 3649 127498
15852 127498 -163983 24556 235985 -131783 202595 -166541 122763 251634 -197319 98997
$$ packed form
15929e2360o27878G7048b5990B06954c80991G4448J30539b06005H1517Q0840K3930
15918A86287a78109j39860A22097J7587a25034A69052j3339o9538j1899c64622
15907A20725P8547b6603H689c24467a18698q2718G9299J64440a29882A45809a73238
15895B31233a5927k67287a26834B04858a87328h4822c0668a522G7879K4210K16104
15884C18193J2342q2714a54776B68044d67154B35803a91391f7060k2406A85635
15873b23698J06524E2503O1931c1301I0078f5459A4256b07538N8415d8531k03456
15862b51987d5729k1713l97452J42932B96667a29283M0008B67244C649J23849
15852A27498a63983B4556K11429a31783B02595a66541A22763J28871a97319I8997
$$ plain form
15841 113230 -111285 224427 37399 -150865 -75608 6482 305773 -110056 -295829 -245704
15831 -245704 77222 -57087 -196356 52740 -147064 149847 -106650 95881 -183105 -93013
15821 -93013 -433490 -63204 -133561 -52010 232193 10199 12908 -174489 -528 -36830 48834 -121010
15808 -31695 350268 -17330 -101587 158102 63417 344184 -219979 -146096 114105 100251 -58205
15796 127267 -15119 -314097 130425 40106 -65317 -9078 -205805 -237302 -177774 157121 -554178
15784 -94980 -101651 83059 296171 184371 -114039 -263282 75083 46937 108621 249939 -80774
15772 102697 -76289 -56819 148930 -10198 -245183 -42195 138174 -246019 -207436 86623 -114871
15760 -172101 176381 6261 105410 -165358 -158654 -288985 8767 78473 -220795 -51842 -383359
$$ packed form
15841A13230a11285B24427C7399a50865P5257F482K99291a10056j85773N0125
15831b45704G7222e7087j39269E2740a47064A49847a06650I5881a83105R0092
15821i3013l40477f3204p0357e2010B32193A0199K709a74489e28l6302D8834a21010
15808c1695C50268a7330q4257A58102F3417K80767b19979P3883A14105j3854e8205
15796A27267a5119k98978A30425D0106f5317i078j96727l1497N9528A57121e54178
15784i4980o671H3059K13112j11800a14039j49243G5083k8146O1684J41318h0774
15772A02697g6289J9470A48930a0198k34985d2195A38174b46019L8583H6623a14871
15760a72101A76381F261R9149a65358O704j30331H767O9706b20795e1842l31517
$$ plain form
15749 -383359 -88782 91296 257901 194967 -232783 286823 -166358 -152164 242538 353606
15739 353606 -30671 112962 -14809 -335539 112475 -216049 -106141 87166 -171660 34619
15728 28505 52248 197653 -30499 -97230 -17623 142911 -56263 30265 44778 -354994 -33759
15716 -90739 70096 -118314 196569 27942 -45267 86766 -62332 -27571 -41761 -247556 -200627
15705 -200627 -14707 -159078 -168540 98083 9669 -87038 89054 307904 -73372 -86795 51317
15693 15681 323914 61541 118216 104046 240113 -73011 -102286 110829 -117460 251277 192239
15682 192239 -109041 99083 53266 13730 -210907 -294989 -35567 -169664 -317156 -149843
15671 86619 -68066 -177846 -46606 40517 -138619 -258424 -149922 -109474 262816 -79103 -331950
$$ packed form
15749c83359h8782I1296J66605o2934b32783B86823a66358J4194B42538J11068
15739C53606c0671A12962a4809l20730A12475b16049a06141H7166a71660C4619
15728B8505K3743J45405c0499o6731a7623A42911e6263C0265J4513c54994c3759
15716i0739G0096a18314A96569B7942d5267H6766f2332b7571j4190k05795M6929
15705b00627a4707j44371r462I8083I669h7038H9054K18850g3372j3423E1317
15693A5681L08233F1541N6675j4170J36067g3011k9275A10829a17460B51277n9038
15682A92239a09041I9083m5817A3730b10907q4082c5567j34097j47492a49843
15671H6619f8066j09780d6606D0517a38619j19805J08502M0448B62816g9103k52847
$$ plain form
15660 -331950 116697 148910 83863 -151851 -83767 78523 241549 -180911 93865 356696
15650 356696 20042 -304916 479132 -82738 -131496 -100234 -207102 175412 -242937 -147966
15640 -147966 173964 -82351 -302578 -72286 -199201 275812 -216042 -527472 -52609 173826
15629 -164511 11999 -108100 30614 191375 -188518 -104075 307833 -161072 -75333 -76112 -39533
15618 -39533 75297 -338373 70591 -116419 117514 -111437 51214 -95843 29714 23867 68017
15607 68017 -216204 269773 -265864 -173873 -30235 -111626 -24672 -164812 -122856 -33969 100690
15595 -80685 201551 -102399 124591 -44671 -85936 -184685 -290826 97812 -77160 226830 34728
15583 79246 22710 -304019 110411 23089 129226 -233247 -43816 -29257 -150089 -69688 -114117
$$ packed form
15660c31950A16697L2213o5047a51851O8084G8523J63026a80911I3865K62831
15650C56696B0042c04916D79132h2738m8758L1262j06868A75412b42937R4971
15640a47966A73964h2351k20227g2286j26915B75812b16042l11430e2609A73826
15629a64511A1999a08100C0614J60761a88518Q4443C07833a61072g5333p79L6579
15618c9533G5297c38373G0591a16419A17514a11437E1214i5843B9714n847M4150
15607F8017b16204B69773b65864R1991c0235q1391b4672j40140M1956c3969A00690
15595h0685B01551a02399A24591d4671m1265r8749j06141I7812g7160B26830C4728
15583G9246B2710c04019A10411B3089J06137b33247d3816J4559j20832f9688m4429
$$ plain form
15572 -114117 -38255 -116190 59472 179406 -325542 263915 28967 257753 -41527 368442
15561 -111840 154486 -38767 373519 168340 -380852 -21201 245802 -126801 -372116 53616
15550 34400 -150005 167232 -186599 305320 180494 149704 -44260 -78373 -62412 -219027
15540 -219027 91903 -598861 -92629 22025 -344520 101261 315460 -227008 161944 -91340
15529 -74316 -24120 -145933 -180104 289294 -28805 35696 60243 -168023 -42503 31785 34441
15518 34441 -26553 -217961 -5511 103027 -294326 -112253 -171568 -184270 10037 219960 -72913
15506 59318 -123504 -4152 287373 -33219 173859 287604 -27449 -65182 181892 46354 419330
15495 419330 -17938 -67680 43243 -109676 117214 -171066 237615 185057 51508 232125
$$ packed form
15572a14117c8255p7935E9472J19934c25542B63915B8967K28786d1527C68442
15561a11840A54486c8767C73519A68340c80852b1201B45802a26801k45315E3616
15550C4400a50005A67232a86599C05320j24826l0790d4260l4113J5961j56615
15540b19027I1903e98861i2629B2025c44520A01261K14199b27008A61944i1340
15529g4316b4120j21813l4171B89294b8805C5696K4547a68023d2503C1785K656
15518C4441b6553j91408e511A03027b94326a12253n9315j2702A0037K09923g2913
15506E9318a23504d152B87373c3219A73859J13745b7449l7733A81892D6354L72976
15495D19330a7938m9742D3243a09676A17214a71066B37615n2558E1508J80617
$$ plain form
15485 232125 -241647 197413 -61925 153657 -49568 3443 43733 -196829 -172286 -288037 69275
15473 101695 31123 -220784 150928 -126575 -23913 -149078 -172815 -105845 -111908 -41451 215410
15461 319849 -33289 -71137 111624 -157590 -177609 -121080 120445 -190240 29257 -84136 -119259
15450 -119259 30375 -10343 363768 -15048 110528 -69454 -67261 27821 -6169 -6730 -134970 -91335
15438 -91335 -189831 259545 205873 -5646 144060 -41841 92169 218172 -54296 -223138 150598
15426 221701 -82434 89946 164024 52216 167783 362735 -96493 31291 -27768 101714 -32781
15414 -62628 186869 -74453 -190555 -59335 -179242 -36652 20335 -217766 -162427 319998 216721
15403 216721 73184 11136 -55022 -134228 4104 -270879 -86180 28701 177042 -297227 166396
$$ packed form
15485B32125b41647A97413f1925A53657d9568C443M0290a96829K4543j15751F9275
15473A01695C1123b20784A50928a26575b3913j25165k3737O6970o063d1451B15410
15461C19849c3289l7848A11624a57590k0019N6529A20445a90240B9257h4136l5123
15450a19259C0375a0343C63768a5048A10528f9454K193B7821f169n61j28240M3635
15438i1335r8496B59545n3672e646A44060d1841I2169J26003e4296j68842A50598
15426B21701h2434H9946P4078E2216J15567J94952i6493C1291b7768A01714c2781
15414f2628A86869g4453j16102e9335j19907c6652B0335b17766N5339C19998j03277
15403B16721G3184A1136e5022p9206D104b70879h6180B8701J48341b97227A66396
$$ plain form
15391 148799 245430 166035 -210334 204693 233093 -92667 -126776 -259748 72857 -16828 1658
15379 58507 111806 -92872 -4095 44273 26898 -6794 144542 -279850 210449 -84759 103902
15367 173191 50572 -135446 -243878 166458 -194796 123637 183227 36640 74663 -11077
15356 -50601 439061 251763 190749 -266246 4384 -101554 -252261 -151651 -27947 -145419
15346 -145419 154726 -108390 -142290 449271 375056 -227994 186564 165931 22921 307240
15336 307240 109029 -70607 88581 123721 -105539 20583 205323 -115792 284766 329496
15326 329496 123634 92028 -66832 -48764 -17413 96138 -205380 73789 -240917 92343 230369
15315 230369 -215559 365294 -119489 -165147 -130167 178766 106305 230165 -233347 519664
$$ packed form
15391A48799R6631p9395b10334B04693K8400i2667l4109j32972G2857a6828A658
15379E8507N3299i2872d095D4273j7375f794A44542b79850B10449h4759A03902
15367A73191E0572a35446j08432A66458a94796A23637N9590C6640L8023a1077
15356e0601D39061j87298o1014b66246D384a01554j50707J00610b7947j17472
15346a45419A54726a08390l3900D49271p4215b27994A86564k0633B2921K84319
15336C07240A09029g0607H8581L5140a05539B0583J84740a15792B84766M4730
15326C29496A23634l1606f6832J8068a7413I6138b05380G3789b40917I2343J38026
15315B30369b15559C65294a19489m5658L4980A78766p2461J23860b33347E19664
$$ plain form
15304 48776 250126 -112171 337884 -67064 10206 -169614 118703 77834 263267 -124350
15293 -85268 -33563 -137834 70357 14820 49935 -225311 7291 -88924 -243698 83174 -7875
15281 73111 -71428 66397 -94823 212968 -348130 -16405 108676 454063 454643 180085 162088
15270 162088 -129832 213172 77117 -464775 141641 -221640 -212270 -14415 172454 382333
15260 382333 -55803 94389 544284 -175334 16269 -12695 158396 485339 110806 262986
15250 262986 172315 1035078 1853250 1377353 1491037 1331355 549745 486763 98877 291875
15240 291875 104969 259889 89776 49101 -282996 94300 340183 114007 83353 386038
15230 386038 185405 121804 471751 76456 -256439 72908 -67624 97128 -322881 147078
$$ packed form
15304D8776K01350a12171C37884f7064A0206a69614A18703m0869J85433a24350
15293h5268c3563j04271G0357A4820L5115b25311G291h8924j54774H3174g875
15281G3111g1428F6397i4823B12968c48130a6405A08676L45387N80A80085j7997
15270A62088a29832B13172G7117d64775A41641b21640R370a4415A72454K09879
15260C82333e5803I4389M49895a75334A6269a2695A58396L26943A10806J52180
15250B62986r0671Q62763Q18172m75897J13684j59682E49745o2982I8877J92998
15240B91875A04969J54920H9776m0675b82996I4300K45883A14007l0654L02685
15230C86038A85405o3601L49947G6456b56439G2908f7624I7128c22881A47078
$$ plain form
15219 -56273 325740 218420 225147 48675 -115992 309149 91012 456405 -19942 115004 39762
15207 233268 -17760 -12358 -32791 -139767 -36286 -78457 -16663 -99832 -160858 525587 38162
15195 -44644 294283 129178 -171722 323537 -521948 -172193 -6321 116151 111088 263487
15185 263487 37338 -141737 43005 155358 168701 -36946 317520 -70443 -29541 9822 190540
15174 190540 -311724 41362 189492 175207 22574 113966 -210212 -220695 -77875 -158620 142219
15162 -134728 -104224 326390 61879 -45226 -106351 -235556 168531 242467 125836 -107766
15151 110788 26679 194329 191801 -183150 149454 238791 -381693 151391 181441 233807 -132839
15139 -132481 187414 158797 62394 -233922 -31471 256164 91664 6132 29409 -4347 12078
$$ packed form
15219e6273C25740j07320O727D8675a15992C09149I1012L65393a9942A15004C9762
15207B33268a7760N402k0433j06976c6286m2171a6663q3169o1026E25587C8162
15195d4644B94283A29178a71722C23537e21948a72193f321A16151n063J52399
15185B63487C7338a41737D3005J12353J3343c6946C17520g0443b9541I822J80718
15174A90540c11724D1362J48130j4285B2574R1392b10212j0483g7875q0745A42219
15162a34728L0504C26390F1879d5226o1125j29205A68531P3936j16631a07766
15151A10788B6679J67650k528a83150A49454Q9337c81693A51391L0050N2366a32839
15139a32481A87414k8617F2394b33922c1471B56164I1664F132K3277d347A2078
$$ plain form
15127 125728 9495 12177 184803 35387 -227678 122635 -24655 332256 311405 651648 -129568
15115 116980 143100 255446 -153916 -13757 266996 219432 210899 171767 251850 18111 -7315
15103 585373 126429 22877 199113 121183 -212303 289236 270510 268438 235800 164913 316477
15092 316477 4494 -26295 51117 -121358 197648 70383 210500 -74966 153470 94270 261586
15081 261586 39409 46089 139448 41546 53597 176486 149022 226754 309499 -103079 18424
15069 56040 29664 160353 158866 -283570 -79562 131716 -30914 133830 142406 146709 191031
15058 191031 -72133 46504 276974 134770 263464 86563 274489 15517 498868 225247
15047 261589 -144431 209014 431554 143750 131133 312051 225182 -63296 152107 299295
$$ packed form
15127A25728I495K682J72626C5387b27678A22635b4655C32256k0851L40243a29568
15115A16980K6120J12346a53916a3757B66996m7564q533l9132Q0083A8111g315
15103E85373A26429B2877J76236p7930b12303B89236j8726k072l2638p0887J51564
15092C16477D494b6295E1117a21358A97648G0383J40117g4966A53470n9200J67316
15081B61586C9409O680R3359D1546J2051J22889k7464P7732Q2745a03079A8424
15069E6040k6376J30689j487b83570g9562A31716c0914A33830Q576M303M4322
15058A91031g2133D6504K30470A34770J28694H6563J87926A5517M83351B25247
15047B61589a44431B09014K22540A43750j2617J80918q6869f3296A52107J47188
$$ plain form
15037 299295 6698 402956 -129557 403202 239544 47788 663069 122248 93322 103507
15027 103507 302318 -79011 357514 442112 13044 242591 -27198 -96935 -21327 213098 93434
15015 230844 510499 212339 -158612 -139334 120769 144835 80057 399365 197791 576454
15005 576454 202966 537078 320627 -101521 230980 -9469 136780 116493 175928 262526
14995 262526 29320 96663 -92977 234618 249273 531118 124419 210085 248509 278804 38163
14983 304536 37757 138785 778233 300814 -75839 50593 -6065 298867 -39331 100775 471084
14972 471084 -203536 332476 82335 330858 268587 487854 193882 216575 441563 563267
14962 563267 -95853 194543 -60502 187653 470179 616714 411479 -84082 225955 189399
$$ packed form
15037B99295F698L96258a29557D03202j63658D7788O15281A22248k8926J0185
15027A03507J98811g9011C57514Q4598A3044K29547b7198o9737b1327B13098I3434
15015B30844K79655B12339a58612J9278A20769K4066o4778L19308A97791L78663
15005E76454B02966L34112k16451a01521B30980i469A36780k0287N9435Q6598
14995B62526B9320O7343i2977B34618J4655K81845A24419Q5666L8424L0295C8163
14983C04536C7757J01028O39448C00814g5839E0593f065B98867c9331A00775L70309
14972D71084b03536C32476H2335K48523o2271K19267A93882K2693K24988J21704
14962E63267i5853A94543f0502A87653K82526J46535k05235h4082B25955l6556
$$ plain form
14952 189399 -90396 319297 -31093 545880 63970 171943 188121 595695 211338 14367
14941 6706 144514 193764 -25876 266035 439360 -39619 10505 128632 68500 273723 439547
14930 439547 152588 468674 95044 260759 270876 97910 365484 375046 196391 345432
14920 345432 234516 420549 138671 251032 371169 215574 369083 33103 402500 438380
14910 438380 429714 108912 407575 496581 285552 263766 93371 214161 354740 519762
14900 519762 310701 334221 146031 224093 280848 296061 375732 163464 579714 467954
14890 467954 333122 471997 303620 539398 155529 343814 455154 246417 350329 331502
14880 331502 124149 577734 209188 367402 380098 350714 401757 240603 418596 243777
$$ packed form
14952A89399i0396C19297c1093E45880F3970J07973J6178M07574B11338A4367
14941F706J37808M9250b5876B66035J73325c9619A0505J18127o0132K05223J65824
14930D39547A52588L16086I5044J65715J0117I7910K67574R562j78655J49041
14920C45432j10916J86033A38671J12361J20137j55595J53509C3103L69397L5880
14910D38380q666A08912K98663Q9006k11029k1786I3371J20790J40579J65022
14900E19762k09061K3520A46031P8062N6755J5213P9671A63464M16250j11760
14890D67954j34832J38875j68377K35778A55529J88285J11340k08737J03912j8827
14880C31502A24149M53585B09188J58214J2696k9384N1043j61154J77993j74819
$$ plain form
14870 243777 474504 273344 355986 161328 396005 202491 401060 399142 475363 34581
14859 676475 294621 104454 211424 356821 408651 247887 653805 325755 409590 148380
14848 751556 310069 487655 231343 490458 376968 688468 339724 232260 505497 531843
14838 531843 392392 322566 431470 434656 224057 361956 407727 537936 599213 512681 644182
14827 644182 636559 362040 454437 414867 702417 424720 685254 266937 495992 381071
14817 381071 345753 506332 515462 402240 573703 595750 479151 -7420 759705 721243 599503
14806 599503 334695 555948 559143 493043 646563 443961 438279 338363 360449 722779 479017
14795 479017 271358 598337 719008 540112 273837 436642 407149 199381 574757 707494
$$ packed form
14870B43777K30727k01160Q2642A61328K34677j93514J98569j918P6221C4581
14859F76475B94621A04454J06970J45397N1830j60764M05918C25755Q3835A48380
14848G51556C10069J77586B31343K59115j13490L11500C39724j07464K73237K6346
14838E31843j39451o9826J08904L186k10599J37899M5771J30209O1277q6532J31501
14827F44182p623k74519R2397l9570K87550k77697K60534B66937K29055j14921
14817C81071l5318J60579R130j13222J71463K2047j16599g420G59705l8462j21740
14806E99503k64808K21253L195o6100J53520k02602n682r9916K2086L62330k43762
14795D79017k07659L26979J20671j78896k66275J62805k9493A99381L75376J32737
$$ plain form
14785 707494 161506 481157 917599 1132939 392512 730896 667470 572238 996182 418677
14774 555162 471865 755678 527587 551216 375977 931586 536548 652181 541635 606713
14764 606713 591954 624625 885172 589796 751666 518372 457088 670252 415932 605313
14754 605313 558695 498115 834982 573235 368471 843595 611115 76405 750839 570147
14744 570147 731629 939095 671243 579512 682596 764664 289203 748641 491200 648444
14734 648444 423370 468266 727890 868965 908483 577144 818808 1011724 664383 682935
14724 682935 1126107 659561 668325 809058 1031397 797480 820883 407073 974255 353118
14713 686193 724057 680224 1015076 565762 874109 749510 621289 1033306 861120 687783
$$ packed form
14785G07494A61506L19651M36442K15340C92512L38384o3426r5232M23944D18677
14774E55162q3297K83813k28091K3629j75239N55609l95038J15633j10546O5078
14764F06713j4759L2671K60547k95376J61870k33294o1284K13164k54320J89381
14754F05313m6618o0580L36867k61747k04764M75124k32480G6405O74434j80692
14744E70147J61482K07466k67852r1731J03084Q2068B89203M59438k57441J57244
14734F48444k25074M4896K59624J41075L9518l31339K41664J92916l47341J8552
14724F82935M43172m66546Q764J40733K22339k33917K3403D07073N67182C53118
14713F86193L7864m3833L34852m49314L08347j24599j28221M12017j72186j73337
$$ plain form
14703 687783 914091 668271 962564 886540 890396 785762 856456 1106711 619300 897258
14693 897258 524692 981044 961090 818905 792720 1115373 815896 985850 689430 974174
14683 974174 695046 1155776 558660 1059480 938739 769450 679618 755811 809218 909628
14673 909628 967474 1349061 999554 922779 1026283 1145504 666344 1077918 1101788 1247445
14663 1247445 793023 819744 793516 740915 1046895 1347464 1509581 1298932 1096977 851768
14653 851768 1232862 1165548 837002 946021 1256098 916007 1120283 946813 1088448 1449730
14643 1449730 1061935 989506 989357 907233 1342669 1151174 1226497 1345418 1414235 1231449 1311050
14632 1311050 1315151 1013268 858250 1194753 1377960 1155656 1519939 1232327 1060524 1440237
$$ packed form
14703F87783K26308k45820K94293p6024L856j04634P0694K50255m87411K77958
14693H97258l72566M56352j9954j42185k6185L22653k99477J69954k96420K84744
14683I74174k79128M60730E58660N00820j20741j69289q9832P6193N3407J00410
14673I09628N7846L81587l49507p6775J03504J19221m79160M11574K3870J45657
14663A247445m54422K6721k6228n2601L05980L00569J62117k10649k01955k45209
14653H51768L81094o7314l28546J09019L10077l40091K04276j73470J41635L61282
14643A449730l87795p2429j49q2124M35436j91495P5323J18921O8817j82786P9601
14632A311050M101l01883j55018L36503J83207k22304L64283k87612j71803L79713
$$ plain form
14622 1440237 1398378 1471077 1343977 1345487 1226663 1361036 1553312 1385137 1061629 1532027
14612 1532027 1814780 1385380 1390428 1504253 1219015 1234878 1236374 1039530 1833822 1535479
14602 1535479 1433835 1621282 1538553 1643507 1406224 1548470 1617509 1544604 1831221 1339387
14592 1339387 1596694 2033714 1982434 2244293 1906713 1842303 1445994 1510890 2033941 1946142
14582 1946142 1607670 1828796 2131248 2024247 1704578 2126782 2272494 1912165 1793962
14573 1793962 2327520 1984360 2057343 2121922 1907282 2022071 1962585 2150193 2268658 2206029
14563 2206029 2378367 2268448 2478651 2371623 2779342 2777071 2532579 2855147 3321091 3209795
14553 3209795 3551827 3870240 4650342 5401945 7143830 11123303 20573117 36736267 46221000
$$ packed form
14622A440237m1859P2699j27100J510j18824J34373J92276j68175l23508M70398
14612A532027K82753m29400N048J13825k85238J5863J496j96844P94292k98343
14602A535479j01644J87447q2729J04954k37283J42246O9039p2905K86617m91834
14592A339387K57307M37020n1280K61859l37580o4410l96309O4896N23051q7799
14582A946142l38472K21126L02452j07001l19669M22204J45712l60329j18203
14573A793962N33558l43160P2983O4579k14640J14789n9486J87608J18465o2629
14563B206029J72338j09919K10203j07028M07719k271k44492L22568M65944j11296
14553C209795L42032L18413P80102P51603J741885L979473R449814J6163150R484733
$$ plain form
14544 46221000 24523716 9852497 4752088 3103441 2337717 1930760 2407372 1708024
14536 1708024 1928419 1643344 2068320 2074302 1810667 2242836 2235417 2130625 1993852 2055699
14526 2055699 2137245 2213209 2227391 2341536 2631237 2202438 2273875 2268937 1975484 2059728 2481424
14515 2481424 2283421 2311851 2353353 2405126 2653338 2782240 2650568 2341675 2649117 2434142
14505 2434142 2924331 2855759 2763224 2573807 3112064 3004020 2983135 2554368 3036350 3411387
14495 3411387 2995863 3289655 3021923 2819716 2910770 3277333 3159445 3321810 3408737 3466403
14485 3466403 3237448 3600879 3524868 3676127 3512642 3579395 3601284 3849690 3963480 3929259
14475 3929259 3437762 3896960 3774743 3989254 4016012 4055706 4372495 4241149 4095811 4395515
$$ packed form
14544D6221000k1697284I852497D752088j648647p65724m06957M76612o99348
14536A708024K20395k85075M24976N982k63635M32169p419j04792j36773O1847
14526B055699Q1546P5964J4182J14145K89701m28799P1437m938k93453Q4244M21696
14515B481424j98003K8430M1502N1773K48212J28902j31672l08893L07442k14975
14505B434142M90189o8572r2535j89417N38257j08044k0885m28767M81982L75037
14495C411387m15524K93792k67732k02207R1054L66563j17888J62365Q6927N7666
14485C466403k28955L63431p6011J51259j63485O6753K1889K48406J13790l4221
14475C929259m91497M59198j22217K14511K6758L9694L16789j31346j45338K99704
$$ plain form
14465 4395515 4084114 4011543 4125058 4491457 4417723 4877032 4890674 4501205 4653109 4736173
14455 4736173 4776609 4721238 5055423 5156439 4998163 4948855 5118411 5117195 5444148 5446756 5183205
14444 5183205 5448296 5599932 5625611 5861780 5586919 5637170 5805084 6013263 5922305 5896805
14434 5896805 6085806 6465626 6340240 6459940 6526729 6379175 6119935 6623602 6805308 6934997
14424 6934997 6963915 6977531 7335775 7478402 7259803 7571865 7675167 7639064 7830950 8020802
14414 8020802 7993833 8456373 8298407 7680742 8744188 8422110 8574177 8861904 8920577 9131846
14404 9131846 9115166 9297209 9330411 9712182 9556792 10044416 10078194 10272665 10274693 10436084
14394 10436084 10976158 10988735 11206738 11322235 11392753 11865406 11862644 12179033 12659110 12464742
$$ packed form
14465D395515l11401p2571J13515L66399p3734M59309J3642l89469J51904Q3064
14455D736173M0436n5371L34185J01016j58276m9308J69556j216L26953K608k63551
14444E183205K65091J51636K5679K36169k74861N0251J67914K08179r0958k5500
14434E896805J89001L79820j25386J19700O6789j47554k59240N03667J81706J29689
14424F934997K8918J3616L58244J42627k18599L12062J03302l6103J91886J89852
14414H020802k6969M62540j57966o17665J063446l22078J52067K87727N8673K11269
14404I131846j6680J82043L3202L81771j55390M87624L3778J94471K028J61391
14394A0436084N40074J2577K18003J15497P0518M72653k762L16389M80077j94368
$$ plain form
14384 12464742 12835397 12840257 13329716 13175071 13537458 13812900 14201328 14656711 14923141 14782532
14374 14782532 15271540 15627038 15873940 15980082 16502752 16793973 17108755 17845655 18024515
14365 18024515 17923327 18463924 18950577 19563966 20063258 20233958 20680527 21194255 21445506
14356 21445506 22333243 22667345 23310979 22880385 24355979 25001561 25596268 25951148 26771128
14347 26771128 27369361 27961343 29019940 29410942 30250559 31225628 31978092 33020958 33720284
14338 33720284 34609271 35712895 36888171 37941674 38701268 39835788 41519395 42452546
14330 42452546 43888099 45173771 46532816 48025590 49929061 51017892 52858469 54688484
14322 54688484 56236226 58673006 60830898 63065486 65344733 67568423 70427925 72902660
$$ packed form
14384A2464742L70655M860M89459j54645L62387K75442L88428M55383K66430j40609
14374A4782532M89008L55498K46902J06142N22670K91221L14782P36900J78860
14365A8024515j01188N40597M86653O13389M99292J70700M46569N13728K51251
14356B1445506Q87737L34102O43634m30594J475594O45582N94707L54880Q19980
14347B6771128N98233N91982J058597L91002Q39617R75069P52464J042866O99326
14338C3720284Q88987J103624J175276J053503P59594J134520J683607R33151
14330D2452546J435553J285672J359045J492774J903471J088831J840577J830015
14322E4688484J547742K436780K157892K234588K279247K223690K859502K474735
$$ plain form
14314 72902660 75587745 78708017 81934347 85370769 88626442 92738444 96387483 100706424
14306 100706424 104945398 110026906 114808030 120035421 126202023 131834691 138521773 144977582
14298 144977582 152334548 160510041 168434214 177267308 186533378 196694548 207313251 218142107
14290 218142107 230186874 242824614 256142028 270048173 284709597 299898490 315784055
14283 315784055 332424296 348900378 365864556 382626643 399171388 415279215 430613803
14276 430613803 444649673 457170264 467802457 475311005 479351380 478995854 477325670 478067925
14268 478067925 476347980 473582744 467051909 458046910 446782726 433438185 419011935
14261 419011935 402754970 385842095 368675240 351430456 334070391 317811604 302419369
$$ packed form
14314G2902660K685085L120272L226330L436422L255673M112002L649039M318941
14306A00706424M238974N081508M781124N227391O166602N632668O687082O455809
14298A44977582P356966Q175493P924173Q833094R266070J0161170J0618703J0828856
14290B18142107J2044767J2637740J3317414J3906145J4661424J5188893J5885565
14283C15784055J6640241J6476082J6964178J6762087J6544745J6107827J5334588
14276D30613803J4035870J2520591J0632193P508548M040375l55526j670184P42255
14268D78067925j719945k765236o530835r004999j1264184j3344541j4426250
14261D19011935j6256965j6912875j7166855j7244784j7360065j6258787j5392235
$$ plain form
14254 302419369 287292744 272568320 257879750 244424809 231779204 219844434 208352208
14247 208352208 197523294 187539122 178065214 169704438 161183560 153012373 145630726 138491650
14239 138491650 132089198 126452717 120876451 115076235 109991567 105105923 100952606 96561163
14231 96561163 93352439 88939960 85390490 82263885 78567712 75505491 72792725 70031342
14223 70031342 67412587 64827042 62942090 60799283 58703386 56450740 54729820 52431710
14215 52431710 50985727 49953224 48350346 46649447 45145021 43520170 42443408 41050365
14207 41050365 40866793 39606233 38061710 36655068 35631482 34368017 33954289 33294430
14199 33294430 32386596 31651198 30497694 29677080 29098148 28283157 27709433 26744681 26143207
$$ packed form
14254C02419369j5126625j4724424j4688570j3454941j2645605j1934770j1492226
14247B08352208j0828914r984172r473908q360776q520878q171187p381647p139076
14239A38491650o402452n636481n576266n800216n084668m885644m153317m391443
14231I6561163l208724m412479l549470l126605l696173l062221k712766k761383
14223G0031342k618755k585545j884952k142807k095897k252646j720920k298110
14215E2431710j445983j032503j602878j700899j504426j624851j076762j393043
14207D1050365j83572j260560j544523j406642j023586j263465m13728o59859
14199C3294430r07834p35398j153504q20614n78932q14991n73724r64752o01474
$$ plain form
14190 26143207 25803041 24818052 23895783 23700435 23415071 22572496 22233519 21620313 21282792
14181 21282792 20715150 20420170 19770747 19447678 19008499 18269289 18048743 17635626 17612467
14172 17612467 17233189 16744099 16253088 16217307 15892552 15589023 15339723 14784096 14875807 14471951
14162 14471951 14100208 13872783 13637970 13184981 13573349 13321390 12493066 12490712 12197629 11877711
14152 11877711 11743176 11854351 11419493 11027539 11108524 11300247 10539843 10444147 10377734 10108242
14142 10108242 10257348 10010653 9866118 9540075 9732812 9548233 9476618 9315077 9130892
14133 9130892 8839049 8828021 8442285 8155058 8220439 8333699 8105464 8463205 8061555 8218192
14123 8218192 7771698 7508342 7422234 7330287 7352896 7011743 7115598 6977725 6898915 6791113
$$ packed form
14190B6143207l40166r84989r22269j95348k85364q42575l38977o13206l37521
14181B1282792n67642k94980o49423l23069m39179p39210k20546m13117k3159
14172A7612467l79278m89090m91011l5781l24755l03529k49300n55627R1711m03856
14162A4471951l71743k27425k34813m52989L88368k51959q28324k354k93083l19918
14152A1877711j34535J11175m34858l91954Q0985J91723p60404r5696o6413k69492
14142A0108242J49106k46695j44535l26043J92737j84579p1615j61541j84185
14133I130892k91843j1028l85736k87227O5381J13260k28235L57741m01650J56637
14123H218192m46494k63356q6108r1947K2609l41153J03855j37873p8810j07802
$$ plain form
14113 6791113 7051442 6245745 6683726 6313657 6504331 6317145 6192145 6167497 6227694 5917701
14103 5917701 5949528 5913989 5813219 5572870 5603592 5707123 5392626 5531204 5261410 5048091
14093 5048091 5507469 5318758 5025952 4893286 4725499 5127167 5108942 4570029 4425189 4686377
14083 4686377 4632063 4502318 4696486 4195364 4294085 4218770 4476905 4473840 4227712 4422409
14073 4422409 4354557 4113278 4262780 3858199 4074037 3891627 4115152 3907782 4128968 4036624
14063 4036624 3845104 3613073 3999275 3326764 3517285 3772813 4230949 3763819 3182371
14054 3182371 3641799 3029898 3573829 3347722 3291302 3310863 3429021 3104912 3246627 3400529
14044 3400529 3298846 2970066 2975295 3155777 3153347 2746165 2986864 3095522 2856769 2650618
$$ packed form
14113F791113K60329q05697M37981l70069J90674j87186j25000k4648O0197l09993
14103E917701L1827l5539j00770k40349L0722J03531l14497J38578k69794k13319
14093E048091M59378j88711k92806j32666j67787M01668j8225n38913j44840K61188
14083D686377n4314j29745J94168n01122R8721p5315K58135l065k46128J94697
14073D422409o7852k41279J49502m04581K15838j82410K23525k07370K21186r2344
14063D036624j91520k32031L86202o72511J90521K55528M58136m67130n81448
14054C182371M59428o11901N43931k26107n6420J9561J18158l24109J41715J53902
14044C400529j01683l28780N229J80482k430m07182K40699J08658k38753k06151
$$ plain form
14034 2650618 2945268 2974837 2994727 3100831 2944754 2553124 3181557 2726227 2836811 2785918
14024 2785918 2925272 2543350 2526373 2795528 2421733 2626601 2584569 2431444 2260555 2406292
14014 2406292 2464483 2396795 2167120 2250409 2398088 2137969 2070765 2346525 2232598 2256890
14004 2256890 1825242 1786534 2116006 1804855 1994104 2012706 1908562 1994091 1687365 2092556
13994 2092556 1318310 1796457 2170830 2357687 2511143 3304248 5994584 13769559 29844064
13985 29844064 45951281 28555486 13829354 8114270 5764215 4541743 3626311 3150263
13977 3150263 3096771 2766569 2710553 2698616 2636450 2459318 2508481 2547925 2160776 2223420 2624797
13966 2624797 2273567 2180316 2129980 1998873 2109429 1955618 1891237 1865025 2183387 2158079
$$ packed form
14034B650618K94650K9569J9890J06104j56077l91630O28433m55330J10584n0893
14024B785918J39354l81922j6977K69155l73795K04868m2032j53125j70889J45737
14014B406292N8191o7688k29675Q3289J47679k60119o7204K75760j13927K4292
14004B256890m31648l8708L29472l11151J89249J8602j04144Q5529l06726M05191
13994B092556p74246M78147L74373J86857J53456P93105K690336P774975J6074505
13985B9844064J6107217j7395795A3829354n715084k350055j222472r15432m76048
13977C150263n3492l30202n6016j1937o2166j77132M9163L9444l87149O2644M01377
13966B624797l51230r3251n0336j31107J10556j53811o4381k6212L18362k5308
$$ plain form
13956 2158079 1835215 1699558 2037658 1710122 1940671 1617160 1431292 1699593 1221922
13947 1221922 1716582 1880298 1722712 1898804 1687014 1727331 1712263 1685758 1698810 1432793
13937 1432793 1454941 1363073 1650257 1567767 1221475 1470541 1827874 1547581 1316063 1438162
13927 1438162 1101979 1455160 1355539 1366751 1382837 1476150 1389161 1382357 1390202 1410395 1182692
13916 1182692 1370328 1623490 1085899 1210704 1263740 1355073 1441382 1128600 1185086 1242207
13906 1242207 1540317 1139134 1332939 1574538 1251896 1218127 973115 1468216 1307851 1196188
13896 1196188 1248096 1182914 1106762 1552245 802176 761103 906186 1181188 1083916 1377294
13886 1377294 1060565 1422180 1322094 892273 962528 1335225 929914 1249180 1046768 1317026
$$ packed form
13956B158079l22864j35657L38100l27536K30549l23511j85868K68301m77671
13947A221922M94660J63716j57586J76092k11790M0317j5068k6505J3052k66017
13937A432793K2148r1868K87184q2490l46292K49066L57333k80293k31518J22099
13927A438162l36183L53181r9621J1212J6086R3313q6989o804P845K0193k27703
13916A182692J87636K53162n37591J24805N3036R1333Q6309l12782N6486N7121
13906A242207K98110m01183J93805K41599l22642l3769k45012M95101j60365j11663
13896A196188N1908o5182p6152M45483p50069m1073J45083K75002r7272K93378
13886A377294l16729L61615j00086m29821P0255L72697m05311L19266k02412K70258
$$ plain form
13876 1317026 1037504 981871 1099210 917892 1166925 1158378 768395 1058204 722083 1330699
13866 1330699 1225053 1267325 1315142 1036330 1205543 1010715 852551 1085940 997291 768312
13856 768312 1084956 935546 863939 1114949 1038396 856064 786979 1230018 962028 887884
13846 887884 985606 874327 864751 782002 929881 1063984 555160 855798 778873 741873 853196
13835 853196 1119640 851776 981927 455748 1004926 1033636 1094210 547570 944797 493436
13825 493436 623906 689314 509102 741299 611044 697095 414366 846176 859163 916799
13815 916799 328383 633960 556754 911714 779101 455868 980016 921819 1293152 937880
13805 937880 701071 738660 772709 946093 745891 626314 638065 221773 680684 693666
$$ packed form
13876A317026k79522n5633J17339j81318K49033q547l89983K89809l36121O08616
13866A330699j05646M2272M7817k78812J69213j94828j58164K33389q8649k28979
13856G68312L16644j49410p1607K51010p6553j82332o9085M43039k67990p4144
13846H87884R7722j11279r576q2749J47879J34103n08824L00638p6925l7000J11323
13835H53196K66444k67864J30151D55748N49178K8710O0574n46640L97227m51361
13825D93436J30470O5408j80212K32197j30255Q6051k82729M31810J2987N7636
13815I16799C28383L05577p7206L54960j32613l23233N24148n8197L71333l55272
13805I37880k36809L7589L4049J73384k00202j19577J1751B21773M58911J2982
$$ plain form
13795 693666 948006 828392 944075 683006 933214 450441 839024 596827 801695 442454
13785 442454 811382 403278 860024 761249 319872 711625 579904 620520 216820 693015
13775 693015 542642 627501 450703 577627 1022010 704883 859884 530405 530208 400115
13765 400115 317371 567095 790241 559759 467576 529388 649138 381397 462035 382630
13755 382630 427963 540009 537269 323179 314130 401825 472990 500272 466307 481275 613102
13744 613102 449301 759479 429257 394865 40342 511518 287562 547336 130652 575679
13734 575679 546807 501985 531416 720004 390152 947848 575297 570964 271000 582709
13724 582709 772269 438710 399910 260443 829784 600623 459516 535044 775667 653109
$$ packed form
13795F93666K54340j19614J15683k61069K50208D50441L88583k42197K04868l59241
13785D42454L68928D03278M56746r8775C19872L91753j31721M0616B16820M76195
13775F93015j50373Q4859j76798J26924M44383l17127J55001l29479j97j30093
13765D00115q2744K49724K23146k30482r2183O1812J19750k67741Q0638p9405
13755C82630M5333J12046k740k14090r049Q7695P1165K7282l3965J4968J31827
13744F13102j63801L10178l30222l4392D0342M71176k23956K59774A30652M45027
13734E75679k8872m4822K9431J88588l29852N57696l72551m333B71000L11709
13724E82709J89560l33559l8800j39467N69341k29161j41107P5528K40623j22558
$$ plain form
13714 653109 360390 535568 347448 404314 534982 362024 239970 334987 262074 577677
13704 577677 553113 327077 726039 482546 583289 400458 288717 643816 513918 536756
13694 536756 776681 281222 517559 665267 713253 306119 700269 564580 249981 413687
13684 413687 278930 134112 365489 594312 251637 679516 392770 167501 362698 362404
13674 362404 473031 580603 366390 302451 687130 625111 454368 519794 317552 315970
13664 315970 575403 894815 359622 370308 10460 593332 656726 604795 65284 381400
13654 381400 564788 424608 226523 331355 259005 630713 227545 356555 568811 752330
13644 752330 281830 439752 526527 198656 546831 214088 194307 94110 128584 231890
$$ packed form
13714F53109k92719J75178j88120N6866J30668j72958j22054R5017p2913L15603
13704E77677k4564k26036L98962k43493J00743j82831j11741L55099j29898K2838
13694E36756K39925B81222K36337J47708M7986C06119L94150j35689B49981J63706
13684D13687j34757A34112K31377K28823B51637M27879k86746A67501J95197k94
13674C62404J10627J07572k14213o3939L84679o2019j70743O5426k02242j582
13664C15970K59433L19412C59622J0686A0460N82872O3394n1931F5284L16116
13654C81400J83388j40180j98085J04832p2350L71708B27545J29010K12256J83519
13644G52330B81830J57922Q6775A98656L48175B14088j9781I4110L4474J03306
$$ plain form
13634 231890 630030 605457 144632 555412 381727 109086 558368 288640 616632 217695
13623 114418 598876 557701 229587 103962 383985 508700 -44636 130403 440826 541675
13613 541675 419142 382535 359862 464269 179918 305842 172498 440816 505151 328686
13603 328686 151716 554237 365527 349892 485368 144758 602510 131049 185258 379722
13593 379722 40405 464247 327951 536312 149422 297685 248330 244071 343401 522679
13583 522679 445642 246470 361854 405565 244857 139729 288553 640052 62050 475068
13573 475068 349516 476870 431670 125158 500481 158386 142982 586858 244452 477673
13563 477673 -53879 173575 593660 486984 352729 -59101 -58719 305324 346748 -141084 221137
$$ packed form
13634B31890L98140k4573A44632M10780j73685A09086M49282k69728L27992B17695
13623A14418M84458m1175B29587A03962K80023J24715d4636A30403L10423J00849
13613E41675j22533l6607k2673J04407A79918J25924j33344K68318O4335j76465
13603C28686A51716M02521j88710j5635J35476A44758M57752A31049N4209J94464
13593C79722D0405M23842j36296K08361A49422J48263m9355m259R9330J79278
13583E22679p7037j99172J15384M3711j60708j05128J48824L51499F2050M13018
13573D75068j25552J27354m5200A25158L75323A58386j5404M43876B44452K33221
13563D77673e3879A73575M20085j06676j34255e9101L82C05324M1424a41084B21137
$$ plain form
13551 90377 402652 -39802 290564 204237 231487 65044 -99401 79471 617851 90633 99354
13540 99354 289472 65870 -90552 361521 332876 57665 169035 327059 311185 -38158 419089
13528 -133266 40513 -1913 431974 251227 351332 239368 100269 245530 518461 141288
13517 324418 142533 514533 221038 20057 276043 217297 503394 9406 151773 269714
13507 269714 85403 266006 312360 247368 -28491 220847 178684 188889 477221 219929 41748
13495 292911 26415 198951 136312 -89795 281826 653812 302589 228810 265521 311861 -118865
13483 509174 87950 327168 236867 394308 69053 36570 356457 324534 564652 343726
13473 343726 262182 129077 124446 435972 -246207 121767 141787 54351 87101 134978 269655
$$ packed form
13551I0377L12275c9802B90564q6327K7250F5044i9401G9471N38380I0633Q721
13540I9354J90118F5870i0552C61521k8645E7665J11370J58024j5874c8158D19089
13528a33266D0513a913D31974j80747J00105j11964A00269J45261K72931A41288
13517C24418A42533L72000B21038B0057K55986n8746K86097I406J42367J17941
13507B69714H5403J80603M6354o4992b8491B20847m2163J0205K88332B19929D1748
13495B92911B6415J72536o2639h9795B81826L71986C02589p3779L6711M6340a18865
13483E09174H7950K39218r0301J57441F9053l2483L19887l1923K40118k20926
13473C43726q1544A29077m631L11526b46207A21767K0020E4351L2750M7877J34677
$$ plain form
13462 269655 119941 420201 303058 311242 258818 -75673 300381 299046 181102 134903 270702
13451 270702 54409 111053 88082 150443 -348638 372963 105085 195272 433837 339450 93943
13439 384170 102741 376589 130628 288653 354351 -122900 -45469 102634 316191 246408
13429 246408 89893 490032 64963 100738 139445 104874 81676 38882 184165 -7003 124070
13417 37605 74275 -93787 -31823 181192 -140419 199372 -69756 105359 257002 279945 33082
13405 13178 -37815 156352 416501 88482 507160 76159 337917 11463 247899 432663
13395 432663 -73061 189117 -74652 318683 -102309 344274 77484 508453 376179 -2960
13384 338865 313361 -26290 307972 26601 451828 310303 -90231 431175 51612 15864 160616
$$ packed form
13462B69655A19941L00260j17143Q184n2424g5673C00381j335j17944m6199J35799
13451B70702E4409N6644k2971O2361c48638C72963A05085R0187K38565r4387I3943
13439C84170A02741K73848A30628J58025O5698a22900d5469A02634K13557o9783
13429B46408H9893M00139F4963L5775L8707l4571k3198C8882J45283g003A24070
13417C7605L6670i3787c1823A81192a40419A99372f9756A05359J51643K2943C3082
13405A3178c7815A56352K60149H8482M18678G6159K61758A1463K36436J84764
13395D32663g3061A89117g4652C18683a02309C44274G7484M30969j32274b960
13384C38865k5504b6290C07972B6601M25227j41525i0231D31175E1612A5864J44752
$$ plain form
13373 160616 138858 76095 -97268 228070 70611 276420 -360472 276014 -101355 261335
13362 577188 178775 128254 -263050 428862 -19087 27737 189024 297909 -15643 253064
13351 133173 64985 157943 138378 -101310 532907 305741 364562 663092 186856 226909
13341 226909 -199190 -92815 155716 2288 -178773 50018 240708 -25316 177837 161448 210810
13330 210810 333563 265949 462135 258276 161498 144871 236453 223748 83644 306369 358001
13319 358001 172540 192973 174473 -86021 283197 -60785 -57523 -171591 304522 278992 260461
13308 260461 -68768 114756 285332 101562 385906 7632 296417 183185 65517 -36068
13297 267665 188762 -307032 139360 -130118 276736 382430 81206 337487 172249 14900
$$ packed form
13373A60616k1758o2763i7268B28070G0611K05809c60472B76014a01355B61335
13362E77188A78775n0521b63050D28862a9087B7737J61287J08885a5643B53064
13351A33173F4985R2958j9565a01310E32907k27166N8821K98530A86856M0053
13341B26909a99190i2815A55716B288a78773E0018J90690b5316A77837j6389M9362
13330B10810J22753o7614J96186k03859r6778j6627R1582j2705H3644K22725N1632
13319C58001A72540K0433j8500h6021B83197f0785L262j14068C04522k5530j8531
13308B60461f8768A14756J70576A01562K84344G632K88785j13232F5517c6068
13297B67665p8903c07032A39360a30118B76736J05694H1206K56281j65238A4900
$$ plain form
13286 172256 220447 125911 329361 245176 113184 374574 156175 -181343 353566 421567
13276 421567 -267966 138118 157258 117829 274947 -81627 -15694 125255 330644 -84805
13265 160137 -5518 322735 45577 177814 15799 -137202 141296 263939 -124559 44737
13254 180841 -137340 -470676 249666 -20449 326477 -83661 69745 496947 -179310 -39927
13243 318154 211822 35077 528240 66112 85750 274596 246761 274833 64583 -63605 224228
13231 102861 159641 55292 174977 -98617 326169 25227 35550 56508 -236994 -9712 70637
13219 396913 51195 94587 -14378 61911 118573 70764 93784 268158 258818 118808 452489
13208 452489 -232615 203220 8973 130625 7633 58712 73998 56300 309866 38374 -364445
$$ packed form
13286A72256M8191r4536K03450q4185A13184K61390A56175a81343C53566O8001
13276D21567b67966A38118J9140l9429J57118h1627a5694A25255K05389h4805
13265A60137e518C22735D5577J32237A5799a37202A41296J22643a24559D4737
13254A80841a37340l33336B49666b0449C26477h3661F9745M27202a79310c9927
13243C18154j06332C5077M93163F6112J9638J88846k7835K8072F4583f3605B24228
13231A02861N6780E5292J19685i8617C26169B5227J0323K0958b36994i712G0637
13219C96913E1195M3392a4378F1911N6662m7809K3020J74374r340A18808L33681
13208D52489b32615B03220H973J21652G633N1079J5286j7698K53566C8374c64445
$$ plain form
13196 -71417 -13205 -11691 -78153 268226 92297 234963 103693 503014 82815 -193870 387048
13184 -239750 106090 340154 -21342 -422766 136264 -125107 212338 -72579 -85113 -207687
13174 -207687 -217557 187950 -89073 -28293 165232 28977 72593 160542 138440 -86694 -47165
13163 -47165 180721 200303 1571 536980 226761 376608 128492 161294 46946 56382 -180029
13151 21659 26662 324555 -215967 -190607 343082 -3335 -93145 110059 388846 391680 -31096
13139 -163117 -14124 21881 -44280 12246 44172 51226 198838 -42101 -155383 -67548 109445
13127 -89888 -119359 284113 250231 -15917 306657 44620 64926 -152859 241531 -226736 359636
13115 101267 237716 72261 -113691 335772 -115600 -32505 -87390 -54690 -164272 137888
$$ packed form
13196g1417a3205J514o6462B68226I2297J42666A03693L99321H2815a93870C87048
13184b39750A06090K34064b1342m01424A36264a25107B12338g2579j2534j22574
13174b07687r870A87950h9073b8293A65232B8977M3616Q7949k2102h6694L9529
13163d7165A80721J9582A571N35409B26761J49847A28492L2802D6946R436a80029
13151B1659N003K97893b15967K5360C43082c335q9810A10059K78787K834c1096
13139a63117a4124B1881d4280A2246L1926P054J47612d2101j13282f7548A09445
13127h9888k9471B84113l3882a5917C06657D4620K0306a52859B41531b26736C59636
13115A01267J36449G2261a13691C35772a15600c2505n4885L2700j09582A37888
$$ plain form
13104 132099 42802 -38360 -66903 244911 255325 159198 -162593 236167 20924 120970 -108575
13092 53669 -11592 93858 114325 -170612 -8471 57226 -388558 277954 -141750 167501 20819
13080 -96186 97548 84575 -180739 75309 340683 65323 58302 6555 -48624 -137867 198306
13068 301400 89515 61262 253273 -58885 3254 41811 228466 76242 236512 85919 13501
13056 156962 -21591 -181674 156889 269594 167254 334312 83857 -223533 12990 93800
13046 93800 43077 197764 -61000 387499 -84401 -59632 -290941 536258 -207414 -257581 -63063
13034 164261 246679 93156 546717 -62710 96082 -95060 533402 146830 87036 181352 241716
13023 241716 162085 -20193 248815 38929 101454 -185356 165787 289377 -82994 -149176 310852
$$ packed form
13104A32099D2802c8360k8543B44911J0414r6127a62593B36167B0924J00046a08575
13092E3669a1592I3858K0467a70612h471E7226c88558B77954a41750A67501B0819
13080i6186I7548j2973a80739G5309K65374F5323p021F555d8624q9243A98306
13068C01400H9515k8253J92011e8885C254L8557J86655G6242J60270H5919A3501
13056A56962b1591j60083A56889J12705j02340J67058H3857b23533A2990Q0810
13046I3800D3077J54687f1000C87499h4401K4769k31309E36258b07414n0167f3063
13034A64261Q2418I3156M53561f2710I6082i5060E33402A46830n9794R4316O0364
13023B41716p9631b0193B48815C8929O2525a85356A65787J23590h2994o6182C10852
$$ plain form
13011 26053 37038 321039 71775 331904 119564 96986 -117843 29241 412448 372277 207251
13000 207251 153228 131809 -154256 18482 -161987 42548 44054 90863 133954 142072 -93488
12988 -105444 -95550 -52679 135113 -10865 206401 84709 126377 247345 224833 -349981 -115325
12976 -154053 -12509 56902 62145 -234092 132016 3293 42716 -97702 22795 72216 -190939
12964 414974 56632 -115912 -10590 265429 -318238 -161483 26172 -214558 -162904 -92283
12954 -92283 -4237 -23196 -347166 2076 -180510 -138780 54963 194372 -274894 -61530 86089
12942 156506 131335 -252689 -83521 48088 1588 -19355 74685 -8643 -225209 129295 -434755
12930 -356541 -44456 220285 -7261 -260424 -205810 137490 -56229 138214 -97882 73432 -32643
$$ packed form
13011B6053J0985K84001G1775K60129A19564k2578a17843B9241L83207m0171j65026
13000B07251n4023k1419a54256A8482a61987D2548J506M6809M3091Q118i3488
12988a05444R894M2871A35113a0865B06401H4709M1668J20968k2512c49981a15325
12976a54053a2509E6902N243b34092A32016C293L9423i7702B2795M9421a90939
12964D14974E6632a15912a0590B65429c18238J56755B6172b14558N1654P0621
12954i2283d237j8959l23970B076a80510M1730E4963J39409b74894f1530H6089
12942A56506k5171b52689h3521D8088A588a9355G4685h643k16566A29295d34755
12930c56541d4456B20285g261k53163N4614A37490e6229A38214i7882G3432c2643
$$ plain form
12918 -177625 -45824 174389 -190044 231344 85108 151267 -63299 -30534 24953 -36905 227996
12906 310415 374738 332847 285574 197528 -498345 -40094 130361 -134631 222664 229072 315651
12895 315651 -5558 200535 -75592 332264 185863 178208 41953 -229582 92979 4129 -105749
12883 -61815 233328 34734 -150891 -32491 260539 175392 241214 -228410 91984 7235 -355665
12871 74231 -59734 99606 75625 -111234 -16259 -183140 72961 128489 -115364 18974 -44785
12859 153833 -252811 273286 46606 67338 -147724 19581 147757 -52070 -77604 13549 105851
12848 105851 -162192 67415 -80741 34232 -60550 226816 30500 332536 -22715 -154867 170441
12836 221558 269131 -143202 -141757 121315 74029 263842 201127 -154615 91393 200776 125121
$$ packed form
12918a77625d5824A74389a90044B31344H5108O6159f3299c0534B4953c6905B27996
12906C10415O4323m1891m7273q8046d98345d0094A30361a34631B22664O408Q6579
12895C15651e558B00535g5592C32264j46401p655D1953b29582I2979D129a05749
12883f1815B33328C4734a50891c2491B60539q5147O5822b28410I1984G235c55665
12871G4231e9734I9606k3981a11234a6259j66881G2961N5528a15364A8974d4785
12859A53833b52811B73286D6606K0732a47724A9581J28176e2070k5534A3549R2302
12848A05851a62192F7415h0741C4232f0550B26816C0500L02036b2715j32152A70441
12836B21558M7573a43202J445A21315m7286J89813o2715a54615I1393J09383p5655
$$ plain form
12825 125121 -173182 -42783 -193559 438328 -22076 135650 186014 63321 92880 35264 -79378
12813 -100606 160573 -462079 69376 -281678 -302638 -231275 -102861 283153 -10226 244054
12802 329007 -293752 -316168 249287 158182 -117932 31348 -60083 204775 108385 -34640 277306
12790 202382 -186309 -65928 228944 136431 -119489 30026 341705 -69903 -24664 159321
12779 269898 -15698 -170702 -118966 38208 428555 -286608 -216582 -252060 143858 215951 65593
12767 -113434 -14732 113482 -267324 146567 355593 50630 165699 77229 -7911 39994 -54287
12755 20653 -191324 -150172 -174453 253305 -41662 218210 96704 299420 -49754 136000 -249559
12743 -206001 -344170 -112965 86176 -114367 405860 124474 -150831 332451 -101764 234911
$$ packed form
12825A25121a73182d2783j50776D38328b2076A35650N0364F3321K9559C5264g9378
12813a00606A60573d62079F9376b81678k0960P1363a02861B83153a0226B44054
12802C29007b93752k2416B49287r1105a17932C1348f0083B04775r6390c4640B77306
12790B02382a86309f5928B28944r2513a19489C0026L11679f9903b4664A59321
12779B69898a5698j55004N1736C8208L90347b86608P0026l5478A43858P2093F5593
12767a13434a4732A13482b67324A46567K09026E0630J15069G7229g911C9994e4287
12755B0653a91324M1152k4281B53305d1662B18210I6704K02716d9754A36000b49559
12743b06001j38169a12965H6176a14367D05860A24474a50831C32451a01764B34911
$$ plain form
12732 21010 563226 -27450 -1325 208947 120571 -116330 238780 -2482 -291493 -17396 431622
12720 141346 -3724 -139230 495281 -218698 200239 251048 -4515 205265 119772 27185 150965
12709 150965 102305 115895 51604 76950 41151 71101 -55695 296039 88013 149537 159246
12698 159246 26371 -262794 18580 530416 75616 -66757 302746 367379 143053 -8555 38673
12686 53675 145164 129946 -214209 -28054 97619 -60934 105588 300923 134633 183 71052
12675 71052 -127716 180809 196178 329599 -74414 -174667 97210 248867 -31819 264672
12664 74277 135252 331308 144664 169342 -57477 107308 -112899 -25919 12243 -22402 39454
12652 -50968 9237 138338 -376360 -29439 -24603 172320 354028 104731 -83176 -51250 91450
$$ packed form
12732B1010N42216b7450a325B08947q8376a16330B38780b482k89011a7396D31622
12720A41346c724j35506D95281b18698B00239N0809d515B05265q5493B7185J23780
12709A50965m8660J3590E1604K5346l5799K9950e5695B96039H8013O1524R709
12698A59246B6371b62794A8580N11836G5616f6757C02746O4633A43053h555C8673
12686E3675R1489j5218b14209b8054I7619f0934A05588J95335A34633A83P0869
12675G1052a27716A80809J5369J33421g4414j00253I7210J51657c1819B64672
12664G4277O0975J96056A44664K4678e7477A07308a12899b5919A2243b2402C9454
12652e0968I237J29101c76360b9439M836A72320J81708A04731h3176L1926I1450
$$ plain form
12640 36232 400235 -6847 284817 -73742 56633 41902 -24289 57328 -73431 235877 -10261
12628 -5871 193027 262171 180859 63703 95423 43489 140440 -326016 -128762 229973 136947
12617 136947 -133758 -199881 -118104 -209754 51113 -130556 -94548 -128438 16748 114432 -1888
12605 193069 18921 240769 24229 154844 -128879 101447 -209078 96700 38423 220638
12595 220638 99706 227802 257483 178708 89040 -19408 326650 217915 238634 -137243 -61679
12583 16231 -187910 -302767 -50806 -30744 -269281 108392 -116113 170143 -132970 137390
12572 491113 -28256 230062 77034 207221 191190 -142955 82065 1057 243953 -7893 -364631
12561 -364631 94393 -311854 -84869 -19897 183853 -133734 129986 226560 -204963 -563261
$$ packed form
12640C6232L64003f847B84817g3742E6633j4731b4289E7328g3431B35877a0261
12628e871A93027O9144q1312F3703L1720D3489R6951c26016a28762B29973r3026
12617A36947a33758o6123Q1777r1650E1113a30556L6008l3890A6748R7684a888
12605A93069A8921K21848B4229J30615a28879A01447b09078I6700C8423J82215
12595B20638I9706J28096K9681p8775H9040a9408C26650j08735K0719a37243f1679
12583A6231a87910j14857e0806K0062k38537A08392a16113A70143a32970A37390
12572D91113b8256B30062G7034J30187j6031a42955H2065A057K42896g893l56738
12561c64631I4393c11854h4869a9897A83853a33734A29986R6574b04963l58298
$$ plain form
12551 -563261 -23687 320986 136185 -160099 -76032 118759 -9812 295948 -165171 73114
12540 -126728 146167 -62098 18413 123016 1089 255976 112108 246838 -56645 97782 86893
12529 86893 -24004 265517 -164947 -66326 97392 84247 129603 65443 -28608 -4036 134957
12517 -43308 -93655 -91777 -257032 -5143 64713 -244710 169363 -59359 179816 -53861 -19782
12505 31866 -43808 18347 53606 56401 -171904 -67792 271017 454204 114807 128728 -110851
12493 88724 75848 -171246 -24884 -7140 -2929 127868 -84738 -16454 116086 17609 -225788
12481 -3046 -81183 115083 46088 -87514 -338017 148411 476913 95480 373966 -271070 17870
12469 -39159 135051 193609 63972 -82442 -75888 -149536 99821 265349 -59191 176119 360759
$$ packed form
12551e63261b3687C20986A36185a60099g6032A18759i812B95948a65171G3114
12540a26728A46167f2098A8413J04603A089K54887A12108J34730e6645I7782j0889
12529H6893b4004B65517a64947f6326I7392j3145M5356o4160b8608d036A34957
12517d3308n0347J878j65255e143F4713b44710A69363e9359A79816e3861a9782
12505C1866d3808A8347L5259K795a71904f7792B71017J83187A14807J3921a10851
12493H8724j2876a71246b4884g140b929A27868h4738a6454A16086A7609b25788
12481c046p8137A15083D6088h7514k50503A48411L28502I5480K78486b71070A7870
12469c9159A35051N8558F3972h2442O554p3648I9821J65528e9191A76119J84640
$$ plain form
12458 360759 -50533 155567 268431 15460 -82846 -13325 -201249 -37037 142996 -145772
12447 119372 233962 16771 131828 -101567 -44664 275185 -22934 -251786 -140512 -97303
12437 -97303 -111623 -206041 -27002 94968 115721 -248104 -31001 185216 286721 161938 -343490
12425 -114637 46849 -176396 -367883 383421 260715 -113192 154234 -220688 493687 -203271
12414 201185 -24375 -125703 82311 258626 419297 120292 -349104 188863 155586 -382557
12403 21552 131890 -296005 328068 -41368 -15402 -12434 -343923 -165529 171480 -54345 -181659
12392 -181659 22902 52030 -395404 -101191 100380 -117318 73846 -199550 -180975 373644
12381 302427 -170584 368476 90533 -3107 84442 254881 -54297 -278655 130238 -71544 207733
$$ packed form
12458C60759e0533A55567J12864A5460h2846a3325j87924c7037A42996a45772
12447A19372J14590A6771J15057a01567d4664B75185b2934k28852J11274M3209
12437i7303j4320r4418b7002I4968K0753b48104c1001A85216J01505j24783c43490
12425a14637D6849a76396j91487C83421j22706a13192A54234b20688D93687b03271
12414B01185b4375j01328H2311J76315J60671A20292c49104A88863l3277c82557
12403B1552J10338b96005C28068d1368a5402K968l31489a65529A71480e4345j27314
12392a81659B2902K9128c95404a01191A00380a17318G3846a99550J8575C73644
12381C02427a70584C68476I0533c107H4442J70439e4297k24358A30238g1544B07733
$$ plain form
12369 28949 478697 -527712 -87131 25818 -33046 28731 127516 271170 -151237 -232802 77008
12357 93251 -175954 -208383 -216018 321919 -416120 77908 71157 -29956 73840 60030 146224
12346 146224 20738 -11211 162581 -157148 -290624 54515 -134055 273950 42176 -426369
12335 -148053 9213 -59165 136043 67244 -112800 136646 -168190 -7953 -29132 72549 -175862
12323 112916 -202295 72115 -64503 -185586 -357144 282620 159671 -166887 -266360 -149835
12313 -149835 117067 1361 258364 -153677 -126606 -273610 -200768 -278956 -288313 34565 430219
12302 430219 157700 -169357 -74399 221330 -171132 118917 187358 67158 125862 234122
12292 234122 -99178 -62269 -232667 149071 87084 -173182 148997 91926 173474 -125669
$$ packed form
12369B8949M49748e27712h7131B5818c3046B8731R8785J43654a51237q1565G7008
12357I3251a75954l2429p635C21919d16120G7908o751b9956G3840j3810Q6194
12346A46224B0738a1211A62581a57148j33476E4515a34055B73950D2176d26369
12335a48053I213e9165A36043F7244a12800A36646a68190g953k1179G2549a75862
12323A12916b02295G2115f4503j21083j71558B82620j22949a66887r9473J16525
12313a49835A17067A361K57003a53677K7071j47004P2842p8188r357C4565L95654
12302D30219A57700a69357g4399B21330a71132A18917O8441F7158N8704J08260
12292B34122i9178L6909j70398A49071o1987a73182A48997n7071Q1548a25669
$$ plain form
12281 124635 52136 72962 92344 -14112 191830 165473 153541 -165224 -76647 261065 78168
12269 -118840 247544 4295 -128698 160903 171715 260481 -570777 -64657 200865 54590 144699
12258 144699 -228360 35086 -35701 61487 87064 7879 -207762 114800 18689 -59196 21855
12246 123818 -61813 -77303 128317 171751 -131904 70880 -321775 131595 -20877 85726 -334
12234 10553 -77522 105741 -32681 158129 14994 213406 229247 119016 -121292 192904
12223 123539 309823 191748 89103 157621 9893 252249 122258 364721 128384 -23875
12212 -116433 159864 128683 29498 -3688 297562 277981 40728 -184307 252435 348167 -47851
12200 423974 330106 313619 400801 354235 228744 395070 -26343 300619 45359 305783 20452
$$ packed form
12281A24635E2136K0826J9382a4112A91830k6357j1932a65224g6647B61065G8168
12269a18840B47544D295a28698A60903J0812Q8766e70777f4657B00865E4590R0109
12258A44699b28360C5086c5701F1487K5577G879b07762A14800A8689e9196B1855
12246A23818f1813j5490A28317M3434a31904G0880c21775A31595b0877H5726c34
12234A0553g7522A05741c2681A58129A4994J98412J5841j10231a21292A92904
12223A23539J86284j18075H9103O8518I893K42356A22258K42463A28384b3875
12212a16433A59864l1181B9498c688B97562j9581D0728a84307B52435R5732d7851
12200D23974r3868j6487Q7182m6566j25491J66326b6343C00619D5359K60424B0452
$$ plain form
12188 342431 37362 274912 269095 -68923 297780 130668 -20964 37342 25498 -239595 -283738
12177 -283738 164657 -317247 237474 -20723 -267555 392271 -129710 308444 298289 178236
12167 178236 -174346 62450 244029 135067 261294 -178593 76924 -61843 141104 25110
12156 171500 248489 45062 223119 -64570 -205654 243120 130386 54682 52 -23469 -161219
12145 -161219 -128902 302697 132933 231338 66946 -160709 339046 99770 -50957 3840 -23458
12133 161442 208911 158301 153189 126480 -101622 -479262 -63363 -181595 64883 224855 406833
12122 406833 170563 151276 140934 -148962 14869 93965 258436 73104 100660 -17414 70726
12110 152514 -111702 44613 71684 18920 -51896 -77823 106317 -104196 156016 -115749
$$ packed form
12188C42431C7362K37550n817f8923B97780A30668b0964C7342j1844b39595m4143
12177b83738A64657c17247B37474b0723k46832C92271a29710C08444j0155j20053
12167A78236a74346F2450J81579j08962J26227a78593G6924f1843A41104B5110
12156A71500P6989D5062J78057f4570j41084B43120j12734E4682E2b3469j37750
12145a61219L2317C02697A32933R8405F6946a60709C39046I9770e0957C840b3458
12133A61442M7469n0610n112k6709a01622l77640f3363j18232F4883J59972J81978
12122D06833A70563j9287j0342a48962A4869P9096J64471G3104K7556a7414G0726
12110A52514a11702D4613K7071A8920e1896k5927A06317a04196A56016a15749
$$ plain form
12099 -261735 -156074 -85304 -14468 -402719 -181121 116784 -173037 -241924 -37006 -150641
12089 -150641 44161 -94403 178536 114045 14598 -162374 -299671 -99372 150657 233457 155637
12078 155637 99037 183809 -58120 -39707 -105211 118000 1231838 1920366 838437 3402 -6541
12066 140021 -223901 195815 128875 33698 125295 -57805 -44027 -165946 239342 -208854
12055 245191 -233483 441719 95804 142110 -199454 -47636 222358 140113 -143816 -67511
12044 -21966 328259 369039 166533 -32726 -66357 -88755 -263682 -116341 -88115 -625446 -174832
12032 -57156 199689 -99630 -187969 51014 230619 356290 -77582 63867 20939 80438 137980
12021 137980 -13217 -91784 171318 324256 100536 249804 40385 -48248 -84737 -64964 -13770
$$ packed form
12099b61735J05661P0770a4468l88251a81121A16784a73037o8887c7006j13635
12089a50641D4161i4403A78536o4491A4598a62374j37297i9372A50657Q2800p7820
12078A55637n6600Q4772e8120J8413o5504A18000J113838O88528H38437C402f541
12066A40021b23901A95815o6940C3698R1597e7805J3778j21919B39342b08854
12055B45191b33483D41719I5804M6306a99454d7636B22358q2245a43816f7511
12044b1966C28259M0780A66533c2726l3631k2398j74927a16341K8226n37331a74832
12032e7156A99689i9630q8339E1014J79605J25671g7582F3867B0939N9499N7542
12021A37980a3217p8567A71318J52938A00536J49268D0385d8248l6489J9773a3770
$$ plain form
12009 26979 -90864 250248 97671 138422 -341262 103582 -20349 35591 -58458 201613 -71754
11997 -185567 10032 -98263 -59323 -109366 -63729 393694 235260 212080 -329662 -12566 39998
11985 -125435 -74871 184356 -84736 -94015 -160572 -38437 205085 89126 -154572 236052 -105545
11973 -27211 -36413 161477 -349019 -45568 -293278 279861 93041 33880 -119862 -337182 -121413
11961 303406 2870 -168661 -191295 23898 -116246 36485 -53682 -170164 -346375 -141696 203088
11949 -14268 -25706 -82204 -278861 469497 73266 -63468 114053 -128653 244488 -143394
11938 -131810 219441 -59071 -116295 46660 -13939 -85336 71265 -39353 -88857 -176962 89795
11926 -145145 -167493 288969 -164114 94176 62067 277092 -50386 -168504 150116 -323584
$$ packed form
12009B6979i0864B50248I7671M0751c41262A03582b0349C5591e8458B01613g1754
11997a85567A0032i8263L8940n0043M5637C93694j58434k3180c29662a2566C9998
11985a25435N0564A84356h4736r279o6557c8437B05085H9126a54572B36052a05545
11973b7211r202A61477c49019d5568k47710B79861I3041C3880a19862k17320a21413
11961C03406B870a68661k2634B3898a16246C6485e3682j16482j76211a41696B03088
11949a4268j1438n6498j96657D69497G3266f3468A14053a28653B44488a43394
11938a31810B19441e9071n7224D6660a3939p1397G1265c9353m9504q8105H9795
11926a45145k2348B88969a64114I4176l2109K15025e0386j18118A50116c23584
$$ plain form
11915 87927 -304248 -20555 -292315 -99912 -150958 87868 170002 1694 -360809 96338 -64535
11903 86803 -81006 -262337 90625 -84238 -395275 -221603 305837 58501 14281 -194616 -65935
11891 -63547 -18432 -151953 127154 34472 91097 104628 -137974 -230162 120692 -95592 146282
11879 -390566 62563 69325 -133956 122498 -241345 -43675 -99001 -157212 117004 -522 -117310
11868 -117310 69914 37711 121678 -228403 20604 -173375 -86813 -77377 -161179 -31802 88743
11856 -282946 1200 412571 -76874 -248444 -6107 -345592 -25042 -14011 -14523 -135596 262470
11844 -93312 -113149 -36455 92359 -60205 99142 -91181 -343581 -38933 14496 -120537 -100624
11833 -100624 -106056 -338528 -231927 -124020 161612 -22533 -298848 -355698 145621 -71372
$$ packed form
11915H7927c04248b0555k71760i9912n1046H7868Q2134A694c60809I6338f4535
11903H6803h1006j81331I0625h4238l11037J73672C05837E8501A4281a94616f5935
11891f3547a8432j33521A27154C4472N6625J3531a37974r2188A20692i5592A46282
11879c90566F2563O762a33956A22498b41345d3675n5326n8211A17004e22j16788
11868a17310F9914l2203Q3967b28403B0604a73375Q6562R436q3802c1802H8743
11856b82946A200M11371g6874j71570f107l39485b5042J1031n12j21073B62470
11844i3312j9837c6455I2359f0205I9142i1181k52400c8933A4496a20537J9913
11833a00624n432k32472J06601J07907A61612b2533k76315n6850A45621g1372
$$ plain form
11822 -34409 -78692 84278 -52631 38763 -93842 168342 -210559 -65125 -3089 -271397 -32573
11810 -135557 -130505 96891 -33789 196929 -165005 189402 -233421 133507 91513 441054
11800 441054 -238775 -56607 -89889 143753 -124006 -90820 70264 93817 144472 -72837 290803
11788 -246206 -258795 -62334 2004 -383973 -47825 -359373 155320 25815 162802 -229675 182714
11776 238796 -269146 12912 42733 -152681 -30810 -13213 55048 -51150 139995 341738 -248053
11764 -151861 126826 144639 -313193 97800 -24388 -192424 43604 64890 -12040 -63871 155242
11752 219632 -396652 24371 52693 -357844 -294886 -88217 -158722 238245 -62844 107295 -174377
11740 66239 -221633 19750 -51766 193747 -101234 -37384 295257 57093 -43133 -184442 -2054
$$ packed form
11822c4409m4283H4278e2631C8763i3842A68342b10559f5125c089k68308c2573
11810a35557N052I6891c3789A96929a65005A89402b33421A33507m1994L49541
11800D41054b38775e6607l3282A43753a24006L3186G0264K3553N0655g2837B90803
11788b46206j2589f2334B004c83973d7825l11548A55320B5815J36987b29675A82714
11776B38796b69146A2912K9821a52681c0810a3213E5048e1150A39995K01743b48053
11764a51861A26826J7813c13193I7800b4388j68036D3604K1286a2040n1831A55242
11752B19632c96652B4371K8322c57844O2958h8217p0505B38245f2844A07295a74377
11740F6239b21633A9750e1766A93747a01234c7384B95257E7093d3133j41309b054
$$ plain form
11728 -128003 -305574 -319172 219458 339657 20469 -8379 191575 -125320 106565 -32281
11717 -450456 78654 98270 158835 -26120 -150003 6635 467665 -14024 73398 291833 -184395
11705 -143038 30250 -46002 245662 -218437 -162978 107820 30220 -92480 -167339 117045 -151040
11693 -112887 47741 128927 -49821 -55665 208792 2040 -273283 156340 -125396 -239892 83902
11681 26672 -95876 92634 159835 -92848 276713 -75124 368960 448516 -133374 -44303 117146
11669 167977 317881 98726 -85328 -61103 2289 149331 123498 -106181 76727 -171387 -222109
11658 -222109 233514 -211705 236730 44884 -44370 -202539 -88765 346532 -181321 -55759
11647 -36526 330205 221185 10349 21339 -370545 -14295 269863 115584 343992 116269
$$ packed form
11728a28003j77571j3598B19458J20199B0469h379A91575a25320A06565c2281
11717d50456G8654J9616O0565b6120j23883F635M61030a4024G3398K18435a84395
11705a43038C0250d6002B45662b18437N5459A07820C0220i2480p4859A17045a51040
11693a12887D7741Q1186d9821n844B08792B040b73283A56340a25396j14496H3902
11681B6672i5876I2634O7201i2848B76713g5124C68960P9556a33374d4303A17146
11669A67977J49904I8726h5328K4225B289J47042k5833a06181G6727a71387n0722
11658b22109B33514b11705B36730D4884d4370j58169h8765C46532a81321e5759
11647c6526C30205j09020A0349J0990c70545a4295B69863A15584K28408A16269
$$ plain form
11636 113197 191455 21395 -148109 96157 -246934 -10371 347706 29002 113474 -19467 18116
11624 41254 40552 21675 181372 -283550 -81156 156477 -94440 82543 188650 16767 -42564
11612 73290 60966 35221 -105943 23853 -107304 469216 86422 -276042 11969 142135 70227
11600 36403 -52812 -52606 -61264 69250 99875 -195630 -54256 -157138 62142 123486 113326 -34387
11587 -58072 -207363 93901 82512 139893 -56751 216307 28 -311855 80111 -379992 132678
11575 -40644 -179061 115726 94055 250805 55457 259201 -18125 -294239 159818 24216
11564 450996 91032 165374 -116908 -112095 145008 219015 -391549 -46354 127463 -26727 217530
11552 211114 -8 20631 -102498 -65330 114028 -64933 -151852 52026 22984 -56400 130289 83255
$$ packed form
11636A13197P8258B1395a48109I6157b46934a0371C47706B9002Q4472a9467A8116
11624D1254p02j8877J59697b83550h1156A56477i4440H2543J06107A6767d2564
11612G3290j2324k5745a05943B3853a07304D69216H6422b76042A1969J30166G0227
11600C6403e2812K06q658F9250L0625a95630e4256j02882F2142O1344j0160c4387
11587e8072j49291I3901j1389N7381e6751B16307B8c11855H0111c79992A32678
11575d0644j38417A15726k1671J56750E5457K03744a8125k76114A59818B4216
11564D50996I1032P4342a16908M813A45008P4007c91549d6354A27463b6727B17530
11552B11114hB0631a02498L7168A14028f4933q6919E2026B2984e6400A30289m7034
$$ plain form
11540 83255 120619 119591 -26837 107292 152869 -63016 354994 134121 125357 253803 259807
11529 259807 -246366 76222 10152 -16113 187132 75319 78887 -63689 41494 -164849 68918
11517 208246 -101628 265204 151992 493386 245849 -103238 11695 18694 219601 537228
11507 537228 195240 155432 -78663 209183 -197934 314058 -195010 180025 224698 87984
11496 -41241 -52821 175968 -78481 394797 -73463 102661 79335 131106 172781 372712 -214384
11484 -35262 292913 -36145 482961 307839 362517 238966 220297 -125559 -83607 363217
11473 303432 248232 -30585 -9360 -116453 213906 37100 281367 107661 -133453 -1237 252200
11461 -37925 91602 -63637 -213932 -50160 79778 301455 561934 246146 216577 93227 -37991
$$ packed form
11540H3255L7364j028b6837A07292M5577f3016C54994A34121q764J28446O004
11529B59807b46366G6222A0152a6113A87132G5319L568f3689D1494a64849F8918
11517B08246a01628B65204j13212L41394B45849a03238A1695O999K00907L17627
11507E37228A95240l9808g8663B09183a97934C14058a95010A80025M4673H7984
11496d1241j1580A75968g8481C94797g3463A02661k3326N1771M1675J99931b14384
11484c5262B92913c6145D82961j75122N4678j23551j8669a25559M1952C63217
11473C03432n5200c0585i360j07093B13906C7100K44267A07661a33453a237B52200
11461c7925I1602f3637j50295e0160G9778K21677K60479B46146k9569I3227c7991
$$ plain form
11449 -165874 -165552 -121845 -77824 288735 482344 147193 -260913 231865 220172 -108415 -569137
11438 -569137 32795 101249 182810 -116261 95544 34363 178364 224165 103905 -18213 -170302
11427 -170302 277445 -321411 150636 94756 1050 -98181 -178136 40010 -63108 280384 519325
11416 519325 145340 181601 -136800 -235963 -60716 29934 28663 -126757 162111 -382452 150953
11404 330105 125102 44390 -270703 -137200 -75872 31447 -232305 -435736 -72444 -204213
11394 -204213 -23875 85655 -13394 -116949 -21582 -111156 -174533 -162650 40743 -156790 -3517
11382 252547 -269498 -433852 12801 131454 102183 12323 -90508 68194 314093 -74059 120999
11370 -228991 128707 289392 184406 54605 -58556 -189457 62383 -266499 93741 205054
$$ packed form
11449a65874L22M3707M4021B88735J93609A47193b60913B31865j1693a08415m60722
11438e69137C2795O8454Q1561a16261I5544C4363J44001M5801A03905a8213j52089
11427a70302B77445c21411A50636n5880A050i8181p9955D0010f3108B80384K38941
11416E19325A45340L6261a36800r9163f0716B9934j271a26757A62111c82452A50953
11404C30105A25102D4390b70703J33503O1328C1447b32305k03431g2444j31769
11394b04213b3875H5655a3394j03555b1582q9574o3377J1883D0743a56790c517
11382B52547b69498j64354A2801J18653k9271A2323i0508F8194K45899g4059A20999
11370b28991A28707J60685j04986E4605e8556j30901F2383b66499I3741J11313
$$ plain form
11360 205054 -270244 -164755 -281843 -65755 264758 -71792 171111 26374 -27106 106252
11349 -133530 -184197 293069 -11309 -221525 209254 -57084 124379 107297 -501401 -129316
11338 -102029 67619 -20651 86178 -54946 35659 354485 -113849 329031 82014 -23229 32632
11326 47285 -122655 81978 -73344 -121146 97058 172672 -3566 -58289 150521 74670 -227577
11314 49781 -110697 -80023 -143888 35102 -234111 62992 -280973 -201392 56055 -327518 -19367
11302 -406078 -242253 -184542 146492 -101781 -61064 68475 60045 -379461 -261414 244547
11291 262007 -121904 -64282 -177949 -398212 -377154 -4557 45108 -111941 3946 -124754 65904
11279 -185815 -47445 -19415 -394173 -66937 201194 -59527 -177104 -284707 411943 231011
$$ packed form
11360B05054b70244J05489j17088f5755B64758g1792A71111B6374b7106A06252
11349a33530n0667B93069a1309k10216B09254e7084A24379j7082e01401a29316
11338a02029F7619b0651H6178e4946C5659L18826a13849C29031H2014b3229C2632
11326D7285a22655H1978g3344m7802I7058P5614c566n4723A50521G4670b27577
11314D9781a10697L0674o3865C5102b34111F2992b80973P9581E6055c27518a9367
11302d06078J63825N7711A46492a01781M0717F8475q430c79461J18047B44547
11291B62007a21904N7622j13667k20263K1058d557D5108a11941C946a24754F5904
11279a85815d7445a9415l74758f6937B01194e9527j17577j07603D11943j80932
$$ plain form
11269 231011 260661 -326643 132020 -64383 37122 -86709 -79418 -3902 -29684 107012 -39479
11257 -63643 175059 -13091 -47266 -156983 24104 19745 -501995 -273378 -175299 64356 -36362
11245 -165322 -278812 -145236 4050 -122158 28503 -187537 406759 -147454 21438 239344
11235 239344 143127 67564 258202 -35953 310303 60479 136902 91957 98623 -454252 177231
11223 29201 -113591 -100217 466121 65055 -8209 -202736 -219063 157080 104686 238179 -206495
11211 88173 -135261 56749 180579 369845 265646 138663 32234 112783 -29961 -32002 -171837
11200 -171837 -69311 94397 243314 -104869 392483 -161580 -438837 -66303 -78699 -183987
11190 -183987 -206804 505632 -265639 -16739 -41598 -59793 -31831 55214 5055 -194454 39158
$$ packed form
11269B31011K9650c26643A32020f4383C7122h6709P291c902k5782A07012c9479
11257f3643A75059a3091l4175j09717B4104m359e01995K28617R8079F4356c6362
11245a65322j13490J33576D050a22158B8503a87537D06759a47454B1438K17906
11235B39344r6217F7564J90638c5953C10303F0479P6423m4945O666d54252A77231
11223B9201a13591J3374D66121F5055h209j94527j6327A57080n2394J33493b06495
11211H8173a35261E6749J23830J89266j04199j26983C2234Q0549b9961k041j39835
11200a71837f9311I4397J48917a04869C92483a61580k77257f6303j2396j05288
11190a83987k2817E05632b65639a6739k4859j8195K7962E5214E055a94454C9158
$$ plain form
11178 -89003 -391460 -156772 -217552 167766 -8955 -298021 263283 -103597 126031 -70903
11167 135413 -127260 542652 -141055 -58932 244869 -30639 -167773 -57491 -147378 -236932
11157 -236932 -15093 58204 95300 421648 -289163 -103535 63326 276187 -187708 249554
11146 -194963 31007 -125285 -3044 -136537 31021 -234573 -189852 89820 -66401 -61050 -21540
11134 118681 78477 -299354 -184055 171496 39934 -18525 -84873 -6370 -28776 86379 116765
11123 116765 -47544 55612 2295 -191012 198496 -332208 208985 290068 -85279 -99882 296704
11111 181094 292677 402490 296923 313 -82622 82937 162315 -66717 363643 153501 118939
11100 118939 267174 9436 1386 155028 144420 167872 -45743 160734 445609 220274 32463
$$ packed form
11178h9003l02457a56772o0780A67766h955k89066B63283a03597A26031g0903
11167A35413a27260E42652a41055e8932B44869c0639j37134e7491q9887q9554
11157b36932a5093E8204L7096L26348b89163a03535F3326K12861a87708B49554
11146a94963C1007a25285c044j33493C1021b34573M4721H9820f6401N351b1540
11134A18681m0204b99354J15299A71496C9934a8525o6348f370k2406H6379L0386
11123A16765d7544E5612B295a91012A98496c32208B08985Q1083h5279j4603B96704
11111A81094J11583J09813j05567C13h2622H2937P9378f6717C63643A53501l4562
11100A18939J48235I436A386J53642j0608K3452d5743A60734K84875B20274C2463
$$ plain form
11088 302545 410929 -60568 -161527 -106337 361532 97770 345574 88284 348278 318544
11078 318544 176918 54911 -107739 -125542 533703 194047 165977 257742 241170 243947 430494
11067 430494 449000 355585 -51875 391190 234050 652694 486878 737432 628906 396506
11057 396506 797156 407874 323245 488318 756238 476381 471295 688553 345768 711872
11047 711872 605046 743017 211042 531559 901629 712656 462384 695678 823085 627739
11037 627739 321753 444443 632042 294308 808971 895781 507817 533663 656069 582032
11027 582032 381659 630785 330518 488305 460310 513663 425648 734726 538085 754863
11017 754863 505831 368570 643483 735784 556646 410089 237771 833387 -72560 507182
$$ packed form
11088C02545J08384f0568j00959N5190C61532I7770K47804H8284K59994k9734
11078C18544j41626E4911a07739j7803E33703A94047k8070R1765j6572K777J86547
11067D30494J8506r3415e1875C91190j57140M18644j65816K50554j08526k32400
11057C96506M00650l89282q4629J65073K67920k79857n086K17258l42785L66104
11047G11872j06826J37971B11042L20517L70070j88973k50272K33294J27407j95346
11037F27739l05986J22690J87599B94308N14663Q6810l87964K5846J22406p4037
11027E82032k00373K49126l00267J57787k7995N3353q8015L09078j96641K16778
11017G54863k49032j37261K74913R2301j79138j46557j72318N95616g2560E07182
$$ plain form
11006 468668 1034530 377130 465894 260000 445027 736374 462728 627167 697256 662377
10996 662377 557207 702006 681720 807018 343738 480506 430298 542543 719556 500241
10986 500241 672550 642688 1094047 875747 861699 1025024 1219318 1036978 1106464 1860876
10976 1860876 1355897 1835752 2197593 2160745 2320717 2545047 2419235 2578567 2135891 2077224
10966 2077224 2073782 1658900 1695429 1247584 1180158 1653373 1370519 1573332 1431888 1572640
10956 1572640 1471570 1818451 1201400 1133262 1092925 561838 553569 536760 430876 493463
10946 493463 231301 445348 502087 62939 92251 345480 -75961 353580 -194618 358450
10935 82986 258827 45030 278162 -240315 312605 -109788 563130 -81415 60759 182318
$$ packed form
11006D68668N65862C77130Q8764k05894J85027K91347k73646J64439P0089l4879
10996F62377j05170J44799k0286J25298C43738J36768n0208J12245J77013k19315
10986E00241J72309k9862M51359k18300j4048J63325J94294j82340O9486P54412
10976A860876n04979M79855L61841l6848J59972K24330j25812J59332m42676n8667
10966B077224l442m14882L6529m47845o7426M73215k82854K02813j41444J40752
10956A572640j01070L46881o17051o8138m0337n31087q269j6809j05884O2587
10946D93463B31301K14047N6739F2939K9312K53229g5961C53580a94618C58450
10935H2986J75841D5030K33132b40315C12605a09788E63130h1415F0759J21559
$$ plain form
10925 182318 210745 -113632 118486 61415 36714 62612 -49565 -3191 -189305 -146051 240323
10913 -176888 -267378 96047 -325854 -425399 131678 273801 -112609 -125 17322 -39808 37065
10901 -171440 -285794 -52551 317620 -33069 118245 -112718 153085 -182236 327 159375
10891 159375 -98778 45645 -185282 -12444 -51852 174129 -78603 90796 -135544 55284 45787
10880 45787 284642 224740 70851 32062 -110878 -70208 180226 150076 116866 16820 -172319
10868 13044 -65048 -59978 140509 -95061 112555 -121745 -109290 -177333 -366215 -129410 -68533
10857 -68533 -914 -46596 59270 -392403 -296701 164412 42636 -124765 -311702 -47637 57180
10845 141346 -110691 62125 -45924 -182300 89392 -73171 286692 73367 -41045 97175 42031
$$ packed form
10925A82318K8427a13632A18486n7071k4701K5898d9565c191j86114M3254B40323
10913a76888r0490I6047c25854r9545A31678J42123a12609a25A7322c9808C7065
10901a71440j14354e2551C17620c3069A18245a12718A53085a82236C27J59048
10891A59375i8778D5645a85282a2444l9408A74129g8603I0796a35544E5284r497
10880D5787K38855n9902G0851C2062a10878M0670A80226l0150l3210A6820a72319
10868A3044f5048N070A40509i5061A12555a21745J2455o8043j88882a29410O0877
10857f8533i14m5682E9270c92403R5702A64412D2636a24765j86937d7637E7180
10845A41346a10691F2125d5924j36376H9392g3171B86692G3367d1045I7175D2031
$$ plain form
10833 -500 128473 16796 -204333 -229848 127693 2573 204848 209577 81411 -201356 -95952
10821 48947 9791 -49583 -203418 -163225 111335 -171462 74352 128637 -57953 -363923 -148613
10809 -57138 2843 205691 -106460 -352461 -282388 195884 -416764 -326035 280108 82746 43524
10798 43524 179785 -240435 108148 -179196 -301024 -178708 101149 90988 -218228 -167561
10788 -167561 -115373 -64352 -276703 -62740 -320134 102303 -4951 -260417 171843 67909 96725
10777 96725 117547 -147206 -330749 32237 -109143 71617 -323177 -75835 -107507 35113 -140746
10765 -77280 379 32698 60664 229036 384149 -240593 -34786 -150064 -161768 201344 164981
10754 164981 -77949 14903 118954 -140146 45226 -247734 302274 146128 -140947 -127345
$$ packed form
10833e00A28473A6796b04333k5515A27693B573K02275M729H1411b01356i5952
10821D8947I791d9583j53835M0193A11335a71462G4352N4285e7953l05970a48613
10809e7138B843K02848a06460k46001P0073A95884d16764R0729B80108H2746l9222
10798D3524J36261b40435A08148a79196j21828J22316A01149j0161b18228N0667
10788a67561N2188N1021k12351f2740k57394A02303d951k55466A71843F7909K8816
10777I6725K0822a47206j83543C2237a09143G1617c23177g5835l1672C5113a40746
10765g7280C79L2319K7966J68372J55113b40593c4786j15278j1704B01344l6363
10754A64981g7949A4903J04051a40146D5226b47734C02274A46128a40947J3602
$$ plain form
10744 -127345 -279232 27847 221800 -53884 76667 434050 -152974 -158498 -81627 110306 -441580
10732 95387 -179820 525135 163864 14359 -103745 252124 -111098 151654 301534 -273605
10721 -543367 -93321 225663 241726 41811 -214294 138733 -60459 121135 -6624 -121115 32092
10709 21464 50008 152038 -216623 113021 87349 -27186 121979 -339300 132313 -273181
10698 -151312 85150 -286636 -64095 -69246 -93131 -229304 -354072 -181849 -306638 -170939
10688 -170939 -143665 -184012 -157104 268406 -76067 125654 224657 -463153 -303207 -163692
10678 -163692 4326 30027 -10980 -124380 20258 -98448 -70087 78510 142837 -268400 35006
10666 -256151 364884 16416 -310052 179724 -286751 -114304 -58155 89105 -16116 -142602
$$ packed form
10744a27345j51887B7847J93953e3884G6667L57383a52974n524P6871A10306d41580
10732I5387a79820E25135A63864A4359a03745B52124a11098A51654J49880b73605
10721e43367i3321B25663J6063D1811b14294A38733f0459A21135f624j14491C2092
10709B1464K8544J02030b16623A13021k5672b7186A21979c39300A32313b73181
10698a51312H5150b86636f4095n151k3885j36173j24768J72223j24789J35699
10688a70939K7274m0347K6908B68406g6067A25654R9003d63153J59946J39515
10678a63692D326K5701a0980j13400B0258i8448K8361G8510O4327b68400C5006
10666b56151C64884A6416c10052A79724b86751a14304N6149H9105a6116j26486
$$ plain form
10656 -142602 -286632 10871 3516 -210929 19211 -169248 -225000 295597 18206 -89244 201402
10644 -163884 132320 -160249 -211312 128858 6792 -2875 97490 234406 -117750 -56683 -48158
10633 -48158 -63013 354177 136420 254237 -21462 -216112 -82885 -49010 -138692 117360 -326324
10621 -209619 53448 54859 -417971 -77285 40142 -450270 40551 200760 -347206 -30796 -9771
10609 47535 -23242 162559 52885 -81374 267675 -202740 -193887 132704 260383 511181 -139411
10597 -237489 165493 189957 -88155 -339857 126833 -168201 110922 45994 -344095 -299165
10587 -299165 220567 -28436 -202794 149157 279087 -170667 -7443 -93358 -48974 -72972 -187945
10576 -187945 94805 -134507 -88112 237468 -84843 73767 -226361 52897 -173815 -4214 6571
$$ packed form
10656a42602j44030A0871C516b10929A9211a69248n5752B95597A8206h9244B01402
10644a63884A32320a60249n1063A28858F792b875I7490J36916a17750e6683Q525
10633d8158j4855C54177A36420J17817b1462j94650h2885L3875q9682A17360c26324
10621b09619E3448J411d17971g7285D0142d50270D0551J60209c47206c0796i771
10609D7535b3242A62559E2885h1374B67675b02740Q853A32704J27679K50798a39411
10597b37489A65493K4464h8155k51702A26833a68201A10922D5994c44095M4930
10587b99165B20567b8436j74358A49157J29930a70667g443q5915M4384k3998j14973
10576a87945I4805a34507M6395B37468h4843G3767b26361E2897a73815d214F571
$$ plain form
10564 -281310 229440 -199827 320959 125739 -145956 -88787 -150018 57151 -301362 82191
10553 -235613 112287 -123128 38153 278960 -16479 74933 61538 -323231 201121 -388022
10542 -118408 402894 -324082 -167371 -32231 66015 -62309 -333567 53282 -191441 -21624
10531 -120051 90822 -416185 -81985 247802 -399806 -50064 98193 -65755 -93831 185951 394964
10520 394964 222366 -142071 -181885 176996 -111168 -55736 -46267 -130019 -128648 54508 75211
10509 75211 136649 -70073 -412397 -132408 -171980 190973 111725 70969 214974 88844 32295
10497 14216 -261217 62381 -111031 -171628 -117526 -7786 270591 -317215 -110166 -193941 166510
10485 -339629 83103 197044 -72420 129853 523685 511408 260299 420482 231746 294582
$$ packed form
10564b81310B29440a99827C20959A25739a45956N7169o1231E7151c01362H2191
10553b35613A12287a23128C8153K40807a6479G4933j3395c23231B01121c88022
10542a18408D02894c24082J56711c2231F6015f2309k71258E3282a91441b1624
10531a20051I0822d16185h1985B47802c99806e0064I8193f5755k8076A85951K09013
10520C94964j72598a42071l9814A76996a11168N5432R469q3752J371E4508K0703
10509G5211O1438g0073l42324a32408l9572A90973p9248m0756J44005H8844C2295
10497A4216b61217F2381a11031o0597N4102g786B70591c17215a10166q3775A66510
10485c39629H3103J13941g2420A29853L93832j2277k51109J60183j88736O2836
$$ plain form
10475 294582 298233 163435 -174206 -201260 -101070 -147597 14654 29329 141050 -53362 -156225
10464 -156225 -213017 77754 -100060 297004 98683 -129196 17869 -72090 -180696 -64751 -130017
10453 -130017 -149744 -246754 352505 -110796 49230 6499 82918 -58862 -267946 -23172 -211673
10442 -211673 -209366 102535 -181113 -299740 66098 287538 234336 26974 -256727 -31319 -16850
10431 -16850 -15234 230826 -18722 79477 -141221 146721 -167315 -247525 -179609 49576 111181
10420 111181 222986 170093 -52291 -120918 -63271 -105718 -192018 -39549 -481318 109265 -23095
10408 -243706 208818 -254810 138842 -477983 -61734 -138346 144442 77176 79759 29148 -240693
10396 178457 153521 91910 45747 235858 202972 4668 235351 -10902 658697 -275799 65981
$$ packed form
10475B94582L651j34798a74206k7054J00190m6527A4654J4675J11721e3362j02863
10464a56225n6792G7754a00060B97004I8683a29196A7869g2090j08606f4751o5266
10453a30017j9727r7010C52505a10796D9230F499P6419e8862k09084b3172j88501
10442b11673K307A02535a81113j18627F6098K21440n3202B6974b56727c1319J4469
10431a6850J616B30826a8722G9477a41221A46721a67315q0210O7916D9576O1605
10420A11181J11805n2893e2291o8627N7647m2447q6300c9549m41769A09265b3095
10408b43706B08818b54810A38842d77983f1734p6612A44442o7266K583B9148b40693
10396A78457k4936o1611D5747J90111l2886D668K30683a0902F58697b75799F5981
$$ plain form
10384 -353133 51161 16271 318082 -438176 199120 217289 368393 165004 307996 178357
10374 178357 1161 634601 166967 113782 11158 244429 225469 230272 274661 262577 448643
10363 448643 570424 259457 276746 73266 239636 107990 584862 39872 99560 177764
10353 177764 411858 78960 335285 677032 214462 152041 333330 168707 348591 246919
10343 246919 -94629 177734 -937 85616 190849 53658 622564 175615 70748 -78322 119600
10331 218216 147619 63805 -94251 127822 -32366 91796 229959 -247075 459408 197419
10320 207633 -144479 -13127 188673 191671 -40249 28994 137579 -69839 93318 -95909 -53292
10309 -53292 377984 -57919 63159 225711 -37893 105451 1667 5370 369982 9577 -192734
$$ packed form
10384c53133E1161A6271L01811d38176A99120J8169J51104A65004J42992j29639
10374A78357A161O33440A66967n3185A1158K33271j8960M803M4389j2084J86066
10363D48643J21781B59457J7289G3266J66370A07990M76872C9872N9688P8204
10353A77764K34094G8960K56325L41747B14462o2421J81289j64623J79884j01672
10343B46919i4629A77734i37H5616J05233E3658N68906A75615G0748g8322A19600
10331B18216p0597F3805i4251A27822c2366I1796J38163b47075D59408A97419
10320B07633a44479a3127A88673K998d0249B8994J08585f9839I3318i5909M2617
10309e3292C77984e7919F3159J62552c7893A05451A667L703L64612I577a92734
$$ plain form
10297 230431 -276593 -9584 47974 -199490 95304 105771 -197547 92603 -44684 -134597 -59218
10285 -112624 32640 25771 -312924 -93242 -44557 -227878 -107956 -502585 -41819 -12280 -5327
10273 -184501 -45534 25091 119620 -90177 205072 53804 -165120 69474 -12311 -12904 -26270
10262 -26270 215174 443879 95485 -266462 473177 -151381 283233 364043 267430 125104
10251 -172398 122381 113319 -249701 297615 -88085 -178780 -149018 -280912 -48802 97898 -76671
10239 -83996 -357168 265209 224569 -28394 -164501 196525 -237099 -82183 -151107 -37201 -146979
10228 -146979 215552 21947 -192207 196083 -176285 15267 50656 -8562 -130023 -16142 53745
10216 8608 -155713 -243387 -293286 53508 -158141 -103290 227191 57083 -192049 254555 1446
$$ packed form
10297B30431b76593i584D7974a99490I5304J0467a97547I2603d4684q9913e9218
10285a12624C2640o869c12924i3242d4557j83321a07956l94629d1819a2280e327
10273a84501d5534B5091R4529i0177B05072E3804a65120F9474a2311n93j3366
10262b6270B15174K28705I5485b66462D73177a51381B83233Q0810r6613A25104
10251a72398A22381r062b49701B97615h8085r0695K9762j31894d8802I7898g6671
10239h3996k73172B65209m0640b8394j36107A96525b37099h2183o8924c7201j09778
10228a46979B15552B1947a92207A96083a76285A5267L5389h562j21461a6142E3745
10216H608a55713q7674m9899E3508a58141N4851B27191E7083a92049B54555A446
$$ plain form
10204 -428977 101588 216098 -142191 -210980 88011 -60556 -102156 -55762 -35004 218732 -219766
10192 -530275 -199268 41540 192913 79516 152312 236484 -226648 -178914 -155823 73911 119036
10181 119036 -296323 -92379 -328857 200061 -199328 181393 -83433 -123775 203826 -146330
10170 -304714 -607233 -164065 -102621 -120158 115564 -107074 -29460 -23835 -309147 285194
10159 -137412 23592 -164685 -179819 -188469 -248446 87618 -174535 57976 -135735 -112231 -166316
10148 -166316 -26206 -183086 -69949 235838 -211892 -359314 -71229 -218540 156425 -54986
10137 -304925 36244 -118832 -29142 152460 144390 -32232 94362 -130869 -233160 234437 6154
10125 -154221 28040 78086 -306671 -373021 -271065 74828 -128476 -99938 -252132 243520
$$ packed form
10204d28977A01588J14510a42191o8789H8011f0556m1600M6394K0758B18732b19766
10192e30275a99268D1540J51373G9516P2796Q4172b26648M7734K3091G3911M5125
10181A19036b96323i2379k36478B00061a99328A81393h3433m0342B03826a46330
10170c04714l02519a64065O1444j7537A15564a07074b9460N625k85312B85194
10159a37412B3592a64685j5134q650n9977H7618a74535E7976a35735K3504n4085
10148a66316b6206j56880f9949B35838b11892j47422g1229j47311A56425e4986
10137c04925C6244a18832b9142A52460q070c2232I4362a30869j02291B34437F154
10125a54221B8040N0046c06671o6350J01956G4828a28476K8538j52194B43520
$$ plain form
10114 -22923 -323265 98417 -79938 97679 -124263 -5777 78224 55313 -140195 -183048 94687
10102 202497 -273079 -163067 145471 202724 -169121 -131697 67440 -146253 165297 88621
10092 88621 -506127 -55153 -157654 -203006 186051 -11178 65407 -439392 -399089 327842 -31453
10080 -124119 60917 -11875 144881 -66193 -9626 125939 71135 -305655 -52794 -70158 -356882
10069 -356882 -184683 -94664 94827 108363 -370430 -232641 76828 30450 25943 -40501 -199339
10058 -199339 29349 -147626 190288 -51423 -105044 36784 -119610 74511 102464 -72055 30533
10046 -142123 -15635 51316 -107265 -30610 -170464 -98060 -337761 -184576 -30962 -132684
10036 -132684 -43871 -203865 -340151 -425556 55467 -148510 -281129 -53255 -258555 68710
$$ packed form
10114b2923l00342I8417g9938I7679a24263e777G8224k2911a40195m2853I4687
10102B02497b73079J10012A45471N7253a69121L7424F7440a46253A65297p6676
10092H8621e06127e5153j02501m5352A86051a1178F5407d39392M0303C27842c1453
10080a24119F0917a1875A44881f6193i626A25939n4804c05655e2794j7364k86724
10069c56882J72199R0019I4827J3536c70430J37789G6828C0450m507d0501j58838
10058a99339B9349a47626A90288e1423n3621C6784a19610G4511K7953g2055C0533
10046a42123a5635E1316a07265c0610j39854P2404k39701J53185c0962j01722
10036a32684d3871j59994j36286q5405E5467a48510j32619e3255k05300F8710
$$ plain form
10025 200867 198536 -427711 113241 -37648 279501 190776 -212754 108348 -210969 8020 70169
10014 70169 -234886 -175927 10170 -173004 23935 214595 -269707 138277 -6896 -358581 -92767
10002 -29455 -93468 238397 45401 105238 -56322 6544 72054 153034 -56180 64415 -12522 50459
9989 -253304 224539 55840 -260569 157818 -277238 -224374 -171991 -246383 -359956 26961 -116335
9977 -158464 269371 84618 -270651 204925 -252182 115485 -306621 -4146 -318960 44387
9966 -71382 -54735 -468114 158750 -175927 -193556 -255051 -136996 133557 208867 -159661 -354378
9955 -354378 -202441 -171845 -87343 -57897 158711 -174130 -93840 191321 -99672 -241724 133794
9943 -31158 -151643 -78766 -372439 -451684 154384 -120744 126742 -327033 -83708 219767
$$ packed form
10025B00867k331d27711A13241c7648B79501q8725b12754A08348b10969H020O2149
10014G0169b34886N8959A0170a73004B3935J90660b69707A38277f896l51685i2767
10002b9455o4013B38397D5401N9837e6322F544O5510Q0980e6180F4415a2522E0459
9989b53304B24539E5840b60569A57818b77238N2864N2383p4392j13573B6961a16335
9977a58464B69371H4618b70651B04925b52182A15485c06621d146l14814D4387
9966g1382J6647m13379A58750a75927j7629o1495J18055A33557P5310a59661j94717
9955c54378J51937L0596Q4502K9446A58711a74130Q0290A91321i9672j42052A33794
9943c1158j20485P2877k93673p9245A54384a20744A26742c27033h3708B19767
$$ plain form
9932 -26734 79045 92419 -289700 -299244 -86332 25939 -288373 -255317 23095 28718 -41155 -36274
9920 -36274 -5832 -32407 -215077 -121618 268130 -77194 -518471 -220829 -96820 301703 -353843
9908 -13363 145338 -29889 108745 -247982 -383567 -25757 -127284 71844 47275 -103524 -134887
9897 -134887 -303711 -204699 119250 34403 -10983 -146251 -1687 -355110 182802 -84037 126770
9885 -197770 199638 -468307 -80503 357980 -124643 -141915 184345 -378773 -266 -28011 -14876
9874 -14876 127653 -86994 -37562 112412 -72781 -346515 -124384 101663 -129938 15883 -257457
9862 43125 -25578 -131670 -239442 -145857 -488491 -117657 -257105 -367659 -142758 -119322
9852 -119322 -42713 -137813 139607 199078 -87372 157981 -144263 -146873 -36204 -22357 -42213
$$ packed form
9932b6734G9045J3374b89700r544h6332B5939b88373L3056B3095N623d1155M881
9920c6274e832k6575j82670R3459B68130g7194m41277b20829i6820C01703c53843
9908a3363A45338b9889A08745b47982j35585b5757j01527G1844k4569a03524l1363
9897a34887j68824R9012A19250C4403a0983j35268a687l53423A82802h4037A26770
9885a97770A99638d68307h0503C57980a24643j7272A84345c78773b66k7745J3135
9874a4876A27653h6994c7562A12412g2781k73734a24384A01663a29938A5883b57457
9862D3125b5578j06092j07772R3585l42634a17657j39448j10554a42758K3436
9852a19322d2713r5100A39607N9471h7372A57981a44263k610c6204J3847j9856
$$ plain form
9841 -42213 -39456 -39662 -50892 41432 121202 16566 161619 -17598 -49459 -45940 -174508 258345
9828 -115903 -251211 67221 -119208 -162901 -48818 -53401 -66707 -292416 -32482 -231807 -88798
9816 71264 36383 -22806 -61548 -21480 164032 -370008 -2979 404897 -179429 -287027 -27483
9804 -131314 -172283 -169460 -371574 -58483 -248140 -114847 207527 222 -169003 -446625 -337136
9793 -337136 29503 181612 -63799 -77718 -33210 150928 -356508 -170070 -2475 -283701 32588
9781 42793 58124 80343 266905 740 227709 -66894 160040 -63447 56177 -289396 96886
9769 -90499 -34373 -16748 111752 -221300 -114932 97396 229425 -218040 -61181 -9717 -55304
9758 -55304 164157 -164586 60163 -63270 -302183 -172882 46662 -334295 -104562 1429 74066
$$ packed form
9841d2213K757k06j1230D1432P9770A6566J45053a7598l1861L519j28568B58345
9828a15903j35308F7221a19208m3693d8818m583j3306k25709c2482j99325h8798
9816G1264l4881b2806l8742b1480A64032c70008b979D04897a79429j07598b7483
9804a31314m0969K823k02114e8483j89657a14847B07527B22a69003k77622J09489
9793c37136B9503J52109f3799j3919c3210A50928c56508a70070b475k81226C2588
9781D2793J5331K2219J86562G40K26969f6894A60040f3447E6177b89396I6886
9769i0499c4373a6748A11752b21300J06368I7396J32029b18040f1181i717m5587
9758e5304A64157a64586F0163f3270k38913J29301D6662c34295a04562A429P2637
$$ plain form
9747 74066 -333637 -123301 125677 -249071 154023 91623 -231451 148977 -47263 118526
9736 -259480 -193114 -203310 -73612 -215864 -236886 -6026 -201239 -303454 -246387 -105572 166748
9724 49042 -17876 -133576 -77686 65912 -62565 -30145 102411 -266606 -313355 -99197 -642418
9713 -642418 -39587 132324 -16697 -82630 192259 -21998 -12479 47619 -25306 -90435 -10660
9701 -143684 195624 59300 -149593 -364807 -215778 14782 -178829 -233186 20914 -19458 337949
9689 -333672 -164734 172950 -76925 15809 -63497 74056 12069 127028 -45201 -375915 5389
9677 -24502 120759 -51167 106321 -260504 154357 -180115 -262092 169436 -272106 -16909
9666 31946 -115036 154722 -18175 -233690 279546 -248282 83552 -90163 -237524 -135803
$$ packed form
9747G4066c33637a23301A25677b49071A54023o2400b31451A48977d7263A18526
9736b59480O6366j0196g3612j42252k1022f026j95213j02215N7067a05572A66748
9724D9042a7876j15700N5890F5912f2565c0145A02411b66606m6749i9197n43221
9713f42418c9587A32324a6697o5933A92259b1998R519D7619b5306o5129a0660
9701a43684A95624E9300a49593k15214J49029A4782a78829n4357B0914a9458C37949
9689c33672a64734A72950g6925A5809f3497G4056A2069J14959d5201l30714E389
9677b4502A20759e1167A06321b60504A54357a80115q1977A69436b72106a6909
9666C1946a15036A54722a8175k15515B79546b48282H3552i0163j47361J01721
$$ plain form
9656 -135803 128541 -67007 249529 -258306 196402 -79871 -99611 -61078 24779 -249902 8563
9644 -123691 85499 -114333 67409 -343579 -71638 -222908 -58342 53819 -314159 -50293 131575
9632 84519 -56096 7158 238317 -58394 138750 61626 -28386 22451 21480 -18698 -454020 -189153
9619 109307 -315410 -181430 492 311284 -1436 -280614 -110725 -28357 -236897 -21741 237321
9607 56167 11944 164030 64668 -88527 -472988 119734 -103393 -8235 -70018 331101 20185
9595 -10609 -6524 135147 -113810 241 108787 -3732 -157932 -66043 -144864 -33477 55924 68835
9583 68835 106460 -24461 -107555 9549 -336910 -350082 -241606 -258357 183397 -117193 -227355
9572 -227355 -80815 -125964 34562 18300 -52332 -268805 -153440 103394 -87608 -9815 -83468
$$ packed form
9656a35803A28541f7007B49529b58306A96402g9871j9740L8533B4779b49902H563
9644a23691H5499a14333F7409c43579g1638j51270e8342E3819c14159e0293A31575
9632H4519e6096G158K31159e8394A38750F1626b8386B2451r71a8698m35322a89153
9619A09307c15410J33980D92L10792a436k79178a10725b8357k08540b1741B37321
9607E6167A1944J52086F4668h8527l84461A19734a03393h235o1783C31101B0185
9595a0609M085A35147a13810B41J08546c732j54200f6043p8821c3477E5924J2911
9583F8835L7625b4461q3094I549c36910j3172J08476j6751A83397a17193j10162
9572b27355h0815m5149C4562j6262e2332k16473J15365A03394h7608i815p3653
$$ plain form
9561 -83468 -36272 -133553 -16938 153592 -585516 -291457 261820 95498 -177996 465510 274766
9550 274766 195301 -331998 30925 -209217 22226 167920 94 -85082 15066 -36550 134904
9538 -120685 -137673 -281896 -206066 106701 -151973 -94237 25040 -12344 216635 -52399 -177483
9527 -177483 -28810 40366 -115938 -94443 -109607 -428014 116972 191687 -79258 54156 -236448
9515 -22307 -361034 -240247 -209261 199217 60538 -365865 183835 -119109 22019 31298 -17725
9503 45383 -63243 -80196 -160762 -240857 126096 14312 105969 -183265 -205691 -377375 -230586
9492 -230586 128797 188902 131301 -62841 -47290 -157783 -15634 -17402 21391 -246610 45463
9480 -55752 -286406 -401388 -326034 -395229 13447 65400 50287 87094 137629 -149374 -20090
$$ packed form
9561h3468c6272r7281a6938A53592e85516b91457B61820I5498a77996D65510j90744
9550B74766p9465c31998C0925b09217B2226J45694I4h5082A5066c6550A34904
9538a20685j6988j44223P5830A06701a51973N7736B5040a2344B16635e2399j25084
9527a77483b8810D0366a15938K1495j5164l18407A16972P4715g9258E4156b36448
9515b2307l38727J20787L0986A99217F0538c65865A83835a19109B2019R279a7725
9503D5383f3243j6953q0566q0095A26096A4312R1657a83265k2426j71684J46789
9492b30586A28797O0105n7601f2841J5551j10493a5634j768B1391b46610D5463
9480e5752k30654j14982P5354o9195A3447N1953j5113L6807N0535a49374b0090
$$ plain form
9468 -64570 -163095 -280873 -131907 -114449 -77889 -26520 113719 -33670 -95314 -125827 125258
9456 351 66608 -101803 -388577 89275 185354 -642334 -31795 -38723 -96230 -104502 -265481 -390416
9444 -390416 -130403 42943 -120869 -300444 -333756 -4443 -318553 11330 -65353 -76887 -249492
9433 -249492 225635 -166237 166348 -136558 -108212 5157 -395538 -288105 168268 -215805
9422 -140385 -3455 295099 315309 -155964 22595 12403 -165140 -235252 146104 -323666 -8664
9410 -201755 -284503 -177303 -351819 89872 -47473 -6516 40945 -291020 -8260 -70090 157452
9398 -121784 -65991 52840 -343912 3284 235418 -276428 133421 4559 614 145194 -130134
9386 -125743 -11539 21820 -24798 -183412 -221971 -179490 -205878 -177258 52557 -330288 -360347
$$ packed form
9468f4570r8525j17778a31907J7458L6560b6520A13719c3670o1644l0513A25258
9456C51O6257a01803k86774H9275R6079f42334c1795o928n7507q272j60979j24935
9444c90416a30403D2943a20869j79575l3312d443l14110A1330f5353j1534j72605
9433b49492B25635a66237A66348a36558K8346E157c95538J07433A68268b15805
9422a40385c455B95099K0210a55964B2595j0192a65140p0112A46104c23666h664
9410b01755q2748J07200j74516H9872d7473f516D0945b91020h260o1830A57452
9398a21784N5793E2840c43912C284K32134b76428A33421D559F14J44580a30134
9386a25743a1539B1820b4798j58614l8559M2481k6388K8620E2557c30288l0059
$$ plain form
9375 -360347 -156507 -56847 -400911 -507072 -358918 -14311 -68497 -109360 106943 329432
9365 329432 128057 -59848 220397 -23736 51981 15901 -41611 -11093 -85734 -158775 -20507
9353 -191228 -155554 152763 6879 -164758 -79002 -64190 -32943 -10868 -118250 -23227 216954
9341 -135835 23264 30435 48038 -311884 -255189 27967 609541 -323016 -212038 -214008 -60934
9329 -45495 -170806 -221128 -364542 52719 326834 -81912 -154957 131820 34793 48841 66515
9318 66515 106049 112881 195375 -157402 -34164 8570 -161327 -40055 -331325 109158 -173214
9306 157192 -44450 -118818 38735 -121003 -60215 225499 -45957 -387067 -280014 -25649 155943
9294 -165371 20270 -296189 -64487 -155152 123466 -484347 -133173 -51880 -125889 -245853 -231820
$$ packed form
9375c60347a56507e6847l44064j06161J48154a4311n4186m0863A06943K22489
9365C29432A28057e9848B20397b3736E1981A5901d1611a1093p4641p3041b0507
9353a91228L5674A52763F879a64758g9002J4812L1247a0868j07382b3227B16954
9341a35835B3264P171J7603c11884N6695B7967N81574c23016J10978j970f0934
9329d5495j25311n0322j43414E2719K74115h1912p3045A31820C4793J4048J7674
9318F6515L9534O832Q2494a57402c4164H570a61327d0055k91270A09158a73214
9306A57192d4450p4368C8735a21003f0215B25499d5957l41110J07053b5649A55943
9294a65371B0270b96189f4487r0665A23466d84347a33173e1880p4009j19964J4033
$$ plain form
9283 -231820 -195711 -26158 -62375 213817 -37972 11859 110926 -424692 94384 12642 -108824
9271 -293682 -134040 -149761 -113041 -189302 393782 152438 -19051 -176404 -314796 -124434
9260 -36775 -171536 -274368 100283 70787 -12594 46876 -4437 -195387 24351 20258 52831
9249 52831 122391 -94956 -188154 -212423 -53300 13875 74554 -161921 -237553 -82029 14315 -29670
9236 -151092 -330164 -166889 -209966 183145 227172 190167 -379964 -187631 -299107 339043
9225 71835 171181 -7029 -108052 -58515 -210723 178490 156655 -179794 72108 -35805 83128
9213 -292314 -124962 109809 -182891 61850 -179304 106719 -302700 -153429 -295050 108801
9202 76136 -88739 -254317 -48929 396855 -110923 -177820 -77138 -274179 69141 323595 -531321
$$ packed form
9283b31820L6109b6158l6217B13817c7972A1859R9067d24692I4384A2642a08824
9271b93682a34040j5721L6720p6261C93782A52438a9051j57353j38392a24434
9260c6775j34761j02832A00283k9496a2594D6876d437j90950B4351m093L2573
9249E2831O9560i4956r3198k4269e3300A3875O0679a61921p5632h2029A4315b9670
9236a51092j79072J63275m3077A83145M4027l7005c79964a87631j11476C39043
9225G1835R9346g029j01023M9537j52208A78490k1835a79794G2108c5805H3128
9213b92314a24962A09809a82891F1850a79304A06719c02700J49271j41621A08801
9202G6136h8739j65578d8929C96855a10923o6897g7138j97041F9141K54454e31321
$$ plain form
9190 40912 -46321 -10048 124002 -177815 299447 42389 -49229 -71771 -46214 -229991 -221928
9179 -221928 38314 -5455 -101007 -147304 -86006 -85970 153559 -468341 261329 -152475 -50923 -26639
9167 -26639 22462 169123 -45128 -49438 24616 1713 -92442 2531 -322176 -256845 28182 54676
9155 54676 -238976 -240611 6456 111164 -347860 99550 -265021 18432 -286914 237611 16070
9143 87844 -197897 -80753 50149 -145967 38483 331235 129407 -422 -20106 -177759 -16154
9131 183506 72293 -244685 314421 -174065 40664 -170414 31017 250968 -277550 -8888 -306873
9120 -306873 -62188 194227 -234548 141283 -63920 -277847 -278596 -260944 -152755 -89897 -89959 449057
9107 -216403 -68743 -54290 -343144 13794 -148006 -54727 110354 -39025 43764 14417 -365517
$$ packed form
9190D0912d6321a0048A24002a77815B99447D2389d9229k2542K5557j83777Q063
9179b21928C8314e455r5552m6297O1298L6A53559d68341B61329a52475e0923K4284
9167b6639B2462J46661d5128m310B4616A713i2442B531c22176O5331B8182K6494
9155E4676b38976j635F456J04708c47860I9550b65021A8432b86914B37611A6070
9143H7844a97897h0753E0149a45967C8483K92752A29407d22j9684j57653a6154
9131A83506G2293b44685C14421a74065D0664a70414C1017K19951b77550h888k97985
9120c06873f2188A94227b34548A41283f3920k13927p49J7652J08189O2858o2D49057
9107b16403f8743J4453k88854A3794a48006e4727A10354c9025D3764A4417c65517
$$ plain form
9095 211297 -82277 314895 -19540 75875 -102811 -92240 46655 -52646 143695 -259081 -386272
9084 -386272 -81031 -299431 -327769 89548 202701 41300 -82234 190891 59870 -3612 -88537
9073 -88537 238097 77554 -303693 181556 171864 -54047 -319646 -356156 54585 -434858 -16522
9061 117788 -93025 -23159 -177402 192990 211970 -82723 335804 50890 58837 -136982 119123
9049 -221376 -292294 223651 -357455 -259545 -207727 -427369 -129358 -89906 -154155 -313973 131546
9037 131675 42455 -260563 179961 232201 -46309 113061 -193525 -153282 175029 -48975 196514
9025 125800 -31275 -29227 -359834 66725 -417906 -160171 207886 -150119 -105223 -344030 -86569
9013 -117630 -58716 -238805 -172912 238498 -101853 145073 -35125 -48583 -207968 -251337 -171295
$$ packed form
9095B11297h2277C14895a9540G5875a02811J0571D6655e2646A43695b59081j27191
9084c86272h1031k18400k8338H9548J13153D1300h2234A90891E9870c612q4925
9073h8537B38097G7554c03693A81556r692e4047k65599l6510E4585d34858a6522
9061A17788i3025b3159j54243A92990J8980h2723C35804E0890P947a36982A19123
9049b21376p0918B23651c57455R7910N1818k19642a29358L9452o4249j59818A31546
9037A31675D2455b60563A79961N2240d6309A13061a93525M0243A75029d8975A96514
9025A25800c1275K048l30607F6725d17906a60171B07886a50119M4896k38807h6569
9013a17630e8716j80089O5893B38498a01853A45073c5125j3458j59385m3369Q0042
$$ plain form
9002 -171295 -124776 -267471 -445320 -432483 -292787 -33414 -95018 -157136 191540 126954 -192357
8990 139506 -48685 -77160 43592 132307 -243096 29016 -253233 1868 -474 -110700 -50801 -317707
8978 -317707 63970 -11585 -102524 133742 -70941 70827 -187625 156553 -28342 -437021 -342970
8967 -342970 -145017 -229790 207492 -26154 47024 39990 99244 -31309 -125314 -47834 -102497
8956 -102497 -294692 -420080 -185335 -56093 -232542 102241 -139051 53743 -68770 -295131
8946 -295131 -116635 -221770 120348 21618 125347 -9549 -4771 391972 279478 -181776 -41082
8934 260415 89854 28305 -209276 -34749 -72481 33468 18450 61927 426533 214242 810711
8923 810711 2539894 7524997 10140307 2540052 1096633 149342 88912 -12158 -69410
$$ packed form
9002a71295M6519j42695j77849J2837J39696c3414o1604o2118A91540o4586a92357
8990A39506d8685k8475D3592Q8715b43096B9016b53233A868d74j10226e0801k66906
8978c17707F3970a1585r0939A33742g0941G0827a87625A56553b8342m08679R4051
8967c42970a45017q4773B07492b6154D7024p034N9254c1309r4005d7834n4663
8956a02497j92195j25388a85335e6093j76449A02241a39051E3743f8770k26361
8946b95131a16635j05135A20348B1618J03729i549d771C91972j12494a81776d1082
8934B60415H9854B8305b09276c4749l7732C3468j5018M3477L64606k12291N96469
8923H10711J729183M985103K615310B540052A096633A49342o0430a2158n7252
$$ plain form
8914 -69410 157460 -138324 -216708 9974 -164689 244301 490301 423615 375152 175815 342772
8903 342772 228080 343250 4805 -161418 132763 -4632 137258 -1660 -235605 -286393 -80342
8891 390290 -110132 -89866 117807 -210399 -349832 154009 181129 -491092 -167432 -350330
8881 -350330 64893 -94748 -224205 -42453 83716 -350702 6320 -260338 -235057 -208462 -381877
8870 -381877 -113389 -86362 -48915 30266 25565 -28575 -81041 11441 -119586 -98857 239975
8858 26963 223021 -161488 68265 94730 -189148 213510 303906 -48036 -163701 88673 115654
$$ packed form
8914f9410A57460a38324p8384I974a64689B44301K46000o6686m8463A75815J66957
8903C42772j14692J15170D805a61418A32763d632A37258a660k33945n0788h0342
8891C90290a10132K0266A17807b10399j39433A54009K7120d91092a67432j82898
8881c50330F4893i4748j29457d2453H3716c50702F320b60338K5281K6595j73415
8870c81877a13389K7027L7447C0266m701b8575n2466A1441a19586K0729B39975
8858B6963J96058a61488F8265K6465a89148B13510R0396d8036j15665H8673K6981
$$ [...]
##END NTUPLES=NMR SPECTRUM
##END=
