
##TITLE=UV1209_M4_1332-1205_7185688_4Yl3yh2TNZ
##JCAMPDX= 6.0         $$ Bruker NMR JCAMP-DX V2.0
##DATA TYPE= NMR SPECTRUM
##DATA CLASS= NTUPLES
##ORIGIN= BRUKER
##OWNER= Administrator
$$ 1.72 TOPSPIN		Version 2.1
$$ 2012-12-06 03:13:27.132 -0500  Administrator@X
$$ Compression mode = diff/dup
##.OBSERVE FREQUENCY= 400.02188249412
##.OBSERVE NUCLEUS= ^1H
##.ACQUISITION MODE= SIMULTANEOUS (DQD)
##.ACQUISITION SCHEME= undefined
##.AVERAGES= 64
##.DIGITISER RES= 22
##SPECTROMETER/DATA SYSTEM= spect
##.PULSE SEQUENCE= noesygpps1d.comp
##.SOLVENT NAME= COFFEE_meoh
##.SHIFT REFERENCE= INTERNAL, COFFEE_meoh, 1, 14.96091
##AUDIT TRAIL= $$ (NUMBER, WHEN, WHO, WHERE, PROCESS, VERSION, WHAT)
$$ ##TITLE= Audit trail, TOPSPIN		Version 2.1
$$ ##JCAMPDX= 5.01
$$ ##ORIGIN= Bruker BioSpin GmbH
$$ ##OWNER= Administrator
$$ $$ E:\/data/COFFEE/nmr/UV1209_M4_1332-1205_7185688_4Yl3yh2TNZ/12/pdata/1/auditp.txt
$$ ##AUDIT TRAIL=  $$ (NUMBER, WHEN, WHO, WHERE, PROCESS, VERSION, WHAT)
(   1,<2012-12-06 03:13:21.225 -0500>,<Administrator>,<X>,<go>,<TOPSPIN 2.1>,
      <created by zg
	started at 2012-12-06 03:01:50.569 -0500,
	POWCHK enabled, PULCHK disabled,
       configuration hash MD5:
       86 BA 57 50 F2 9D 5C 9B 26 00 A9 28 5F 66 2E 89
       data hash MD5: 64K
       E8 09 56 9E 53 8D B1 2A 0A 05 FD 05 E9 09 59 F8>)
(   2,<2012-12-06 03:13:24.350 -0500>,<Administrator>,<X>,<proc1d>,<TOPSPIN 2.1>,
      <Start of raw data processing
       efp LB = 0.3 FT_mod = 6 PKNL = 1 PHC0 = 0 PHC1 = 0 SI = 128K 
       data hash MD5: 128K
       DA CA 48 52 7E 94 E5 DA A6 97 C2 BA D7 96 B1 AB>)
(   3,<2012-12-06 03:13:25.413 -0500>,<Administrator>,<X>,<proc1d>,<TOPSPIN 2.1>,
      <pk PHC0 = -76.85486 PHC1 = 0 
       data hash MD5: 128K
       98 9A EA BD EF 4D 3E 6A 0E 23 D1 B6 AB EE D1 8E>)
(   4,<2012-12-06 03:13:26.116 -0500>,<Administrator>,<X>,<proc1d>,<TOPSPIN 2.1>,
      <abs ABSG = 1 
       data hash MD5: 128K
       C8 FF 5F F6 83 F4 4D 4A 1B 40 DD 66 43 4A 69 B3>)
(   5,<2012-12-06 03:13:26.303 -0500>,<Administrator>,<X>,<proc1d>,<TOPSPIN 2.1>,
      <abs ABSG = 2 
       data hash MD5: 128K
       ED 33 B3 EF FB B2 B7 1D A0 CE 0E 5B 3B 19 3E 91>)
(   6,<2012-12-06 03:13:26.475 -0500>,<Administrator>,<X>,<proc1d>,<TOPSPIN 2.1>,
      <abs ABSG = 3 
       data hash MD5: 128K
       32 99 4C 13 AC 78 14 19 50 32 E9 60 DE 73 13 A3>)
(   7,<2012-12-06 03:13:26.647 -0500>,<Administrator>,<X>,<proc1d>,<TOPSPIN 2.1>,
      <abs ABSG = 4 
       data hash MD5: 128K
       64 9F 26 7E E2 DD 5E D3 CF 09 29 8E 38 09 9A 83>)
(   8,<2012-12-06 03:13:26.819 -0500>,<Administrator>,<X>,<proc1d>,<TOPSPIN 2.1>,
      <abs ABSG = 5 
       data hash MD5: 128K
       68 02 F2 5A 64 09 E8 AB A5 F5 B6 CE F4 A9 C5 1D>)
$$ ##END=
$$ 
$$ $$ hash MD5
$$ $$ D3 75 C6 6B D5 17 C5 73 4C 27 74 E0 16 4A 48 54
##$RELAX= 
##$RELAX= 
##$RELAX= 
##$RELAX= 
##$RELAX= 
##$RELAX= 
##$RELAX= 
##$RELAX= 
$$ Bruker specific parameters
$$ --------------------------
##$DU= <E:\>
##$EXPNO= 12
$$ [...]
##$TP07= 0
##$TPNAME0= <>
##$TPNAME1= <>
##$TPNAME2= <>
##$TPNAME3= <>
##$TPNAME4= <>
##$TPNAME5= <>
##$TPNAME6= <>
##$TPNAME7= <>
##$TPOAL= (0..7)
0.5 0.5 0.5 0.5 0.5 0.5 0.5 0.5
##$TPOFFS= (0..7)
0 0 0 0 0 0 0 0
##$TUNHIN= 0
##$TUNHOUT= 0
##$TUNXOUT= 0
##$USERA1= <user>
##$USERA2= <user>
##$USERA3= <user>
##$USERA4= <user>
##$USERA5= <user>
##$V9= 5
##$VALIST= <valist>
##$VCLIST= <CCCCCCCCCCCCCCC>
##$VD= 0
##$VDLIST= <DDDDDDDDDDDDDDD>
##$VPLIST= <PPPPPPPPPPPPPPP>
##$VTLIST= <TTTTTTTTTTTTTTT>
##$WBST= 1024
##$WBSW= 4
##$XGAIN= (0..3)
0 0 0 0
##$XL= 0
##$YL= 0
##$YMAX_a= 5919257
##$YMIN_a= -11707995
##$ZGOPTNS= <>
##$ZL1= 120
##$ZL2= 120
##$ZL3= 120
##$ZL4= 120
##$ABSF1= 14.96091
##$ABSF2= -5.597272
##$ABSG= 5
##$ABSL= 3
##$ALPHA= 0
##$AQORDER= 0
##$ASSFAC= 0
##$ASSFACI= 0
##$ASSFACX= 0
##$ASSWID= 0
##$AUNMP= <proc_prof1d_extract.lims>
##$AXLEFT= 0
##$AXNAME= <>
##$AXNUC= <1H>
##$AXRIGHT= 0
##$AXTYPE= 0
##$AXUNIT= <>
##$AZFE= 0.1
##$AZFW= 0.1
##$BCFW= 0
##$BC_mod= 0
##$BYTORDP= 0
##$COROFFS= 0
##$CY= 15
##$DATMOD= 1
##$DC= 0
##$DFILT= <>
##$DTYPP= 0
##$F1P= 0
##$F2P= 0
##$FCOR= 0.5
##$FTSIZE= 131072
##$FT_mod= 6
##$GAMMA= 0
##$GB= 0
##$INTBC= 1
##$INTSCL= 1
##$ISEN= 128
##$LB= 0.3
##$LEV0= 0
##$LPBIN= 0
##$MAXI= 10000
##$MC2= 0
##$MEAN= 0
##$ME_mod= 0
##$MI= 0
##$NCOEF= 0
##$NC_proc= -2
##$NLEV= 6
##$NOISF1= 0
##$NOISF2= 0
##$NSP= 0
##$NTH_PI= 0
##$NZP= 0
##$OFFSET= 14.96091
##$PC= 1
##$PHC0= -76.85486
##$PHC1= 0
##$PH_mod= 1
##$PKNL= yes
##$PPARMOD= 0
##$PPDIAG= 0
##$PPIPTYP= 0
##$PPMPNUM= 2147483647
##$PPRESOL= 1
##$PSCAL= 4
##$PSIGN= 0
##$PYNMP= <proc.py>
##$REVERSE= no
##$SF= 400.020009673007
##$SI= 131072
##$SIGF1= 0
##$SIGF2= 0
##$SINO= 400
##$SIOLD= 131072
##$SPECTYP= <>
##$SREGLST= <1H.CDCl3>
##$SSB= 0
##$STSI= 131072
##$STSR= 0
##$SW_p= 8223.68421052631
##$SYMM= 0
##$S_DEV= 0
##$TDeff= 65536
##$TDoff= 0
##$TI= <>
##$TILT= no
##$TM1= 0
##$TM2= 0
##$TOPLEV= 0
##$USERP1= <user>
##$USERP2= <user>
##$USERP3= <user>
##$USERP4= <user>
##$USERP5= <user>
##$WDW= 1
##$XDIM= 131072
##$YMAX_p= 445245794
##$YMIN_p= -13181
##$CURPLOT= <Network HP LaserJet P1505>
##$CURPRIN= <$Network HP LaserJet P1505>
##$DFORMAT= <normdp>
##$LAYOUT= <+/1D_H.xwp>
##$LFORMAT= <normlp>
##$PFORMAT= <normpl>
##$SURQMSG= 1
$$ End of Bruker specific parameters
$$ ---------------------------------
##NTUPLES= NMR SPECTRUM
##VAR_NAME=  FREQUENCY,     SPECTRUM/REAL,   SPECTRUM/IMAG
##SYMBOL=    X,             R,               I
##VAR_TYPE=  INDEPENDENT,   DEPENDENT,       DEPENDENT
##VAR_FORM=  AFFN,          ASDF,            ASDF
##VAR_DIM=   131072,        131072,          131072
##UNITS=     HZ,            ARBITRARY UNITS, ARBITRARY UNITS
##FACTOR=    0.0627417313425164, 1,          1
##FIRST=     8223.62146879497, 6032,         -57747
##LAST=      0,             8171,            -56678
##MIN=       0,             -13181,          0
##MAX=       8223.62146879497, 445245794,    0
$$ Real data points
##PAGE= N=1
##DATA TABLE= (X++(R..R)), XYDATA
$$ [...]
65334 216281 209926 203042 195499 187811 180748 174682 169536 165042 160832 156706 153056 150530 149050 147785
65320 147785 146391 145500 145459 145378 144305 142697 141645 141003 139472 136550 133311 130924 129304 127710 125985 124599
65304 124599 123779 123190 122437 121561 120984 121107 121939 123088 124162 125225 126788 129249 132346 135188 136962 137702
65288 137702 138233 139216 140353 140763 140035 138605 137192 136300 136169 136610 136809 135906 133969 131853 129993 128058
65272 128058 126089 125100 125891 127870 129780 131190 132568 134219 135816 136795 136656 135228 133122 131558 131117
65257 131117 131053 130486 129791 129983 131077 132100 132574 132959 133617 134298 134774 135119 135171 134506 133216 131972 131110 130333
65239 130333 129523 129081 129076 128794 127656 126169 125485 126268 128194 130268 131515 131724 131684 132295 133409 133958 133262 131620
65221 131620 129525 127004 124118 121492 119881 119444 119715 120029 119909 119456 119444 120481 121954 122476 121607 120444
65205 120444 120112 120377 120325 119825 119560 119937 120682 121411 122021 122564 123071 123470 123433 122577 121133 120082 120166 120949 121333
65186 121333 120912 120336 120439 121456 123149 125233 127435 129343 130472 130597 130045 129549 129656 130225 130642 130521 129943
65169 129943 129065 127861 126361 124809 123421 122279 121615 121820 123037 125014 127460 130142 132532 133986 134627
65154 134627 135515 137427 139902 142041 143871 146196 149282 152449 155071 157399 160222 164077 168984 174704
65140 174704 181069 188136 195963 204179 211996 218917 225276 231744 238406 244697 250166 254936 259322 263302
65126 263302 266479 268374 268724 267722 266029 264420 263354 262804 262333 261172 258500 254064 248559 243126 238383
65111 238383 234055 229480 224306 218781 213570 209220 205497 201303 195641 188757 182002 176426 171786 167212
65097 167212 162516 158359 155135 152289 149052 145583 142893 141642 141473 141609 141698 141776 141726 141249 140280 139097 138034
65080 138034 137292 136915 136654 136032 134899 133816 133478 133841 134308 134663 135285 136447 138000 139790 141707 143191
65064 143191 143420 142365 141095 140611 140913 141470 142001 142322 142096 141431 141230 142260 144141 145884 147067 147851 148163
65047 148163 147728 146727 145656 144521 142930 141044 139689 139336 139529 139561 139208 138569 137643 136362 134836 133344
65031 133344 132185 131507 131059 130256 128807 127144 125865 124904 123795 122643 122120 122385 122671 122276 121453 120929 120960
65014 120960 121253 121531 121774 122056 122503 123342 124716 126486 128343 130128 131986 134267 137232 140681 143899 146188
64998 146188 147493 148327 149109 149886 150651 151517 152441 153178 153701 154368 155395 156446 157003 156963 156661 156534 157015 158478
64980 158478 160918 163798 166559 169231 172202 175419 178141 179547 179312 177537 174509 170726 166903 163521
64966 163521 160420 157147 153710 150678 148402 146538 144632 142866 141694 140883 139577 137530 135664 135061 135777
64951 135777 137024 138126 138779 138746 137996 137022 136372 135899 135064 133951 133253 133153 132985 132306 131623 131608 132199 132994
64933 132994 134002 135320 136506 136984 136856 136609 136278 135681 135318 136017 137466 138048 136693 134218 132256 131400
64917 131400 131150 131243 132089 133799 135577 136489 136467 136231 136383 136844 137176 137268 137591 138666 140386 142149 143754 145790
64899 145790 148790 152401 155930 159445 163624 168602 173772 178831 184232 190262 196427 202176 207549 212589
64885 212589 216831 220125 223347 227383 231745 235139 237106 238151 238363 236979 233471 228207 221909 215278
64871 215278 209246 204632 201262 198274 195572 194058 194049 194439 194067 193080 192228 191538 190474 188835 186676 183846
64855 183846 180382 176961 174132 171454 168124 164190 160388 157107 154261 151875 149974 148140 145978 143808
64841 143808 142106 140595 138832 137519 138008 140362 142918 144109 143922 143356 143203 143664 144384 144577 143753 142550
64825 142550 142189 142887 143644 143852 144210 145545 147529 149313 150809 152567 154790 157168 159492 161843 164332
64810 164332 167074 170249 173840 177586 181475 185892 190862 195608 199427 202665 206110 209580 211849 212023
64796 212023 210392 207755 204467 200436 195767 191022 186858 183506 180639 177788 174934 172522 170875 169829
64782 169829 169160 169115 170168 172261 174585 176189 176727 176636 176748 177681 179482 181802 184359 187098 189929 192596
64766 192596 194992 197392 200198 203529 207236 211136 215109 219089 223167 227575 232374 237291 242006 246457
64752 246457 250704 254699 258473 262383 266799 271517 275791 279021 281176 282462 282732 281417 277936 272142
64738 272142 264481 255905 247530 240113 233640 227538 221490 216015 211969 209449 207542 205428 203445 202650
64724 202650 203458 205154 206759 207939 208998 210344 212164 214387 216798 219355 222410 226376 231152 236165
64710 236165 240999 245598 249733 252721 253985 253617 252099 249718 246509 242522 237818 232361 226209 219729
64696 219729 213378 207394 201870 196956 192686 188751 184777 180843 177497 175221 174019 173497 173176 172773 172366
64681 172366 172349 173103 174691 176853 179285 181853 184551 187387 190316 193385 196890 201295 206800 213017 219171
64666 219171 224602 228981 232214 234390 235710 236211 235609 233737 231049 228297 225675 222713 219140 215419 212205
64651 212205 209644 207539 205951 205239 205476 206108 206363 206057 205935 206964 209208 211728 213871 216203 219651 224129
64635 224129 228875 233940 240260 248093 256451 264537 272713 281326 289401 295439 298977 300500 300228 297972
64621 297972 293923 288648 282322 274828 266619 258635 251185 243668 235699 227888 221132 215593 210839 206666
64607 206666 203362 201217 200067 199357 198561 197567 196685 196290 196532 197395 198857 200817 203062 205484 208172 211031
64591 211031 213545 215317 216751 218801 222000 226032 230273 234406 238425 242304 245920 249238 252447 255881
64577 255881 259786 264163 268859 273754 278730 283505 287749 291342 294224 296027 296282 295045 292811 289597
64563 289597 284705 277749 269381 260520 251383 241925 232782 224947 218656 213315 208455 204119 200358 197064
64549 197064 194377 192663 191951 191888 192293 193222 194425 195355 195934 196788 198509 201041 203895 206560 208540 209445
64533 209445 209303 208480 207132 205056 202140 198546 194384 189752 185276 182081 180772 180745 180831 180408 179712 179414
64517 179414 180142 182078 184604 186576 187311 187214 187242 187910 189043 190223 191151 191725 192190 193219 195495 199064 203204
64500 203204 207019 210150 212997 216370 220879 226559 232983 239628 245986 251423 255261 257176 257432 256598 255167
64485 255167 253466 251732 250071 248491 247170 246630 247369 249184 251042 251822 251194 249613 247516 244828 241434
64470 241434 237761 234463 231663 228973 226298 224054 222529 221602 221352 222329 224788 228099 231444 234646 237731
64455 237731 240124 241057 240550 239274 237513 235046 232047 229370 227739 227166 227264 227686 228288 229397 231826 235999
64439 235999 241071 245705 249801 254658 261204 268913 276888 285204 294538 305136 316925 330386 346572
64426 346572 366231 389340 415536 444870 478229 517168 563204 617201 679578 750872 831468
64415 831468 920608 1016033 1114586 1212757 1306928 1394336 1474286 1547573 1614045 1671288 1716133
64404 1716133 1746624 1761913 1761276 1744685 1714000 1672219 1621214 1560905 1490659 1410725 1322223 1226802
64392 1226802 1127003 1026558 929679 839807 758864 687367 625024 571282 525356 485982 451694
64381 451694 421711 396190 375211 357879 342884 329599 318083 308339 300293 294233 290357 287887
64369 287887 285450 282407 279004 275107 269831 262847 255218 248222 241959 235809 229695 224042 218749 213232
64355 213232 207575 202907 200297 199730 200416 201721 203424 205345 207202 208965 211083 214112 218022 221952 224699
64340 224699 225504 224378 221829 218444 214757 211198 207969 204947 201935 199053 196791 195646 195710 196592 197716
64325 197716 198713 199633 200804 202461 204520 206730 208957 211200 213367 215226 216735 218225 220069 222195 224118
64310 224118 225421 225994 225789 224622 222387 219255 215515 211340 206833 202099 197113 191789 186420 181821 178650
64295 178650 176708 175303 174127 173364 173001 172609 171910 171100 170463 170080 170055 170630 171906 173777 176221 179238 182467
64278 182467 185456 188525 192645 198000 203294 207152 209766 212512 216210 220505 224686 228283 230843 231980
64264 231980 231938 231528 231186 230540 229220 227711 227021 227609 228943 230095 230594 230672 230662 230234 228455 224749 219646
64247 219646 214324 209535 205223 201022 196801 192806 189590 187712 187185 187323 187429 187471 187679 187748 187128 186053
64231 186053 185524 186019 186931 187608 188303 189609 191484 193461 195447 197633 199807 201440 202433 203216 203991 204475
64215 204475 204551 204645 205090 205482 205137 204041 202906 202231 201647 200410 198344 196068 194351 193473 193235 193353 193600
64198 193600 193628 192971 191426 189388 187686 187001 187452 188713 190477 192771 195900 200146 205590 212154 219713
64183 219713 228092 236991 245974 254509 262051 268063 272045 273560 272309 268224 261466 252445 242002 231583
64169 231583 222791 216355 211536 206889 201590 195839 190122 184647 179632 175583 172868 171277 170301 169609 169014
64154 169014 168323 167635 167513 168356 169796 171210 172717 175098 178672 182781 186573 189848 192905 195942 198888
64139 198888 201580 203789 205156 205334 204209 201947 198972 195912 193412 191852 191227 191231 191340 191009 190072 188997
64123 188997 188482 188804 189760 191220 193326 196110 199324 202894 207156 212335 218028 223577 228835 234214 240040
64108 240040 246202 252472 258793 265002 270466 274384 276568 277767 279011 280726 282704 284879 287779 292080
64094 292080 297969 305088 312710 319654 324409 326001 324792 321981 318322 313782 308330 302385 296215 289528
64080 289528 282086 274374 267215 261002 255657 251055 247069 243343 239510 235578 231827 228412 225395 222975
64066 222975 221309 220186 219324 218935 219484 220841 222183 223006 223854 225645 228435 231217 232909 233367 233379 233834
64050 233834 235007 236678 238825 241952 246491 252088 257902 263724 270357 278597 288158 298001 307534 316936
64036 316936 326253 334775 341618 346601 350086 352170 352476 350771 347389 342928 337857 332605 327760 323867
64022 323867 321121 319434 318618 318326 318025 317373 316502 315550 313995 310975 306414 301358 296874 292944 288778 283978
64006 283978 278928 274236 270240 267033 264478 262107 259493 256920 255297 255069 255554 255734 255471 255447 256050 256935
63990 256935 257818 259121 261434 264649 268067 271174 273946 276533 279113 282136 286252 291713 298115 304922
63976 304922 312057 319731 327781 335526 342341 348250 353947 360305 367869 376693 386574 397373 409150 422043
63962 422043 436126 451320 467349 483873 500909 519180 539873 563927 591708 623385 659338
63951 659338 700114 746334 799003 859796 930697 1013359 1108878 1217878 1340449 1476123 1624333
63940 1624333 1784780 1956923 2139044 2328247 2521471 2716028 2908969 3096375 3273698
63931 3273698 3436462 3580354 3701068 3794974 3860193 3896588 3904410 3883222 3832362 3752223 3644824
63920 3644824 3513359 3361617 3193867 3014867 2829542 2642425 2457218 2276629 2102563
63911 2102563 1936605 1780494 1636061 1504704 1387050 1283134 1192596 1114526 1047312 988977
63901 988977 937711 892058 850909 813681 780304 750620 723866 699150 676324 655814 637609
63890 637609 621030 605610 591512 578725 566548 554482 543182 533901 527234 522969 520858 520798 522383
63877 522383 525104 529201 535761 545677 558867 574644 592577 612806 635731 661517 689742 719517
63865 719517 750108 781355 813352 845881 878458 910699 942177 972052 999344 1023604 1044849
63854 1044849 1062891 1077236 1087689 1094451 1097484 1096314 1090674 1080784 1066770 1048391 1025670 999285
63842 999285 969919 937734 903029 867022 831216 796119 761137 725757 690329 655625 622158
63831 622158 590140 559854 531683 505838 482184 460404 440274 421703 404481 388212 372699
63820 372699 358278 345426 334057 323560 313618 304573 296792 290082 284027 278533 273674 269264 265018
63807 265018 260992 257457 254460 251839 249583 247752 246109 244175 241707 238813 235628 232221 228839 225862
63793 225862 223340 220848 218014 214983 212229 210079 208616 207892 207915 208427 208862 208655 207591 205871 203895 201985
63777 201985 200253 198655 197150 195822 194842 194268 193884 193355 192584 191882 191718 192269 193273 194212 194657 194505 194032
63760 194032 193649 193552 193649 193828 194069 194247 194091 193602 193272 193582 194456 195509 196653 198025 199431 200390 200773 200918
63742 200918 201162 201735 203051 205474 208607 211523 213944 216569 219814 222940 225058 226514 228446 231197 233967
63727 233967 236047 237744 239869 242788 246233 249792 253342 257087 261243 265691 270033 274005 277640 280894
63713 280894 283355 284528 284199 282335 278934 274299 269225 264522 260479 257062 254345 252299 250458 248434
63699 248434 246654 245957 246388 247056 247404 248019 249773 252589 255612 258407 261449 265327 269853 274236 277989
63684 277989 281335 284634 287654 289743 290677 290992 291346 291841 292145 292033 291524 290703 289732 288969 288792 289340 290597
63667 290597 292531 294909 297117 298538 299127 299433 300065 301211 302406 302599 300778 296896 291968 286950 281873
63652 281873 276479 271248 266973 263532 259983 255997 252409 250068 248833 248010 247254 246718 246803 248097 251015
63637 251015 255104 259081 262029 264163 266130 268078 269948 272194 275428 279529 283910 288686 294847 303026
63623 303026 312551 322037 330710 339007 348188 359448 373116 388424 404195 419981 436524 455042
63611 455042 476139 499477 524375 550552 578253 607741 638736 670340 701320 730160 754893
63600 754893 773421 784572 788923 788262 784220 777671 769400 760732 752973 746310 739583 731233 720333 706770
63586 706770 690722 672248 651407 628663 604959 581285 558169 535758 514371 494773 477737
63575 477737 463548 452108 443339 437125 432941 430019 427987 427043 427367 428789 431287 435351 441317 448603
63561 448603 456222 464001 472695 482758 493633 504571 515724 527987 542076 558184 576440 597293
63549 597293 621395 649303 681310 717433 757560 801327 847192 891213 927378 950338 958549 954743
63537 954743 943396 927964 910398 892335 875725 862028 851336 842733 835465 829279 823475 816084
63525 816084 804647 787951 766599 741789 714028 683456 651010 618566 587785 559222 532660
63514 532660 507966 485371 465120 447136 431074 416588 403508 391770 381287 371970 363851 356959
63502 356959 351031 345531 340119 334946 330356 326465 323178 320454 318272 316419 314553 312487 310342 308512
63488 308512 307479 307432 307932 308227 308161 308537 310287 313424 317151 320811 324408 328263 332571 337216 341761 345682
63472 345682 348883 351771 354469 356160 355746 353067 349014 344464 339703 334905 330476 326663 323312 320288
63458 320288 317732 315627 313597 311467 309631 308444 307601 306598 305626 305588 307266 310824 316017 322450 329592
63443 329592 336936 344427 352689 362709 375291 390742 409044 430364 455464 485397 520431 558994
63431 558994 597637 632168 659208 677219 686585 689002 686690 681895 676742 673278 673435 678756 689995
63418 689995 707037 729377 756648 788451 823702 860488 896703 930499 959952 982827 997349
63407 997349 1003275 1001975 995581 986236 975707 965018 954319 943448 932533 921581 909525 894341
63395 894341 874377 849372 820193 788015 753951 719058 684363 650911 619739 591530 566267
63384 566267 543533 523149 505268 489952 477039 466439 458154 451998 447686 445145 444300 444651 445741
63371 445741 448060 452774 460299 469827 480503 492357 505712 520432 536367 553961 573748 595660
63359 595660 619511 645808 675330 708064 743158 779760 817214 854478 889958 921976 948960
63348 948960 969343 982026 987195 986205 980481 970950 958692 945525 933312 922663 912592 901428
63336 901428 887907 871461 851820 828646 801726 771466 739113 706452 675226 646623 621117
63325 621117 598756 579725 564563 553725 547179 544699 546137 550619 555307 555771 548382 532529 510649
63312 510649 486493 463299 442699 424577 408051 392916 379952 369704 361489 354115 347211 341241
63300 341241 336502 332704 329479 326671 324088 321406 318496 315563 312890 310571 308393 305883 302676 299060
63286 299060 295841 293426 291343 289020 286628 284641 282910 280792 278110 275400 273309 272271 272581 274126
63272 274126 276010 277088 277001 276251 275383 274683 274572 275468 277069 278492 279399 280346 281765 283275 284492 285879
63256 285879 288201 291453 294927 298137 301220 304527 308257 312400 316784 321216 325747 330640 335913 341165
63242 341165 346231 351765 358883 368217 379516 392031 405099 418541 432788 448426 465447 483172
63230 483172 501158 519835 539693 560094 579606 597594 614840 632278 649745 666496 682588
63219 682588 699029 716576 734995 753639 772222 790638 808386 824652 838823 850487 858975 863354
63207 863354 862999 857805 847832 833196 814571 793281 770471 746411 721117 695412 670845 648612
63195 648612 629032 612093 597916 586491 577468 570608 566178 564586 565764 569188 574354 581069 589443
63182 589443 599894 612962 628710 646204 663897 680717 696732 712707 729135 745768 761972
63171 761972 777304 791751 805574 819009 831993 843936 853802 860673 864326 865082 862956 857171 846714
63158 846714 831240 811199 787271 760080 730525 699973 669819 640863 613218 586779 561720
63147 561720 538654 518334 501103 486511 473505 461117 449095 438012 428757 421740 416417 411713
63135 411713 407100 403151 400746 399813 399195 397883 396054 394633 394100 394116 394238 394634 395875 398239 401425 404866
63119 404866 408174 411252 414224 417333 420840 424834 429100 433218 436776 439569 441734 443783 446326 449655
63105 449655 453693 458391 463827 469609 474592 477792 479521 480984 482761 484323 485195 485773 486544 487185 487111 486470
63089 486470 485889 485528 485143 484924 485458 486790 488170 488891 488844 488146 486863 485449 484973 486344 489406 493053 496186
63072 496186 498497 500517 503089 506735 511402 516838 523133 530775 540169 551220 563392 576204 589842
63059 589842 605349 623840 645299 668494 692539 718186 747020 779569 814952 852337 891901
63048 891901 934113 978752 1025063 1072325 1119879 1167008 1213338 1259072 1304388 1348817 1391699
63037 1391699 1433208 1474466 1516536 1559483 1602500 1644773 1685979 1725849 1763328 1796458 1823223
63026 1823223 1842243 1852435 1852487 1841367 1819258 1787269 1746170 1696219 1638565 1576095 1512320 1449775
63014 1449775 1389832 1333422 1281170 1233190 1189567 1151099 1118997 1093884 1075487 1063348 1057329
63003 1057329 1057364 1063082 1073786 1088618 1106797 1127974 1152214 1179270 1207978 1236858 1265288 1293622
62991 1293622 1322199 1350782 1379174 1407695 1436573 1465165 1492225 1516694 1537867 1554939 1566890
62980 1566890 1572816 1572049 1564010 1548328 1525177 1495167 1458806 1416385 1368526 1316524 1261949 1206190
62968 1206190 1150685 1097200 1047303 1001490 959220 919803 882966 848606 816584 787012 760327
62957 760327 736708 715636 696336 678439 661883 646415 631589 617164 603130 589345 575566
62946 575566 561867 548708 536480 525145 514365 503801 493314 483136 473865 466035 459635 454158
62934 454158 449106 444260 439572 435086 430993 427428 424186 420906 417628 414926 413321 412682 412244 411124 408891
62919 408891 405897 403131 401543 401372 402121 403029 403445 402988 401696 399964 398090 395952 393447 391020 389339
62904 389339 388504 387993 387397 386768 386315 386223 386793 388204 390086 391803 393223 394693 396201 397231 397636 397978 398706
62887 398706 399599 400398 401348 402594 403572 403626 402936 402283 402145 402479 403125 403907 404520 404796 404933 405137 405175 404606 403235
62868 403235 401062 398135 394810 391766 389249 386675 383528 380307 377911 376394 375154 374230 374468 376243 378750
62853 378750 380890 382298 383250 384075 384978 386009 386914 387347 387370 387399 387450 386930 385510 383717 382243 381017 379515
62836 379515 377794 376618 376487 376986 377294 377008 376295 375438 374507 373491 372572 372156 372600 373892 375661 377539 379513
62819 379513 381810 384423 386934 388968 390759 393022 396174 399880 403525 406878 410084 413221 416290 419602
62805 419602 423667 428594 434003 439731 446165 453569 461494 469383 477501 486619 496818 507229 517196 527255
62791 527255 538657 552226 568003 585814 605769 628241 653707 682726 715828 753206 794704
62780 794704 840310 890631 946593 1008642 1076332 1148661 1224497 1302618 1381631 1460101 1536461
62769 1536461 1608618 1673930 1730042 1775549 1809537 1830814 1838235 1831666 1811955 1779907 1736069 1681789
62757 1681789 1619773 1552998 1483371 1411798 1339180 1266831 1196103 1127969 1062943 1001253 943308
62746 943308 890031 842289 799838 761304 725551 692580 662757 635771 611071 588858 569791
62735 569791 553796 539893 527215 515585 505106 495844 488069 482179 478095 475089 472465 470135 468393
62722 468393 467389 467027 467186 467938 469622 472690 477274 483011 489525 496964 505748 515909 527153 539583
62708 539583 553815 570241 588662 608923 631526 657236 686366 718842 754802 794677 838671
62697 838671 886556 938077 993223 1051813 1113018 1175682 1239063 1302818 1366043 1426659 1482092
62686 1482092 1530318 1569860 1599055 1616125 1620201 1611772 1591861 1561188 1520446 1470966 1414692 1353658
62674 1353658 1289794 1224883 1160298 1096923 1035569 977216 922532 871480 823804 779662 739429
62663 739429 703153 670618 641689 616098 593128 572059 552831 535803 520962 507862 496164
62652 496164 485752 476361 467637 459474 451774 443974 435489 426732 419034 413289 409082 405335 401376 397233
62638 397233 393369 390436 388981 388988 389763 390375 390198 389173 387841 387028 387131 387640 387648 386850 385741 384942 384643 384718
62620 384718 384911 384920 384706 384760 385679 387454 389584 391876 394583 397711 400845 403952 407772 412923 419001 425064
62604 425064 430853 437107 444760 454194 465336 478168 492983 510176 529973 552489 577983 606772
62592 606772 638799 673477 710116 748186 786998 825504 862700 897831 929771 956613 976562
62581 976562 989004 994144 991975 982505 966743 946362 922167 893817 861349 826122 789937 754036
62569 754036 719322 686637 656170 627283 599628 573912 550917 530280 511050 493082 477057
62558 477057 463294 451331 440703 431474 423853 417713 412643 408165 403831 399338 394608 389660 384597
62545 384597 379895 376453 375013 375504 377149 379092 380773 381996 382988 384213 385745 386895 386866 385752 384556
62530 384556 384190 384740 385844 387500 390292 394841 401162 408675 416869 425920 436512 449192 464130 481494
62516 481494 501602 524466 549480 575964 603957 634185 667265 703062 740735 779159 817204
62505 817204 853776 887762 918058 943738 964122 978645 986784 988276 983348 972568 956592 936326
62493 936326 913217 889012 865111 842291 821006 801654 784619 770437 759983 754159 753284 757010
62481 757010 764765 775959 789847 805701 823250 842476 862806 882784 900581 914552 923451 926826
62469 926826 925331 919964 910629 895996 875110 848659 818317 785486 751143 716375 682214 649127
62457 649127 617236 586975 559057 533903 511524 491867 474905 460434 448122 437767 429316 422712
62445 422712 417938 415008 413675 413281 413185 413217 413572 414463 416105 418804 422704 427483 432444 436793 439780 440927
62429 440927 440377 438697 436100 432150 426535 419802 412934 406444 400275 394362 388834 383766 379097 374764
62415 374764 370664 366625 362684 359210 356435 354051 351582 348994 346568 344324 342031 339693 337659 336242
62401 336242 335571 335755 336787 338215 339268 339517 339322 339563 340959 343533 346596 349253 351052 352165 353029 354009
62385 354009 355421 357593 360670 364493 368790 373380 378169 383195 388724 395079 402345 410491 419761 430404
62371 430404 441881 452921 462728 471882 481740 493317 506929 522501 539779 558619 579526 603671
62359 603671 632085 665073 702705 745379 793338 845873 901510 958764 1016273 1072356 1124979
62348 1124979 1172099 1211804 1242455 1263282 1274836 1278466 1275329 1266045 1250967 1230260 1203813 1171571
62336 1171571 1134075 1092589 1048799 1004495 961193 919756 880548 844071 811139 782235 757211
62325 757211 735847 718145 703571 690571 677502 663745 649388 634314 618276 601523 584576
62314 584576 567600 550696 534529 519870 506634 494171 482421 471921 462631 453645 444380 435453
62302 435453 428053 422805 419393 416955 414739 412681 411382 411286 412053 413030 414056 415348 416886 418549 420603
62287 420603 423278 425963 427667 428378 429277 431414 434793 438852 443173 447479 451584 455680 460229 465196 469803
62272 469803 473367 476149 479184 483515 489713 497835 507633 518891 531701 546442 563618 583828 607590
62259 607590 635017 665995 700992 741260 787711 839881 896483 956538 1019145 1082342 1143029
62248 1143029 1198086 1245125 1282465 1309352 1326311 1334542 1334798 1327246 1312218 1290283 1261661 1226381
62236 1226381 1185070 1138881 1088730 1035490 980959 927661 877403 830846 788543 751377 719624
62225 719624 692546 669423 650192 634727 622345 612586 605687 601687 599737 598845 598652 598893 598837 597944
62211 597944 596545 595087 593180 590082 585743 580684 575151 569122 562856 556736 550666 544295 537767 531709
62197 531709 526472 521842 517582 513895 511290 510174 510585 512267 515078 519299 525288 532761 540793 548707
62183 548707 556665 565221 574602 584505 594262 603044 610327 616398 622014 627432 632238 636362 640773 646890
62169 646890 655759 668103 684676 706028 732167 762794 797669 836452 878351 922071 965851 1007461
62157 1007461 1044612 1075646 1099706 1116409 1125883 1129063 1127077 1120070 1107272 1088486 1064702 1036920
62145 1036920 1005264 969931 932276 894196 856956 821292 788121 758287 731957 709012 689786
62134 689786 674727 663540 655375 649630 645950 643638 641845 640325 639425 639381 640181 642103 645800 651695 659663
62119 659663 669348 680540 693207 707254 722031 735927 746865 753624 756508 756539 754467 750959 747200
62106 747200 744371 742497 740303 736233 729364 719564 707374 693877 680509 668880 660484 656045 654940
62093 654940 655838 658180 662478 668955 676709 684840 693601 703569 714305 724832 735030 745452 756065
62080 756065 766348 776701 788609 803098 819825 837957 857179 877479 898581 920047 941661
62069 941661 963425 985396 1007573 1029701 1051327 1072468 1094091 1117368 1142465 1168501 1194462
62058 1194462 1219372 1241607 1259061 1270509 1276309 1277380 1274009 1266069 1253996 1238862 1221402 1201210
62046 1201210 1177018 1147872 1114169 1077477 1039243 999870 959295 918088 877438 838230 800756
62035 800756 765300 732268 701601 672704 645366 620299 598396 579736 563625 549370 536726
62024 536726 525744 516435 508525 501407 494435 487298 479981 472385 464270 455665 447104 439244 432365 426333
62010 426333 420958 416284 412617 410338 409676 410657 413267 417580 423627 431228 440027 449610 459528 469334 478654
61995 478654 487090 494069 499086 502177 503844 504413 503849 502322 500407 498299 495206 490040 482597 473794 464948
61980 464948 457067 450444 444477 438172 431219 424330 418215 412648 406966 401022 395056 389081 383193 378194
61966 378194 375066 373859 373756 374107 374722 375281 375275 374632 373759 372922 372152 371726 372074 373187 374827 377360 381577
61949 381577 387533 394310 401244 408768 417704 428277 440132 452868 466270 480447 496010 513695
61937 513695 533541 554737 576438 598301 620122 641415 661667 680635 698117 713690 726910
61926 726910 737598 745890 752219 757129 760641 761834 759551 753650 745080 734785 723156 710729 698800
61913 698800 688919 682128 678855 679101 682499 688574 697212 708616 722748 739157 757266 776181 794128
61900 794128 808845 818993 824703 826487 824163 817317 806316 792266 776196 758694 740185 721169
61888 721169 702253 684073 667035 651073 635891 621508 608261 596254 585163 574579 564151
61877 564151 553463 542395 531632 522096 513715 505551 497463 490780 486745 484983 484223 483989 484808 487086
61863 487086 490629 495218 501069 508633 518225 529800 542923 557227 573054 591192 611743 633933
61851 633933 657474 683426 712971 745774 780451 816188 852841 889605 924810 957310 987049
61840 987049 1013767 1035916 1051509 1059585 1060334 1054303 1042280 1025808 1007104 988180 970282 954257
61828 954257 941098 931949 927746 929002 935701 947086 961622 977473 993180 1007755 1020151 1028985
61816 1028985 1032953 1031271 1023468 1009030 987715 960146 927734 892064 854663 817210 781250 747474
61804 747474 715673 685643 657811 632725 610317 590096 571893 555982 542436 530689 519922
61793 519922 509869 501092 494241 489041 484237 478792 472955 467850 464192 461821 460272 459184 458069 456326
61779 456326 453813 451026 448490 446265 444154 442060 439980 438040 436695 436407 436890 437088 436243 434651 433104
61764 433104 431995 431314 431121 431473 432103 432673 433250 434130 435229 436097 436601 437294 438869 441307 443710 445042 445059
61747 445059 444356 443520 442467 440861 438884 437137 435877 434854 433886 433089 432451 431707 430828 430171 429915 429697 429075
61730 429075 428108 427363 427540 429049 431533 433876 435205 435906 437141 439323 441741 443733 445502 447566 450112
61715 450112 453208 456930 460883 464236 466586 468175 469009 468580 466871 464750 462708 460065 456172 451666 447601
61700 447601 444014 440349 436780 433935 431597 428836 425415 422079 419403 417194 415106 413074 410937 408326
61686 408326 405178 401957 399180 397001 395201 393277 390766 387794 385080 382973 380891 378243 375466 373464
61672 373464 372372 371628 370891 370010 368415 365657 362503 360392 359669 359343 358672 357940 357392 356515 354973 353389
61656 353389 352557 352461 352643 353014 353772 354981 356712 359200 362386 365594 368059 369568 370448 371362 373303 377161
61640 377161 382803 388953 394296 398379 401209 402653 402716 401875 400482 398256 394961 391160 387557 383943 379649
61625 379649 374885 370670 367336 364037 360183 356636 354836 355079 356252 357086 357172 356769 356129 355251 354069 352585
61609 352585 350835 348867 346783 344655 342279 339089 334591 328995 323255 318189 313593 308506 302497 296377
61595 296377 291396 287914 285213 282526 279811 277406 275396 273633 272084 270782 269658 268715 268205 268181 268024
61580 268024 266944 265003 263161 262187 261916 261716 261240 260532 259804 259383 259500 259877 259776 258766 257232 255896 255101
61563 255101 254741 254588 254466 254369 254636 255583 256775 257140 256278 255215 255367 257052 259520 262107 264676 267116 269135
61546 269135 270636 271726 272335 272264 271689 271189 271217 271893 273235 275133 277077 278450 279280 280292 282030 284255
61530 284255 286385 288212 289931 291687 293283 294283 294281 293205 291430 289550 288008 286927 286142 285265 283853
61515 283853 281747 279258 276980 275464 275037 275580 276408 276731 276504 276482 277154 278003 278160 277435 276218 274795 273352
61498 273352 272395 272398 273104 273809 274298 274904 275616 275842 275191 273984 272841 272199 272313 273120 273895 273663 272391 271382
61480 271382 272102 274770 278312 281452 283581 284799 285496 285960 286188 286009 285378 284545 283955 283957 284519 285190 285538 285698
61462 285698 286265 287492 288881 289749 289903 289545 288882 288194 287902 288103 288294 288065 287828 288350 289793 291779 294114
61445 294114 296767 299246 300790 301255 301223 301208 301371 301987 303492 305875 308636 311536 314841 318672 322632 326346
61429 326346 329884 333399 336702 339398 341172 341889 341775 341516 341851 343023 344969 347770 351349 354855 357202
61414 357202 358368 359491 361467 364024 366315 367736 367966 366901 364954 362916 361143 359317 357161 354867
61400 354867 352559 349949 346877 343712 340872 338372 336119 334202 332643 331341 330479 330424 330993 331407 331270 330954
61384 330954 330716 330192 329289 328846 329672 331416 333146 334651 336430 338616 340605 341715 341744 341055 340483 340859 342182
61367 342182 343489 343969 343904 344135 345005 346370 348231 350621 353084 355081 356829 359129 362339 366184 370564
61352 370564 375884 382399 389755 397456 405415 413822 422744 431960 440989 449148 455860 461048 465155 468772
61338 468772 472343 476064 479832 483361 486580 489827 493304 496397 497987 497581 495826 493709 491451 488471
61324 488471 484358 479599 475200 471727 468962 466534 464591 463559 463408 463579 463730 464202 465563 468000 471339
61309 471339 475383 479988 485036 490701 497638 506525 517267 528833 539982 550052 558953 566503 572011
61296 572011 574660 574246 571310 566621 560810 554526 548402 542540 536406 529645 522660 515948 509275 502164
61282 502164 494924 488401 482829 477731 472910 468706 465222 462328 460619 461321 464707 469464 474205 478897
61268 478897 484136 489773 495133 500056 504844 509474 513738 518037 523325 530261 538925 549208 560872 573254
61254 573254 585425 596660 606491 614459 620337 624507 627628 629922 631076 630760 628848 625274 620129 613919
61240 613919 607410 601192 595554 590573 585979 581147 575711 570137 565264 561328 557878 554659 552078 550632
61226 550632 550267 550532 551130 552043 553272 554757 556591 559078 562391 566211 570023 573793 578060 583094 588306
61211 588306 592945 597093 601350 605602 608867 610515 610958 610856 610350 609556 609238 610364 613257 617640 623272
61196 623272 630136 638334 648230 660450 675252 692007 709576 726921 743101 757092 768218 776630
61184 776630 782956 787672 791137 793924 796558 799002 800801 801688 801723 800982 799467 797232 794226 790081 784387
61169 784387 777210 769180 761125 753674 746868 739901 731477 720766 707995 694000 679519 665074 651149
61156 651149 638054 625779 614314 603989 595250 588250 582857 578929 576441 575501 576306 578741 581903 584327
61142 584327 584810 582848 578375 571685 563602 555075 546403 537451 528821 521964 517738 515584 514589 514607 515754
61127 515754 517614 519894 523343 529123 537500 547823 559527 572458 586501 601613 618143 636487
61115 636487 656481 677584 699491 722188 745593 769596 794192 819195 844037 868164 891346
61104 891346 913287 933435 951521 967774 982116 993664 1001525 1005584 1006021 1002699 995589 985201 971851
61091 971851 955208 935357 913725 891941 870221 847849 824842 802060 779956 758311 737187
61080 737187 717193 698721 681629 665720 650985 637461 625360 615131 606887 600048 594006 588714
61068 588714 584119 579761 575699 573180 573300 575411 577871 579965 582105 584602 587441 591060 596117 602504
61054 602504 609558 617170 625729 635183 645141 655846 668058 681982 697152 713267 730416 748750
61042 748750 768725 791278 816775 844130 871913 899990 929132 959590 991295 1025025 1061978
61031 1061978 1102389 1145638 1191363 1239346 1288797 1339019 1390171 1442117 1493452 1543485 1594508
61020 1594508 1650196 1712433 1781760 1860037 1949742 2050821 2161087 2280155 2410901 2557732
61010 2557732 2726658 2927163 3170612 3466612 3824715 4260428 4796054 5456421 6270342
61001 6270342 7277518 8525483 10054087 11887125 14034236 16467632 19054221 21505244
60993 21505244 23442397 24583623 24909946 24665987 24203474 23819417 23701502 23938283 24492462
60984 24492462 25142641 25508315 25215040 24093861 22251451 19969988 17546927 15198500
60976 15198500 13049457 11157484 9534363 8163767 7019048 6072738 5296259 4660039
60968 4660039 4138185 3710734 3360433 3070446 2826437 2618248 2438292 2280215 2139867
60959 2139867 2015383 1905247 1807587 1721538 1647340 1584552 1531778 1488354 1454273 1427925 1405810
60948 1405810 1385262 1365801 1347350 1329107 1311162 1295433 1283593 1275133 1268422 1262569 1257351 1252338
60936 1252338 1247175 1242010 1236893 1231335 1224945 1217772 1209648 1200098 1189369 1178513 1167912 1156602 1143621
60923 1143621 1129082 1113242 1095567 1075548 1053797 1031488 1009243 987188 965450 943920 922094
60912 922094 899866 878055 857538 838305 819992 802875 787606 774206 761995 750470 739767
60901 739767 730256 721988 714601 707664 701126 695295 690227 685406 680378 675413 670907 666420 661107 655022
60887 655022 649050 643490 637637 630971 623769 616198 607772 598324 588737 580031 572236 564761 557378 550275
60873 550275 543523 537056 530931 525260 520067 515442 511486 508014 504752 501889 499768 497877 495048 491114
60859 491114 487517 485532 484509 482745 479646 476149 473186 470666 468021 465037 461828 458478 455026 451621
60845 451621 448453 445590 442908 440236 437579 435124 432886 430424 427175 423090 418671 414389 410311 406361
60831 406361 402610 399188 396156 393550 391376 389562 388125 387315 387330 388023 389197 391029 393791 397230 400621
60816 400621 403301 404762 404655 403428 402685 403823 406249 407927 407864 407043 406613 406297 405319 403865 402642 401591
60800 401591 400102 398243 396866 396488 396738 396934 396730 396188 395511 394662 393072 390037 385685 381198 377613 374685
60784 374685 371444 367624 363924 360898 358176 354980 351117 347249 344300 342603 341573 340286 338395 336330
60770 336330 334591 333205 332038 331255 331126 331613 332550 334064 336413 339424 342450 344934 346823 348412 350007
60755 350007 351802 353952 356562 359513 362378 364729 366682 368929 372008 375692 379413 383068 386880 390559
60741 390559 393201 394242 393958 392790 390614 387022 381989 375916 369273 362510 356034 349916 343807 337498
60727 337498 331513 326830 323932 322274 320716 318498 315849 313620 312252 311248 309828 307899 306036 304663
60713 304663 303677 302833 302001 301017 299741 298358 297208 296250 295141 293869 292813 292079 291349 290513 289883 289663 289802
60696 289802 290512 292246 294846 297383 299249 300819 302609 304458 306051 307662 309743 312257 315059 318481
60682 318481 322827 327655 332275 336760 341805 347732 354211 360734 366741 371517 374691 376835 378977 381530
60668 381530 384121 386266 387644 387867 386735 384671 382250 379379 375696 371768 368915 367523 366384 364267
60654 364267 361421 358886 356880 354806 352621 351263 351479 352910 354721 356641 358858 361092 362368 361914 359964
60639 359964 357450 355062 352832 350448 347675 344512 341259 338495 336756 336171 336550 337698 339327 340737 341133
60624 341133 340427 339317 338391 337542 336490 335430 334791 334664 334860 335195 335377 334946 333838 332739 332417 332926 333918
60607 333918 335439 337714 340321 342380 343614 344513 345261 345259 344119 342516 341511 341414 341853 342623 343809 345170
60591 345170 346092 346381 346632 347443 348491 348784 347806 346160 344903 344446 344346 344133 344033 344689 346381 348820 351604
60574 351604 354554 357551 360440 363345 366903 371901 378758 387522 398192 410629 424202 437938 451266
60561 451266 464257 476829 487956 496058 500124 500161 496709 490459 482401 473838 465809 458725 452723 448086
60547 448086 445056 443521 443274 444420 447184 451470 457054 464147 473343 484982 498898 514830 532606
60534 532606 551740 571101 589292 605276 618528 628677 635173 637391 635104 628896 620057 610057
60522 610057 600171 591437 584456 578977 574024 568841 563544 558610 554096 549927 546676 545362 546366 549039
60508 549039 552482 556312 560592 565522 571482 579105 589104 602126 618724 639283 664069 693556 728559
60495 728559 769625 816380 867703 922263 978466 1034106 1086730 1134213 1174466 1204874 1222912
60484 1222912 1227375 1218288 1195742 1159974 1112886 1058390 1000559 941978 884249 829105 778158 732038
60472 732038 690605 653757 621445 593188 568185 545799 525583 507105 490221 475270 462596
60461 462596 452018 443092 435571 429233 423508 417767 411926 406465 401943 398556 395895 392999 389116 384642
60447 384642 380865 378525 377092 375730 374333 373167 372182 371351 371103 371609 372045 371435 369985 368706 367866 366771
60431 366771 365087 363445 362484 362054 361730 361531 361619 361746 361433 360518 359198 357699 356206 355026 354542 354937 356076
60414 356076 357697 359569 361414 362801 363461 363753 364486 365968 367532 368430 368938 369912 371361 372293 372183 371849
60398 371849 372470 374336 376956 379808 382451 384481 385949 387434 389184 390610 391160 391207 391444 391861 392096 392448
60382 392448 393672 395917 398666 401622 404876 408200 410946 412799 414092 415269 416597 418423 421091 424358
60368 424358 427410 429697 431367 432774 433983 434917 435705 436592 437776 439403 441530 444055 446898 450315 454756
60353 454756 460352 466738 473534 480873 489351 499420 510769 522306 532893 541987 549346 554304 555945
60340 555945 554105 549552 542937 534293 524007 513512 504270 496510 489703 483780 479061 475397 472371 470134
60326 470134 469062 468627 467608 465468 462688 459658 456275 452842 450341 449256 448887 448368 447823 448018 449444
60311 449444 452343 457141 464152 473094 483512 495673 510599 529208 551717 577707 606282 635945
60299 635945 664527 689534 708719 720488 723886 718418 704167 682320 655377 626437 598020 571541
60287 571541 547687 526910 509415 494979 483127 473557 466268 461210 457868 455374 453118 451022 449003
60274 449003 446381 442352 437075 431812 427753 425051 423096 421288 419298 417112 415198 414250 414389 414937 415264
60259 415264 415448 415790 416214 416618 417266 418200 418724 418219 417206 416841 417539 418711 419714 420403 420863 421288 422088 423481
60241 423481 424986 425748 425342 423897 421736 419450 418002 417989 418868 419582 419889 420446 421712 423458 425346 427250
60225 427250 428953 430245 431441 433184 435525 437702 438971 439265 439016 438778 439124 440501 443067 446785 451465
60210 451465 456492 461011 464889 469075 474375 480272 485656 490284 494599 498508 501483 503795 506542 510377
60196 510377 515083 520353 525932 530966 534339 535986 536985 538136 539255 539922 539896 538670 535786 531956 528726
60181 528726 526546 524183 520564 516204 512145 508457 504594 500544 496789 493598 490971 488857 486985 484970
60167 484970 482982 481711 481305 480963 480010 478671 477342 475895 474311 473237 473204 473856 474669 475844 477733 479922
60151 479922 481673 482940 484160 485385 486393 487412 488962 491033 493051 494687 496273 498442 501644 505911
60137 505911 510913 516444 522859 530594 539140 547180 554017 560155 565969 570602 572916 572985 571792 569919 567411
60122 567411 564700 562658 561678 561358 561192 561049 560971 560983 561162 561484 561665 561539 561537 562310 563831 565180 565377 564178
60104 564178 562015 559340 556190 552406 548243 544474 541618 539251 536568 533551 531028 529511 528651 528038 527873
60089 527873 528500 529839 531669 533930 536320 538123 538985 539461 540318 541674 543241 544946 546675 547771 547438
60074 547438 545542 542546 538822 534515 529871 525175 520388 515229 509583 503571 497357 491167 485376 480285
60060 480285 475843 471715 467556 463242 459040 455543 453086 451250 449366 447465 446216 445866 445931 446030 446336 446970
60044 446970 447680 448466 449873 452251 455311 458699 462365 465994 468863 470789 472594 475063 477976 480592 482434
60029 482434 483112 482153 479677 476631 473661 470368 466270 461711 457048 451785 445604 439592 435144 431962 428347
60014 428347 423431 418016 413150 408898 404754 400494 396278 392399 389221 387064 385949 385589 385564 385466 385110 384744
59998 384744 384677 384653 384098 383103 382446 382449 382644 382912 383966 386077 388367 390190 392222 395152 398171 400059 401086
59981 401086 402499 404502 406084 406605 406354 405720 404938 404464 404475 404167 402645 400400 398808 398313 398252 398304 398814 399679
59963 399679 400208 400333 400822 402061 403635 405244 407013 408710 409756 410263 411003 412056 412487 411698 410179 408596
59947 408596 407117 405965 405623 405985 406167 405642 404797 404014 403081 401959 401246 401261 401417 401173 400907 401231 401977 402549
59929 402549 402840 403223 403951 405075 406689 408864 411511 414498 417711 420984 424345 428284 433157 438357 442871
59914 442871 446793 451394 457320 463538 468550 471907 474022 475236 475772 476037 476130 475432 473390 470491 467821
59899 467821 465780 463882 461770 459870 458891 459028 459816 460610 461101 461457 462077 463395 465865 469810 474961 480398
59883 480398 485282 489509 493397 497108 500933 505633 511706 518500 524891 530630 536061 540636 543040 542996 541720
59868 541720 540034 537255 532749 527536 523261 520198 517323 513993 510542 507429 504791 502875 502071 502273 502819
59853 502819 503359 504428 506926 511281 517292 524717 533711 544438 556148 566864 574433 577999 578285 576586
59839 576586 573935 571246 569541 569513 571003 573058 574291 573198 568712 560923 551199 541370 532847 526273 521490
59824 521490 517662 513915 510181 507099 504945 503086 500791 498131 495640 493364 490843 487981 485493 484204
59810 484204 484068 484051 483046 480795 477764 474243 470019 465092 460228 456321 453474 451161 448996 446822 444345
59795 444345 441466 438896 437661 437843 438425 438481 437949 437186 436414 435810 435514 435313 434803 434046 433530 433373 433145 432633
59777 432633 432164 431956 431785 431599 431880 432986 434610 436239 437711 439049 440170 441135 442297 443863 445642 447424
59761 447424 449249 451131 452886 454457 455969 457340 458271 458781 459310 460157 461335 463088 465883 469578 473265
59746 473265 476349 479223 482511 486210 490034 494069 498472 502887 506734 509842 512318 514007 514551 513922 512572
59731 512572 511075 509817 508936 508448 508479 509254 510580 511539 511228 509844 508463 507693 507111 506144 504770 503082 500888
59714 500888 498227 495809 494389 494013 494199 494526 494703 494414 493517 492249 491017 490177 490042 490722 491808 492597 492837
59697 492837 492938 493384 494338 495855 497983 500474 502782 504479 505320 505011 503484 501351 499458 497977 496610
59682 496610 495581 495549 496441 497316 497596 497520 497082 495515 492339 488149 483861 479835 476130 472818 469584 465783
59666 465783 461369 457067 453249 449474 445644 442635 441131 440623 440304 440222 440833 442069 443630 445590 447997
59651 447997 450441 452705 455268 458451 461623 463935 465327 466150 466384 465937 465137 464203 462787 460723 458647
59636 458647 457122 455804 454273 453047 452807 453161 453149 452599 452020 451510 450680 449435 448051 446736 445776 445740 446753
59619 446753 447908 448089 446980 444674 440946 435833 430379 425791 422264 419520 417930 417975 419109 420446 422240
59604 422240 425306 429162 432189 433799 435117 437170 439520 441113 441624 441487 441261 441361 441947 442802 443609 444342
59588 444342 445056 445520 445533 445329 445063 444248 442410 439973 437706 435634 433382 431227 429719 428478 426617 424341
59572 424341 422855 422502 422215 421211 420105 419759 419938 419827 419281 418930 419372 420609 421994 422586 422016 421080 420947
59555 420947 421704 422330 422209 421935 422345 423479 424982 426925 429617 432925 436365 439855 444001 449594 456959
59540 456959 465814 475826 487359 501610 519759 541748 565452 586653 600220 602754 595078 581840
59528 581840 568000 555831 545404 536859 531036 528359 528404 530664 534811 540132 545473 549903 552945 554271
59514 554271 553792 551878 548790 544180 537843 530665 523867 517550 511019 504340 498318 492899 486924 479861
59500 479861 472693 466555 461451 456853 452761 449475 446941 444863 443056 441320 439411 437446 435873 434843
59486 434843 434079 433518 433477 433985 434674 435573 437364 440458 444461 448950 454173 460504 467728 475317 482931 490138
59470 490138 496076 500031 502206 503523 504738 505990 506999 507445 507258 506762 506450 506660 507689 510122 514571
59455 514571 520942 528362 536065 544069 552870 562723 573357 584132 594387 603853 612696 620868 627501
59442 627501 631260 631302 627603 620590 610987 599946 588636 577561 566737 556600 548082 541575 536409
59429 536409 531729 527445 523943 521329 519493 518768 519969 523651 529705 537851 548219 561149 576534 593899
59415 593899 613225 635113 659804 686647 715195 745845 777687 805792 822666 823695 810632 789443
59403 789443 765977 744178 726538 714344 708045 708470 716602 730422 742950 745856 735542 714637
59391 714637 688042 659395 631190 605742 584525 567512 554031 543589 535562 529089 523847 520207
59379 520207 518207 517069 516051 515125 514568 514588 515546 517778 520985 524403 527727 531229 534986 538765 542633
59364 542633 546853 551186 555192 559223 564077 569615 574759 579052 583228 588091 593806 600391 607876 615768
59350 615768 623449 631253 640142 650232 660885 672363 685834 701327 717107 731735 745416 758628
59338 758628 770740 780874 788938 794805 797510 796381 792152 785955 777848 767272 754326 739759 724273
59325 724273 708678 694124 681239 669395 657619 645944 635227 625945 617795 610225 602871 595680
59313 595680 588932 582934 577579 572611 568407 565861 565324 566246 568011 570489 573796 578368 585347 595910
59299 595910 609977 626361 643996 661565 675742 681734 676834 662623 643012 621198 599134 578432
59287 578432 560234 544774 532083 522565 516122 511558 507804 505093 504068 504465 505643 507690 511029 515516
59273 515516 520972 528062 537537 548964 561129 573417 585937 598565 610659 621589 630957 638530
59261 638530 644455 649157 652535 653708 652003 647724 641551 633854 625099 616217 607919 600207 593072 586925
59247 586925 581761 576736 571420 566803 564205 563738 564532 565860 567339 568752 570495 573628 578624 584582 590355
59232 590355 595809 601272 606502 611136 615407 619396 622164 622677 621209 618895 616259 613004 608801 603445
59218 603445 596708 588960 581594 576013 572380 569861 567560 564665 560481 555154 549777 545019 540309 535121
59204 535121 530203 526508 523679 520723 517619 515119 513454 512286 511474 510819 509583 507322 504800 503061 502051
59189 502051 501166 500613 501045 502314 503768 505426 507718 510392 512825 515150 517984 521324 524688 528026 531505
59174 531505 534817 537759 541080 545637 551128 556785 562828 569993 578045 586169 594484 603700 613430 622297
59160 622297 629683 636025 641384 645049 646693 646647 644935 641243 635998 630271 624349 617451 609074 599657 589765
59145 589765 579577 569342 559476 550073 541153 533289 527027 521717 515976 509427 503017 497503 492608 487796
59131 487796 483019 478532 474692 471987 470533 469680 468953 469136 471407 475535 480063 484256 488763 494282 500724
59116 500724 507952 516285 525874 536302 547061 557849 568406 578745 589378 600500 611125 619940
59104 619940 626920 633179 639406 645393 650866 655612 658868 659815 658735 656665 654031 650777 647618 645647
59090 645647 644591 643009 640633 638999 639200 640312 640798 640289 639120 637068 633536 628406 621925 614216 605535
59075 605535 596710 588726 581962 576035 570213 563985 557521 551525 546384 541738 537287 533541 531108 529619
59061 529619 528201 526627 525091 523246 520569 517459 514760 512323 509296 505831 503213 502058 501631 501239 501164
59046 501164 501725 502383 502306 501241 499556 497997 497402 497924 498513 497948 496346 494861 494057 493590 493404 494028 495537
59029 495537 497326 499253 502078 506490 512468 519762 528222 537511 547167 557037 567107 577169 587295
59016 587295 598109 609593 620130 627959 633136 636729 638590 637664 634286 630274 626605 622767 618695 615588
59002 615588 614282 614383 615580 618366 622885 628397 634400 640970 647575 653022 657134 661061 665301 668770
58988 668770 670487 670848 670513 669304 666959 663769 659755 654417 648062 642230 638075 635329 633484 632824 633614
58973 633614 635518 638583 643609 650734 658838 667149 676273 686669 697335 707081 716146 725524 735492 745746
58959 745746 756070 765941 774267 780516 785338 789124 790699 788446 782135 772790 761337 748273 734088
58946 734088 719157 703557 687680 672532 658860 646429 634731 623923 614590 607090 601517 597723
58934 597723 594984 592216 588938 585518 582411 579795 577977 577109 576387 574620 571850 569327 567664 566224 564654
58919 564654 563535 562999 562125 560500 559059 558496 558067 556930 555653 555399 556467 558533 561483 565213 569432
58904 569432 574418 581173 590095 600256 610588 621024 632024 643903 656954 671080 684814 696127
58892 696127 704984 713895 725160 738792 753890 770591 789498 810308 832193 854648 876961 897766
58880 897766 915982 931285 943009 949884 951768 950282 946585 939750 928516 913467 896195 877470
58868 877470 857653 837967 819828 803605 789198 777032 767261 758872 750792 743127 736082 728632 719638
58855 719638 709553 699595 689899 679809 669377 659200 649298 639472 630365 622929 617184 612458 608339
58842 608339 604465 600015 594489 588446 582519 576314 569294 561970 555177 548838 542516 536477 531116 526056
58828 526056 520939 516421 513210 510826 508515 506718 506404 507538 509407 511897 515226 518986 522628 526473
58814 526473 531111 536303 541485 546717 552035 556510 559188 560461 561366 562054 562064 561567 561157 560797 560057 558987
58798 558987 557761 555920 552889 548855 544321 539412 534345 529807 526005 522176 517965 514382 512431 511733
58784 511733 511529 512037 513599 515494 516909 518283 520452 523275 526308 529910 534376 538833 542237 544562 545782
58769 545782 544842 541143 536021 531122 526287 520636 514801 510221 506973 504094 501414 499307 497262 494543
58755 494543 491812 490446 490643 491710 493664 496902 500805 504278 507261 510236 512865 514663 516419 519292
58741 519292 523052 526803 530787 535861 541797 547793 553979 560722 567218 572636 577952 584665 592309 599265
58727 599265 605483 612225 619550 626230 631896 637150 641797 645152 648061 652478 658823 665645 671966 678247
58713 678247 684999 692169 699919 708361 716564 723327 728687 733111 735657 734819 730875 725388 718596 709310
58699 709310 697200 683142 667361 649323 629649 610179 591898 574554 558344 544121 531835
58688 531835 520555 510199 501617 494915 489335 484692 481207 478093 474134 469618 465913 463272 460866 458751
58674 458751 457783 457679 457293 456852 457882 460808 464614 468961 474653 481939 490358 500411 513285 528607
58660 528607 544218 558285 569887 577775 580829 579989 577669 574948 571128 565945 560156 553954 547009 540139
58646 540139 534709 530304 525282 519769 515693 513585 511842 509550 507640 506648 505691 504367 503550 503643 503967 504357
58630 504357 505366 506572 506723 505849 505131 504542 502976 500896 500212 501099 501548 500710 500120 500933 502541 504745 508715
58613 508715 514838 521955 529553 538225 547128 553632 556695 558179 559694 560555 560038 559132 558599 557525 555259
58598 555259 552745 550567 547690 543502 539211 535892 533025 530177 528214 527652 527664 527928 529604 533350 538175
58583 538175 543311 549367 556651 564377 572534 582416 594104 605518 615147 623740 632151 639696 645942 652009
58569 652009 658700 665293 671551 678976 688789 700614 714298 730842 750183 770269 789896 810329
58557 810329 832497 854627 874343 891143 905116 915227 920815 923186 923869 922698 919111 913804 907660
58544 907660 900577 892789 885637 879499 872540 862991 851237 838341 824148 808271 791446 774484 757317
58531 757317 740316 725062 712633 702519 694129 687764 683309 679870 677566 677698 680237 683257 685750
58518 685750 688635 691998 693932 693445 692015 690816 688890 685636 682509 680457 678079 674192 669962 666652
58504 666652 663514 659759 656394 654216 652123 649241 646550 644663 642295 638783 635760 634396 633313 631230
58490 631230 629278 628658 628441 627835 628218 630610 633539 635810 639053 644988 652412 659525 667139 676891 688226
58475 688226 699726 711582 724164 735902 745062 751971 757215 759499 757610 752676 746252 738149 728366
58462 728366 719017 711940 706425 701595 698754 698901 700339 701459 703642 708621 715249 721786 729150 738720
58448 738720 748882 756863 762149 765215 764935 760522 754190 748656 743607 737600 731615 727584 725138 722929
58434 722929 721552 722054 723249 723697 724691 728162 733222 737848 742373 748248 755151 762445 771638 783993 797301
58419 797301 808324 816882 824305 829705 831344 830138 828201 825305 820147 813729 808013 802546 795803 788526
58405 788526 782436 776961 770544 763856 758558 754324 750256 747585 747649 748846 749028 749324 752132 756907 761379
58390 761379 765302 769488 772821 773921 774214 775797 777764 778031 777102 776654 776378 775862 777505 783579 792230 800269
58374 800269 807947 817066 826494 833891 839992 846884 853847 859147 864074 870836 878376 884708 891427 901226
58360 901226 912865 923300 932953 944071 955714 965378 973837 983280 992275 997674 1000068 1002481 1005242
58347 1005242 1007069 1009373 1014344 1020526 1025398 1030457 1038468 1047831 1055357 1062579 1073242 1086433 1098485
58334 1098485 1110051 1124839 1142625 1159903 1176271 1193847 1211511 1226106 1238270 1250776 1262293
58323 1262293 1269306 1273112 1278206 1284768 1289391 1292191 1296282 1301214 1304053 1306220 1312132 1321609 1330619 1338876
58309 1338876 1349582 1362350 1373746 1384361 1397987 1414240 1429374 1443898 1461769 1482458 1501568
58298 1501568 1518984 1538563 1559935 1578633 1594415 1611584 1630983 1649485 1667319 1687909 1710519
58287 1710519 1731088 1750323 1772830 1798440 1822685 1845660 1871826 1901256 1929791 1957703 1989305
58276 1989305 2024216 2058011 2091176 2128093 2167670 2204812 2240724 2281621 2327500 2372663 2417064
58265 2417064 2466196 2519966 2573062 2626369 2686225 2752012 2816456 2878690 2944685 3014295 3080809
58254 3080809 3144268 3211889 3284009 3353155 3418667 3488607 3565429 3643666 3723593 3812663 3911237
58243 3911237 4011555 4113190 4224576 4346964 4472514 4600806 4741140 4895590 5056303
58234 5056303 5222531 5403262 5599839 5803749 6014998 6244271 6493441 6753245 7024035
58225 7024035 7318621 7640457 7980251 8338742 8730555 9160470 9619285 10108885 10647032
58216 10647032 11241325 11884202 12580488 13352810 14212660 15155106 16190310 17350084 18655333
58207 18655333 20110722 21741708 23602162 25735812 28170046 30961484 34208432 38008298
58199 38008298 42451930 47677813 53885207 61284993 70106701 80686147 93493767 109066654
58191 109066654 127989704 150937947 178574312 211280213 248975166 290997884 335589631
58184 335589631 379021309 415498775 438856855 445245794 434673797 410294266 376492496
58177 376492496 337474875 296820726 257358338 220979690 188626700 160573048 136721264
58170 136721264 116723194 100062282 86204323 74694937 65131215 57131854 50384078
58163 50384078 44671068 39820408 35665091 32073688 28969257 26287035 23945228 21876032
58155 21876032 20048837 18439863 17007825 15717555 14558470 13521055 12580292 11718221
58147 11718221 10938152 10240731 9608249 9026435 8499500 8029751 7603124 7208186 6849289
58138 6849289 6527486 6227235 5935356 5656211 5396023 5148738 4909234 4684574 4480167
58129 4480167 4288962 4105135 3934503 3781114 3637136 3496113 3363226 3242745 3128108
58120 3128108 3014012 2906170 2809658 2719151 2629613 2545324 2469592 2396594 2321988 2250983 2187602
58109 2187602 2126420 2063080 2002632 1949247 1897822 1844034 1792891 1748953 1707417 1663225 1620086
58098 1620086 1582236 1545818 1506634 1468473 1435701 1405153 1372948 1342006 1315468 1289910 1262352
58087 1262352 1237010 1217974 1201783 1183957 1166222 1150837 1134582 1114948 1095639 1079420 1062115
58076 1062115 1040177 1017655 998969 981168 960136 938432 920140 903605 885898 869092 855650
58065 855650 842800 827740 813322 802536 792466 779692 766629 756658 747995 738189 729528 723975
58053 723975 717762 707208 695247 686177 678557 669292 660129 653892 648522 641017 633358 628539 624537 618028
58039 618028 610401 604425 598593 590381 581568 574867 568764 561042 553786 549426 545329 537815 528263 519944
58025 519944 512156 502834 493586 486710 480366 472059 463783 458399 454112 447988 441818 438875 437716 434847
58011 434847 430908 428645 427276 424456 421559 421434 422896 422762 421423 421249 421494 420017 418220 418978 421208
57996 421208 421551 420086 419544 420234 420457 420595 422082 423432 421802 417490 412876 408099 401788 394658 388367
57981 388367 382182 374698 367411 362695 359695 356027 351947 348975 346120 341571 336580 333644 332265 330414
57967 330414 328577 328351 328622 327257 325212 324890 325837 326086 326317 328538 331927 334099 335218 336757 337498 335046
57951 335046 330376 326701 324674 322601 320418 319457 319168 318090 317276 318893 322196 324755 326881 330978 337246
57936 337246 343854 350755 359507 369824 379967 390030 401306 412935 422597 429897 435788 439535 439792
57923 439792 437881 436367 435020 431679 426313 420683 414800 407440 399496 393100 388020 382486 376941 373251
57909 373251 370907 367797 364246 362402 362031 360772 358286 356312 354823 351983 347852 344374 341565 337360
57895 337360 331389 325500 320499 315769 312020 310837 311410 311177 309873 309620 311016 312602 314151 316823 319897
57880 319897 321060 320434 320728 322750 324132 323185 320845 318130 314773 311103 308368 306518 304321 302035 301220
57865 301220 301643 301317 299936 299325 300149 301148 302021 304015 307142 309787 311707 314604 319036 323478 327022 330358
57849 330358 333591 335713 336732 337765 338657 337986 335622 332700 329049 323567 317183 312314 309069 305181 300033
57834 300033 295477 292163 288481 283952 280270 278002 275523 272406 270646 271080 271666 270930 270358 271654 274074
57819 274074 276172 278026 280162 282266 284366 287457 291622 295188 296740 296336 294106 289593 283240 276511
57805 276511 269794 262117 253554 245855 240050 235529 232049 230347 230083 229546 228310 227933 229189 230844 232013
57790 232013 233472 235730 238040 240257 243415 247515 251041 253627 256895 261509 265788 268553 271134 275077
57776 275077 279846 284250 288318 292400 296072 299206 302514 305848 307570 306750 304512 302180 299608 296232
57762 296232 292194 287469 281470 274421 267722 262231 257654 254048 252132 251584 250920 249746 249233 249733 250044
57747 250044 249754 250206 252181 254691 256918 259319 261919 263653 264386 265439 267038 267425 265738 263602 262499
57732 262499 261605 259674 257142 254820 252275 249030 245818 243294 240953 238512 236790 236026 234982 232886 230620
57717 230620 228920 227118 224800 222879 221787 220413 218078 215731 213909 211424 207550 203609 200751 197943
57703 197943 193921 189547 186370 184256 182210 180314 179130 178321 177409 176845 176902 176623 175228 173414 172011 170565
57687 170565 168628 167148 167123 167996 168797 169820 171830 174660 177923 182112 187790 194723 202942 213640 227963
57672 227963 246085 268478 296760 332155 374465 423706 481090 546305 614221 675285 718782
57661 718782 736099 723729 685438 630683 569287 507682 449847 399060 356854 321932 292176
57650 292176 266950 246342 229601 215828 205007 196904 190129 183689 178286 174742 172381 170300 168888
57637 168888 168631 168727 168444 168530 169653 170690 170310 169210 169040 169977 171015 171768 172437 172699 172107 171006 169860
57620 169860 168412 166449 164418 162421 159803 156660 154315 153208 151934 149599 147364 146215 145073 142949
57606 142949 141147 141195 142131 142090 141296 141152 141533 141367 140912 141050 141059 139520 136893 134875 133577 131514 128184 124607
57588 124607 121429 118370 115443 113038 110819 108063 105032 102703 101342 100515 100098 100083 99867 98890 97434 95791
57572 95791 93474 90401 87817 86695 86232 85374 84686 85053 85605 84808 82792 80765 78943 76925 75315 74997
57556 74997 75395 75314 74891 74948 75161 74805 74606 75813 77962 79599 80665 82160 83926 84958 85549 86955 89126
57539 89126 90869 92172 94299 97559 100840 103319 104870 104944 103001 100089 98172 97803 97990 98153 98383 98041
57523 98041 96155 93348 91478 91144 91270 91280 91831 93113 94192 94470 94355 94146 93669 93240 93637 94900 96353
57506 96353 97831 99592 101087 101280 100239 99092 98343 97547 96517 95502 94215 92119 89600 87514 85696
57491 85696 83335 80686 78926 78382 78337 78491 79140 79973 80181 79725 79168 78380 76883 75221 74410 74218 73572 72514
57473 72514 72055 72218 72010 71351 71245 71886 72234 71673 70510 68751 65981 62683 60142 58815 58079 57583 57468
57456 57468 57374 56761 56113 56256 56677 56191 55174 55256 56763 58240 58684 58534 58357 58230 58541 59667 60813 60838
57438 60838 60176 60178 60731 60564 59834 60053 61259 61641 60448 59038 58391 57822 56884 56423 56802 57013 56532 56313 56989
57419 56989 57682 57456 56427 54797 52412 49944 48788 49057 49346 49134 49594 51246 52715 52791 52036 51306 50419
57402 50419 49304 48853 49417 49909 49478 48746 48434 48228 47940 48290 49457 50301 50150 49981 50702 51666 52054 52443
57384 52443 53758 55779 57808 59765 61584 62604 62630 62615 63314 64206 64502 64168 63266 61579 59657 58870 59526
57367 59526 60242 60025 59543 59439 59002 57800 57070 57950 59549 60278 60067 59835 59747 59498 59472 60197 61265 62019 62685
57348 62685 63686 64602 64902 65048 65759 66815 67603 68175 68758 68926 68260 67308 66978 67509 68657 70143 71295
57331 71295 71181 69853 68547 67917 67129 65479 63719 62728 61996 60643 58954 57696 56746 55625 54662 54410
57315 54410 54566 54522 54405 54610 54923 55054 55333 55974 56314 55682 54350 52877 51329 49880 49239 49592 50055 50043
57297 50043 50159 50849 51342 51013 50634 51008 51480 51191 50763 51177 51815 51268 49566 48070 47524 47526 47540 47212 46058
57278 46058 44025 42005 40784 39949 38779 37568 36956 36569 35567 34025 32626 31415 29985 28473 27292
57263 27292 26355 25595 25648 26921 28481 29095 28946 29151 30014 30850 31184 31036 30330 29055 27703 26662 25568
57246 25568 24118 22994 23023 23945 24969 25956 27114 28161 28872 29802 31361 32793 33251 33265 33864 34813 35069
57229 35069 34533 34023 33842 33612 33229 32805 32016 30703 29735 30013 30931 31127 30536 30408 31402 32863 33981 34582
57211 34582 34782 34824 35190 36070 36850 36859 36389 36295 36981 38435 40617 43002 44477 44693 44876 46245 48313 49900
57193 49900 51009 52364 53795 54662 55370 56846 58760 59760 59423 58619 58115 58036 58492 59473 60286 60283 59933 60090
57175 60090 60625 61029 61798 63726 66204 67958 69277 71767 75794 79818 82483 83917 84685 84917 84846 85055
57159 85055 85748 86729 88141 90257 92584 94309 95585 97171 98939 100107 100997 103032 106722 111045 115211
57144 115211 119711 125205 131600 138851 147537 158058 170181 183972 200352 220120 243058 268373
57132 268373 295416 323587 352190 380890 409945 439782 470712 503173 537916 575835 617841
57121 617841 664653 716256 771778 830327 891786 956468 1024412 1095467 1169556 1246369 1325442
57110 1325442 1407190 1493327 1585534 1684374 1790210 1904492 2029319 2166567 2318584 2489273
57100 2489273 2683628 2906868 3165023 3465794 3817787 4229170 4707389 5259001 5888731
57091 5888731 6599257 7392088 8266946 9219118 10237976 11307322 12404816 13504306 14590281
57082 14590281 15679131 16820514 18060950 19391888 20727390 21930429 22863896 23431104
57074 23431104 23591525 23356320 22771690 21898637 20799212 19533032 18157998 16728710 15293622
57065 15293622 13893704 12561300 11318179 10175772 9138751 8207832 7379412 6645497
57057 6645497 5996534 5423907 4919273 4473533 4078238 3726997 3414493 3135468 2885870
57048 2885870 2663687 2467232 2293463 2138926 2001208 1878416 1768413 1669671 1581834 1504291
57038 1504291 1435066 1372125 1314939 1264019 1219837 1182931 1154035 1133459 1121380 1119149 1128882 1151238
57026 1151238 1185148 1229810 1283698 1339355 1381458 1393833 1369376 1312916 1235955 1150292 1064915
57015 1064915 985211 913253 849263 793081 744355 702310 666314 636065 610574 587845 566486
57004 566486 546808 529418 513680 498661 484684 472534 461743 450996 439901 429212 419558 410913
56992 410913 403068 395838 389156 383663 380702 381026 383987 388711 395452 404993 417181 430654 443413 453031
56978 453031 457113 454579 446287 433993 419304 403893 389550 377125 366165 356322 348253 342500 338567
56965 338567 336006 335411 337293 340953 345692 352352 362447 376366 393408 412822 433514 453143 468671
56952 468671 477691 478749 471317 456485 437048 415855 394484 374097 356490 343013 333195 325782
56940 325782 320698 318856 320510 325037 332061 341755 354341 370247 390402 415412 444495 475552 505514
56927 505514 529992 543876 544017 531344 509623 482616 453073 423381 395472 370226 347915 329006
56915 329006 313705 301231 290568 281546 274350 268554 263606 259729 257300 255797 254354 252930 251990 251545
56901 251545 251474 252265 254404 257502 260937 264763 269059 273134 276524 280067 284722 289981 294865 300002 307231
56886 307231 317374 329583 342344 353629 360413 359818 351167 335997 316218 293331 269217 246221
56874 246221 226188 210205 199154 193585 193106 196881 204759 217204 234401 256256 283057 315365
56862 315365 353595 398345 450403 509270 571851 633089 687075 727041 746381 742408 719135 684619
56850 684619 645504 605089 565585 529700 499599 476152 459777 450855 449195 454413 467100 488544
56838 488544 519347 559595 610209 672598 746775 830926 922290 1016078 1102861 1169288 1203567
56827 1203567 1200807 1163810 1100498 1021058 935542 851818 774880 707598 651260 605487 568923
56816 568923 540840 521660 511822 511028 518942 535967 562882 600247 648210 706125 771709 840439
56804 840439 905428 957721 987986 990025 963743 914705 850983 780505 709990 644263 585784 535384
56792 535384 493474 460075 434237 414638 400722 392491 389598 391787 399899 415149 437475 465701
56780 465701 498875 535731 572538 602966 620889 622922 608775 580805 543515 502074 460256 419998
56768 419998 382568 349070 319798 294282 272223 253554 237706 223901 212162 202918 195609 188850
56756 188850 181989 175384 169152 162981 157223 152860 150117 148271 146914 146148 145452 143833 141397 139439 138554
56741 138554 137912 136776 135470 134492 133883 133868 134839 136251 136749 135919 134803 134243 133859 133112 132229 131556 131085 131082
56723 131082 132171 134285 136497 138224 139651 140796 141388 141888 143302 145565 147410 148219 148638 148979 148593 147473
56707 147473 146918 147690 148867 149479 150017 151302 153005 154387 155510 156695 157613 157934 158110 158582 158893 158432 157427
56690 157427 156448 155543 154457 153102 151265 148625 145542 143028 141422 139973 138208 136767 136283 136390 136530
56675 136530 136845 137620 138690 139977 141697 143486 144356 144155 143994 144591 145341 145803 146862 149316 152322 154433
56659 154433 155457 156237 157263 158509 160009 161648 162869 163395 163647 163880 163623 162794 162489 163747 166199 168811
56643 168811 171364 174286 177617 181062 184579 188064 190903 192594 193397 193763 193613 192738 191350 189619 187304
56628 187304 184442 181731 179609 177600 175223 172866 171093 169754 168444 167162 165856 164059 161721 159712
56614 159712 158721 158263 157497 156411 155496 154811 154147 153592 153315 153217 153266 153619 154087 154228 154327 155379 157555 159663
56596 159663 160728 161134 161541 161658 160989 159962 159420 159646 160582 162230 164135 165284 165247 164756 164631 164924 165571
56579 165571 166818 168407 169474 169945 170855 172539 173854 174132 174479 175955 177711 178347 178090 178179 178955 180006
56563 180006 181497 183973 187352 191268 195889 201394 207277 213031 218701 223799 226746 226621 224656 222806
56549 222806 221658 220838 220458 220691 220784 219981 218836 218295 218117 217461 216304 215021 213336 211074 209199 208676 208967
56532 208967 208979 208736 208725 208451 207263 205893 205514 205906 206192 206666 208086 209721 210049 209074 208104 207501 206486 205051
56514 205051 204154 203876 203095 201235 198984 197126 195918 195553 195979 196323 195806 195124 195614 197157 198221 197939 196906
56497 196906 196024 195752 196282 197217 197253 195492 192861 191051 190405 190164 190280 191299 192721 193262 192803 192548 193144
56480 193144 194093 195038 196096 196859 196536 195312 194225 193564 192706 191582 190954 191089 191462 191924 192938 194487 195919
56463 195919 196977 197967 198899 199575 200353 201641 202807 202875 202164 201923 202491 203155 203656 204363 205080 205139 204711 204626 204886
56444 204886 204813 204562 205048 206364 207750 209124 211039 213165 214415 214750 215294 216461 217509 218134 218940 219988
56428 219988 220355 219607 218475 217800 217869 218832 220503 221831 221912 221486 222024 223529 224789 225618 226957 228770 229862
56411 229862 230092 230846 232816 235022 236547 237603 238410 238614 238325 238200 238049 236920 234926 233440 233023 232746
56395 232746 231920 230903 229775 227973 225823 224734 225270 226490 227647 228894 229913 229674 228213 226838 225978
56380 225978 224653 222824 222262 223985 226545 228121 228812 229727 231127 232598 233953 234975 235362 235626 236887
56365 236887 239094 240775 241176 241236 241766 242245 242252 242523 243561 244614 245121 245849 247529 249569 251220 252831 254904
56348 254904 256960 258254 258709 258409 257307 256085 256045 257351 258716 259578 261145 264279 267780 270018 271132
56333 271132 272386 274258 276296 278112 279550 280541 281471 282971 284845 286190 286990 288444 291153 294138 296293
56318 296293 297645 298632 299328 299977 301119 302623 303757 304605 306061 308061 309367 309583 309820 310864 312305 314044
56302 314044 316841 320656 324266 327342 331065 335811 340095 342880 345081 347738 350467 352898 355780 359427
56288 359427 362772 365286 368092 371892 375604 378458 381649 386295 391405 395613 399410 403936 408967 413872
56274 413872 419336 426384 434689 443403 452642 462789 473397 484140 495751 508717 522164 535363
56262 535363 549209 564960 582639 601825 622880 646311 672171 701143 734766 773576 816603
56251 816603 863748 916894 977371 1044256 1116630 1195603 1282344 1375814 1474194 1576788 1682618
56240 1682618 1788832 1892641 1993350 2090340 2180269 2258413 2321777 2369162 2399353 2411328 2405393
56229 2405393 2382510 2343448 2289857 2224845 2151008 2069227 1980783 1888900 1796541 1704434 1613069
56218 1613069 1524750 1441553 1363014 1288129 1217967 1153975 1095210 1039885 988349 942044 900564
56207 900564 862191 826416 793707 763749 736134 711745 691341 673694 657151 641922 628843
56196 628843 617149 605651 594935 586193 579063 572728 567845 565123 563254 560613 557782 556108 555025
56183 555025 553202 551024 549510 547993 545411 542783 541901 542639 543866 545742 548705 551505 552865 553970 556776
56168 556776 560957 564904 568456 572263 575952 579422 584312 591552 599156 605257 611450 620071 630131 639402
56154 639402 648658 660029 672735 684575 696494 711588 730400 751139 773842 800407 831065 864700
56142 864700 902344 946801 999262 1059650 1129543 1210916 1302367 1399996 1501181 1603686 1701894
56131 1701894 1788424 1859923 1918131 1965882 2005760 2041846 2078073 2114058 2145616 2169216 2183016
56120 2183016 2184928 2174197 2154761 2132872 2111043 2087342 2059507 2025444 1980476 1919261 1841320
56109 1841320 1751356 1654548 1555275 1459416 1372734 1296603 1229367 1171547 1125293 1089172 1058694
56098 1058694 1032234 1011625 996660 984109 972762 964577 959978 956641 953717 952810 954079 955737 957912
56085 957912 962499 968784 973916 978130 984587 993548 1001747 1008281 1016008 1026107 1036315 1045632 1055820
56072 1055820 1067119 1077346 1086376 1096819 1109289 1121731 1134112 1148719 1165072 1179872 1192883
56061 1192883 1207472 1224429 1240849 1256168 1273441 1293248 1312202 1329044 1346503 1365543 1383514
56050 1383514 1399643 1416601 1434991 1452106 1467803 1485657 1506518 1527002 1546165 1567552 1592668
56039 1592668 1618567 1643841 1670821 1699913 1728168 1755414 1785370 1818812 1852234 1885121 1921436
56028 1921436 1961930 2002362 2041597 2083813 2130142 2175985 2219483 2264823 2314121 2363898 2412760
56017 2412760 2464488 2520244 2575933 2630705 2689721 2754951 2821830 2888661 2960379 3039075 3120005
56006 3120005 3201204 3287710 3381840 3478928 3577341 3682897 3798426 3919038 4042795 4175541
55996 4175541 4319766 4469597 4622598 4785335 4961247 5144704 5333694 5536309 5757535
55987 5757535 5991871 6236467 6498906 6784220 7087476 7407514 7754347 8134232 8541866
55978 8541866 8976716 9452000 9977575 10549911 11169839 11853518 12614188 13450825 14367775
55969 14367775 15387642 16531803 17808448 19235177 20853460 22706439 24826801 27265428
55961 27265428 30109059 33452904 37385190 42021325 47525592 54082317 61891406 71232328
55953 71232328 82505816 96194029 112831419 133030003 157415563 186405486 220009361
55946 220009361 257708547 298071704 337979012 372265672 394888831 401431082 391165426
55939 391165426 367073045 334053371 296928631 259403719 223914457 191811162 163624060
55932 163624060 139378913 118851264 101671056 87368675 75464465 65547586 57271366
55925 57271366 50322766 44439312 39432273 35158979 31486670 28302438 25532757 23123702
55917 23123702 21014929 19151906 17505526 16057234 14777322 13635275 12617314 11715311
55909 11715311 10909843 10180208 9519882 8926734 8388310 7890936 7433264 7017178 6634681
55900 6634681 6276527 5944485 5642452 5364049 5101094 4856022 4634100 4430956 4239209
55891 4239209 4060142 3897829 3748567 3606829 3475249 3358384 3252653 3152498 3060710 2982658
55881 2982658 2915315 2851211 2788375 2727662 2665364 2597447 2526797 2457929 2388652 2314585 2237359
55870 2237359 2160687 2082909 2001355 1919898 1844405 1774483 1707102 1644346 1590024 1542144 1496106
55859 1496106 1452088 1412289 1374330 1334591 1295150 1260514 1230054 1200153 1171035 1145081 1120952
55848 1120952 1095663 1070065 1046526 1023724 999340 975146 953777 933389 911169 889133 870530
55837 870530 853530 834618 815453 799911 786791 771873 755270 740448 727775 715211 703772
55826 703772 696155 691073 684735 676874 669771 662528 651912 638068 624126 610937 597219 583957 573506
55813 573506 564960 555368 544913 536286 529651 522848 515961 511086 508141 505322 503209 504147 508080 512965
55799 512965 518537 525674 532993 538318 542642 548271 553875 555869 554128 551929 550592 548469 544953 541281
55785 541281 537511 532668 527627 523860 519597 511234 498536 484701 471616 459042 448248 442075 440956
55772 440956 442826 447473 457232 472370 488851 501397 506375 501999 488943 471144 453140 436290
55760 436290 419681 403888 390792 380350 370993 362938 357774 354979 352224 349003 346601 344604 340955
55747 340955 335549 330301 325420 319120 311428 304847 300503 296860 293004 290160 288965 287917 285552 281947
55733 281947 277470 272216 267075 263224 260302 257070 253692 251090 248417 243909 238106 233392 230300 227101
55719 227101 223184 219965 218156 216974 216489 218010 221577 225630 229683 234898 241550 248228 253933 258633
55705 258633 261564 261488 258982 256044 253144 249036 243672 238601 234089 228507 221215 213641 206945 200985 196028
55690 196028 193029 191585 189907 187432 185330 184082 182869 181740 182013 183978 186472 189149 192835 197289
55676 197289 201028 203792 206683 209390 209881 207572 204313 201424 198218 194280 190833 188791 187569 186669 186449
55661 186449 186628 186124 185028 184732 185549 186391 187202 189287 192633 195451 197171 199381 202897 206364 208745 210788
55645 210788 212946 214257 214435 214716 215412 214883 212215 208694 205314 201018 194837 187704 180699 173415 165549
55630 165549 158250 152452 147559 143131 140128 139101 138772 137775 136285 134772 132856 130520 128788 127982 127001
55615 127001 125418 124451 124590 124254 122294 119997 118927 118422 116899 114264 111466 108985 107218 106945 107936 108385
55599 108385 107139 105230 103977 103086 101990 101427 101969 102479 101881 101244 102187 104193 105381 105217 104749 104731 105093
55582 105093 105795 106788 107431 107115 106188 105517 105593 106661 108889 111735 114090 115758 117842 120982 124258 126553
55566 126553 127873 128655 128924 128857 128908 128684 127054 124071 121247 119209 116877 113887 111851 111762 112045 110903 109024
55549 109024 108138 108248 108218 107969 108100 108222 107523 106429 106032 106356 106601 106565 106600 106756 107098 108125 109785 110909
55531 110909 110748 110138 110091 110303 110295 110868 112889 115580 117480 118277 118307 117272 114978 112504 111034 110254 109311 108506
55513 108506 108480 108585 107774 106448 105800 105863 105791 105454 105126 104144 101552 97797 94343 91909 90344 89698 89906 89956
55495 89956 88953 87665 87505 88326 88683 87880 86335 84275 81707 79440 78481 78425 77864 76433 75124 74632 74646
55478 74646 74778 74982 74991 74469 73779 73605 73828 73691 73005 72326 72091 72370 73200 74389 75301 75638 75998 76924 77938
55459 77938 78344 78264 77954 76948 75061 73439 73288 74225 75208 76369 78357 80539 81608 81626 81776 82318 82482
55442 82482 82169 82107 82284 81868 80768 79724 78765 77125 74931 73485 73453 74073 74531 74957 75634 76378 77177 78566
55424 78566 80893 83834 86830 89387 90986 91500 91685 92577 94394 96662 99127 101684 103735 104591 104371 103635
55408 103635 102428 100647 98949 98105 97670 96528 94608 92851 91580 90196 88535 87255 86681 86329 85827
55393 85827 85354 85000 84555 84032 83667 83456 83401 83993 85561 87423 88625 89258 89979 90543 90044 88438 86626 85069
55375 85069 83535 82141 81467 81568 81984 82656 83761 84748 84725 83826 83025 82713 82583 82703 83326 83767 82942 81099
55357 81099 79594 78876 78082 76820 75778 75342 75060 74886 75524 77042 78449 79156 79659 80326 80710 80495 79949
55340 79949 79094 77688 76424 76705 78652 80633 81439 81619 81990 82197 81678 80866 80352 79824 78851 77910 77666 77933
55322 77933 78200 78543 79143 79528 79231 78769 79110 80449 82087 83231 83435 82638 81271 80022 79164 78470 77899
55305 77899 77782 78085 78186 77785 77381 77466 77812 77916 77636 77059 76288 75687 75789 76665 77867 79119 80441 81487
55287 81487 81597 80810 80082 80115 80685 81414 82407 83693 84781 85339 85730 86364 86968 86924 85976 84398 82935 82614
55269 82614 83948 86091 87448 87308 86256 84931 83313 81491 80199 80015 80684 81649 82577 83099 82765 81721
55253 81721 80805 80533 80590 80533 80315 79850 78852 77532 76715 76783 77151 77157 76877 76729 76927 77590 78736 79884 80438 80697
55233 80697 81586 83102 83979 83421 82215 81510 81352 81144 80803 80644 80710 80931 81508 82528 83575 84229 84506 84418
55215 84418 83676 82340 81240 81186 82042 82968 83298 82980 82549 82805 84008 85340 85765 85359 84987 84766 83947 82440
55197 82440 81269 81113 81533 82098 83076 84467 85569 86215 87259 88995 90237 89962 88811 87869 86934 85289
55181 85289 83444 82689 83314 84472 85481 86190 86333 85642 84555 83887 83837 83982 84111 84380 84803 85192 85492 85682
55163 85682 85587 85236 85118 85599 86432 87262 88202 89394 90442 90857 90678 90202 89476 88541 87697 87067 86405 85768 85739
55144 85739 86416 86849 86233 85114 84646 85098 85812 86217 86183 85728 85105 84856 85212 85782 86338 87354 89138 90950
55126 90950 91794 91717 91625 92118 93112 94234 94999 94993 94454 94258 94852 95650 95965 95814 95308 94115 92387 91338 91863
55107 91863 93177 93909 93973 94234 94824 95102 94982 95005 95220 95145 94871 95081 95860 96444 96304 95661 94851 94015 93486 93736
55087 93736 94712 95785 96464 96710 96642 96458 96587 97308 98314 99113 99688 100230 100521 100201 99478 98893 98580 98356 98286
55068 98286 98457 98440 97757 96784 96419 96880 97474 97536 97019 96238 95577 95366 95551 95624 95360 95331 96162 97577 98804 99596
55048 99596 100113 100118 99142 97405 95804 94991 94973 95412 95797 95560 94681 93974 94167 95011 95896 96844 98099 99100 98933
55029 98933 97641 96196 95252 94697 94347 94249 94334 94452 94624 94678 94023 92509 91099 90718 90845 90410 89769 90454 92911
55010 92911 95752 97442 97675 96939 95896 95469 96443 98525 100573 102040 103334 104609 105278 105142 104937 105204
54994 105204 105461 105186 104795 104879 105081 104630 103686 103316 104128 105512 106438 106642 106770 107430 108417 109145 109612 110353 111324
54975 111324 111649 110946 110215 110596 111764 112440 112173 111646 111418 111355 111267 111234 111159 110726 109909 108941 107852 106615 105665
54956 105665 105583 106352 107560 109041 110572 111278 110409 108597 107316 107074 107097 106786 106437 106410 106569 106772 107006 106887
54938 106887 105957 104647 104006 104278 104614 104435 104161 104369 105115 106338 108042 109824 111122 112199 114032 116945
54922 116945 120258 123577 127471 132444 138100 143756 149154 154175 158666 162892 167333 171613 174369 174545
54908 174545 172145 167574 161246 154154 147740 142567 137969 133500 129762 127204 125098 122575 119898 117812
54894 117812 116224 114451 112399 110759 110202 110827 112152 113312 113678 113561 113859 114882 116105 117277 118932
54879 118932 121492 124714 128440 133019 138481 144113 149458 154924 160763 166224 170464 173552 175753 176471
54865 176471 174821 170851 165477 159553 153619 148108 143139 138441 134018 130388 127666 125005 121687 118233
54851 118233 115712 114391 113767 113459 113285 112821 111726 110296 109054 108010 106944 106096 105942 106447 107144 107747
54835 107747 108174 108220 107747 107020 106360 105710 104901 104034 103183 102121 100785 99615 98986 98695 98487 98623 99399 100547
54817 100547 101688 102955 104513 105896 106452 106113 105187 103846 102422 101649 101766 101842 100955 99746 99816 101677 104253
54800 104253 106371 107815 108765 109130 108892 108528 108637 109331 110174 110538 110045 108845 107497 106495 105994 106025 106548
54783 106548 107156 107195 106610 106250 106945 108655 110885 113418 116067 118216 119382 120028 121131 123083 125551 128255
54767 128255 131303 134871 139089 144144 150033 156346 162658 168913 175032 180428 184380 186634 187172 185752
54753 185752 182286 177399 171980 166306 160241 154156 148990 145328 142872 140827 138538 135898 133428 131780
54739 131780 130894 129992 128736 127875 128181 129197 129730 129318 128514 127945 127767 127979 128654 129844 131603 133982 136687
54722 136687 139141 141325 144152 148448 153917 159630 165037 169839 173409 175221 175478 174468 171706 166723
54708 166723 160422 154504 149614 145126 140740 137134 134812 133313 131939 130421 128617 126382 124126 122743
54694 122743 122551 122829 122713 122024 121007 119851 118815 118241 118069 117767 117056 116351 116228 116807 117861 119140 120308
54677 120308 120863 120465 119214 117578 116134 115267 114828 114234 113248 112456 112518 113157 113513 113360 113255 113488 113661 113438
54659 113438 113001 112506 111762 110818 110295 110675 111652 112531 112981 113089 112951 112547 111921 111294 111080 111703 113170 114839
54641 114839 115973 116528 117063 117870 118633 118976 118931 118696 118339 117905 117558 117376 117226 116954 116605 116395 116510 116877 117052
54622 117052 116575 115555 114601 114010 113454 112795 112590 113191 113839 113522 112483 111999 112749 114268 115944 117603 118988
54605 118988 119559 119207 118429 117517 116212 114492 113059 112565 112817 113140 113202 113125 113126 113277 113395 113042 111978 110740
54587 110740 110367 111338 113108 114805 116028 116824 117325 117672 118023 118414 118759 119006 119120 118970 118542 118112 117850 117505
54569 117505 117002 117104 118642 121093 122790 122790 121801 120976 120545 120101 119593 119363 119475 119594 119474 119250 119279 119819 120770
54550 120770 121716 122364 122836 123302 123562 123366 122987 122925 123176 123413 123875 125303 127844 130665 132876 134254 134872
54533 134872 134629 133499 131819 130044 128524 127576 127354 127569 127820 128176 128921 129772 130074 129818 129637 129632 129090 127708
54515 127708 126257 125576 125605 125902 126390 127017 127411 127493 127889 128981 130034 130027 129079 128315 128476 129248 129942 130281 130513
54496 130513 131023 131899 132732 133000 132666 132137 131580 130747 129610 128693 128479 128900 129645 130537 131412 132108 132861 134161
54478 134161 135878 137111 137283 136810 136249 135435 134151 133139 133590 135738 138604 141032 142502 143106 143250 143403
54462 143403 143827 144543 145628 147127 148465 148491 146694 144114 142482 142521 143488 144155 143859 142667 141022 139287
54446 139287 137530 135760 134322 133654 133601 133472 132998 132676 132869 133163 133072 132841 132941 133287 133647 134395 136011 138056
54428 138056 139458 139834 139806 139988 140326 140606 141029 141913 143115 144003 143990 143077 141893 141120 140788 140417 139914 139913 140850
54409 140850 142040 142258 141145 139627 138914 139408 140592 141652 142178 142425 142978 144100 145503 146732 147553 147901
54393 147901 147794 147498 147507 148098 149040 149898 150430 150638 150692 150876 151318 151715 151638 151116 150475 149692 148536 147419 147266
54374 147266 148267 149482 150113 150437 150994 151583 151715 151431 150947 150072 148772 147851 148175 149481 150712 151338 151694
54357 151694 152246 153269 155024 157593 160624 163792 167283 171266 175184 178231 180243 181466 181783 180964 179418
54342 179418 177745 175705 172557 168401 164240 160637 157279 154057 151602 150242 149202 147439 144845 142196
54328 142196 140280 139408 139447 139887 140068 139691 139098 138924 139524 140727 142014 142898 143260 143289 143095 142593 141859 141279
54310 141279 141136 141337 141822 142867 144601 146535 147932 148407 147862 146310 144220 142507 141594 140882 139759 138632
54294 138632 138191 138172 137904 137708 138505 140119 141176 140945 140197 139899 140029 140168 140425 141201 142537 144137 145625
54277 145625 146451 146065 144538 142696 141439 141137 141693 142686 143428 143514 143414 143951 145110 145971 145961 145453 144960 144459
54259 144459 143828 143224 142711 142141 141828 142633 144900 147807 150227 151744 152456 152404 151736 150922 150230 149378 148184
54242 148184 147122 146659 146509 146186 145927 146374 147511 148585 148986 148654 147753 146529 145480 145133 145511 146140 146538
54225 146538 146427 145619 144175 142645 141722 141622 142112 143072 144552 146233 147376 147630 147533 147882 148739 149380 149202
54208 149202 148439 147919 148172 148862 149075 148209 146589 145145 144500 144427 144262 143699 142964 142266 141498 140667 140272 140756
54190 140756 141687 142054 141458 140541 140036 139885 139575 138897 137984 137014 136320 136491 137744 139467 140834 141709 142423 142946
54172 142946 142938 142488 142060 141726 141115 140208 139523 139387 139579 139842 140183 140462 140235 139296 138038 137017 136510 136560 137069
54153 137069 137688 138002 137928 137666 137328 137059 137414 138959 141362 143560 144936 145717 146082 145748 144755 143893 143734 143868
54135 143868 143630 143092 142763 142741 142784 142885 143197 143659 144247 145225 146628 147772 147949 147433 147100 147182 147099 146559 146110
54116 146110 146296 146814 147001 146938 147530 149390 151868 153508 153517 152540 151816 151765 151779 151318 150652 150388 150743 151597 152880
54097 152880 154512 156150 157421 158347 159311 160612 162131 163331 163566 162644 161221 160391 160725 161842 162976 163719
54081 163719 164138 164534 165230 166340 167588 168650 169776 171742 175011 179330 184287 189826 195993 202708 210158
54066 210158 218973 229389 240384 250024 256567 259050 257267 251718 243552 234156 224728 216213 209273 203984
54052 203984 199859 196442 193674 191545 189842 188601 188285 188999 189954 190467 191172 193412 197419 201913 205732
54037 205732 209172 213355 218745 224772 230632 236029 241129 246135 250983 255390 259112 262186 264939 267686
54023 267686 270347 272391 273284 273122 272679 272715 273350 274255 275150 275752 275436 273581 270321 266447 262438 258116 253429
54006 253429 248928 245090 241650 238075 234395 231151 228759 227282 226608 226534 226857 227622 229013 230858 232590
53991 232590 233901 234972 235817 235975 235256 234194 233063 230977 226754 220480 213555 207334 202401 198854 196471
53976 196471 194505 192098 189167 186402 184327 182860 181856 181468 181737 182294 182800 183366 184328 185777 187454 188902
53960 188902 189665 189599 189098 188874 189403 190695 192462 194320 195949 197355 198930 201014 203415 205669 207710 210015
53944 210015 213063 216878 221067 225111 228681 231823 234789 237610 240095 242434 245367 249335 253792 257915
53930 257915 261764 266134 271387 277145 283207 290131 298682 309202 321695 336039 351742 367803 382981
53917 382981 396017 405552 410454 410735 407955 404330 401366 399379 398072 397219 396788 396606 396163 394845 392401
53902 392401 389086 385313 381341 377396 373831 370794 367855 364321 359995 355365 350969 346714 341900 335847
53888 335847 328498 320460 312391 304425 296429 288690 281829 275845 269951 263821 258410 254756 252366 249730
53874 249730 246294 242935 240383 238163 235510 232476 229552 226808 224053 221464 219366 217593 215626 213267
53860 213267 210690 207987 205163 202592 200874 200072 199489 198500 197257 196277 195610 194831 193764 192690 191745 190569
53844 190569 188891 187147 186138 186234 187288 189076 191316 193386 194639 195090 195252 195192 194414 192850 191359 190868
53828 190868 191500 192802 194237 195075 194537 192706 190761 189703 189423 189615 190796 193338 196087 197325 197017 196812
53812 196812 197767 199265 200476 201662 203484 205979 208906 212417 216714 221503 226337 231128 235900 240509
53798 240509 244959 249560 254330 258665 262085 264929 267933 271399 275157 278908 282174 284315 285166 285404 285742
53783 285742 285968 285337 283718 281726 279704 277163 273517 269009 264577 260928 257942 254956 251433 247323 242912
53768 242912 238601 234836 231874 229410 226679 223323 219920 217257 215285 213380 211429 209890 208724 207175
53754 207175 204966 203015 202376 202929 203650 203801 203338 202486 201509 200760 200436 200268 199799 198943 198027 197388 197151 197261
53736 197261 197555 197955 198705 200123 201935 203209 203331 202756 202405 202606 203035 203475 204073 204896 205756 206623 207834
53719 207834 209708 212096 214371 215822 216163 215844 215815 216742 218426 220043 220998 221506 222456 224626 227869 231109
53703 231109 233426 235064 236964 239351 241480 242963 244561 247131 250506 254164 258350 263470 268624 272033
53689 272033 273145 273303 273864 274515 274106 272535 270930 270190 270154 270228 270190 270068 269623 268436 266505 264504 263279
53672 263279 263124 263609 264098 264272 264110 263566 262528 261153 260002 259685 260377 261707 263012 263687 263394 262151 260321
53655 260321 258474 257136 256483 256222 255868 255265 254766 254810 255368 255966 256271 256466 256975 257900 258833 259241 258972 258426
53637 258426 258276 258961 260321 261688 262458 262662 262915 263740 265131 266932 269335 272587 276240 279324 281469 283396
53621 283396 285915 288865 291526 293743 295989 298518 301196 304177 307989 312700 317573 321915 325851 329931
53607 329931 334469 339567 345356 351662 357742 362953 367609 372641 378403 384225 389152 392667 394615 394903
53593 394903 393650 391400 388837 386240 383391 380029 376272 372611 369567 367299 365417 363203 360271 357076
53579 357076 354526 352919 351505 349416 346777 344373 342357 340034 337140 334519 333063 332581 332391 332483 333246
53564 333246 334351 334933 334873 335033 336094 337901 340080 342469 344660 345908 346003 345623 345456 345468 345405 345414 345702 346134
53546 346134 346698 347889 350068 352804 355431 357927 360678 363693 366699 369821 373558 378146 383413 389153
53532 389153 395208 401341 407540 414324 422267 431333 441123 451587 462861 474492 485570 495840 506114
53519 506114 517350 529757 543022 556962 571618 587054 603418 621057 640237 660830 682432
53508 682432 704723 727519 750592 773740 797035 820741 844793 868489 890956 911979 932150
53497 932150 952093 971755 990656 1008557 1025615 1042000 1057834 1073487 1089471 1105970 1122754
53486 1122754 1139628 1156558 1173369 1189753 1205718 1221600 1237452 1252838 1267389 1281158 1294256
53475 1294256 1306556 1317898 1328072 1336416 1342005 1344582 1344770 1343041 1339071 1332528 1323876 1313842 1302616
53462 1302616 1290097 1276411 1261675 1245874 1229603 1214213 1200276 1186407 1170616 1152467 1132985
53451 1132985 1112953 1092557 1072484 1053836 1036632 1019558 1001579 982910 964162 945633 927958
53440 927958 912412 899817 889758 881477 874963 870586 868189 867139 866877 866941 866919 866990 868094 871008 875481
53425 875481 880807 886927 894381 903398 913671 924954 937350 950964 965744 981796 999488 1019050
53413 1019050 1040249 1062560 1085613 1109474 1134573 1161326 1189819 1219897 1251548 1285010 1320466
53402 1320466 1357785 1396579 1436419 1477064 1518749 1562227 1608148 1656330 1705971 1756584 1808307
53391 1808307 1861155 1914533 1967760 2020675 2073300 2125275 2176063 2225409 2273079 2318352 2360344
53380 2360344 2398899 2434664 2468178 2499206 2527094 2551419 2572064 2588904 2601683 2610139 2614044 2613040
53368 2613040 2606570 2594067 2575130 2549494 2516914 2477437 2431993 2382580 2331525 2280345 2229285
53357 2229285 2177822 2125456 2072195 2018670 1965945 1915017 1866354 1820014 1776091 1734702 1695416
53346 1695416 1656970 1617916 1577579 1536439 1495705 1456572 1419655 1384899 1352057 1321192 1292663
53335 1292663 1266657 1242980 1221292 1201372 1183120 1166579 1152050 1139911 1130030 1121444 1112742 1102814
53323 1102814 1091369 1078952 1066535 1054870 1044090 1034000 1024655 1016372 1009200 1002773 996911 992072
53311 992072 988956 987802 988329 990236 993526 998323 1004493 1011468 1018500 1025344 1032759 1042160 1054583 1070017
53297 1070017 1087734 1107048 1127669 1149580 1172770 1197031 1221947 1247226 1273071 1299867 1327290
53286 1327290 1354026 1378721 1401104 1421840 1441404 1459515 1475719 1490042 1502707 1513303 1520624
53275 1520624 1523550 1522080 1517375 1510786 1502913 1493578 1482384 1469033 1453229 1434687 1413423 1389860
53263 1389860 1364565 1338065 1310940 1283828 1257053 1230364 1203230 1175330 1146633 1117216 1087376
53252 1087376 1057926 1029985 1004141 979840 955808 931146 906002 881163 857171 833939 811113
53241 811113 788568 766488 745173 724918 705938 688120 670896 653624 636310 619932 605846
53230 605846 594725 586000 578426 571193 564361 558168 552216 545705 538292 530220 521579 511979 501197 489669
53216 489669 478004 466396 454827 443471 432482 421755 411424 402255 394884 388819 382817 376241
53204 376241 369477 363066 357020 351063 344987 338633 332021 325592 319866 314704 309433 303846 298582 294273
53190 294273 290773 287545 284387 281382 278477 275529 272640 270014 267548 264836 261701 258583 256279 255229
53176 255229 255052 254856 254042 252689 251204 249965 249401 249844 250842 251086 249676 247192 244877 243059 241168 239064
53160 239064 237340 236242 235322 234378 233757 233395 232539 230956 229563 229174 229343 229188 228738 228639 228979 229202 228972 228395
53142 228395 227592 226655 225845 225304 224774 224083 223617 223752 224159 224365 224732 226032 228077 229622 229820 229146 228626 228713
53124 228713 229227 229945 230821 231815 232811 233695 234371 234748 234752 234351 233611 232778 232180 231959 231994 232137 232315 232344 231948 231145
53104 231145 230302 229558 228519 226865 224988 223606 222902 222454 221921 221378 221036 220999 221342 222050 222834 223249 223094 222539
53086 222539 221858 221184 220526 219936 219698 220282 221897 223968 225433 225756 225401 225095 224980 224842 224790 225099 225532 225379
53068 225379 224277 222571 220812 219212 217680 216090 214364 212472 210491 208634 207148 206128 205417 204738 204050
53053 204050 203695 203983 204725 205522 206433 207856 209713 211385 212624 213844 215157 215818 215200 213843 212864 212681
53037 212681 212940 213305 213675 213851 213753 213777 214342 215210 215858 216265 216614 216478 215230 213246 211759 211319 211236 210841 210479
53018 210479 210762 211520 212148 212607 213374 214513 215310 215021 213742 212427 212031 212636 213461 213745 213490 213267 213506 214169
53000 214169 214890 215207 214859 214099 213462 212979 211988 210146 208225 207293 207379 207658 207765 208128 209011 210048 210919 211771
52982 211771 212711 213449 213799 214088 214767 215991 217742 219975 222416 224583 226214 227392 228157 228376 228133 227890
52966 227890 228058 228722 229805 231148 232390 233234 233885 234722 235475 235306 233930 232114 230747 229888 228989 227635
52950 227635 225695 223195 220466 218112 216484 215388 214541 214044 214196 215121 216701 218518 219744 219607 218256
52935 218256 216665 215396 213985 211981 210028 209255 209875 211045 211906 212240 212206 212003 211796 211594 211230 210705 210366
52918 210366 210384 210323 209728 208976 208962 209949 211338 212599 213822 215107 216000 216029 215460 215038 215092 215316 215409 215465 215612 215617
52898 215617 215148 214267 213380 212745 212324 212078 212080 212226 212188 211902 211898 212832 214783 217183 219258 220326 219967 218343 216277
52879 216277 214667 213831 213629 213978 214806 215683 216061 215939 215810 215952 216218 216567 217292 218571 220302 222448 225061
52862 225061 227795 229913 230979 231149 230603 229268 227334 225500 224301 223559 222798 221831 220656 219268 217874
52847 217874 216850 216086 214850 212783 210604 209298 208934 208735 208008 206551 204505 202413 201066 200694 200538 199833
52831 199833 198928 198729 199279 199743 199780 199999 200856 201927 202701 203392 204387 205288 205206 203957 202503 202099 203203 205240
52813 205240 207268 208794 209957 211030 212022 212897 213956 215593 217561 218823 218405 216311 213481 210931 208988
52798 208988 207308 205466 203481 201723 200425 199406 198329 197105 195922 194984 194329 193879 193572 193463 193710 194427
52782 194427 195518 196731 197814 198554 198773 198520 198186 198163 198404 198682 199178 200289 201736 202489 201942 200668 199633
52765 199633 199106 198869 199013 199755 200689 201025 200626 200182 200253 200737 201359 202081 202780 203127 203176 203564 204657 205825 206169
52746 206169 205806 205908 207306 209493 211212 211846 211963 212542 213942 215742 217437 219006 220724 222603 224224
52731 224224 225112 225171 224813 224751 225616 227563 230108 232336 233350 232709 230661 227944 225186 222480 219718 217225
52715 217225 215658 215087 214693 213773 212720 212489 213277 214291 214738 214426 213363 211524 209393 208147 208626 210337
52699 210337 211978 212868 213378 214021 214697 215028 214958 214643 214057 213132 212172 211677 211721 211892 211972 212314 213289 214630 215684
52680 215684 216221 216652 217449 218622 219831 220769 221291 221384 221184 220967 220970 221183 221334 221142 220624 220165 220163 220555 220812 220488
52660 220488 219664 218843 218625 219568 221917 225123 227934 229544 230536 232235 235099 238165 240059 240125 238550 235967
52644 235967 233154 230664 228517 226466 224618 223380 222776 222343 221849 221597 221766 222008 222065 222334 223369 225093
52628 225093 226933 228492 229796 231041 232367 233602 234115 233277 231317 229273 227839 226764 225735 225169 225471
52613 225471 226019 225772 224672 223679 223468 223804 224212 224550 224776 224743 224404 223859 223093 222080 221179 220940 221379 221955
52595 221955 222434 223338 225178 227604 229734 231121 232044 232838 233331 233080 232050 230831 230171 230359 231125 232054 232923
52578 232923 233692 234382 234967 235239 234842 233683 232277 231342 231035 230949 230864 230994 231420 231890 232470 233740 235782 237495
52560 237495 237588 236075 234156 232765 231780 230644 229218 227888 227126 227050 227363 227718 228166 228932 229794 230192 230099 230182
52542 230182 230712 230945 230138 228650 227384 226586 225921 225346 225092 225027 224840 224710 225051 225757 226400 227008 227885 228865
52524 228865 229612 230484 232091 233970 234730 233772 231974 230476 229605 229238 229306 229587 229798 230303 231953 234790 237680
52507 237680 239793 241725 244469 247849 250664 252027 251932 250830 249238 247608 246099 244583 243184 242519 242970
52492 242970 243985 244596 244445 243886 243176 242102 240477 238615 237118 236316 236037 235955 236121 236996 238830 241147 243024
52475 243024 243855 243687 243048 242720 243391 244965 246350 246504 245701 245200 245673 246607 247358 248092 249403 251542 254335
52458 254335 257401 260166 262099 263144 263580 263387 262265 260408 258579 257142 255605 253440 250795 248069 245384
52443 245384 242877 240938 239667 238566 237260 236052 235360 235015 234619 234160 233773 233294 232589 231986 231902 232288 232833
52426 232833 233393 233872 234141 234460 235487 237334 239104 239928 240082 240470 241478 242981 245034 247690 250418 252565
52410 252565 254341 256719 260430 265691 272684 281546 291898 303000 314252 324844 333065 336949 335889
52397 335889 330998 323733 314841 304874 294954 286389 279766 274754 270666 267046 263922 261651 260388 259745
52383 259745 259156 258555 258409 259133 260729 262946 265445 267813 269742 271292 272786 274474 276480 278917 281813
52368 281813 285040 288620 292881 297907 302918 306685 308562 308818 308090 306904 305576 304153 302443 300518 299057
52353 299057 298738 299375 300142 300616 301130 302132 303730 305851 308301 310638 312496 314108 316030 318357 320777
52338 320777 323382 326683 330667 334602 338108 341808 346519 352396 359286 367297 376420 386075 395734 405767
52324 405767 417055 429897 443852 458553 474073 490410 507086 523480 539257 554333 568693
52313 568693 582490 596163 610230 624872 639838 654771 669537 684091 698105 711063 722917
52302 722917 734358 746100 758003 769289 779551 789068 798059 806141 812740 817646 820820 822014 820994
52289 820994 817926 813196 807011 799589 791645 784209 777836 772326 767385 763224 760210 758171 756525 755161
52275 755161 754787 756071 758709 761765 764884 768702 774008 780946 789223 798535 808373 817836 826278 834093
52261 834093 842363 851792 862324 873620 885359 897099 908436 919501 930838 942596 954144 964601
52249 964601 973421 980418 985627 989353 992033 993819 994448 993486 990476 985023 977333 968629 960394 953006 945674
52234 945674 937803 929706 921676 913286 904291 895530 888065 881816 875891 869968 864480 859575 854880 850434
52220 850434 846954 844836 843554 842476 841726 841798 842719 844143 846047 848831 852706 857349 862216 867043 871937
52205 871937 877053 882198 886792 890322 892870 895039 897357 899917 902681 905881 909879 914700 919881 924793
52191 924793 929032 932583 935751 938890 942072 944984 947191 948455 948719 947830 945417 941110 934884 927174 918701
52176 918701 910146 901958 894408 887699 881871 876587 871341 866027 861188 857441 854754 852583 850767 849926
52162 849926 850764 853147 856149 858917 861253 863382 865438 867301 868853 870203 871625 873239 874766 875702 875881
52147 875881 875847 876501 878302 880870 883386 885299 886580 887369 887522 886603 884422 881527 878967 877453 876851 876660
52131 876660 876798 877729 880001 884067 890442 899585 911441 925499 941477 959579 979881 1001876 1024995
52118 1024995 1049239 1074731 1100785 1126019 1149554 1171729 1193403 1214792 1235212 1253838 1270503
52107 1270503 1285657 1299651 1312144 1322367 1329990 1335614 1340314 1344863 1349445 1353858 1357663 1360276 1361286
52094 1361286 1360778 1359089 1356123 1351103 1343116 1331881 1317912 1302099 1285227 1267875 1250620 1234194
52082 1234194 1219359 1206680 1196450 1188742 1183338 1179629 1176884 1174762 1173479 1173507 1175324 1179436 1186119 1194852
52068 1194852 1204379 1213779 1223299 1233764 1245337 1257290 1268922 1280177 1291231 1301937 1311933 1321167
52056 1321167 1330020 1338920 1347842 1356214 1363358 1369029 1373350 1376142 1376624 1374081 1368605 1360854 1351232 1339751
52042 1339751 1326629 1312553 1298203 1283801 1269276 1254585 1239819 1225210 1211119 1197851 1185429
52031 1185429 1173775 1163008 1153234 1144030 1134524 1124167 1113168 1102026 1090861 1079441 1067632 1055644
52019 1055644 1043931 1032991 1023130 1014282 1006063 998055 990019 981907 973819 965913 958172 950312 942028
52006 942028 933327 924331 914811 904128 891632 876923 859876 840891 821201 802444 785576 770396
51994 770396 756322 743321 731758 721526 711836 701976 691968 682326 673341 664829 656511 648290 639990
51981 639990 631037 620831 609422 597494 585546 573419 560820 548021 535734 524529 514735 506664
51969 506664 500552 496335 493865 493267 494741 498084 502723 508189 514231 520583 527018 533551 540151 546213
51955 546213 550761 553208 553591 552080 548659 543406 536713 529139 521336 514113 508211 503982 501573 501306 503470
51940 503470 507832 513888 521612 531337 542881 555398 568226 581206 593879 605034 613486 618833 621114
51927 621114 620224 616196 609694 601670 592640 582650 571834 560738 550156 540765 532818 526260 521384 519230
51913 519230 520780 525895 533712 544075 557549 573627 589783 602954 611339 614261 611269 602574 589997
51900 589997 576329 563585 552370 542624 534119 526200 517829 508154 496771 483630 469241 454873
51888 454873 441871 430702 421066 412808 406165 401200 397726 395862 396063 398405 402347 407408 413597 421010
51874 421010 429418 438432 447729 456906 465421 472737 478290 481420 481851 480232 477545 473775 467850 459301
51860 459301 449461 440471 433465 428226 424351 421973 421263 421809 422884 424150 425814 428021 430176 431050 429717
51845 429717 426403 422192 417859 413236 407903 402238 397369 394018 391695 389257 386169 383077 381134 380877
51831 380877 381807 382968 383828 384565 385654 387269 389110 390672 391555 391520 390423 388277 385407 382387 379755 377881
51815 377881 377084 377566 379049 380778 382267 383897 386386 389737 393115 395719 397273 397649 396611 394251 391265
51800 391265 388456 386216 384653 383845 383633 383457 382694 380966 378028 373814 368846 364120 360196 356843 353996
51785 353996 352448 352869 354519 355811 356066 355956 356224 356762 357001 356493 354911 352201 349151 347284 347684 350224
51769 350224 354208 359410 366080 374190 383150 392313 401461 410755 420237 429352 436948 441894 443800 443060
51755 443060 440289 435922 430355 424130 417703 411170 404403 397438 390652 384559 379462 375282 371729 368681
51741 368681 366326 364995 365033 366865 370796 376457 382712 388581 394068 399691 405287 409908 412972 414960 416717
51726 416717 418520 420232 422043 424481 427620 430602 432095 431210 428023 423392 418372 413750 409990 407402
51712 407402 406082 405669 405276 403985 401588 398856 396932 396413 397167 399062 402425 407285 412445 416025 417103
51697 417103 416291 414578 412365 409958 408191 407775 408472 409664 411359 413769 416057 416475 413961 409002 402868
51682 402868 396658 391151 386887 383923 381901 380545 379805 379610 379946 381154 383499 386355 388570 389892 391387
51667 391387 394223 398643 404444 411597 419778 427867 434684 439859 443309 444282 441759 435844 428170 420945
51653 420945 415985 414456 416818 422763 431528 442315 454087 465078 473040 476269 474305 467722 457657
51640 457657 445548 432844 420579 409200 398778 389282 380703 373183 366976 362102 358100 354494 351513
51627 351513 349985 350397 352338 354958 357571 359622 360465 359703 357642 355058 352518 350183 348183 346784 346102
51612 346102 346018 346452 347397 348457 348777 347906 346534 345907 346483 347568 348367 348981 350193 352584 356137 360543 365640
51595 365640 371616 378914 387796 397817 407722 415916 421000 422045 418913 412604 404960 397624 391369 386518
51581 386518 383548 382811 383997 386588 390876 397913 408332 421657 436925 453419 470492 487259 503158
51568 503158 518735 535187 552795 569994 584394 594831 602451 609953 620071 634807 655552 683133
51556 683133 717456 757332 800659 844480 885064 918915 944364 961786 971814 973819 966718 950711
51544 950711 927289 897756 862861 823943 783286 742748 702780 663386 625486 590662 559891
51533 559891 533220 510512 491784 476684 464189 453240 443573 435651 429730 425271 421454 418118 415700
51520 415700 414175 412611 410233 407541 405721 405192 405359 405680 406128 406568 406566 406197 406243 406993 407412 406135 402973
51503 402973 398874 394681 390531 386351 382300 378660 375660 373531 372416 372111 372104 371872 371037 369355 366859 364038
51487 364038 361643 360150 359466 359150 358777 358068 356806 354856 352378 349932 348112 346927 345666 343573 340568
51472 340568 337181 333934 331018 328465 326314 324545 323037 321604 320029 318267 316793 316398 317281 318614 319462
51457 319462 319919 320751 322099 323325 324126 325054 326688 329031 332008 335993 341392 348181 356228 365731 377018
51442 377018 390292 405656 422758 439981 454572 464260 468690 469036 466702 462846 458675 455266 452825
51429 452825 450342 446039 438328 426878 413200 399882 388805 380122 373016 366957 361870 357686 354415
51416 354415 352460 352161 353116 354506 356024 358023 360700 363725 366774 369980 373589 377421 380904 383542 385265
51401 385265 386437 387607 389204 391370 393946 396536 398691 400314 401890 404043 406826 409763 412658 416028
51387 416028 420572 426575 434085 443415 455217 470179 488854 511613 538716 570548 607726 650571
51375 650571 698489 750304 805059 861671 917538 968426 1010579 1042663 1065099 1077977 1080345 1071418
51363 1071418 1051708 1022755 986239 943615 896441 846676 796382 747056 699563 654918 614629
51352 614629 579587 548964 521268 496498 476097 460509 448015 436647 426144 417115 409357 402216
51340 402216 395851 390693 386079 380788 374907 369929 366847 365109 363591 361688 359243 356226 352839 349442
51326 349442 346211 343210 340669 338650 336683 334374 332226 331105 330984 331025 330835 330787 331128 331699 332666 334572
51310 334572 337346 340103 342331 344531 347256 350172 352572 354378 356126 358214 360398 361796 361387 358931
51296 358931 355465 352338 349667 346316 341480 335635 329801 324626 320533 318044 317353 317998 319388 321369 323986
51281 323986 327175 330996 335730 341328 347079 352201 356432 359765 361964 362780 362351 361076 359351 357696 356849
51266 356849 357304 358930 361277 364081 367245 370539 373508 375557 376020 374516 371372 367430 363313 359220 355489
51251 355489 352728 351042 349585 347485 344962 343078 342538 343133 344264 345590 347095 348794 350452 351557 351672
51236 351672 350842 349524 348050 346359 344364 342280 340401 338766 337290 336011 334938 333775 332134 330073
51222 330073 328289 327620 328345 329986 331855 333711 335675 337577 338883 339529 340380 342317 345162 348060 350758
51207 350758 353776 357358 361097 364750 368720 373325 378073 382073 384794 386150 386217 385161 383158 380164 376054
51192 376054 371224 366658 363151 360730 359046 357951 357403 357194 357138 357345 357997 358948 359817 360342 360552 360729 361250
51175 361250 362289 363630 364984 366427 368159 369911 371059 371453 371651 372209 373117 374021 374608 374641 374141 373658 373861
51158 373861 374669 375228 374943 374062 373118 372385 372056 372264 372608 372326 371355 370585 370605 370838 370517 369829 369375 368990 367983
51139 367983 366251 364289 362235 359747 356871 354278 352420 351001 349528 348034 347011 346812 347269 347851 348179
51124 348179 348457 349289 351065 353676 356850 360408 364086 367430 370197 372586 374895 377150 379265 381317 383513
51109 383513 386109 389392 393325 397125 399760 401121 402192 403745 405402 406309 406198 405353 404069 402669 401561
51094 401561 400705 399464 397506 395442 394026 393191 392505 392038 391999 391933 391234 390223 389834 390308 390971 391241 391093 390586
51076 390586 389726 388890 388648 389097 389990 391480 393967 397145 400027 402226 404536 407939 412614 418228 424601
51061 424601 431754 439786 449115 460381 473523 487090 498947 507807 514112 519602 526139 534770 545696
51048 545696 558884 574265 591118 607699 622159 633827 643037 649760 653040 651961 646657 638172 627834
51035 627834 617019 606902 597753 588586 577895 564808 549547 533104 516768 501722 488686 477831
51023 477831 469133 462745 458921 457630 458421 460699 464147 468847 474987 482436 490651 499042 507286 515225
51009 515225 522647 529442 535919 542731 550342 558632 567057 575282 583722 593363 604755 617237 629389
50996 629389 640359 650444 660419 670744 681487 692381 702551 710727 716326 720030 722843 724943 726036
50983 726036 726549 727717 730441 734545 739123 743259 746534 749331 752636 757270 763527 771874 783487 799363
50969 799363 819196 842023 867895 897994 933025 972411 1015358 1061772 1111560 1163699 1216815
50958 1216815 1270406 1324831 1380104 1435132 1488155 1537659 1582726 1622675 1656680 1684061 1704996
50947 1704996 1720577 1731918 1739532 1743929 1746514 1749227 1753364 1759053 1765563 1771402 1774266 1771913 1763593
50934 1763593 1750345 1733839 1715346 1695722 1675525 1654656 1632289 1607479 1579584 1548070 1512518
50923 1512518 1473179 1431136 1387538 1342829 1296883 1249690 1201877 1154855 1110381 1069479 1031773
50912 1031773 996363 963384 934018 908884 887219 867957 850813 835711 821846 808164 794471
50901 794471 781456 769789 759712 751223 744028 737438 730919 724731 719536 715417 711759 708185 705124
50888 705124 703255 702707 703038 703779 704807 706271 708317 710893 713674 716224 718349 720443 723422 728116 734604
50873 734604 742276 750625 759798 770248 782088 795037 808750 822890 837191 851896 868034 886753
50861 886753 908444 932936 960354 991180 1025573 1063438 1105275 1152190 1204755 1262607 1325608
50850 1325608 1394770 1471473 1556196 1648480 1747657 1853021 1963627 2078639 2197765 2320813
50840 2320813 2446754 2573486 2698326 2818237 2929758 3029300 3113834 3181312 3230659 3261783
50830 3261783 3275651 3274168 3259865 3235622 3204357 3168693 3131044 3094189 3061484 3036060 3019706
50819 3019706 3012483 3013119 3019355 3027976 3035062 3036681 3029587 3011509 2981000 2937220 2879936 2809690 2727713
50806 2727713 2635448 2534274 2425936 2313087 2198989 2086633 1978404 1876420 1782525 1697717
50796 1697717 1621974 1554894 1496243 1445839 1403303 1368129 1339700 1317289 1300553 1289957 1285892
50785 1285892 1287086 1290712 1294495 1297939 1300998 1302607 1301656 1298748 1295561 1292512 1288236 1281486 1272510 1262238
50771 1262238 1251047 1238787 1225223 1209881 1192049 1171569 1149200 1125731 1101152 1075318 1049067
50760 1049067 1023878 1000548 978966 959226 942163 928407 917523 908634 901522 896547 893717 892574
50748 892574 892997 895477 900325 907148 915503 925740 938855 955767 977071 1003140 1033976 1069140 1108355
50735 1108355 1152088 1201039 1255045 1312987 1373758 1436836 1501841 1568079 1634769 1701329 1767237
50724 1767237 1831935 1895007 1956124 2014621 2069406 2119291 2162949 2198464 2223486 2236284 2236466 2224613
50712 2224613 2201721 2169419 2130479 2088654 2047845 2011257 1980789 1956939 1939436 1928106 1922943
50701 1922943 1923449 1928361 1936099 1944945 1952606 1956263 1953459 1942620 1922616 1892526 1852433 1803969 1749573
50688 1749573 1691476 1631759 1572807 1516913 1465516 1419310 1378847 1344534 1316311 1294003 1277938
50677 1277938 1268671 1266164 1269826 1279416 1295337 1317829 1346289 1379640 1417036 1457739 1500226 1541849
50665 1541849 1579862 1613065 1642165 1668272 1691325 1710495 1725856 1738806 1750731 1762005 1772517
50654 1772517 1782286 1791076 1798189 1803375 1807500 1811732 1816569 1822264 1829637 1839713 1852926 1869507 1890348
50641 1890348 1916608 1948563 1985545 2026763 2071350 2117672 2163521 2207249 2248183 2285998 2320428
50630 2320428 2351753 2380884 2408732 2435959 2463318 2491191 2517789 2537777 2543355 2527730 2488864
50619 2488864 2430934 2362382 2292026 2226247 2168811 2121821 2085979 2060606 2044622 2037549 2038906 2046837
50607 2046837 2058252 2070380 2081347 2089180 2091227 2085123 2069677 2044455 2009035 1963387 1908759 1847700
50595 1847700 1783053 1716993 1650864 1585752 1523038 1464208 1410066 1360459 1315028 1273890 1237286
50584 1237286 1204896 1176007 1150075 1126624 1104922 1084395 1065258 1048131 1033210 1020375 1009860
50573 1009860 1002046 996791 993776 993361 996133 1001610 1008394 1015790 1024358 1034620 1046222 1058825 1072940
50560 1072940 1089301 1108019 1128970 1152509 1179261 1209561 1243414 1280510 1319886 1360008 1399573
50549 1399573 1437911 1474431 1508302 1539084 1567229 1593612 1618967 1644061 1669912 1697418 1727209
50538 1727209 1760135 1797391 1839777 1887327 1940015 1998284 2062486 2132415 2207988 2289900 2379047
50527 2379047 2475689 2579628 2690626 2807925 2929735 3053903 3178832 3303066 3424202 3538899
50517 3538899 3643833 3736084 3812803 3871332 3909881 3927745 3924905 3901672 3858544 3795957 3714494
50506 3714494 3615912 3503926 3383533 3259614 3136512 3018467 2909586 2813256 2732181 2668964
50496 2668964 2625949 2604141 2602727 2619829 2653307 2700551 2757845 2820261 2882072 2937159 2979308
50485 2979308 3002605 3002144 2975095 2921603 2844603 2748400 2637324 2515652 2388141 2259663 2134074
50474 2134074 2013737 1900145 1794490 1697425 1608788 1528034 1454893 1389439 1331622 1280941 1236549
50463 1236549 1197578 1163333 1133282 1107023 1084496 1066185 1052763 1044238 1039588 1037400 1036678 1036822 1037146
50450 1037146 1036935 1035958 1034556 1033251 1032581 1033214 1035757 1040305 1046464 1053848 1062255 1071293 1080282 1088670 1096284
50435 1096284 1103039 1108785 1113745 1118783 1124854 1132306 1141044 1151291 1163730 1178671 1195423 1212819 1230373
50422 1230373 1248641 1268459 1290093 1313342 1338189 1364976 1394016 1425497 1459961 1498503 1542193
50411 1542193 1591390 1645693 1704347 1766438 1830929 1896783 1962973 2028216 2090897 2149469 2202773
50400 2202773 2249830 2289657 2321609 2345496 2360743 2365507 2357273 2334533 2297623 2248062 2187659 2118501
50388 2118501 2043214 1964795 1886232 1810367 1739744 1676262 1621132 1575292 1539676 1514905 1501028
50377 1501028 1497749 1504567 1520320 1542837 1569415 1597545 1624838 1648467 1665297 1672756 1669380 1654571
50365 1654571 1628356 1591614 1546174 1494275 1437938 1378993 1319434 1261370 1206522 1155852 1109491
50354 1109491 1066823 1026785 988521 951981 917822 886735 859036 834886 814534 798087 785171
50343 785171 775157 767793 763531 763204 767370 775835 787690 801835 817591 834691 852466 868973 881192
50330 881192 886411 883748 874632 861923 848432 835867 824788 815304 807647 802115 798670 796871 796249
50317 796249 796610 797931 800081 802801 805851 808996 811838 813953 815422 817018 819512 822759 825894 828510
50303 828510 831148 834310 837459 839692 841092 842697 845147 848176 851545 855601 860474 865457 869773 873439
50289 873439 876767 879515 881263 882277 883297 884687 886519 889232 893275 897981 901583 902678 901333 898725
50275 898725 896218 894897 895367 897631 901341 906208 911925 917839 923153 927426 930374 931444 930276 927633
50261 927633 925049 923356 922175 921031 920190 920076 920550 921261 922206 923536 925442 928684 934689 944508 958081
50246 958081 975019 995635 1020459 1049064 1080072 1112213 1144726 1176812 1207431 1235879 1262208
50235 1262208 1286913 1310427 1332947 1354474 1374813 1393367 1408746 1418627 1420516 1413077 1396637 1372281
50223 1372281 1340900 1303516 1262138 1219583 1178305 1139694 1104534 1073740 1048400 1029097 1015107
50212 1015107 1004155 993032 978720 959218 933884 903637 870958 839047 810318 785566 764510
50201 764510 746716 731783 719164 708326 699066 691365 685049 679743 675022 670504 666011 661704 657771
50188 657771 653900 649479 644414 639255 634270 629009 623163 617366 612624 609303 607079 605462 603937 602055
50174 602055 599950 598435 598033 598277 598443 598563 599087 600026 601160 602757 605246 608439 611923 616008 621353 627777
50158 627777 634372 640835 647784 655709 664608 674812 687005 700871 714686 726958 737778 747817
50146 747817 756618 762871 766134 767376 767832 768042 768192 768806 770693 774491 780686 790022 803570 822178 845958
50131 845958 874521 907715 945861 989127 1036942 1088261 1142202 1198043 1254686 1310589 1364416
50120 1364416 1415620 1464458 1511732 1558508 1605717 1653667 1701731 1748222 1790244 1823917 1845331
50109 1845331 1851829 1842596 1818360 1780802 1732166 1674957 1611644 1544574 1476011 1408046 1342370 1280198
50097 1280198 1222326 1169229 1121212 1078615 1041756 1010511 984022 960944 939994 920368 901983
50086 901983 885454 871564 860613 852410 846786 843581 842064 840988 839614 838230 837342 836885 836586 836463
50072 836463 836363 835554 833507 830723 828088 825711 823037 819729 815727 810830 805056 799091 793470 787607 780638
50057 780638 773072 766528 761793 758156 754710 751323 748167 745369 743438 743058 744042 745333 746500 748432 752169
50042 752169 757799 764970 773615 783524 793860 803853 813607 823726 834511 845931 857858 869814 880933
50029 880933 890725 899608 908263 916731 924472 930952 935840 938932 940241 939959 938209 935276 932087 929821
50015 929821 928741 928121 927754 928857 933013 940902 952661 968816 989823 1014932 1042347 1070538 1098932
50002 1098932 1127478 1156137 1184822 1213445 1242106 1271392 1302168 1334564 1367252 1397965 1424401
49991 1424401 1444327 1455342 1455344 1443386 1419816 1385724 1342607 1292335 1237020 1178855 1120155 1063201
49979 1063201 1009636 960137 914883 874038 837623 805390 777254 753567 734503 719393 706973
49968 706973 696041 685685 675470 665867 657976 652147 647196 641674 635670 630707 627971 627333 628050 629824
49954 629824 633079 638626 647008 657828 669814 681857 693780 705751 717356 727834 736892 744569
49942 744569 750536 754373 756487 757872 758758 758172 754980 748755 739452 726948 711385 693547 674575 655538
49928 655538 637391 620906 606344 593481 582198 572788 565569 560459 557104 555136 554168 553876 554278 555626
49914 555626 557806 560108 561918 563481 565671 569039 573380 578322 584073 591260 600005 609492 618816 628167
49900 628167 638757 651413 665623 680079 693669 705584 714985 721323 724924 726665 726981 725535 721846
49887 721846 715818 707671 697736 686460 674274 661407 647952 634094 620054 605963 592107 579180
49875 579180 567840 558111 549536 541835 535053 529192 524246 520564 518610 518207 518530 519015 519911 521785 524916
49860 524916 529320 534995 541832 549618 558330 568275 579726 592636 606723 621583 636496 650324 661817
49847 661817 670113 675116 677624 678934 679947 680567 680093 677989 673950 667499 658236 646592 633835 621222
49833 621222 609577 599652 592077 586603 582036 577464 573223 570298 569141 569488 570952 573302 576393 580296
49819 580296 585421 592160 600550 610525 622174 635322 649064 662212 674090 684490 693139 699855 705244
49806 705244 710468 715966 720775 723407 723062 719802 713988 706075 696789 686950 676970 666779 656267 645628
49792 645628 635170 625068 615437 606495 598463 591374 585145 579787 575422 572108 569743 568068 566619 564827
49778 564827 562436 559836 557742 556489 555932 556093 557528 560764 565691 571843 579055 587391 596473 605282 612758
49763 612758 618453 622636 625969 629029 631860 634055 635431 636410 637276 637111 634136 627346 617462 606065 594294
49748 594294 582744 572100 563045 555481 548518 541517 534788 528994 524224 520158 516924 515096 514649 514455
49734 514455 513366 511547 510232 510282 511582 513785 516856 520504 523823 526243 528628 532659 539150 547453 556516
49719 556516 565954 575967 586733 598099 609458 619717 627700 632947 635994 637717 638532 638329 636874
49706 636874 634033 629763 624131 617362 609805 601931 594323 587415 581130 574996 568778 562815 557663 553593
49692 553593 550628 548864 548460 549381 551421 554446 558471 563459 569195 575362 581648 587808 593818 600037 607144
49677 607144 615764 626117 638079 651553 666533 682536 698020 710753 719139 723165 723961 722619 719740
49664 719740 716018 712690 711012 711388 713257 715796 718432 720552 720840 717379 708763 695254 678723 661431
49650 661431 644917 629864 616494 604693 594021 584083 575035 567574 562400 559772 559458 560854 563176
49637 563176 565726 568051 569818 570749 570784 570109 568773 566477 563025 558798 554374 549804 544711 539078 533514
49622 533514 528747 525181 522865 521395 519842 517398 514375 512066 511320 511625 511924 511920 512174 513183 514870 516902
49606 516902 519022 521017 522664 523875 524778 525619 526593 527704 528763 529628 530484 531681 533261 534867 536247
49591 536247 537536 538806 539698 539886 539734 539961 540652 541126 540911 540415 540340 540794 541368 541875 542499 543254 543901 544545
49573 544545 545800 547969 550522 552988 556096 561240 568750 577491 586440 595898 606527 617843 628473
49560 628473 637602 645275 651371 655275 656770 656451 654790 651430 645990 639143 632315 626519 621959 618589
49546 618589 616446 615354 614805 614383 614113 614208 614614 614949 614848 614272 613509 613017 613248 614548 617076 620801 625688
49529 625688 631955 640022 650025 661489 673780 686954 701908 719320 738399 756852 772347 784065
49517 784065 792818 799665 804669 807223 807424 806617 806469 807821 810697 815002 820669 827122 833028 836764 837071
49502 837071 833389 825796 814721 800749 784833 768560 753655 740810 729292 718160 707578 698453
49490 698453 691111 685074 680037 676268 673833 672062 670220 668281 666791 666282 666996 668776 670923 672533 673335
49475 673335 674012 675409 677646 680200 682615 684853 687130 689653 692390 694939 696800 697908 698732 699646 700439
49460 700439 700626 700067 699067 698026 697213 696638 695885 694198 691078 686833 682336 678186 674195 669713 664401
49445 664401 658684 653464 649373 646329 643881 641797 640116 638801 637720 637089 637493 639249 642006 645269 649213
49430 649213 654632 662023 670941 680469 690370 701576 715228 731225 748064 764391 780289 796446
49418 796446 812126 824663 831315 831385 826464 819026 811194 804569 800515 800000 803007 808317 814311 820172
49404 820172 826190 832874 840214 848043 856637 866359 876961 887876 899038 910816 923138 935358 947056
49391 947056 958346 969191 978962 986868 992319 994770 993775 989586 983259 975872 967876 959267 949911 939567
49377 939567 928220 916692 906454 898414 892331 887685 884611 883495 884086 885676 887928 891016 894908 898897
49363 898897 901912 903155 902547 900721 898385 895564 891591 885900 878625 870417 861991 853955 846769 840709
49349 840709 835986 832767 830772 829102 827110 825393 825167 826558 828268 829112 829068 828493 827157 824714 821431
49334 821431 817809 813946 809859 805979 802739 800091 797979 796832 796931 797674 798224 798691 800113 803336 808343
49319 808343 814389 820371 825363 829385 833494 838752 845320 852816 861090 870152 879828 890119 901589 914790
49305 914790 929542 945292 961831 979093 996607 1013680 1029583 1042821 1050720 1050934 1043475 1030589
49293 1030589 1014795 997709 980421 963778 947964 932656 917960 904734 893813 885402 879201 874558
49281 874558 870438 865924 861081 856924 854410 853866 855388 859216 865361 873168 881477 889147 895487 900431
49267 900431 904244 907006 908621 909457 910364 911549 912015 910880 908912 907865 908616 911002 915460 923543 936296
49252 936296 952917 971536 990710 1009574 1026864 1040373 1047563 1046805 1038296 1023764 1005103 983487
49240 983487 960015 936598 915288 896791 880427 865684 853073 843314 836399 831837 829355 829024 830950
49227 830950 834971 840422 846353 852472 859735 869324 880986 893002 903847 913313 921928 930026 937632
49214 937632 944706 951107 956691 961571 965940 969686 972687 975420 978749 983136 988704 995909 1005282 1016455
49200 1016455 1028335 1040464 1053287 1066839 1080152 1092443 1104059 1115680 1127316 1138594 1149319
49189 1149319 1159155 1167470 1174216 1180404 1186943 1193468 1199026 1203583 1208214 1214138 1222200 1233020 1246964
49176 1246964 1264048 1284340 1308355 1336757 1369976 1408492 1452945 1503044 1556070 1606690 1648401
49165 1648401 1675734 1686345 1682100 1668085 1649889 1631448 1615044 1602296 1594276 1590926 1591028 1592825
49153 1592825 1594587 1595127 1594343 1592954 1591313 1588993 1586040 1583997 1584713 1588453 1594117 1601088 1609784 1620322
49139 1620322 1631762 1643145 1654501 1666387 1679080 1692721 1707647 1723863 1740524 1756573 1771842
49128 1771842 1787048 1802705 1818508 1833853 1848528 1862711 1876561 1890196 1903988 1918572 1934406
49117 1934406 1951386 1968945 1986511 2004013 2022274 2043062 2068495 2100090 2138451 2184147 2238778
49106 2238778 2304573 2382259 2468719 2556620 2637474 2707131 2769522 2833567 2903465 2970565 3016111
49095 3016111 3024245 2993880 2938651 2875851 2814932 2754550 2688276 2612344 2529146 2445131 2366497
49084 2366497 2296796 2237380 2188544 2149722 2119416 2095915 2078178 2065702 2057726 2052942 2049862 2047178
49072 2047178 2043940 2039847 2035330 2031016 2027047 2023136 2019135 2015232 2011554 2007977 2004422 2001065 1998012 1994921
49058 1994921 1991204 1986635 1981622 1976781 1972401 1968571 1965681 1964314 1964414 1965007 1965167 1965027 1965416 1966685 1968459
49043 1968459 1970541 1973576 1978724 1986946 1998438 2012258 2026613 2040026 2052184 2063203 2072380 2078570
49031 2078570 2081755 2083256 2084210 2084763 2085111 2086214 2088681 2091626 2093500 2093748 2093070 2092447 2092469 2093261 2094504 2095757
49015 2095757 2097158 2099448 2102952 2106983 2110740 2114402 2118845 2124708 2132188 2141214 2151236 2161321 2171097
49002 2171097 2181154 2191837 2202244 2211269 2219183 2227062 2234902 2241439 2245925 2248976 2251400 2253062 2253325
48989 2253325 2251898 2248864 2244392 2238898 2233106 2227631 2222627 2217921 2213274 2208595 2204238 2200984 2199280 2198519
48975 2198519 2197649 2196400 2195326 2194612 2193663 2192111 2190450 2189160 2187788 2185537 2182400 2179079 2176015 2173169 2170782
48960 2170782 2169700 2170617 2173292 2176857 2180814 2185417 2191085 2197772 2205177 2213416 2223069 2234470 2247317 2261203
48946 2261203 2276233 2292778 2310803 2329859 2349706 2370607 2392903 2416579 2441431 2467606 2495822
48935 2495822 2526995 2561469 2598600 2637243 2676820 2717702 2760456 2804992 2850768 2897724 2946546
48924 2946546 2997854 3051307 3105684 3159824 3213452 3267143 3321609 3377081 3433225 3489257 3543925
48913 3543925 3595837 3644369 3690214 3734619 3778074 3820150 3860465 3899132 3936174 3971263 4004367
48902 4004367 4036081 4066897 4096623 4124903 4151849 4177739 4202431 4225456 4246364 4264763 4280451
48891 4280451 4293808 4305459 4315144 4321458 4323197 4320405 4313673 4303158 4289080 4272515 4254670 4235656
48879 4235656 4214862 4192203 4168021 4141940 4112841 4080067 4043722 4003650 3959035 3909357 3855255
48868 3855255 3798242 3740013 3682026 3625094 3569162 3513878 3459487 3406834 3356620 3309234 3265121
48857 3265121 3224587 3187123 3151647 3117663 3085742 3056674 3030646 3007378 2986610 2968276 2952547
48846 2952547 2939797 2930248 2923599 2919328 2917179 2917015 2918530 2921723 2927396 2936367 2948260 2961861 2976647
48833 2976647 2993062 3011232 3030383 3049834 3069599 3089604 3109230 3128221 3147275 3167067 3187324
48822 3187324 3207523 3227879 3248888 3270366 3291836 3313582 3336391 3360308 3384405 3407832 3430517
48811 3430517 3452686 3474366 3495619 3516774 3538080 3559411 3580649 3602177 3624670 3648383 3672965
48800 3672965 3698031 3723709 3750423 3778248 3806738 3835289 3863381 3890311 3915050 3936729 3955234
48789 3955234 3971229 3985646 3999235 4012359 4024976 4036851 4047803 4057393 4064237 4066068 4060946 4048281
48777 4048281 4028601 4002828 3972225 3938439 3902704 3865087 3825132 3783123 3740021 3696277 3651440
48766 3651440 3605019 3557022 3507609 3456937 3405629 3354714 3304810 3255849 3207823 3161279 3116836
48755 3116836 3074724 3035080 2998228 2964324 2933168 2904657 2879023 2856261 2835745 2816769 2799215
48744 2799215 2783323 2769097 2756306 2744913 2735229 2727803 2723294 2722110 2723817 2727064 2730326 2732636 2733508
48731 2733508 2732576 2729785 2725779 2721661 2718258 2715806 2714358 2714195 2715592 2718209 2721003 2723023 2724268 2725431
48717 2725431 2726684 2727150 2725935 2723350 2720568 2718171 2715627 2712337 2708733 2706081 2705347 2706387 2708098 2709381
48703 2709381 2710106 2711076 2712950 2715455 2717906 2720178 2722684 2725610 2728754 2732074 2735886 2740478 2746002 2752696
48689 2752696 2760688 2769484 2778087 2785721 2792030 2796640 2799169 2799932 2800178 2801291 2803937 2808004 2812981 2818181
48675 2818181 2822829 2826104 2827044 2824587 2818088 2807851 2794911 2780343 2764889 2748935 2732325 2714460
48663 2714460 2695114 2675006 2655035 2635138 2614570 2593097 2571018 2547968 2522612 2493940 2462260
48652 2462260 2428640 2394008 2359221 2325490 2294127 2265934 2241032 2219180 2200126 2183666 2169216
48641 2169216 2155295 2139976 2122337 2103196 2083842 2064419 2044295 2023629 2003518 1984665 1966908
48630 1966908 1950123 1934553 1920000 1905609 1890775 1875517 1859739 1843056 1825630 1808316 1791576
48619 1791576 1775129 1759153 1744909 1733501 1724718 1717757 1712575 1709836 1709977 1712854 1717931 1724256 1730594
48606 1730594 1736056 1740397 1743460 1744798 1744204 1742263 1740008 1738313 1737780 1738749 1741068 1744168 1747563 1750915 1753564
48591 1753564 1754509 1753088 1749160 1742576 1733099 1721043 1707371 1692945 1678287 1664123 1651343 1640096
48579 1640096 1629679 1619708 1610698 1603134 1596688 1590768 1585227 1580193 1575914 1573152 1572974 1575656 1580431 1586649
48565 1586649 1594407 1603521 1612735 1620589 1626495 1630324 1631584 1629602 1624040 1614743 1601702 1585760 1568857
48552 1568857 1552975 1539223 1528058 1519557 1512918 1506532 1499260 1491076 1481982 1471075 1457486 1441634
48540 1441634 1424864 1408347 1392834 1378799 1366079 1353991 1342507 1332743 1325602 1320547 1316430 1313021
48528 1313021 1310972 1310893 1313250 1318720 1327888 1340877 1357784 1378705 1402373 1425066 1441604 1447566 1440818
48515 1440818 1422283 1396135 1368298 1343241 1322084 1304023 1288824 1277243 1269984 1267419 1269944 1277605
48503 1277605 1289713 1305452 1324396 1345763 1368043 1390389 1413557 1437969 1461083 1477888 1484125
48492 1484125 1478474 1462344 1438874 1412012 1385170 1360091 1337092 1315963 1296169 1276886 1257917
48481 1257917 1240243 1224855 1211423 1199084 1188061 1179344 1172910 1167401 1161664 1155742 1150273 1145659 1141878
48468 1141878 1138529 1135077 1131572 1128920 1127921 1128316 1129343 1130937 1133780 1138342 1144473 1151627 1159012 1165778
48454 1165778 1171500 1176065 1178890 1178959 1176120 1171507 1166057 1159510 1151665 1143700 1137134 1132138 1127841 1123602
48440 1123602 1118913 1112690 1103939 1092901 1080656 1068024 1055622 1044268 1034283 1024925 1015532 1006682 999259
48427 999259 993078 987481 982539 978472 974607 970244 965988 962835 960431 957538 953772 949526 944667 938689
48413 938689 931917 925241 918965 913015 907828 903752 900090 896033 892091 889284 887432 885602 883734 882284
48399 882284 880746 878116 874551 871031 867667 863833 859673 855914 852292 847726 842009 836044 830439 825098
48385 825098 819984 815131 810206 805153 800856 798048 796119 794173 792505 791746 791407 790748 790197 790245 789811 787486
48369 787486 783647 779579 775403 770814 766951 765333 765569 766168 766871 768092 769033 768774 768407 769531 771360 771934
48353 771934 771493 771810 772807 772940 772620 774114 778067 783031 788441 795246 803614 812802 823298 836403 851822
48338 851822 868386 886637 907432 928168 943796 951904 954088 952709 949553 947276 948460 952967 959253
48325 959253 967929 980688 996548 1013117 1030974 1052535 1077221 1102414 1128678 1159045 1193436 1229049
48313 1229049 1266069 1307604 1354213 1404373 1460208 1526641 1605160 1695068 1800562 1929403 2085210
48302 2085210 2269327 2489779 2759349 3086129 3477675 3954990 4551037 5297373 6228075
48293 6228075 7394799 8854948 10640722 12760009 15213489 17935230 20655897 22863759
48285 22863759 24008190 23818936 22448224 20321757 17879235 15430232 13155514 11147602
48277 11147602 9432973 7995710 6808349 5843872 5068498 4442741 3934539 3522695 3187918
48268 3187918 2910509 2677468 2483016 2320843 2182481 2063182 1962273 1877019 1802037 1734981
48258 1734981 1677117 1627918 1584180 1544499 1509701 1478616 1448183 1418073 1390958 1367926 1347507
48247 1347507 1329203 1313994 1301218 1288743 1276508 1266441 1258778 1251890 1245827 1242567 1242486 1243839 1246130
48234 1246130 1250851 1258353 1266570 1273048 1275706 1271823 1259432 1240230 1218497 1196717 1174568 1152069
48222 1152069 1130764 1111229 1092127 1072581 1053429 1035503 1018588 1002517 987426 972609 956941
48211 956941 940702 925257 910755 895927 880197 864201 848213 831889 815611 800281 785806
48200 785806 771554 758098 746548 736391 726136 715944 707274 699950 692194 683844 676878 672109 667863
48187 667863 662886 658169 654724 651699 648114 644585 641859 639166 635611 631976 629675 628699 627807 626083 623432
48172 623432 620274 617533 616239 616345 616612 616143 615297 614622 613817 612392 610518 608509 606203 603561 601303 600267
48156 600267 600532 601549 602699 603491 603785 604058 604869 605942 606433 606235 606149 606573 606979 607093 607669 609523 612411
48139 612411 615407 617875 619666 620856 621716 622606 623627 624710 626037 627903 630138 632240 634078 635942 638001
48124 638001 640384 643567 647751 651876 654352 655035 655528 657225 659948 662928 666232 670595 676419 683438 690988
48109 690988 698296 704996 711589 718977 727424 736513 746114 756636 768136 780004 791909 804275 817383
48096 817383 830609 843090 854661 865743 876744 887992 899860 912396 925020 936895 947553
48085 947553 957062 965809 974252 982647 990965 999146 1007297 1015353 1022848 1029464 1035507 1041320 1046462 1050273
48071 1050273 1053137 1056358 1060641 1065427 1069919 1074183 1079028 1085303 1093428 1103124 1113387 1123010 1131134 1137126
48057 1137126 1140425 1141215 1140868 1140746 1140604 1138972 1134925 1128543 1119763 1108107 1093833 1078270 1062588 1047084
48043 1047084 1031973 1017800 1004492 990903 976013 959955 943349 926303 908713 890931 873476
48032 873476 856478 839963 824254 809558 795479 781448 767348 753374 739635 726273 713599
48021 713599 701754 690540 679888 670090 661245 652873 644523 636473 629427 623667 618808 614197 609404
48008 609404 604538 600250 597159 595164 593587 592028 590699 589888 589587 589751 590439 591527 592748 594117 595792
47993 595792 597379 598106 597959 598018 599151 600953 602414 603158 603435 603280 602431 600960 599392 598106 596959 595626
47977 595626 594094 592673 591569 590522 589048 587024 584786 582508 579894 576841 573943 571736 569792 567377
47963 567377 564817 563232 562829 562463 561180 559370 557957 557226 556959 557185 558207 560235 563319 567316 571717
47948 571717 575958 580139 584912 590507 596409 602224 608203 614639 621458 628792 637208 646816 656669 665687
47934 665687 673706 681104 687861 693614 698258 701902 704471 705877 706367 706283 705622 704189 701945 698944 695265
47919 695265 691237 687318 683385 678581 672271 664785 656911 649085 641448 634176 627270 620457 613847 608357
47905 608357 604935 603591 603522 603846 603846 603023 601542 600316 600181 601225 603216 606113 609687 613309 616864 621316
47889 621316 627521 634849 641901 648306 654843 661985 669319 676486 683696 691138 698631 706042 713334 719999
47875 719999 725143 728435 730460 731916 733019 733807 734322 734077 731997 727469 721164 714333 707507 700298 692257
47860 692257 683425 674052 664226 653958 643464 633247 623904 615831 609042 603218 597976 593112 588624
47847 588624 584567 580910 577567 574590 572258 570869 570432 570637 571157 571888 572981 574782 577659 581606 586005
47832 586005 590075 593630 597141 600989 604994 608766 612158 615157 617659 619709 621683 623943 626384 628624
47818 628624 630598 632875 636446 642165 650052 659103 668181 677283 687589 700152 715043 732011 751324
47805 751324 773338 797575 822909 848472 873815 898284 920866 940698 957354 970633 980448 986942
47793 986942 990288 990305 986549 978901 967924 954699 940514 926554 913546 901580 890483 880318 871373
47780 871373 863690 856803 849989 842726 835002 827231 819712 812228 804539 797188 791281 787129 783627 779356
47766 779356 773899 767734 761403 755354 750115 745768 741524 736593 731363 726852 723086 718956 713875 708680
47752 708680 704505 701480 699023 696915 695444 694880 695340 697055 700262 704808 710134 715703 721320 727157 733651
47737 733651 741296 750387 760900 772588 785032 797667 810021 822063 834158 846519 858853 870611
47725 870611 881325 890510 897468 901649 903300 903468 903147 902492 900970 898102 893748 887683 879374 868587
47711 868587 855992 842736 829395 815800 801971 788723 777010 767010 758226 750290 743277 737293
47699 737293 732168 727681 723900 721178 719800 719619 720103 720922 722467 725560 730573 737144 744809 753539 763428
47684 763428 774248 785693 797760 810511 823609 836432 848536 859736 869951 879288 888087 896539
47672 896539 904342 911040 916474 920604 923070 923396 921532 917870 912796 906564 899427 891486 882440 871872
47658 871872 859760 846473 832389 817898 803638 790357 778571 768590 760626 754488 749465 745038
47646 745038 741485 739211 737739 736207 734827 734993 737706 742559 748546 755131 762112 769102 775840 782696
47632 782696 790292 798756 807797 817478 828538 841895 857963 876433 896658 918364 942052 968486
47620 968486 997660 1028369 1058816 1087515 1113704 1137242 1158212 1176271 1190197 1198327 1199647 1194276
47608 1194276 1182798 1165443 1142153 1113292 1079992 1043830 1006240 968117 929879 891952 855160
47597 855160 820466 788422 759159 732877 709870 689896 671979 655262 639827 626368 615142
47586 615142 605542 596677 588079 579867 572406 565903 560225 555063 550285 546096 542829 540570 538993 537529
47572 537529 535829 534103 532918 532522 532478 532155 531356 530217 528662 526474 523957 521947 520880 520143 518664 515985
47556 515985 512562 509182 506352 504154 502447 501117 500102 499162 497833 495911 493961 492947 493198 494023 494475
47541 494475 494221 493482 492509 491459 490552 489967 489613 489288 489018 488991 489202 489423 489579 489930 490772 492035 493252 493940
47523 493940 494059 494153 494863 496257 497676 498369 498179 497524 496842 496312 496084 496429 497413 498594 499340 499587 499970 500996
47505 500996 502274 502951 502846 502651 502881 503117 502749 502023 501691 501752 501262 499569 497130 494785 492714 490580 488440
47488 488440 486964 486695 487433 488455 489180 489523 489747 490154 490951 492329 494418 497063 499779 502141 504159 506187
47472 506187 508527 511297 514541 518184 521935 525467 528646 531342 533217 534096 534473 535142 536283 537370 537995
47457 537995 538231 538049 537070 535361 533960 533972 535466 537793 540752 544765 549962 555762 561585 567520 574025
47442 574025 581327 589462 598753 609898 623440 639268 656766 675495 695629 717566 741082 765103
47430 765103 788445 810648 831852 851918 869931 884656 895342 902042 905268 905417 902530 896506 887507
47417 887507 876146 863282 849618 835368 820287 804133 787258 770677 755368 741559 728884
47406 728884 717067 706110 695858 685941 676395 667879 660831 654665 648346 641681 635592 630995 627803
47393 627803 625209 622682 620488 619387 620025 622504 626299 630567 634694 638664 642928 647961 654015 661179
47379 661179 669432 678470 687493 695420 701491 705682 708498 710367 711275 710983 709458 706969 703655 699191 693092
47364 693092 685420 676929 668240 659136 649031 638054 627141 616952 607196 597316 587353 577709 568444
47351 568444 559407 550836 543259 536796 531078 525845 521137 516928 513059 509613 506813 504432 501838 498846
47337 498846 496084 494242 493387 493249 493720 494685 495735 496526 497253 498430 500311 502769 505555 508429 511206 513898
47321 513898 516639 519259 521256 522440 523308 524370 525392 525746 525284 524375 523241 521828 520341 519251 518607
47306 518607 517810 516363 514473 512680 511186 509897 508864 508328 508388 508965 510119 512155 515320 519595 524830
47291 524830 530884 537429 543803 549450 554561 559969 566242 573119 580097 587211 594816 602772 610488 617796
47277 617796 625149 632697 639841 646156 652173 658552 664865 670052 673978 677600 681413 684608 686283 686847
47263 686847 687520 688827 690337 691788 693724 696912 701695 708151 716333 725813 735170 742243 744920 741759
47249 741759 732420 718067 701162 684227 668586 654460 642056 631947 624338 618620 614068 610618
47237 610618 608641 608261 609242 611218 613682 616070 618380 621470 626234 632555 639554 646790 654670 663620 673390
47222 673390 683277 692666 701236 708952 716009 722516 728191 732659 735996 738622 740681 741860 741766 740057 736282
47207 736282 730238 722573 714458 706504 698533 690575 683380 677552 672752 668245 663820 659723 656090 653030
47193 653030 651000 650537 651656 653837 656541 659562 663167 668072 674937 683557 692891 702200 711782 722267
47179 722267 733697 745901 759335 774760 792108 810296 828128 844934 860498 875001 889085
47168 889085 903375 917681 930957 942067 950333 955470 957572 957295 955618 953117 949618 944605 937812
47155 937812 929464 920194 910698 901231 891543 881552 871885 863389 856176 849620 843307 837558 832930 829553
47141 829553 827080 825022 823091 821488 820872 821805 824233 827740 832199 837767 844312 851323 858425 865514 872294
47126 872294 878108 882444 885195 886288 885424 882425 877497 870970 863146 854503 845619 836519 826475 814891
47112 814891 802213 789560 777658 766549 756194 746787 738336 730352 722285 714142 706424 699488 693112
47099 693112 686769 680284 674091 668829 664669 661200 657911 654690 651719 649051 646529 644179 642503 642114
47085 642114 643047 644641 646214 647741 649724 652546 656189 660479 665270 670326 675264 679769 683676 686881
47071 686881 689382 691442 693416 695374 697201 699006 700851 702016 701299 698474 694963 692447 691250 690670 690485
47056 690485 691266 693311 696093 698927 701656 704514 707811 711883 716945 722755 728687 734248 739356 744175
47042 744175 748957 753976 759315 764831 770594 777123 784710 792720 800146 806777 813268 820039 826769 833048
47028 833048 838940 844741 850694 857035 863732 870114 875420 879915 884664 889862 894087 895841 895237 893530
47014 893530 891355 888230 883618 877755 871349 864956 858878 853366 848697 845020 842157 839578 836792 833872
47000 833872 831481 830292 830391 831173 831766 831739 831643 832631 835167 838276 840612 842104 843929 846937 850956 855775
46984 855775 861869 869666 878790 888578 898736 909007 918834 928072 937545 948151 959711 971411 983014
46971 983014 994873 1006914 1018404 1028751 1037914 1046002 1053021 1059092 1064413 1068938 1072481 1075120 1077081
46958 1077081 1078213 1078042 1076482 1074214 1072245 1071273 1071370 1072061 1072797 1073587 1074988 1077272 1079900 1082278 1084744 1088224
46942 1088224 1093128 1099096 1105740 1112994 1120755 1128804 1137069 1145411 1153214 1159925 1166090 1173078 1181480 1190471
46928 1190471 1199009 1206994 1214757 1222002 1227950 1232146 1234542 1234981 1233131 1228885 1222426 1213988 1203877 1192624
46914 1192624 1180783 1168667 1156507 1144629 1133119 1121494 1109203 1096514 1084526 1074265 1066102
46903 1066102 1060128 1056600 1055710 1057183 1060545 1065752 1073198 1082973 1094491 1107173 1121373 1138155 1157953
46890 1157953 1179772 1201925 1223353 1243854 1263281 1281138 1297117 1311569 1325069 1337738 1349198
46879 1349198 1359028 1367031 1373228 1377941 1381820 1385501 1389082 1392108 1394127 1395272 1396277 1397984 1400859 1404988
46865 1404988 1410483 1417742 1427131 1438445 1450899 1463725 1476663 1489830 1503298 1516902 1530320 1543167
46853 1543167 1555081 1565802 1575180 1583055 1589229 1593556 1595926 1596200 1594304 1590469 1585142 1578634 1571031 1562517
46839 1562517 1553542 1544532 1535671 1527116 1519213 1512327 1506730 1502838 1501159 1501630 1503340 1505433 1508214 1512814
46825 1512814 1519820 1528756 1538893 1549908 1561527 1573206 1584661 1596308 1608543 1620748 1631542 1640032
46813 1640032 1646397 1651201 1654515 1655895 1654977 1651912 1647296 1641784 1635710 1629017 1621550 1613350 1604587 1595315
46799 1595315 1585509 1575310 1565057 1555032 1545347 1536072 1527335 1519273 1512108 1506318 1502417 1500357 1499242
46786 1499242 1497931 1495993 1494035 1493080 1493616 1495243 1497158 1498953 1500868 1503301 1506192 1509049 1511424 1513191
46772 1513191 1514445 1515452 1516691 1518651 1521443 1524841 1528766 1533431 1538925 1545034 1551704 1559311 1568116 1577736
46758 1577736 1587605 1597810 1608974 1621351 1634452 1647624 1660627 1673584 1686645 1699819 1712882
46747 1712882 1725396 1736986 1747596 1757197 1765350 1771494 1775757 1779067 1782221 1785072 1786809 1786886 1785568 1783843
46733 1783843 1782840 1783061 1784083 1785290 1786900 1789766 1794030 1798652 1802705 1806692 1811918 1818808 1826452 1833705
46719 1833705 1840110 1845709 1850503 1854339 1857010 1858323 1858263 1857050 1854708 1850562 1843635 1833688 1821527 1808139
46705 1808139 1793833 1778375 1761534 1743193 1723318 1702228 1680707 1659351 1637915 1615732 1592818
46694 1592818 1570128 1548608 1528334 1508826 1489870 1471712 1454596 1438499 1423350 1409161 1395823
46683 1395823 1383019 1370581 1358827 1348332 1339339 1331527 1324346 1317462 1310945 1305162 1300501 1297044 1294481
46670 1294481 1292429 1290832 1289943 1289960 1290948 1293107 1296809 1302176 1308820 1316244 1324343 1333281 1342991 1353057 1363017
46655 1363017 1372599 1381591 1389709 1396626 1402096 1406080 1408878 1410943 1412354 1412547 1410875 1407481 1403382 1399686
46641 1399686 1396976 1395501 1395588 1397548 1401390 1406927 1414165 1423318 1434461 1447400 1462000 1478462 1497077
46628 1497077 1517697 1539519 1561394 1582277 1601364 1617961 1631486 1641772 1649149 1653961 1655943 1654355
46616 1654355 1648872 1640138 1629184 1616407 1601476 1584284 1565643 1546721 1527957 1508842 1488836 1468232
46604 1468232 1448004 1429025 1411649 1395859 1381488 1368235 1355824 1344390 1334516 1326546 1319865 1313148
46592 1313148 1305502 1297236 1289386 1282624 1276829 1271543 1266415 1261123 1255267 1248758 1242175 1236290 1231205 1226269
46578 1226269 1220914 1215226 1209606 1204296 1199543 1195907 1193875 1193194 1192940 1192288 1191037 1189470 1188039 1187223 1187385
46563 1187385 1188549 1190378 1192330 1193813 1194409 1194288 1194227 1194874 1196033 1197062 1197943 1199429 1202038 1205391 1208799
46548 1208799 1212135 1215838 1220343 1225736 1231717 1237726 1243419 1249252 1256207 1264728 1274279 1284231 1294770 1306514
46534 1306514 1319639 1333962 1349619 1366973 1385906 1405772 1426180 1447359 1469673 1493154 1517546
46523 1517546 1542477 1567512 1592356 1617082 1641876 1666560 1690641 1713777 1735800 1756339 1774858
46512 1774858 1791124 1805150 1816619 1824901 1829972 1832820 1834587 1835604 1835549 1834226 1831749 1828198 1823621 1818356
46498 1818356 1812969 1807819 1802946 1798331 1793975 1789642 1784792 1778864 1771472 1762332 1751308 1738701 1725275
46485 1725275 1711688 1697838 1682892 1665962 1646671 1625139 1601701 1576819 1551114 1525195 1499385
46474 1499385 1473713 1448155 1422727 1397368 1372046 1347172 1323719 1302686 1284518 1269203 1256760
46463 1256760 1247345 1240921 1237123 1235549 1236070 1238805 1243889 1251254 1260593 1271552 1283941 1297585 1311931
46450 1311931 1326172 1339987 1353820 1368022 1381932 1394343 1404722 1413406 1420657 1426212 1429867 1431809
46438 1431809 1432078 1430371 1426863 1422624 1418623 1414703 1410237 1405435 1401190 1397753 1394426 1390746 1387258 1384869
46424 1384869 1384099 1385286 1388844 1394682 1401913 1409910 1419437 1431964 1447901 1466280 1486334 1508574 1533815
46411 1533815 1561806 1591539 1622514 1654951 1688839 1723553 1758443 1793086 1826780 1858550 1888066
46400 1888066 1915883 1942208 1966013 1986124 2002749 2016917 2028501 2035870 2037820 2034922 2028463 2018840
46388 2018840 2005864 1990125 1973041 1955519 1937364 1918191 1898261 1878103 1857937 1837977 1818939
46377 1818939 1801638 1786213 1772356 1760339 1751289 1746205 1745067 1747222 1752371 1760765 1772674 1788130
46365 1788130 1807216 1830247 1857568 1889408 1925938 1967103 2012363 2061004 2112814 2168050 2226420
46354 2226420 2286497 2346493 2405329 2462574 2517656 2569647 2617644 2660770 2697837 2727542 2749110
$$ [...]
##END NTUPLES=NMR SPECTRUM
##END=
