
##TITLE=UV1210_M4_1332-1205_7185290_ikKj0LbaFJ
##JCAMPDX= 6.0         $$ Bruker NMR JCAMP-DX V2.0
##DATA TYPE= NMR SPECTRUM
##DATA CLASS= NTUPLES
##ORIGIN= BRUKER
##OWNER= Administrator
$$ 1.72 TOPSPIN		Version 2.1
$$ 2012-12-06 02:23:41.849 -0500  Administrator@X
$$ Compression mode = diff/dup
##.OBSERVE FREQUENCY= 400.02188249412
##.OBSERVE NUCLEUS= ^1H
##.ACQUISITION MODE= SIMULTANEOUS (DQD)
##.ACQUISITION SCHEME= undefined
##.AVERAGES= 8
##.DIGITISER RES= 22
##SPECTROMETER/DATA SYSTEM= spect
##.PULSE SEQUENCE= zg30
##.SOLVENT NAME= COFFEE_meoh
##.SHIFT REFERENCE= INTERNAL, COFFEE_meoh, 1, 14.98509
##AUDIT TRAIL= $$ (NUMBER, WHEN, WHO, WHERE, PROCESS, VERSION, WHAT)
$$ ##TITLE= Audit trail, TOPSPIN		Version 2.1
$$ ##JCAMPDX= 5.01
$$ ##ORIGIN= Bruker BioSpin GmbH
$$ ##OWNER= Administrator
$$ $$ E:\/data/COFFEE/nmr/UV1210_M4_1332-1205_7185290_ikKj0LbaFJ/10/pdata/1/auditp.txt
$$ ##AUDIT TRAIL=  $$ (NUMBER, WHEN, WHO, WHERE, PROCESS, VERSION, WHAT)
(   1,<2012-12-06 02:23:33.677 -0500>,<Administrator>,<X>,<go>,<TOPSPIN 2.1>,
      <created by zg
	started at 2012-12-06 02:22:27.520 -0500,
	POWCHK enabled, PULCHK disabled,
       configuration hash MD5:
       86 BA 57 50 F2 9D 5C 9B 26 00 A9 28 5F 66 2E 89
       data hash MD5: 64K
       5B 55 BA E5 F7 FE 9A FD A0 75 5E 1B CF 3C C2 53>)
(   2,<2012-12-06 02:23:36.786 -0500>,<Administrator>,<X>,<proc1d>,<TOPSPIN 2.1>,
      <Start of raw data processing
       efp LB = 0 FT_mod = 6 PKNL = 1 PHC0 = 0 PHC1 = 0 SI = 32K 
       data hash MD5: 32K
       2C 9E B8 4B BC 39 12 F5 7A B8 32 8E 1A D8 9B 75>)
(   3,<2012-12-06 02:23:37.255 -0500>,<Administrator>,<X>,<proc1d>,<TOPSPIN 2.1>,
      <pk PHC0 = 102.8375 PHC1 = 0 
       data hash MD5: 32K
       63 50 56 B9 06 14 C6 F4 F5 88 36 00 7D 61 CD 11>)
(   4,<2012-12-06 02:23:37.489 -0500>,<Administrator>,<X>,<proc1d>,<TOPSPIN 2.1>,
      <abs ABSG = 1 
       data hash MD5: 32K
       E2 00 62 DE B5 94 56 7C 63 04 3E EA A9 31 FB ED>)
(   5,<2012-12-06 02:23:37.630 -0500>,<Administrator>,<X>,<proc1d>,<TOPSPIN 2.1>,
      <abs ABSG = 2 
       data hash MD5: 32K
       AA 34 A2 E0 75 C4 07 81 22 A2 3D 9D 32 63 2E DC>)
(   6,<2012-12-06 02:23:37.786 -0500>,<Administrator>,<X>,<proc1d>,<TOPSPIN 2.1>,
      <abs ABSG = 3 
       data hash MD5: 32K
       BA BB 1C 54 C9 57 54 3B C4 CC E1 08 96 52 44 46>)
(   7,<2012-12-06 02:23:37.927 -0500>,<Administrator>,<X>,<proc1d>,<TOPSPIN 2.1>,
      <abs ABSG = 4 
       data hash MD5: 32K
       5B 41 17 A5 62 39 6E DA 1E 02 3C 56 C4 56 AA B8>)
(   8,<2012-12-06 02:23:38.083 -0500>,<Administrator>,<X>,<proc1d>,<TOPSPIN 2.1>,
      <abs ABSG = 5 
       data hash MD5: 32K
       59 C5 EB 50 37 B8 AE 47 9A 5A DB 8B 2F 7F D2 64>)
$$ ##END=
$$ 
$$ $$ hash MD5
$$ $$ EE 19 0F A0 FD 67 57 99 50 93 93 B8 8A B6 04 1C
##$RELAX= 
##$RELAX= 
##$RELAX= 
##$RELAX= 
##$RELAX= 
##$RELAX= 
##$RELAX= 
$$ Bruker specific parameters
$$ --------------------------
##$DU= <E:\>
##$EXPNO= 10
$$ [...]
##$TP= (0..7)
150 150 150 150 150 150 150 150
##$TP07= 0
##$TPNAME0= <>
##$TPNAME1= <>
##$TPNAME2= <>
##$TPNAME3= <>
##$TPNAME4= <>
##$TPNAME5= <>
##$TPNAME6= <>
##$TPNAME7= <>
##$TPOAL= (0..7)
0.5 0.5 0.5 0.5 0.5 0.5 0.5 0.5
##$TPOFFS= (0..7)
0 0 0 0 0 0 0 0
##$TUNHIN= 0
##$TUNHOUT= 0
##$TUNXOUT= 0
##$USERA1= <user>
##$USERA2= <user>
##$USERA3= <user>
##$USERA4= <user>
##$USERA5= <user>
##$V9= 5
##$VALIST= <valist>
##$VCLIST= <CCCCCCCCCCCCCCC>
##$VD= 0
##$VDLIST= <DDDDDDDDDDDDDDD>
##$VPLIST= <PPPPPPPPPPPPPPP>
##$VTLIST= <TTTTTTTTTTTTTTT>
##$WBST= 1024
##$WBSW= 4
##$XGAIN= (0..3)
0 0 0 0
##$XL= 0
##$YL= 0
##$YMAX_a= 644006
##$YMIN_a= -551592
##$ZGOPTNS= <>
##$ZL1= 120
##$ZL2= 120
##$ZL3= 120
##$ZL4= 120
##$ABSF1= 14.98509
##$ABSF2= -5.573092
##$ABSG= 5
##$ABSL= 3
##$ALPHA= 0
##$AQORDER= 0
##$ASSFAC= 0
##$ASSFACI= 0
##$ASSFACX= 0
##$ASSWID= 0
##$AUNMP= <proc_prof1d_extract_pilot.lims>
##$AXLEFT= 0
##$AXNAME= <>
##$AXNUC= <1H>
##$AXRIGHT= 0
##$AXTYPE= 0
##$AXUNIT= <>
##$AZFE= 0.1
##$AZFW= 0.1
##$BCFW= 0
##$BC_mod= 0
##$BYTORDP= 0
##$COROFFS= 0
##$CY= 15
##$DATMOD= 1
##$DC= 0
##$DFILT= <>
##$DTYPP= 0
##$F1P= 0
##$F2P= 0
##$FCOR= 0.5
##$FTSIZE= 32768
##$FT_mod= 6
##$GAMMA= 0
##$GB= 0
##$INTBC= 1
##$INTSCL= 1
##$ISEN= 128
##$LB= 0
##$LEV0= 0
##$LPBIN= 0
##$MAXI= 10000
##$MC2= 0
##$MEAN= 0
##$ME_mod= 0
##$MI= 0
##$NCOEF= 0
##$NC_proc= -8
##$NLEV= 6
##$NOISF1= 0
##$NOISF2= 0
##$NSP= 0
##$NTH_PI= 0
##$NZP= 0
##$OFFSET= 14.98509
##$PC= 1
##$PHC0= 102.8375
##$PHC1= 0
##$PH_mod= 1
##$PKNL= yes
##$PPARMOD= 0
##$PPDIAG= 0
##$PPIPTYP= 0
##$PPMPNUM= 2147483647
##$PPRESOL= 1
##$PSCAL= 4
##$PSIGN= 0
##$PYNMP= <proc.py>
##$REVERSE= no
##$SF= 400.02
##$SI= 32768
##$SIGF1= 0
##$SIGF2= 0
##$SINO= 400
##$SIOLD= 32768
##$SPECTYP= <>
##$SREGLST= <1H.CDCl3>
##$SSB= 0
##$STSI= 32768
##$STSR= 0
##$SW_p= 8223.68421052631
##$SYMM= 0
##$S_DEV= 0
##$TDeff= 65536
##$TDoff= 0
##$TI= <>
##$TILT= no
##$TM1= 0
##$TM2= 0
##$TOPLEV= 0
##$USERP1= <user>
##$USERP2= <user>
##$USERP3= <user>
##$USERP4= <user>
##$USERP5= <user>
##$WDW= 1
##$XDIM= 32768
##$YMAX_p= 474303603
##$YMIN_p= -726045
##$CURPLOT= <Network HP LaserJet P1505>
##$CURPRIN= <$Network HP LaserJet P1505>
##$DFORMAT= <normdp>
##$LAYOUT= <+/1D_H.xwp>
##$LFORMAT= <normlp>
##$PFORMAT= <normpl>
##$SURQMSG= 1
$$ End of Bruker specific parameters
$$ ---------------------------------
##NTUPLES= NMR SPECTRUM
##VAR_NAME=  FREQUENCY,     SPECTRUM/REAL,   SPECTRUM/IMAG
##SYMBOL=    X,             R,               I
##VAR_TYPE=  INDEPENDENT,   DEPENDENT,       DEPENDENT
##VAR_FORM=  AFFN,          ASDF,            ASDF
##VAR_DIM=   32768,         32768,           32768
##UNITS=     HZ,            ARBITRARY UNITS, ARBITRARY UNITS
##FACTOR=    0.250966925370066, 1,           1
##FIRST=     8223.43324360094, 6497,         13739
##LAST=      0,             -202828,         -233366
##MIN=       0,             -726045,         0
##MAX=       8223.43324360094, 474303603,    0
$$ Real data points
##PAGE= N=1
##DATA TABLE= (X++(R..R)), XYDATA
$$ [...]
19550a92438G0283b00237f5254j8889j62535R3002H8301B6062J3891J65484D0100
19538A06743f537j38814j08522J5744d5941l86381A69396Q6539a63066B51532
19527b48530F8109d42584a06302j09874N3626b0691k82137a50534k3494O511e9348
19515g9013A39223K42812a99460A07068K45853c56005b1980B87437j41627c42910
19504A46464P8940B1675d3138j76539H1683j9833j3733J44292n2718a8306j22023
19493a40329A4697a29220j58778C6867i5405o6294A27179a80123A25634c25150
19482B0169f2978l94913C17408b4823F2831J03839a10049l2454O0721B0016b76578
19470i8977j37397a16682B8450K73820G74L19089a1157j61370e6796r0034j1381
$$ plain form
19550 -192438 70283 -200237 -65254 -84143 -246678 -153676 88301 26062 39953 205437 40100
19538 106743 -6537 -145351 -253873 -238129 -45941 -432322 169396 255935 -163066 251532
19527 -248530 68109 -442584 -106302 -216176 -162550 -20691 -302828 -150534 -174028 -167517 -59348
19515 -79013 139223 382035 -199460 107068 352921 -356005 -21980 287437 145810 -342910
19504 146464 225404 21675 -43138 -219677 81683 61850 48117 192409 139691 -18306 -140329
19493 -140329 14697 -129220 -287998 36867 -95405 -161699 127179 -180123 125634 -325150
19482 20169 -62978 -457891 317408 -24823 62831 166670 -110049 -142503 -81782 20016 -276578
19470 -98977 -236374 -116682 28450 302270 774 319863 -11157 -172527 -56796 -146830 -158211
19459a58211H0975K67800j05677A9120a51560F8654g6639j15108E4286b59780
19448d30105C9982b80152J08689J8909j17j31486l2192j89133A28331a46153r6087
19437b42240J5611l6849A24051l5649c77588J56397N4725K9223j48685H2883c09343
19425B9088J09141b60073m1490a9461q1859F14b53484g8226L5737C15740a96450
19413a52267a7665j63670K1301L452I7128c2365o9697O015r0959A13405a15508
19401A64202p335b82195g2113G4185e5315j90426j75811F8763K13094a9636j44123
19390a63759c0146l6444B1462n025a30700d7909F3455L3929J17184a34955c9024
19378e6573C72320b73789A46175a25585r0470d1834J539p3618A50741b8628A1437
$$ plain form
19459 -158211 80975 348775 243098 19120 -151560 68654 -76639 -191747 54286 -259780
19448 -430105 39982 -280152 -171463 -152554 -152671 -284157 -316349 -505482 128331 -146153 -242240
19437 -242240 -226629 -263478 124051 88402 -377588 -221191 -166466 -137243 -285928 82883 -309343
19425 29088 138229 -260073 -301563 -19461 -101320 614 -253484 -78226 -42489 315740 -196450
19413 -152267 -17665 -181335 -160034 -156582 97128 -32365 -102062 -96047 -187006 113405 -115508
19401 164202 156867 -282195 -72113 74185 -55315 -245741 -421552 68763 281857 -19636 -163759
19390 -163759 -30146 -66590 21462 16437 -130700 -47909 63455 97384 214568 -134955 -39024
19378 -56573 372320 -273789 146175 -125585 -216055 -41834 -40295 -113913 150741 -28628 11437
19366D0021a5154k3621j01484f9048I6614O8323k9441L0428D7496L2942g3720
19354i0611k5442D6987j8234e3877E8109b25618a3705p5970j1421A18338f0664
19342a6861a430H9133a42184k20998C50228j36271a74559E7461J93171c72112
19331d9080j59217E8099b83703P3044E8498c07914g0262n5276J4552j58670A60187
19319a63468O160C07754b05118j54069B33J4981e75353f2261m38j11256c1945
19307A53078a67497a2731B22166f2736k91895A1101f6079C05023G2181J09596
19297A81777b30009j05588i046B62739e59364K49154B8763b77308J9268f3515
19286A02482b05167j87230n912C40552I5083a0017l29549F665K5893a59085A83342
$$ plain form
19366 40021 -15154 -38775 -140259 -69048 96614 164937 135496 165924 47496 80438 -73720
19354 -90611 -116053 46987 28753 -53877 58109 -225618 -13705 -89675 -101096 118338 -60664
19342 -16861 -1430 89133 -142184 -363182 350228 213957 -174559 57461 250632 -372112
19331 -49080 -208297 58099 -283703 -210659 58498 -307914 -70262 -125538 -110986 -269656 160187
19319 -163468 -157308 307754 -205118 -359187 233 15214 -575353 -62261 -62699 -173955 -31945
19307 153078 -167497 -12731 222166 -62736 -354631 11101 -66079 305023 72181 181777
19297 181777 -230009 -335597 -9046 262739 -559364 -310210 28763 -277308 -258040 -63515
19286 102482 -205167 -392397 -398309 340552 95083 -10017 -339566 6665 32558 -159085 183342
19274f6356K7247q891j10590A831J38815i9113j92187A18745f0130k14687j38071
19263d12888a18126c8777H2426b79694f0282q9423A54730a64777d8586j18721
19253a67307B59621a65081A5040K48943b99268J45733j15780A5776a67022n3065
19243b20087k38292P0266E503c0394j17373M1256a5253k33147A0600a29331A28496
19231a43006k18174F6164B7643b27086k12502a09877p2486F220a32445j8337b7317
19219a85199f3602A71012a21098A84428g6593A60187p1049J48035a31783A214
19208a19497D437N844c32732j15647Q8250f8255k62246a56976p859A33637e5392
19196H2122b45260g6402k21029B49223h6458r0932O3343j34574B42192b85964
$$ plain form
19274 -66356 -39109 -48000 -158590 1831 140646 -99113 -291300 118745 -60130 -274817 -412888
19263 -412888 -118126 -38777 82426 -279694 -60282 -149705 154730 -164777 -48586 -167307
19253 -167307 259621 -165081 15040 263983 -299268 -153535 -269315 15776 -167022 -220087
19243 -220087 -458379 -388113 5503 -30394 -147767 -106511 -15253 -248400 10600 -129331 128496
19231 -143006 -361180 66164 27643 -227086 -439588 -109877 -182363 6220 -132445 -150782 -27317
19219 -185199 -63602 171012 -121098 184428 -76593 160187 89138 237173 -131783 1214
19208 -119497 4437 10281 -332732 -448379 -360129 -68255 -330501 -156976 -164835 133637 -55392
19196 82122 -245260 -76402 -297431 249223 -86458 -177390 -114047 -248621 242192 -285964
19185E543b8025q4642k46750i4174n2272o2125C1033J20175C9453a53313E0728
19173b644j26635L0445A26103N1347b22943F5220h5219k66732E4055Q3472B969
19161b63697c7055l26807b7841A86290L02498b05763B14680a29023b9222j7666
19151d6888A17346B317a56780C3354K09384c22683Q5761e5249b7029j2643j64764
19140b04436P3366o106O8179J9946h167j5644j0644A29272a57780A65112a76606
19128g6321A8904D889P4317J75501h8631k34998F9248d0714C242Q4821G420J96027
19116B03447b76348J15520F3901b0578b090k58420g8478b8643j02424B47077o8812
19105A78265f4888C915A061a58086N3031K6776o3023m2072P6117G7067J26036
$$ plain form
19185 5543 -28025 -112667 -359417 -94174 -146446 -208571 31033 151208 39453 -153313 50728
19173 -2644 -129279 -98834 126103 177450 -222943 65220 -85219 -351951 54055 137527 2969
19161 -263697 -37055 -363862 -27841 186290 488788 -205763 214680 -129023 -29222 -46888
19151 -46888 117346 2317 -156780 33354 242738 -322683 -236922 -55249 -27029 -39672 -204436
19140 -204436 -131070 -137176 -68997 -49051 -8167 -23811 -34455 129272 -157780 165112 -176606
19128 -76321 18904 4889 79206 254707 -88631 -323629 69248 -40714 3242 88063 7420 203447
19116 203447 -276348 -160828 63901 -20578 -2090 -260510 -78478 -28643 -131067 247077 178265
19105 178265 -64888 3915 1061 -158086 -105055 -78279 -141302 -183374 -107257 77067 203103
19094B03103I5554b19237G9992K91187c51966j36661A21684l5001a43070A82373
19083c22023f0770b1878j55375k6511E3520f5342E3660a06963M9996G8518h5017
19071F073K28392m5185P8287c64946a9457B7446b63460H0334b98803B74702E8566
19059I5235J03243a85933N4323j24145m894p7726a04616Q177E4801a76312P1008
19048a05304p997j97622G1034a57734H7323a26868N7916M839l8084E9971n159
19037E4812a91554j27986i863k58381I0952c75826a71511e9040I841e2163R210
19026d2953C57579A16329C6827L67836g520H4573C099K41929b04118R6167B03811
19014A27952a22843e4516K0657j11793E3007l185b36018A19924J23697b64595
$$ plain form
19094 203103 95554 -219237 79992 371179 -351966 -488627 121684 86683 -143070 182373
19083 -322023 -60770 -21878 -177253 -203764 53520 -65342 53660 -106963 -56967 78518 -85017
19071 6073 234465 189280 267567 -364946 -19457 27446 -263460 80334 -298803 274702 58566
19059 95235 198478 -185933 -131610 -255755 -260649 -338375 -104616 -96439 54801 -176312 -105304
19048 -105304 -113301 -310923 71034 -157734 87323 -126868 -68952 -64113 -102197 59971 54812
19037 54812 -191554 -319540 -9863 -268244 90952 -375826 -171511 -59040 9841 -52163 -42953
19026 -42953 357579 116329 36827 404663 -7520 84573 3099 245028 -204118 -107951 203811
19014 127952 -122843 -54516 -33859 -145652 53007 49822 -236018 119924 243621 -264595
19003A69897L7592O375f853n8659k00901J30494o4892P6549d5229j02517K2588
18992a25158B25252E5441b94051c3294j56392j55791a72220K7133O021A15220
18981A86152N4167i3929A81907d0659j1397A5545g6515B46506N6834a3458A5105
18969B93359A10701b55560c1936m7067A36067a33812j76600B33255a35490A30723
18958B93732a59243j72031a08132C3584R584c32759D0193b30699j33016B524d12907
18946b03143L8812K657B67144a52410j32929A18159R343l3953i3464A16483a44741
18934A02182a66422f7686p3109A43545B8749a9587j814d061A90039a6942j44398
18923a61340H8599J08165a75627N2493O0701I6906f854B11581e7296j20382k1527
$$ plain form
19003 169897 207489 213864 -6853 -65512 -266413 -135919 -200811 -124262 -45229 -147746 -125158
18992 -125158 225252 55441 -294051 -33294 -189686 -345477 -172220 -145087 -139066 115220
18981 186152 240319 -93929 181907 -40659 -52056 15545 -76515 246506 303340 -13458 15105
18969 293359 110701 -255560 -31936 -79003 136067 -133812 -310412 233255 -135490 130723
18958 293732 -159243 -331274 -108132 33584 43168 -332759 40193 -230699 -363715 2524 -412907
18946 -203143 -164331 -161674 267144 -152410 -285339 118159 127502 93549 -93464 116483 -144741
18934 102182 -166422 -67686 -140795 143545 28749 -19587 -21401 -4061 190039 -16942 -161340
18923 -161340 88599 196764 -175627 -123134 -62433 96906 -6854 211581 -57296 -177678 -199205
18912a99205J1662L179j5877Q4195J0421k5929p231J199G2045b45631H3222a5489
18899b29398A23570e33627F9208c1459l32813I9317B5805g7866k30308A13419
18888b58389J16628C2624R501e8521D7974b63562B36631G2759A4334a71473E6395
18876d7549k65474C400g9242o970A0790P9172m1617b78505a10312D6221H961P7310
18864H6271e0888f03j9548k39444c2602A94890a75264f3167F85084a61507e7006
18852A07804b3202E9396a46077M3285o1903k4903G0290h5228a0604p9063j27096
18841b16763I3662B8116a18959C9584a33026B54503c28948B9375Q7958g3424j5545
18830h8969j59016a16372M4470o8755o094A00713A5748L5102i3674A67987J36526
$$ plain form
18912 -199205 -187543 -184364 -200241 -116046 -105625 -131554 -138785 -137586 72045 -245631 83222 -15489
18899 -229398 123570 -533627 69208 -31459 -364272 99317 25805 -77866 -308174 113419
18888 -258389 -141761 32624 42125 -58521 47974 -263562 236631 72759 14334 -171473 56395
18876 -47549 -313023 3400 -79242 -86212 10790 89962 48345 -278505 -110312 46221 8961 86271
18864 86271 -50888 -603 -20151 -259595 -32602 194890 -175264 -63167 685084 -161507 -57006
18852 107804 -23202 59396 -146077 -102792 -164695 -189598 70290 -85228 -10604 -89667 -216763
18841 -216763 93662 28116 -118959 39584 -133026 254503 -328948 29375 117333 -73424 -88969
18830 -88969 -247985 -116372 -71902 -140657 -146751 100713 15748 50850 -93674 167987 304513
18819C04513E7452K06948d08403e400E6565a3021D6709a89735C72618e5274B86089
18807I9071p190M883A3126a01875c0284B72853d8107o6267A32997a34603l0778
18796a65381Q0901b6848m2688Q639B5758d4671m6934J8060K5041k04768d8433
18784A92194o2656o201C8984Q745A8687L4496k6590C796K57037a76233q1265D04616
18771b11722l7842C61036I2331J36484c47404J31967J06687j04457K651i5027
18760a97156H0827a22826C66551d3578m6280A43072I407J2097g7848B33K04908
18749B05141q6363f6532q383J7671a7791j7444C39597n0480a64229e2817D6275
18737F2339a55598j43348f5118j39673J00478L255K7583b5494H705a86132G6553
$$ plain form
18819 304513 57452 264400 -408403 -5400 56565 -13021 46709 -189735 372618 -55274 286089
18807 99071 91881 96764 13126 -101875 -30284 272853 -48107 -114374 132997 -134603 -165381
18796 -165381 -84480 -26848 -69536 -60897 25758 -44671 -91605 -73545 -48504 -253272 -48433
18784 192194 129538 123337 38984 47729 18687 53183 26593 3796 260833 -176233 -257498 404616
18771 -211722 -249564 361036 92331 228815 -347404 -215437 -108750 -213207 -210556 -95027
18760 -197156 80827 -122826 366551 -43578 -89858 143072 9407 21504 -77848 233 205141
18749 205141 118778 -66532 -74915 -57244 -17791 -35235 339597 289117 -164229 -52817 46275
18737 62339 -155598 -298946 -65118 -204791 -104313 -101058 -73475 -25494 8705 -186132 76553
18725a4162l68134A06765c3607A54763K05922b90351j56755b7079l48958a29119
18714b99937L9123q9552a46840B78977b2358A81228a40913B91984g1524H4593
18703a28627J3750n7751M0099C0524J76823c82186g4477A20038b87162e3434m869
18692e8303J5156E3099a12991B94407j20474F4141K79043a66273N3295k64874
18682c77852B99421c74210O5697G7232b1849D82315a89174P3493m51675i0911
18671B2692J40493c70261g274G714c55389B17283b55374A7560a09586B19221i0123
18659A5270J47787f1016A26474e1065k64389j084J46805J9118I136b09328F8184
18647a29640E4803K72090r7908o7588f5052B11149F7489N6391a41489r7208C46325
$$ plain form
18725 -14162 -382296 106765 -33607 154763 360685 -290351 -447106 -27079 -376037 -129119
18714 -299937 -260814 -350366 -146840 278977 -22358 181228 -140913 291984 -71524 84593
18703 -128627 -114877 -172628 -132529 30524 207347 -382186 -74477 120038 -287162 -53434 -58303
18692 -58303 -43147 53099 -112991 294407 173933 64141 343184 -166273 -112978 -377852
18682 -377852 299421 -374210 -308513 77232 -21849 482315 -189174 -115681 -567356 -90911
18671 22692 163185 -370261 -7274 7714 -355389 217283 -255374 17560 -109586 219221 -90123
18659 15270 163057 -61016 126474 -51065 -315454 -316538 -169733 -150615 9136 -209328 68184
18647 -129640 54803 326893 228985 161397 -65052 211149 67489 123880 -141489 -238697 346325
18635e5125r4804r840F8019K37245A0352g5908q4799A8626b46493A0463i699D2034
18622D40778a93980P6144k854K9632j42266F4825J01210J28850b71454d8511A69752
18610I7391L8650i1554j11242q5079B61191i4170H4217a12423K0313A5400L6786
18599E2186Q3871a76846B23185c69191A09270k9537g4321A24622e6734F4229b02973
18587a32917l8897B53039I56f7077C9122b33655K5055k4403j82518J51699g8131
18575A06539f5542A44913E3398e4408j71215J03124L9240A23644a52798M862A00134
18563A71814o4944B7837e47541e9027j00106m769I97a88914b9533A868i5133a9229
18550H1978c38231a48124r352O172N7777B88860e7773m0846A43505b51744a29
$$ plain form
18635 -55125 -149929 -159769 68019 305264 10352 -75908 -160707 18626 -246493 10463 -9699 42034
18622 440778 -193980 -117836 -120690 -91058 -233324 64825 166035 294885 -271454 -48511 169752
18610 97391 136041 -91554 -202796 -287875 261191 -94170 84217 -112423 -92110 15400 52186
18599 52186 136057 -176846 223185 -369191 109270 79733 -74321 124622 -56734 64229 -202973
18587 -132917 -171814 253039 956 -67077 39122 -233655 -208600 -233003 -415521 -263822 -78131
18575 106539 -65542 144913 53398 -54408 -225623 -122499 -83259 123644 -152798 -147936 100134
18563 171814 106870 27837 -547541 -59027 -159133 -163902 997 -188914 -29533 1868 -95133 -19229
18550 81978 -338231 -148124 -157476 -151304 -93527 288860 -57773 -98619 143505 -251744 -129
18538A74007e11782A14269a75547l1323B9466a86767B31522G2520c0575m5490
18528g6065J2747A05704l8018a2763k77257j2571j53604a3569C51426a9608I7174
18516a2000j10428k54410d7981k79123e2104m49340K21048c7087k0982A95054
18505B52301b33671O4830K5032D60235a97110m4467c726C7781K76133H7675b67836
18493a90361B38752I9567a47550j2388c6845K207k18763J11131j61385K3200Q9073
18482a91382A52681b77236E4468K54377d8753n47178K03490A77822h6562C01607
18471a42960j8494C0686M7819b15957f8722B70832J10302o2705i4303E7209J91939
18460B49148D0127Q0380a60743A07810L9596i4787A72629G3240J03362a56841
$$ plain form
18538 174007 -511782 114269 -175547 -206870 29466 -186767 231522 72520 -30575 -76065
18528 -76065 -63318 105704 67686 -12763 -290020 -302591 -456195 -13569 351426 -19608 97174
18516 -12000 -122428 -376838 -47981 -327104 -52104 -501444 -280396 -37087 -58069 195054
18505 252301 -233671 -168841 -143809 460235 -197110 -241577 -3726 37781 313914 87675 -267836
18493 -190361 238752 99567 -147550 -159938 -36845 -34638 -253401 -142270 -303655 -280455 -191382
18482 -191382 152681 -277236 54468 308845 -48753 -595931 -392441 177822 -86562 301607
18471 -142960 -161454 30686 78505 -215957 -68722 270832 381134 318429 -94303 57209 249148
18460 249148 40127 120507 -160743 107810 147406 -94787 172629 73240 176602 -156841
18449a58137q138k1658d1686j05536A23700K00170g9611F7961a92344B22446D5626
18437A74255J69768d20494J65393R3287A47660i7792d5096D29991B07090F2171
18426A74538b2372A07156d1980l74061D0696a67226k13521B5999a34624E0629
18415F5683F132f1404H4605k4083a99386B47393A13660D2968L1940l5930J16010
18404A54988i9519b2717j44865M2895j42918Q7929F6206J2009f0557A71395j9419
18393A51976D1262c16702e6241K4417l3749j78520f3575j78441i799B45376C9932
18381a27602k17380C00671b35619g5568j66670e7840m2998C1877J5393c0132A26245
18369B05415H320d764H5051f2491j98800F6739b81254a24451j62134Q2159C0279
$$ plain form
18449 -158137 -166275 -187933 -41686 -147222 123700 323870 -79611 67961 -192344 222446 45626
18437 174255 344023 -420494 -255101 -161814 147660 -97792 -45096 429991 207090 62171
18426 174538 -22372 107156 -41980 -416041 40696 -167226 -380747 25999 -134624 50629
18415 65683 6132 -61404 84605 60522 -199386 247393 113660 42968 74908 38978 154988
18404 154988 -99519 -22717 -167582 -124687 -267605 -179676 66206 78215 -60557 171395 151976
18393 151976 41262 -316702 -56241 -31824 -65573 -244093 -63575 -242016 -9799 245376 39932
18381 -127602 -344982 300671 -235619 -75568 -242238 -57840 -100838 31877 47270 -30132 126245
18369 205415 8320 -4764 85051 -62491 -261291 66739 -281254 -124451 -286585 -204426 30279
18357e0022m8516C1182L9748b72899e1577J8411j86523A51834G5039a27397A96035
18345G3416Q2266E1811e3143A55686m2336c9092k51726H7621b97142A53396L0327
18334A83723i5338b60j96253P264a4499k522B83763f5653k7437C06001a06802
18322a98639J5570A93482b11115G5818d9340j00936j57004a43585A6268a75755
18311F2663a48711O4896A49352c4961D13664e7340A20315R427N4052e4189l7529
18300i1718C26246I0415a83358B73602e03488h5803L9540k77021A5999a96691
18289b46162j1811B50875E3212a2504A11390h7090o3075d981A57426b09075K4069
18278a85006o8589A73779b82052D1991e198A06952a58297k07878k7575a72851
$$ plain form
18357 -50022 -98538 31182 70930 -272899 -51577 -33166 -219689 151834 75039 -127397 196035
18345 73416 155682 51811 -53143 155686 113350 -39092 -290818 87621 -297142 153396 183723
18334 183723 -95338 -260 -196513 -189249 -14499 -17021 283763 -65653 -93090 306001 -106802
18322 -198639 -183069 193482 -211115 75818 -49340 -150276 -307280 -143585 16268 -175755
18311 62663 -148711 -83815 149352 -34961 413664 -57340 120315 129742 183794 -54189 -91718
18300 -91718 326246 90415 -183358 273602 -503488 -85803 -46263 -323284 15999 -196691
18289 -246162 -257973 250875 53212 -12504 111390 -87090 -150165 -4981 157426 -209075 -185006
18278 -185006 -253595 173779 -282052 41991 -5198 106952 -158297 -366175 -393750 -172851
18267g8943J3327A33447b44106f5264A84236a81026A93572b11657H3084i5566
18256a06864A68753b18471k2525j03646b1398C26846B5728g5225C31736j52577
18246A79159g7931b1622j5149G1010g8610J639a125C1043e726C41973i7292j47994
18234b45286K9803D1771g4654j74835g5673M852I7356d65596G0057L0015a0016
18222H5198J29024K12845a61798n3348A46035c8299k3948o7240A14975a8608A08835
18210b59650G9143J11833b41552R8264q7047B37044a26857A00203A0963c9956
18199a2335o2235k94586E0761B1940a13929F6906a00276k3035J7687K6592j81418
18188b60450h7533o0111B03821r6058j1437a04654A10240e36060A48154b4860
$$ plain form
18267 -78943 -65616 133447 -244106 -65264 184236 -181026 193572 -211657 83084 -95566
18256 -106864 168753 -218471 -240996 -344642 -21398 326846 25728 -75225 331736 179159
18246 179159 -77931 -21622 -36771 71010 -78610 -76971 -1125 31043 -5726 341973 -97292 -245286
18234 -245286 -215483 41771 -74654 -249489 -75673 -70821 97356 -465596 70057 100072 -10016
18222 85198 214222 427067 -161798 -215146 146035 -38299 -62247 -129487 114975 -18608 108835
18210 -259650 79143 190976 -241552 -143288 -230335 237044 -126857 100203 10963 -39956
18199 -12335 -74570 -369156 50761 21940 -113929 66906 -100276 -123311 -105624 -79032 -260450
18188 -260450 -87533 -147644 203821 107763 96326 -104654 110240 -536060 148154 -24860
18177B20376c6219O354F340b05308C4426a84729a3217C58113f8956k00154I7596
18165A10722J1210a44839f6239A51027b412D7429J12003m8161b18576B80880A19429
18153c46043h5826o3505j44494b3609m3144j02910b6401A43483Q6089a1373l29703
18142c41076C31270b72213f0384I5400d8032A62682a51765G4031K5893e0801F4396
18130g2779B13301a70726p2766g5295B50982j11700a11322M5259p0035a2720p7058
18119h9778g803j53517E1952J84e2482j96518h1611L9016A6999N5446o202g5980
18106B37882i0380n079l7346C28399b8854j83847M121A09852J03086H6218h9579
18094C2048c3488A79157p5470J68411D4777b29684h2082k96671a76336P4182B16218
$$ plain form
18177 220376 -36219 -29865 6340 -205308 34426 -184729 -13217 358113 -68956 -269110 97596
18165 110722 121932 -144839 -66239 151027 -2412 47429 159432 111271 -218576 280880 119429
18153 -346043 -85826 -149331 -293825 -23609 -66753 -169663 -26401 143483 229572 -11373 -341076
18142 -341076 331270 -272213 -60384 95400 -48032 162682 -151765 74031 99924 -50801 64396
18130 -72779 213301 -170726 -243492 -75295 250982 139282 -111322 -66063 -136098 -12720 -89778
18119 -89778 -7803 -161320 51952 52136 -52482 -249000 -81611 -42595 16999 72445 66243 -75980
18106 237882 -90380 -95459 -132805 328399 -28854 -212701 -208580 109852 212938 86218 -89579
18094 32048 -33488 179157 103687 272098 44777 -229684 -82082 -378753 -176336 -102154 216218
18082a25883a0399E4935b30080r9057K6107a06821H4632e9828C31481a16199j99495
18071c15694A88810a26602k3328l77210H7184c89419a79593N6533f0421C16562
18060i1959o2052A1581K03077M9684n7233i204k29780A37421a44671C29028A02374
18048c1577D4533R3840K29677d1624j96593k8597L7828E5168a27230B3126J45384
18037A68510F0433b04984E2165d80395b4840A04873N9778k0594N6611c47981a1974
18025a54560A44307b04415A48597G565a03716A30499b51416D6908a31870A35478
18014a66975I7438b7753p0415c2257j56830G5659a34260A94958K5349i8460c4228
18002a1566B6006a94333F030g3361C32318G9719a40202B6216a5048j70155C9976
$$ plain form
18082 -125883 -10399 54935 -230080 -329137 -303030 -106821 84632 -59828 331481 -116199 -315694
18071 -315694 188810 -126602 -149930 -527140 87184 -389419 -179593 -123060 -60421 316562
18060 -91959 -154011 11581 214658 264342 207109 -9204 -238984 137421 -144671 329028 102374
18048 -31577 44533 138373 368050 -41624 -238217 -266814 -228986 55168 -127230 23126 168510
18037 168510 60433 -204984 52165 -480395 -24840 104873 164651 144057 200668 -347981 -11974
18025 -154560 144307 -204415 148597 7565 -103716 130499 -251416 46908 -131870 135478
18014 -166975 97438 -27753 -98168 -32257 -189087 75659 -134260 194958 220307 -98460 -34228
18002 -11566 26006 -194333 6030 -73361 332318 79719 -140202 26216 -15048 -185203 39976
17990h9083o5196l2372A8093K315b58992L2003A37008B0149f0029r0659O0746
17979h9942j32657J2930O7256j10485B22201g0462A29985m9401i5325C8966a56761
17967e5083d573j01873B01620E8028a08377A65363a70332j51273a07398l0977
17957a38375H2794J28364d69077h6437G3185f5016l3418J5233A16493J22495i6407
17945a74817H1158a05433C2891a90255m8606A96971a95212k0942B32685g289A2048
17933b00863A74412L5356M2649a51146P5123R151A69693J04655J08942A75668
17922i3900l800k46967d4899B10805a66717E5181c05542a29302d5174I8456b55022
17910c0499A16498d1514k13006A91081C1515a89418B86031a65088j21301B8058
$$ plain form
17990 -89083 -154279 -186651 18093 20408 -258992 -226989 137008 20149 -60029 -150688 -89942
17979 -89942 -222599 -209669 -142413 -252898 222201 -70462 129985 80584 -95325 38966 -156761
17967 -55083 -4573 -106446 201620 58028 -108377 165363 -170332 -321605 -107398 -138375
17957 -138375 82794 211158 -469077 -86437 73185 -65016 -98434 -83201 116493 238988 -96407
17945 -174817 81158 -105433 32891 -190255 -238861 196971 -195212 -216154 232685 -7289 12048
17933 -200863 174412 209768 252417 -151146 -76023 -66872 169693 274348 383290 175668
17922 -93900 -97700 -344667 -44899 210805 -166717 55181 -305542 -129302 -45174 98456 -255022
17910 -30499 116498 -41514 -254520 191081 31515 -189418 286031 -165088 -286389 28058
17899G1306A956J34894d257j3542C3875J63292c0484B5710b9099C57905A8869
17887A39169o5674b16058h5705G8244g8875j59197B29385m1614a96896j16810
17877c13706A58722c30104a42514c4405j2517e698D5598A0577b39002a752B39122
17865B71766a63067A20477J56558a11916A70135a83269B18437M0246A20305m2089
17855G8216a38270b2398D33745a95222r0677g9652k73430A67904n0612a45350
17844a54113k04185A5180a46097A18015b73491a25531B46328F0792b00565i2147
17833A43418a96044N5389m8107O5191A85366a64595A62546B5847b21024f9045
17822A07000c35702c4402A47918J70591N6632C2727J03285k9144a26152B31408
$$ plain form
17899 71306 1956 136850 -4257 -17799 33875 197167 -30484 25710 -29099 357905 18869
17887 139169 73495 -216058 -85705 78244 -78875 -238072 229385 187771 -196896 -313706
17877 -313706 158722 -330104 -142514 -34405 -46922 -5698 45598 10577 -239002 -1752 239122
17865 271766 -163067 120477 277035 -111916 170135 -183269 218437 258683 120305 78216
17855 78216 -138270 -22398 433745 -195222 -285899 -79652 -353082 167904 117292 -145350
17844 -154113 -358298 15180 -146097 118015 -273491 -125531 246328 60792 -200565 -92147
17833 143418 -196044 -140655 -188762 -123571 185366 -164595 162546 25847 -221024 -69045
17822 107000 -335702 -34402 147918 318509 375141 32727 136012 106868 -126152 231408
17811b73534A12062b03063A88104Q7829d2166A03766k9676J14587D57J99233b7564
17799B9969J20037i8644c6490C3285b40335J711A42596h068l28474E9352a19782
17787b82618A14443M9312i4746J2677B4679c36136D27684a52632D0375r769A1941
17775A00427f0427F0026c01428Q4126A64396f6272A68353b4898r6103g43A33660
17763A77686q6136c37604L2418h4917B93283j22672d9326C7500b38577a6338B69580
17751c01908P0058A94436f70C69534C0202c45927d2665B46368a58832D66601h0803
17739F99a03626o6530A36806a08394A23174a8051n2437F185J21648d8578A24460
17727c1642j92692P7917B6534b84961D6617g0525B0761b42959m9513A55029b35501
$$ plain form
17811 -273534 112062 -203063 188104 275933 -42166 103766 74090 188677 457 199690 -27564
17799 29969 150006 -98644 -36490 33285 -240335 -238624 142596 -8068 -336542 59352 -119782
17787 -282618 114443 163755 -94746 -82069 24679 -336136 427684 -152632 40375 30606 11941
17775 100427 -60427 60026 -301428 -217302 164396 -66272 168353 -24898 -121001 -743 133660
17763 177686 91550 -337604 -305186 -84917 293283 170611 -49326 37500 -238577 -16338 269580
17751 -301908 -231850 194436 -670 369534 30202 -345927 -42665 246368 -158832 466601 -80803
17739 699 -103626 -170156 136806 -108394 123174 -18051 -70488 6185 127833 -48578 124460
17727 -31642 -224334 -146417 26534 -284961 46617 -70525 20761 -242959 -292472 155029 -235501
17715f0198C7538K1346Q9804N3804I1528b31924A20623J54900A28570a4771l56090
17704c70861a08512r1966F2386M9472c0116B05852p2849P1709M8846a8384p3514
17693i1898j23523D0714M53L2297b35388A52298e8435A92117c10105d2804n4335
17682i7139B22786b1515A02945b93494a5899j42584a8486q5403b3298q0533A1195
17670A28132C8372P5135K21022F1336L65893e8508k47430a52180B9345n312J0093
17659C4126a27665I8907d23243E2403M09545A096O7388C1911J00177J0417e9831
17647a961I1983b62611Q5285C09977C777a7460p6572B5752K18139b4207l65984
17636c90191e616C75540A01795L66982B02591q2009l5900a25393m5754E0514K55537
$$ plain form
17715 -60198 37538 58884 148688 202492 91528 -231924 120623 275523 128570 -14771 -370861
17704 -370861 -108512 -200478 62386 111858 -30116 205852 133003 204712 253558 -18384 -91898
17693 -91898 -215421 40714 41167 73464 -235388 152298 -58435 192117 -310105 -42804 -97139
17682 -97139 222786 -21515 102945 -293494 -15899 -158483 -18486 -103889 -23298 -103831 11195
17670 128132 38372 113507 334529 61336 427229 -58508 -305938 -152180 29345 24033 34126
17659 34126 -127665 98907 -423243 52403 461948 1096 68484 31911 132088 142505 -59831
17647 -1961 91983 -262611 -177326 309977 3777 -17460 -94032 25752 243891 -24207 -390191
17636 -390191 -5616 375540 101795 468777 202591 120582 84682 -125393 -171147 50514 306051
17625C06051p1998n5564J08814d5033k95887E8353J20583A2554J26122a54002
17614B7254i5960A0021P3702J73805B0054K19145A0564L81088j29784c8855l99294
17603d38149g2453j06300K287q9864i8514M8043j25703j5943M6167c8924F1141
17591B65809D7720a59584f5170A09325b0191B80217a99166Q5909A85165Q7865
17581B73030K2836p1545b7688E0206g844j44986L6366I5042d94469A71956c17557
17569b27125g9902l9818A92485R9742P0347f9988B99478D2611g467D9433Q9363
17558A38796a46253e825n0885B5206c5800l56584b5549A96392a23443L8423A76816
17546A59718K1400J22012H8662K78479A30496K2963B1575a6546F8792b73391F9070
$$ plain form
17625 306051 234053 178489 287303 -45033 -340920 58353 178936 12554 138676 -154002
17614 27254 -95960 10021 83723 257528 20054 239199 10564 391652 261868 -38855 -438149
17603 -438149 -72453 -178753 -176466 -266330 -98514 -50471 -176174 -192117 -145950 -38924 61141
17591 265809 47720 -159584 -65170 109325 -20191 280217 -199166 -113257 185165 273030
17581 273030 295866 224321 -27688 50206 -7844 -152830 -116464 95042 -494469 171956 -317557
17569 -227125 -79902 -119720 192485 292227 362574 -69988 299478 42611 -7467 49433 138796
17558 138796 -146253 -5825 -56710 25206 -35800 -392384 -25549 196392 -123443 -85020 176816
17546 159718 181118 303130 88662 367141 130496 153459 21575 -16546 68792 -273391 69070
17534E5419K0933a84070j02986i6194B40037a81324A92625f4616B45562d7721
17523a8338A59578A5850L85936j78905D7528k2285J86376a39383A67711D7831
17512a11269b0441D9328Q0988b22556A72619a87508j90839A08141E3566J72010
17502B25576F1912J01694O18j4175D5510a003j58798B23800k9457c1809A88739
17490h0974B56410d7398B18181o7624o3153c9895J0312G5596J54223P8908a48649
17478a4328A80812J38813i1572A21094N176b18083B28472m1857D8177h2761p3102
17467a55863B11682j02247P0539E926g7223H7125M0946L23929A26677O8179H6441
17455D9402L23054B6871K46830K05080a8500D16221A81220N1113J81480K4757
$$ plain form
17534 55419 76352 -184070 -287056 -96194 240037 -181324 192625 -64616 245562 -47721
17523 -18338 159578 15850 401786 222881 47528 25243 211619 -139383 167711 47831
17512 -111269 -20441 49328 130316 -222556 172619 -187508 -378347 108141 53566 225576
17502 225576 61912 163606 164224 150049 45510 -1003 -159801 223800 194343 -31809 188739
17490 -80974 256410 -47398 218181 150557 87404 -39895 -29583 75596 229819 308727 -148649
17478 -14328 180812 319625 -91572 121094 126270 -218083 228472 186615 48177 -82761 -155863
17467 -155863 211682 109435 179974 5926 -77223 87125 128071 452000 126677 194856 86441
17455 49402 372456 26871 273701 478781 -18500 416221 181220 232333 413813 438570
17445D38570Q3176j50942j5541G5130L10791j77725M4319d7615A7664J36682C9676
17433D35387a39266B77803C5603J94462p8009K54733j6972j21741o8991J33662
17423C32747J8994L3330J16262j88289j2568A10688i0517C12305O024O5068j19115
17412B64282J17120D4576J2462K07527i360C63438H8637b03198D5600L58812i1262
17400B39516a98694H3071j6372M8038K23579c0120D73214B28346o9796g9447A14889
17388G29761B56170a09034I1803K46327p8708O1362k7209c931k22255g2408k4452
17377i6860B59103a93409A90030K29845D597L6261J57827o8710j4497K10376j21675
17366B04179J18521A10073J26P1467R161F6320J69018r6225J9575R8467J16003
$$ plain form
17445 438570 521746 370804 355263 75130 385921 208196 252515 -47615 17664 154346 39676
17433 435387 -139266 277803 35603 230065 152056 406789 389817 268076 199085 332747
17423 332747 351741 385071 501333 313044 300476 110688 -90517 312305 318329 383397 264282
17412 264282 381402 44576 57038 264565 -9360 363438 88637 -203198 45600 404412 -91262
17400 239516 -198694 83071 66699 114737 338316 -30120 473214 228346 158550 -79447 114889
17388 729761 256170 -109034 91803 338130 259422 320784 293575 -3931 -226186 -72408 -96860
17377 -96860 259103 -193409 190030 419875 4597 40858 198685 129975 115478 325854 204179
17366 204179 322700 110073 110199 181666 190827 66320 235338 139113 158688 257155 373158
17355C73158j28034c1739j0178k22318A93111a14247G5035K45096H9795J66889
17345B56684A07904K11759A55403A4962M31387B9067L15187a86604B12893c5725
17334B51279D1201q804J51086p2241c40166M7482j53819B72553d767C01082A09767
17322C23425B7027Q286J31552K15194A7109J88361E1141L09436B211J7144J21427
17311A40782B2426J24417K17351I8573H987c1043F3154K63207l6120B0862a72695
17299c5902B39386I0598e1794k54126B5977J29494a61885D90106A62887H0630
17288C63639A39178d9742C08264l7006F3560K95853j52550E9695a09980B25673
17277B53467P1365q6451m4733p4602N8197K27678j71717J36676J06978i6897C50927
$$ plain form
17355 373158 245124 -31739 -41917 -264235 193111 -114247 75035 320131 89795 256684
17345 256684 107904 319663 155403 14962 446349 29067 344254 -186604 212893 -35725
17334 251279 41201 32397 183483 111242 -340166 -292684 -446503 272553 -4767 301082 109767
17322 323425 27027 35313 166865 382059 17109 205470 51141 360577 2211 19355 140782
17311 140782 22426 146843 364194 98573 8987 -31043 63154 326361 290241 20862 -172695
17299 -35902 239386 90598 -51794 -305920 25977 155471 -161885 490106 162887 80630
17288 363639 139178 -49742 308264 271258 63560 359413 206863 59695 -109980 225673
17277 253467 324832 238381 193648 119046 177243 404921 233204 369880 476858 -96897 350927
17265A46854R511J60796m2856Q7451a11801J676B68212g1284B64981a69641C29235
17253g0484j34939A16256O6883p0523L56705I7558J89613J25211j86516d2782
17242a8080D51298D6567J53825J50801r0749l4440P4388a01306B66049h5274B33238
17230A0227K28452B4168M0303L58916A37784b08804A33020M5192N31050A46478
17219E48002A86560l0977q324J11162K31960o6466c04277B96325j41957K35637
17209C90005M0684A99057m5299J24492d9944A39647L29279A80368p7122Q8075
17199A91321d541A80269k4913b7837A29K97678r1460R3738g7502E3377M24360
17188D77737A65573l6071J6535L24291A20352L25943O19I0734a84973H6478L8150
$$ plain form
17265 146854 156365 317161 274305 361756 -111801 -110125 268212 -71284 264981 -169641 329235
17253 -70484 -205423 116256 183139 112616 469321 97558 287171 412382 225866 -42782
17242 -18080 451298 46567 200392 351193 260444 226004 300392 -101306 266049 -85274 233238
17230 10227 238679 24168 64471 423387 137784 -208804 133020 178212 709262 146478
17219 548002 186560 155583 147259 258421 490381 423915 -304277 296325 154368 390005
17209 390005 430689 199057 153758 278250 -49944 139647 468926 180368 103246 191321
17199 191321 -4541 180269 155356 -27837 129 297807 206347 300085 -77502 53377 477737
17188 477737 165573 129502 146037 470328 120352 446295 446914 90734 -184973 86478 124628
17177A24628J65667B7920L08583H6943J82277p5684N7868c24876E4904L50555
17167D05459A78972e4675B48765p3988R51q2537A0430M80141a15944C52128M9554
17156D01682A35592J77538J92282j81551e8833A41481J64676J92281k37908K95908
17146E56438k55184D7264K9345M50974F564K56154J59834j63410p8679Q1004j3372
17135B48095J9856N4223k591K7437R1495B15969J7914K28372j43580J95322A26992
17123B34863J83450j519H7507N21463q8535j78642o2534N7790n2752K23492k02553
17112C05236b8298B86172J76032J55058B81353n5891L4222m0539O6051O5350L2824
17101C83370J81049j54418J02177L3793A32816L422J24220J00975A62512o421
$$ plain form
17177 124628 290295 27920 336503 86943 269220 193536 251404 -324876 54904 405459
17167 405459 178972 -54675 248765 174777 175728 93191 10430 490571 -115944 352128 401682
17156 401682 135592 313130 505412 323861 -58833 141481 306157 498438 260530 556438
17146 556438 301254 47264 76609 527583 6564 262718 422552 259142 180463 261467 248095
17135 248095 267951 322174 319583 347020 438515 215969 233883 462255 318675 513997 126992
17123 234863 418313 416794 87507 608970 520435 341793 279259 337049 284297 507789 305236
17112 305236 -28298 286172 462204 617262 281353 225462 259684 219145 285196 350546 383370
17101 383370 564419 410001 512178 545971 132816 136238 260458 361433 162512 156091
17091A56091N22522j28264A55238c2160C67286M9122o4043R4778J3076K08809
17081F69028j77235j06728L607j31744J01890j70147M17354A96710J69251k8330
17071C37631q8302L3526L5381J35420P3814p8254k02799J62530L14741k93961
17061D29727o3764J07411Q717j84847L23163J79768A33595O99157r6571B11477
17050C81164N04203j81609C13408J15969K05293B52388L56222B16830M93065r4121
17040F15774C00183N09749B25126J80733K2875J96891J51963j67844l6080j63201
17030D10463K09207j43947j0200L46156k21016j99818M59891D05982R9704J31757
17020F37443k65616J70842J15513j00909l7155J4678j00759K24578j14647K04810
$$ plain form
17091 156091 678613 550349 155238 -32160 367286 416408 352365 447143 460219 669028
17081 669028 491793 385065 388672 256928 358818 188671 606025 196710 365961 337631
17071 337631 249329 282855 318236 453656 527470 449216 246417 408947 723688 429727
17061 429727 365963 473374 482091 297244 620407 800175 133595 832752 736181 211477
17050 381164 885367 703758 313408 429377 634670 252388 608610 216830 709895 615774
17040 615774 300183 809932 225126 405859 428734 625625 777588 609744 573664 410463
17030 410463 619670 475723 465523 811679 590663 390845 850736 405982 505686 637443
17020 637443 371827 542669 658182 557273 520118 534796 434037 658615 543968 748778
17010G48778k67669L83685m14178J62079j34595J41880q726N44823k37622k89750
17000F28705R1593L3830k57780q1595L13829j50542J08102R2640j39554K60323
16990H99551l71703L08448l03316N4263K03473r8485K53220j44359J48987m05906
16980E44173K64355L6018L46858m82676q2905j20053K42369J09134K87798C59238
16969E55282M65559m86961P82161n65992J60393j21548O3865L6517j7375L72906
16959A244807k93027n3392l5856l15084K70561K54697j71731J14973J50684Q4981
16949A251613k42052J70264l70931J0538Q5780K01281K18792l41839K70277J18900
16939A372623k58729m1910K6399J80052L31017l44341n0836J48243J38599l38422
$$ plain form
17010 748778 481109 864794 450616 612695 478100 619980 611254 1156077 918455 628705
17000 628705 720298 754128 496348 414753 728582 578040 686142 778782 639228 899551
16990 899551 527848 836296 532980 587243 790716 692231 945451 801092 950079 544173
16980 544173 808528 844546 1191404 708728 625823 505770 748139 857273 1145071 359238
16969 555282 1020841 533880 1316041 750049 910442 788894 852759 889276 871901 1244807
16959 1244807 951780 898388 862532 547448 818009 1072706 900975 1015948 1166632 1251613
16949 1251613 1009561 1179825 808894 819432 905212 1106493 1325285 983446 1253723 1372623
16939 1372623 1113894 1071984 1098383 1278435 1609452 1265111 1214275 1362518 1501117 1162695
16929A162695R4925J79105L9351j86876j75263J24738L4439j99698K50164L21807
16919A645387m85346j5129L30511j77254j8782J10378N7118r1324o4061o5555
16909A225943K43840n8705K00020m57226N03601j23007M9238k29384N4379J68306
16899A577005J3712l8349j30J60173O1820l8018J74061n87992J46406M32044L91436
16888B292168n52881L21805l87952J41144J2394J84359L8687n3214j5347J46402
16878B127565K06960l25604k8789K09897m40606M23695M7979L11907j59475j62106
16868B211423j14562K31943J55834k29824Q9736J3494j13649K75401K24041j60059
16858B583778k31249K03903K12437j05083N91393l88486K3155j17993P8998j1739
$$ plain form
16929 1162695 1257620 1436725 1476076 1289200 1113937 1238675 1273114 1073416 1323580 1645387
16919 1645387 1160041 1144912 1475423 1298169 1279387 1389765 1446883 1355559 1291498 1225943
16909 1225943 1469783 1411078 1611098 1153872 1657473 1534466 1583704 1354320 1408699 1577005
16899 1577005 1590717 1552368 1552238 1712411 1774231 1736213 1910274 1322282 1468688 1900732 2292168
16888 2292168 1739287 2061092 1673140 1814284 1826678 2011037 2049724 1996510 1981163 2127565
16878 2127565 2334525 2008921 1980132 2190029 1749423 2173118 2221097 2533004 2373529 2211423
16868 2211423 2096861 2328804 2484638 2254814 2344550 2358044 2244395 2519796 2743837 2583778
16858 2583778 2352529 2556432 2768869 2663786 3255179 2866693 2889848 2771855 2850853 2839114
16848B839114J83321k36256L65714K79633k65005M7455j78017L24136j58172P41574
16838C943497k33091l51823M52962J23278l12374M67988j81493L50665n30426
16829C729183N32655l86604L30358L14718j85703J65037L01053k76366M56212
16820D980543J53490n6686k59019K21774l77387N55933L67805J23809n1395J17946
16810E776813P9253Q5775J31272M79269q0742j0843O13196k42892L09497l07415
16800F833183M67895L696L26883L085M25109J51945k9794L77056J22610M61170
16790I142838L06003K48446L26424p8638p4963P71739L03641M36923L5997Q075
16780A1426485J028130r4205K99954L89698N64318K71095J045500K93197L22477
$$ plain form
16848 2839114 3022435 2786179 3151893 3431526 3166521 3213976 3035959 3360095 3201923 3943497
16838 3943497 3710406 3358583 3811545 3934823 3622449 4090437 3908944 4259609 3729183
16829 3729183 4261838 3875234 4205592 4520310 4334607 4499644 4800697 4524331 4980543
16820 4980543 5134033 5077347 4818328 5040102 4662715 5218648 5586453 5710262 5658867 5776813
16810 5776813 5856066 5941841 6073113 6552382 6471640 6460797 7073993 6831101 7140598 6833183
16800 6833183 7301078 7304774 7631657 7634742 8059851 8211796 8182002 8559058 8681668 9142838
16790 9142838 9448841 9697287 10023711 9945073 9870110 10641849 10945490 11382413 11418410 11426485
16780 11426485 12454615 12360410 12660364 13050062 13614380 13885475 14930975 15224172 15546649
16771A5546649N08160K18027R76158O4525Q68768Q48230P94972M26872O87235
16762B0939596N70080J388890P23839R38822J003714Q08229J257977J058124J336654
16753C0025925J342452J337023J897476J304281J404352K145024J783780K221132
16745D3461445K528434J932720K504977K679167L153312K988381L519837L319977
16737F6088250L842247M313349M628366M603516N057331N293072N667288N821343
16729A05314762O806347O320001P075121O496106P305444P267293O996287P078211
16721A60659572O432767N829842N663920M264742L427086J958460J102740Q4586
16713A89423715j537000k334169m104174m453777n424458o263082o726537o659428
$$ plain form
16771 15546649 16054809 16272836 17248994 17313519 18182287 19030517 19825489 20252361 20939596
16762 20939596 21509676 22898566 23622405 24561227 25564941 26373170 27631147 28689271 30025925
16753 30025925 31368377 32705400 34602876 35907157 37311509 39456533 41240313 43461445
16745 43461445 45989879 47922599 50427576 53106743 56260055 59248436 62768273 66088250
16737 66088250 69930497 74243846 78872212 83475728 88533059 93826131 99493419 105314762
16729 105314762 112121109 118441110 125516231 132012337 139317781 146585074 153581361 160659572
16721 160659572 167092339 172922181 178586101 182850843 186277929 188236389 189339129 189423715
16713 189423715 187886715 185552546 181448372 176994595 171570137 165307055 158580518 151921090
16705A51921090p428520p117581p425939o743756o922614o578968o342845n748689
16697I7612178n938224n074925m875903m643266m427800l964841l911715l232396
16689F1543108l553525k732131l259371k595018k657724k121047k185176k094246
16681D0344870k010565j668102j781846j552041j685608j336201j158077j092553
16673B8059877j028521j434145r77335j020172p45981r34607o92301j117696p11102
16664A9398017n10647j076677o9712m05880r74584m91374l56390o45545p76994
16655A4090214k41104m54935m48694l79681m03021R3459n49160n10274l45427
16646A0851377j65543l64884l70807l11124J3348m86142j71901k84855j44133
$$ plain form
16705 151921090 144492570 137374989 129949050 123205294 116282680 109703712 103360867 97612178
16697 97612178 91673954 86599029 81723126 77079860 72652060 68687219 64775504 61543108
16689 61543108 57989583 55257452 51998081 49403063 46745339 44624292 42439116 40344870
16681 40344870 38334305 36666203 34884357 33332316 31646708 30310507 29152430 28059877
16673 28059877 27031356 25597211 24619876 23599704 22853723 21919116 21226815 20109119 19398017
16664 19398017 18887370 17810693 17740981 17335101 16360517 15869143 15512753 14867208 14090214
16655 14090214 13849110 13394175 12945481 12565800 12162779 12256238 11707078 11196804 10851377
16646 10851377 10685834 10320950 9950143 9639019 9652367 9166225 8994324 8709469 8565336
16637H565336o5012m94336K18051k60310k81352m11098k51682R306j55461l5437
16627F838005k11790j96019J8849n35927J74711L8587j47907k37707m13583K43154
16617E570373j32598l01074K0975r5190R7530k45658m15232Q0112l78144j17955
16607D083139J50846K11644n33471K43126j05309M4336n61071L79285k76351M4127
16597C680301j73874K823j12170k0772K64992k80480k09110L8694M5007j66650
16587C068761K23848l91193Q116l5233j44062M570J79239J76035n16305Q2377
16577B656153k10735l7968L870R6055k62762L41867k01355k29244J07487m3576
16567B219792P6705K1397j75807l7997J60205l10691o6144M3573K66614m52417
$$ plain form
16637 8565336 8500324 8005988 8224039 7963729 7682377 7271279 7019597 7028903 6873442 6838005
16627 6838005 6626215 6430196 6449045 5913118 6087829 6126416 5978509 5740802 5327219 5570373
16617 5570373 5437775 5136701 5157676 5062486 5160016 4914358 4499126 4579238 4201094 4083139
16607 4083139 4233985 4445629 3912158 4155284 4049975 4094311 3533240 3912525 3636174 3680301
16597 3680301 3506427 3509250 3397080 3376308 3641300 3360820 3151710 3190404 3235411 3068761
16587 3068761 3292609 2901416 2909532 2874299 2730237 2734807 2914046 3090081 2573776 2656153
16577 2656153 2445418 2407450 2411320 2507375 2244613 2586480 2385125 2155881 2263368 2219792
16567 2219792 2296497 2317894 2142087 2104090 2264295 1953604 1887460 1931033 2197647 1745230
16557A745230K67138j99388J79389k34986Q3974k12410J22182J38204j5920j05317
16547A768096K38214l67312J97756j6477L32750p13018L06704j98978l46872L52537
16537A553400j95482J4150J43884k9944m43343N15247q184j51161J15418j78892
16527A335093k06952K53588j27578j26592J83243k38941J64132M0000j86493L4329
16517A123829K5563L11280m17526L44824l80171K10033J92573j54382j77386J56043
16507A234680n5979P9873j00607r0618K8387Q0924l93887K40831k00846K49201
16497A071959J7545N2543j46998m5040k12996K70981m8631l9963q1570j46650
16487F91180q5552R4982K77034m01484L79694k73259J25450J83993k46456p9615
$$ plain form
16557 1745230 2012368 1812980 1992369 1757383 1841357 1628947 1751129 1889333 1873413 1768096
16547 1768096 2006310 1638998 1836754 1820277 2153027 1440009 1746713 1547735 1200863 1553400
16537 1553400 1357918 1372068 1515952 1486008 1042665 1557912 1549728 1398567 1513985 1335093
16527 1335093 1128141 1381729 1254151 1127559 1310802 1071861 1235993 1275993 1089500 1123829
16517 1123829 1149392 1460672 1043146 1387970 1007799 1217832 1410405 1256023 1078637 1234680
16507 1234680 1178701 1258574 1157967 1067349 1095736 1176660 782773 1023604 822758 1071959
16497 1071959 1089504 1142047 995049 950009 737013 1007994 959363 919400 837830 691180
16487 691180 605628 700610 977644 576160 955854 682595 808045 992038 745582 665967
16477F65967P662K64222k40444o6953J61790p6699n0982J68515o5576J71741l10292
16466F28951r409o8730K40503J11105r2605p620J11391q7952o3120B65495K58674
16455E24169J02654p7856K56674M23622D55798J76403K65890j27318j72239R4573
16445F93107j3492n0096k77445o3857L95047k9300N4966J91335l62062L3502J04470
16434F76175L25579m23212L42883p0164M59568B50168L13388j32811M4529J50363
16424F25637j6799k21014K5916J39463p7394m7787A69748M92959j03481j94020
16414C65206L74803p3957j27290q407L4314l5898K3747k19691J61280q3394J52389
16403E63102q9659p5532N6296o2618j14887J10341J61856k01830J74853d56B44597
$$ plain form
16477 665967 673629 937851 697407 630454 792244 715545 664563 833078 767502 939243 628951
16466 628951 619542 550812 791315 902420 809815 802195 913586 825634 762514 265495 524169
16455 524169 626823 548967 805641 1229263 455798 632201 898091 770773 598534 693107
16445 693107 679615 629519 352074 288217 683264 653964 708930 900265 538203 571705 676175
16434 676175 1001754 578542 921425 851261 1310829 250168 563556 430745 475274 625637
16424 625637 608838 387824 413740 553203 475809 428022 169748 662707 559226 365206
16414 365206 740009 666052 538762 530355 564669 528771 552518 332827 494107 410713 563102
16403 563102 473443 397911 454207 391589 276702 387043 548899 347069 521922 -456 244597
16391A28240J30365K76136J95405j26790E0109J04732J56326L9705p8662J29380
16381D01590q0113K17892k12324Q3433j06481R0027A63394L80799k61237L8958
16371C21914P8325j53619G5153J95092M04777m9585k89455K13971j42665J56711
16361E63999p1833j48658J73949F4377L5018K05977Q7549A08018L64744j02791
16351C69971r9966M17918C39532A06498K14737L7765j34288M05110F9314J68634
16341B37948H9722J83290N1564j45215m5165J78095A08175K70280K03422I9053
16330B08328j01713l0253K20963F9808L34844l0932p6931p4450J81312i658B75690
16318C63325M3621j53452A16074K52268j12515J00767l0772j35706J15555m0145
$$ plain form
16391 128240 258605 534741 730146 603356 50109 154841 311167 350872 272210 401590
16381 401590 321477 539369 327045 410478 303997 394024 163394 544193 282956 321914
16371 321914 400239 246620 75153 270245 675022 625437 335982 549953 407288 563999
16361 563999 492166 343508 517457 64377 99395 305372 392921 108018 472762 369971
16351 369971 270005 687923 339532 106498 321235 359000 224712 629822 69314 237948
16341 237948 89722 273012 324576 179361 134196 312291 108175 378455 581877 99053
16330 208328 106615 76362 297325 69808 404652 373720 296789 222339 403651 -9658 275690
16318 363325 406946 253494 116074 368342 255827 356594 325822 190116 305671 265526
16308B65526M5643k8054K9713A10447L46463A62005J0916j1442P6261K21686o2119
16297C97307A93763J38140O618k7804J29436m4818r8031A36574J18690J24362
16287C79626A5994L19877p6877B5662J70633Q3196K3591j10497l3537m3754K29999
16276C45293A02197L89747A38336N8370h0915B03484b27188c5963B85456j41139
16266A44317Q668C0796A2803J95231g2405K7996B98180g3382F0445f1508D93780
16254A28786o0072M3949j3852d1804C28133o769p3229A19080i9175C97770o5467
16243C32303A09507K88225j65161d0057A92346N9792B0034i9036G4960J14630
16233A89590J83775m8971c0565I1056b28738A6362b75464B07251c900C48643k588
$$ plain form
16308 265526 311169 283115 312828 110447 456910 162005 172921 161479 237740 459426 397307
16297 397307 193763 331903 338521 310717 440153 395335 297304 136574 255264 379626
16287 379626 15994 335871 258994 25662 196295 279491 303082 192585 159048 115294 345293
16276 345293 102197 491944 138336 196706 -80915 203484 -227188 -35963 285456 144317
16266 144317 152985 30796 12803 208034 -72405 -44409 298180 -73382 60445 -61508 493780
16254 128786 68714 112663 98811 -41804 328133 321364 248135 119080 -99175 397770 332303
16243 332303 109507 397732 232571 -40057 192346 252138 20034 -99036 74960 189590
16233 189590 373365 324394 -30565 91056 -228738 16362 -275464 207251 -3900 348643 346055
16222C46055A67662A2804K01647R7702A46858b7081A72614K51970b77964A99558
16211A19647a6414j40233A89022q7458L71439c29149A94335m1653n5482h5726
16200F4575P6828a8318B04720Q0956l06A15705J04465J17237I4966b0209B01274
16188a56783A88059L7174G7492K0684a87000A22083a86800h4828C80200q3631
16178B96569q4819a06145n8652A82872f7353l2925d0939D6901J24553j3402O8497
16167B26549N1043G2562a00636l9991I022J28962K34454b05766C64281G4245m88
16156G3757K85156n4997p3423O8734d3285k2526E27044q1879f0316j04843B35335
16144A4334K62047r3672n7853d7653F4157P2257a94315E6972a61780d4C35272
$$ plain form
16222 346055 167662 12804 214451 312153 146858 -27081 172614 424584 -277964 199558
16211 119647 -16414 -156647 189022 101564 473003 -329149 194335 152682 97200 -85726
16200 64575 141403 -18318 204720 285676 285370 115705 220170 337407 94966 -20209 201274
16188 -156783 188059 225233 77492 98176 -187000 122083 -186800 -84828 380200 296569
16178 296569 211750 -106145 -164797 182872 -67353 -100278 -40939 46901 171454 158052 226549
16167 226549 277592 72562 -100636 -140627 9022 137984 372438 -205766 364281 74245 73757
16156 73757 358913 303916 230493 299227 -43285 -65811 527044 445165 -60316 -165159 235335
16144 14334 276381 182709 124856 -47653 64157 136414 -194315 56972 -161780 -44 335272
16132b66117b9851q1752E7880J21788P2995a67162d0395J242B09960A5610J29312
16121A44922e969o1398D7906a81477A36139C7966j2762a53910j6815b0715j03074
16110a23789q0479A04934K11561G3322b51805A01003D3118N0152L756a81032A64564
16098A20842N1215K6880d459A2752J58245R6631d1885B93341A5099h0666k5699
16087a06365A49349J62293A02243K28600I652a92869A58498a60177b9108A1854
16076a51449O7150B99793g206j89560d4667k47886b4131B8329a9002r816E10832
16064g2092H4388k8077K96457G985e7165A64249b37057g4293j40626b0173A43063
16052c89456h2469j66866J24525m3915E6448b22205c2722k65395a21921a5814
$$ plain form
16132 -266117 -29851 -111603 57880 179668 252663 -167162 -40395 -39153 209960 15610 144922
16121 144922 -5969 -67367 47906 -181477 136139 37966 25204 -153910 -170725 -20715 -123789
16110 -123789 -204268 104934 316495 73322 -251805 101003 43118 93270 97026 -181032 164564
16098 120842 172057 198937 -4459 12752 170997 267628 -41885 293341 15099 -80666 -106365
16087 -106365 149349 311642 102243 330843 9652 -192869 158498 -160177 -29108 11854
16076 -151449 -84299 299793 -7206 -196766 -44667 -292553 -24131 28329 -19002 -28818 510832
16064 -72092 84388 56311 352768 7985 -57165 164249 -237057 -74293 -214919 -20173 143063
16052 -389456 -82469 -249335 -124810 -168725 56448 -222205 -32722 -298117 -121921 -15814
16041B29697G7964K7911F052c1462H1098R8256p5448a82241G8972l3098d1515
16029B42156A0773i3574K976G9066c61684f417m473l9130B3667K69931c2920H4401
16016G9178h0234n1138e0236j70386A85618N3859c3516P860B3895a3674C52779
16004i5711r9874m2508H3930l8662d9301A09965c19754A31098a84609N882j5349
15993a94076D6410K361O1291l3080o483j5905b48255C15839j33403n6976a86260
15981A29086r576P6876I3863L1297J14736b0396H3179K0498J71990D8902J30402
15970A79304a0569G8446b2908A97804d1757l32572E792J8648R07a50375j89841
15959c40216a28323B7534f9138A98251g6574A10894g5153C7689A303e7784o6447
$$ plain form
16041 229697 77964 105875 6052 -31462 81098 179354 103906 -182241 78972 45874 -41515
16029 242156 10773 -93574 -90598 79066 -361684 -6417 -10890 -50020 23667 293598 -32920 84401
16016 79178 -80234 -131372 -50236 -220622 185618 239477 -33516 -25656 23895 -13674 352779
16004 -95711 -195585 -238093 83930 45268 -49301 109965 -319754 131098 -184609 -178727 -194076
15993 -194076 46410 48771 110062 76982 70499 54594 -248255 315839 182436 125460 -186260
15981 129086 119510 196386 93863 125160 239896 -20396 83179 103677 275667 48902 179304
15970 179304 -10569 78446 -22908 197804 -41757 -374329 5792 24440 25347 -150375 -340216
15959 -340216 -128323 27534 -69138 198251 -76574 110894 -75153 37689 1303 -57784 -124231
15948a24231j59940a15001a3019j9300j14906j70609E7315J25774H427a76794
15937a91467A11186e47459a83386l3880c2257n1865j24408h6893A62607p4055
15927H8552P0594f9172A60955b06579L2090L9869N1823A14854l8388C4074b11914
15915F3826b29586A33553a21753A12471h3900l7704a9368A80558a88552K3431
15905a65121f5159A03749a73050Q3655j8844A21124j0393J11903g2843A55845
15894a80194A18235g4508D6864K38447b50863A81399O4544a01431M2208B02508
15883b26319C55883A53466R1978b37940R7140b1420j08771m8454A90925i9432
15872a10038c9515j69224Q5108c9372E1944d2258A18751R0427C2795a46272j89431
$$ plain form
15948 -124231 -284171 -115001 -13019 -32319 -147225 -317834 57315 183089 8427 -176794
15937 -191467 111186 -547459 -183386 -217266 -32257 -84122 -208530 -86893 162607 88552
15927 88552 159146 -69172 160955 -206579 -174489 -134620 -82797 114854 76466 34074 -211914
15915 63826 -229586 133553 -121753 112471 -83900 -121604 -19368 180558 -188552 -165121
15905 -165121 -65159 103749 -173050 -89395 -108239 121124 110731 222634 -72843 155845
15894 -180194 118235 -74508 46864 285311 -250863 181399 245943 -101431 -59223 202508
15883 -226319 355883 153466 245444 -237940 -140800 -21420 -130191 -178645 190925 -99432
15872 -110038 -39515 -208739 -123631 -39372 51944 -42258 118751 209178 32795 -146272 -335703
15861c35703r8031d0443B74019a11616k34425D667b06778B03289b91820O5048
15851b26772B17830L5254c65167f2097j71840C95045i6033K9610A16232B5552
15840b70309a2607m1582k23051g4990q5172r3354A00696a63450F5395a24628j09851
15829b34479j53012H7582e3656F082R171J68355a61913A42415b80131R5613J0308
15818a74210m3092f87A09867b7342k93902e3082B02161a34173F0745i8802k40555
15807c39357b008B4644c56254i8956A87589G8105J86500b75767B13352A7625K62083
15796B79708C4084a33764m6935a5353G3285J947R878a67606q4671c8666j3871
15785e2537B75724a45785r8813D1665N9515J78957D8571b03248B5508i4193A46003
$$ plain form
15861 -335703 -433734 -40443 274019 -111616 -346041 4667 -206778 203289 -291820 -226772
15851 -226772 217830 253084 -365167 -62097 -233937 395045 -96033 -66423 116232 25552
15840 -270309 -12607 -54189 -277240 -74990 -160162 -253516 100696 -163450 65395 -124628 -234479
15829 -234479 -387491 87582 -53656 6082 15253 183608 -161913 142415 -280131 -184518 -174210
15818 -174210 -217302 -687 109867 -27342 -321244 -53082 202161 -134173 60745 -98802 -339357
15807 -339357 -2008 24644 -356254 -98956 187589 78105 264605 -275767 213352 17625 279708
15796 279708 34084 -133764 -180699 -15353 73285 75232 85110 -167606 -252277 -38666 -52537
15785 -52537 275724 -145785 -244598 41665 101180 280137 48571 -203248 25508 -94193 146003
15773D17031G4653c27849A85532D5933b36666A01468l432g0942j46157J2833b8343
15761a06854j25171c2712A63137B2275a68938G6749a05167o9969A34155b22125
15750a43990L4779A56450d0539B9913g9397j15794f88B06886e1522j83556f9875
15738a76504A1300a1619A71623i8550B47418a5662A36212a4957B9705a59605R290
15727a50315C2067b48199A48879D8782J95519c3670j45627P4162J9542B49367
15716B16750b18838L2273h1255d305B26949L6560a7349A3659c48116B1593c34651
15704A27344b83587A69079b87656g7370G0290g26045i6016E1526J07311b61560
15693D9199R1028a2734G8116b23879g3308o8278C9454A1682a4218I0770a18438
$$ plain form
15773 417031 74653 -327849 185532 45933 -236666 101468 98036 -70942 -217099 -204266 -28343
15761 -106854 -232025 -32712 163137 22275 -168938 76749 -105167 -175136 134155 -222125
15750 -143990 -109211 156450 -40539 29913 -79397 -195191 -688 206886 -51522 -235078 -69875
15738 -176504 11300 -11619 171623 -98550 247418 -15662 136212 -14957 29705 -159605 -150315
15727 -150315 32067 -248199 148879 48782 244301 -33670 -179297 -105135 -85593 249367
15716 216750 -218838 -186565 -81255 -4305 226949 263509 -17349 13659 -348116 21593 -334651
15704 127344 -283587 169079 -287656 -77370 70290 -726045 -96016 51526 158837 -261560
15693 49199 140227 -12734 78116 -223879 -73308 -141586 39454 11682 -14218 90770 -118438
15681A98979D9082m184a2903l83503a27943j22688C5601H364a54126f3965j88198
15670b52163B5199c7594p3755A03596J64876b95858D7962d99605g7976j63272
15660b41248b6743A34789K25658j77057a49624f6685j48377A40861m7471e2320
15649a18923H0325D434b2274j08610I3954a69025C37249c873B67438j08771D0903
15637A26572a22125j58027h6294L9100H521B505J3386b34365f040A24797O691
15626A31488P6958c88471A08297A9973g2787k46376L80E3355n040b22737b7875
15614I6090K54634c21750b6633m21287a44797K7054l6561O8355k17655a25874
15603C12321B0623a3529j36346P2192a5666r2941p5282j23302A32279n2540b38842
$$ plain form
15681 198979 49082 44898 -12903 -396406 -127943 -250631 35601 8364 -154126 -63965 -252163
15670 -252163 25199 -37594 -111349 103596 268472 -295858 47962 -499605 -77976 -241248
15660 -241248 -26743 134789 360447 183390 -149624 -66685 -215062 140861 93390 -52320
15649 -118923 80325 4434 -22274 -130884 93954 -169025 337249 -3873 267438 158667 40903
15637 126572 -122125 -280152 -86294 -47194 8521 2505 15891 -234365 -6040 124797 131488
15626 131488 208446 -388471 108297 19973 -72787 -319163 -318783 53355 48315 -222737 -27875
15614 96090 350724 -321750 -26633 -447920 -144797 -117743 -154304 -85949 -303604 -125874
15603 312321 20623 -13529 -149875 -77683 -15666 -108607 -183889 -307191 132279 79739 -238842
15591b8154n1159c2055E3997c83807H6903a66140A23251P9778A6853a52342c9110
15579f19895b78869A04792b31121A9208f4995B7578i1572j44006f4320b8868k09047
15568b37915D3139m995A5194J20100h641m976l02189D23812a31438c5052n9754
15557i4806O698A13321K26349c8387G7621K9381b92898A20971a32854A54415b88584
15545A45463h9251A46808b09781L5517j0778C65231B3111g7237C3638K25253m834
15534B54057b04262A30011a85165h7672b7150H3242c642p8444r9835g400q6776
15523i4176n040B39564b8270j31716d8642B16453d9895k97755a49794c1134A01633
15511b46008r3925n9332C42246F1254b00437B61989A1014c52910D0435d52166
$$ plain form
15591 -28154 -79313 -32055 53997 -383807 86903 -166140 123251 203029 16853 -152342 -39110
15579 -619895 -278869 104792 -231121 19208 -64995 27578 -91572 -235578 -64320 -28868 -237915
15568 -237915 43139 38144 15194 135294 -8641 -13617 -315806 423812 -131438 -35052 -94806
15557 -94806 -88108 113321 339670 -38387 77621 107002 -292898 120971 -132854 154415 -288584
15545 145463 -89251 146808 -209781 -174264 -185042 365231 23111 -77237 33638 258891 254057
15534 254057 -204262 130011 -185165 -87672 -27150 83242 -3642 -82086 -181921 -7400 -94176
15523 -94176 -99216 239564 -28270 -159986 -48642 216453 -49895 -347650 -149794 -31134 101633
15511 -246008 -339933 -399265 342246 61254 -200437 261989 11014 -352910 40435 -452166
15500e2470j67664B06670I3598F104J91995I2228N2877a14356j15186i9313b6182
15488f7835j71746M8107j3029N1200A93834e7140k13637N7438M0955G9686A6662
15476E8471h6517G278a47831r3864C21430a69694A03109a04355p0079h6595A56542
15464A3243J08524E3513a15091n23j27485B46859i541A5125J83386J51445c27393
15452g8379C45003F3103O5449c18497Q6477B12514d7440A02889a795A33090a3815
15440a7125A28026A3560a4819H14i0581B61796f4289K1255F4149b42896i1645
15428a85871b9341k24825Q0226A68805a71105O0133l15951C141K12192l7198q0772
15417I7363K11575o9193j4374I1362a44396B48544L5591a40332B5279J16110n1154
$$ plain form
15500 -52470 -220134 206670 93598 6104 198099 92228 145105 -114356 -229542 -99313 -26182
15488 -67835 -239581 -191474 -204503 -153303 193834 -57140 -270777 -213339 -172384 79686 16662
15476 58471 -86517 7278 -147831 -241695 321430 -169694 103109 -104355 -174434 -86595 156542
15464 13243 121767 53513 -115091 -115614 -243099 246859 -9541 15125 198511 349956 -327393
15452 -78379 345003 63103 128552 -318497 -232020 212514 -47440 102889 -1795 133090 -13815
15440 -17125 128026 13560 -14819 814 -90581 261796 -64289 -43034 64149 -242896 -91645
15428 -185871 -29341 -254166 -173940 168805 -171105 -110972 -426923 3141 215333 178135 97363
15417 97363 308938 239745 225371 91362 -144396 248544 284135 -140332 25279 141389 90235
15406I0235j0301e0485k2346F0458E353a98175d4121m8489A61391n8715h1785
15394A07108b46409h5233m8836p3572L3555J5918B96604i9722L645j7052H0934
15382A66058K3599a35039m6586D5896a3364p2404A93089D3956b843j39597A7379
15370E6633a58806K9232r9986b3937A3475J05822B1294K25869r6425o9945a23320
15358e411A30278a5883F3881a51863C77062a85464Q8146D19732e51826E141M04143
15347D09284e5669H9232C6422f8718G8422K56974A04259i4358B00194H794a03341
15335D30846E2770b79856c2255a172q4756A4295a32363B00213B32K31198a68577
15323c4985j3430K477j03875k4391C84075F5050j4935M1181a59441B5452e8897
$$ plain form
15406 90235 79934 -50485 -72831 60458 5353 -198175 -44121 -92610 161391 102676 -81785
15394 107108 -246409 -85233 -134069 -207641 -174086 -158168 296604 -99722 -96077 -113129 80934
15382 166058 189657 -135039 -181625 45896 -13364 -85768 193089 43956 -2843 -142440 17379
15370 56633 -158806 -129574 -229560 -23937 13475 119297 21294 247163 150738 80793 -123320
15358 -5411 130278 -15883 63881 -151863 377062 -185464 -97318 419732 -551826 5141 409284
15347 409284 -55669 89232 36422 -68718 78422 335396 104259 -94358 200194 8794 -103341
15335 430846 52770 -279856 -32255 -1172 -85928 14295 -132363 200213 232 231430 -168577
15323 -34985 -48415 -45938 -149813 -174204 384075 65050 50115 91296 -159441 25452 -58897
15311A36620b83089m5373g0336B97542C3204a42954b7j137A1872i9512M679B16569
15298E506K2024d8816A90050C4105J11675R2606a11151F684K51928L5393p5335
15287B18670c94676J97069G0797K96427A1348J2010a83216N0571A159e6940J0009
15276d6931A16181a29653M7292A01602b99048C12981j10620f1989B78111r5414
15266A82697a23063A2231c54141e0012n4421L9225E6572c5967I6882c977A3497
15254d5878A49376J25033k5785b1620B40100M93522O74066K64646m91460M99855
15244A680729H17319C45625g7270I2112a54654j27327D19759A74468d815q5310
15234i0125H3376E674Q2653a35790c1679I4606M2107A0915J39493J45918e3169
$$ plain form
15311 136620 -283089 -328462 -70336 297542 33204 -142954 -27 -1164 11872 -99512 -94833 216569
15298 5506 27530 -48816 190050 34105 145780 238386 -111151 6684 258612 294005 218670
15287 218670 -394676 -197607 70797 367224 11348 23358 -183216 -132645 1159 -56940 -46931
15276 -46931 116181 -129653 -82361 101602 -299048 312981 202361 -61989 278111 182697
15266 182697 -123063 12231 -354141 -50012 -104433 -65208 56572 -35967 96882 -3977 13497
15254 -45878 149376 274409 248624 -21620 240100 733622 1407688 1672334 1180874 1680729
15244 1680729 817319 345625 -77270 92112 -154654 -281981 419759 174468 -4815 -90125
15234 -90125 83376 5674 88327 -135790 -31679 94606 136713 10915 150408 296326 -53169
15222B5766K5867e1056G9911d2276g918j38264A85994a1720D7167J65330r7918
15211A14579A0438C765K09494c94490g6158D58397c19153h0791n6813O083B30157
15199a98601A05310P8928m6369a65344A40847L96311A09809C0911a65416A20550
15188C76170H7913J78169I5604d30413A15529J21P0048J02916j25381a25063k586
15177a27649D6010J31085a31148N6691A75702i3566O34B49322l2532C8751K5990
15166F4741f2119n7280A16460l502J9277g5072A08508J79522a00333b5654I4784
15154A83331B8522h5137j14031D0810K10248c3793B86528A02539J07054P2002
15144B81595d3337C6470a12101A33806R8940I2663J72936A00345N1916b90215
$$ plain form
15222 25766 51633 -51056 79911 -42276 -7918 -146182 185994 -11720 47167 212497 114579
15211 114579 10438 3765 213259 -394490 -76158 458397 -319153 -80791 -137604 -131521 230157
15199 -198601 105310 184238 137869 -165344 140847 537158 109809 30911 -165416 120550
15188 376170 87913 266082 95604 -430413 115529 115650 185698 288614 163233 -125063 -127649
15177 -127649 46010 177095 -131148 -74457 175702 -93566 -92932 249322 216790 38751 64741
15166 64741 -62119 -119399 116460 112958 132235 -75072 108508 288030 -100333 -25654 94784
15154 183331 28522 -85137 -199168 40810 251058 -33793 286528 102539 209593 281595
15144 281595 -43337 36470 -112101 133806 232746 92663 265599 100345 152261 -290215
15133A14153L22915n4515A72402e3509k2523q9188E6154a67070G3329N14667G6980
15121E41552B04816l3122h910C54516A34834K36527i9369I4273a75594N1249A14564
15109B78245A18233C5431M5364C2177J18937B5124b0306j28767M7090C9896L7426
15098G7322Q675K93098F2455M5889k9236k9826K32720J91211B6961J37544J67212
15087C31717A23755J31602I146M7777J62482e4315A48965e1505I3493a14816O022
15076a08794I7927D2173K09686l8890J19554a79455E88606a95827h4652B23175
15065E54050b96414A64440e2625A76506b4682o9418B23869K56351A23901b86269
15054B40358N254C3446L71054F480K90462J22631F2119K44172j22217K76596A86055
$$ plain form
15133 114153 437068 382553 172402 -53509 -76032 -165220 56154 -167070 73329 587996 76980
15121 541552 204816 171694 -8910 354516 134834 371361 -99369 94273 -175594 -124345 114564
15109 278245 118233 35431 80795 32177 151114 25124 -20306 -149073 -101983 39896 77322
15098 77322 85997 379095 62455 108344 79108 49282 282002 473213 26961 164505 331717
15087 331717 123755 255357 9146 56923 219405 -54315 148965 -51505 93493 -114816 -108794
15076 -108794 97927 42173 251859 212969 332523 -179455 588606 -195827 -84652 223175
15065 554050 -296414 164440 -52625 176506 -24682 -94100 223869 480220 123901 -286269
15054 240358 245612 33446 404500 6480 296942 419573 62119 306291 184074 460670 186055
15042C06591o5560e9065B05591R3031M7304H9481K78908D1358a79939A21336b13157
15030i8191B41708F1888Q2232b39727B42870q9820j6096J16042K62512H0266J01804
15019A82070N5268q6028R0525J0325r5554Q1423J72032j16092j06475J43384j34429
15008A96449d2891k2827C7155J14520j8802k6463M42953B70097i2284E23193j17258
14997D05935B02810c8409D34788A96076J6291B4254K80954q3606J61583A03855
14986B40560r0550a17338C82361G4146j1426K85396J7098O7058M7292L3738j03437
14975D09865K80291C15964J23163n396j94007J85835j69065L50029B38925J455
14965B40380K7346P1917o4672k7768K03366A42259J20914j18904J74750k9295
$$ plain form
15042 306591 241031 -59065 205591 298622 345926 89481 368389 41358 -179939 121336 -213157
15030 -98191 241708 61888 144120 -239727 242870 153050 136954 252996 515508 80266 182070
15019 182070 237338 151310 241835 252160 156606 238029 410061 293969 187494 330878 196449
15008 196449 -42891 -65718 37155 151675 132873 106410 549363 270097 -92284 523193 405935
14997 405935 202810 -38409 434788 196076 212367 24254 305208 221602 383185 103855
14986 240560 150010 -117338 382361 74146 62720 348116 365214 432272 479564 513302 409865
14975 409865 690156 315964 439127 433731 239724 425559 256494 606523 238925 240380
14965 240380 267726 339643 274971 247203 450569 142259 263173 144269 319019 289724
14955B89724J35097A79533L00128A67093K55801B04055k0140L41059k45425K32404
14945E11953b7434C64087j31914L9599b042B87634k7451J02669A31811R3061K22947
14934D47819A59808h155D06957f3470A44735N5740j9072P3931m2797K5438A11516
14922f4466B9876N50029B48221N8217K47141B64456J96293j55274L1318j29267
14912B07526d5284B47182B6616K00774L02074i461A75615J90099j41559P4574
14902B98729P712J00623j88645J60003I3655M12766J8583A28209r944L66984B42191
14890D14329B06925q0599K55835p3571K55096r5547j09559K2206l1876J56693
14880E05603I9751m313O6964J6076O7116M6925O7098F9177M02937K8573A58347
$$ plain form
14955 289724 424821 179533 479661 167093 422894 204055 183915 524974 279549 511953
14945 511953 -27434 364087 232173 271772 -2042 287634 260183 362852 131811 224872 447819
14934 447819 159808 -8155 406957 -63470 144735 200475 181403 255334 212537 237975 111516
14922 -64466 29876 579905 248221 306438 553579 264456 460749 305475 336793 207526
14912 207526 -45284 247182 26616 227390 529464 -9461 175615 365714 224155 298729
14902 298729 306441 407064 218419 378422 93655 506421 525004 128209 118265 485249 242191
14890 414329 206925 126326 382161 308590 563686 468139 358580 380786 348910 505603
14880 505603 99751 95438 162402 178478 245594 292519 359617 69177 472114 500687 158347
14868C42210A21075K51739j41421I7129K35039j05498N5698L10399k83756e2265
14857C67777R7455J28019B06125J24738J12785j02302L10547k55166j94519K45537
14847D47745j66892J19712K58517k13079J06921L1016k22754J60037o0184J76914
14837F37953o9444A77232N34934j94474J53683J9059l35674G3966N64285K19749
14827H58000l72908k41215K32702J0724j2232j08989K57108A19648K89230m6210
14817C62668L90330p2429B85386L13601j76475K32403l26034O3542K47100l00867
14807C38656A53691L88492L1476K5285A1844L62232L64951B11612N29062k07122
14797E33552K59576k36154j21195P8160j52529K89291j97525J85950q6083k20162
$$ plain form
14868 342210 121075 372814 231393 97129 332168 226670 282368 592767 309011 -52265
14857 367777 465232 593251 206125 330863 443648 341346 651893 396727 202208 447745
14847 447745 280853 400565 659082 446003 552924 583940 361186 521223 461039 637953
14837 637953 568509 177232 712166 517692 671375 690434 354760 73966 638251 858000
14827 858000 485092 243877 476579 487303 475071 366082 623190 119648 408878 362668
14817 362668 752998 680569 285386 598987 422512 654915 328881 392423 639523 338656
14807 338656 153691 542183 573659 598944 11844 374076 739027 211612 740674 533552
14797 533552 793128 556974 435779 513939 361410 650701 453176 639126 553043 332881
14787C32881j07850K57929J14623j27526K11849K17017l01883j25859L88678m01193
14777D58666j09574Q6824K33199q0443m9438K02133j16483J16901q1263j5654
14767F44868C16030P8005J48966M67050D51955K90643j03124l10209K8482L06635
14757F64382m3961j84443L86802R4014l85090M6363J95381n3543J82628l30934
14747E71599J17592n3308J5561n8605k43210O9459M72824C66301Q0472M2461M77854
14736I67088m78423J01286M911K32092C32440K74561k9127K93214m4440K30928
14726A057576l39099O2863j50211M09558l22172C27002N43301N1781J98021l59236
14716G60869J63279m56980Q9998J40041k00264K32338k77757M89258J1387M7569
$$ plain form
14787 332881 225031 482960 597583 470057 681906 898923 597040 471181 859859 458666
14777 458666 349092 435916 669115 588672 539234 741367 624884 741785 660522 644868
14767 644868 316030 394035 543001 1010051 451955 742598 639474 329265 357747 664382
14757 664382 620421 435978 822780 916794 531704 578067 773448 719905 902533 571599
14747 571599 689191 635883 651444 592839 349629 419088 891912 366301 446773 489234 967088
14736 967088 488665 589951 594862 826954 332440 607001 577874 871088 826648 1057576
14726 1057576 718477 781340 631129 1040687 718515 327002 870303 922084 1120105 760869
14716 760869 924148 467168 557166 697207 496943 729281 451524 940782 952169 999738
14706I99738j23370j10295R8499J26038j17228k84892L09566p8894L03041k36589
14696H85614n5848K92357k9166m04649j52782N00276J90728o03533J77551R3486
14686H94034J61142l86645K17459M49177m67412l14814J93487K55424j21344J79108
14676A059616j11449K85248n08254j51935J75294L89171k48842o1622J11082J14361
14666A052670l03325M22623q3794k4638j93068K17355o1787J9891j5283k5148
14656A005496J31419J60151l56113J5009M23396K03060p03517K89624r7699P0164
14646A140990K5730j29011K5152K44443j75672q6180J64154p0594j81555K84790
14636A242247k47335J3135L69583n8833n4723k39808Q5249O1775r5744K26654
$$ plain form
14706 999738 876368 766073 864572 990610 873382 588490 898056 819162 1122203 885614
14696 885614 829766 1122123 1092957 688308 535526 1035802 1226530 622997 800548 894034
14686 894034 1055176 668531 885990 1335167 867755 552941 746428 1001852 880508 1059616
14676 1059616 948167 1233415 725161 573226 748520 1137691 888849 827227 938309 1052670
14666 1052670 749345 1171968 1088174 1063536 870468 1087823 1026036 1045927 1030644 1005496
14656 1005496 1136915 1297066 940953 955962 1379358 1582418 878901 1168525 1070826 1140990
14646 1140990 1166720 1037709 1062861 1307304 1131632 1045452 1209606 1139012 957457 1242247
14636 1242247 994912 1008047 1377630 1318797 1264074 1024266 1109515 1171290 1075546 1302200
14626A302200N2701J79990J18632k92999p6515M5407L21213m41661L28438l73658
14616A163748J52462J68912j23861L89636l19487J205J61825J877n34091P50327
14606A812553m60141R332J91364k4502j16883J36918m3344K40013k42172q2764
14596A420374J6223K93220q0477j92588j9938Q3799K06767L41283n36661K26025
14586A758027K9301J20518k9015J66718m33152L30043k90296l1900L96307J5110
14576B031661p4406j44939K43498j54358M48998n06289K34289K40737k99410J47038
14566B166819J74332l31478M16580r8919m4887J07175K14507j76836K33326L34555
14556B995174J32470L1646j00649K021P98440O56111J052191J746631M064172
$$ plain form
14626 1302200 1354901 1534891 1653523 1360524 1284009 1329416 1650629 1208968 1537406 1163748
14616 1163748 1316210 1485122 1361261 1750897 1431410 1432615 1594440 1596317 1062226 1812553
14606 1812553 1352412 1361744 1553108 1528606 1411723 1548641 1505297 1745310 1503138 1420374
14596 1420374 1436597 1729817 1649340 1456752 1436814 1520613 1727380 2068663 1532002 1758027
14586 1758027 1787328 1907846 1878831 2045549 1612397 1942440 1652144 1620244 2016551 2031661
14576 2031661 1957255 1812316 2055814 1901456 2350454 1844165 2078454 2319191 2019781 2166819
14566 2166819 2341151 2009673 2426253 2327334 2282447 2389622 2604129 2427293 2660619 2995174
14556 2995174 3127644 3159290 3058641 3060662 3859102 4515213 5567404 7314035 11378207
14547A1378207Q758325J4751279Q702387j7796245A1149624E266125j926704o38244
14539B701177q02692P1695K2018J19036r9839k19687K73592k71679K57527R8549
14529B149697J24670m79231j4255M85474k39641J22733K20183l51189L60479k13400
14519B165520M40608k55140K18704j69873N9717r4353N24132q3593K190p8032
14509B729880j18261M01745m69899K26316N4865J35100j10781P6343R4772O793
14499C026873N9770J00342k06317l664J58355j77329J63881m5125O9729L86306
14489C532821j64068j72640K42307K45550r6086r3974m2520J27114K47527k02714
14479C623317Q0281j66166K36739N648L58126k53098j01081M33090m12067K82001
$$ plain form
14547 11378207 20136532 34887811 43590198 25793953 11149624 5266125 3339421 2701177
14539 2701177 1898485 1970180 1992198 2111234 2011395 1791708 2065300 1793621 2051148 2149697
14529 2149697 2274367 1795136 1780881 2266355 2026714 2149447 2369630 2018441 2378920 2165520
14519 2165520 2606128 2350988 2569692 2399819 2459536 2365183 2889315 2805722 2807912 2729880
14509 2729880 2611619 3013364 2543465 2769781 2824646 2959746 2848965 2925308 3020080 3026873
14499 3026873 3086643 3186985 2980668 2977004 3135359 2958030 3121911 3076786 3146515 3532821
14489 3532821 3368753 3196113 3438420 3683970 3587884 3493910 3451390 3578504 3826031 3623317
14479 3623317 3703598 3537432 3774171 3779819 4137945 3884847 3783766 4216856 3804789 4086790
14469D086790O3433k26086P3983L34893m18187M52566m2743q2014J42023m26923
14459C957735J063579k53811j03947N9309o6028N48657k25677m8336l4679L14935
14449E211737k35720R2309P0556K86012j01770J82395k0766o5676L79448K38317
14439F036842k3214J85161k75354K34217k78557K74203Q7811J62802j85797J8481
14429F236595O43204k82313q8348J52985J99027O0133r3543J01297L42235L5342
14419G306614m3113O2049J81095L21578n0092J00779M22632J87053o8405j0484
14409H409706M43437k92370J10512N71909J45626l95932M72577M2033j69694N30190
14399I867994K43836j52192K37538J23595L27057m4391K34418L11275N89332p2142
$$ plain form
14469 4086790 4150223 3924137 3998120 4333013 3914826 4367392 4324649 4242635 4384658 3957735
14459 3957735 5021314 4767503 4663556 4722865 4656837 5205494 4979817 4931481 4896802 5211737
14449 5211737 4976017 5068326 5138882 5424894 5323124 5505519 5484753 5419077 5798525 6036842
14439 6036842 6013628 6198789 5923435 6157652 5879095 6153298 6241109 6403911 6218114 6236595
14429 6236595 6879799 6597486 6509138 6662123 6861150 6921283 6827740 6929037 7271272 7306614
14419 7306614 7263501 7325550 7506645 7828223 7778131 7878910 8301542 8488595 8420190 8409706
14409 8409706 8853143 8560773 8671285 9243194 9388820 8992888 9465465 9507498 9337804 9867994
14399 9867994 10111830 9959638 10197176 10320771 10647828 10603437 10837855 11149130 11738462 11666320
14389A1666320k9624K98676J36729N7370L91326K16680J78471N10957J33974J21361
14379A3682240J22052J91524O27708J23708K75579K72090K4845J16814P41070
14370A6177630J44311P81478j6479L00802J36926J92256O26263Q09639P5149N31629
14360A9759604J69116O44491M59057N59866L41462N21764N45565M98580O98392
14351B4197897N14028P04867N32379M60544M02458J174929P56927M88623R95368
14342C0228020L09230J097544Q47389P82289J159490Q82724J026976J167284Q93847
14333C8394793J251470J199368R52758J527723R59669J695657J554244J548877
14325D9084559J523532J690878J958765J931881J533982K409566J891373K109948
$$ plain form
14389 11666320 11636696 11935372 12072101 12129471 12520797 12737477 12915948 13426905 13560879 13682240
14379 13682240 13804292 13995816 14623524 14747232 15022811 15294901 15319746 15436560 16177630
14370 16177630 16321941 17103419 17086940 17387742 17524668 17716924 18343187 19152826 19227975 19759604
14360 19759604 19928720 20573211 21032268 21592134 21933596 22455360 23000925 23499505 24197897
14351 24197897 24711925 25416792 25949171 26409715 26812173 27987102 28744029 29232652 30228020
14342 30228020 30537250 31634794 32482183 33264472 34423962 35306686 36333662 37500946 38394793
14333 38394793 39646263 40845631 41798389 43326112 44285781 45981438 47535682 49084559
14325 49084559 50608091 52298969 54257734 56189615 57723597 60133163 62024536 64134484
14317F4134484K388877K772987K646963K714516K670245L462808L030723L865267
14309H7686870L471920L610786M329019M060813M760188M888386N638462N332362
14301A23778806O407171N700161P154249O888348P472627Q097730Q575512R364752
14293A83439356R725639J0020199J1039297J1851367J1889494J2979809J3766550
14286B64711711J4174977J5176075J5347225J5989893J6630998J6674254J6764492
14279C75469625J6486074J6152707J5274152J4134407J2479517J0432575P170941
14272D67599998L773635J296329J633641o12000r64917o73216m103759p685048
14264D60264663j0470505j2546761j4144562j5581559j6520254j6610272j6877409
$$ plain form
14317 64134484 66523361 69296348 71943311 74657827 77328072 80790880 83821603 87686870
14309 87686870 91158790 94769576 99098595 103159408 107919596 112807982 118446444 123778806
14301 123778806 130185977 135886138 143040387 149928735 157401362 165499092 174074604 183439356
14293 183439356 193164995 203185194 214224491 226075858 237965352 250945161 264711711
14286 264711711 278886688 294062763 309409988 325399881 342030879 358705133 375469625
14279 375469625 391955699 408108406 423382558 437516965 449996482 460429057 467599998
14272 467599998 471373633 472669962 474303603 473691603 472726686 472053470 467949711 460264663
14264 460264663 449794158 437247397 423102835 407521276 391001022 374390750 357513341
14257C57513341j6708248j6818282j5262876j4731865j5117058j4365924j3394230
14250B51114858j3025569j2322868j1594408j0589686j0617761r374481q770933
14243A74819152q862978q305110p231531p053010o573083o223670n916533n717957
14235A18935280n015817n461573m340952m610974l248154m014560l832547l776197
14227H4634506l100880l344307l015931l063549k412793k569761k194687k650426
14219F2282172j729136k259450j797848j642173k028747j484194j518537j801444
14211D8020643j299507j702558j643995j008628n27324q16461j802950j281977
14203C7937243j230687j100960j019730k01052r07453j051158p21103j046860
$$ plain form
14257 357513341 340805093 323986811 308723935 293992070 278875012 264509088 251114858
14250 251114858 238089289 225766421 214172013 203582327 192964566 183590085 174819152
14243 174819152 165956174 157651064 150419533 143366523 136793440 130569770 124653237 118935280
14235 118935280 113919463 108457890 104116938 99505964 96257810 92243250 88410703 84634506
14227 84634506 81533626 78189319 75173388 72109839 69697046 67127285 64932598 62282172
14219 62282172 60553036 58293586 56495738 54853565 52824818 51340624 49822087 48020643
14211 48020643 46721136 45018578 43374583 42365955 41838631 41022170 39219220 37937243
14203 37937243 36706556 35605596 34585866 34384814 33477361 32426203 31705100 30658240
14195C0658240p96617p63883o35542o91181q82780m19044q49853p45650k47537
14186B4626153p27240n83515p06882l78099q73549P3208q82962k42965l16428
14177A9987721m64084l20655l35878k76620q60411Q4553o30885j96669n70773
14168A6416299K08897m72487m68939l31721k87671k48475n5009k31982m93638
14159A4035274q5936m81661k20123l13181p7266m62416k50732J85786l86423J38694
14149A2082016o38050J34842l10713j50059j16535j50383k29514m50239J10847
14140A0282212m26179R4846m61659J57549o1128k31611l64668M85891n04551l06564
14130H664138n3898j15364l79251K26238k38420m10058L36193p640j92542J16881
$$ plain form
14195 30658240 29861623 29097740 28462198 27771017 26888237 26469193 25619340 24873690 24626153
14186 24626153 23898913 23315398 22608516 22230417 21356868 21430076 20547114 20304149 19987721
14177 19987721 19523637 19202982 18867104 18590484 17730073 17814626 17183741 16987072 16416299
14168 16416299 16625196 16152709 15683770 15352049 15064378 14815903 14760894 14528912 14035274
14159 14035274 13949338 13467677 13247554 12934373 12857107 12394691 12143959 12329745 11943322 12082016
14149 12082016 11443966 11578808 11268095 11118036 11001501 10851118 10621604 10171365 10282212
14140 10282212 9856033 9950879 9489220 9646769 9585641 9354030 8989362 9475253 8970702 8664138
14130 8664138 8610240 8494876 8115625 8341863 8103443 7693385 8029578 8021938 7829396 7946277
14120G946277j70755l25153j64055J42493m53357K23268k14328k153j68747k89457
14110F524033p8554J01701k87171L2290M5554j92035q8397M5658l59042L55259
14100F099296k40451k1797k40491R0977j18830l0330p2249J6823l08238J82225
14090E356935j61364L55746o78433K58267k46099j81175j6112J35660j17084J55168
14080D861509J42892k21143Q0077k41713k24677k79104J6661L0664j6162r9467
14070D049537k849O3708J52942k81862k22319J07520L4297k23744L82120m10048
14060C649302k20173L39982R7669l50682L41022J4779l39769N06148p06884q8071
14050C243323N3543J03204J17745k52861j81404J98649M612J21699m54515M61626
$$ plain form
14120 7946277 7775522 7450369 7286314 7428807 6975450 7198718 6984390 6982237 6813490 6524033
14110 6524033 6445479 6547180 6260009 6292299 6337853 6145818 6057421 6103079 5744037 6099296
14100 6099296 5858845 5837048 5596557 5687534 5568704 5538374 5466125 5482948 5174710 5356935
14090 5356935 5195571 5551317 4872884 5131151 4885052 4703877 4687765 4823425 4706341 4861509
14080 4861509 5004401 4783258 4863335 4621622 4396945 4117841 4134502 4165166 4149004 4049537
14070 4049537 4046688 4110396 4263338 3981476 3759157 3866677 3900974 3677230 4059350 3649302
14060 3649302 3429129 3769111 3866780 3516098 3857120 3871899 3532130 4038278 3331394 3243323
14050 3243323 3296866 3400070 3517815 3264954 3083550 3282199 3286811 3408510 2953995 3415621
14040C415621k94170J27048m27186j4848N03734l30203M3265m5847k42492L69886
14030C104808l14679q1798J36483K35489q0177k58985J02694J13362l57646L15234
14020B914785n24188K33858n89075M10862k23653Q5586L90783j81476j2903k23323
14010B281256N3150k81432K631J34324L93345n41808M94221n63295K66347P9591
14000B318330n06739n4544M11081l3043k91813L28607n46434P4414M06615J80972
13990B287446L97162J094840L007340P135583J4839521J4234092j4266602j3354259
13982A5375123o459356l157888q97852n14819q42618k55340k39418j27004k31872
13973B648956k01922P9789k1379Q0681j38115k83528J02067k40896M19248k78799
$$ plain form
14040 3415621 3121451 3248499 2821313 2806465 3310199 2979996 3023261 2977414 2734922 3104808
14030 3104808 2790129 2708331 2844814 3080303 3000126 2741141 2843835 2957197 2599551 2914785
14020 2914785 2390597 2624455 2035380 2446242 2222589 2308175 2698958 2517482 2504579 2281256
14010 2281256 2334406 2052974 2055605 2189929 2583274 2041466 2535687 1972392 2238739 2318330
14000 2318330 1811591 1757047 2168128 2135085 1843272 2171879 1625445 1699859 2106474 2287446
13990 2287446 2684608 3779448 6786788 13922371 28761892 42995984 28729382 15375123
13982 15375123 8915767 5757879 4860027 4345208 3502590 3247250 3007832 2880828 2648956
13973 2648956 2447034 2526823 2505444 2586125 2448010 2164482 2266549 2025653 2444901 2166102
13963B166102O2645r9239j9807k13269J33332m8249J8983l33015J86647j21900
13953A732230L13233k350j38159m6548L94429m70872M45131p44018K48198j16653
13943A614621j09356L25819K38077j99385k15007K0321J25953l49355N11131n79167
13933A383652J59782l55229L86540k81662K97463l24553o8732K67314P6111k03057
13923A337629K4310R4286J9491K06527k43750J81666J05625k55561m1497J01714
13913A530440j73901m0868K29621L5792k31859k32530L83898p5241k0790k19109
13903A185453K37468l42076P02925l70066n2620K5864j52997J37119J9221k20134
13893A170157K70171J13149j58209k7965k72430L2240R1743Q4955J54555k07848
$$ plain form
13963 2166102 2228747 2129508 2109701 1896432 2029764 1981515 2000498 1667483 1854130 1732230
13953 1732230 2045463 2043113 1904954 1858406 2252835 1781963 2227094 1483076 1731274 1614621
13943 1614621 1505265 1831084 2069161 1869776 1654769 1675090 1801043 1451688 1962819 1383652
13933 1383652 1543434 1188205 1574745 1293083 1590546 1265993 1197261 1464575 1540686 1337629
13923 1337629 1361939 1456225 1475716 1682243 1438493 1620159 1725784 1470223 1428726 1530440
13913 1530440 1356539 1315671 1545292 1581084 1349225 1116695 1500593 1425352 1404562 1185453
13903 1185453 1422921 1080845 1783770 1413704 1361084 1386948 1233951 1371070 1390291 1170157
13893 1170157 1440328 1553477 1395268 1367303 1094873 1127113 1218856 1303811 1458366 1250518
13883A250518k57533K99965l47718J76239R4358j67764P4847N2626j38339J89311
13873A226510r1531O4367m5546R4190j14177j85872K51978j93045J91545j11231
13863A087188j39706P5559j99657J76589j80674M82957k76910L04176l58265N7683
13853A028940L5927o3585N2012j08416J39782j8139L75436o00939K53347m5035
13843A049330j11177m9459n6217M110K99120k76489J87426p3548j94846l2652
13833G45598J0777N0300J12625l38122n6164J32144J16646M79762E84159J59523
13823G43682k7372L68282m10616K30462j43452Q6187l4516n6616N4476l80617
13813D29900K73756L21674j23896j00118K98288l11668R0781j61697k88629J66974
$$ plain form
13883 1250518 992985 1292950 945232 1121471 1215829 1048065 1122912 1175538 1037199 1226510
13873 1226510 1134979 1199346 1153800 1247990 1133813 947941 1199919 1006874 1198419 1087188
13863 1087188 947482 1023041 823384 999973 819299 1302256 1025346 1329522 971257 1028940
13853 1028940 1064867 1001282 1053294 944878 1084660 1066521 1441957 841018 1094365 1049330
13843 1049330 938153 888694 832477 836587 1135707 859218 1046644 973096 778250 745598
13833 745598 756375 806675 919300 581178 525014 657158 773804 1253566 584159 743682
13823 743682 716310 1084592 673976 904438 760986 847173 812657 756041 810517 429900
13813 429900 703656 1025330 901434 801316 1099604 787936 878717 717020 428391 595365
13803E95365J73208J52599j88829m3935j35397K23970j22435J2913j26403J45722
13793F86778M7008j47498K1521L23987l15209L0392K26701k31747N4202K55389
13783I51524k48089j45206j25814L30597r8853L6491k32513M52633l82872N1868
13773E89766n4606L48554B72368M47381R0624R5463q8031R6971j63549k08034
13763E43193j10135J07110J94104M3534j17323k06251l654Q1963J44628j44427
13753E32742q9269J0781L79078m03270M7338L11329J11449C06352O68026C21135
13742F20971j70116p5735Q7912J19316B00097J08002N98567m13242N8823M19246
13732I71493C96725J58761j26955J36208o6143j28346L78824C44132L44105p896
$$ plain form
13803 595365 768573 921172 732343 688408 553011 776981 654546 667459 541056 686778
13793 686778 733786 586288 607809 931796 616587 646979 873680 641933 696135 951524
13783 951524 703435 558229 432415 763012 664159 700650 468137 920770 537898 589766
13773 589766 535160 883714 272368 719749 810373 905836 817805 914776 751227 543193
13763 543193 433058 540168 734272 777806 660483 454232 450578 532541 677169 532742
13753 532742 443473 454254 833332 430062 477400 788729 900178 306352 974378 321135
13742 620971 450855 375120 463032 582348 200097 308099 906666 493424 552247 971493
13732 971493 396725 555486 428531 564739 498596 370250 749074 344132 688237 680341
13722F80341l02281P5258q5228j72378O00521j88194K94455l05823A30906P17283
13712H48189C31284J08460M7029L9431B53810k4005P85655D54269o5251K20699
13702F09717l1344p973o9440J9144J86839C00366K14601j55343o608K90028r7510
13691E45534k62544J34134R9161J3565j76046J69643J52980m6852j14965o8888
13681D45722j23001O8177j14645K23622J55832j62014J71769k30246L32111l54377
13671D12950q9672K38978k24337A37416L72369q8497N9023J46616k24182j30328
13661B72417L91330j74530k07631p5411L11503j92952N3136A80749N26878A25524
13650F50954k78076j70365M36128j02382d1169B34226L50358B72998L794K28408
$$ plain form
13722 680341 378060 453318 368090 195712 796233 608039 902494 596671 130906 848189
13712 848189 331284 439744 486773 526204 253810 229805 1015460 454269 389018 609717
13702 609717 578373 570400 500960 520104 706943 300366 514967 359624 353016 643044 545534
13691 545534 282990 417124 516285 529850 353804 523447 676427 629575 514610 445722
13681 445722 322721 390898 276253 499875 655707 493693 665462 435216 767327 412950
13671 412950 323278 562256 337919 137416 509785 421288 480311 626927 402745 272417
13661 272417 663747 489217 281586 206175 517678 324726 377862 180749 707627 125524
13650 650954 372878 202513 638641 536259 -41169 234226 584584 272998 276792 505200
13640E05200B17668K58546L3007B49277K07880F7249M17146n4041J50364A98458
13629A89812M82419B44822K19282J92905k21346j94986L6396l7497J52567j53536
13619B38607L12140c290C48762J92671j25838j99482K10937j4664m5014N9387
13609D26759M0424k02970L12011j15363J7656m604j20653A75392k996K84222B11630
13597D99590o2972B16699k9773K41357q0496J134q0472l3139A00488K57999K61942
13586F20429k53584j36311J84781F5959K96648J75831A82256d3498F51434B85110
13575C39724n7782L4797j49675K16124j04555J72610j45479p849K08540j14101
13565C92354r9049A19235K16926J09864j70896J39321j28213j2377P8462L2207
$$ plain form
13640 505200 217668 476214 509221 249277 457157 67249 484395 430354 580718 198458
13629 189812 672231 244822 464104 657009 435663 240677 277073 239576 392143 238607
13619 238607 550747 -3290 348762 541433 415595 216113 427050 412386 367372 426759
13609 426759 467183 264213 576224 460861 478517 473913 353260 175392 172396 456618 211630
13597 499590 436618 216699 186926 428283 347787 348921 268449 235310 100488 358487 620429
13586 620429 366845 230534 415315 65959 362607 538438 182256 -43498 651434 285110
13575 339724 281942 316739 167064 383188 278633 451243 305764 297915 506455 392354
13565 392354 293305 119235 336161 446025 275129 414450 286237 273860 352322 384529
13555C84529j91525P9113J02306A73380K93103R5743B38102E7773J79464K05009
13545D42246A37733K59351F9249J02589G2888L64836E4108M64380A74013J44436
13535C18449a3983F26092A16393B6500L01620H1525M46062a38537E85075D3468
13524A11014J3896J14891J0215k8470L99781k08271q3598J05971A63729Q840L39655
13513E12224B35362l3396r8924J22738K1756J30024R868A11608J00524J64142
13503C76274A13185k7330K73950h117A59028a0159B79159H7077e5773C58309j62394
13492A95915q1295J48227A01392J21147J9687O3943h5870A56384b4769D70791
13481D56917b31429b0231D55681j28992o2382j06531j6162J25611b8248B60481
$$ plain form
13555 384529 193004 272117 374423 173380 466483 562226 238102 57773 237237 442246
13545 442246 137733 397084 69249 171838 72888 437724 54108 518488 174013 318449
13535 318449 -13983 626092 116393 26500 328120 81525 527587 -138537 585075 43468
13524 111014 124910 239801 250016 221546 621327 413056 329458 435429 163729 172569 512224
13513 512224 235362 201966 103042 225780 247536 377560 387428 111608 212132 376274
13503 376274 113185 85855 359805 -8117 159028 -10159 279159 87077 -55773 358309 195915
13492 195915 114620 262847 101392 222539 242226 306169 -85870 156384 -24769 470791
13481 456917 -231429 -20231 455681 326689 264307 157776 141614 267225 -28248 260481
13470G3610J30955M6871J71712j18759H4148K24254K4917m4025O0461f4359A39939
13458C2829J97147l8412r1097L10119A76137J62192J87661k28955O8915a41972
13447B71285R0192A27576K49814j13443k6402l630E2667L18811O0289K1791A59896
13435d43431C05957k5048L16163B06907K3312K34405F7331N58074C5019L76898
13425D11917p4288J0548j48045N7268b37933c584A73352q2061J38707L4202Q6407
13414C50607j14119A262K92546k8763a6293A25034e8737F952b21798A10662a7681
13402a75290A03587a5069C23583K12688A2856J49432K4950k1695k5073L9182L8896
13391B18548n5825C2925R8282B7398h8711B78211j07915a6443B21208r0635D9861
$$ plain form
13470 73610 204565 251436 423148 304389 84148 308402 333319 289294 349755 -64359 139939
13458 32829 229976 191564 100467 410586 176137 338329 525990 297035 365950 -141972
13447 271285 361477 127576 377390 263947 237545 233915 52667 371478 431767 453558 159896
13435 -443431 305957 280909 597072 206907 230219 464624 67331 625405 35019 411917
13425 411917 337629 348177 200132 257400 -237933 -3584 173352 91291 229998 264200 350607
13414 350607 236488 1262 293808 265045 -16293 125034 -58737 6952 -221798 110662 -17681
13402 -175290 103587 -15069 323583 536271 12856 162288 187238 165543 140470 179652 218548
13391 218548 162723 32925 131207 27398 -88711 278211 170296 -16443 221208 130573 49861
13379B18689r8233C0877a3665B95383f5620D17380B0878b13596A92321m3136c0543
13367A96808A7454K5249N2511J77531P6554A46738E4766J27208K51709j57906
13357B75777A25873J4988J09248L81274A20123E0814N6245J11664n5882p4644
13347H8197B3211M51083j37087A64153K0542o3185K43736A08118M5959g4178a5534
13335A92193a25977B25564J38614A64957R9082k3264G4028J64682D5385K42871
13325B88256P3234j68685A2138K16645K8911r3900Q3323J54333A26102J65406
13315B91508n4199J35995A40460M6499L28529F9054M63735E8900K14953g2372
13304A14694k0362b3989B67015o5458A6783J36180P5719L6445a11180C26678N6161
$$ plain form
13379 218689 120456 30877 -13665 295383 -65620 417380 20878 -213596 192321 149185 -30543
13367 196808 17454 42703 95214 272745 349299 146738 54766 181974 433683 275777
13357 275777 125873 140861 250109 631383 120123 50814 107059 218723 162841 88197
13347 88197 23211 474294 337207 164153 184695 121510 365246 108118 154077 -74178 -15534
13335 192193 -125977 225564 364178 164957 264039 240775 74028 238710 45385 288256
13325 288256 361490 192805 12138 228783 257694 163794 247117 401450 126102 291508
13315 291508 237309 373304 140460 186959 515488 69054 532789 58900 273853 -72372
13304 114694 94332 -23989 267015 201557 16783 152963 228682 265127 -111180 326678 382839
13293C82839A43930a69902j57605A02577d0183H1179L16071a87020G8743K90410
13283C69153j26809F236L00966j07658b00145B69148d55379B27807I8961O9666
13273A68627J802A5431K64310J3679f5052C19390c192C00376b85373C10703i6534
13261a78999H0465a08332C89400C6795L23224D268J39563K31040c6686B54624
13250g9596C6766d0326B00757J2079b48689D26823K0849A94372j0268b61452k5479
13239b86931J05980A08330C7946e3658G9541p370J53832n4598a09295A46508K32212
13228C78720A58249d686B59215C7683K35887M9956D7279J32456r815b3427B59391
13216B39187m3176b177B59514p8859l6265L10233b21980D28178e5652a4477A48802
$$ plain form
13293 382839 143930 -169902 -327507 102577 -40183 81179 397250 -187020 78743 369153
13283 369153 242344 6236 307202 199544 -200145 269148 -455379 227807 98961 168627
13273 168627 170429 15431 279741 293420 -65052 319390 -3192 300376 -285373 310703 -96534
13261 -178999 80465 -108332 389400 36795 360019 4268 143831 374871 -36686 254624
13250 -79596 36766 -40326 200757 212836 -248689 426823 447672 194372 184104 -261452 -286931
13239 -286931 -180951 108330 37946 -53658 79541 72171 226003 171405 -109295 146508 378720
13228 378720 158249 -4686 259215 37683 273570 323526 47279 179735 169920 -23427 259391
13216 239187 196011 -2177 259514 180655 144390 454623 -221980 428178 -55652 -14477 148802
13204A64917i4125B58847c2257B85169J26232r4624A56301M1868G8563J93542
13194B72105P4916E1087J56747c7564B43365I977a82112A27328K1897J34759d5839
13182B33169k7670b363p7601A02653L1319K89316H3305K7388a93878B08009F062
13170a39770D56558G7200L409d1923B70760P5009j47595k3252J03790j21709L02294
13159D59297G8035a34971j18790E0086J23221a51268G1999N3160E5537k0790a00031
13147A1107b14494I2250J28234g4980E35027B45202A0167R1825a93973D618J47642
13136A52260M1451a39799b2364E7468J33911p8004D0038L20988A06710C6743K2912
13125E9655J08907P5215a16703A83274K0768a17992a8577q1265B59419l6764J4399
$$ plain form
13204 164917 -94125 258847 -32257 285169 411401 316777 156301 198169 78563 272105
13194 272105 347021 51087 207834 -37564 243365 9977 -182112 127328 149225 283984 -45839
13182 233169 205499 -2363 -79964 102653 133972 423288 83305 110693 -193878 208009 6062
13170 -139770 456558 77200 80609 -41923 270760 345769 198174 174922 278712 157003 459297
13159 459297 78035 -134971 -253761 50086 173307 -151268 71999 125159 55537 34747 -100031
13147 11107 -214494 92250 220484 -74980 535027 245202 10167 101992 -193973 4618 152260
13136 152260 193711 -139799 -22364 57468 191379 113375 40038 361026 106710 36743 59655
13125 59655 168562 243777 -116703 183274 204042 -117992 -18577 -99842 259419 222655 237054
13114B37054g6666G6506R1552p3208J34626K3968A12542f6344p8898E7895K51718
13103C09613g5297E54462b78916A19032J38698A9012L5664a0536A26771K4276
13093A51047b41299A67763q3551g7894H0280g644k77485A26492A0618L49199b8153
13081H7827J13334i0927D38472a4604G7446Q7923J7400H6105J11512D5456g0737
13069a33869a242A61670a37030F5158D767P8220L21952e3418F932L97321A46627
13057b8709A4661K29656b11555F8892K9348d7156D7710I449o04K11009b542k31915
13045b34457E267J88257g7633A74342b49969B59083E3325J68435d9051r0172B40941
13033e2130A57868K7235G7845K25947G8976J28373a12431B01184J11931p9897
$$ plain form
13114 237054 -76666 76506 168058 94850 229476 253444 112542 -66344 -145242 57895 309613
13103 309613 -75297 554462 -278916 119032 257730 19012 54676 -10536 126771 151047
13093 151047 -241299 167763 84212 -77894 80280 -7644 -285129 126492 10618 359817 -28153
13081 87827 201161 -90927 438472 -14604 77446 165369 182769 86105 197617 45456 -70737
13069 -133869 -1242 161670 -137030 65158 4767 82987 404939 -53418 6932 404253 146627
13057 -28709 14661 244317 -211555 68892 98240 -47156 47710 9449 8845 219854 -2542 -234457
13045 -234457 5267 193524 -77633 174342 -249969 259083 53325 221760 -49051 -139223 240941
13033 -52130 157868 185103 77845 303792 78976 207349 -112431 201184 313115 233218
13023B33218a15927E4705K66239a9004A00601F024L54494D4896L0426J61022A5882
13011H0279G33Q160J04854J67260j33633a09148C88372j07500D1749b10060A99232
12999C4556h8578b8053j54124A65931e0823E4182K40228A42717b26564G5918f2989
12987C3126h4569A38129c63358A6598K64189A39068E4046L5762K62712A07820
12976D46321e00640B2510N7006g3569D5292n705f6714j4818I0001b13652A16407
12964c13612B2919a2467A70872d6822A97723a87504r3397C57798b15992E0457
12953A48300h6454A46199L1071i4728B43244m8563h645j97169I5752K39783j66706
12942A68829n9977a11419L7632A5368O9144a50287j21829E1309Q9066Q9515b83134
$$ plain form
13023 233218 -115927 54705 320944 -19004 100601 6024 360518 44896 75322 236344 15882
13011 80279 733 8893 113747 281007 147374 -109148 388372 280872 41749 -210060 199232
12999 34556 -88578 -28053 -182177 165931 -50823 54182 294410 142717 -226564 75918 -62989
12987 33126 -84569 138129 -363358 16598 280787 139068 54046 89808 352520 107820
12976 446321 -500640 22510 79516 -73569 45292 39587 -66714 -81532 90001 -213652 116407
12964 -313612 22919 -12467 170872 -46822 197723 -187504 -280901 357798 -215992 50457
12953 148300 -86454 146199 177270 -94728 243244 194681 -8645 -205814 95752 335535 168829
12942 168829 108852 -111419 -73787 15368 84512 -150287 -272116 51309 140375 229890 -283134
12930G058J90471b98402o405A48025a45631A17895b20678A81905H6620b73573
12919c25966B19802D937b13139h8184D0684J01293b67927M0675Q890D25806a96444
12907B71420B3026b96428B32104d9597R785A49820N1900d1776A69438J7808H686
12895B42311b5854C35285e9396m854A83118C0038J45360d9185m8198r0771F4477
12883C68389A15972b2914D1808K0518A8290d24333D36825A17392a9773B62520
12872d0026G1173a58944H5800L1762J47424a65175G3935e5848j0616I9940a90645
12860A05991r094n38K07012j24367a5004m76141a821B05835K695c0569c69A11290
12847C7251L64900c4683B48359a78072n2681B8444K55839f8837E6569k7843M2654
$$ plain form
12930 7058 197529 -298402 -304807 148025 -145631 117895 -220678 181905 86620 -273573
12919 -325966 219802 4937 -213139 -88184 40684 141977 -267927 -227252 -218362 425806 -196444
12907 271420 23026 -296428 232104 -49597 -39812 149820 201720 -41776 169438 187246 8686
12895 242311 -25854 335285 -59396 -64250 183118 30038 175398 -49185 -97383 -188154 64477
12883 368389 115972 -22914 41808 62326 18290 -424333 436825 117392 -19773 262520
12872 -40026 71173 -158944 85800 117562 264986 -165175 73935 -55848 -66464 99940 -190645
12860 105991 96897 96359 303371 179004 -15004 -491145 -1821 205835 208530 -30569 -369 111290
12847 37251 402151 -34683 248359 -178072 -230753 28444 284283 -68837 56569 28726 71380
12836G1380g7846B92240d6511p716E7040J12191a79522A75278a52196J0674A06515
12824A2556J1712O3197J79617i1649E3J20237l7307h110A13221a9877J405F9496
12811b30467A56013f976j64169o1221A12856f8848D99981c8257D6594Q5450e2828
12799a17860l10336a17739A72634K7130I7566a95921E5657b79503a32274L8922
12789i3352M1652a803A04508K69979a9629n03792A17663E7386A4925g067j85297
12778a92364B77832I2687b41368h70j77160A15129K08400L4919F2514N1396R2178
12767B06088N1269n0703a4818A12202i0841C03346b67002H0108B6349J26815J65938
12756C19102a59741j63160A82664a24158D74568i7912A23346a80824N8592j05820
$$ plain form
12836 71380 -77846 292240 -46511 -54227 57040 169231 -179522 175278 -152196 -141522 106515
12824 12556 24268 87465 267082 -91649 53 120290 82983 -8110 113221 -19877 -18472 69496
12811 -230467 156013 -6976 -171145 -232366 112856 -68848 499981 -38257 46594 132044 -52828
12799 -117860 -428196 -117739 172634 199764 97566 -195921 55657 -279503 -132274 -93352
12789 -93352 -51700 -1803 104508 374487 -19629 -523421 117663 57386 14925 -7067 -192364
12778 -192364 277832 92687 -241368 -870 -178030 115129 323529 358448 62514 113910 206088
12767 206088 257357 206654 -14818 112202 -90841 303346 -267002 80108 26349 153164 319102
12756 319102 -159741 -322901 182664 -124158 474568 -97912 123346 -180824 -122232 -228052
12746b28052D7163a75291G6053N8330k6766Q6553a62211B7176K02069f3377A65066
12734a82868B36287F4981K26998n5997c0917B14929I6394m1554J36993a46643
12723A48459K36395a22407M5504A99342a07411c8270A93064c0000B23159J9628
12713B42787C2698L5015J55532m3935d0849E8320J7110b33085A63376E5313f3364
12701B06493a462E48553B49066r6594c5512k62051q9305D4607b79821B49169a53570
12689h6506N115k03600A77110c0768a0058A7627b3779I8425K07580g4435B43629
12677C61634p6695c00466a04588C37528j7153q1278l2214a33364A27488J27142
12667B54630j05287a96641O2561O4946I373R9945e5315a3367A52885n4606A9167
$$ plain form
12746 -228052 47163 -175291 76053 134383 107617 194170 -162211 27176 229245 -63377 165066
12734 -182868 236287 64981 291979 235982 -30917 214929 96394 54840 191833 -146643
12723 148459 384854 -122407 -76903 199342 -107411 -38270 193064 -30000 223159 242787
12713 242787 32698 67713 223245 179310 -40849 58320 75430 -233085 163376 55313 -63364
12701 206493 -1462 548553 249066 152472 -35512 -297563 -386868 44607 -279821 249169 -153570
12689 -86506 -81391 -284991 177110 -30768 -10058 17627 -23779 98425 306005 -74435 243629
12677 361634 284939 -300466 -104588 337528 320375 239097 206883 -133364 127488 254630
12667 254630 149343 -196641 -134080 -69134 9373 109318 -55315 -13367 152885 98279 19167
12655i4670B19427O5127I2774c13779J11778B82545A37546m3256b0567k8387j98543
12644b47497A7230M08761a91594A94715D931K23746l6724B8557A046a28303B09003
12632E2717a4352A15277K01838j45045F9845M06641B8589J18113a44837O7471
12622g7366A4343a52614B20077J4033J15645a05416I605P0046J33104d5415j85844
12611b31259a5169A82287m8990l7467k3511b32977A43712a4729p9234B04862R1148
12600B96010J19990i5452A26171n9680a447F6056M06781a75022A38219C1926f5464
12588G1739n647M9995a31125F9916J599d23099A66638o3782k0653J55367a25162
12576a9264C8301Q5978J12864c4631k73441D8741J03985R540c67094J29331o513
$$ plain form
12655 -94670 219427 284554 92774 -313779 -202001 282545 137546 94290 -20567 -48954 -247497
12644 -247497 17230 425991 -191594 194715 4931 228677 191953 28557 1046 -128303 209003
12632 52717 -14352 115277 317115 172070 69845 476486 28589 146702 -144837 -77366
12622 -77366 14343 -152614 220077 234110 349755 -105416 9605 79651 212755 -45415 -231259
12611 -231259 -15169 182287 133297 95830 72319 -232977 143712 -14729 -93963 204862 296010
12600 296010 416000 -95452 126171 66491 -1447 66056 472837 -175022 138219 31926 -65464
12588 71739 66092 116087 -131125 69916 71515 -423099 166638 102856 82203 237570 -125162
12576 -19264 38301 124279 237143 -34631 -308072 48741 152726 162266 -367094 -237763 -244276
12565b44276Q123C66626F0483J01643n2676P5746J8276a03321A95604I6092c47045
12553c6184E920K1129J18164c5033D0693L8249b80386A48059b9101B66095a05669
12541a83525A47084A5597J51992c00469J00864M2264g7052C13688A05647a56612
12530c30220B45038B3518A1154J38175R3529H0129J36044b38322P9761A1432J3656
12519B5088h8755k29347e5111B55327O4321a19144k04099b8276A39393c0213n427
12508c5640A94121r1995a96782D0814J4773J04979L21830b58306b0417h999A44057
12496E3638b7630A15804b06531e3946D4963a63670j73749A68092i6872A0018P664
12485A7682b5334k33783B6707J12236a21151A30187J10599p919a68781d4773D0370
$$ plain form
12565 -244276 -236153 366626 60483 162126 109450 185196 203472 -103321 195604 96092 -347045
12553 -36184 5920 27049 145213 -35033 40693 78942 -280386 148059 -29101 266095 -105669
12541 -183525 147084 15597 167589 -300469 -199605 -157341 -77052 313688 105647 -156612
12530 -330220 245038 23518 11154 149329 242858 80129 216173 -238322 -158561 11432 25088
12519 25088 -88755 -318102 -55111 255327 319648 -119144 -323243 -28276 139393 -30213 -35640
12508 -35640 194121 102126 -196782 40814 55587 160566 482396 -258306 -20417 -8999 144057
12496 53638 -27630 115804 -206531 -53946 44963 -163670 -337419 168092 -96872 10018 17682
12485 17682 -25334 -259117 26707 138943 -121151 130187 240786 232867 -168781 -44773 40370
12473h1412l42020F5778b19845A05821B7263Q1910C1460p989L3562N7672c0768
12461c22788A90094J9370b9842B98013a40635B3164Q1683h0606e893D7366K57938
12450C05304b73782b8994D5191b17659D7572K64623H4859b30417M1392r0188C0379
12438B40917J70311l1609c5312j54837Q8634c7524k42666f7921G6130c06349M4044
12427b62305h2960j68603D1284K0962J28332P9309C5381L1850f591j4714A08852
12415a58590H4342j9008Q6211b59464j38252h4162B9088c8598A84484g7540E4278
12403a79834O3216A78618a30847I7576J3769k4931e80997B4613d7530A43584a36089
12391A65562a89193M3146k92424c3728l4739j131l66058a48447A3450c06835e0215
$$ plain form
12473 -81412 -423432 65778 -219845 105821 27263 109173 31460 23471 57033 114705 -30768
12461 -322788 190094 209464 -29842 298013 -140635 23164 104847 -80606 -5893 47366 305304
12450 305304 -273782 -28994 45191 -217659 47572 312195 84859 -230417 -189025 -279213 30379
12438 240917 411228 379619 -35312 -190149 -101515 -37524 -280190 -67921 76130 -306349 -262305
12427 -262305 -82960 -251563 41284 62246 190578 269887 35381 67231 -6591 -21305 108852
12415 -158590 84342 65334 151545 -259464 -397716 -84162 29088 -38598 184484 -77540 54278
12403 -179834 -116618 178618 -130847 97576 111345 86414 -580997 24613 -47530 143584 -136089
12391 165562 -189193 -146047 -438471 -33728 -68467 -69598 -435656 -148447 13450 -306835 -50215
12379d3740p0357A66197d2563a5257m7162k9365G9562b4045A78194K89340A41842
12367A35212a69418f8582A80162h4870H1803J0699J43755F8159c32071E6072b16497
12355A35443a19107N2582H3516K3890d53919C1765a6354j91445A76320b08053
12344B42362d49360a26976k0944e2259k58845R6331B98127a25737E3124i2213
12333A39088a76823B31811B2Q335c22415p5402F0209a04397B70934B096N7926
12322F0022J86642q3944N432O5195M3352F1379h0764D60388c78631c9793B41J94370
12310A94611h6933D3062a8625l76587a64583C5893Q32a2719C86386e431A99924
12298c10234C13636j32391l3720E2247h4800B1018Q4537e1292G6971N9464c5945
$$ plain form
12379 -43740 -114097 166197 -42563 -15257 -62419 -91784 79562 -24045 178194 467534 141842
12367 135212 -169418 -68582 180162 -84870 81803 92502 236257 68159 -332071 56072 -216497
12355 135443 -119107 -66525 83516 107406 -453919 31765 -16354 -207799 176320 -208053
12344 242362 -449360 -126976 -147920 -52259 -311104 -214773 298127 -125737 53124 -92213
12333 139088 -176823 231811 22 8357 -322415 -397817 60209 -104397 270934 2096 60022
12322 60022 246664 162720 168152 233347 276699 61379 -80764 460388 -378631 -39793 241 194611
12310 194611 -86933 43062 -18625 -395212 -164583 35893 36725 -12719 386386 -5431 199924
12298 -310234 313636 181245 147525 52247 -84800 21018 105555 -51292 76971 136435 -35945
12286i8689j55107G7842J66024a99818A02880d0610A71140K5265a29762K4482
12276a05280B3693a87879B19477j9293F8097K11411I4474b47019D27527A89628
12265a9425k22034R3136m1339b2970j03723A79326e303B42727a1610j05646B69430
12253A16406f4023A41941J18618C9309L79K12710K59415b95986A52673b54934
12242G0399R6170F9253a5378A64084d11124a58273n4166B82597d3015A6268b23078
12230B50582j24015f5360q283B30101k2016q5456P2174J08032A50166J02739d0324
12218B39459o7157c9355B6242L34299g4021D85948F7928k0167K38481F9170L6769
12207A05939J07287Q6661J09285A97483a58737B90893a63843O5688A62340p9536
$$ plain form
12286 -98689 -253796 77842 243866 -199818 102880 -40610 171140 196405 -129762 -105280
12276 -105280 23693 -187879 219477 200184 68097 279508 94474 -247019 427527 189628
12265 -19425 -241459 -148323 -189662 -22970 -126693 179326 -5303 242727 -11610 -117256 269430
12253 116406 -64023 141941 260559 39309 39688 252398 511813 -295986 152673 -254934
12242 70399 166569 69253 -15378 164084 -411124 -158273 -212439 282597 -43015 16268 -223078
12230 250582 126567 -65360 -73643 230101 208085 122629 194803 302835 150166 252905 -40324
12218 239459 172302 -39355 26242 360541 -74021 485948 67928 47761 286242 69170 105939
12207 105939 213226 299887 409172 197483 -158737 290893 -163843 -98155 162340 82804
12197H2804j7924b1272C71106j68394d9360B95583e7242E5214L3264a05508e1421
12185B73a6136l5473A21676K75577A7618J03347K76207A32563J47977A18869E5444
12173E4010R9654m2216a63935j0098G2297e920n3490A01489a04886B17719a47426
12161a26344F5353b69135A83757e7010B74015e41976d4084B91131A19577N3953
12151A73530b79326J26288E3342f2655B87247a42446A01518a8433B26085j09489
12141A16596a6912o1109K2426A33187i3266b7937B09500r4457k0791a36066e8727
12129c042j34017A54755E9906h9991d624A23751j9479J97532a98966J5643D5162
12117A61908P8635m3462O7506b4646j44235A9641J98661b54597I4642a49367m0280
$$ plain form
12197 82804 64880 -21272 371106 202712 -49360 295583 -57242 55214 88478 -105508 -51421
12185 273 -16136 -51609 121676 397253 17618 120965 397172 132563 280540 118869 55444
12173 54010 153664 111448 -163935 -174033 72297 -5920 -59410 101489 -104886 217719 -147426
12161 -126344 65353 -269135 183757 -57010 274015 -541976 -44084 291131 119577 173530
12151 173530 -279326 -153038 53342 -62655 287247 -142446 101518 -18433 226085 116596
12141 116596 -16912 -78021 -55595 133187 -93266 -27937 209500 115043 94252 -136066 -58727
12129 -3042 -137059 154755 59906 -89991 -4624 123751 104272 301804 -198966 -183323 45162
12117 161908 240543 197081 264587 -24646 -168881 19641 218302 -254597 94642 -149367 -189647
12106a89647Q2732B02944B5151a11286d4084B40094b5694j0793A42296E7687O2840
12095A20527M0749P3440a94135j54012e8456K9075C05663d1785A63572G8782B6341
12083b68126H4411d2516r9648c5399A75495O138b24826g0833I1155J75535a15792
12071B7573M0440Q59040O48227G77264C40333c9689j5820A19811a25067B74845
12060B50397a80726f710j65570j0830j7391C4071N8812K15682A40806b62982Q6341
12049a76641B27566f8579c0077j3120J7493k20991J10064A57095K10536a52889
12038d0408A18999K62775b24899A73230n3049K7320a12494E6221K06481a20582
12027a4230D1097c29548A56108i7447j08280A3335b1125A85999a37250b9109o9262
$$ plain form
12106 -189647 -106915 202944 25151 -111286 -44084 240094 -25694 -36487 142296 57687 120527
12095 120527 161276 234716 -194135 -348147 -58456 -29381 305663 -41785 163572 78782 26341
12083 -268126 84411 -42516 -142164 -35399 175495 181633 -224826 -70833 91155 266690 -115792
12071 27573 68013 927053 1575280 777264 340333 -39689 -55509 119811 -125067 274845
12060 250397 -180726 -6710 -172280 -183110 -200501 34071 92883 308565 140806 -262982 -176641
12049 -176641 227566 -68579 -30077 -43197 -25704 -246695 -136631 157095 367631 -152889
12038 -40408 118999 381774 -224899 173230 120181 147501 -112494 56221 262702 -120582
12027 -14230 41097 -329548 156108 -97447 -205727 13335 -21125 185999 -137250 -29109 -98371
12016i8371A91408f1051D5967j756d29974b01447D71138D8432b38228C16974F8273
12004B15695b21974h6467A56210a09079F2895a76617j34323a33296j67504I0158
11993A30731c3077F3359a53815C8082J7172L5594a94278Q4496A49070a6679n4147
11982g0826C6933K26430a47705D3500a34566a0822o3766H26R8128a27296G8706
11970A6292b548G623b41976N4019Q3639N422b973A54435J5218c22739D2667J05201
11958A47868k3284a67012j10094h4352k7673N3882J2182H4187L6306k5925J60581
11947B55149M2690e42899D5501M4702b09818f3803k71769i9406C32664f6490j38381
11936b04871L9905B25332b31164J15014L4510C1353g9427L6168B21921h0179A33058
$$ plain form
12016 -98371 191408 -61051 45967 44211 -429974 -201447 471138 48432 -238228 316974 68273
12004 215695 -221974 -86467 156210 -109079 62895 -176617 -310940 -133296 -300800 90158
11993 130731 -33077 63359 -153815 38082 55254 90848 -194278 -109782 149070 -16679 -70826
11982 -70826 36933 263363 -147705 43500 -134566 -10822 -74588 826 98954 -127296 78706
11970 16292 -2548 7623 -241976 -187957 -104318 -98896 -2973 154435 169653 -322739 42667 147868
11958 147868 124584 -167012 -277106 -84352 -112025 -58143 -45961 84187 120493 94568 255149
11947 255149 297839 -542899 45501 90203 -209818 -63803 -335572 -99406 332664 -66490 -204871
11936 -204871 -164966 225332 -231164 -116150 -81640 31353 -79427 -43259 221921 -80179 133058
11924b13876N0039P1060n5493q9362a04499A14469D689J75494B4087c6000G1814
11912D09395A37468A9270J02208P2986e580G1050O9338b15549B252d7732j96357
11901b44089B05190b08819E6997a93590C3137a89798A17122c79835B81069A34894
11890b27778h5649G9016c8724k55146h9597j03951d3806B19113N0908a17611A27389
11878C5161a14550m4745A08165C9031c5319k41561A49255F328e0968k5387A6642
11866a75930q615E4104J87410a0163j22411A23246E0784a15923b3143D20970A36885
11854e0510k89005a03187j6135q5797e7804F779a96032K6599f1256o1933d7324
11842D05057d3341l20434B51d5241E969J93575a80770D6702m192j2495N2382J01659
$$ plain form
11924 -213876 -163837 -92777 -148270 -237632 -104499 114469 4689 180183 24087 -36000 71814
11912 409395 137468 19270 121478 194464 -5580 71050 140388 -215549 2252 -47732 -244089
11901 -244089 205190 -208819 56997 -193590 33137 -189798 117122 -379835 281069 134894
11890 -227778 -85649 79016 -38724 -293870 -89597 -193548 -43806 219113 270021 -117611 127389
11878 35161 -114550 -159295 108165 39031 -35319 -276880 149255 6328 -50968 -76355 16642
11866 -175930 -184545 54104 241514 -10163 -132574 123246 50784 -115923 -23143 420970 136885
11854 -50510 -339515 -103187 -119322 -205119 -57804 6779 -196032 -169433 -61256 -123189 -47324
11842 405057 -43341 -363775 251 -45241 5969 199544 -180770 46702 42510 30015 82397 184056
11830A84056b4022n0466l17345H0793b15724d8696I1613K5466J08644h9339n9390
11819a48729q4333E1222J65464r7094c37842J37838A20590f1677p5021D1192a2301
11807A12645d6378A67945F3138a42425L6291c7268A69419F0812b79377A16624
11796b7712k55371G4561K16944b02730C6174Q9670B0164M223J66761d3777B97545
11784d1835B21101a38234j36215a36869I5464K37713a47675c947D3982a15097
11773c41359a50983k69472J38472A8646J48129a1912j09329e4070k42680d7177
11762A78580b08258A34617J17396a3426j23763J1696c0521A00976k5391J05339
11752A80924a66533c9283g035B06383c1664B0067h2524B49848M0507a86629A53071
$$ plain form
11830 184056 -24022 -74488 -391833 80793 -215724 -48696 91613 117079 225723 -89339 -148729
11819 -148729 -233062 51222 216686 119592 -337842 -200004 120590 -61677 -136698 41192 -12301
11807 112645 -46378 167945 63138 -142425 -106134 -37268 169419 60812 -279377 116624
11796 -27712 -283083 74561 291505 -202730 36174 125844 20164 24387 191148 -43777 297545
11784 -41835 221101 -138234 -274449 -136869 95464 333177 -147675 -3947 43982 -115097
11773 -341359 -150983 -420455 -281983 18646 166775 -11912 -121241 -54070 -296750 -47177
11762 178580 -208258 134617 252013 -13426 -137189 -125493 -30521 100976 75585 180924
11752 180924 -166533 -39283 -7035 206383 -31664 20067 -82524 249848 290355 -186629 153071
11740A99745A2372J11712E1411b49731A73019o9991d41868d326k58340A82020
11729B61010j05716n0218h6687b496j5701k25402m495J23737A73851m9577J08022
11718B32296e5276k6244B54998C5584K71539c21916E471K16553h6669J4600n1667
11707a23736A02475a25589H7123a19516e9100O451A87974N9699E7768J04160J48695
11696C10623g692j82479A93123J482C318K80716E7121i817B36979J36884b4889
11684D4600P6046b361j0004D4558K5634k8560J08379f9664B8234g7519l4180a3116
11671a09491N3371n8896l069G1918b50284m2447G848h075j09402e2887k23729
11660b76616O4669B72170M7204i7240f369A49957c1896A39290b41086L6982e2341
$$ plain form
11740 199745 12372 124084 51411 -249731 173019 103028 -441868 -4326 -262666 182020
11729 261010 155294 105076 -86687 -2496 -18197 -243599 -248094 -124357 173851 124274 232296
11718 232296 -55276 -81520 254998 35584 307123 -321916 5471 222024 -86669 -72069 -123736
11707 -123736 102475 -125589 87123 -119516 -59100 -52649 187974 247673 57768 161928 310623
11696 310623 -7692 -190171 193123 194605 3318 284034 57121 -9817 236979 373863 -24889
11684 44600 120646 -2361 -12365 44558 70192 41632 150011 -69664 28234 -77519 -111699 -13116
11671 -109491 -56120 -115016 -118085 71918 -250284 -292731 7848 -8075 -117477 -52887 -276616
11660 -276616 -211947 272170 319374 -97240 -6369 149957 -31896 139290 -241086 -204104 -52341
11648B16595H3605d2602P626B36158c58054A84172L7400b7103k2112B3850c06818
11636b2690p4779H5048R5144o4555P8018J95869b30476i7638K2117A3321R2593
11625A05914J14180a1236j64028A6686b96491o1079J53101c1293j59708A17259
11614B55703i4742k7151j49529P3871K3153l6218p5374F5344i1498l12842A30849
11602I023c5935A80422i0611C0204L879N0928f2245j68985f3100D0000h2447B85253
11589A58605E2950b43296A33649i8536o6979E0949i2966A59604F8581J22474n19
11578A90536C1615R3308J03695n8173D0147J4787d5819C75376j19263A19171P6824
11567A95995b34991r36P4759A9892K27029b5047j9634A27949n4999a33367j5318
$$ plain form
11648 216595 83605 -42602 -34976 236158 -358054 184172 221572 -27103 -49215 23850 -306818
11636 -22690 -97469 85048 180192 115637 193655 389524 -230476 -97638 -75521 13321 105914
11625 105914 220094 -11236 -175264 16686 -296491 -357570 -204469 -31293 -191001 117259
11614 255703 -94742 -121893 -271422 -197551 -174398 -210616 -285990 65344 -91498 -404340 130849
11602 9023 -35935 180422 -90611 30204 34083 85011 -62245 -231230 -63100 40000 -82447 285253
11589 158605 52950 -243296 133649 -98536 -165515 50949 -92966 159604 68581 191055 190536
11578 190536 31615 124923 228618 170445 40147 54934 -45819 375376 256113 119171 195995
11567 195995 -234991 -235927 -161168 19892 246921 -25047 -44681 127949 72950 -133367 -148685
11556a48685B43954H2291a35896A26610a5402j32590g1293A28650J01584D2948
11545a50422A00665P8716H2102a49459f9269A16289J31659a51808L1752C00133
11534B09579o5056J84434e1410B00804a30053r6355A42696B5610a0950G8372K49817
11523C28189a54051B83998n7664Q5199a75618D05082G0719L70575a61174H1044
11512A04880D5975a20708B5448K00412F4414h9889n355h033B99443d8310j9205
11501f7515A74693a47627A74787N8625Q1763J2003A20323i9557m2930o1371B40049
11489C4816L2812K20980a46436G664J22065g4757B04379d8656n360C19935A53531
11477f6756B24485I7321M2818l7800l7933G337K38511Q7944q9948O8646A3364
$$ plain form
11556 -148685 243954 82291 -135896 126610 -15402 -147992 -71293 128650 230234 42948
11545 -150422 100665 179381 82102 -149459 -69269 116289 247948 -151808 -120056 300133
11534 209579 144523 328957 -51410 200804 -130053 -226408 142696 25610 -10950 78372 328189
11523 328189 -154051 283998 226334 311533 -175618 405082 70719 441294 -161174 81044
11512 104880 45975 -120708 25448 225860 64414 -89889 -95244 -8033 299443 -48310 -67515
11501 -67515 174693 -147627 174787 233412 315175 327178 120323 -99557 -142487 -203858 240049
11489 34816 67628 288608 -146436 7664 129729 -74757 204379 -48656 -54016 319935 153531
11477 -66756 224485 97321 140139 102339 64406 7337 245848 333792 243844 312490 13364
11465B88082g7135K2200j99765R3199A68725J59878g2518B02139E4246K18287
11455B72533B0990b02966f5267A8567b00342k11464A79548h1563j44908c1894
11444a20342G5601d2768B31982p7655e8900q4938g1652F6030K23632e8629a1461
11432C32759m722G4375o84a80673N6030C7909i2267A33765k0258P880a24924e1621
11419B34221G8140b16371K7852d273A57346K22585I9131c25059A2137Q6046k0916
11408G7267J94730C3197e23907D2350K01584A3294Q6902H763K37898E7889N7490
11397A15379c37306j90730b19316A64242b1995h559n5246I6023m2881q191a18795
11385C4651O8139a00923B50811a29475b2318C5157P8559a82433d1719A02026C285
$$ plain form
11465 288082 -77135 -54935 -254700 -161501 168725 328603 -72518 202139 54246 272533
11455 272533 20990 -202966 -65267 18567 -200342 -411806 179548 -81563 -226471 -31894
11444 -120342 75601 -42768 231982 154327 -58900 -143838 -71652 66030 289662 -58629 -11461
11432 332759 328037 74375 73691 -180673 -124643 37909 -92267 133765 113507 121387 -124924 -51621
11419 234221 78140 -216371 -188519 -4273 157346 379931 99131 -325059 12137 98183 77267
11408 77267 271997 33197 -523907 42350 243934 13294 100196 8763 246661 57889 115379
11397 115379 -337306 -528036 -219316 164242 -21995 -8559 -63805 96023 53142 44951 -118795
11385 34651 102790 -100923 250811 -129475 -22318 35157 113716 -182433 -41719 102026 3285
11373a2251n8278j88774d4934j0598g048j7725j98313A32812e1917j52030j06457
11362c10404O8911R7656J4783A26870Q5892H1844J09666H6929J77873a10287B24604
11350c12301I5813d9995B35926A17204E7696b90745A49797j929a03662l9274G6905
11338c153k09830a05298l5254b5919l5646B22102N1566b72864a05776k4003B4411
11326d15450I3842c6803D921K33066e2282n5767l26809a26114I6482a00227r2814
11315a93041B81224j23117h3787H2008b78712J03190j31530D4161b510k99899
11305c02409A53562g8314k9356l00518C84445b2154l30777A79372k6662b84026
11294h0858K8244c905m386l96728a1395j22812B43269a88700f9444A97937F512
$$ plain form
11373 -12251 -70529 -259303 -44934 -55532 -7048 -24773 -223086 132812 -51917 -203947 -310404
11362 -310404 -241493 -143837 -129054 126870 212762 81844 191510 86929 264802 -110287 224604
11350 -312301 95813 -49995 235926 117204 57696 -290745 149797 147868 -103662 -142936 76905
11338 -3153 -212983 -105298 -140552 -25919 -61565 222102 273668 -272864 -105776 -129779 24411
11326 -415450 93842 -36803 4921 237987 -52282 -108049 -434858 -126114 96482 -100227 -193041
11315 -193041 281224 158107 -83787 82008 -278712 -175522 -307052 44161 -2510 -302409
11305 -302409 153562 -78314 -107670 -408188 384445 -22154 -352931 179372 152710 -284026
11294 -80858 -52614 -3905 -8291 -405019 -11395 -134207 243269 -188700 -69444 197937 6512
11282b5330j3337k16622N4122r9705g8235b383l2052B5277a05753k049A93274
11270A39921A3788J67638m6707a02850n9018E5496a85362A04507b44948C3628
11259f5077k15388R6155C82426a78231b2526A37601A1008g9905j70710o819I4387
11247b06956A63489J36687E5589L2542a51569j35747h3153j00585b0570B32838
11236a21914j90315B26193q3136g5164K6147j72523I7549N5698c49032A04862
11225d757k04450e5436A78488C1344g0545j08038k89327a4124C04791a48551f2170
11213b3838q0016B90776c20782O654j76904B08450a46841A2245d4341B7549J74885
11202B02434b11821p882A71698b27791d0402E305a97505A81447J17377a15649
$$ plain form
11282 -25330 -38667 -255289 -201167 -300872 -78235 -2383 -34435 25277 -105753 -107802 193274
11270 139921 13788 181426 134719 -102850 -161868 55496 -185362 104507 -244948 33628
11259 -65077 -280465 -184310 382426 -178231 -22526 137601 11008 -79905 -250615 -257434 94387
11247 -206956 163489 300176 55589 88131 -151569 -287316 -83153 -183738 -20570 232838
11236 -121914 -312229 226193 143057 -75164 -49017 -221540 97549 153247 -349032 104862
11225 -4757 -209207 -55436 178488 31344 -70545 -178583 -467910 -14124 304791 -148551 -62170
11213 -23838 -103854 290776 -320782 -314128 -491032 208450 -146841 12245 -44341 27549 202434
11202 202434 -211821 -219703 171698 -227791 -40402 5305 -197505 181447 298824 -115649
11191a52536B6615L0462J38405M8293N734b31268K4888C6685a75056A18129J32075
11180B50204j07105C0150i1068k38161C1088a60597j79220a26315C5788J10200
11170A45988c595C54406f5128b8628l4848B89396H1800J24920C6410a61200c378
11158a98255A07458B7195A1035J54079a27057q978D3618h9033k6149B15454L56606
11147E72060h5701a655A99827b12648c3854j26398O1215C39781b14487A53416
11136a66563F7462j0371b24181A69912J3753A1328J01884c30671A10153E1939
11125A73770a49919j04626g3727o8728A37324a39570e7733o1665A45181m1210
11115A03971a0464A07221M16803A54192M1405D9054a52459j4486A52706a51187
$$ plain form
11191 -152536 26615 57077 195482 243775 249509 -231268 -206380 36685 -175056 118129 250204
11180 250204 143099 30150 -91068 -329229 31088 -160597 -339817 -126315 35788 145988
11170 145988 -3595 354406 -65128 -28628 -63476 289396 81800 206720 36410 -161200 -3378
11158 -198255 107458 27195 11035 165114 -127057 -136035 43618 -89033 -115182 215454 572060
11147 572060 -85701 -1655 199827 -212648 -33854 -160252 -99037 339781 -214487 153416
11136 -166563 67462 57091 -224181 169912 183665 11328 113212 -330671 110153 51939
11125 173770 -149919 -254545 -73727 -142455 137324 -139570 -57733 -119398 145181 103971
11115 103971 -10464 107221 524024 154192 195597 49054 -152459 -166945 152706 -151187
11104a1783r0893A50801C7574O0873L54E979a59450L1796A19096K91519j94081
11093B16534Q8670r4651r720K0351C1638K03533B3084K46368H152L2703L41110
11082C81965A11810J55589O5970A19707J71525I1008J36081j00889i117D40568
11071D66339k0659A45286N8962J20960p7697J85647A83395J10257k3133J69544
11061D40063j40310O28298l71650K20364k79293n9272Q4333N5862L38173B80192
11050H49095j50067K95474C24057M93719l51346K70443m8629j064k27581R2576
11040E52175K58489m01752K49890K40771j07198k48572K65798A59609M68761l9926
11030E88444K0976p5475K77844j02845k78699R4621J78062j97011j04222L27139
$$ plain form
11104 -11783 -102676 150801 37574 98447 98801 5979 -159450 -127654 119096 410615 216534
11093 216534 305204 210553 200833 221184 31638 235171 23084 269452 8152 40855 381965
11082 381965 111810 267399 333369 119707 291232 91008 227089 126200 -9117 440568
11071 466339 445680 145286 204248 325208 247511 433158 183395 293652 270519 440063
11061 440063 299753 928051 556401 776765 497472 438200 522533 578395 916568 280192
11050 849095 699028 994502 324057 817776 466430 736873 688244 687180 459599 552175
11040 552175 810664 408912 658802 899573 792375 543803 809601 159609 628370 588444
11030 588444 609420 533945 811789 708944 430245 524866 702928 505917 401695 728834
11020G28834p7904j69755l7501j44080L86722C6398M21379j70412J80737J06917
11010E75019k17616k8175K08220r0731J89914B49511L96930j18463N4870k01047
11000C81801K85855J7888J68450k18408K58933k11065k56710j58564L30958p4940
10990E24198K10859J55805j55493L5904j89998J72781j1608j55821L50613K08489
10980A145729j39836q6548J36863M88210J34707l9255L90511K43477N38509m92517
10970B319850K86032l18353J4245J2859m96663n15912K73753O5561J5059l19429
10960A337002L86177l07929j4283J92257j29799N2228m11006J5999k69678Q0130
10950I31098j76014j53961j70174B00621k0085J60205K1998h844C03353I1982
$$ plain form
11020 728834 650930 481175 443674 299594 686316 36398 457777 287365 468102 575019
11010 575019 357403 329228 537448 446717 636631 249511 646441 527978 582848 381801
11000 381801 667656 685544 853994 635586 894519 683454 426744 268180 599138 524198
10990 524198 735057 890862 735369 771273 581275 754056 742448 586627 937240 1145729
10980 1145729 1005893 919345 1056208 1544418 1679125 1639870 2030381 2273858 2812367 2319850
10970 2319850 2605882 2287529 2301774 2314633 1817970 1302058 1575811 1641372 1656431 1337002
10960 1337002 1723179 1415250 1400967 1593224 1463425 1515653 1104647 1120646 850968 931098
10950 931098 755084 601123 430949 200621 180536 340741 362739 -8844 303353 91982
10939A5132J67212N4685J89022a60298C78755P5797F4599K59268L6774b40090
10928a25440B68515a18774C13916b0555A71581g1163D0913J53662h4996E6195
10917a72619n0144D5999e5249A23549e8069j73719D2369b26582M9553k08623A5121
10905a12569E5690P7849b13823d3528D31988F897a60867B04469a19999A26975
10894A58368c98015J90663I2241a29794m113o6206o7793B8673c00402J03213F52
10882i8389d6769k52748R9316q4951B38976j00393a3799j54700M452G6734a76477
10870f5591b3529A24047b0043E6818J14732F0009c22810J31306l4390B05012b90895
10858c430q8036j11158A1400K83128H6342a9551C57537a00752k5635d4260j18390
$$ plain form
10939 15132 182344 237029 426051 -160298 378755 454552 64599 323867 360641 -240090
10928 -125440 268515 -118774 313916 -20555 171581 -71163 40913 194575 -84996 56195
10917 -172619 -222763 45999 -55249 123549 -58069 -231788 42369 -226582 -177029 -385652 15121
10905 -112569 55690 133539 -213823 -43528 431988 6897 -160867 204469 -119999 126975
10894 158368 -398015 -207352 92241 -129794 -133907 -200113 -267906 28673 -300402 -197189 652
10882 -98389 -46769 -299517 -200201 -285152 238976 138583 -13799 -168499 -164047 76734 -176477
10870 -65591 -23529 124047 -20043 56818 171550 60009 -322810 -191504 -225894 205012 -290895
10858 -3430 -91466 -202624 11400 294528 86342 -19551 357537 -100752 -126387 -44260 -162650
10847a62650K3976D2159K07944D3594o925p494a82666k7545A17884B8406h8999
10835A0350K01704i7382G710a18430E683N5217a16792m8908F194J06248J77254
10824B89696m3801b2023B8094o653O9618i8427A1977a7090j06916D092h5624e862
10811b21321A684a82963q9730J01112o8468A33431b91289h9806o5392p582B56464
10799a67125C6746c66684B38592a01931p9613L7991M4109L0682A27276C3609f7201
10787c298A97120c07669c6781p2011A28542a74206A24188E0331i3213D247P8629
10776H2876A916P2895E587d06439d1444j41113g8733G6260C3464b64095A33863
10764D0576a14257j44682C0526e3847A59554m9315b18251f1950j59044B96700
$$ plain form
10847 -162650 -138674 42159 250103 43594 36669 29175 -182666 -210211 117884 28406 -88999
10835 10350 212054 -97382 7710 -118430 5683 60900 -116792 -165700 6194 112442 289696
10824 289696 245895 -22023 28094 21441 91059 -98427 11977 -17090 -124006 4092 -85624 -5862
10811 -221321 1684 -182963 -272693 -171581 -240049 133431 -291289 -89806 -155198 -162780 256464
10799 -167125 36746 -366684 238592 -101931 -181544 -143553 -99444 -68762 127276 33609 -67201
10787 -3298 197120 -307669 -36781 -108792 128542 -174206 124188 50331 -93213 4247 82876
10776 82876 1916 74811 5587 -406439 -41444 -182557 -78733 76260 33464 -264095 133863
10764 40576 -114257 -258939 30526 -53847 159554 110239 -218251 -61950 -220994 296700
10753F951Q6583g9854j55673j8613A20440P8510q3755d556A74719n5655a05230
10741D994Q5574Q0019G9830J65845a45243B46347B9070J71065a32935a2730A83263
10729B66102b4255J2100A14782j7030g6291j75604F0718K1435c1453A33823a4054
10717h8448k22597B70465G4790J33990f7999J5124p3430F8679a65440n5318d9446
10705g2773p6361A81514K7221H978a89128o1592J2222K1020C87079A1436a42707
10693b35348j08275J66859e8532A25581C7758b43052J12576O0539A00327d6566
10682A08701R0423F8351a36156f5709m65462a66526n9688O7443A26448D6673P4817
10671A21490a75778d8549p0796c3483j6700A27063j6377j8237a8276p6469o4283
$$ plain form
10753 6951 93534 -79854 -235527 -254140 120440 198950 115195 -4556 174719 119064 -105230
10741 4994 90568 170587 79830 245675 -145243 246347 29070 200135 -132935 -12730 183263
10729 266102 -24255 -12155 114782 97752 -76291 -251895 60718 82153 -31453 133823 -14054
10717 -88448 -311045 270465 74790 208780 -67999 -52875 -126305 68679 -165440 -220758 -49446
10705 -72773 -149134 181514 208735 8978 -189128 -250720 -238498 -217478 387079 11436 -142707
10693 -235348 -343623 -176764 -58532 125581 37758 -243052 -130476 -69937 100327 -46566
10682 108701 199124 68351 -136156 -65709 -531171 -166526 -226214 -158771 126448 46673 121490
10671 121490 -175778 -48549 -119345 -33483 -50183 127063 110686 92449 -18276 -94745 -159028
10660a59028k36093a2146j65237F8009f552B99480f0293l6077F765a91030n3757
10649b44787D2482a38292A57347E5090L38945b18408B01001D4003a63580O6769
10639i6811k14610a53837k7635k98685a77123A55469L1162b26291B9523a95009
10628c1981q1252A71297a57907M0683c5015H9758L0055a01236j28618d2402j25788
10617a68190g3179D183b36272E4701f5213k43868I1850d01283B13342a1906A23419
10605d66972K28308L7173B5888c0568A72129D3977a9401o6961q244k88647J85640
10594a97613G9576c1598A30469a51237e5621j57790a04242A2737L8939b97862
10583b82713O4414E9721J20547a91803j27060J37387H2166h2809C71212j54615
$$ plain form
10660 -159028 -395121 -12146 -177383 68009 -6552 299480 -60293 -96370 6765 -191030 -244787
10649 -244787 42482 -138292 157347 55090 394035 -218408 201001 44003 -163580 -96811
10639 -96811 -311421 -153837 -181472 -480157 -177123 155469 186631 -226291 29523 -195009
10628 -31981 -113233 171297 -157907 -117224 -35015 89758 119813 -101236 -229854 -42402 -168190
10617 -168190 -73179 4183 -236272 54701 -65213 -309081 91850 -401283 213342 -11906 123419
10605 -466972 -238664 -201491 25888 -30568 172129 43977 -19401 -86362 -94606 -383253 -197613
10594 -197613 79576 -31598 130469 -151237 -55621 -213411 -104242 12737 51676 -297862
10583 -282713 -218299 59721 180268 -191803 -318863 -181476 82166 -82809 371212 216597
10573B16597A06108a52751q1529Q3845D4086A9929b2811J0082k08891i7352a8034
10561H0277J56913A12927a15602J3847C60176b69238J33470A89347g5783m40518
10551e16301a15061c6887B18074D5109L5692N7177h4571I8184a47255j7429J871
10540a62813J1391O5271j35506f0843H7887J45695m3229i842I818a14118b502
10528b59485a14462a3976K716n23068A7524a29467A13297d25341a88376p5383
10518b63759A6404K59618a60100a1427j04424E3964J41638C3436K25345I4891
10507b164j66883A18253a37618A5806a34503A4003K4698b68336C4760L18425H4389
10495F1014q549b3516A07788D8281d4646j05388j46481A78515o9865K51252a74645
$$ plain form
10573 216597 106108 -152751 -234280 -150435 44086 19929 -22811 -12729 -221620 -97352 -18034
10561 80277 237190 112927 -115602 -101755 360176 -269238 -135768 189347 -75783 -516301
10551 -516301 -115061 -36887 218074 45109 80801 137978 -84571 98184 -147255 -164684 -162813
10540 -162813 -151422 -86151 -221657 -60843 87887 233582 190353 -9842 9818 -114118 -2502
10528 -259485 -114462 -13976 -11260 -534328 17524 -129467 113297 -425341 -188376 -263759
10518 -263759 16404 276022 -160100 -11427 -115851 53964 195602 33436 258781 94891
10507 -2164 -169047 118253 -137618 15806 -134503 14003 38701 -268336 34760 353185 84389
10495 61014 52465 -23516 107788 48281 -44646 -150034 -296515 178515 108650 359902 -174645
10483E1077l57c8525B26861J0758K33450h3948A68441k648l5475D0242c7117B12182
10470a24674A09919A2440J85397c92372B51282A12946C7580K02313n713b12521
10459d25967A01341e637m53064a27870K4322a0178j36949j72794a29556n4272
10449a83828B32579f3229n6304l4033k1958Q0711k29591A53169b60261f7965j4225
10438h2190J4856J7458A70446j2157e786E9024b5778j7100A74978h6019k6521
10427a12540B5326J5625a01135A37773a05041l14454c8126j8559p3043C25254
10416d5237A12208b0132j07831f396r9514C2973J47121c54034B53977A19992O0598
10405A80590b0546J642l80340q734E1932j2512b15253A49169K79393a06439j5892
$$ plain form
10483 51077 50720 -38525 226861 237619 471069 -83948 168441 165793 130318 40242 -37117 212182
10470 -124674 109919 12440 197837 -392372 251282 112946 37580 239893 234180 -212521
10459 -425967 101341 -5637 -458701 -127870 -103548 -10178 -147127 -319921 -129556 -183828
10449 -183828 232579 -63229 -119533 -153566 -175524 -94813 -324404 153169 -260261 -67965 -82190
10438 -82190 -67334 -49876 170446 158289 -5786 59024 -25778 -42878 174978 -86019 -112540
10427 -112540 25326 40951 -101135 137773 -105041 -419495 -38126 -56685 -129728 325254
10416 -45237 112208 -20132 -127963 -6396 -105910 32973 180094 -354034 253977 119992 180590
10405 180590 -20546 -18904 -399244 -407978 51932 39420 -215253 149169 428562 -106439 -122331
10394a22331A76569G7817i8036A34283d5271H7928K03324N7623m5836a38966A30843
10382C2901a9401B08394i9575B59031k2276j2930L7353K16176k04735f0948A31305
10370A51154J13918m0577K05597o0850K13182B88125J66016j86524p8657J44143
10360C33103Q1483A90609R7913j38881m5011K17934A47149K98353j71729r2232
10350A81541L63460B48175J92263e5660A59225J74309E8163N9063N0069P0013
10340B37308o3772o4408k5825k4933M02936a62968C39060j63574m2216b27468
10329c8743B15650a12971C91185A42342j6046J8677G1754B8607a0901j18009K6158
10318a02752j21818m0996B8613J43620m0538c6836F3770d2958A01250i3726j89960
$$ plain form
10394 -122331 176569 77817 -98036 134283 -45271 87928 291252 348875 303039 -138966 130843
10382 32901 -19401 208394 -99575 259031 236755 223825 261178 477354 272619 -60948 131305
10370 151154 265072 224495 430092 369242 582424 288125 454141 267617 188960 333103
10360 333103 414586 190609 288522 149641 104630 322564 147149 445502 273773 181541
10350 181541 545001 248175 440438 -55660 159225 333534 58163 117226 167295 237308
10340 237308 173536 109128 83303 58370 461306 -162968 339060 175486 133270 -227468
10329 -38743 215650 -112971 391185 142342 126296 144973 71754 28607 -10901 -128910 -102752
10318 -102752 -224570 -265566 28613 172233 131695 -36836 63770 -42958 101250 -93726 -283686
10307b83686a40859F1521a01339L8016A49147j0697g9637B51737p35c66454A03890
10295e44174b23618b7486B06216p889G0891e14478A46875o9173a50747l82821
10285e33568A75799c51626B46882H6826a05161D0581b55490e9816B3208h341m9177
10274e7518B70864e06756B54935a97337B14543a67760l5558B4386a76462F6834
10263A58239a5703A49230n0968N7479J695J46566A49260M8130K24602b07003A88111
10251b62217B89778d7651k25658A30838a41679D5330A0229a4491j47969q9118
10241b51578F753c6133k10712B69771H4668K76992a36603A10996a58240M3258
10231a14982A93084c89025H6806a97190N3387k6574G5963I931i0673k12305A1057
$$ plain form
10307 -283686 -140859 61521 -101339 -63323 149147 138450 -79637 251737 251002 -366454 103890
10295 -544174 -223618 -27486 206216 198327 70891 -514478 146875 77702 -150747 -533568
10285 -533568 175799 -351626 246882 86826 -105161 40581 -255490 -59816 23208 -8341 -57518
10274 -57518 270864 -506756 254935 -197337 214543 -167760 -203318 24386 -176462 66834
10263 158239 -15703 149230 98262 155741 157436 304002 149260 197390 421992 -207003 188111
10251 -262217 289778 -47651 -273309 130838 -141679 45330 10229 -14491 -162460 -251578
10241 -251578 6753 -36133 -246845 269771 84668 361660 -136603 110996 -158240 -114982
10231 -114982 193084 -389025 86806 -197190 -143803 -170377 75963 9931 -90673 -302978 11057
10219B52037j10680a5222k88455d8753j89403O5999A6818d46867B6108e2180G6263
10207A41155B322J54998b4112A73872A2641e93001b79108E3637c11652G5415l2092
10196D3323J4490a2245A71670J44497b7161A08134O5644m2350a05727D9409J7249
10185F6658a77161a0924D0634K0270c33257J51487B01278E429b11237c888B873
10173A70147D0081a37041o9372h7185C55008F1992f2221E3157b39153f2571b4422
10161A11557c3441k86439A25716l1064r371J47495c14872B84966d19063C0362
10150a36841b4928A68334e32737f618B9574O7956D3798c58577m8841E08b45207
10138a27220D6374J58697a84798C16845a34728k8774B342K04009g2210j55739
$$ plain form
10219 252037 141357 -15222 -303677 -48753 -238156 -172157 16818 -446867 26108 -52180 76263
10207 141155 2322 157320 -24112 173872 12641 -593001 -279108 53637 -311652 75415 43323
10196 43323 57813 -12245 171670 316167 -27161 108134 173778 131428 -105727 49409 66658
10185 66658 -177161 -10924 40634 60904 -333257 -181770 201278 5429 -211237 -3888 2873
10173 170147 40081 -137041 -206413 -87185 355008 61992 -62221 53157 -239153 -62571 -24422
10161 111557 -33441 -319880 125716 94652 85281 232776 -314872 284966 -419063 30362
10150 -136841 -24928 168334 -532737 -6618 29574 97530 43798 -358577 -407418 508 -245207
10138 -127220 46374 205071 -184798 316845 -134728 -163502 2342 206351 -72210 -227949
10128b27949C51566e4688A35071i1652B64179c17573B0820f657r4170c0882B69266
10116f9920j29778B09436D7396A3613c834F350a97717C1764N4895k0251R7403
10105A63811h5469J1851A78011a47434f1433j13435k23435a89230L9049A08106
10094a22457K7740B37575I5835J83027h2071C36077a45279b6289D3735M3729b71773
10082G3436a6165I6820i6631L2787l06920a19641r2068L5168k26673J52634R472
10071b41108c9304H426i2583l38052A05724a52739k14775D477b45067H7465C6830
10059a57732j04869b720n4483a7199C22560a50943O7987J3585B58770A1755M1398
10048E3153e0473b1714a0345k03921q873H9556a79678A25288b80944B00786b77615
$$ plain form
10128 -227949 351566 -54688 135071 -91652 264179 -317573 20820 -6657 -100827 -30882 269266
10116 -69920 -199698 209436 47396 13613 -3834 6350 -197717 31764 86659 66408 163811
10105 163811 -85469 -73618 178011 -147434 -61433 -174868 -398303 -189230 -150181 108106
10094 -122457 -94717 237575 95835 278862 -82071 336077 -145279 -26289 43735 87464 -271773
10082 73436 -16165 96820 -96631 -63844 -370764 -119641 -211709 -176541 -403214 -250580 -241108
10071 -241108 -39304 8426 -92583 -430635 105724 -152739 -367514 4477 -245067 87465 36830
10059 -157732 -262601 -2720 -57203 -17199 322560 -150943 -82956 -69371 258770 11755 53153
10048 53153 -50473 -21714 -10345 -214266 -223139 89556 -179678 125288 -280944 200786 -277615
10036E3552c7972j89563c9376o0543k60461H5191R3217m5212b48330e4338N773
10025d8565J5574k51510j43053e4266A93355f579L35n2818j48429r157f4083I0704
10012h3110C25190a72063k89476e8395C0934a61022n9224R9648l9021j52185A31393
10000E8084j496c99719a8415j33851c4853D01014F0812e8890o6370N2747A81619
9988a42716B2347a46462c2003A99740e76230C5169f1304D8845i5015m1001C64004
9976b2888o9383C5828c99004i9904D7388e01217i8521L1054j10335l2196B87138
9964d1559B38088b13068O706A71467m2331b37763O0880r8905f4470l00795O3587
9953c01678G5419b03386Q1612d4648E4337a89578o3799g4163j68734h7985j06358
$$ plain form
10036 53552 -37972 -227535 -39376 -99919 -360380 85191 178408 133196 -248330 -54338 -48565
10025 -48565 -32991 -284501 -427554 -54266 193355 -6579 -6244 -59062 -207491 -216648 -64083 90704
10012 -83110 325190 -172063 -461539 -58395 30934 -161022 -220246 -120598 -159619 -311804 131393
10000 58084 56588 -399719 -18415 -152266 -34853 401014 60812 -58890 -125260 -72513 181619
9988 -142716 22347 -146462 -32003 199740 -576230 35169 -61304 48845 -95015 -136016 364004
9976 -22888 -92271 35828 -399004 -99904 47388 -501217 -98521 -67467 -177802 -209998 287138
9964 -41559 238088 -213068 -206362 171467 129136 -237763 -176883 -275788 -64470 -365265 -301678
9953 -301678 75419 -203386 -121774 -44648 54337 -189578 -253377 -74163 -242897 -87985 -194343
9942a94343D1810b3298B88097L4155d1103n4916Q968m6597B26600A8776K130g2147
9929b56329a22258A7813Q9172k5884b35602a0683j32363k10977a8767n5908B02728
9917a95593j00105J22501c9519C1318P229b30984f7052A07983g3034k4900m8391
9906a46325A74825b74770D5435c62938B25300a48128P0953D0754b7117q3843l2926
9895a43886C24023c04437H2711f8491r6264L4460j18327b0761j81040C7530a31972
9883a93622j720a6243B6320O5657K1265Q7165a47210M8202M18A4151O5606C1377
9870a34646F6952R4341K32044C7092a21613l142m944n4654I7691a51659j72584
9859c24243a24095B73254f7083k24917c6655B13536a50302F2768c03385f4908
$$ plain form
9942 -194343 41810 -23298 288097 322252 -41103 -96019 -87051 -133648 226600 18776 20906 -72147
9929 -256329 -122258 17813 106985 81101 -235602 -10683 -143046 -354023 -18767 -74675 202728
9917 -195593 -295698 -173197 -39519 31318 38547 -230984 -67052 107983 -73034 -97934 -146325
9906 -146325 174825 -274770 45435 -362938 225300 -148128 -77175 40754 -27117 -110960 -143886
9895 -143886 324023 -304437 82711 -68491 -164755 -130295 -248622 -20761 -201801 37530 -131972
9883 -193622 -195342 -16243 26320 91977 113242 200407 -147210 -99008 -98590 14151 79757 31377
9870 -134646 66952 161293 393337 37092 -121613 -124755 -129699 -184353 97691 -151659 -324243
9859 -324243 -124095 273254 -67083 -292000 -36655 213536 -150302 62768 -303385 -64908
9848b28914D9160b08781B0082a57968D5272N946b65803E204c10627C068a67053
9836h3141k56771B1325i4537E8170b8892j15949o4836e6483A10789a03607J9759
9825h3848B28626a61899j28736A85535N8084c68628B74630b57152C12242b40512
9814h6480j41773r0987B61566h6837l8948b7862E7534J65840b95973Q1588Q946
9803b05439M3607D2056b0934B09224b19579e5272j16700N996I3410b56468C14602
9791B48246b11221h0783n5787b3567j08386p4767a01163a3785D1097a6550j2300
9780b8850G561b0195j31033C13944a22641a8901j75104i0163k08013j31211D5618
9768b61064C04521a72285E8302a83247d2004j91579H9699b58635I3380a20694
$$ plain form
9848 -228914 49160 -208781 20082 -157968 45272 51218 -265803 5204 -310627 3068 -167053
9836 -83141 -339912 21325 -94537 58170 -28892 -144841 -209677 -56483 110789 -103607 -83848
9825 -83848 228626 -161899 -290635 185535 243619 -368628 274630 -257152 312242 -240512
9814 -86480 -228253 -319240 261566 -86837 -125785 -27862 57534 223374 -295973 -214385 -205439
9803 -205439 -161832 42056 -20934 209224 -219579 -55272 -171972 -165976 93410 -256468 314602
9791 248246 -211221 -80783 -136570 -23567 -131953 -206720 -101163 -13785 41097 -16550 -28850
9780 -28850 7561 -20195 -151228 313944 -122641 -18901 -194005 -90163 -298176 -429387 45618
9768 -261064 304521 -172285 58302 -183247 -42004 -233583 89699 -258635 93380 -120694
9757h5149A50063b03253K2763B26777I0765K9895A6693M3378f8653k80031g7048
9745b65498j74044g7049l0993J9257k1758A08703p391b33645P7844j6035G9195
9733a11607d2942E4820J82007d16202A12884a81472e9003A22386b6034A98366
9722c0103k13370f6546l9779j43043Q3945p085g71k33489k1566e9037j4458M951
9710f8544k68700c6966a6277A11396N0462G4552a0186l69394d7538B23584D0923
9698c58990E1382P742a8081G2627a96814B6378a97564g9905i117l31316A16122
9686A44700o0710c37867A4834b28462D12028g2750m16090L5791b05513R3017l8489
9675a50985J6965N0804A54964B7242a16348b471j61855B37912c95323B7088J8023
$$ plain form
9757 -85149 150063 -203253 -180490 226777 90765 120660 16693 60071 -68653 -348684 -77048
9745 -265498 -439542 -77049 -108042 -88785 -110543 108703 101312 -233645 -155801 -171836 79195
9733 -111607 -42942 54820 236827 -416202 112884 -181472 -59003 122386 -26034 198366
9722 -30103 -243473 -66546 -106325 -249368 -165423 -172508 -771 -234260 -255826 -59037 -73495 -68544
9710 -68544 -337244 -36966 -16277 111396 161858 74552 -10186 -379580 -47538 223584 40923
9698 -358990 51382 59124 -18081 72627 -196814 26378 -197564 -79905 -9117 -340433 116122
9686 144700 83990 -337867 14834 -228462 412028 -72750 -488840 -453049 -205513 -112496 -150985
9675 -150985 -134020 -83216 154964 27242 -116348 -2471 -164326 237912 -395323 27088 45111
9664D5111b45472l3964c9306D8753a8920F189b57629a8637B48207d8252G8331
9652a21225M5070A1317J70437q5698f2692j94401B26820l7015H0164P6313b18070
9640d00713A83373a06216C07b23309L2067g1948b1493j6981C6272M5641a08059
9628a669l00588H9367k8346h7570n5753A32034E5353O1309e7691q9656o5339R14
9616b11772R9202A70692H2869a06087n608p6732G5564a15368B7538J01338a4029
9604a58949j9965E739c39262B70702a25926A9662a13807A61093n9721D8608b11863
9592d97341a54110c5145k30084A63662G1375K7664K34988a97057P9898j17116
9582b34275J4932B09271a89832K3228L4953m2335I9693b8158j1511q0836k95598
$$ plain form
9664 45111 -245472 -279436 -39306 48753 -18920 6189 -257629 -18637 248207 -48252 78331
9652 -121225 -76155 11317 181754 96056 -62692 -257093 226820 189805 80164 156477 -218070
9640 -400713 183373 -106216 307 -223309 -191242 -71948 -21493 -38474 36272 81913 -108059
9628 -1669 -302257 89367 61021 -87570 -143323 132034 55353 116662 -57691 -147347 -212686 -211772
9616 -211772 -112570 170692 82869 -106087 -111695 -188427 75564 -115368 27538 128876 -14029
9604 -158949 -178914 5739 -339262 270702 -125926 19662 -113807 161093 101372 48608 -211863
9592 -497341 -154110 -35145 -265229 163662 71375 99039 334027 -197057 -117159 -234275
9582 -234275 -219343 209271 -189832 -166604 -131651 -173986 99693 -28158 -39669 -120505 -416103
9571d16103a03140k08949J1080a43188k09550h2484k47672E1311N5366J33427
9561B40104a42105B00142b8007B97388E3956c6701A61J51503a82706A35844e2853
9549a01392a4091j10611c3129a6436l89387A61594d45605b00159i6734q2518j08143
9538b87395A66c33382f092n40841a44965O5079m9395G482J43787c6043o2789J61
9526i8671A49804C8116b47576A1663J62746P0186G3077d68488A14329b71374P8734
9515a92640G9366b25330D348K9382r940b09835G0319a78574n4041j01771L717
9504c30669a4619k48116B9673a15179c8353I493K6767a43296A71607b70492Q4291
9493a86201C3844g5564q1571d2342k94823B36926c1055k9082r84q8057l390j27478
$$ plain form
9571 -416103 -103140 -312089 -301009 -143188 -352738 -82484 -330156 51311 106677 240104
9561 240104 -142105 200142 -28007 297388 53956 -36701 161 151664 -182706 135844 -52853
9549 -101392 -14091 -124702 -33129 -16436 -405823 161594 -445605 -200159 -96734 -179252 -287395
9538 -287395 166 -333382 -6092 -546933 -144965 -79886 -129281 7482 151269 -36043 -98832 -98671
9526 -98671 149804 38116 -247576 11663 174409 244595 73077 -468488 114329 -271374 -192640
9515 -192640 79366 -225330 4348 33730 23790 -209835 70319 -178574 -232615 -334386 -330669
9504 -330669 -14619 -262735 29673 -115179 -38353 9493 36260 -143296 171607 -270492 -186201
9493 -186201 33844 -75564 -157135 -42342 -337165 236926 -31055 -60137 -61121 -149178 -152568 -280046
9481b80046H7557a27029D06371m0739f5982l40161h9249J5670B56389C9062b03071
9469a7358j253B80459c17580R3475j86801a9377k12730A40782C1142g4571k39900
9458c14471Q0486J09764j1013A20502k7941j3757J13404b40105d9765k28259D8855
9446I0385c9655J8165r4306C6229b77332D65184E6143b68498f307B54682c486
9434c46970N0269F5607c43860a6965B4039i4257b8575E2925e7697A50436a85553
9422D5899e312k3374j5899A03050j9784e672j65625f8854j65318O5307o7404A81398
9409a59562m1042b4403q5100C7043b91385J03116c3830E40a85405K1046A04332
9397A4359K86709a30119B22200a98602a6325A90217b62971o6077P7104A88826
$$ plain form
9481 -280046 87557 -127029 406371 365632 -65982 -406143 -89249 -73579 256389 39062 -203071
9469 -17358 -18611 280459 -317580 -224105 -410906 -19377 -232107 140782 31142 -74571 -314471
9458 -314471 -233985 -124221 -135234 120502 92561 78804 192208 -240105 -49765 -278024 48855
9446 90385 -39655 -21490 -115796 36229 -277332 465184 56143 -268498 -6307 254682 -3486
9434 -346970 -296701 65607 -343860 -16965 24039 -94257 -28575 52925 -57697 150436 -185553
9422 45899 -5312 -28686 -44585 103050 83266 -5672 -171297 -68854 -234172 -168865 -236269 181398
9409 -159562 -200604 -24403 -109503 37043 -291385 -188269 -33830 540 -185405 -164359 104332
9397 14359 301068 -130119 222200 -198602 -16325 190217 -262971 -329048 -251944 188826
9386A06226A9764J32677b01262b9477j35260k9417A9103J38461b84371B32297
9375A05998c02314J30629F7696P728c43851h6917A4078a45103j41457B5352E723
9363g8846b9985k06293B4291b51658Q8945g3875b1254D5443a71819L8385N7550
9352g5884C3908f2906A58113F6805L98039g8403l06838C4044M5798a89880q91
9341a90771A0580Q7959a57099n1264l2440A20681c24671J56741h1732k7035j24569
9330b33336k957F4454d28529a11510C7938c13075H1347a87401J4407p6476D8578
9318a76702r849d7580j597k5537B53489e8306j70489A93583c80922a72322B10195
9306A31641a26891A13069g2254c4257I8147J8679j8370k4106d7847r5924o3353
$$ plain form
9386 106226 19764 152441 -201262 -29477 -164737 -194154 19103 157564 -284371 232297
9375 105998 -302314 -171685 67696 75424 -343851 -86917 14078 -145103 -286560 25352 5723
9363 -78846 -29985 -236278 24291 -251658 -162713 -73875 -21254 45443 -171819 -133434 -75884
9352 -75884 33908 -62906 158113 66805 464844 -78403 -385241 34044 79842 -189880 -190771
9341 -190771 10580 98539 -157099 -208363 -240803 120681 -324671 -167930 -81732 -108767 -233336
9330 -233336 -236293 64454 -428529 -111510 37938 -313075 81347 -187401 -172994 -249470 48578
9318 -176702 -186551 -47580 -49177 -74714 253489 -58306 -228795 193583 -380922 -172322 210195
9306 131641 -126891 113069 -72254 -34257 98147 116826 98456 74350 -47847 -143771 -207124
9295b07124F945a2802H8673L1038L38716G2929a00979L8306K8416B42245b76106
9283d3014A97760a649k6749k34023j17725a85166F562c70417d6760k40693n730
9272b93183n3515c1574A77660R4175F9179g5958n7265I5611g8823a8472p8390
9261i6862k9547k71224B5403b13622A25384h0435j1582J9125m1810j78595A17338
9249E4441c54516A69001b6514j53427j58467A88469F0979d5841j396k531j96270
9238b46038g4294L1895k32458A36883a37926I6517M0757o0262b79299F958e8274
9226d9812C15744j31838a1474F387f0305G5212h8630C95888b6303j15315c3196
9214b7595A32052C714c26705A19545b79548A34791a59515g9126j59408J18186
$$ plain form
9295 -207124 6945 -12802 88673 119711 458427 72929 -100979 -62673 -34257 242245 -276106
9283 -43014 197760 -1649 -28398 -262421 -380146 -185166 6562 -370417 -46760 -287453 -293183
9272 -293183 -346698 -31574 177660 271835 69179 -75958 -133223 95611 -78823 -18472 -96862
9261 -96862 -126409 -397633 25403 -213622 125384 -80435 -92017 -72892 -114702 -293297 117338
9249 54441 -354516 169001 -26514 -179941 -338408 188469 60979 -45841 -47237 -49768 -246038
9238 -246038 -74294 -42399 -274857 136883 -137926 96517 137274 77012 -279299 6958 -58274
9226 -49812 315744 183906 -11474 6387 -60305 75212 -88630 395888 -26303 -141618 -33196
9214 -27595 132052 3714 -326705 119545 -279548 134791 -159515 -79126 -238534 -120348
9204a20348A06572a47455M6019B95741a55101D7249c32953I376d12122g3804A20077
9192A95932E1724a9138j54315d7823o2181j76816a19318C46543g6399j76369R4083
9181a58685b9593m46071a53865A46327a30773b8915C24157d7002o654A02146K64827
9170C66973I8132b1827A49272a51916B9921e5518A96633i9239A2024J25503A8199
9158d07843A37738I842d7712j52468Q5511B20906b25949A59475b65961A30372
9147a10112k4735N1587m0592p1285G2135b04151g0809k23286A99441f5360q6407
9136a51767d9315k2568q8492C9827d20904J82809A9357L27655a61586k7877F951
9124A45364h8682H7418f9359o834b0429A41901b64727D5075e9235A37452c40473
$$ plain form
9204 -120348 106572 -147455 -101436 295741 -155101 47249 -332953 9376 -412122 -73804 120077
9192 195932 51724 -19138 -173453 -47823 -110004 -286820 -119318 346543 -76399 -252768 -158685
9181 -158685 -29593 -475664 -153865 146327 -130773 -28915 324157 -47002 -53656 102146 366973
9170 366973 98132 -21827 149272 -151916 29921 -55518 196633 -99239 12024 137527 18199
9158 -407843 137738 9842 -47712 -200180 -114669 220906 -225949 159475 -265961 130372
9147 -110112 -134847 -83260 -123852 -195137 72135 -204151 -70809 -294095 199441 -65360 -151767
9136 -151767 -49315 -71883 -160375 39827 -420904 -238095 19357 347012 -161586 -189463 6951
9124 145364 -88682 87418 -69359 -76193 -20429 141901 -264727 45075 -59235 137452 -340473
9112G457a94778G8946d18971i264n58525a8450j49549A21678i5655k61136g0552
9100i8153m5698l143B01893A100K60355a61721e1326j02752k28671d9072l05154
9089c54226d3836m13176B47566a54990L4957b5125A8118f8453l38381E9852J72268
9078B32120b1660l11057F8879M7165m0595b25610A7490a88443B02034r7409f9365
9066a01726o2669M1751o6716j3276N5737A40065i8026k21213A37865j4579f6476
9054a264p0977p3777r4960B12061b94302a44559j14179A07168h7551j21336A73211
9042A42005a15150k12073J58682I7288K4414m7959b23914P24Q9925D4099e8509
9030a05814G6494b02750J8779j6320D8510K23145d8171A69946d51339H1655K77430
$$ plain form
9112 7457 -194778 78946 -418971 -9264 -567789 -18450 -167999 121678 -95655 -356791 -70552
9100 -98153 -143851 -146994 201893 1100 261455 -161721 -51326 -154078 -382749 -49072 -354226
9089 -354226 -43836 -457012 247566 -154990 -120033 -25125 18118 -68453 -406834 59852 232120
9078 232120 -21660 -332717 68879 116044 75449 -225610 17490 -188443 202034 104625 -69365
9066 -101726 -164395 -122644 -189360 -202636 -146899 140065 -98026 -319239 137865 123286 -66476
9054 -1264 -72241 -146018 -240978 212061 -294302 -144559 -258738 107168 -87551 -208887 173211
9042 142005 -115150 -327223 -168541 97288 121702 73743 -223914 -223190 -133265 44099 -58509
9030 -105814 76494 -202750 -183971 -200291 48510 271655 -48171 169946 -451339 81655 359085
9019C59085j60476a93688C548L33094a82012a4515A9348K96981A55802e0874k63892
9008c14766a45618j99153J41470k4018F8136l767J10229E6271J95540J5036A15409
8996a65177F3411a66641K3502D7411c31641R9876A23704e3474l03171d3565k36310
8985b79875o8624a11659A52934b83532r156f463c162R17n9960j03312l1882A25495
8972A96849c26830A92427a32812A06792b00838e0739j11748e4693E4499k2261
8962C2238b16951A91089G1013C0734d1280A7184h9453B381b06993A4346o2a78212
8949A08055i9583I5038f3071A85905d18333J47938C8392F650d1581D7641a71969
8937C8228J45705e5435B62778j03219J71791b13733g2210L5527j91823i9030j12429
$$ plain form
9019 359085 198609 -193688 3548 336642 -182012 -14515 19348 316329 155802 -50874 -314766
9008 -314766 -145618 -344771 -203301 -227319 68136 64369 174598 56271 251811 266847 115409
8996 -165177 63411 -166641 -143139 47411 -331641 -231765 123704 -53474 -356645 -43565 -279875
8985 -279875 -348499 -111659 152934 -283532 -292688 -6463 -3162 -2245 -62205 -165517 -197399 125495
8972 196849 -326830 192427 -132812 106792 -200838 -50739 -162487 -54693 54499 32238
8962 32238 -216951 191089 71013 30734 -41280 17184 -89453 2381 -206993 14346 14284 -178212
8949 108055 -99583 95038 -63071 185905 -418333 -270395 38392 6650 -41581 47641 -171969
8937 38228 183933 -55435 262778 159559 331350 -213733 -72210 -36683 -228506 -99030 -211459
8926b11459A59674L45763L25186J453032M694128K535187B913159I25943l66623
8917E59320A49286J98556a05023J9586l28055B53312j16584d9588E5556N38759
8907E94315a78271l5322R7366p0023F5975b87857C2183a59618d5082I3825r359
8896H4466d3015A46230i4763K3069k31080e3764G4577b3455A47683n2577K1102
8885A16208a84824K8539l43206a63518c9672j51821M7106M7711B86560b06647
$$ plain form
8926 -211459 159674 505437 830623 2283655 6977783 9512970 2913159 925943 559320
8917 559320 149286 347842 -105023 -85437 -413492 253312 136728 -49588 55556 594315
8907 594315 -178271 -213593 -116227 -186250 65975 -287857 32183 -159618 -45082 93825 84466
8896 84466 -43015 146230 -94763 -71694 -302774 -53764 74577 -23455 147683 95106 116208
8885 116208 -184824 -156285 -499491 -163518 -39672 -191493 -144387 -96676 286560 -206647
$$ [...]
##END NTUPLES=NMR SPECTRUM
##END=
