
##TITLE=UV1210_M4_1332-1205_7185290_ikKj0LbaFJ
##JCAMPDX= 6.0         $$ Bruker NMR JCAMP-DX V2.0
##DATA TYPE= NMR SPECTRUM
##DATA CLASS= NTUPLES
##ORIGIN= BRUKER
##OWNER= Administrator
$$ 1.72 TOPSPIN		Version 2.1
$$ 2012-12-06 02:36:44.757 -0500  Administrator@X
$$ Compression mode = diff/dup
##.OBSERVE FREQUENCY= 400.02188249412
##.OBSERVE NUCLEUS= ^1H
##.ACQUISITION MODE= SIMULTANEOUS (DQD)
##.ACQUISITION SCHEME= undefined
##.AVERAGES= 64
##.DIGITISER RES= 22
##SPECTROMETER/DATA SYSTEM= spect
##.PULSE SEQUENCE= noesygpps1d.comp
##.SOLVENT NAME= COFFEE_meoh
##.SHIFT REFERENCE= INTERNAL, COFFEE_meoh, 1, 14.96095
##AUDIT TRAIL= $$ (NUMBER, WHEN, WHO, WHERE, PROCESS, VERSION, WHAT)
$$ ##TITLE= Audit trail, TOPSPIN		Version 2.1
$$ ##JCAMPDX= 5.01
$$ ##ORIGIN= Bruker BioSpin GmbH
$$ ##OWNER= Administrator
$$ $$ E:\/data/COFFEE/nmr/UV1210_M4_1332-1205_7185290_ikKj0LbaFJ/12/pdata/1/auditp.txt
$$ ##AUDIT TRAIL=  $$ (NUMBER, WHEN, WHO, WHERE, PROCESS, VERSION, WHAT)
(   1,<2012-12-06 02:36:38.803 -0500>,<Administrator>,<X>,<go>,<TOPSPIN 2.1>,
      <created by zg
	started at 2012-12-06 02:25:08.552 -0500,
	POWCHK enabled, PULCHK disabled,
       configuration hash MD5:
       86 BA 57 50 F2 9D 5C 9B 26 00 A9 28 5F 66 2E 89
       data hash MD5: 64K
       A5 7F 2E F3 AF 4C 04 F0 61 52 9E E9 C6 54 84 0A>)
(   2,<2012-12-06 02:36:41.928 -0500>,<Administrator>,<X>,<proc1d>,<TOPSPIN 2.1>,
      <Start of raw data processing
       efp LB = 0.3 FT_mod = 6 PKNL = 1 PHC0 = 0 PHC1 = 0 SI = 128K 
       data hash MD5: 128K
       95 C4 2B AA 25 60 CD 6A 31 AA 10 51 C8 50 81 CB>)
(   3,<2012-12-06 02:36:43.007 -0500>,<Administrator>,<X>,<proc1d>,<TOPSPIN 2.1>,
      <pk PHC0 = -75.14099 PHC1 = 0 
       data hash MD5: 128K
       28 DC 15 F8 32 6C FB 5D 7F A2 B7 6D E9 A9 35 37>)
(   4,<2012-12-06 02:36:43.694 -0500>,<Administrator>,<X>,<proc1d>,<TOPSPIN 2.1>,
      <abs ABSG = 1 
       data hash MD5: 128K
       B1 EE 5B E3 DF CB 06 68 9E CA D3 F7 80 53 1B 8D>)
(   5,<2012-12-06 02:36:43.882 -0500>,<Administrator>,<X>,<proc1d>,<TOPSPIN 2.1>,
      <abs ABSG = 2 
       data hash MD5: 128K
       8A D6 00 21 3D 5C 84 8B 5D 8B A3 52 8B 2E 83 4F>)
(   6,<2012-12-06 02:36:44.053 -0500>,<Administrator>,<X>,<proc1d>,<TOPSPIN 2.1>,
      <abs ABSG = 3 
       data hash MD5: 128K
       8D 5B DB 49 A0 73 CB 7D 09 4A 2B 20 1A 32 89 A5>)
(   7,<2012-12-06 02:36:44.257 -0500>,<Administrator>,<X>,<proc1d>,<TOPSPIN 2.1>,
      <abs ABSG = 4 
       data hash MD5: 128K
       D5 AE 35 49 F2 03 C0 C8 07 38 D4 7F 9F 5B E8 81>)
(   8,<2012-12-06 02:36:44.444 -0500>,<Administrator>,<X>,<proc1d>,<TOPSPIN 2.1>,
      <abs ABSG = 5 
       data hash MD5: 128K
       EB 16 CA EB 1E CD CE 70 8E 0C CD B3 7F F1 11 F5>)
$$ ##END=
$$ 
$$ $$ hash MD5
$$ $$ AB C5 15 BC 1E 4F 42 A2 DB 99 00 A3 45 DD E0 98
##$RELAX= 
##$RELAX= 
##$RELAX= 
##$RELAX= 
##$RELAX= 
##$RELAX= 
##$RELAX= 
##$RELAX= 
$$ Bruker specific parameters
$$ --------------------------
##$DU= <E:\>
##$EXPNO= 12
$$ [...]
##$TP07= 0
##$TPNAME0= <>
##$TPNAME1= <>
##$TPNAME2= <>
##$TPNAME3= <>
##$TPNAME4= <>
##$TPNAME5= <>
##$TPNAME6= <>
##$TPNAME7= <>
##$TPOAL= (0..7)
0.5 0.5 0.5 0.5 0.5 0.5 0.5 0.5
##$TPOFFS= (0..7)
0 0 0 0 0 0 0 0
##$TUNHIN= 0
##$TUNHOUT= 0
##$TUNXOUT= 0
##$USERA1= <user>
##$USERA2= <user>
##$USERA3= <user>
##$USERA4= <user>
##$USERA5= <user>
##$V9= 5
##$VALIST= <valist>
##$VCLIST= <CCCCCCCCCCCCCCC>
##$VD= 0
##$VDLIST= <DDDDDDDDDDDDDDD>
##$VPLIST= <PPPPPPPPPPPPPPP>
##$VTLIST= <TTTTTTTTTTTTTTT>
##$WBST= 1024
##$WBSW= 4
##$XGAIN= (0..3)
0 0 0 0
##$XL= 0
##$YL= 0
##$YMAX_a= 5846271
##$YMIN_a= -11796172
##$ZGOPTNS= <>
##$ZL1= 120
##$ZL2= 120
##$ZL3= 120
##$ZL4= 120
##$ABSF1= 14.96095
##$ABSF2= -5.597232
##$ABSG= 5
##$ABSL= 3
##$ALPHA= 0
##$AQORDER= 0
##$ASSFAC= 0
##$ASSFACI= 0
##$ASSFACX= 0
##$ASSWID= 0
##$AUNMP= <proc_prof1d_extract.lims>
##$AXLEFT= 0
##$AXNAME= <>
##$AXNUC= <1H>
##$AXRIGHT= 0
##$AXTYPE= 0
##$AXUNIT= <>
##$AZFE= 0.1
##$AZFW= 0.1
##$BCFW= 0
##$BC_mod= 0
##$BYTORDP= 0
##$COROFFS= 0
##$CY= 15
##$DATMOD= 1
##$DC= 0
##$DFILT= <>
##$DTYPP= 0
##$F1P= 0
##$F2P= 0
##$FCOR= 0.5
##$FTSIZE= 131072
##$FT_mod= 6
##$GAMMA= 0
##$GB= 0
##$INTBC= 1
##$INTSCL= 1
##$ISEN= 128
##$LB= 0.3
##$LEV0= 0
##$LPBIN= 0
##$MAXI= 10000
##$MC2= 0
##$MEAN= 0
##$ME_mod= 0
##$MI= 0
##$NCOEF= 0
##$NC_proc= -2
##$NLEV= 6
##$NOISF1= 0
##$NOISF2= 0
##$NSP= 0
##$NTH_PI= 0
##$NZP= 0
##$OFFSET= 14.96095
##$PC= 1
##$PHC0= -75.14099
##$PHC1= 0
##$PH_mod= 1
##$PKNL= yes
##$PPARMOD= 0
##$PPDIAG= 0
##$PPIPTYP= 0
##$PPMPNUM= 2147483647
##$PPRESOL= 1
##$PSCAL= 4
##$PSIGN= 0
##$PYNMP= <proc.py>
##$REVERSE= no
##$SF= 400.020009656341
##$SI= 131072
##$SIGF1= 0
##$SIGF2= 0
##$SINO= 400
##$SIOLD= 131072
##$SPECTYP= <>
##$SREGLST= <1H.CDCl3>
##$SSB= 0
##$STSI= 131072
##$STSR= 0
##$SW_p= 8223.68421052631
##$SYMM= 0
##$S_DEV= 0
##$TDeff= 65536
##$TDoff= 0
##$TI= <>
##$TILT= no
##$TM1= 0
##$TM2= 0
##$TOPLEV= 0
##$USERP1= <user>
##$USERP2= <user>
##$USERP3= <user>
##$USERP4= <user>
##$USERP5= <user>
##$WDW= 1
##$XDIM= 131072
##$YMAX_p= 404997211
##$YMIN_p= -14909
##$CURPLOT= <Network HP LaserJet P1505>
##$CURPRIN= <$Network HP LaserJet P1505>
##$DFORMAT= <normdp>
##$LAYOUT= <+/1D_H.xwp>
##$LFORMAT= <normlp>
##$PFORMAT= <normpl>
##$SURQMSG= 1
$$ End of Bruker specific parameters
$$ ---------------------------------
##NTUPLES= NMR SPECTRUM
##VAR_NAME=  FREQUENCY,     SPECTRUM/REAL,   SPECTRUM/IMAG
##SYMBOL=    X,             R,               I
##VAR_TYPE=  INDEPENDENT,   DEPENDENT,       DEPENDENT
##VAR_FORM=  AFFN,          ASDF,            ASDF
##VAR_DIM=   131072,        131072,          131072
##UNITS=     HZ,            ARBITRARY UNITS, ARBITRARY UNITS
##FACTOR=    0.0627417313425164, 1,          1
##FIRST=     8223.62146879497, -1813,        -50651
##LAST=      0,             -107,            -52008
##MIN=       0,             -14909,          0
##MAX=       8223.62146879497, 404997211,    0
$$ Real data points
##PAGE= N=1
##DATA TABLE= (X++(R..R)), XYDATA
$$ [...]
$$ plain form
63951 624368 660295 702439 751629 808481 873388 946662 1029037 1121775 1225967 1341810 1468712
63940 1468712 1605829 1752339 1907515 2070712 2240846 2415620 2591616 2765374 2933835
63931 2933835 3093422 3239513 3367691 3475153 3560276 3621315 3656544 3665435 3648612 3606510 3538926
63920 3538926 3446141 3329880 3193148 3039918 2875163 2704227 2531409 2359334 2189859 2025146
63910 2025146 1867567 1718989 1580512 1452657 1335558 1229231 1133828 1049485 975856 912120
63900 912120 857445 811075 771932 738656 710200 685986 665420 647805 632935 621105 612145 604939
63888 604939 598362 592212 586683 581352 575418 568696 561643 554427 546783 539043 532687 529337 529511 532755
63874 532755 538767 547788 559808 573969 589273 605727 624290 645687 669746 695973 724164 753989
$$ packed form
63951F24368L5927M2144M9190N6852O4907P3274Q2375R2738J04192J15843J26902
63940A468712J37117J46510J55176J63197J70134J74774J75996J73758J68461
63931B933835J59587J46091J28178J07462Q5123O1039L5229Q891j6823m2102o7584
63920C538926r2785j16261j36732j53230j64755j70936j72818j72075j69475j64713
63910B025146j57579j48578j38477j27855j17099j06327r5403q4343p3629o3736
63900I12120n4675m6370l9143l3276k8456k4214k0566j7615j4870j1830q960p206
63888F04939o577o150n529n331n934o722p053p216p644p740o356l350J74L244
63874E32755O012R021J2020J4161J5304J6454J8563K1397K4059K6227K8191K9825
$$ plain form
63862 753989 784440 814409 843655 872614 901266 928850 954711 978742 1000735 1019896 1035462
63851 1035462 1047415 1056134 1061590 1063286 1060794 1054021 1042983 1027606 1007836 983831 956107 925479
63839 925479 892808 858780 824046 789324 755031 720965 686811 652989 620473 589693 560242
63828 560242 531944 505586 482021 460920 441063 421767 403555 387337 373255 360488 348068
63817 348068 335835 324536 314923 306881 299646 292714 286124 279949 274154 269057 265240 262618 260093 256624
63803 256624 252265 247786 243671 239967 236731 234023 231644 229361 227295 225629 224071 222041 219281 215973
63789 215973 212444 209125 206556 204992 204098 203393 202767 202198 201389 200230 199305 199203 199489 199117 197800 196243
63773 196243 195006 193974 193034 192429 192117 191621 191007 191226 192782 194621 195166 194258 193273 193361 194274 195127 195655 196225
$$ packed form
63862G53989L0451K9969K9246K8959K8652K7584K5861K4031K1993J9161J5566
63851A035462J1953Q719N456J696k492o773j1038j5377j9770k4005k7724l0628
63839I25479l2671l4028l4734l4722l4293l4066l4154l3822l2516l0780k9451
63828E60242k8298k6358k3565k1101j9857j9296j8212j6218j4082j2767j2420
63817C48068j2233j1299r613q042p235o932o590o175n795n097l817k622k525l469
63803B56624m359m479m115l704l236k708k379k283k066j666j558k030k760l308
63789B15973l529l319k569j564q94p05o26n69q09j159r25j02K86l72j317j557
63773A96243j237j032r40o05l12m96o14K19J556J839N45r08r85Q8R13Q53N28N70
$$ plain form
63755 196225 196931 197278 196863 196017 195446 195387 195414 195088 194472 193830 193130 192186 191167 190609 190874 191868 193293 194999
63737 194999 197077 199799 203419 207762 212033 215319 217376 218769 220236 222075 224148 226238 228325 230637
63723 230637 233432 236681 240113 243731 248007 253244 258920 264067 268209 271551 274350 276594 278284 279442
63709 279442 279720 278490 275570 271535 267188 263098 259729 257427 255980 254584 252708 250708 249336 248912 249293
63694 249293 250305 251810 253546 255310 257251 259687 262670 265896 268980 271667 273950 276073 278268 280350
63680 280350 281848 282670 283345 284387 285723 286993 288061 288874 289118 288541 287538 286992 287505 289033 291164 293448
63664 293448 295541 297347 299027 300592 301578 301404 300017 297913 295593 293204 290591 287352 282935 277132 270574
63649 270574 264441 259592 256147 253830 252325 251210 249966 248321 246471 244814 243607 242966 243041 244057 246183
$$ packed form
63755A96225P06L47m15q46n71n9K7l26o16o42p00r44j019n58K65R94J425J706
63737A94999K078K722L620M343M271L286K057J393J467J839K073K090K087K312
63723B30637K795L249L432L618M276N237N676N147M142L342K799K244J690J158
63709B79442K78j230k920m035m347m090l369k302j447j396j876k000j372m24L81
63694B49293J012J505J736J764J941K436K983L226L084K687K283K123K195K082
63680B80350J498Q22O75J042J336J270J068Q13K44n77j003n46N13J528K131K284
63664B93448K093J806J680J565R86j74j387k104k320k389k613l239m417n803o558
63649B70574o133m849l445k317j505j115j244j645j850j657j207o41P5J016K126
$$ plain form
63634 246183 249414 253532 258187 263072 267985 272790 277479 282339 287801 293925 300334 306873 314028 322279
63620 322279 331320 340508 349979 360709 373391 387814 403534 420539 438996 458755 479549 501452
63608 501452 524837 549982 576903 605297 634455 663390 691196 717043 739749 757818 770194
63597 770194 776769 777983 774442 767329 758640 750191 742379 734459 725903 716862 707188 695801 681539 664333
63583 664333 645140 624915 604033 582659 561241 540475 520952 503036 487043 473311 461962
63572 461962 452684 445012 438885 434747 432953 433227 434863 437339 440598 444892 450588 457963 466864 476577
63558 476577 486378 496238 506737 518265 530653 543717 557853 573868 592423 613811 638010 664756
63546 664756 693788 725406 760562 799731 841194 880623 912849 934457 944985 945972 939315 926740
$$ packed form
63634B46183L231M118M655M885M913M805M689M860N462O124O409O539P155Q251
63620C22279R041R188R471J0730J2682J4423J5720J7005J8457J9759K0794K1903
63608E01452K3385K5145K6921K8394K9158K8935K7806K5847K2706J8069J2376
63597G70194O575J214l541p113q689q449p812p920q556r041r674j1387j4262j7206
63583F64333j9193k0225k0882k1374k1418k0766j9523j7916j5993j3732j1349
63572D61962r278p672o127m138j794K74J636K476L259M294N696P375Q901R713
63558D76577R801R860J0499J1528J2388J3064J4136J6015J8555K1388K4199K6746
63546F64756K9032L1618L5156L9169M1463L9429L2226K1608J0528R87o657j2575
$$ plain form
63534 926740 910398 893135 877530 864681 854181 845212 837300 829970 822094 812012 798353 780617
63522 780617 759080 734340 707041 677928 647923 617965 588731 560640 534166 509919 488188
63511 488188 468579 450457 433717 418783 405845 394514 384348 375324 367533 360782 354801 349628
63499 349628 345413 342065 339403 337464 336243 335276 333895 331893 329564 327132 324632 322319 320667 319727 319010
63484 319010 318288 318113 319174 321386 324064 326760 329521 332372 335076 337521 339968 342722 345703 348548 350956
63469 350956 352769 353756 353528 351799 348708 344806 340612 336218 331463 326516 322059 318649 316003 313223 309800
63454 309800 306221 303507 302299 302464 303402 304609 306044 308152 311528 316506 323053 331035 340385 350940
63440 350940 362380 374612 388152 403780 421888 442491 465962 493232 524796 559459 594289
$$ packed form
63534I26740j6342j7263j5605j2849j0500q969p912p330p876j0082j3659j7736
63522G80617k1537k4740k7299k9113l0005k9958k9234k8091k6474k4247k1731
63511D88188j9609j8122j6740j4934j2938j1331j0166r024p791o751n981n173
63499C49628m215l348k662j939j221r67j381k002k329k432k500k313j652r40p17
63484C19010p22j75J061K212K678K696K761K851K704K445K447K754K981K845K408
63469C50956J813R87k28j729l091l902m194m394m755m947m457l410k646k780l423
63454C09800l579k714j208J65R38J207J435K108L376M978O547P982R350J0555
63440C50940J1440J2232J3540J5628J8108K0603K3471K7270L1564L4663L4830
$$ plain form
63429 594289 625782 651153 669010 679497 684065 684775 683521 681824 681192 683320 689638 700736 716358
63416 716358 735991 759414 786670 817428 850381 883430 914542 942253 965258 981970 991145 992897
63404 992897 988595 979783 967766 954225 941175 929635 918761 906853 892828 876227 856348 832432
63392 832432 804686 774379 742851 711000 679637 649589 621233 594588 570057 548442 529941
63381 529941 513730 499039 486143 475844 468331 463020 459265 456784 455558 455760 457690 461504 467050
63368 467050 474175 482970 493503 505538 518786 533263 549205 566896 586785 609351 634395 660855
63356 660855 687884 715941 746157 778704 812399 845902 878511 909400 936674 957929 971812
63345 971812 978732 980050 976839 969595 958988 946486 933796 921613 909222 895534 880217 863495
$$ packed form
63429E94289L1493K5371J7857J0487M568P10j254j697o32K128O318J1098J5622
63416G16358J9633K3423K7256L0758L2953L3049L1112K7711K3005J6712R175J752
63404I92897m302q812j2017j3541j3050j1540j0874j1908j4025j6601j9879k3916
63392H32432k7746l0307l1528l1851l1363l0048k8356k6645k4531k1615j8501
63381E29941j6211j4691j2896j0299p513n311l755k481j226K02J930L814N546
63368D67050P125Q795J0533J2035J3248J4477J5942J7691J9889K2566K5044K6460
63356F60855K7029K8057L0216L2547L3695L3503L2609L0889K7274K1255J3883
63345I71812O920J318l211p244j0607j2502j2690j2183j2391j3688j5317j6722
$$ plain form
63333 863495 845090 823953 799224 771224 741478 711930 684073 658437 634772 612865 593231
63322 593231 576909 564672 556686 552775 552434 554264 555662 553587 545916 532336 514212 493738 472969
63309 472969 453290 435440 419754 406225 394403 383542 373075 363075 354259 347398 342528 338706
63297 338706 334749 330282 325859 322069 318863 315813 312624 309113 305134 300923 297174 294300 291856 289160
63283 289160 286264 283796 282056 280850 280090 279891 280054 280090 279850 279590 279305 278559 277129 275399 273959 273208 273363
63266 273363 274366 275718 276931 278135 279668 281083 281393 280520 279697 280034 281391 283104 285030 287311 289801
63251 289801 292464 295783 300058 304748 309274 314053 319884 326591 333193 339305 345531 352429 359873 367640
63237 367640 375998 385513 396663 409707 424476 440224 456142 472123 488628 505820 523266 540510
$$ packed form
63333H63495j8405k1137k4729k8000k9746k9548k7857k5636k3665k1907j9634
63322E93231j6322j2237p986l911l41J830J398k075p671j3580j8124k0474k0769
63309D72969j9679j7850j5686j3529j1822j0861j0467j0000q816o861m870l822
63297C38706l957m467m423l790l206l050l189l511l979m211l749k874k444k696
63283B89160k896k468j740j206p60j99J63L6k40k60k85p46j430j730j440p51J55
63266B73363J003J352J213J204J533J415L10q73q23L37J357J713J926K281K490
63251B89801K663L319M275M690M526M779N831O707O602O112O226O898P444P767
63237C67640Q358R515J1150J3044J4769J5748J5918J5981J6505J7192J7446J7244
$$ plain form
63225 540510 557465 574128 590331 605899 620769 634994 648956 663428 678844 694510 709177
63214 709177 722497 735284 748126 760356 770738 778617 783908 786345 785257 780038 770575 757398 741475
63201 741475 723632 704035 682638 660281 638811 619729 603091 588174 574837 563651 554996 548742
63189 548742 544814 543460 544755 548309 553699 560812 569530 579371 589841 601056 613649 627986 643649
63176 643649 659810 675947 691964 707726 722830 737039 750675 764232 777598 789915 800244
63165 800244 808158 813619 816567 816737 813718 807094 796692 782756 765762 746001 723584 698958 673148
63152 673148 647301 622095 597722 574209 551597 529938 509393 490310 473122 458206 445826
63141 445826 435941 427909 420706 413792 407654 403137 400234 397819 394662 390508 386112 382462 380095 379015
$$ packed form
63225E40510J6955J6663J6203J5568J4870J4225J3962J4472J5416J5666J4667
63214G09177J3320J2787J2842J2230J0382P879N291K437j088n219r463j3177j5923
63201G41475j7843j9597k1397k2357k1470j9082j6638j4917j3337j1186q655o254
63189E48742l928j354J295L554N390P113Q718R841J0470J1215J2593J4337J5663
63176F43649J6161J6137J6017J5762J5104J4209J3636J3557J3366J2317J0329
63165H00244P914N461K948J70l019o624j0402j3936j6994j9761k2417k4626k5810
63152F73148k5847k5206k4373k3513k2612k1659k0545j9083j7188j4916j2380
63141D45826r885q032p203o914o138m517k903k415l157m154m396l650k367j080
$$ plain form
63127 379015 378909 379387 380162 381238 382927 385456 388495 391295 393556 395923 399243 403421 407469 410762 413727
63112 413727 417123 421102 425324 429576 433728 437363 440091 442187 444418 447116 449892 452384 454889 458025
63098 458025 462000 466455 470808 474570 477513 479800 481901 484156 486441 488347 489620 490269 490324 489771 488861
63083 488861 488252 488453 489112 489156 487959 486241 485465 486323 488115 489774 491126 492789 495084 497616 500068 503004
63067 503004 507499 514023 521920 530093 538088 546481 556298 568226 582409 598764 617229 637713 660080
63054 660080 684256 710238 737987 767548 799310 833791 870950 909906 949611 989651 1030182
63043 1030182 1071283 1112666 1153914 1194630 1234447 1273219 1311257 1349067 1386775 1424001 1460312
63032 1460312 1495579 1529828 1562883 1594107 1622235 1645526 1662352 1671791 1673520 1667271 1652702 1629816
$$ packed form
63127C79015j06M78P75J076J689K529L039K800K261K367L320M178M048L293K965
63112D13727L396L979M222M252M152L635K728K096K231K698K776K492K505L136
63098D58025L975M455M353L762K943K287K101K255K285J906J273O49N5n53r10
63083D88861o09K01O59M4j197j718p76Q58J792J659J352J663K295K532K452K936
63067E03004M495O524P897Q173P995Q393R817J1928J4183J6355J8465K0484K2367
63054F60080K4176K5982K7749K9561L1762L4481L7159L8956L9705M0040M0531
63043A030182M1101M1383M1248M0716L9817L8772L8038L7810L7708L7226L6311
63032A460312L5267L4249L3055L1224K8128K3291J6826R439J729o249j4569k2886
$$ plain form
63020 1629816 1599213 1561845 1518786 1471245 1420530 1367955 1315073 1263953 1216672 1174222 1136232
63009 1136232 1102038 1071854 1046748 1027778 1015349 1009119 1008306 1012236 1020798 1034072 1051485 1071779
62997 1071779 1094084 1118453 1144885 1172369 1199587 1226217 1252721 1279065 1304592 1329190 1353553
62986 1353553 1377834 1400854 1421184 1438441 1452793 1463586 1469279 1468708 1461807 1448944 1430083 1404841
62974 1404841 1373111 1335426 1292844 1246659 1198192 1148718 1099453 1051448 1005434 961808 920809
62963 920809 882559 846907 813488 782157 753248 727210 704063 683400 664791 647944 632477
62952 632477 617850 603621 589634 575948 562743 550276 538722 527888 517222 506215 494802
62941 494802 483353 472378 462301 453408 445847 439565 434243 429379 424598 419913 415590 411708 408003
$$ packed form
63020A629816l0603l7368m3059m7541n0715n2575n2882n1120m7281m2450l7990
63009A136232l4194l0184k5106j8970j2429o230q13L930Q562J3274J7413K0294
62997A071779K2305K4369K6432K7484K7218K6630K6504K6344K5527K4598K4363
62986A353553K4281K3020K0330J7257J4352J0793N693n71o901j2863j8861k5242
62974A404841l1730l7685m2582m6185m8467m9474m9265m8005m6014m3626m0999
62963I20809l8250l5652l3419l1331k8909k6038k3147k0663j8609j6847j5467
62952F32477j4627j4229j3987j3686j3205j2467j1554j0834j0666j1007j1413
62941D94802j1449j0975j0077q893p561o282n322m864m781m685m323l882l705
$$ plain form
62928 408003 404214 400410 396864 393748 391156 389197 387801 386621 385444 384612 384580 385094 385271 384630 383609 382808
62912 382808 382171 381234 379897 378486 377253 376215 375445 375066 374895 374424 373396 372273 371920 372784 374388 375742
62896 375742 376355 376776 377897 379813 381800 383566 385982 389982 395049 399399 401730 402240 401870 401111 399868
62881 399868 398108 396166 394490 393296 392452 391588 390387 388856 387263 385813 384518 383336 382249 381165 379969
62866 379969 378707 377529 376417 375199 373800 372211 370249 367775 365215 363353 362381 361688 360890 360514 361126
62851 361126 362228 362727 362314 361636 361188 360764 360156 359688 359730 360195 360845 361672 362595 363100 362628 361247 359595 358209
62833 358209 357156 356261 355506 355153 355535 356658 358035 359089 359711 360237 360910 361698 362721 364387 366853 369673
62817 369673 372313 374727 377084 379303 381317 383537 386439 389798 392956 395847 399131 403133 407289 410969
$$ packed form
62928D08003l789l804l546l116k592j959j396j180j177q32l2N14J77o41j021q01
62912C82808o37r37j337j411j233j038p70l79j71m71j028j123l53Q64J604J354
62896C75742O13M21J121J916J987J766K416M000N067M350K331N10l70p59j243
62881C99868j760j942j676j194q44q64j201j531j593j450j295j182j087j084j196
62866C79969j262j178j112j218j399j589j962k474k560j862r72o93p98l76O12
62851C61126J102M99m13o78m48m24o08m68M2M65O50Q27R23N05m72j381j652j386
62833C58209j053q95p55l53L82J123J377J054O22N26O73P88J023J666K466K820
62817C69673K640K414K357K219K014K220K902L359L158K891L284M002M156L680
$$ plain form
62803 410969 414408 418406 423457 429599 436866 445357 454885 464961 475128 485139 494906 504605 514845
62790 514845 526467 540123 556150 574727 595864 619353 645111 673648 705839 742095 782083
62779 782083 825447 872468 923744 979386 1038890 1101626 1167005 1234034 1301053 1366090 1427381
62768 1427381 1483439 1532862 1574289 1606500 1628372 1638864 1637388 1624313 1600896 1568499 1528012
62757 1528012 1480175 1426211 1367794 1306400 1243121 1179221 1116376 1055972 998370 943321 890991
62746 890991 842163 797383 756383 718516 683478 651428 622661 597337 575272 555802 538088
62735 538088 521811 507351 495062 484641 475501 467524 460978 455836 451637 448031 444996 442538 440717
62722 440717 440018 441100 443813 446977 449574 451867 454909 459269 464754 471194 478800 487751 498026 509851
$$ packed form
62803D10969L439L998N051O142P267Q491R528J0076J0167J0011R767R699J0240
62790E14845J1622J3656J6027J8577K1137K3489K5758K8537L2191L6256L9988
62779G82083M3364M7021N1276N5642N9504O2736O5379O7029O7019O5037O1291
62768A427381N6058M9423M1427L2211K1872J0492j476j3075k3417l2397m0487
62757A528012m7837n3964n8417o1394o3279o3900o2845o0404n7602n5049n2330
62746H90991m8828m4780m1000l7867l5038l2050k8767k5324k2065j9470j7714
62735E38088j6277j4460j2289j0421r140p977o546n142m199l606l035k458j821
62722D40717o99J082K713L164K597K293L042M360N485O440P606Q951J0275J1825
$$ plain form
62708 509851 523793 540066 558135 577439 598362 622122 649714 681204 715950 753226 792671
62697 792671 834458 879221 927587 979535 1034165 1090185 1146693 1203429 1260156 1315709 1367721
62686 1367721 1413423 1450843 1479168 1498083 1507068 1505586 1493654 1471810 1440543 1400266 1352064 1298067
62674 1298067 1240661 1181463 1121377 1061416 1002904 946811 893458 843191 796918 755463 718569
62663 718569 685054 653990 625284 599095 575157 553063 532897 515151 500081 487389 476506
62652 476506 466895 458085 449627 441203 432744 424470 416864 410436 405305 401010 396980 393166 389998 387705
62638 387705 385969 384392 383033 382230 382025 382022 381767 381068 379908 378297 376330 374359 372944 372480 372750 372908 372134
62621 372134 370393 368461 367106 366437 366204 366511 367878 370526 373892 377007 379296 380993 382893 385735 389740
$$ packed form
62708E09851J3942J6273J8069J9304K0923K3760K7592L1490L4746L7276L9445
62697G92671M1787M4763M8366N1948N4630N6020N6508N6736N6727N5553N2012
62686A367721M5702L7420K8325J8915Q985j482j1932k1844l1267m0277m8202n3997
62674A298067n7406n9198o0086n9961n8512n6093n3353n0267m6273m1455l6894
62663G18569l3515l1064k8706k6189k3938k2094k0166j7746j5070j2692j0883
62652D76506r611q810q458q424q459q274p606o428n131m295m030l814l168k293
62638C87705j736j577j359q03k05lk55o99j160j611j967j971j415m64K70J58p74
62621C72134j741j932j355o69k33L07J367K648L366L115K289J697J900K842M005
$$ plain form
62606 389740 394711 400561 407583 416035 425588 435596 445968 457439 470784 486065 502961 521584
62594 521584 542495 565928 591450 618582 647402 678203 710624 743372 774848 803895 829899
62583 829899 852331 870382 883131 890003 891021 886621 877321 863567 845743 824130 798946 770694
62571 770694 740512 709941 680104 651258 623301 596572 571832 549492 529222 510436 492900
62560 492900 476684 461775 448020 435328 423742 413409 404719 398158 393597 389859 385598 380768 376665
62547 376665 374242 372860 371159 368783 366611 365455 365192 365244 365383 365822 366847 368558 370680 372531 373484 373690
62531 373690 374037 375206 377018 378929 380923 383584 387467 392684 399033 406296 414473 423897 435081 448313
62517 448313 463524 480630 499790 521125 544432 569530 596735 626536 658766 692414 726343
$$ packed form
62606C89740M971N850P022Q452R553J0008J0372J1471J3345J5281J6896J8623
62594E21584K0911K3433K5522K7132K8820L0801L2421L2748L1476K9047K6004
62583H29899K2432J8051J2749O872J018m400r300j3754j7824k1613k5184k8252
62571G70694l0182l0571k9837k8846k7957k6729k4740k2340k0270j8786j7536
62560D92900j6216j4909j3755j2692j1586j0333q690o561m561l738m261m830m103
62547C76665k423j382j701k376k172j156k63N2J39M39J025J711K122J851R53K06
62531C73690L47J169J812J911J994K661L883N217O349P263Q177R424J1184J3232
62517D48313J5211J7106J9160K1335K3307K5098K7205K9801L2230L3648L3929
$$ plain form
62506 726343 759963 793031 824974 854576 880383 901370 917176 927628 932209 930361 922414 909823
62494 909823 894190 876293 856379 835062 813454 792559 773131 756062 742344 732421 726038 723008
62482 723008 723743 728666 737231 747912 759368 771598 785792 802819 821830 840543 856849 869737
62470 869737 878690 883061 882680 878354 870772 859226 842444 820523 794976 766895 736343 703862 671265
62457 671265 640147 610507 581685 553852 527759 503675 481612 462209 446359 434047 424280 416092
62445 416092 409064 403127 398532 395811 395073 395479 396039 396741 398257 400759 403768 406943 410163 412836 414034
62430 414034 413557 412227 410953 409984 408995 407247 403705 397806 390320 382840 376346 370793 365938 361632 357232
62415 357232 351859 345701 340216 336509 334219 332451 330999 330028 329272 328388 327626 327390 327414 327051 326152 325140
$$ packed form
62506G26343L3620L3068L1943K9602K5807K0987J5806J0452M581j848p947j2591
62494I09823j5633j7897j9914k1317k1608k0895j9428j7069j3718r923o383l030
62482G23008P35M923Q565J0681J1456J2230J4194J7027J9011J8713J6306J2888
62470H69737Q953M371l81m326p582j1546j6782k1921k5547k8081l0552l2481l2597
62457F71265l1118k9640k8822k7833k6093k4084k2063j9403j5850j2312r767q188
62445D16092p028n937m595k721p38M06N60P02J516K502L009L175L220K673J198
62430D14034m77j330j274r69r89j748l542n899p486p480o494n553m855m306m400
62415C57232n373o158n485l707k290j768j452r71p56q84p62k36K4l63q99j012
$$ plain form
62399 325140 324411 324135 324376 324978 325529 325893 326527 327948 330190 333116 336735 340727 344178 346502 348303 350656
62383 350656 353825 357407 361428 366403 372406 378942 385774 393041 400464 407304 413515 420255 428781 439174
62369 439174 450533 462094 473818 486142 499547 514388 531006 549945 571895 597211 625679
62358 625679 657061 691809 730707 773804 820102 868464 918345 969372 1020490 1069869 1115544
62347 1115544 1155967 1190013 1216705 1235098 1244677 1245928 1240201 1228606 1211188 1187533 1158071 1124261
62335 1124261 1087485 1048363 1007384 965724 924981 886315 850169 816760 786492 759794 736639
62324 736639 716340 697918 680743 664685 649628 635151 620911 606933 593064 578449 562341
62313 562341 545378 529279 514978 501741 488507 475480 463791 453993 445538 437657 430206 423615
$$ packed form
62399C25140p29k76K41O02N51L64O34J421K242K926L619L992L451K324J801K353
62383C50656L169L582M021M975O003O536O832P267P423O840O211O740Q526J0393
62369D39174J1359J1561J1724J2324J3405J4841J6618J8939K1950K5316K8468
62358F25679L1382L4748L8898M3097M6298M8362M9881N1027N1118M9379M5675
62347A115544M0423L4046K6692J8393R579J251n727j1595j7418k3655k9462l3810
62335A124261l6776l9122m0979m1660m0743l8666l6146l3409l0268k6698k3155
62324G36639k0299j8422j7175j6058j5057j4477j4240j3978j3869j4615j6108
62313E62341j6963j6099j4301j3237j3234j3027j1689r798q455p881p451o591
$$ plain form
62301 423615 418421 414905 412901 411772 410725 409231 407254 405202 403660 402972 402960 403225 403756 404981 407073
62286 407073 409553 411827 413854 416010 418532 421499 425134 429681 434970 440494 445955 451430 456980 462463
62272 462463 467871 473551 479882 486908 494499 502744 512002 522678 535172 550027 567830 588784 612524
62259 612524 638647 667467 699999 737036 778362 823065 870478 920513 973001 1026986 1080736
62248 1080736 1132175 1179152 1219538 1251508 1273958 1286709 1290404 1286118 1274812 1256897 1232402 1201617
62236 1201617 1165369 1124521 1079457 1030500 978832 926634 876060 828209 783209 741090 702300
62225 702300 667444 636831 610398 587871 568762 552275 537484 523730 510877 499215 489215
62214 489215 481245 475206 470380 465921 461654 458158 455887 454479 453307 452484 452808 454780 458153 462591 468258
$$ packed form
62301D23615n194l516k004j129j047j494j977k052j542o88j2K65N31J225K092
62286D07073K480K274K027K156K522K967L635M547N289N524N461N475N550N483
62272D62463N408N680O331P026P591Q245R258J0676J2494J4855J7803K0954K3740
62259F12524K6123K8820L2532L7037M1326M4703M7413N0035N2488N3985N3750
62248A080736N1439M6977M0386L1970K2450J2751L695m286j1306j7915k4495l0785
62236A201617l6248m0848m5064m8957n1668n2198n0574m7851m5000m2119l8790
62225G02300l4856l0613k6433k2527j9109j6487j4791j3754j2853j1662j0000
62214D89215p970o039m826m459m267l496k271j408j172q23L24J972L373M438N667
$$ plain form
62199 468258 475435 483843 492776 501824 511142 521020 531437 542072 552653 563146 573636 584037 593985
62186 593985 603116 611436 619276 626802 633684 639399 643874 647714 651707 656012 659905 662420 663329 663407 663800
62171 663800 665311 668430 673751 681978 693523 708423 726751 748943 775597 806974 842628 881383
62159 881383 921622 961578 999356 1032808 1059919 1079628 1092119 1098137 1098314 1093323 1084078 1071081
62147 1071081 1053799 1031456 1004376 973911 941100 906265 870112 834366 800803 770172 742489
62136 742489 717853 696472 678310 663221 651199 642082 635275 630105 626241 623474 621501 620312 620426
62123 620426 622301 625787 630575 636817 644760 654080 664220 675161 687179 699787 711457 720447 725636
62110 725636 726850 725071 722276 720340 719707 719412 718343 716017 712214 706623 699216 690473 680879 670578
$$ packed form
62199D68258P177Q408Q933R048R318R878J0417J0635J0581J0493J0490J0401R948
62186E93985R131Q320P840P526O882N715M475L840L993M305L893K515R09P8L93
62171F63800J511L119N321Q227J1545J4900J8328K2192K6654L1377L5654L8755
62159H81383M0239L9956L7778L3452K7111J9709J2491O018J77m991r245j2997
62147A071081j7282k2343k7080l0465l2811l4835l6153l5746l3563l0631k7683
62136G42489k4636k1381j8162j5089j2022r117o807n170l864k767j973j189J14
62123F20426J875L486M788O242P943R320J0140J0941J2018J2608J1670Q990N189
62110G25636J214j779k795j936o33k95j069k326l803n591p407q743r594j0301
$$ plain form
62096 670578 659943 650194 642901 638833 637520 638010 639844 643262 648581 655575 663573 672076 681031 690446
62082 690446 700086 709839 720146 731645 744497 758409 773301 789563 807594 827447 849007 872232
62070 872232 897060 923200 950035 976590 1001864 1025576 1048584 1072195 1097025 1122833 1149288
62059 1149288 1176234 1203031 1228228 1250210 1267875 1280521 1287661 1289387 1286549 1280060 1270155 1256622
62047 1256622 1239450 1218750 1194244 1165478 1132650 1096761 1058827 1019377 978944 938612 899592
62036 899592 862328 826370 791267 757344 725559 696757 671137 648264 627373 607784 589369
62025 589369 572740 558701 547296 537490 527981 518285 508869 500262 492284 484199 475513 466498 457917
62012 457917 450262 443381 436953 431181 426613 423253 420396 417671 415808 415806 417597 420183 422970 426270 430393
$$ packed form
62096F70578j0635r749p293m068j313M90J834L418N319O994P998Q503Q955R415
62082F90446R640R753J0307J1499J2852J3912J4892J6262J8031J9853K1560K3225
62070H72232K4828K6140K6835K6555K5274K3712K3008K3611K4830K5808K6455
62059A149288K6946K6797K5197K1982J7665J2646P140J726k838o489r905j3533
62047A256622j7172k0700k4506k8766l2828l5889l7934l9450m0433m0332l9020
62036H99592l7264l5958l5103l3923l1785k8802k5620k2873k0891j9589j8415
62025E89369j6629j4039j1405r806r509r696r416q607p978q085q686r015q581
62012D57917p655o881o428n772m568l360k857k725j863kJ791K586K787L300M123
$$ plain form
61997 430393 434965 439486 443955 448451 452483 455308 456703 456953 456217 454331 451268 447451 443445 439468 435235
61982 435235 430183 423984 416994 410157 404317 399617 395667 392169 389195 386968 385580 384961 384919 385179 385458
61967 385458 385532 385268 384688 384097 383974 384504 385310 385884 386278 387104 388761 390909 392890 394471 395930 397522 399226
61950 399226 401124 403743 407764 413426 420423 428373 437166 446832 457314 468616 481096 495407 511991
61937 511991 530673 550787 571704 593162 614989 636598 657061 675908 693617 710934 727774
61926 727774 743266 756848 768749 779106 787236 792283 794211 793490 790083 783582 774433 764357 755162
61913 755162 747536 741245 736153 732759 731969 734616 740960 750341 761378 772831 784358 796389 809245
61900 809245 822323 833954 842071 845258 843399 837397 828271 816543 802308 785665 767070 747483
$$ packed form
61997D30393M572M521M469M496M032K825J395K50p36j886l063l817m006l977m233
61982D35235n052o199o990o837n840m700l950l498k974k227j388o19m2K60K79
61967C85458P4k64n80n91j23N30Q06N74L94Q26J657K148J981J581J459J592J704
61950C99226J898K619M021N662O997P950Q793R666J0482J1302J2480J4311J6584
61937E11991J8682K0114K0917K1458K1827K1609K0463J8847J7709J7317J6840
61926G27774J5492J3582J1901J0357Q130N047J928p21l407o501r149j0076r195
61913G55162p626o291n092l394p90K647O344R381J1037J1453J1527J2031J2856
61900H09245J3078J1631Q117L187j859o002r126j1728j4235j6643j8595j9587
$$ plain form
61888 747483 728102 709712 692292 675380 658769 642566 626716 610969 595416 580583 566753
61877 566753 553525 540355 527289 514929 503879 494503 487004 481304 476879 473044 469566 466855 465469
61864 465469 465555 466844 469162 472822 478409 486163 495718 506557 518629 532436 548620 567607 589473
61851 589473 613890 640304 668388 698219 729852 762908 796945 831935 867742 903226 936526
61840 936526 966410 992745 1015439 1033616 1046275 1053297 1055284 1052799 1046317 1036742 1025455 1013842
61828 1013842 1003085 994249 988183 985365 986132 990964 1000140 1013096 1028335 1044049 1058620 1070549 1078212
61815 1078212 1079977 1074731 1062359 1043636 1019498 990504 957194 920801 883045 845097 807180 769509
61803 769509 733238 700017 670757 645139 622222 601225 581829 564094 548165 534033 521558
$$ packed form
61888G47483j9381j8390j7420j6912j6611j6203j5850j5747j5553j4833j3830
61877E66753j3228j3170j3066j2360j1050r376p499n700m425l835l478k711j386
61864D65469Q6J289K318L660N587P754R555J0839J2072J3807J6184J8987K1866
61851E89473K4417K6414K8084K9831L1633L3056L4037L4990L5807L5484L3300
61840I36526K9884K6335K2694J8177J2659P022J987k485o482r575j1287j1613
61828A013842j0757q836o066k818P67M832R176J2956J5239J5714J4571J1929P663
61815A078212J765n246j2372j8723k4138k8994l3310l6393l7756l7948l7917l7671
61803G69509l6271l3221k9260k5618k2917k0997j9396j7735j5929j4132j2475
$$ plain form
61792 521558 510622 501033 492287 483878 475974 469358 464362 460216 455815 450907 446168 442315 439469 437270
61778 437270 435305 433473 432071 431310 430719 429431 427310 425325 424411 424353 424218 423523 422472 421421 420737 420932
61762 420932 422219 423975 425250 425821 426250 427016 428108 429391 430750 431891 432583 433163 434184 435476 436124 435556
61746 435556 434143 432592 431264 430275 429735 429534 429293 428816 428289 427822 427159 426053 424646 423304 422374 422271 423385
61729 423385 425610 428276 430865 433541 436701 440227 443491 446013 447862 449510 451448 453866 456560 459240
61715 459240 461929 464865 467941 470543 472149 472832 472982 472716 471808 470085 467642 464746 461689 458684 455742
61700 455742 452606 448934 444611 439920 435395 431445 428040 424813 421523 418320 415498 413155 411246 409746
61686 409746 408526 407229 405612 403878 402382 401098 399678 397918 395878 393686 391646 390302 389865 389654 388705
$$ packed form
61792E21558j0936r589q746q409p904o616m996m146m401m908m739l853k846k199
61778D37270j965j832j402p61n91j288k121j985r14n8j35o95j051j051o84J95
61762D20932J287J756J275N71M29P66J092J283J359J141O92N80J021J292O48n68
61746D35556j413j551j328r89n40k01k41m77n27m67o63j106j407j342r30j03J114
61729D23385K225K666K589K676L160L526L264K522J849J648J938K418K694K680
61715D59240K689K936L076K602J606O83J50k66r08j723k443k896l057l005k942
61700D55742l136l672m323m691m525l950l405l227l290l203k822k343j909j500
61686D09746j220j297j617j734j496j284j420j760k040k192k040j344m37k11r49
$$ plain form
61671 388705 386928 385110 383775 382701 381660 380875 380459 380067 379462 378846 378190 376861 374492 371796 369921 369249
61655 369249 369355 369832 370610 371595 372525 373222 373666 373963 374491 375832 378181 381064 384043 387424 391714 396596
61639 396596 401044 404480 407275 410003 412659 414784 415959 415983 414833 412643 409596 405806 401443 396961 392913
61624 392913 389482 386379 383317 380411 378012 376237 374768 373156 371339 369837 369261 369611 370244 370584 370616 370507
61608 370507 370039 368642 365847 361446 355486 348438 341178 334396 328115 322059 316357 311436 307322 303568
61594 303568 299916 296554 293577 290599 287180 283444 280123 278044 277538 278112 278703 278521 277762 277235 277306 277462
61578 277462 276961 275516 273243 270360 267239 264490 262593 261473 260642 259680 258466 257149 256150 256023 256887 257975
61562 257975 258115 256915 255260 254390 254598 255103 255165 254961 255166 256029 257236 258552 260086 261796 263165 263716 263626
$$ packed form
61671C88705j777j818j335j074j041p85m16l92o05o16o56j329k369k696j875o72
61655C69249J06M77P78R85R30O97M44K97N28J341K349K883K979L381M290M882
61639C96596M448L436K795K728K656K125J175K4j150k190l047l790m363m482m048
61624C92913l431l103l062k906k399j775j469j612j817j502n76L50O33L40L2j09
61608C70507m68j397k795m401n960p048p260o782o281o056n702m921m114l754
61594C03568l652l362k977k978l419l736l321k079n06N74N91j82p59n27P1J56
61578B77462n01j445k273k883l121k749j897j120q31r62j214j317r99j27Q64J088
61562B57975J40j200j655q70K08N05O2k04K05Q63J207J316J534J710J369N51r0
$$ plain form
61545 263626 263573 264087 265237 266772 268279 269402 270213 271277 273007 275051 276653 277532 278080 278758 279750 281172
61529 281172 283059 284994 286258 286600 286492 286351 285958 285007 283787 282742 281599 279629 276831 274234 272780
61514 272780 272355 272245 272178 272473 273257 274018 274092 273381 272397 271711 271459 271371 271126 270602 269861 269038 268309 267863 267770 267830
61494 267830 267613 266754 265261 263552 262177 261444 261269 261323 261386 261546 262048 262873 263511 263349 262370 261384 261429 262882
61476 262882 265221 267564 269314 270348 270881 271303 272013 273189 274660 276058 277072 277588 277711 277726 277965 278535
61460 278535 279182 279514 279327 278731 278058 277705 277952 278766 279800 280692 281385 282134 283214 284673 286265 287580 288317
61443 288317 288524 288560 288809 289528 290952 293257 296210 299136 301567 303818 306570 309940 313327 316216 318714
61428 318714 321139 323461 325408 326866 327841 328276 328282 328472 329676 332183 335483 338781 341632 344065 346395 348985
$$ packed form
61545B63626n3N14J150J535J507J123Q11J064J730K044J602Q79N48O78R92J422
61529B81172J887J935J264L42j08j41l93r51j220j045j143j970k798k597j454
61514B72780m25j10o7K95P84P61P4p11r84o86k52q8k45n24p41q23p29m46r3O0
61494B67830k17q59j493j709j375p33j75N4O3J60N02Q25O38j62r79r86M5J453
61476B62882K339K343J750J034N33M22P10J176J471J398J014N16J23J5K39N70
61460B78535O47L32j87n96o73l53K47Q14J034Q92O93P49J080J459J592J315P37
61443B88317K07L6K49P19J424K305K953K926K431K251K752L370L387K889K498
61428C18714K425K322J947J458R75M35OJ90J204K507L300L298K851K433K330K590
$$ plain form
61412 348985 351976 355044 357552 359131 359981 360476 360577 359912 358374 356361 354313 352227 349855 347247 344868
61397 344868 343094 341777 340456 338947 337542 336550 335792 334783 333385 332059 331295 330997 330644 329926 328962 327985
61381 327985 327184 326893 327473 328746 329890 330269 330203 330595 331866 333534 334764 335082 334683 334334 334907 336654 338921
61364 338921 340865 342376 343976 345952 348128 350447 353127 355999 358372 360007 361765 364734 369051 374107
61350 374107 379643 385960 393186 401040 409429 418569 428184 437105 444191 449495 454152 459232 464933 470725
61336 470725 475946 480231 483635 486443 488780 490451 491328 491777 492393 493172 493258 491783 488821 485231 481661 478108
61320 478108 474532 471424 469361 468227 467308 466224 465425 465669 467232 469694 472307 474478 476158 477943 480715
61305 480715 484990 490677 497533 505715 515637 527211 539321 550180 558329 563412 565989 566674 565616 562864
$$ packed form
61412C48985K991L068K508J579Q50M95J01o65j538k013k048k086k372k608k379
61397C44868j774j317j321j509j405r92p58j009j398j326p64k98l53p18r64r77
61381C27985q01k91N80J273J144L79o6L92J271J668J230L18l99l49N73J747K267
61364C38921J944J511J600J976K176K319K680K872K373J635J758K969M317N056
61350C74107N536O317P226P854Q389R140R615Q921P086N304M657N080N701N792
61336D70725N221M285L404K808K337J671Q77M49O16P79Q6j475k962l590l570l553
61320D78108l576l108k063j134r19j084p99K44J563K462K613K171J680J785K772
61305D80715M275N687O856Q182R922J1574J2110J0859Q149N083K577O85j058k752
$$ plain form
61291 562864 558910 554473 549807 544598 538615 532137 525625 519253 512947 506735 500856 495608 491148 487390
61277 487390 484106 481247 479116 478006 477733 477811 478119 479092 481198 484495 488708 493413 498122 502531 506772
61262 506772 511089 515304 519101 522869 527630 533900 541263 549387 558687 569338 580177 589463 596507 601897
61248 601897 606311 609839 612413 614182 615199 615259 614214 612158 609187 605258 600346 594571 588215 581851 576321
61233 576321 572244 569607 568020 567147 566592 565685 564019 562152 561253 561926 563764 566064 568601 571590 575206
61218 575206 579241 583081 586130 588433 590647 593136 595421 596980 598201 599906 602142 604157 605479 606259
61204 606259 606612 606509 606508 607709 610569 614389 618392 622742 628074 634555 641989 650493 660543 672453 686102
61189 686102 700924 715905 729865 742089 752539 761346 768412 773761 777880 781325 784190 786240 787377
$$ packed form
61291E62864l954m437m666n209n983o478o512o372o306o212n879n248m460l758
61277D87390l284k859k131j110k73P8L08R73K106L297M213M705M709M409M241
61262E06772M317M215L797L768M761O270P363Q124R300J0651J0839R286P044N390
61248F01897M414L528K574J769J017O0j045k056k971l929m912n775o356o364n530
61233E76321m077k637j587q73n55r07j666j867q99O73J838K300K537K989L616
61218E75206M035L840L049K303K214K489K285J559J221J705K236K015J322P80
61204F06259L53j03jJ201K860L820M003M350N332O481P434Q504J0050J1910J3649
61189F86102J4822J4981J3960J2224J0450Q807P066N349M119L445K865K050J137
$$ plain form
61176 787377 787689 787287 786306 784822 782512 778682 773024 766213 759400 753157 747147 740670 733257 724771 715249
61161 715249 704760 693354 681140 668414 655617 643135 631190 619885 609238 599257 590188 582561
61149 582561 576715 572356 568990 566712 566079 567098 568776 569814 569352 566946 562400 556029 548741 541464 534625
61134 534625 528371 523021 518980 516355 514877 514200 514292 515678 519137 524840 531959 539574 547805 557414 568451
61119 568451 580160 592318 605682 620757 637085 654337 673216 694380 717087 739819 761898
61108 761898 783704 805573 827320 848637 869212 888467 905878 921560 935974 949062 960129
61097 960129 968482 973725 975489 973412 967456 957946 945412 930657 914670 897954 880113 860606 839771
61084 839771 818703 798277 778768 760151 742164 724261 706190 688623 672650 658657 646192
$$ packed form
61176G87377L12m02r81j484k310l830n658o811o813o243o010o477p413q486r522
61161G15249j0489j1406j2214j2726j2797j2482j1945j1305j0647r981r069p627
61149E82561n846m359l366k278o33J019J678J038m62k406m546o371p288p277o839
61134E34625o254n350m041k625j478o77R2J386L459N703P119P615Q231R609J1037
61119E68451J1709J2158J3364J5075J6328J7252J8879K1164K2707K2732K2079
61108G61898K1806K1869K1747K1317K0575J9255J7411J5682J4414J3088J1067
61097I60129Q353N243J764k077n956r510j2534j4755j5987j6716j7841j9507k0835
61084H39771k1068k0426j9509j8617j7987j7903j8071j7567j5973j3993j2465
$$ plain form
61073 646192 634801 624414 614997 606542 599498 594520 591572 589728 588090 586496 585280 584784 585267 586864
61059 586864 589447 592777 596901 602065 608233 614985 621919 628920 636136 644006 653165 663962 676227 689865
61045 689865 705403 723372 743405 764647 786934 810823 836499 863466 891441 920798 951917
61034 951917 984783 1019508 1056651 1096656 1139409 1184644 1232452 1283208 1337221 1394319 1453402
61023 1453402 1512714 1571365 1630705 1693775 1763583 1842500 1932777 2036353 2154055 2286137 2433822
61012 2433822 2599626 2786823 3000552 3249823 3546691 3902980 4329211 4836418 5435843
61003 5435843 6135836 6943021 7870144 8942263 10195887 11677881 13444021 15533607 17903693
60994 17903693 20363281 22589178 24254236 25187520 25442165 25232609 24821507 24448908 24303464
$$ packed form
61073F46192j1391j0387r417q455p044m978k948j844j638j594j216m96M83J597
61059E86864K583L330M124N164O168O752O934P001P216P870R159J0797J2265J3638
61045F89865J5538J7969K0033K1242K2287K3889K5676K6967K7975K9357L1119
61034I51917L2866L4725L7143M0005M2753M5235M7808N0756N4013N7098N9083
61023A453402N9312N8651N9340O3070O9808P8917R0277J03576J17702J32082J47685
61012B433822J65804J87197K13729K49271K96868L56289M26231N07207N99425
61003E435843O99993Q07185R27123J072119J253624J481994J766140K089586K370086
60994A7903693K459588K225897J665058R33284K54645k09556m11102l72599j45444
$$ plain form
60985 24303464 24475203 24884604 25268122 25282351 24674273 23392463 21570584 19427875 17176409
60976 17176409 14978818 12942239 11123877 9541545 8188574 7046632 6091892 5298112
60968 5298112 4640379 4097400 3650372 3281472 2974720 2717151 2498089 2308341 2141162
60959 2141162 1992995 1861947 1745888 1642650 1551135 1470982 1401480 1341583 1290475 1247095
60949 1247095 1209356 1174661 1141204 1108308 1075971 1044743 1015663 989440 965736 943828 923706
60938 923706 905766 889641 874152 858478 842750 827492 813069 799647 787035 774504 761435
60927 761435 748300 736416 726511 718035 710045 702180 694514 687036 679820 673397 668458 665249 663521 662992
60913 662992 663667 665740 669307 674137 679755 685944 693140 702026 712714 724644 737364 750970 765563
$$ packed form
60985B4303464J71739M09401L83518J4229o08078j281810j821879k142709k251466
60976A7176409k197591k036579j818362j582332j352971j141942r54740p93780
60968E298112o57733n42979m47028l68900l06752k57569k19062j89748j67179
60959B141162j48167j31048j16059j03238r1515q0153o9502n9897n1108m3380
60949A247095l7739l4695l3457l2896l2337l1228k9080k6223k3704k1908k0122
60938I23706j7940j6125j5489j5674j5728j5258j4423j3422j2612j2531j3069
60927G61435j3135j1884r905q476p990p865p666p478p216o423m939l209j728n29
60913F62992O75K073L567M830N618O189P196Q886J0688J1930J2720J3606J4593
$$ plain form
60900 765563 780707 795835 810984 826748 843619 861598 880268 898859 916344 931886 945316
60889 945316 957038 967482 976725 984469 990121 993002 992792 989701 984054 975892 965265 952693 938797
60876 938797 923558 906572 888131 869465 851621 834566 817763 801156 785075 769517 754195
60865 754195 739169 724910 711644 699160 687376 676632 667186 658722 650567 642176 633225 623543 613305
60852 613305 603108 593511 584465 575448 566186 556979 548236 539909 531591 523083 514644 506629 499061 491646
60838 491646 484127 476390 468286 459625 450547 441749 434033 427599 421966 416618 411523 406957 402991 399351
60824 399351 395749 392261 389433 387964 388114 389285 390262 390065 388647 386842 385738 386082 388013 391003 394037
60809 394037 396152 397078 397369 397824 398728 399740 400548 401482 403250 406037 409087 411407 412717 413418 413702 413191
$$ packed form
60900G65563J5144J5128J5149J5764J6871J7979J8670J8591J7485J5542J3430
60889I45316J1722J0444R243P744N652K881k10l091n647q162j0627j2572j3896
60876I38797j5239j6986j8441j8666j7844j7055j6803j6607j6081j5558j5322
60865G54195j5026j4259j3266j2484j1784j0744r446q464q155q391q951r682j0238
60852F13305j0197r597r046r017r262r207q743q327q318q508q439q015p568p415
60838D91646p519p737q104q661r078q798p716o434n633n348n095m566l966l640
60824C99351l602l488k828j469J50J171R77j97j418j805j104L44J931K990L034
60809C94037K115R26K91M55R04J012Q08R34J768K787L050K320J310P01K84n11
$$ plain form
60793 413191 411667 409746 408367 407764 407340 406538 405362 403924 401943 399121 395797 392822 390691 389075 387285
60778 387285 384962 382147 378874 375012 370600 366066 361908 358199 354650 351279 348744 347686 347771 347720 346508
60763 346508 344293 341987 340129 338620 337458 337113 337838 339041 339834 340060 340306 340924 341564 341845 342057 342910 344810
60746 344810 347670 351205 355107 359032 362756 366340 369847 372906 374827 375288 374742 374001 373442 372689 371062
60731 371062 368358 365195 362479 360481 358560 355886 352252 348031 343628 339336 335562 332604 330125 327302
60717 327302 323808 320287 317559 315657 313982 312207 310518 309036 307459 305410 302831 299934 297068 294762
60703 294762 293587 293582 294004 293915 293011 291644 290207 288926 288256 288879 290945 293588 295639 296674 297072 297223 297205
60686 297205 297243 297956 299831 302677 305801 308551 310684 312522 314850 318297 322617 326891 330608 334152 338026
$$ packed form
60793D13191j524j921j379o03m24q02j176j438j981k822l324k975k131j616j790
60778C87285k323k815l273l862m412m534m158l709l549l371k535j058Q5n1j212
60763C46508k215k306j858j509j162l45P25J203P93K26K46O18O40K81K12Q53J900
60746C44810K860L535L902L925L724L584L507L059J921M61n46p41n59p53j627
60731C71062k704l163k716j998j921k674l634m221m403m292l774k958k479k823
60717C27302l494l521k728j902j675j775j689j482j577k049k579k897k866k306
60703B94762j175nM22q9r04j367j437j281o70O23K066K643K051J035L98J51j8
60686B97205L8P13J875K846L124K750K133J838K328L447M320M274L717L544L874
$$ plain form
60671 338026 342099 346019 349866 353831 357543 360414 362479 364273 365989 367437 368747 370326 371984 372876
60657 372876 372632 371937 371621 371675 371549 370966 370037 368950 367989 367607 368036 368976 369931 370658 371042 370804 369643 367523
60639 367523 364567 360924 356893 352860 348814 344345 339486 335151 332209 330410 328850 327275 326209 325847
60625 325847 325568 324758 323580 322632 322286 322572 323366 324342 325013 325130 324914 324649 324224 323344 322126 321201 321138 321898
60607 321898 322944 323799 324417 325063 325975 327174 328530 329852 330999 332056 333340 335013 336669 337587 337486 336812
60591 336812 336184 335849 335851 336348 337408 338707 339826 340727 341553 342107 341983 341240 340561 340633 341587 343127 344962 347067
60573 347067 349760 353525 358574 364546 370868 377467 384869 393612 403811 415371 428242 442202 456534
60560 456534 470147 481989 491224 497163 499275 497476 492436 485472 477942 470625 463763 457672 453028 450404
$$ packed form
60671C38026M073L920L847L965L712K871K065J794J716J448J310J579J658Q92
60657C72876k44o95l16N4j26n83r29j087r61l82M29R40R55P27L84k38j161k120
60639C67523k956l643m031m033m046m469m859m335k942j799j560j575j066l62
60625C25847k79q10j178r48l46K86P94R76O71J17k16k65m25q80j218r25o3P60
60607C21898J046Q55O18O46R12J199J356J322J147J057J284J673J656R18j01o74
60591C36812o28l35KM97J060J299J119R01Q26N54j24p43o79P2R54J540J835K105
60573C47067K693L765N049N972O322O599P402Q743J0199J1560J2871J3960J4332
60560D56534J3613J1842R235N939K112j799n040o964p530p317o862o091m644k624
$$ plain form
60546 450404 449797 450929 453828 458735 465499 473505 482285 491971 503075 516020 530899 547363 564645
60533 564645 581877 598354 613306 625487 633481 636621 635378 630764 623684 614986 605712 596872 589034
60520 589034 582257 576270 570540 564497 558064 551967 547265 544540 543644 544102 545573 547982 551387 555836 561296
60505 561296 567842 575928 586291 599469 615554 634560 656807 682699 712300 745576 783025 825478
60493 825478 872924 923791 975713 1026884 1076198 1122109 1161908 1192537 1211927 1219223 1213963 1195690
60481 1195690 1164639 1122421 1071745 1015579 956737 897873 841303 788596 740483 697111 658339
60470 658339 623909 593649 567465 544983 525290 507384 490914 476236 463686 453041 443750 435443
60458 435443 428088 421838 416812 412794 409041 404657 399395 393950 389254 385573 382488 379625 377103 375212
$$ packed form
60546D50404o07J132K899M907O764Q006Q780R686J1104J2945J4879J6464J7282
60533E64645J7232J6477J4952J2181P994L140j243m614p080q698r274q840p838
60520E89034o777n987n730o043o433o097m702k725q96M58J471K409L405M449N460
60505E61296O546Q086J0363J3178J6085J9006K2247K5892K9601L3276L7449M2453
60493H25478M7446N0867N1922N1171M9314M5911L9799L0629J9390P296n260j8273
60481A195690l1051m2218n0676n6166n8842n8864n6570n2707m8113m3372l8772
60470F58339l4430l0260k6184k2482j9693j7906j6470j4678j2550j0645r291q307
60458D35443p355o250n026m018l753m384n262n445m696l681l085k863k522j891
$$ plain form
60444 375212 373902 372788 371579 370284 368943 367303 365022 362240 359735 358335 358190 358732 359261 359413 359206
60429 359206 358863 358622 358522 358326 357756 356773 355511 354052 352472 351019 349900 348868 347417 345550 344070 343849
60413 343849 345004 346990 349321 351862 354497 356855 358570 359652 360445 361233 362012 362694 363399 364392 365718 367072
60397 367072 368146 369010 370006 371319 372727 373815 374392 374762 375559 377181 379335 381322 382822 384166 385728
60382 385728 387390 388840 390134 391619 393485 395760 398449 401310 403674 405046 405833 406967 408805 410860
60368 410860 412578 413824 414613 414952 415134 415659 416654 417832 419144 420923 423168 425330 427174 429312 432410
60353 432410 436322 440485 444813 449719 455578 462652 471142 480726 490251 498480 505045 510201 513874 515567
60339 515567 515090 512750 508785 503207 496355 489068 482084 475621 469689 464466 460187 456939 454696 453254
$$ packed form
60444C75212j310j114j209j295j341j640k281k782k505j400j45N42N29J52k07
60429C59206l43k41j00j96n70r83j262j459j580j453j119j032j451j867j480k21
60413C43849J155J986K331K541K635K358J715J082P93P88P79O82P05R93J326J354
60397C67072J074Q64R96J313J408J088N77L70P97J622K154J987J500J344J562
60382C85728J662J450J294J485J866K275K689K861K364J372P87J134J838K055
60368D10860J718J246P89L39J82N25R95J178J312J779K245K162J844K138L098
60353D32410L912M163M328M906N859P074Q490R584R525Q229O565N156L673J693
60339E15567m77k340l965n578o852p287o984o463n932n223m279l248k243j442
$$ plain form
60325 453254 452039 450344 447972 445452 443408 441951 440820 439841 438971 438100 437202 436698 437329 439482 442758 446483
60309 446483 450671 456301 464512 475669 489417 505472 524036 545419 569616 596238 624293 651714
60297 651714 675588 693401 704000 707101 702272 689059 668102 641641 612795 584508 558786 536291
60285 536291 516544 498980 483896 472017 463239 456452 450657 445651 441406 437481 433542 429913 426989
60272 426989 424396 421359 417754 414260 411486 409396 407614 405876 404082 402303 400886 400254 400403 400792 400912
60257 400912 400793 400800 401095 401540 402059 402808 403876 404992 405704 405856 405785 405953 406453 406961 407205 407391 408017 409239 410531
60238 410531 411211 411312 411684 412962 414649 415600 415446 415070 415468 416637 417992 419466 421451 423744 425399 425900
60222 425900 425905 426366 427357 428274 428866 429472 430338 431300 432220 433300 434791 436748 439194 442227 445802 449745 454149
$$ packed form
60325D53254j215j695k372k520k044j457j131r79q70q71q98n04O31K153L276L725
60309D46483M188N630Q211J1157J3748J6055J8564K1383K4197K6622K8055K7421
60297F51714K3874J7813J0599L101m829j3213k0957k6461k8846k8287k5722k2495
60285E36291j9747j7564j5084j1879q778o787n795n006m245l925l939l629k924
60272D26989k593l037l605l494k774k090j782j738j794j779j417o32J49L89J20
60257D00912j19PK95M45N19P49J068J116P12J52p1J68N00N08K44J86O26J222J292
60238D10531O80J01L72J278J687R51j54l76L98J169J355J474J985K293J655N01
60222D25900NM61R91R17N92O06Q66R62R20J080J491J957K446L033L575L943M404
$$ plain form
60205 454149 459424 465615 471929 477325 481449 484665 487296 489366 491146 493346 496393 499792 502623 504577
60191 504577 506172 507953 509857 511428 512361 512658 512402 511636 510428 508898 507092 504904 502183 498927 495350
60176 495350 491704 488064 484361 480633 477114 474030 471474 469592 468679 468805 469452 469842 469587 468765 467401 465367
60160 465367 462872 460668 459442 459264 459841 460939 462246 463159 463337 463339 464142 465956 468009 469659 471189 473193
60144 473193 475625 477961 480100 482495 485383 488409 491328 494733 499643 506374 514107 521663 528475 534626
60130 534626 540168 544744 547918 549576 549853 548911 547055 544936 543241 542035 540670 538529 535763 533154 531411
60115 531411 530783 531192 532363 533817 535135 536417 538180 540489 542433 542922 541940 540563 539633 538836 537343 534960
60099 534960 532238 529671 527256 524816 522354 519998 517917 516411 515829 516235 517263 518428 519502 520598 521985
$$ packed form
60205D54149N275O191O314N396M124L216K631K070J780K200L047L399K831J954
60191E04577J595J781J904J571R33K97k56p66j208j530j806k188k721l256l577
60176D95350l646l640l703l728l519l084k556j882r13J26O47L90k55q22j364k034
60160D65367k495k204j226j78N77J098J307R13J78KQ03J814K053J650J530K004
60144D73193K432K336K139K395K888L026K919L405M910O731P733P556O812O151
60130E34626N542M576L174J658K77r42j856k119j695j206j365k141k766k609j743
60115E31411o28M09J171J454J318J282J763K309J944M89r82j377r30p97j493k383
60099E34960k722k567k415k440k462k356k081j506n82M06J028J165J074J096J387
$$ plain form
60084 521985 523863 526186 528681 531081 533280 535194 536684 537841 539098 540613 541637 541034 538510 534904
60070 534904 531083 527041 522385 517229 512133 507329 502501 497280 491727 486296 481507 477483 473614 468885
60056 468885 462907 456559 451274 447625 444901 442106 439110 436655 435359 434999 434813 434385 434037 434361 435607
60041 435607 437716 440680 444470 448663 452646 456234 459704 463090 465952 468034 469674 471174 472189 472193 471208
60026 471208 469599 467418 464509 461065 457465 453637 449139 443966 438712 433781 428860 423384 417251 410886
60012 410886 404910 399907 396277 394006 392592 391348 389830 388046 386339 385036 384106 383193 381968 380365 378466
59997 378466 376434 374645 373598 373399 373553 373529 373331 373300 373667 374654 376668 379785 383253 386071 388060 389819
59981 389819 391682 393343 394560 395575 396580 397289 397366 396885 396077 394892 393172 391128 389365 388476 388623 389389
$$ packed form
60084E21985J878K323K495K400K199J914J490J157J257J515J024o03k524l606
60070E34904l821m042m656n156n096m804m828n221n553n431m789m024l869m729
60056D68885n978o348n285l649k724k795k996k455j296l60j86m28l48L24J246
60041D35607K109K964L790M193L983L588L470L386K862K082J640J500J015Mr85
60026D71208j609k181k909l444l600l828m498n173n254m931m921n476o133o365
60012D10886n976n003l630k271j414j244j518j784j707j303r30r13j225j603j899
59997C78466k032j789j047j99J54k4j98l1L67R87K014L117L468K818J989J759
59981C89819J863J661J217J015J005P09P7m81q08j185j720k044j763q89J47P66
$$ plain form
59965 389389 390072 390372 390730 391711 393186 394563 395795 397503 399948 402442 404194 405242 406128 407024 407690 408067
59949 408067 408342 408523 408426 408138 408066 408425 408960 409365 409729 410390 411461 412673 413667 414291 414603 414637 414279 413351 411805
59930 411805 409908 408245 407414 407561 408317 409357 410895 413272 416191 418937 421450 424487 428387 432290 435221
59915 435221 437427 439903 442896 445739 448084 450458 453458 457049 460739 463880 465750 465995 465181 464289 463568
59900 463568 462493 460898 459338 458086 456685 454949 453659 453617 454578 455759 456949 458510 460686 463510 467014
59885 467014 470983 474841 478395 482336 487373 493127 498558 503240 507546 511774 515879 519955 524165 528032
59871 528032 530512 531035 529981 527921 524922 520861 515983 510801 505703 500917 496647 493028 490089 487922
59857 487922 486731 486574 487187 488146 489187 490369 492109 495066 499797 506424 514735 524516 535517 546956
$$ packed form
59965C89389O83L00L58R81J475J377J232J708K445K494J752J048Q86Q96O66L77
59949D08067K75J81r7k88p2L59N35M05L64O61J071J212R94O24L12L4l58r28j546
59930D11805j897j663q31J47P56J040J538K377K919K746K513L037L900L903K931
59915D35221K206K476K993K843K345K374L000L591L690L141J870K45q14q92p21
59900D63568j075j595j560j252j401j736j290m2R61J181J190J561K176K824L504
59885D67014L969L858L554L941N037N754N431M682M306M228M105M076M210L867
59871E28032K480N23j054k060k999m061m878n182n098m786m270l619k939k167
59857D87922j191j57O13R59J041J182J740K957M731O627Q311R781J1001J1439
$$ plain form
59843 546956 557298 564858 568820 569691 568777 567256 565796 564943 565392 567387 569913 571006 569179 564388 557619
59828 557619 549953 542255 535259 529355 524312 519467 514199 508172 501453 494655 488599 483496 478810 474287
59814 474287 470645 468568 467356 465456 462365 459180 457035 455736 454314 452306 449934 447413 444704 441845
59800 441845 439070 436555 434321 432353 430600 428892 427088 425313 423871 422882 422152 421425 420622 419826 419211 419047
59784 419047 419630 420954 422526 423754 424586 425501 426706 427728 428132 428325 428973 429704 429224 427020 424289 422650
59768 422650 422469 423000 423692 424477 425052 424826 423737 422384 421182 420069 419282 419631 421503 424154 426546 428552
59752 428552 430773 433490 436484 439702 443357 447245 450594 452939 454723 456712 459160 461901 465010 468819
59738 468819 473311 477938 482171 485914 489153 491501 492398 491700 489942 488051 486934 487115 488483 490378 492062
$$ packed form
59843E46956J0342P560L962Q71r14j521j460q53M49J995K526J093j827m791o769
59828E57619p666p698o996n904n043m845n268o027o719o798o056n103m686m523
59814D74287l642k077j212j900l091l185k145j299j422k008k372k521k709k859
59800D41845k775k515k234j968j753j708j804j775j442r89p30p27q03p96o15j64
59784D19047N83J324J572J228Q32R15J205J022M04J93O48P31m80k204k731j639
59768D22650j81N31O92P85N75k26j089j353j202j113p87L49J872K651K392K006
59752D28552K221K717K994L218L655L888L349K345J784J989K448K741L109L809
59738D68819M492M627M233L743L239K348Q97o98j758j891j117J81J368J895J684
$$ plain form
59723 492062 493050 492999 491620 489092 486354 484462 483574 482913 481684 479691 477150 474514 472600 472213 473281 474781
59707 474781 475856 476578 477292 477779 477691 477404 477688 478604 479425 479671 479644 479840 480410 481380 482910 484991 487168 488911
59689 488911 490082 490796 490958 490237 488518 486208 483975 482322 481457 481425 482131 483146 483780 483616 482850 481825 480349
59672 480349 477859 474244 470006 465530 460713 455536 450482 446072 442408 439557 437867 437354 437161 436305 434850
59657 434850 433697 433299 433191 432835 432408 432561 433802 436204 439363 442521 445038 446928 448751 450936 453341
59642 453341 455411 456538 456291 454578 451671 448061 444382 441433 439865 439551 439590 439287 438835 438732 438947 439209
59626 439209 439679 440562 441321 441164 440283 439748 440023 440366 439938 438708 436913 434330 430681 426264 421692 417357
59610 417357 413608 411072 410217 410737 411846 413110 414580 416297 418153 420308 423191 426748 429965 431597 431460
$$ packed form
59723D92062R88n1j379k528k738j892q88o61j229j993k541k636j914l87J068J500
59707D74781J075P22P14M87q8k87K84R16Q21K46k7J96N70R70J530K081K177J743
59689D88911J171P14J62p21j719k310k233j653q65l2P06J015O34j64p66j025j476
59672D80349k490l615m238m476m817n177n054m410l664k851j690n13j93q56j455
59657D34850j153l98j08l56m27J53J241K402L159L158K517J890J823K185K405
59642D53341K070J127k47j713k907l610l679k949j568l14L9l03m52j03K15K62
59626D39209M70Q83P59j57q81n35K75L43m28j230j795k583l649m417m572m335
59610D17357l749k536q55N20J109J264J470J717J856K155K883L557L217J632j37
$$ plain form
59595 431460 430713 430618 431219 431564 431101 430312 429818 429454 428656 427417 426299 425681 425464 425382 425170 424555 423559 422668 422240
59576 422240 421930 421199 420151 419163 417909 415643 412487 409539 407510 406100 405051 404848 405842 407381 408556
59561 408556 409307 410147 411192 412061 412491 412497 412210 412047 412734 414556 416779 418425 419504 420946 423422 426823 430867
59544 430867 435530 440694 445933 451093 456816 464194 474026 486675 502422 521340 542457 563115 579608
59531 579608 588897 590055 584426 574650 563429 552662 543184 535245 529317 526241 526368 528825 532027 534876
59517 534876 537155 538953 540221 540801 540429 538647 535229 530653 525635 520132 513437 505423 497069 489416 482564
59502 482564 476028 469564 463222 457047 451267 446427 442791 439806 436678 433379 430679 429209 428845 428967 429008
59487 429008 428716 428148 427523 427078 427067 427761 429237 431212 433351 435729 438655 442144 446030 450593 456416 463340
$$ packed form
59595D31460p47r5O01L45m63p89m94l64p98j239j118o18k17q2k12o15r96q91m28
59576D22240l10p31j048r88j254k266l156k948k029j410j049k03R94J539J175
59561D08556P51Q40J045Q69M30Ok87j63O87J822K223J646J079J442K476L401M044
59544D30867M663N164N239N160N723P378R832J2649J5747J8918K1117K0658J6493
59531E79608R289J158n629r776j1221j0767r478p939n928l076J27K457L202K849
59517E34876K279J798J268N80l72j782l418m576n018n503o695q014q354p653o852
59502D82564o536o464o342o175n780m840l636k985l128l299k700j470l64J22M1
59487D29008k92n68o25m45j1O94J476J975K139K378K926L489L886M563N823O924
$$ plain form
59471 463340 470181 475900 480542 484611 488035 490469 492231 494168 496580 498883 500493 501631 503155 505830
59457 505830 509853 514792 519909 524701 529283 534250 540252 547679 556534 566444 576801 586953 596205 603796
59443 603796 609181 612338 613495 612496 608789 602192 593388 583571 573855 564997 557223 550098 542951 535744
59429 535744 529319 524660 522101 521222 521189 521262 521497 523024 527160 534144 543243 554052 566865 581586 597218
59414 597218 612934 629146 647172 668418 693835 722766 751392 773455 784056 782873 773262 758956
59402 758956 742458 725725 710733 699234 692834 692981 699427 708391 713479 709393 694864 672350 645806
59389 645806 618771 593431 570526 550056 532228 517568 506296 498010 491973 487324 483209 479340
59377 479340 476405 475297 475849 476903 477713 478665 480430 482978 485829 488839 492401 497003 502707 508869 514420
$$ packed form
59471D63340O841N719M642M069L424K434J762J937K412K303J610J138J524K675
59457E05830M023M939N117M792M582M967O002P427Q855R910J0357J0152R252P591
59443F03796N385L157J157r99l707o597q804r817r716q858p774p125p147p207
59429E35744o425m659k559q79l3P3K35J527M136O984R099J0809J2813J4721J5632
59414E97218J5716J6212J8026K1246K5417K8931K8626K2063J0601j183r611j4306
59402G58956j6498j6733j4992j1499o400J47O446Q964N088m086j4529k2514k6544
59389F45806k7035k5340k2905k0470j7828j4660j1272q286o037m649m115l869
59377D79340k935j108N52J054Q10R52J765K548K851L010L562M602N704O162N551
$$ plain form
59362 514420 518761 522445 526664 532058 538319 544847 551298 557476 563244 568882 575164 582823 592067 602647
59348 602647 614134 626074 638119 650144 662147 674056 685746 697118 707987 718079 727376 736171
59336 736171 744375 751061 755210 756753 756286 753914 749023 741253 731017 718911 705266 690586 675918
59323 675918 662278 649905 638323 627014 615937 605524 596310 588457 581617 575411 569923 565516 562274
59310 562274 559857 557899 556362 555661 556584 559779 564931 570753 576305 582222 590238 601646 616557 634137
59296 634137 652683 669460 681383 686329 683716 674143 659179 641351 623361 606728 591508 577447
59284 577447 564928 554616 546730 540912 536491 532722 529194 526198 524461 524446 526158 529500 534350 540294
59270 540294 546793 553703 561151 569025 577118 585719 595304 605454 614756 622046 627197 630538 632171 632145
$$ packed form
59362E14420M341L684M219N394O261O528O451O178N768N638O282P659R244J0580
59348F02647J1487J1940J2045J2025J2003J1909J1690J1372J0869J0092R297Q795
59336G36171Q204O686M149J543m67k372m891p770j0236j2106j3645j4680j4668
59323F75918j3640j2373j1582j1309j1077j0413r214p853o840o206n488m407l242
59310E62274k417j958j537p01R23L195N152N822N552N917Q016J1408J4911J7580
59296F34137J8546J6777J1923M946k613r573j4964j7828j7990j6633j5220j4061
59284E77447j2519j0312p886n818m421l769l528k996j737j5J712L342M850N944
59270E40294O499O910P448P874Q093Q601R585J0150R302P290N151L341J633k6
$$ plain form
59256 632145 630634 627503 622230 614708 605725 596262 586710 577145 567959 559746 552838 547334 543340 540820
59242 540820 539440 538828 538821 539268 539951 540959 542787 545669 549057 552129 554627 556882 559185 561545 564053 567010
59226 567010 570486 573877 576154 576662 575593 573533 570668 566782 562020 557108 552548 548065 543355 538903
59212 538903 535456 533012 531065 529530 528627 527970 526728 524740 522653 520858 519116 517387 516172 515744 515765
59197 515765 515942 516307 516618 516285 515330 514682 515045 516080 517070 517742 518023 517714 517002 516726 517523 519161 521138 523414
59179 523414 526022 528460 530130 531054 531688 532369 533390 535162 537764 540712 543697 547180 551742 557219 563008
59164 563008 568921 575227 582120 589633 597694 605745 612636 617550 620887 623655 626119 627567 627328 625494
59150 625494 622603 618980 614497 608850 602080 594791 587645 580713 573719 566971 561336 557055 553150 548479
$$ packed form
59256F32145j511l131n273p522q983r463r552r565r186q213o908n504l994k520
59242E40820j380o12pM47O83J008J828K882L388L072K498K255K303K360K508K957
59226E67010L476L391K277N08j069k060k865l886m762m912m560m483m710m452
59212E38903l447k444j947j535r03o57j242j988k087j795j742j729j215m28K1
59197E15765J77L65L11l33r55o48L63J035R90O72K81l09p12k76P97J638J977K276
59179E23414K608K438J670R24O34O81J021J772K602K948K985L483M562N477N789
59164E63008N913O306O893P513Q061Q051O891M914L337K768K464J448k39j834
59150F25494k891l623m483n647o770p289p146o932o994o748n635m281l905m671
$$ plain form
59136 548479 542916 537101 531504 526249 521461 517298 513841 511222 509493 508210 506703 505031 504036 504050 504353
59121 504353 504450 505075 507141 510429 514311 519241 526328 535652 545984 556138 565710 574573 582634 590268
59107 590268 598185 606559 614775 622176 628672 634618 640429 646245 651544 655277 656866 656919 656457 655731 654461
59092 654461 652927 651875 651315 650307 648287 645987 644627 644588 645108 644989 643375 640077 635357 629397 622133
59077 622133 613763 605091 596945 589341 581651 573560 565472 558038 551581 545985 540859 535887 531281 527728
59063 527728 525672 524769 524219 523363 521742 519070 515614 512293 509874 508259 506928 505681 504526 503312 502040
59048 502040 501144 500788 500272 498940 497347 496632 496914 497229 496993 496648 496765 497371 498325 499591 500929 501922 502561
59031 502561 503265 504211 505213 506433 508642 512512 518032 524726 532043 539485 546807 554236 562129 570508 579290
$$ packed form
59136E48479n563n815n597n255m788m163l457k619j729j283j507j672r95J4L03
59121E04353R7O25K066L288L882M930P087R324J0332J0154R572Q863Q061P634
59107E90268P917Q374Q216P401O496N946N811N816N299L733J589N3m62p26j270
59092F54461j534j052n60j008k020k300j360l9N20j19j614l298m720n960p264
59077F22133q370q672q146p604p690q091q088p434o457n596n126m972m606l553
59063E27728k056r03n50q56j621k672l456l321k419j615j331j247j155j214j272
59048E02040q96l56n16j332j593p15K82L15k36l45J17O06R54J266J338R93O39
59031E02561P04R46J002J220K209L870N520O694P317P442P322P429P893Q379Q782
$$ plain form
59016 579290 588772 599228 610104 620251 628952 636061 641169 643554 643170 640967 637883 634163 629929 625770
59002 625770 622385 620130 619297 620322 623320 627783 633066 638810 644641 649895 653988 656822 658579 659488 659998
58987 659998 660715 661732 662315 661661 659768 657232 654337 650703 645890 640158 634611 630540 628511 628124 628782
58972 628782 630543 633956 639149 645554 652552 660042 668253 677302 687030 697013 706626 715365 723204 730503
58958 730503 737564 744427 750951 756785 761321 763985 764570 763023 759043 752270 742787 731180 718187 704581
58944 704581 691120 678141 665423 652954 641634 632513 625446 619192 612933 606945 601662 596850 592053
58931 592053 587270 582753 578571 574785 571708 569605 568304 567376 566543 565677 564584 563018 560911 558537 556470
58916 556470 555236 554838 554695 554261 553573 553037 552880 553153 554072 555964 558997 563231 568748 575437 582929 591135
$$ packed form
59016E79290R482J0456J0876J0147Q701P109N108K385l84k203l084l720m234m159
59002F25770l385k255q33J025K998M463N283N744N831N254M093K834J757R09N10
58987F59998P17J017N83o54j893k536k895l634m813n732n547m071k029l87O58
58972F28782J761L413N193O405O998P490Q211R049R728R983R613Q739P839P299
58958G30503P061O863O524N834M536K664N85j547l980o773r483j1607j2993j3606
58944G04581j3461j2979j2718j2469j1320r121p067o254o259n988n283m812m797
58931E92053m783m517m182l786l077k103j301r28q33q66j093j566k107k374k067
58916E56470j234l98j43m34o88n36j57K73R19J892L033M234N517O689P492Q206
$$ plain form
58900 591135 600543 611490 623470 635655 647783 659911 671645 682454 692533 702591 712916 723518
58888 723518 735082 748748 764806 782377 800544 818997 837447 855298 872213 888206 902735
58877 902735 914378 921796 924613 923174 918039 909991 899880 888053 874278 858506 841364 823849
58865 823849 806964 791659 778488 767139 756799 747100 738260 730297 722696 714885 706478 697152 686971
58852 686971 676754 667297 658257 648665 638545 629042 620806 613302 605954 598899 592263 585716 579207 573223
58838 573223 567860 562583 557313 552746 548999 545027 540098 534897 530360 526322 522249 518522 515947 514525
58824 514525 513665 513160 513092 513220 513335 513871 515340 517506 519830 522327 525170 527871 529841 531512 533890 537027
58808 537027 539881 541802 543332 545198 547118 548055 547355 545382 543138 541400 540220 539202 538063 536758 535220
$$ packed form
58900E91135R408J0947J1980J2185J2128J2128J1734J0809J0079J0058J0325J0602
58888G23518J1564J3666J6058J7571J8167J8453J8450J7851J6915J5993J4529
58877I02735J1643P418K817j439n135q048j0111j1827j3775j5772j7142j7515
58865H23849j6885j5305j3171j1349j0340r699q840p963p601p811q407r326j0181
58852F86971j0217r457r040r592j0120r503q236p504p348p055o636o547o509n984
58838E73223n363n277n270m567l747l972m929n201m537m038m073l727k575j422
58824E14525q60n05o8J28J15N36J469K166K324K497K843K701J970J671K378L137
58808E37027K854J921J530J866J920R37p00j973k244j738j180j018j139j305j538
$$ plain form
58793 535220 533392 531485 529727 527862 525419 522483 519665 517291 515282 513887 513672 514564 515753 516918 518736
58778 518736 521736 525434 529088 532606 536141 539548 542736 545769 548111 548565 546710 543589 540284 536603
58764 536603 531997 526875 521969 517072 511644 506148 501570 497934 494553 491610 490235 490843 492400 493612
58750 493612 494149 494559 495573 497633 500596 503790 506689 509484 512698 516585 521254 526966 533676 540621 547070
58735 547070 553251 559836 566725 573104 578617 583766 589156 595000 601382 608388 615792 623041 629655 635422
58721 635422 640287 644338 647816 650959 654067 657823 663025 669645 676654 683258 689826 697092 704913 712444
58707 712444 719039 724246 727316 727560 725082 720508 714124 705824 695581 683340 668811 652126 634531
58694 634531 617592 601769 586396 571003 555954 541898 529254 518361 509495 502538 496968 492236
$$ packed form
58793E35220j828j907j758j865k443k936k818k374k009j395k15Q92J189J165J818
58778E18736L000L698L654L518L535L407L188L033K342M54j855l121l305l681
58764E36603m606n122m906m897n428n496m578l636l381k943j375O08J557J212
58750D93612N37M10J014K060K963L194K899K795L214L887M669N712O710O945O449
58735E47070O181O585O889O379N513N149N390N844O382P006P404P249O614N767
58721F35422M865M051L478L143L108L756N202O620P009O604O568P266P821P531
58707G12444O595N207L070K44k478m574o384q300j0243j2241j4529j6685j7595
58694F34531j6939j5823j5373j5393j5049j4056j2644j0893q866o957n570m732
$$ plain form
58682 492236 487971 483956 480175 476734 473470 469959 466210 463035 461312 461115 461882 463123 464652 466488 468876
58667 468876 472175 476543 482137 489587 499442 510895 522043 531877 541042 550044 557791 562884 565381 566183
58653 566183 565500 563184 559906 556602 553074 548398 542538 536474 530930 525987 521734 518266 515207 512169
58639 512169 509487 507633 506285 504941 504080 504602 506437 508820 511609 515050 518489 520774 521959 523326 525530
58624 525530 527854 529464 530326 530659 530511 530092 529737 529483 529496 530758 534257 539511 544928 549651 554037 558305
58608 558305 561957 564694 566773 568166 568421 567602 566389 564966 562817 559845 556732 553896 551089 548288 545962
58593 545962 544111 542044 539575 537509 536504 536361 536935 538831 542524 547466 552774 558334 564658 572039 580271
58578 580271 588894 597398 605478 613313 621274 629262 636696 643233 649150 655039 661481 668897 677318 686420
$$ packed form
58682D92236m265m015l781l441l264l511l749l175j723j97P67J241J529J836K388
58667D68876L299M368N594P450R855J1453J1148R834R165R002P747N093K497Q02
58653E66183o83k316l278l304l528m676n860o064n544m943m253l468l059l038
58639E12169k682j854j348j344q61N22J835K383K789L441L439K285J185J367K204
58624E25530K324J610Q62L33j48m19l55k54J3J262L499N254N417M723M386M268
58608E58305L652K737K079J393K55q19j213j423k149k972l113k836k807k801k326
58593E45962j851k067k469k066j005j43N74J896L693M942N308N560O324P381Q232
58578E80271Q623Q504Q080P835P961P988P434O537N917N889O442P416Q421R102
$$ plain form
58564 686420 696229 707554 721192 736923 753899 771739 790537 810085 829836 849361 868019 884437
58552 884437 897243 906201 911904 914650 914509 912126 908355 903237 896407 888401 880479 873124 865689 857481
58538 857481 848267 837792 825783 812442 798180 783066 767391 752297 738762 726357 714249 702982
58526 702982 693850 686884 681070 676358 673717 673212 673823 675333 678595 683544 688579 692480 695456 697837 699210
58511 699210 699423 699074 698361 696670 693866 690810 688122 685516 682707 679727 676078 671009 665061 659938 656321
58496 656321 653138 649477 645779 642572 639508 636495 634523 634482 636136 638834 642206 645749 648912 652129 656545
58481 656545 662266 668101 673444 679105 685853 693552 702206 712257 723177 733283 741669 748930 755295
58468 755295 759659 761230 760595 758277 753849 747455 740699 734887 729747 724918 721229 719330 718460 717849 718141
$$ packed form
58564F86420R809J1325J3638J5731J6976J7840J8798J9548J9751J9525J8658J6418
58552H84437J2806Q958N703K746j41k383l771n118o830q006p922p355p435q208
58538H57481r214j0475j2009j3341j4262j5114j5675j5094j3535j2405j2108j1267
58526G02982r132o966n814m712k641n05O11J510L262M949N035L901K976K381J373
58511F99210K13l49p13j691k804l056k688k606k809k980l649n069n948n123l617
58496F56321l183l661l698l207l064l013j972m1J654K698L372L543L163L217M416
58481F56545N721N835N343N661O748P699Q654J0051J0920J0106Q386P261O365
58468G55295M364J571o35k318m428o394o756n812n140m829l689j899q70o11K92
$$ plain form
58453 718141 720155 723463 727425 732489 739135 746517 753384 759429 764615 768080 768881 767108 763448 758551
58439 758551 753496 749671 747289 745227 743115 742212 743277 745167 746793 748937 752632 757102 760972 764465
58425 764465 768803 774340 780725 788011 796171 804322 811827 819342 827360 834557 838976 840227 839253 836706
58411 836706 832856 828392 823878 818912 813022 806886 801563 797052 792627 788067 783663 779584 776060 773586
58397 773586 772298 771875 772521 775021 779292 784075 788655 793547 798854 803558 807272 811032 815337 819092 821713
58382 821713 824496 828525 832883 836439 839820 843857 847578 849527 849908 849849 849796 850156 852156 856435 861929 867634
58366 867634 874113 881858 889806 897164 905073 914592 924622 933860 943254 954345 966498 978033 988819
58353 988819 999502 1009363 1017249 1023675 1029828 1035440 1039700 1043267 1047326 1051738 1056099 1061416 1068576 1076437
$$ packed form
58453G18141K014L308L962N064O646P382O867O045N186L465Q01j773l660m897
58439G58551n055l825k382k062k112r03J065J890J626K144L695M470L870L493
58425G64465M338N537O385P286Q160Q151P505P515Q018P197M419J251r74k547
58411H36706l850m464m514m966n890o136n323m511m425m560m404m079l524k474
58397G73586j288m23O46K500M271M783M580M892N307M704L714L760M305L755K621
58382H21713K783M029M358L556L381M037L721J949L81n9n3L60K000M279N494N705
58366H67634O479P745P948P358P909R519J0030R238R394J1091J2153J1535J0786
58353I88819J0683R861P886O426O153N612M260L567M059M412M361N317P160P861
$$ plain form
58339 1076437 1083756 1091741 1102252 1114605 1126718 1138349 1150634 1163342 1175414 1187509 1201314 1216666
58327 1216666 1231720 1245537 1258363 1270013 1280154 1289523 1298735 1306733 1312531 1317504 1323604 1330301 1335781
58314 1335781 1340279 1345673 1352544 1360219 1369008 1379872 1392403 1405465 1419217 1434381 1450389 1466394
58302 1466394 1483069 1501123 1519333 1536492 1553970 1573691 1594865 1615514 1635916 1657597 1680171
58291 1680171 1702189 1723993 1746664 1769364 1790828 1812325 1835920 1860995 1885722 1910726 1937888
58280 1937888 1966720 1995449 2024571 2055771 2088499 2121188 2154717 2191005 2229415 2268286 2308677
58269 2308677 2352586 2398795 2444713 2491169 2541037 2594268 2648693 2704627 2764035 2826155 2888668
58258 2888668 2952419 3020256 3091937 3164786 3238547 3314863 3392905 3470378 3548033 3628416 3711313
$$ packed form
58339A076437P319P985J0511J2353J2113J1631J2285J2708J2072J2095J3805J5352
58327A216666J5054J3817J2826J1650J0141R369R212P998N798M973O100O697N480
58314A335781M498N394O871P675Q789J0864J2531J3062J3752J5164J6008J6005
58302A466394J6675J8054J8210J7159J7478J9721K1174K0649K0402K1681K2574
58291A680171K2018K1804K2671K2700K1464K1497K3595K5075K4727K5004K7162
58280A937888K8832K8729K9122L1200L2728L2689L3529L6288L8410L8871M0391
58269B308677M3909M6209M5918M6456M9868N3231N4425N5934N9408O2120O2513
58258B888668O3751O7837P1681P2849P3761P6316P8042P7473P7655Q0383Q2897
$$ plain form
58247 3711313 3795347 3882651 3976590 4076253 4178813 4285919 4401752 4526194 4656298 4793160
58237 4793160 4940665 5098560 5263737 5437452 5624230 5824520 6035623 6258980 6499142
58228 6499142 6756618 7029501 7321148 7638145 7981722 8349617 8745322 9176717 9647010
58219 9647010 10156655 10712991 11327733 12005954 12748142 13562230 14462697 15459386 16559500
58210 16559500 17779941 19145488 20676839 22394848 24336204 26551559 29091181 32009440
58202 32009440 35382458 39305515 43878077 49213498 55462030 62801733 71407124 81445290
58194 81445290 93090333 106509918 121854355 139317137 159223835 182034050 208252511
58187 208252511 238291821 272134327 308619315 344727386 375765376 396874629 404997211
$$ packed form
58247C711313Q4034Q7304R3939R9663J02560J07106J15833J24442J30104J36862
58237D793160J47505J57895J65177J73715J86778K00290K11103K23357K40162
58228F499142K57476K72883K91647L16997L43577L67895L95705M31395M70293
58219I647010N09645N56336O14742O78221P42188Q14088R00467R96689J100114
58210A6559500J220441J365547J531351J718009J941356K215355K539622K918259
58202C2009440L373018L923057M572562N335421O248532P339703Q605391J0038166
58194H1445290J1645043J3419585J5344437J7462782J9906698K2810215K6218461
58187B08252511L0039310L3842506L6484988L6108071L1037990K1109253Q122582
$$ plain form
58180 404997211 399841895 383319004 358275331 327608487 293990921 259773108 226805993
58173 226805993 196318767 168976733 145022948 124394754 106831642 91991756 79523924
58166 79523924 69077974 60312637 52929603 46690952 41399810 36884994 33010631 29678296
58158 29678296 26806281 24317043 22147236 20252340 18592865 17127159 15821754 14655921
58150 14655921 13610821 12665055 11804549 11025404 10322287 9683461 9100195 8570821 8091861
58141 8091861 7654561 7253554 6889605 6560050 6254949 5966266 5693033 5434570 5186679
58132 5186679 4947978 4722460 4512186 4314024 4126333 3951957 3791559 3640683 3496576
58123 3496576 3361755 3237713 3121063 3008998 2903044 2804349 2710509 2619891 2534210 2454183
$$ packed form
58180D04997211n155316j6522891k5043673l0666844l3617566l4217813l2967115
58173B26805993l0487226k7342034k3953785k0628194j7563112j4839886j2467832
58166G9523924j0445950q765337p383034o238651n291142m514816l874363l332335
58158B9678296k872015k489238k169807j894896j659475j465706j305405j165833
58150A4655921j045100r45766q60506p79145p03117o38826n83266n29374m78960
58141H091861m37300m01007l63949l29555l05101k88683k73233k58463k47891
58132E186679k38701k25518k10274j98162j87691j74376j60398j50876j44107
58123C496576j34821j24042j16650j12065j05954r8695r3840r0618q5681q0027
$$ plain form
58113 2454183 2377470 2303326 2234518 2172127 2113044 2054980 1999482 1947698 1897609 1847834 1799976
58102 1799976 1754899 1710712 1666540 1624344 1584939 1546214 1507260 1470301 1436576 1404253 1372349
58091 1372349 1342657 1315674 1288624 1259896 1231704 1206088 1181943 1158369 1137204 1119502 1102709
58080 1102709 1084126 1064404 1045248 1026423 1007353 989046 972124 955265 937644 920548 904831
58069 904831 889193 872745 856777 842250 828065 813563 800246 789154 778996 768671 759294 751825
58057 751825 744985 737307 729159 721070 712205 702150 692121 682865 673438 663486 654463 647059 639757 631562
58043 631562 623911 618138 613194 607692 602110 597152 591833 585057 577458 570089 562923 556027 550369 545936
58029 545936 540831 533644 525034 515818 505530 494245 483718 475054 467142 458974 451595 446100 441616
$$ packed form
58113B454183p6713p4144o8808o2391n9083n8064n5498n1784n0089m9775m7858
58102A799976m5077m4187m4172m2196l9405l8725l8954l6959l3725l2323l1904
58091A372349k9692k6983k7050k8728k8192k5616k4145k3574k1165j7702j6793
58080A102709j8583j9722j9156j8825j9070j8307j6922j6859j7621j7096j5717
58069I04831j5638j6448j5968j4527j4185j4502j3317j1092j0158j0325r377p469
58057G51825o840p678q148q089q865j0055j0029r256r427r952r023p404p302q195
58043F31562p651n773m944n502n582m958n319o776p599p369p166o896n658m433
58029E45936n105p187q610r216j0288j1285j0527q664p912q168p379n495m484
$$ plain form
58016 441616 437006 432855 429968 427526 424526 421591 419658 418256 416591 414981 413752 412156 409802 407722
58002 407722 406595 405404 403267 401178 400487 400990 401895 403257 405176 406935 408180 409478 410648 410179 407525
57987 407525 404206 401387 398281 394380 391263 390303 390309 389345 387362 385162 382291 377987 372983 368423 364049
57972 364049 359228 354651 351317 348869 346519 344507 343091 341327 338551 335960 335040 335465 336114 336969 338371
57957 338371 339563 339747 339571 339901 340168 339481 338271 337222 335815 333693 332199 332593 333864 334350 334495 335823
57941 335823 338154 340165 342110 345619 351084 357343 363812 371025 379134 387654 396666 406670 417207 426987
57927 426987 435326 442346 447995 452075 454908 456868 457598 456699 454561 451474 446677 439576 431151 422813 414535
57912 414535 405559 396283 387920 380818 374550 369134 364749 360786 356604 352663 349535 346430 342222 337260
$$ packed form
58016D41616m610m151k887k442l000k935j933j402j665j610j229j596k354k080
58002D07722j127j191k137k089o91N03R05J362J919J759J245J298J170m69k654
57987D07525l319k819l106l901l117r60Or64j983k200k871m304n004m560m374
57972C64049m821m577l334k448k350k012j416j764k776k591r20M25O49Q55J402
57957C38371J192J84j76L30K67o87j210j049j407k122j494L94J271M86J45J328
57941C35823K331K011J945L509N465O259O469P213Q109Q520R012J0004J0537R780
57927D26987Q339P020N649M080K833J960P30q99k138l087m797p101q425q338q278
57912D14535q976r276q363p102o268n416m385l963m182l941l128l105m208m962
$$ plain form
57898 337260 332628 328203 323220 318212 314563 312400 310646 308991 308107 308034 307973 307713 307846 308629 309904 311984
57882 311984 315263 319169 322856 326608 331116 335657 338627 339750 340261 340866 340974 339932 337649 333974 328882
57867 328882 323327 318595 314754 310938 307071 303986 301886 300116 298484 297477 297032 296444 295750 295945 297507
57852 297507 299731 301766 303415 304802 306185 308156 311121 314479 317061 318306 318379 317504 316005 314498 313061
57837 313061 310734 306888 302481 298727 295210 290836 286084 282555 280611 279185 277745 276718 276088 275410 275222
57822 275222 276601 279154 281254 282526 284265 287014 289639 291421 293313 296219 299501 301988 303224 302925
57808 302925 300513 296120 291036 286391 282219 278311 274909 271978 268905 265598 262920 261401 260439 259378
57794 259378 258370 257608 256720 255652 255211 255958 257326 258511 259435 260200 260455 260084 259783 260187 261038 261972 263467
$$ packed form
57898C37260m632m425m983n008l649k163j754j655q84p3o1k60J33P83J275K080
57882C11984L279L906L687L752M508M541K970J123N11O05J08j042k283l675n092
57867C28882n555m732l841l816l867l085k100j770j632j007m45n88o94J95J562
57852B97507K224K035J649J387J383J971K965L358K582J245P3q75j499j507j437
57837C13061k327l846m407l754l517m374m752l529j944j426j440j027o30o78j88
57822B75222J379K553K100J272J739K749K625J782J892K906L282K487J236k99
57808C02925k412m393n084m645m172l908l402k931l073l307k678j519r62j061
57794B59378j008p62q88j068m41P47J368J185R24P65K55l71l01M04Q51R34J495
$$ plain form
57777 263467 266204 269923 273732 277258 280822 284717 288891 293199 297509 301641 305454 308866 311660 313540
57763 313540 314391 314203 312824 310221 306900 303512 300125 296492 292927 290050 287668 284867 281500 278720 277578
57748 277578 277753 278132 278101 277838 277727 277888 278031 277665 276659 275555 274881 274315 273066 270994 268730 266772 265126
57731 265126 263762 262672 261479 259703 257491 255408 253591 251794 250192 249289 249009 248651 247802 246548 244884
57716 244884 242736 240441 238320 235917 232632 228964 225974 223611 220867 217627 214937 213202 211528 209358
57702 209358 207422 206411 205807 204762 203212 201556 200087 199157 199016 199076 198343 196893 195834 195458 194763 193390
57686 193390 192559 193176 194311 194740 194923 196231 199009 202701 207236 213114 220590 229886 241779 256988 275308
57671 275308 296248 320165 347905 379881 416593 459498 509623 564498 617008 657842 679522
$$ packed form
57777B63467K737L719L809L526L564L895M174M308M310M132L813L412K794J880
57763C13540Q51j88j379k603l321l388l387l633l565k877k382k801l367k780j142
57748B77578J75L79l1k63j11J61J43l66j006j104o74n66j249k072k264j958j646
57731B65126j364j090j193j776k212k083j817j797j602r03k80l58q49j254j664
57716B44884k148k295k121k403l285l668k990k363k744l240k690j735j674k170
57702B09358j936j011o04j045j550j656j469r30j41O0p33j450j059l76o95j373
57686A93390q31O17J135M29J83J308K778L692M535N878P476R296J1893J5209J8320
57671B75308K0940K3917K7740L1976L6712M2905N0125N4875N2510M0834K1680
$$ plain form
57660 679522 679186 658866 623609 578921 529446 479265 432100 390430 354796 324645 299537 279078
57648 279078 262286 247966 235674 225706 218219 212873 209227 206939 205578 204645 203783 202761 201404 199844
57634 199844 198678 198511 199344 200602 201688 202386 202873 203405 203899 203853 202861 201106 199037 196776 194289 191932
57618 191932 190193 188969 187783 186635 185845 185070 183420 180813 178323 176788 175888 174911 173695 172393 171079
57603 171079 170027 169648 169690 169199 167776 166202 165347 165133 165059 165026 165029 164644 163528 161942 160273 158480 156424 154230
57585 154230 151920 149239 146210 143261 140508 137682 135101 133719 133615 133462 132306 130931 130455 130365 129162
57570 129162 126503 123573 121541 120560 120124 119578 118461 117046 116357 117070 118592 119778 120214 120288 120352 120417 120310
57553 120310 119634 118042 116113 115346 116545 118750 120503 121620 122815 124131 124823 124555 123736 122778 121919 121656
$$ packed form
57660F79522l36k0320l5257m4688m9475n0181m7165m1670l5634l0151k5108k0459
57648B79078j6792j4320j2292r968p487n346l646k288j361r33q62j022j357j560
57634A99844j166j67Q33J258J086O98M87N32M94m6r92j755k069k261k487k357
57618A91932j739j224j186j148p90p75j650k607k490j535r00r77j216j302j314
57603A71079j052l79M2m91j423j574q55k14p4l3Ll85j116j586j669j793k056k194
57585A54230k310k681l029k949k753k826k581j382j04j53j156j375m76r0j203
57570A29162k659k930k032r81m36n46j117j415o89P13J522J186M36P4O4O5j07
57553A20310o76j592j929p67J199K205J753J117J195J316O92k68q19r58q59k63
$$ plain form
57537 121656 122538 124507 127095 129996 132797 134518 134391 132930 131354 130103 128850 127813 127887 129244 130806
57522 130806 131552 131597 131556 131531 131288 130985 131079 131571 131800 131183 130045 129438 129974 131014 131355 130633 129542 128774 128410
57503 128410 128445 128993 129587 129182 127494 125603 124513 123791 122456 120532 118710 116956 114630 111793 109355 107858
57487 107858 106912 105875 104433 102562 100561 99094 98630 98897 99346 99874 100588 101200 101376 101344 101386 101049 99713
57470 99713 97771 96331 95768 95442 94852 94248 93995 94062 94311 94667 94924 94916 94944 95503 96614 97932 99366 100901
57452 100901 101899 101418 99444 97177 95852 95736 96378 97322 98364 99458 100623 101768 102640 103112 103358 103509
57436 103509 103391 102919 102421 102196 102079 101964 102358 103745 105598 106679 106357 105158 104152 104126 105105 106291 106706
57419 106706 106255 105760 105612 105059 103441 101480 100502 100859 101940 103252 104556 105324 105147 104425 103787 103097 101978
$$ packed form
57537A21656Q82J969K588K901K801J721j27j461j576j251j253j037P4J357J562
57522A30806P46M5m1k5k43l03R4M92K29o17j138o07N36J040L41p22j091p68l64
57503A28410L5N48N94m05j688j891j090p22j335j924j822j754k326k837k438j497
57487A07858r46j037j442j871k001j467m64K67M49N28P14O12J76l2M2l37j336
57470I9713j942j440n63l26n90o04k53O7K49L56K57qK8N59J111J318J434J535
57452A00901R98m81j974k267j325j16O42R44J042J094J165J145Q72M72K46J51
57436A03509j18m72m98k25j17j15L94J387J853J081l22j199j006k6R79J186M15
57419A06706m51m95j48n53j618j961r78L57J081J312J304P68j77p22o38o90j119
$$ plain form
57402 101978 100896 100608 100815 100585 99998 100099 101185 102324 102756 102677 102509 102420 102781 104085 106055 107650 108159
57385 108159 107681 106639 105681 105896 107936 110826 112762 113245 113388 113971 114450 114162 113310 112278 111102 110070
57369 110070 109851 110464 111081 111328 111816 112901 113945 114425 114786 115555 116541 117573 119050 120888 121845 120972 119134
57352 119134 118048 118227 118795 119004 119083 119692 121283 123878 126994 129881 132227 134352 136372 137573 137164 135352
57336 135352 133131 131190 129520 127954 126623 125802 125561 125601 125382 124516 123093 121490 119928 118390 116820 115102
57320 115102 113038 110780 109067 108422 108349 107956 107222 106820 106812 106471 105513 104518 103927 103499 103026 102699 102439 101745 100602
57301 100602 99710 99403 99109 98287 97096 95730 94007 92154 91110 91304 91786 91249 89378 86691 83699 80837
57285 80837 78522 76588 74169 70763 66927 63390 60071 56614 53374 51180 50493 51314 53463 56443 59518
$$ packed form
57402A01978j082k88K07k30n87J01J086J139M32p9j68q9L61J304J970J595N09
57385A08159m78j042r58K15K040K890J936M83J43N83M79k88q52j032j176j032
57369A10070k19O13O17K47M88J085J044M80L61P69R86J032J477J838R57q73j838
57352A19134j086J79N68K09P9O09J591K595L116K887K346K125K020J201m09j812
57336A35352k221j941j670j566j331q21k41M0k19q66j423j603j562j538j570j718
57320A15102k064k258j713o45p3l93p34m02ql41r58r95n91m28m73l27k60o94j143
57301A00602q92l07k94q22j191j366j723j853j044J94M82n37j871k687k992k862
57285H0837k315j934k419l406l836l537l319l457l240k194o87Q21K149K980L075
$$ plain form
57270 59518 62472 65882 70243 75360 80982 87324 94368 101372 107784 113994 120460 126684 131894 136191
57256 136191 140145 143680 146276 147980 149421 151057 153106 155832 159159 162270 164450 166086 168026 170124
57242 170124 171332 171204 170536 170350 170907 171902 173085 174426 175884 177235 178143 178575 179062 180182 181747 183017
57226 183017 183839 184941 186831 189070 191023 192613 193925 194848 195685 197330 200057 202809 204499 205389 206334
57211 206334 207237 207360 206781 206485 207125 208534 210297 212090 213647 215148 217401 220897 224946 228492 231433
57196 231433 234390 237517 240525 243647 247488 251908 255955 259022 261397 263735 266663 270755 275985 281204
57182 281204 284964 287050 288630 290903 294206 298289 302728 307071 311247 315879 321627 328265 334978 341374
57168 341374 347620 353843 360122 366836 374094 381091 387023 392635 399817 409474 420669 432001 442945
$$ packed form
57270E9518K954L410M361N117N622O342P044P004O412O210O466O224N210M297
57256A36191L954L535K596J704J441J636K049K726L327L111K180J636J940K098
57242A70124J208j28o68j86N57R95J183J341J458J351R08M32M87J120J565J270
57226A83017Q22J102J890K239J953J590J312R23Q37J645K727K752J690Q90R45
57211B06334R03J23n79k96O40J409J763J793J557J501K253L496M049L546K941
57196B31433K957L127L008L122L841M420M047L067K375K338K928M092N230N219
57182B81204L760K086J580K273L303M083M439M343M176M632N748O638O713O396
57168C41374O246O223O279O714P258O997N932N612P182R657J1195J1332J0944
$$ plain form
57155 442945 453648 464359 475472 487475 500481 514303 529071 545140 562283 579611 596505
57144 596505 613044 629501 646089 663265 681521 700686 720105 739674 759959 781178 802918
57133 802918 825151 848719 874344 901819 930570 960409 991377 1023387 1056474 1090941 1126899
57122 1126899 1164157 1202926 1244217 1289223 1338669 1393119 1453543 1521296 1597747 1684045 1780962
57111 1780962 1888863 2008094 2139209 2282508 2437740 2605143 2786807 2986363 3207563
57102 3207563 3454157 3731142 4045012 4402587 4810759 5277702 5813050 6426072 7124270
57093 7124270 7913748 8799060 9781140 10855802 12014852 13247738 14541652 15881715 17252240
57084 17252240 18635682 20008308 21340811 22612257 23829256 25027642 26243789 27471229
$$ packed form
57155D42945J0703J0711J1113J2003J3006J3822J4768J6069J7143J7328J6894
57144E96505J6539J6457J6588J7176J8256J9165J9419J9569K0285K1219K1740
57133H02918K2233K3568K5625K7475K8751K9839L0968L2010L3087L4467L5958
57122A126899L7258L8769M1291M5006M9446N4450O0424O7753P6451Q6298R6917
57111A780962J07901J19231J31115J43299J55232J67403J81664J99556K21200
57102C207563K46594K76985L13870L57575M08172M66943N35348O13022O98198
57093G124270P89478Q85312R82080J074662J159050J232886J293914J340063J370525
57084A7252240J383442J372626J332503J271446J216999J198386J216147J227440
$$ plain form
57076 27471229 28635465 29607427 30247019 30449471 30171114 29428637 28281135 26808743 25096986
57067 25096986 23228536 21279363 19316195 17394600 15558485 13840834 12264200 10840350
57059 10840350 9570510 8447714 7460389 6594940 5836838 5171742 4587343 4074492 3626382
57050 3626382 3236785 2899183 2607154 2354947 2137522 1950252 1788675 1648528 1526119
57041 1526119 1418732 1324561 1242180 1170164 1107273 1052830 1006740 969112 939798 918191 903572
57030 903572 895835 895781 904575 923240 953092 995986 1052248 1116901 1178059 1220540 1232701 1211359
57018 1211359 1161630 1092967 1014811 934222 855682 781936 714685 654702 601876 555677 515802
57007 515802 482160 454153 430302 409040 389945 373713 360720 350021 340191 330797 322393 315205
$$ packed form
57076B7471229J164236R71962O39592K02452k78357p42477j147502j472392j711757
57067B5096986j868450j949173j963168j921595j836115j717651j576634j423850
57059A0840350j269840j122796r87325q65449p58102o65096n84399n12851m48110
57050C626382l89597l37602k92029k52207k17425j87270j61577j40147j22409
57041A526119j07387r4171q2381p2016o2891n4443m6090l7628k9314k1607j4619
57030I03572p737n4Q794J8665K9852M2894N6262O4653O1158M2481J2161k1342
57018A211359m9729o8663p8156q0589p8540p3746o7251n9983n2826m6199l9875
57007E15802l3642k8007k3851k1262j9095j6232j2993j0699r830r394q404p188
$$ plain form
56995 315205 308622 302119 295945 290567 286102 282680 280707 280244 280704 281834 284508 289806 297642 306960 316831
56980 316831 326387 333921 337213 335107 328213 318028 306016 293516 281588 270527 260067 250352 242243
56967 242243 236510 233205 232001 232624 234779 238161 242846 249327 257988 268853 281912 297103 313584
56954 313584 329292 341525 348014 347674 340884 329200 314502 298298 281832 266439 253119 241899
56942 241899 232283 224375 218981 216601 216941 219575 224570 232340 243328 257835 275651 295931 317856
56929 317856 341037 364281 384157 396123 397614 389399 373834 352962 328584 302797 277334 252991
56917 252991 230438 210903 195252 182935 172686 163926 156792 151187 146547 142362 138423 134790 132008
56904 132008 130941 131835 133895 136323 139364 143733 149454 156019 163441 172309 182887 194906 208281 223374
$$ packed form
56995C15205o583o503o174n378m465l422j973m63M60J130K674N298P836R318R871
56980C16831R556P534L292k106o894j0185j2012j2500j1928j1061j0460r715q109
56967B42243n733l305j204O23K155L382M685O481Q661J0865J3059J5191J6481
56954C13584J5708J2233O489l40o790j1684j4698j6204j6466j5393j3320j1220
56942B41899r616p908n394k380L40K634M995P770J0988J4507J7816K0280K1925
56929C17856K3181K3244J9876J1966J491q215j5565k0872k4378k5787k5463k4343
56917B52991k2553j9535j5651j2317j0249q760p134n605m640m185l939l633k782
56904A32008j067Q94K060K428L041M369N721O565P422Q868J0578J2019J3375J5093
$$ plain form
56890 223374 240435 259351 280099 303005 328299 355623 383923 411467 435875 454507 465214
56879 465214 466989 460255 446770 429134 410037 391605 375101 360922 348997 339589 333703 332310
56867 332310 335277 341645 351125 364664 383342 407371 436600 471327 511850 557287 604887 649870
56855 649870 685775 706244 708057 692822 665448 631160 594094 557663 524747 497272 476252 462374
56843 462374 456030 456955 464563 478806 500232 529184 565520 609225 660812 720923 789643 865679
56831 865679 945003 1019772 1079419 1114219 1119016 1094586 1046378 982186 910064 836948 767954 706236
56819 706236 653277 609416 574477 548243 530615 521582 521089 528889 544450 567138 596612 633061
56807 633061 676948 728080 784104 839229 884804 912334 917027 899062 862141 811474 752775 691730
$$ packed form
56890B23374J7061J8916K0748K2906K5294K7324K8300K7544K4408J8632J0707
56879D65214J775o734j3485j7636j9097j8432j6504j4179j1925r408n886j393
56867C32310K967O368R480J3539J8678K4029K9229L4727M0523M5437M7600M4983
56855F49870L5905K0469J813j5235k7374l4288l7066l6431l2916k7475k1020j3878
56843D62374o344R25P608J4243K1426K8952L6336M3705N1587O0111O8720P6036
56831H65679P9324P4769N9647L4800M797k4430m8208o4192p2122p3116o8994o1718
56819G06236n2959m3861l4939k6234j7628r033m93P800J5561K2688K9474L6449
56807F33061M3887N1132N6024N5125M5575K7530M693j7965l6921n0667n8699o1045
$$ plain form
56795 691730 633069 579779 533169 493430 460189 433140 412538 398842 391716 389803 391819 397504
56783 397504 407320 421716 440973 465135 493153 521999 547014 563374 567583 558388 537023 506599
56771 506599 470854 433100 395850 360711 328329 298761 272168 248953 229188 212448 198362
56760 198362 186897 177850 170503 164001 157773 151505 145250 139669 135509 132565 129742 126426 123164 120750
56746 120750 119344 118787 118983 119420 119124 117726 115974 114596 113362 111922 110830 110797 111451 111738 111257 110437 109774
56729 109774 109603 110246 111589 112817 113289 113334 113554 113826 113774 113733 114263 115053 115308 115038 115015 115589 116410 117239 118166
56710 118166 119056 119612 119922 120223 120278 119759 119103 119087 119656 120052 120107 120525 121757 123383 124712 125312 124957 123787
56692 123787 122542 121919 121695 121180 120446 120266 120840 121466 121635 121559 121442 121041 120322 119818 120052 121048 122528 123992
$$ packed form
56795F91730n8661n3290m6610l9739l3241k7049k0602j3696p126j913K016N685
56783C97504R816J4396J9257K4162K8018K8846K5015J6360M209r195k1365l0424
56771E06599l5745l7754l7250l5139l2382k9568k6593k3215j9765j6740j4086
56760A98362j1465r047p347o502o228o268o255n581m160k944k823l316l262k414
56746A20750j406n57J96M37k96j398j752j378j234j440j092l3O54K87m81q20o63
56729A09774j71O43J343J228M72M5K20K72n2m1N30P90K55k70k3N74Q21Q29R27
56710A18166Q90N56L10L01N5n19o56j6N69L96N5M18J232J626J329O00l55j170
56692A23787j245o23k24n15p34j80N74O26J69p6j17m01p19n04K34R96J480J464
$$ plain form
56674 123992 124637 123995 122852 122739 124220 126319 127895 128883 129828 130883 131786 132472 133279 134689 136924 139569
56658 139569 141689 142792 143552 145042 147350 149642 151508 153442 155842 158302 160129 160985 160933 160534 160923 162928
56642 162928 165866 168008 168564 168465 168845 169593 169899 169476 168526 167047 164906 162351 159896 157814 156104 154718
56626 154718 153506 152185 150729 149590 149220 149443 149480 148564 146549 144051 141921 140371 138803 136768 134803
56611 134803 133751 133502 133163 132394 131812 131972 132756 133932 135468 136981 137663 137271 136631 136643 137287 138043 138822 139870
56593 139870 141083 141988 142357 142414 142483 142680 142914 143018 142923 142760 142733 142909 143239 143662 143981 143829 143081 142177 141682 141622
56573 141622 141610 141496 141500 141804 142448 143490 144912 146566 148601 151559 155457 159176 161580 163089 165293 169131
56557 169131 174242 179964 185845 191105 194722 196584 197827 199570 201759 203488 203984 203159 201704 200742 200820
$$ packed form
56674A23992O45o42j143j13J481K099J576R88R45J055R03O86Q07J410K235K645
56658A39569K120J103P60J490K308K292J866J934K400K460J827Q56n2l99L89K005
56642A62928K938K142N56r9L80P48L06m23r50j479k141k555k455k082j710j386
56626A54718j212j321j456j139l70K23L7r16k015k498k130j550j568k035j965
56611A34803j052k49l39p69n82J60P84J176J536J513O82l92o40J2O44P56P79J048
56593A39870J213R05L69N7O9J97K34J04r5j63k7J76L30M23L19j52p48r04m95o0
56573A41622j2j14ML04O44J042J422J654K035K958L898L719K404J509K204L838
56557A69131N111N722N881N260L617J862J243J743K189J729M96q25j455r62P8
$$ plain form
56542 200820 201225 200844 199652 198708 198771 199612 200586 201042 200314 198307 196149 195247 195574 195864 195521 195170 195175 194939 194173
56523 194173 193621 193893 194546 194994 195433 196186 196866 196869 196056 194503 192219 189539 187062 184866 182531 180226 178810
56506 178810 178476 178334 177783 177225 176851 175954 174256 172789 172409 172409 171672 170375 169340 168431 166894 164856 163222
56489 163222 162281 161556 161005 161362 163102 165694 167977 168962 168456 167282 166746 167511 169201 171188 173195 174892
56473 174892 175667 175420 175057 175528 176751 177917 178509 178596 178563 178915 179894 181016 181497 181341 181339 181779 182033 181751 181553
56454 181553 182015 182954 184210 186135 188569 190375 190884 190897 191342 191791 191359 190324 189767 190154 191213 192693 194302
56437 194302 195450 195925 196343 197173 197916 198054 198028 198390 198789 198819 199071 200131 201239 201293 200662 200678 201709 202990
56419 202990 203996 204698 204805 204076 203178 202969 203131 202763 202158 202594 204256 205727 205805 204825 203923 203881 204908 206666
$$ packed form
56542B00820M05l81j192r44O3Q41R74M56p28k007k158r02L27K90l43l51Nk36p66
56523A94173n52K72O53M48M39P53O80Lq13j553k284k680k477k196k335k305j416
56506A78810l34j42n51n58l74q97j698j467l80%p37j297j035r09j537k038j634
56489A63222r41p25n51L57J740K592K283R85n06j174n36P65J690J987K007J697
56473A74892P75k47l63M71J223J166N92Q7l3L52R79J122M81j56kM40K54k82j98
56454A81553M62R39J256J925K434J806N09J3M45M49m32j035n57L87J059J480J609
56437A94302J148M75M18Q30P43J38k6L62L99L0K52J060J108N4o31J6J031J281
56419B02990J006P02J07p29q98k09J62l68o05M36J662J471P8r80r02m2J027J758
$$ plain form
56401 206666 208277 208924 208660 208148 207779 207558 207652 208380 209835 212078 215315 219266 222856 225357 227362 229720
56385 229720 232061 233430 233897 234299 234692 234395 233426 232630 232324 232000 231471 231221 231504 232026 232692 233766 235185
56368 235185 236533 237761 239186 240774 242130 243140 243904 244238 244026 243787 244066 244524 244582 244603 245386 246749 247799
56351 247799 248361 248960 249512 249351 248575 248099 248276 248636 249121 250322 252261 254067 255195 256003 256859 257610 258147
56334 258147 258614 258906 258850 258955 260015 261930 263883 265705 267960 270632 273032 275206 278112 281924 285391
56319 285391 287520 288884 290551 292549 294154 295080 295717 296523 297698 299230 300983 302850 304805 306615 307848
56304 307848 308588 309713 311865 314606 317368 320655 325214 330479 335037 338429 341232 343659 345451 347024
56290 347024 349227 351863 353850 355035 356496 358861 361727 365004 369288 374435 379236 383222 387533 393193
$$ packed form
56401B06666J611O47k64n12l69k21R4P28J455K243L237L951L590K501K005K358
56385B29720K341J369M67M02L93k97r69p96l06l24n29k50K83N22O66J074J419
56368B35185J348J228J425J588J356J010P64L34k12k39K79M58N8K1P83J363J050
56351B47799N62N99N52j61p76m76J77L60M85J201J939J806J128Q08Q56P51N37
56334B58147M67K92n6J05J060J915J953J822K255K672K400K174K906L812L467
56319B85391K129J364J667J998J605R26O37Q06J175J532J753J867J955J810J233
56304C07848P40J125K152K741K762L287M559N265M558L392K803K427J792J573
56290C47024K203K636J987J185J461K365K866L277M284N147M801L986M311N660
$$ plain form
56276 393193 399605 405615 411233 417434 424874 433417 442495 451445 459920 468257 477134 486889 497620 509689
56262 509689 523371 538263 553946 570974 590159 611270 633718 658259 686520 718994 755118
56251 755118 795338 841227 893172 949757 1010091 1075091 1145648 1221011 1299946 1382217 1467910
56240 1467910 1556208 1645628 1734527 1820676 1901231 1973831 2036996 2089114 2128098 2152573 2162452
56229 2162452 2157913 2138925 2106310 2062117 2008275 1945829 1876065 1801310 1723889 1645121 1565871
56218 1565871 1487259 1410335 1335907 1265051 1198887 1137574 1080490 1027625 979660 936500 897059
56207 897059 860843 828415 799830 773982 750033 728151 708359 690064 673279 658843 646727
56196 646727 635528 624392 614106 605535 598386 592276 587543 584105 580823 577056 573632 571370 569802
$$ packed form
56276C93193O412O010N618O201P440Q543R078Q950Q475Q337Q877R755J0731J2069
56262E09689J3682J4892J5683J7028J9185K1111K2448K4541K8261L2474L6124
56251G55118M0220M5889N1945N6585O0334O5000P0557P5363P8935Q2271Q5693
56240A467910Q8298Q9420Q8899Q6149Q0555P2600O3165N2118L8984K4475R879
56229B162452m539j8988l2615m4193n3842o2446o9764p4755p7421p8768p9250
56218A565871p8612p6924p4428p0856o6164o1313n7084n2865m7965m3160l9441
56207H97059l6216l2428k8585k5848k3949k1882j9792j8295j6785j4436j2116
56196F46727j1199j1136j0286q571p149o110m733l438l282l767l424k262j568
$$ plain form
56183 569802 568257 566981 566277 565696 565034 564985 565931 567140 567993 568850 569956 570762 571221 572485 575360 579222 583273
56166 583273 587663 592529 597242 601550 606214 611584 616884 621859 627760 635636 644889 654545 664702 675682
56152 675682 687099 698877 712012 727259 744298 763151 785117 811226 841072 874121 910867
56141 910867 951816 996938 1047190 1104915 1171454 1245818 1326859 1414853 1509289 1606472 1700864
56130 1700864 1787731 1863576 1926160 1976260 2018225 2056846 2094100 2129435 2161290 2186844 2202229
56119 2202229 2205356 2197837 2182933 2162828 2138922 2112646 2083836 2049513 2006050 1951656 1885907 1809039
56107 1809039 1723640 1635279 1549246 1467736 1391555 1322585 1262540 1211109 1167500 1132279 1105574
56096 1105574 1085145 1068525 1055551 1046624 1040225 1034680 1030792 1030031 1031457 1033047 1034839 1038090 1042539
$$ packed form
56183E69802j545j276p04n81o62m9R46J209Q53Q57J106Q06M59J264K875L862M051
56166E83273M390M866M713M308M664N370N300M975N901P876R253R656J0157J0980
56152F75682J1417J1778J3135J5247J7039J8853K1966K6109K9846L3049L6746
56141I10867M0949M5122N0252N7725O6539P4364Q1041Q7994R4436R7183R4392
56130A700864Q6867P5845O2584N0100M1965L8621L7254L5335L1855K5554J5385
56119B202229L127p519j4904k0105k3906k6276k8810l4323m3463n4394o5749p6868
56107A809039q5399q8361q6033q1510p6181o8970o0045n1431m3609l5221k6705
56096A105574k0429j6620j2974q927o399n545l888p61J426J590J792L251M449
$$ plain form
56083 1042539 1047150 1052510 1059822 1068406 1076700 1084792 1093663 1102978 1112050 1121787 1133238 1145364 1156697
56070 1156697 1167968 1180586 1193896 1206691 1220034 1235657 1252724 1269205 1285370 1302940 1321797
56059 1321797 1340544 1359358 1379302 1399745 1419452 1439243 1460603 1482664 1503620 1524051 1545649
56048 1545649 1567709 1588284 1607895 1628723 1650833 1672622 1694282 1717576 1742746 1768812 1796105
56037 1796105 1825345 1855135 1883711 1912323 1943584 1977487 2012397 2048784 2088247 2129907 2171631
56026 2171631 2213982 2259193 2307127 2355971 2405933 2458335 2512201 2565801 2620527 2679097 2741058
56015 2741058 2804304 2869794 2940204 3015014 3091577 3169979 3252208 3337750 3424980 3515688 3613101
56004 3613101 3716544 3823215 3933949 4051850 4176703 4306560 4443445 4591217 4748988
$$ packed form
56083A042539M611N360P312Q584Q294Q092Q871R315R072R737J1451J2126J1333
56070A156697J1271J2618J3310J2795J3343J5623J7067J6481J6165J7570J8857
56059A321797J8747J8814J9944K0443J9707J9791K1360K2061K0956K0431K1598
56048A545649K2060K0575J9611K0828K2110K1789K1660K3294K5170K6066K7293
56037A796105K9240K9790K8576K8612L1261L3903L4910L6387L9463M1660M1724
56026B171631M2351M5211M7934M8844M9962N2402N3866N3600N4726N8570O1961
56015B741058O3246O5490P0410P4810P6563P8402Q2229Q5542Q7230R0708R7413
56004C613101J03443J06671J10734J17901J24853J29857J36885J47772J57771
$$ plain form
55995 4748988 4913038 5084116 5266240 5459558 5661440 5873629 6101091 6344775 6602930
55986 6602930 6878493 7177316 7500272 7845477 8217281 8624159 9068728 9549392 10071217
55977 10071217 10645239 11277423 11968715 12725920 13561969 14485826 15503693 16630575 17889562
55968 17889562 19300584 20883030 22669879 24706968 27040402 29720842 32820870 36433564
55960 36433564 40656850 45598878 51398262 58218045 66218676 75554683 86388340 98875831
55952 98875831 113151236 129378625 147842107 168962553 193226452 221077016 252639907
55945 252639907 287072127 321774664 352303133 373583548 381903913 376322118 358614850
55938 358614850 332127188 300511305 266955685 233879785 202883722 174853038 150149900
$$ packed form
55995D748988J64050J71078J82124J93318K01882K12189K27462K43684K58155
55986F602930K75563K98823L22956L45205L71804M06878M44569M80664N21825
55977A0071217N74022O32184O91292P57205Q36049R23857J017867J126882J258987
55968A7889562J411022J582446J786849K037089K333434K680440L100028L612694
55960C6433564M223286M942028N799384O819783Q000631R336007J0833657J2487491
55952I8875831J4275405J6227389J8463482K1120446K4263899K7850564L1562891
55945B52639907L4432220L4702537L0528469K1280415Q320365n581795j7707268
55938C58614850k6487662l1615883l3555620l3075900l0996063k8030684k4703138
$$ plain form
55931 150149900 128788833 110556305 95113512 82093483 71151014 61962384 54226523
55924 54226523 47686474 42136980 37407025 33349818 29851071 26827775 24209735 21931050
55916 21931050 19939404 18198114 16673291 15329035 14137404 13081429 12144402 11305772
55908 11305772 10550156 9870426 9258430 8701217 8189193 7719630 7289217 6890835 6520235
55899 6520235 6178290 5863782 5570796 5295749 5040376 4805275 4586767 4382522 4194251
55890 4194251 4022288 3863041 3714155 3577090 3452538 3338279 3233503 3140387 3059475 2987851
55880 2987851 2923273 2865400 2811586 2756369 2697082 2635690 2573518 2508449 2438860 2365904 2290226
55869 2290226 2210519 2127159 2043421 1961482 1880831 1802020 1728154 1661038 1599330 1541866 1489336
$$ packed form
55931A50149900k1361067j8232528j5442793j3020029j0942469r188630p735861
55924E4226523o540049n549494m729955m057207l498747l023296k618040k278685
55916B1931050j991646j741290j524823j344256j191631j055975r37027q38630
55908A1305772p55616o79730o11996n57213n12024m69563m30413l98382l70600
55899F520235l41945l14508k92986k75047k55373k35101k18508k04245j88271
55890D194251j71963j59247j48886j37065j24552j14259j04776r3116q0912p1624
55880B987851o4578n7873n3814n5217n9287o1392o2172o5069o9589p2956p5678
55869B290226p9707q3360q3738q1939q0651p8811p3866o7116o1708n7464n2530
$$ plain form
55858 1489336 1441363 1395501 1350688 1308495 1269734 1233112 1198332 1167040 1139331 1112628 1085373
55847 1085373 1058675 1033161 1007468 981135 955661 931343 906332 880213 855330 833113 812317
55836 812317 792354 775007 761045 748190 734414 720486 707497 694655 681386 669033 658508
55825 658508 648645 638642 629775 622882 616376 608477 599347 589502 578398 566256 555079 546027 537673
55812 537673 528498 519161 510723 502670 494498 487498 483123 480971 479823 479242 478956 478314 477641 478581 481845
55797 481845 486147 490352 494844 499711 503552 505460 506408 507307 507407 505932 503613 501273 498518 495110 491876
55782 491876 488880 484276 476402 465652 453181 439480 425421 412937 403185 395570 389913 387935 391195
55769 391195 398952 409200 420045 428822 431969 427747 417841 404907 390141 374545 360422 349402
$$ packed form
55858A489336m7973m5862m4813m2193l8761l6622l4780l1292k7709k6703k7255
55847A085373k6698k5514k5693k6333k5474k4318k5011k6119k4883k2217k0796
55836H12317j9963j7347j3962j2855j3776j3928j2989j2842j3269j2353j0525
55825F58508r863j0003q867o893o506p899r130r845j1104j2142j1177r052q354
55812E37673r175r337q438q053q172p000m375k152j148n81k86o42o73R40L264
55797D81845M302M205M492M867L841J908R48Q99J00j475k319k340k755l408l234
55782D91876k996m604p874j0750j2471j3701j4059j2484r752p615n657j978L260
55769C91195P757J0248J0845Q777L147m222r906j2934j4766j5596j4123j1020
$$ plain form
55757 349402 340434 331830 324018 318311 314169 309817 304607 298791 291870 283228 273802 265242 257921 251306
55743 251306 245594 241362 238187 235348 233366 233250 234587 235831 236150 235678 234373 231979 228855 225616 222265
55728 222265 218665 215413 213169 211527 209502 206664 202970 198173 192436 186866 182445 179037 176348 175036
55714 175036 175778 177953 180513 183515 187639 192734 197913 202617 206518 208963 209607 209116 208261 206758 203840
55699 203840 199383 193648 186662 178874 171638 165954 161289 156591 151787 147353 143235 139380 136550 135367
55685 135367 135137 134792 134395 134543 134998 135262 135915 137998 141404 145134 148755 152368 155478 157205 157415 156579
55669 156579 154798 152086 149236 147208 145880 144530 143286 142937 143470 143970 143960 143834 143998 144487 145355 146611
55653 146611 147838 148664 149460 150855 152776 154692 156528 158592 160848 162973 164946 166911 168785 170476 172010
$$ packed form
55757C49402q968q604p812n707m142m352n210n816o921q642r426q560p321o615
55743B51306n712m232l175k839j982j16J337J244L19m72j305k394l124l239l351
55728B22265l600l252k244j642k025k838l694m797n737n570m421l408k689j312
55714A75036P42K175K560L002M124N095N179M704L901K445O44m91q55j503k918
55699B03840m457n735o986p788p236n684m665m698m804m434m118l855k830j183
55685A35367k30l45l97J48M55K64O53K083L406L730L621L613L110J727K10q36
55669A56579j781k712k850k028j328j350j244l49N33N00j0j26J64M89Q68J256
55653A46611J227Q26P96J395J921J916J836K064K256K125J973J965J874J691J534
$$ plain form
55638 172010 172852 171754 168059 162616 156662 150447 143743 136929 130604 124770 119380 115004 111914 109238
55624 109238 106211 103551 102306 101934 101012 99362 97968 97128 96200 95045 94231 93770 92942 91468 89700 87667
55608 87667 85086 82340 80301 79112 78165 77295 76967 77298 77850 78355 78643 78035 75967 73218 71345 70836 70881
55591 70881 70914 71240 72000 72703 73090 73494 74096 74680 75244 75958 76420 75968 74930 74574 75514 76968 77939 78406 79083
55572 79083 80597 83109 86147 88725 90100 90467 90494 90428 90190 89935 89748 89150 87824 86465 85860 85426 83888
55555 83888 81277 79023 77987 77614 77192 76796 76701 76846 77169 77677 77966 77513 76559 75933 75994 76535 77553 79077
55537 79077 80336 80267 79019 77884 77589 77732 78005 78699 79748 80435 80452 80225 79891 79039 77845 77280 77670 78067
55519 78067 77539 76130 74148 71581 68861 67211 67406 68820 70189 70662 69808 67578 64832 62961 62290 61545
$$ packed form
55638A72010Q42j098l695n443n954o215o704o814o325n834n390m376l090k676
55624A09238l027k660j245l72r22j650j394q40r28j155q14m61q28j474j768k033
55608H7667k581k746k039j189r47q70l28L31N52N05K88o08k068k749j873n09M5
55591G0881L3L26P60P03L87M04O02N84N64P14M62m52j038l56R40J454R71M67O77
55572G9083J514K512L038K578J375L67K7o6k38k55j87n98j326j359o05m34j538
55555H3888k611k254j036l73m22l96r5J45L23N08K89m53r54o26O1N41J018J524
55537G9077J259o9j248j135k95J43K73O94J049O87J7k27l34q52j194n65L90L97
55519G8067n28j409j982k567k720j650J95J414J369M73q54k230k746j871o71p45
$$ plain form
55503 61545 59503 56463 53522 51195 49480 48581 48734 49697 51029 52534 54018 55065 55468 55484 55357 55082
55487 55082 54829 54954 55302 55254 54756 54567 55080 55705 55858 55727 55518 54854 53646 52794 53173 54455 55644 56267
55469 56267 56356 55769 54401 52769 51712 51646 52493 53986 55603 56674 57014 57058 57018 56494 55392 54573 54854 55843
55451 55843 56446 56206 55484 54704 54062 53747 53817 53977 53927 53710 53430 52931 52137 51363 50934 50897 51360 52533 54032
55432 54032 54862 54658 54365 54997 56305 57384 58037 58645 59155 59171 58858 58774 58903 58728 58306 58442 59719 61983
55414 61983 64868 68133 71319 73714 74947 75244 74968 74245 73171 71954 70668 69164 67405 65657 64225
55399 64225 63154 62270 61379 60381 59261 58048 56805 55701 55047 55081 55736 56803 58239 60013 61696 62645
55383 62645 62666 62111 61275 60190 59098 58476 58359 58201 57729 57359 57413 57557 57506 57694 58545 59537 59738 58994 57895
$$ packed form
55503F1545k042l040k941k327j715q99J53R63J332J505J484J047M03J6j27k75
55487E5082k53J25L48m8m98j89N13O25J53j31k09o64j208q52L79J282J189O23
55469E6267Q9n87j368j632j057o6Q47J493J617J071L40M4m0n24j102q19K81R89
55451E5843O03k40p22p80o42l15P0J60n0k17k80m99p94p74m29l7M63J173J499
55432E4032Q30k04k93O32J308J079O53O08N10J6l13q4J29j75m22J36J277K264
55414F1983K885L265L186K395J233K97k76p23j074j217j286j504j759j748j432
55399F4225j071q84q91r98j120j213j243j104o54L4O55J067J436J774J683R49
55383F2645K1n55q36j085j092o22j17j58m72l70N4J44n1J88Q51R92K01p44j099
$$ plain form
55364 57895 56739 55234 53202 51004 49164 47996 47596 47896 48674 49741 51056 52484 53598 54001 53728 53209
55348 53209 53003 53601 55065 56707 57502 57127 56211 55393 54694 54052 53740 53713 53253 52035 50989 51250 52593 53830
55330 53830 54474 55057 55920 56707 57177 57630 58245 58664 58525 57880 56851 55432 53921 52994 53028 53604 54008 53948 53674
55311 53674 53608 54038 54873 55515 55255 54009 52494 51493 51150 51161 51432 52177 53325 54155 53853 52411 50734 49705
55293 49705 49441 49651 50405 51923 53753 54933 55196 55357 56152 57278 58040 58424 58884 59446 59786 59982 60488 61321
55275 61321 61839 61479 60317 58879 57760 57418 57958 58998 59975 60649 61164 61718 62338 62847 62950 62562 62205 62727
55257 62727 64310 66106 67190 67532 67604 67399 66515 64975 63354 62162 61645 62021 63226 64431 64506 63171 61248
55240 61248 59702 58913 58895 59612 60812 61999 62813 63158 62915 61967 60663 59720 59398 59136 58370 57401 57076 57767
$$ packed form
55364E7895j156j505k032k198j840j168m00L00P78J067J315J428J114M03k73n19
55348E3209k06N98J464J642P95l75r16q18o99o42l12k7m60j218j046K61J343J237
55330E3830O44N83Q63P87M70M53O15M19j39o45j029j419j511r27L4N76M04o0k74
55311E3674o6M30Q35O42k60j246j515j001l43J1K71P45J148Q30l02j442j677j029
55293D9705k64K10P54J518J830J180K63J61P95J126P62L84M60N62L40J96N06Q33
55275F1321N18l60j162j438j119l42N40J040R77O74N15N54O20N09J03l88l57N22
55257F2727J583J796J084L42P2k05q84j540j621j192n17L76J205J205P5j335j923
55240F1248j546p89j8P17J200J187Q14L45k43r48j304r43l22k62p66r69l25O91
$$ plain form
55222 57767 58993 59949 60218 59972 59661 59490 59213 58543 57749 57592 58497 59981 61089 61318 60944 60513 60302 60338
55204 60338 60685 61432 62424 63265 63680 63669 63276 62473 61466 60734 60434 60024 59012 57849 57495 58191 59287 60278
55186 60278 61237 62115 62423 61970 61241 60696 60349 60357 61210 62730 63689 63236 62170 61923 62709 63522 63599 62993 61960
55167 61960 60775 60058 60336 61192 61632 61436 61428 62302 63859 65584 67279 68837 69915 70163 69548 68350 67121
55150 67121 66513 66751 67282 67425 67221 67251 67719 68284 68748 69265 69849 70231 70281 70102 69707 69082 68546 68514 68921 69388
55130 69388 69838 70383 70752 70598 70277 70508 71223 71635 71503 71399 71549 71409 70771 70280 70357 70466 70093 69612 69510
55111 69510 69481 69114 68863 69405 70452 71042 70809 70176 69547 69040 68902 69376 70134 70552 70628 70992 71884 72717 72903
55092 72903 72635 72512 72727 72991 73108 73221 73468 73626 73290 72384 71312 70604 70498 70984 72023 73463 74905 75970
$$ packed form
55222E7767J226R56K69k46l11j71k77o70p94j57R05J484J108K29l74m31k11L6
55204F0338L47P47R92Q41M15j1l93q03j007p32l00m10j012j163l54O96J096R91
55186F0278R59Q78L08m53p29n45l47QQ53J520R59m53j066k47P86Q13P7o06j033
55167F1960j185p17K78Q56M40j96qQ74J557J725J695J558J078K48o15j198j229
55150F7121o08K38N31J43k04L0M68N65M64N17N84L82N0j79l95o25n36l2M07M67
55130F9388M50N45L69j54l21K31P15M12j32j04J50j40o38m91P7J09l73m81j02
55111F9510k9l67k51N42J047N90k33o33o29n07j38M74P58M18P6L64Q92Q33J86
55092G2903k68j23K15K64J17J13K47J58l36r06j072p08j06M86J039J440J442J065
$$ plain form
55074 75970 76647 77076 77129 76662 76115 76215 76924 77287 76665 75575 74901 74742 74595 74333 74319 74670 74988 74901 74419 73666
55054 73666 72680 71652 71091 71468 72754 74403 75778 76529 76642 76231 75385 74255 73126 72298 71897 71934 72420
55037 72420 73245 74038 74432 74442 74336 74193 73921 73738 74135 75217 76377 76909 76778 76584 76943 77933 78969 79190
55019 79190 78304 77108 76801 77640 78670 78945 78568 78256 78352 78724 79325 80203 81078 81461 81291 81077 81241 81599 81625
55000 81625 81033 79975 78773 77663 76828 76535 77054 78365 80077 81809 83562 85524 87529 89006 89585 89551
54984 89551 89507 89738 90008 89890 89163 87947 86608 85596 85272 85713 86487 86699 85672 83780 82372 82537 84086
54967 84086 85982 87514 88657 89550 90167 90479 90477 90000 88939 87647 86767 86652 87262 88478 89994 91048 90966
54950 90966 90082 89476 89630 89931 89702 89060 88494 88190 88174 88569 89290 89879 90050 90012 89941 89634 89089 88936 89741 91172
$$ packed form
55074G5970O77M29N3m67n47J00P09L63o22j090o74j59j47k62j4L51L18q7m82p53
55054G3666r86j028n61L77J286J649J375P51J13m11q46j130j129q28m01L7M86
55037G2420Q25P93L94J0j06j43k72j83L97J082J160N32j31j94L59R90J036K21
55019G9190q86j196l07Q39J030K75l77l12R6L72O01Q78Q75L83j70k14J64L58K6
55000H1625n92j058j202j110q35k93N19J311J712J732J753J962K005J477N79l4
54984H9551m4K31K70j18p27j216j339j012l24M41P74K12j027j892j408J65J549
54967H4086J896J532J143Q93O17L12km77j061j292q80j15O10J216J516J054q2
54950I0966q84o06J54L01k29o42n66l04j6L95P21N89J71l8p1l07n45j53Q05J431
$$ plain form
54930 91172 92361 92869 92910 92906 93256 94262 95827 97426 98818 100569 103448 107417 111690 115677 119456 123378
54914 123378 127564 131808 135753 139100 141749 143667 144587 144132 142271 139343 135580 131047 126145 121600 117671
54899 117671 113955 110335 107444 105679 104329 102469 100253 98556 97666 97174 96925 97157 97732 98117 98252 98682
54883 98682 99661 100811 101848 102956 104202 105251 106092 107457 110084 113967 118737 124277 130360 136026 140143
54868 140143 142667 144661 146796 148337 148076 145938 143019 140037 136409 131241 124782 118310 112773 108112
54854 108112 103901 100081 96864 94439 92980 92506 92497 92138 91241 90506 90456 90537 89791 88085 86174 84714 83800
54837 83800 83342 83285 83379 83184 82544 81829 81586 82062 83086 84253 85231 85896 86215 86094 85585 85097 85029 85156 84884
54818 84884 84130 83449 83161 83041 83113 83934 85579 87047 87426 87073 86862 86828 86524 86345 87345 89696 92305 94123
$$ packed form
54930I1172J189N08M1mL50J006J565J599J392J751K879L969M273L987L779L922
54914A23378M186M244L945L347K649J918R20m55j861k928l763m533m902m545l929
54899A17671l716l620k891j765j350j860k216j697q90m92k49K32N75L85J35M30
54883I8682R79J150J037J108J246J049Q41J365K627L883M770N540O083N666M117
54868A40143K524J994K135J541k61k138k919k982l628n168o459o472n537m661
54854A08112m211l820l217k425j459m74rl59q97p35n0Q1p46j706j911j460r14
54837H3800m58n7R4j95o40p15k43M76J024J167R78O65L19j21n09m88o8J27k72
54818H4884p54o81k88j20P2Q21J645J468L79l53k11l4l04j79J000K351K609J818
$$ plain form
54800 94123 95040 95312 94876 93596 91676 89576 87842 87095 87653 89104 90697 92226 94029 96054 97567 98028
54784 98028 97737 97400 97459 98084 99343 101014 102509 103282 103218 102555 101700 101215 101652 103169 105442 108059 110821
54767 110821 113699 116736 120067 123805 127906 132314 137168 142598 148349 153867 158705 162606 165298 166525
54753 166525 166212 164345 160835 155808 149878 143774 137843 132257 127484 123997 121560 119331 116732 113920
54739 113920 111460 109839 109168 109039 108881 108733 109258 110495 111184 110100 107707 105579 104503 104211 104739 106682
54723 106682 109863 112998 115270 117375 120495 124971 130434 136434 142353 147350 151023 153708 155713 156665
54709 156665 156013 153750 150316 146206 141918 137769 133563 128970 124407 120809 118273 115764 112558 109223
54695 109223 106708 105191 104333 103889 103460 102432 100887 99904 100173 100969 101266 101168 101284 101300 100393 98739 97499
$$ packed form
54800I4123R17K72m36j280j920k100j734p47N58J451J593J529J803K025J513M61
54784I8028k91l37N9O25J259J671J495P73o4o63q55m85M37J517K273K617K762
54767A10821K878L037L331L738M101M408M854N430N751N518M838L901K692J227
54753A66525l13j867l510n027n930o104n931n586m773l487k437k229k599k812
54739A13920k460j621o71j29j58j48N25J237O89j084k393k128j076k92N28J943
54723A06682L181L135K272K105L120M476N463O000N919M997L673K685K005R52
54709A56665o52k263l434m110m288m149m206m593m563l598k536k509l206l335
54695A09223k515j517q58m44m29j028j545r83K69P96K97r8J16J6r07j654j240
$$ plain form
54678 97499 97316 97817 98496 99195 99692 99699 99417 99401 99753 100061 100115 100027 99711 98984 98201 98033 98477 98770 98473 97959 97634
54657 97634 97360 96905 96387 95915 95276 94336 93392 92861 92944 93772 95358 97114 97876 96989 95174 93883 93893 94794
54639 94794 95720 96214 96328 96269 96200 96301 96743 97463 98086 98304 98292 98477 98849 98857 98146 97102 96384 96198 96350 96728
54619 96728 97272 97626 97350 96495 95666 95467 96138 97592 99461 101184 102453 103517 104701 105731 105981 105401 104706
54602 104706 104526 104770 104895 104437 103159 101091 98711 96814 95969 96186 97125 98316 99151 99121 98419 98075 99037
54585 99037 101181 103413 104749 105042 104669 103850 102589 101236 100626 101305 102742 103735 103677 103106 102908 103362 104167
54568 104167 105017 105754 106241 106465 106605 106715 106579 106224 106234 107055 108207 108745 108372 107549 106646 105648 104711 104332 104757
54549 104757 105739 107023 108576 110156 111175 111344 111076 110982 111287 111947 112967 114286 115613 116665 117456 118202
$$ packed form
54678I7499j83N01O79O99M97Pk82j6L52L08N4q8l16p27p83j68M44K93k97n14l25
54657I7634k74m55n18m72o39r40r44n31Q3Q28J586J756P62q87j815j291J0R01
54639I4794R26M94J14n9o9J01M42P20O23K18j2J85L72Qp11j044p18j86J52L78
54619I6728N44L54k76q55q29j99O71J454J869J723J269J064J184J030K50n80o95
54602A04706j80K44J25m58j278k068k380j897q45K17R39J191Q35l0p02l44R62
54585I9037K144K232J336K93l73q19j261j353o10O79J437R93n8n71j98M54Q05
54568A04167Q50P37M87K24J40J10j36l55J0Q21J152N38l73q23r03r98r37l79M25
54549A04757R82J284J553J580J019J69k68r4L05O60J020J319J327J052P91P46
$$ plain form
54533 118202 119074 120099 121091 121660 121589 121232 121135 121225 120862 119825 118691 117957 117304 116156 114533 112861 111322
54516 111322 109932 108971 108704 108829 108794 108608 108749 109291 109718 109774 109938 110729 111939 112901 113277 113225 113004 112810 112943
54497 112943 113690 114887 115885 116178 115930 115659 115511 115146 114403 113736 113774 114634 115921 117287 118645 119836 120453
54480 120453 120231 119462 118866 119079 120254 121977 123523 124369 124613 124812 125332 125948 126126 125642 124834 124370 124702 125636
54462 125636 126417 126488 126141 126213 127066 128185 128893 129114 129210 129357 129458 129428 129200 128578 127510 126418 125842 125717 125458
54443 125458 124856 124422 124621 125178 125491 125390 125044 124334 122942 121079 119581 118997 118991 118926 118743 118897 119607 120640
54425 120640 121762 122992 124325 125588 126731 127919 129129 129933 129955 129389 128751 128273 127854 127534 127586 128000 128207
54408 128207 127602 126286 125094 124841 125634 126925 128100 128893 129327 129480 129475 129550 129951 130774 132028 133730 135737
$$ packed form
54533A18202Q72J025R92N69p1l57r7R0l63j037j134p34o53j148j623j672j539
54516A11322j390r61k67J25l5j86J41N42M27N6J64P91J210R62L76n2k21j94J33
54497A12943P47J197R98K93k48k71j48l65p43o67L8Q60J287J366J358J191O17
54480A20453k22p69n96K13J175J723J546Q46K44J99N20O16J78m84q08m64L32R34
54462A25636P81P1l47P2Q53J119P08K21R6J47J01l0k28o22j068j092n76j25k59
54443A25458o02m34J99N57L13j01l46p10j392j863j498n84oo5j83J54P10J033
54425A20640J122J230J333J263J143J188J210Q04K2n66o38m78m19l20N2M14K07
54408A28207o05j316j192k53P93J291J175P93M34J53nP5M01Q23J254J702K007
$$ plain form
54391 135737 137575 138743 139177 139106 138482 137025 134963 133213 132494 132612 132947 133273 133657 133898 133679 133152 132797
54374 132797 132694 132434 131807 131146 130978 131630 133186 135333 137267 138275 138546 138962 139934 140929 141353 141360 141383 141356 140919
54355 140919 140177 139719 139958 140855 142226 143888 145457 146386 146461 146082 145910 146334 147381 148987 151083 153306 154890
54338 154890 155156 154176 152639 150992 149025 146549 144118 142574 141964 141486 140560 139431 138527 137720 136594 135096
54322 135096 133541 132178 131117 130553 130692 131412 132257 132783 132847 132593 132272 132016 131719 131204 130528 129955 129589 129253
54304 129253 128842 128563 128651 129032 129496 129978 130437 130612 130214 129321 128322 127509 126942 126621 126514 126428 126138 125746 125697 126314
54284 126314 127410 128466 129148 129539 129877 130149 130062 129413 128342 127108 125760 124293 123113 122940 124024 125695
54268 125695 126967 127461 127529 127629 127888 128238 128629 128998 129193 129097 128767 128442 128441 128995 130036 131172 131948 132216 132198
$$ packed form
54391A35737J838J168M34p1o24j457k062j750p19J18L35L26L84K41k19n27l55
54374A32797j03k60o27o61j68O52J556K147J934J008K71M16R72R95M24PK3k7m37
54355A40919p42m58K39Q97J371J662J569R29P5l79j72M24J047J606K096K223J584
54338A54890K66r80j537j647j967k476k431j544o10m78r26j129r04q07j126j498
54322A35096j555j363j061n64J39P20Q45N26O4k54l21k56k97n15o76n73l66l36
54304A29253m11k79Q8L81M64M82M59J75l98q93r99q13n67l21j07q6k90l92m9O17
54284A26314J096J056O82L91L38K72q7o49j071j234j348j467j180j73J084J671
54268A25695J272M94O8J00K59L50L91L69J95r6l30l25jN54J041J136P76K68j8
$$ plain form
54249 132198 132200 132327 132415 132188 131501 130540 129812 129811 130651 132012 133445 134697 135704 136302 136107 134870 132986 131389
54231 131389 130722 130691 130483 129767 128983 128615 128550 128318 127707 126896 126120 125492 125077 124980 125336 126211 127438 128515 128829
54212 128829 128181 126999 125954 125478 125669 126378 127207 127658 127609 127523 127910 128610 128928 128518 127865 127762 128453 129468
54194 129468 130232 130666 131058 131470 131561 131140 130644 130646 130953 130704 129522 128119 127421 127447 127512 127262 126974 126894 126815 126476
54174 126476 125958 125510 125216 125013 124837 124650 124448 124307 124257 124136 123775 123386 123453 124101 124802 124913 124322 123408 122554
54155 122554 121965 121789 122068 122482 122430 121583 120308 119421 119531 120595 122020 123103 123444 123161 122828 123113 124243
54138 124243 125719 126710 126866 126692 126933 127661 128242 128279 128297 129200 131177 133435 135011 135573 135380 134835 134278 133957
54120 133957 133854 133700 133463 133655 134730 136278 137330 137508 137315 137112 136494 135146 133768 133425 134206 135236 135919
$$ packed form
54249A32198KJ27Q8k27o87r61p28jQ40J361J433J252J007N98j95j237j884j597
54231A31389o67l1k08p16p84l68o5k32o11q11p76o28m15r7L56Q75J227J077L14
54212A28829o48j182j045m76J91P09Q29M51m9q6L87P00L18m10o53j03O91J015
54194A29468P64M34L92M12R1m21m96KL07k49j182j403o98K6O5k50k88q0p9l39
54174A26476n18m48k94k03j76j87k02j41n0j21l61l89O7O48P01J11n91r14q54
54155A22554n89j76K79M14n2q47j275q87J10J064J425J083L41k83l33K85J130
54138A24243J476R91J56j74K41P28N81L7J8R03J977K258J576N62j93n45n57l21
54120A33957j03j54k37J92J075J548J052J78j93k03o18j348j378l43P81J030O83
$$ plain form
54103 135919 136405 136756 136489 135420 134376 134433 135627 136930 137425 137141 136708 136504 136305 135672 134519 133305 132669
54086 132669 132970 134156 135908 137776 139377 140676 141928 143104 143627 143144 142403 142739 144532 146736 148155
54071 148155 148748 149373 150709 152778 155258 157764 159941 161580 162697 163558 164763 167185 171296 176448 181334
54056 181334 185440 189629 195060 202055 210287 219363 228562 236486 241765 243977 243412 240347 235240 229282
54042 229282 223805 219149 214861 211027 208502 207698 207990 208706 210001 212314 215518 219170 223206 227818 232861
54027 232861 237833 242323 246065 248732 250137 250697 251315 252589 254266 255541 255829 255206 254249 253523 253181 252902
54011 252902 252135 250464 247850 244530 240653 236117 230890 225360 220067 215164 210478 206092 202429 199595
53997 199595 197145 194775 192761 191370 190267 189030 187835 187042 186395 185258 183453 181255 178794 176175 174039
$$ packed form
54103A35919M86L51k67j069j044N7J194J303M95k84m33k04j99o33j153j214o36
54086A32669L01J186J752J868J601J299J252J176N23m83p41L36J793K204J419
54071A48155N93O25J336K069K480K506K177J639J117Q61J205K422M111N152M886
54056A81334M106M189N431O995Q232R076R199P924N279K212n65l065n107n958
54042B29282n477m656m288l834k525q04K92P16J295K313L204L652M036M612N043
54027B32861M972M490L742K667J405N60O18J274J677J275K88o23r57p26l42k79
54011B52902p67j671k614l320l877m536n227n530n293m903m686m386l663k834
53997A99595k450k370k014j391j103j237j195p93o47j137j805k198k461k619k136
$$ plain form
53982 174039 173126 173208 173249 172736 172155 171939 171781 171305 170702 170217 169590 168528 167278 166259 165579 165373 166196 168458
53964 168458 171721 175088 178114 180925 183630 186169 188675 191539 195040 199072 203211 206928 209904 212321
53950 212321 214568 216444 216993 215526 212624 209739 207949 207397 207720 208577 209823 211627 214429 218396 222942
53935 222942 227112 230496 233436 236344 239210 241918 244689 247914 251669 255587 259204 262360 265319 268524
53921 268524 272191 276182 280291 284607 289453 295034 301307 308255 316109 325104 334989 344993 354469 363544
53907 363544 372878 382745 392670 402132 411210 419971 427475 432077 432799 429879 423921 415257 404453 392742
53893 392742 381331 370600 360420 350819 341801 332913 323742 314678 306495 299146 291669 283449 275110
53880 275110 267932 262658 258924 255576 251501 246529 241561 237539 234301 230887 226928 223179 220502 218850
$$ packed form
53982A74039r13Q2M1n13n81k16j58m76o03m85o27j062j250j019o80k06Q23K262
53964A68458L263L367L026K811K705K539K506K864L501M032M139L717K976K417
53950B12321K247J876N49j467k902k885j790n52L23Q57J246J804K802L967M546
53935B22942M170L384K940K908K866K708K771L225L755L918L617L156K959L205
53921B68524L667L991M109M316M846N581O273O948P854Q995R885J0004R476R075
53907C63544R334R867R925R462R078Q761P504M602P22k920n958q664j0804j1711
53893C92742j1411j0731j0180r601r018q888r171r064q183p349p477q220q339
53880B75110p178n274l734l348m075m972m968m022l238l414l959l749k677j652
$$ plain form
53866 218850 217616 216460 215302 213747 211224 207756 204132 201086 198594 196188 193778 191900 191104 191295 191768
53851 191768 191814 191264 190531 190225 190595 191165 190939 189239 186420 183656 181943 181400 181421 181246 180405 178999 177712
53834 177712 177220 177399 177486 177201 177236 178159 179258 179189 177668 175930 175412 176436 178226 179780 180542 180654 180754 181348
53816 181348 182309 183229 184144 185508 187425 189408 191073 192656 194583 196928 199564 202538 205979 209851 214072
53801 214072 218668 223549 228349 232812 237207 242037 247386 252744 257409 260932 263302 264935 266386 267893
53787 267893 269272 270379 271428 272632 273707 274089 273626 272684 271538 269943 267430 263839 259411 254507 249421
53772 249421 244382 239561 234990 230541 226118 221904 218247 215222 212440 209497 206492 203827 201561 199379
53758 199379 197286 195869 195609 196179 196739 196679 195833 194287 192379 190708 189609 188697 187279 185256 183220 181746
$$ packed form
53866B18850j234j156j158j555k523l468l624l046k492k406k410j878p96J91M73
53851A91768M6n50p33l06L70N70k26j700k819k764j713n43K1j75q41j406j287
53834A77712m92J79Q7k85L5R23J099o9j521j738n18J024J790J554P62J12J00N94
53816A81348R61R20R15J364J917J983J665J583J927K345K636K974L441L872M221
53801B14072M596M881M800M463M395M830N349N358M665L523K370J633J451J507
53787B67893J379J107J049J204J075L82m63r42j146j595k513l591m428m904n086
53772B49421n039m821m571m449m423m214l657l025k782k943l005k665k266k182
53758A99379k093j417k60N70N60o0q46j546j908j671j099r12j418k023k036j474
$$ plain form
53742 181746 181011 181074 182005 183529 185012 186041 186781 187578 188484 189329 189893 189894 189205 188358 188447 190117 192828 195452
53724 195452 197380 198713 199681 200403 201067 201801 202318 202133 201221 200088 199176 198604 198504 199126 200400 201812 203026
53707 203026 204326 206230 208897 212151 215790 219522 222802 225171 226804 228499 231024 234422 237837 240072
53693 240072 240690 240696 241800 244692 248324 251116 252573 253326 253938 254308 254125 253270 251691 249465 247196 245853
53677 245853 245852 246575 247013 246673 245722 244623 243921 244057 244981 246015 246422 246082 245453 244972 244710 244521 244257 243821 243204
53658 243204 242453 241536 240288 238690 237177 236414 236605 237122 236976 235754 234073 232991 232955 233433 233658 233544 233603
53641 233603 234144 234972 235881 236961 238230 239350 240068 240644 241499 242612 243614 244365 245087 245987 247056 248207
53625 248207 249348 250367 251398 253049 255991 260195 264894 269430 273841 278468 283219 287537 291043 294007
$$ packed form
53742A81746p35O3R31J524J483J029P40P97R06Q45N64Jo89q47Q9J670K711K624
53724A95452J928J333R68P22O64P34N17j85r12j133r12n72j00O22J274J412J214
53707B03026J300J904K667L254L639L732L280K369J633J695K525L398L415K235
53693B40072O18OJ104K892L632K792J457P53O12L70j83q55j579k226k269j343
53677B45853jP23M38l40r51j099p02J36R24J034M07l40o29m81k62j89k64m36o17
53658B43204p51r17j248j598j513p63J91N17j46j222j681j082l6M78K25j14N9
53641B33603N41Q28R09J080J269J120P18N76Q55J113J002P51P22R00J069J151
53625B48207J141J019J031J651K942M204M699M536M411M627M751M318L506K964
$$ plain form
53611 294007 297142 300973 305383 309760 313586 316888 320050 323343 326813 330524 334532 338499 341679 343697
53597 343697 345210 347440 350888 354766 357863 359804 361195 362638 363999 364758 364740 364107 362818 360543 357163
53582 357163 352948 348077 342402 336054 329984 325429 322827 321564 320745 319890 318821 317359 315459 313493 312026
53567 312026 311217 310592 309539 307992 306518 305685 305469 305435 305412 305749 306840 308636 310721 312670 314225 315401
53551 315401 316617 318470 321016 323508 325226 326383 327790 329731 331770 333661 335812 338599 341784 345072
53537 345072 348818 353608 359328 365190 370655 375930 381584 388111 395885 404975 414778 424291 433195 442396
53523 442396 453005 464928 477037 488774 500943 514589 529564 544836 560036 576014 593689
53512 593689 612857 632500 651969 671473 691547 712481 734300 756927 780121 803374 826148
$$ packed form
53611B94007L135L831M410M377L826L302L162L293L470L711M008L967L180K018
53597C43697J513K230L448L878L097J941J391J443J361P59j8o33j289k275l380
53582C57163m215m871n675o348o070m555k602j263q19q55j069j462j900j966j467
53567C12026q09o25j053j547j474q33k16l4k3L37J091J796K085J949J555J176
53551C15401J216J853K546K492J718J157J407J941K039J891K151K787L185L288
53537C45072L746M790N720N862N465N275N654O527P774R090R803R513Q904R201
53523D42396J0609J1923J2109J1737J2169J3646J4975J5272J5200J5978J7675
53512E93689J9168J9643J9469J9504K0074K0934K1819K2627K3194K3253K2774
$$ plain form
53501 826148 848248 869845 891039 911516 930877 949351 967830 986931 1006174 1024507 1041584
53490 1041584 1058120 1074974 1092322 1109878 1127362 1144459 1160766 1176228 1191297 1206234 1220563
53479 1220563 1233737 1246097 1258514 1271165 1283255 1293894 1302726 1309661 1314589 1317446 1318084 1316009 1310852
53466 1310852 1303224 1294395 1284834 1273685 1260116 1244626 1228436 1212102 1195423 1178424 1161580 1144979
53454 1144979 1127952 1109798 1090552 1070836 1051228 1031889 1012682 993545 974831 957173 940790
53443 940790 925071 909241 893535 879314 867773 858809 851386 844768 839039 834438 830691 827345 824617
53430 824617 823511 824928 828819 834415 841130 848928 857802 867316 876996 887037 898283 911458 926604
53417 926604 943252 960976 979716 999727 1021319 1044580 1069249 1094926 1121444 1148963 1177695
$$ packed form
53501H26148K2100K1597K1194K0477J9361J8474J8479J9101J9243J8333J7077
53490A041584J6536J6854J7348J7556J7484J7097J6307J5462J5069J4937J4329
53479A220563J3174J2360J2417J2651J2090J0639Q832O935M928K857O38k075n157
53466A310852p628q829r561j1149j3569j5490j6190j6334j6679j6999j6844j6601
53454A144979j7027j8154j9246j9716j9608j9339j9207j9137j8714j7658j6383
53443I40790j5719j5830j5706j4221j1541q964p423o618n729m601l747l346k728
53430H24617j106J417L891N596O715P798Q874R514R680J0041J1246J3175J5146
53417I26604J6648J7724J8740K0011K1592K3261K4669K5677K6518K7519K8732
$$ plain form
53406 1177695 1207696 1239068 1272241 1307725 1345515 1384984 1425563 1467399 1511069 1556706 1603688
53395 1603688 1651297 1699413 1748382 1798378 1849143 1900234 1951295 2002119 2052635 2102805 2152352
53384 2152352 2200545 2246434 2289380 2329305 2366484 2401232 2433684 2463596 2490292 2512994 2531354
53373 2531354 2545562 2555925 2562388 2564489 2561604 2553153 2538689 2517907 2490700 2457298 2418411 2375121
53361 2375121 2328544 2279668 2229447 2178659 2127472 2075495 2022667 1969925 1918569 1869110 1821241
53350 1821241 1774787 1730009 1686841 1644500 1602254 1560172 1518789 1478394 1439031 1400946 1364596
53339 1364596 1330304 1298134 1268014 1239795 1213339 1188660 1165850 1144848 1125615 1108552 1094176
53328 1094176 1082096 1070832 1059146 1047220 1035997 1025713 1015750 1005753 996120 987280 979144 971471
$$ packed form
53406A177695L0001L1372L3173L5484L7790L9469M0579M1836M3670M5637M6982
53395A603688M7609M8116M8969M9996N0765N1091N1061N0824N0516N0170M9547
53384B152352M8193M5889M2946L9925L7179L4748L2452K9912K6696K2702J8360
53373B531354J4208J0363O463K101k885q451j4464k0782k7207l3402l8887m3290
53361B375121m6577m8876n0221n0788n1187n1977n2828n2742n1356m9459m7869
53350A821241m6454m4778m3168m2341m2246m2082m1383m0395l9363l8085l6350
53339A364596l4292l2170l0120k8219k6456k4679k2810k1002j9233j7063j4376
53328A094176j2080j1264j1686j1926j1223j0284r963r997r633q840q136p673
$$ plain form
53316 971471 964334 957944 952401 947886 944870 943880 945171 948607 953629 959334 964989 970676 977168 984985
53302 984985 993888 1003537 1014325 1027109 1042231 1059225 1077540 1097193 1118525 1141555 1165815 1190700
53290 1190700 1215766 1240705 1265323 1289623 1313736 1337561 1360568 1382137 1402018 1420234 1436562
53279 1436562 1450497 1461789 1470678 1477318 1481232 1481745 1478825 1473100 1465041 1454555 1441522 1426352 1409640
53266 1409640 1391447 1371325 1349135 1325553 1301510 1277225 1252104 1225639 1198164 1170442 1142702
53255 1142702 1114478 1085526 1056489 1028390 1001649 975891 950608 925680 901208 877162 853390
53244 853390 829897 806930 784748 763359 742521 722072 702173 683127 664933 647223 629720
53233 629720 612679 596745 582497 570203 559927 551572 544780 538874 533039 526648 519472 511562 502901
$$ packed form
53316I71471p137o390n543m515l016r90J291L436N022N705N655N687O492P817
53302I84985Q903R649J0788J2784J5122J6994J8315J9653K1332K3030K4260K4885
53290A190700K5066K4939K4618K4300K4113K3825K3007K1569J9881J8216J6328
53279A436562J3935J1292Q889O640L914N13k920n725q059j0486j3033j5170j6712
53266A409640j8193k0122k2190k3582k4043k4285k5121k6465k7475k7722k7740
53255A142702k8224k8952k9037k8099k6741k5758k5283k4928k4472k4046k3772
53244H53390k3493k2967k2182k1389k0838k0449j9899j9046j8194j7710j7503
53233F29720j7041j5934j4248j2294j0276q355o792n906n835o391p176p910q661
$$ plain form
53220 502901 493274 482634 471499 460660 450381 440135 429343 418202 407522 397862 389062 380627
53208 380627 372304 364249 356809 350266 344665 339703 334762 329210 322905 316436 310643 305732 301033 295811
53194 295811 290126 284618 279625 274952 270434 266246 262597 259560 257261 255752 254520 252679 249939 246994
53180 246994 244644 242919 241356 239701 237935 236053 234241 232931 232184 231346 229833 227983 226580 225780 225076
53165 225076 224178 223361 222977 223150 223860 224875 225681 225883 225589 225019 224067 222777 221895 222111 222906 222963 221745 219854
53147 219854 217837 215590 213136 211038 209596 208365 206968 205693 204805 203936 202800 201941 202088 203094 204187
53132 204187 204966 205544 205922 205959 205907 206332 207326 208269 208575 208393 208393 209034 210187 211425 212501 213498 214508 215405 216077
53113 216077 216648 217136 217131 216363 215537 215909 217780 219948 220938 220367 218836 217085 215653 214855 214492 213837 212423
$$ packed form
53220E02901r627j0640j1135j0839j0279j0246j0792j1141j0680r660q800q435
53208C80627q323q055p440o543n601m962m941n552o305o469n793m911m699n222
53194B95811n685n508m993m673m518m188l649l037k299j509j232j841k740k945
53180B46994k350j725j563j655j766j882j812j310p47q38j513j850j403q00p04
53165B25076q98q17l84J73P10J015Q06K02k94n70r52j290q82K16P95N7j218j891
53147B19854k017k247k454k098j442j231j397j275q88q69j136q59J47J006J093
53132B04187P79N78L78L7n2M25R94R43L06j82%O41J153J238J076R97J010Q97O72
53113B16077N71M88np68q26L72J871K168R90n71j531j751j432p98l63o55j414
$$ plain form
53096 212423 210582 208877 207355 205871 204752 204459 204761 204896 204536 204044 203820 203943 204465 205404 206285 206228 204867
53079 204867 202949 201786 202142 203679 205334 206233 206344 206251 206230 205856 204664 202915 201325 200318 199915 200100 200724
53062 200724 201278 201343 201238 201578 202187 202159 201112 199739 198819 198283 197625 196719 195768 194855 194047 193708 194163 195114 195762
53043 195762 195576 194724 193814 193406 193687 194423 195211 195805 196124 196010 195274 194142 193291 193179 193523 193720 193596 193462
53025 193462 193550 193819 194227 194791 195347 195610 195623 195830 196472 197084 196850 195418 193222 191067 189584 189039 189386 190330
53007 190330 191412 192259 192830 193344 193937 194461 194667 194509 194216 194121 194429 195063 195680 195969 196032 196366 197298 198540 199421
52988 199421 199547 199048 198297 197622 197280 197443 198067 198927 199803 200502 200819 200744 200753 201454 202804 203995 204390 204268 204360
52969 204360 204888 205476 205827 205993 205995 205683 205137 204865 205429 207038 209548 212501 215048 216308 216175 215473 214920 214170
$$ packed form
53096B12423j841j705j522j484j119k93L02J35l60m92k24J23N22R39Q81n7j361
53079B04867j918j163L56J537J655Q99J11r3k1l74j192j749j590j007m03J85O24
53062B00724N54O5j05L40O09k8j047j373r20n36o58r06r51r13q08l39M55R51O48
53043A95762j86q52r10m08K81P36P88N94L19j14p36j132q51j12L44J97j24j34
53025A93462Q8K69M08N64N56K63J3K07O42O12k34j432k196k155j483n45L47R44
53007A90330J082Q47N71N14N93N24K06j58k93r5L08O34O17K89O3L34R32J242Q81
52988A99421J26m99p51o75l42J63O24Q60Q76O99L17p5RP01J350J191L95j22R2
52969B04360N28N88L51J66Kl12n46k72N64J609K510K953K547J260j33p02n53p50
$$ plain form
52951 214170 212396 209700 207296 206145 205938 205721 205083 204256 203422 202541 201806 201661 202082 202262 201323 199229 196818
52934 196818 195026 194239 194243 194563 194804 194839 194779 194764 194763 194581 194069 193353 192845 192959 193689 194481 194672 194058 192945 191712
52914 191712 190522 189474 188835 188938 189922 191614 193528 195026 195677 195619 195407 195435 195650 195874 196061 196062 195503 194277
52896 194277 192973 192390 192646 193118 193261 193136 193069 193159 193364 193825 194776 196115 197240 197461 196638 195362 194414 194002
52878 194002 193702 193178 192671 192533 192589 192386 191935 191733 192038 192627 193396 194691 196790 199444 202225 204971 207522
52861 207522 209359 210091 210151 210448 211199 211577 210716 208750 206612 205000 203825 202582 201027 199399 198096 197204
52845 197204 196373 195169 193480 191511 189460 187353 185278 183552 182487 182030 181820 181567 181259 180930 180488 179955
52829 179955 179731 180306 181651 183176 184455 185719 187288 188680 188805 187215 184803 182989 182456 182920 183915 185306
$$ packed form
52951B14170j774k696k404j151k07k17o38q27q34q81p35j45M21J80r39k094k411
52934A96818j792p87ML20K41L5o0j5jj82n12p16n08J14P30P92J91o14j113j233
52914A91712j190j048o39J03R84J692J914J498O51n8k12K8K15K24J87Jn59j226
52896A94277j304n83K56M72J43j25o7R0K05M61R51J339J125K21q23j276r48m12
52878A94002l00n24n07j38N6k03m51k02L05N89P69J295K099K654K781K746K551
52861B07522J837P32O0K97P51L78q61j966k138j612j175j243j555j628j303q92
52845A97204q31j204j689j969k051k107k075j726j065m57k10k53l08l29m42n33
52829A79955k24N75J345J525J279J264J569J392J25j590k412j814n33M64R95J391
$$ plain form
52813 185306 187006 188627 189631 189739 189189 188783 189598 192232 196100 199746 202044 202855 202378 200367 196567 191715
52797 191715 187395 184702 183518 183183 183345 183815 184099 183697 182758 181938 181623 181603 181504 181171 180625 180045 179882 180645
52779 180645 182349 184368 185989 186906 187122 186719 186032 185791 186644 188425 190080 190451 189190 187084 185528 185426
52763 185426 186350 186989 186658 186122 186537 187789 188514 187870 186573 185802 185666 185373 184570 183686 182988 182159 181121 180537
52745 180537 180929 181816 182422 182960 184341 186674 188919 190286 191241 192622 194355 195689 196407 197133 198533 200737
52729 200737 203493 206351 208651 209895 210263 210364 210320 209545 207602 204898 202256 200175 198759 198080 198172 198776
52713 198776 199430 199757 199562 198792 197620 196380 195163 193617 191493 189324 188209 188769 190476 192160 193051 193280
52697 193280 193392 193563 193449 192822 192089 191915 192415 193079 193511 193957 194965 196793 199201 201546 202978 202956 201811
$$ packed form
52813A85306J700J621J004J08n50m06Q15K634L868L646K298Q11m77k011l800m852
52797A91715m320k693j184l35J62M70K84m02r39q20l15k0r9l33n46n80j63P63
52779A80645J704K019J621R17K16m03o87k41Q53J781J655L71j261k106j556j02
52763A85426R24O39l31n36M15J252P25o44j297p71j36k93q03q84o98q29j038n84
52745A80537L92Q87O06N38J381K333K245J367R55J381J733J334P18P26J400K204
52729B00737K756K858K300J244L68J01m4p75j943k704k642k081j416o79R2O04
52713A98776O54L27j95p70j172j240j217j546k124k169j115N60J707J684Q91K29
52697A93280J12J71j14o27p33j74N00O64M32M46J008J828K408K345J432k2j145
$$ plain form
52680 201811 200517 199683 199051 198157 197064 196087 195188 194233 193572 193751 194694 195719 196369 196697 196663 195833 194036 191967
52662 191967 190778 191097 192577 194322 195667 196629 197659 199029 200628 202411 204725 207848 211423 214761 217562
52647 217562 219817 221101 220629 218309 215178 212423 210282 208276 206226 204546 203643 203426 203483 203431 203047 202366
52631 202366 201813 202022 203289 205175 206848 207898 208759 210165 212224 214159 215061 214813 214135 213747 213650 213289 212357
52614 212357 211268 210660 210500 210012 208646 206833 205437 204704 204261 203981 204111 204488 204453 203944 203898 204953 206382
52597 206382 207068 207031 207115 207453 207331 206561 205979 206332 207438 208804 210401 212379 214484 216117 216725 216046 214381
52580 214381 212746 212190 212773 213634 214209 214760 215545 216208 216469 216765 217529 218290 218174 217078 215729 214737 214165 213942
52562 213942 214111 214546 214834 214603 213794 212612 211367 210294 209386 208452 207409 206389 205549 205053 205282 206560 208430
$$ packed form
52680B01811j294q34o32q94j093r77q99r55o61J79R43J025O50L28l4q30j797k069
52662A91967j189L19J480J745J345R62J030J370J599J783K314L123L575L338K801
52647B17562K255J284m72k320l131k755k141k006k050j680r03k17N7n2l84o81
52631B02366n53K09J267J886J673J050Q61J406K059J935R02k48o78l88r7l61r32
52614B12357j089o08j60m88j366j813j396p33m43k80J30L77l5n09m6J055J429
52597B06382O86l7Q4L38j22p70n82L53J106J366J597J978K105J633O08o79j665
52580B14381j635n56N83Q61N75N51P85O63K61K96P64P61j16j096j349r92n72k23
52562B13942J69M35K88k31q09j182j245j073r08r34j043j020q40m96K29J278J870
$$ plain form
52545 208430 209688 209644 208980 208873 209545 210239 210396 210199 210018 209985 210208 210829 211634 212079 211954 211692 211828 212433 213265
52526 213265 214115 214758 214874 214429 214004 214327 215400 216357 216351 215441 214443 213996 214002 214065 214239 215059 216879 219398 221920
52507 221920 223866 225045 225711 226534 228186 230617 232806 233568 232685 231093 229882 229213 228304 226432 223851 221573
52491 221573 220245 219463 218409 216950 215790 215628 216591 218452 220858 223222 224931 225978 226971 228199 229158
52476 229158 229411 229442 230079 231329 232475 233157 233728 234460 235061 235147 234776 234277 233902 233782 234013 234569 235364 236532
52458 236532 238379 240894 243455 245271 246059 246142 245863 245084 243381 240705 237618 234747 232221 229933 228210
52443 228210 227621 228024 228380 227900 226914 226088 225182 223280 220137 216615 213722 211786 210723 210496 210930 211452 211491
52426 211491 211042 210552 210341 210432 210927 212203 214455 217139 219187 220003 220141 220775 222609 225503 229045 233007
$$ packed form
52545B08430J258m4o64j07O72O94J57j97j81l3K23O21Q05M45j25k62J36O05Q32
52526B13265Q50O43J16m45m25L23J073R57or10r98m47OO3J74Q20J820K519K522
52507B21920J946J179O66Q23J652K431K189P62q83j592j211o69r09j872k581k278
52491B21573j328p82j054j459j160j62R63J861K406K364J709J047R93J228R59
52476B29158K53L1O37J250J146O82N71P32O01Q6l71m99l75j20K31N56P95J168
52458B36532J847K515K561J816P88Q3k79p79j703k676l087k871k526k288j723
52443B28210n89M03L56m80r86q26r06j902l143l522k893j936j063k27M34N22L9
52426B11491m49m90k11R1M95J276K252K684K048Q16J38O34J834K894L542L962
$$ plain form
52410 233007 237155 241095 244634 248029 251677 255921 261337 268699 278106 288343 297558 304404 308278 308880
52396 308880 306189 300704 293185 284223 274474 265060 257070 250755 245752 241994 239673 238428 237396 236322
52382 236322 235865 236503 237723 238701 239301 239975 241066 242624 244633 247029 249620 252317 255278 258621 262134
52367 262134 265471 268491 271233 273684 275681 277033 277679 277885 278183 278877 279639 279907 279622 279279 279301 279760 280677
52350 280677 282038 283410 284135 284168 284295 285186 286624 287972 289052 290236 291887 294138 297020 300528 304645
52335 304645 309464 315154 321638 328468 335181 341674 348170 355082 362938 372163 382780 394472 406947
52322 406947 419892 432737 445060 457345 470666 485287 500140 514092 527231 540384 553852
52311 553852 567293 580542 593816 607160 620340 633275 646088 658668 670652 681950 692926
$$ packed form
52410B33007M148L940L539L395L648M244N416P362R407J0237R215O846L874O02
52396C08880k691n485p519q962r749r414p990o315n003l758k321j245j032j074
52382B36322m57O38J220R78O00O74J091J558K009K396K591K697K961L343L513
52367B62134L337L020K742K451J997J352O46K06K98O94P62K68k85l43K2M59R17
52350B80677J361J372P25L3J27Q91J438J348J080J184J651K251K882L508M117
52335C04645M819N690O484O830O713O493O496O912P856R225J0617J1692J2475
52322D06947J2945J2845J2323J2285J3321J4621J4853J3952J3139J3153J3468
52311E53852J3441J3249J3274J3344J3180J2935J2813J2580J1984J1298J0976
$$ plain form
52300 692926 703835 714353 723832 731970 739126 745962 752673 758629 762927 765254 765841 764623 761090 755395
52286 755395 749023 743679 739645 735831 731278 726040 720604 715193 709948 705422 702492 701820 703405 706527
52272 706527 710154 713675 717330 721805 727545 734674 743364 753736 765299 776907 787602 797280 806383
52259 806383 815185 823686 832077 840937 850781 861539 872584 883212 892979 901668 909197 915710 921500
52246 921500 926613 930648 933245 934546 934750 933376 929622 923578 916410 909084 901480 893195 884587 876415
52232 876415 868849 861571 854621 848377 842794 837393 832073 827312 823326 819617 815656 811604 808064 805406
52218 805406 803627 802675 802618 803539 805448 808279 811901 816056 820316 824188 827598 831253 836139 842282 848349
52203 848349 852897 855839 858242 860873 863602 866143 868667 871393 874117 876546 878776 881159 883890 886976
$$ packed form
52300F92926J0909J0518R479Q138P156O836O711N956M298K327N87j218l533n695
52286G55395o372n344m034l814m553n238n436n411n245m526k930o72J585L122
52272G06527L627L521L655M475N740P129Q690J0372J1563J1608J0695R678R103
52259H06383Q802Q501Q391Q860R844J0758J1045J0628R767Q689P529O513N790
52246I21500N113M035K597J301K04j374l754o044p168p326p604q285q608q172
52232H76415p566p278o950o244n583n401n320m761l986l709l961m052l540k658
52218H05406j779r52n7R21J909K831L622M155M260L872L410L655M886O143O067
52203H48349M548K942K403K631K729K541K524K726K724K429K230K383K731L086
$$ plain form
52189 886976 890390 893967 897274 899801 901269 901676 901170 899911 897927 895037 891079 886223 880887 875284 869270
52174 869270 862730 855925 849360 843433 838233 833581 829295 825540 822814 821401 820994 821183 822134 824282 827388
52159 827388 830436 832665 834257 835767 837327 838731 839900 840832 841322 841202 840741 840447 840499 840706 840985 841548 842543
52142 842543 843794 845017 846139 847264 848409 849353 849783 849544 848794 847944 847534 848131 850213 853949 859126 865455
52126 865455 873003 882216 893509 906916 922153 938946 957338 977667 1000114 1024082 1048193 1071155
52114 1071155 1092566 1112699 1131734 1149605 1166446 1182579 1197910 1211810 1223837 1234222 1243440
52103 1243440 1251629 1258685 1264590 1269367 1272960 1275527 1277613 1279696 1281585 1282508 1281727 1278960 1274381 1268410
52089 1268410 1261355 1253115 1243377 1232183 1220013 1207171 1193584 1179578 1166463 1155731 1147786 1141937
$$ packed form
52189H86976L414L577L307K527J468M07n06j259j984k890l958m856n336n603o014
52174H69270o540o805o565n927n200m652m286l755k726j413m07J89R51K148L106
52159H27388L048K229J592J510J560J404J169R32M90j20m61k94N2K07K79N63R95
52142H42543J251J223J122J125J145R44M30k39p50q50m10N97K082L736N177O329
52126H65455P548R213J1293J3407J5237J6793J8392K0329K2447K3968K4111K2962
52114A071155K1411K0133J9035J7871J6841J6133J5331J3900J2027J0385R218
52103A243440Q189P056N905M777L593K567K086K083J889R23p81k767m579n971
52089A268410p055q240r738j1194j2170j2842j3587j4006j3115j0732p945n849
$$ plain form
52077 1141937 1137493 1134311 1132303 1131153 1130809 1131733 1134314 1138337 1143425 1149712 1157651 1167215 1177660 1188116
52063 1188116 1198184 1207919 1217433 1226675 1235515 1243886 1251825 1259388 1266541 1273135 1278952 1283756 1287340 1289540
52049 1289540 1290210 1289188 1286343 1281746 1275729 1268672 1260637 1251270 1240138 1227277 1213395 1199448 1185919
52036 1185919 1172557 1158981 1145420 1132663 1121231 1110877 1101055 1091644 1082958 1075180 1068069 1061139
52024 1061139 1053899 1045916 1036987 1027282 1017159 1006764 996061 985289 975032 965598 956565 947312 937899
52011 937899 929099 921539 915067 908945 902347 894595 885325 874749 863524 852018 839815 826235 811216
51998 811216 795255 778569 760950 742699 725161 709786 696829 685400 674693 664728 655884 648107
51986 648107 640727 632816 623727 613587 603387 594228 586339 578969 571271 562971 554074 544432 533973
$$ packed form
52077A141937m444l182k008j150l44R24K581M023N088O287P939R564J0445J0456
52063A188116J0068R735R514R242Q840Q371P939P563P153O594N817M804L584K200
52049A289540O70j022k845m597o017p057q035r367j1132j2861j3882j3947j3529
52036A185919j3362j3576j3561j2757j1432j0354r822r411q686p778p111o930
52024A061139p240p983q929r705j0123j0395j0703j0772j0257r434r033r253r413
52011I37899q800p560o472o122o598p752r270j0576j1225j1506j2203j3580j5019
51998H11216j5961j6686j7619j8251j7538j5375j2957j1429j0707r965q844p777
51986F48107p380p911r089j0140j0200r159p889p370p698q300q897r642j0459
$$ plain form
51973 533973 523134 512626 502892 494111 486592 480725 476546 473785 472444 472890 475177 478662 482620 486983
51959 486983 492056 497725 503449 508972 514421 519478 523055 524257 523312 521011 517557 512697 506888 501449
$$ packed form
51973E33973j0839j0508r734q781p519n867m179k761j341M46K287L485L958M363
51959D86983N073N669N724N523N449N057L577J202r45k301l454m860n809n439
$$ [...]
##END NTUPLES=NMR SPECTRUM
##END=
