
##TITLE=UV1211_M4_1332-1205_7185644_mEKHBzjl5w
##JCAMPDX= 6.0         $$ Bruker NMR JCAMP-DX V2.0
##DATA TYPE= NMR SPECTRUM
##DATA CLASS= NTUPLES
##ORIGIN= BRUKER
##OWNER= Administrator
$$ 1.72 TOPSPIN		Version 2.1
$$ 2012-12-05 20:51:14.788 -0500  Administrator@X
$$ Compression mode = diff/dup
##.OBSERVE FREQUENCY= 400.02188249412
##.OBSERVE NUCLEUS= ^1H
##.ACQUISITION MODE= SIMULTANEOUS (DQD)
##.ACQUISITION SCHEME= undefined
##.AVERAGES= 8
##.DIGITISER RES= 22
##SPECTROMETER/DATA SYSTEM= spect
##.PULSE SEQUENCE= zg30
##.SOLVENT NAME= COFFEE_meoh
##.SHIFT REFERENCE= INTERNAL, COFFEE_meoh, 1, 14.98509
##AUDIT TRAIL= $$ (NUMBER, WHEN, WHO, WHERE, PROCESS, VERSION, WHAT)
$$ ##TITLE= Audit trail, TOPSPIN		Version 2.1
$$ ##JCAMPDX= 5.01
$$ ##ORIGIN= Bruker BioSpin GmbH
$$ ##OWNER= Administrator
$$ $$ E:\/data/COFFEE/nmr/UV1211_M4_1332-1205_7185644_mEKHBzjl5w/10/pdata/1/auditp.txt
$$ ##AUDIT TRAIL=  $$ (NUMBER, WHEN, WHO, WHERE, PROCESS, VERSION, WHAT)
(   1,<2012-12-05 20:51:06.381 -0500>,<Administrator>,<X>,<go>,<TOPSPIN 2.1>,
      <created by zg
	started at 2012-12-05 20:50:00.350 -0500,
	POWCHK enabled, PULCHK disabled,
       configuration hash MD5:
       86 BA 57 50 F2 9D 5C 9B 26 00 A9 28 5F 66 2E 89
       data hash MD5: 64K
       FD 45 2F 03 D7 9D 21 45 A2 24 34 F9 02 0B A6 90>)
(   2,<2012-12-05 20:51:09.506 -0500>,<Administrator>,<X>,<proc1d>,<TOPSPIN 2.1>,
      <Start of raw data processing
       efp LB = 0 FT_mod = 6 PKNL = 1 PHC0 = 0 PHC1 = 0 SI = 32K 
       data hash MD5: 32K
       92 23 FE 7B E4 EB 2C 3A 9C 3D 98 23 4C 7B F2 D2>)
(   3,<2012-12-05 20:51:09.975 -0500>,<Administrator>,<X>,<proc1d>,<TOPSPIN 2.1>,
      <pk PHC0 = 95.69092 PHC1 = 0 
       data hash MD5: 32K
       3B FF ED 9A FF B2 59 83 50 AD 77 E0 08 9E C9 26>)
(   4,<2012-12-05 20:51:10.194 -0500>,<Administrator>,<X>,<proc1d>,<TOPSPIN 2.1>,
      <abs ABSG = 1 
       data hash MD5: 32K
       29 0F 62 8C EA 57 61 A6 3A 00 70 A5 12 9E 77 42>)
(   5,<2012-12-05 20:51:10.350 -0500>,<Administrator>,<X>,<proc1d>,<TOPSPIN 2.1>,
      <abs ABSG = 2 
       data hash MD5: 32K
       D9 A2 FC 12 DB 61 B7 3C EF 03 26 8D BD A4 98 42>)
(   6,<2012-12-05 20:51:10.475 -0500>,<Administrator>,<X>,<proc1d>,<TOPSPIN 2.1>,
      <abs ABSG = 3 
       data hash MD5: 32K
       CD 97 D1 95 FC DB A5 BB 59 BB BC A3 6E 22 66 CF>)
(   7,<2012-12-05 20:51:10.631 -0500>,<Administrator>,<X>,<proc1d>,<TOPSPIN 2.1>,
      <abs ABSG = 4 
       data hash MD5: 32K
       75 51 03 AC 29 E1 CC 48 4C EE 92 02 C3 B8 99 EF>)
(   8,<2012-12-05 20:51:10.772 -0500>,<Administrator>,<X>,<proc1d>,<TOPSPIN 2.1>,
      <abs ABSG = 5 
       data hash MD5: 32K
       9D CA 74 77 8D 42 07 EE FF 32 22 65 C6 DA FA DE>)
$$ ##END=
$$ 
$$ $$ hash MD5
$$ $$ 4E 89 C0 C9 E6 98 5A 08 13 4E 51 B7 18 D2 01 15
##$RELAX= 
##$RELAX= 
##$RELAX= 
##$RELAX= 
##$RELAX= 
##$RELAX= 
##$RELAX= 
$$ Bruker specific parameters
$$ --------------------------
##$DU= <E:\>
##$EXPNO= 10
$$ [...]
150 150 150 150 150 150 150 150
##$TP07= 0
##$TPNAME0= <>
##$TPNAME1= <>
##$TPNAME2= <>
##$TPNAME3= <>
##$TPNAME4= <>
##$TPNAME5= <>
##$TPNAME6= <>
##$TPNAME7= <>
##$TPOAL= (0..7)
0.5 0.5 0.5 0.5 0.5 0.5 0.5 0.5
##$TPOFFS= (0..7)
0 0 0 0 0 0 0 0
##$TUNHIN= 0
##$TUNHOUT= 0
##$TUNXOUT= 0
##$USERA1= <user>
##$USERA2= <user>
##$USERA3= <user>
##$USERA4= <user>
##$USERA5= <user>
##$V9= 5
##$VALIST= <valist>
##$VCLIST= <CCCCCCCCCCCCCCC>
##$VD= 0
##$VDLIST= <DDDDDDDDDDDDDDD>
##$VPLIST= <PPPPPPPPPPPPPPP>
##$VTLIST= <TTTTTTTTTTTTTTT>
##$WBST= 1024
##$WBSW= 4
##$XGAIN= (0..3)
0 0 0 0
##$XL= 0
##$YL= 0
##$YMAX_a= 669200
##$YMIN_a= -568250
##$ZGOPTNS= <>
##$ZL1= 120
##$ZL2= 120
##$ZL3= 120
##$ZL4= 120
##$ABSF1= 14.98509
##$ABSF2= -5.573092
##$ABSG= 5
##$ABSL= 3
##$ALPHA= 0
##$AQORDER= 0
##$ASSFAC= 0
##$ASSFACI= 0
##$ASSFACX= 0
##$ASSWID= 0
##$AUNMP= <proc_prof1d_extract_pilot.lims>
##$AXLEFT= 0
##$AXNAME= <>
##$AXNUC= <1H>
##$AXRIGHT= 0
##$AXTYPE= 0
##$AXUNIT= <>
##$AZFE= 0.1
##$AZFW= 0.1
##$BCFW= 0
##$BC_mod= 0
##$BYTORDP= 0
##$COROFFS= 0
##$CY= 15
##$DATMOD= 1
##$DC= 0
##$DFILT= <>
##$DTYPP= 0
##$F1P= 0
##$F2P= 0
##$FCOR= 0.5
##$FTSIZE= 32768
##$FT_mod= 6
##$GAMMA= 0
##$GB= 0
##$INTBC= 1
##$INTSCL= 1
##$ISEN= 128
##$LB= 0
##$LEV0= 0
##$LPBIN= 0
##$MAXI= 10000
##$MC2= 0
##$MEAN= 0
##$ME_mod= 0
##$MI= 0
##$NCOEF= 0
##$NC_proc= -8
##$NLEV= 6
##$NOISF1= 0
##$NOISF2= 0
##$NSP= 0
##$NTH_PI= 0
##$NZP= 0
##$OFFSET= 14.98509
##$PC= 1
##$PHC0= 95.69092
##$PHC1= 0
##$PH_mod= 1
##$PKNL= yes
##$PPARMOD= 0
##$PPDIAG= 0
##$PPIPTYP= 0
##$PPMPNUM= 2147483647
##$PPRESOL= 1
##$PSCAL= 4
##$PSIGN= 0
##$PYNMP= <proc.py>
##$REVERSE= no
##$SF= 400.02
##$SI= 32768
##$SIGF1= 0
##$SIGF2= 0
##$SINO= 400
##$SIOLD= 32768
##$SPECTYP= <>
##$SREGLST= <1H.CDCl3>
##$SSB= 0
##$STSI= 32768
##$STSR= 0
##$SW_p= 8223.68421052631
##$SYMM= 0
##$S_DEV= 0
##$TDeff= 65536
##$TDoff= 0
##$TI= <>
##$TILT= no
##$TM1= 0
##$TM2= 0
##$TOPLEV= 0
##$USERP1= <user>
##$USERP2= <user>
##$USERP3= <user>
##$USERP4= <user>
##$USERP5= <user>
##$WDW= 1
##$XDIM= 32768
##$YMAX_p= 478510872
##$YMIN_p= -678413
##$CURPLOT= <Network HP LaserJet P1505>
##$CURPRIN= <$Network HP LaserJet P1505>
##$DFORMAT= <normdp>
##$LAYOUT= <+/1D_H.xwp>
##$LFORMAT= <normlp>
##$PFORMAT= <normpl>
##$SURQMSG= 1
$$ End of Bruker specific parameters
$$ ---------------------------------
##NTUPLES= NMR SPECTRUM
##VAR_NAME=  FREQUENCY,     SPECTRUM/REAL,   SPECTRUM/IMAG
##SYMBOL=    X,             R,               I
##VAR_TYPE=  INDEPENDENT,   DEPENDENT,       DEPENDENT
##VAR_FORM=  AFFN,          ASDF,            ASDF
##VAR_DIM=   32768,         32768,           32768
##UNITS=     HZ,            ARBITRARY UNITS, ARBITRARY UNITS
##FACTOR=    0.250966925370066, 1,           1
##FIRST=     8223.43324360094, 82231,        -99072
##LAST=      0,             9923,            -137215
##MIN=       0,             -678413,         0
##MAX=       8223.43324360094, 478510872,    0
$$ Real data points
##PAGE= N=1
##DATA TABLE= (X++(R..R)), XYDATA
$$ [...]
$$ plain form
19526 -12352 -154549 -59413 -299126 1144 97973 -54802 65017 -31026 29801 125802 -42046
19514 -54566 122307 -258135 -404489 318972 113239 9091 -50363 -208633 17818 -256927
19503 -325304 491938 -72618 81963 -111629 10087 -86195 -156156 7699 -64837 -84373 -73988
19492 -73988 -30760 118419 62362 -294245 -402657 -114568 331844 -87995 251489 -193660
19481 192150 10749 -227881 9925 104276 -103096 18067 -186418 37470 125420 181913 -162265
19469 -152889 -5573 -22899 -253045 -170127 115677 -113704 -61741 -197355 -86050 -60979 21028
19457 -28143 114859 -236284 24771 -19519 59416 -8299 -429388 167837 -289202 -164630 -172609
19446 -172609 -220033 268507 34119 48878 -91723 9485 101656 -183008 -109689 47066 -125908
$$ packed form
19526a2352j42197e9413k39713A144R6829e4802F5017c1026B9801R6001d2046
19514e4566A22307b58135j46354C18972A13239I091e0363j58270A7818b56927
19503c25304D91938g2618H1963a11629A0087h6195o9961G699f4837j9536J0385
19492g3988c0760A18419n6057b94245j08412a14568C31844h7995B51489a93660
19481A92150A0749b27881I925R4351a03096A8067a86418C7470Q7950N6493a62265
19469a52889e573j7326k30146Q2918A15677a13704N1963j35614h6050K5071B1028
19457b8143A14859b36284B4771a9519E9416h299m21089A67837b89202J24572p979
19446a72609m7424B68507C4119J4759i1723I485R2171a83008P3319D7066a25908
$$ plain form
19434 -299976 78685 -228836 -26828 94502 -108259 216550 -5330 205345 29096 -191 -156560
19423 -156560 -166451 123016 250868 -21172 97998 94749 56524 285952 -177604 68594 53944
19412 53944 -4517 -79739 -4431 72442 -12658 -83609 136459 -73225 33846 -306065 -11482 -259366
19400 -259366 78409 -327912 -96815 -27885 -94211 -176731 -158851 71843 -76272 45074 -548673
19388 -130447 -3916 -24153 3890 120040 178979 -96130 70114 -18991 -346606 181883 486260
19377 486260 9442 320070 -280234 8745 213818 -431340 -53979 275438 -183160 -256581 93119
19365 -225063 -35579 -156727 301579 -93920 -5539 -219025 101570 223109 -139305 -292578
19355 -292578 -200222 -124636 -166906 121938 194748 80610 187166 295300 -143101 -419267
$$ packed form
19434b99976G8685b28836b6828I4502a08259B16550e330B05345B9096a91j56369
19423a56560r891A23016J27852b1172I7998l249l8225K29428a77604F8594j4650
19412E3944d517p5222d431G2442a2658p0951A36459g3225C3846c06065a1482k47884
19400b59366G8409c27912i6815b7885o6326q2520J7880G1843g6272D5074e48673
19388a30447c916k0237C890J16150N8939i6130G0114a8991l27615A81883L04377
19377D86260I442L10628b80234H745K05073d31340e3979B75438a83160p3421I3119
19365b25063c5579j21148C01579i3920e539k13486A01570J21539a39305j53273
19355b92578R2356P5586m2270A21938P2810H0610J06556J08134a43101k76166
$$ plain form
19345 -419267 23324 -156573 134991 192124 -234742 13139 -158829 -182626 41211 -335911
19334 -151512 -270167 -273201 30011 -269144 -140745 2256 74499 46502 -413667 80738 -112202
19322 -216128 -140207 20724 -382565 2755 -170468 -124100 -9042 -161250 -45078 78365 194203
19311 194203 -237735 39583 242934 -128544 47591 74789 -413184 219077 -107590 69561
19300 65009 -138022 128481 -217528 239749 120973 -225912 -42572 -115264 -205328 236798
19289 -19991 166401 59777 -191478 78490 128128 62633 390898 62197 -281127 -9710 61123
19277 -349792 -146090 -307193 -47592 -219186 73641 -347249 52670 96729 77872 -236027
19266 -109313 -280412 112270 -103518 -231355 -184468 -164470 -417358 -14208 130669 -114849
$$ packed form
19345d19267B3324a56573A34991N7133b34742A3139a58829k3797D1211c35911
19334a51512j18655l034C0011b69144J28399B256P2243k7997d13667H0738a12202
19322b16128P5921B0724c82565B755a70468M6368i042j52208d5078G8365J15838
19311A94203b37735C9583K03351a28544D7591K7198d13184B19077a07590F9561
19300F5009a38022A28481b17528B39749j18776b25912d2572p2692r0064B36798
19289a9991A66401E9777a91478G8490M9638F2633L28265F2197b81127i710F1123
19277c49792a46090j61103d7592j71594G3641c47249E2670M4059j8857b36027
19266a09313j71099A12270a03518j27837M6887J9998k52888a4208A30669a14849
$$ plain form
19255 134106 -112455 -306355 -323353 -3339 -96748 -13124 -242522 -346307 -60678 142679 -391821
19243 -189497 312816 -201929 -190154 74433 154006 177895 -39105 192759 -73721 -2909 -346689
19232 -346689 131643 -29811 -397522 -223132 -383402 83139 197508 -391373 218299 98455
19221 223627 3023 140851 -55060 -47100 -201515 -155516 25039 -130329 -287128 379514 -106732
19209 40165 -15706 358928 -252464 -230541 -113888 -98106 -13040 160491 -107837 -65725 -38237
19198 -38237 243738 -126519 255296 308910 -14483 138672 60930 -9652 289764 -212008 -225971
19187 -225971 -39548 151047 -49647 -103110 -134462 173603 90020 -40177 -60368 -17607 -291499
19176 -291499 -226504 -5993 387171 -220154 -52624 -354771 -91661 -115573 -314844 114030 -266176
$$ packed form
19255A34106a12455j93900j6998c339r3409a3124k29398j03785f0678A42679c91821
19243a89497C12816b01929J1775G4433P9573K3889c9105A92759g3721b909l43780
19232c46689A31643b9811l67711J74390j60270H3139J14369c91373B18299I8455
19221B23627C023J37828e5060P960j54415M5999B5039a30329j56799C79514a06732
19209D0165a5706C58928b52464K1923a13888J5782a3040A60491a07837M2112K7488
19198c8237B43738a26519B55296N3614a4483A38672F0930i652B89764b12008j3963
19187b25971c9548A51047d9647n3463l1352A73603q3583d0177k0191a7607k73892
19176b91499O4995e993C87171b20154e2624l02147i1661k3912j99271A14030b66176
$$ plain form
19164 -173748 -58828 -93670 -137639 -43439 -106170 62238 -78723 49967 21330 -188293 -6540
19152 -9969 -235576 -467262 -125551 -317285 -78230 -190911 97949 -8684 -167054 -3430 163017
19140 -106535 -80697 -81096 187462 -81066 -178492 -26603 -313298 289410 10538 -38461 5296
19128 -88533 73881 73261 134185 -312907 38588 -287934 -113748 446130 129189 -177415 63372
19116 -52456 19237 -105194 -24488 110900 -95855 8336 -48543 -264823 176664 -60256 -255248
19105 -255248 -356187 -214689 -129068 14413 -10789 129679 304183 -84806 67313 -257986
19094 82358 -63267 -173294 -215127 -143009 165959 -155940 -68008 -161839 -138778 -64309 -238481
19083 -238481 74611 93434 -297333 22872 -221262 329621 -69254 -77522 -354035 -198906 20101
$$ packed form
19164a73748e8828l4842m3969d3439o2731F2238g8723D9967B1330a88293f540
19152i969k25607k31686a25551j91734g8230j12681I7949h684j58370c430A63017
19140a06535K5838l99A87462h1066r7426b6603k86695B89410A0538c8461E296
19128h8533G3881o20O0924c12907C8588b87934a13748D46130A29189a77415F3372
19116e2456A9237a05194b4488A10900i5855H336d8543k16280A76664f0256j94992
19105b55248j00939J41498Q5621A4413a0789A29679J74504h4806F7313b57986
19094H2358f3267j10027m1833P2118A65959a55940f8008r3831K3061f4309j74172
19083b38481G4611J8823b97333B2872b21262C29621f9254q268k76513J55129B0101
$$ plain form
19071 -163119 255117 -266084 -244895 43326 -37839 -290612 219933 45608 48918 -120697 134848
19059 -77448 49157 -128692 -203832 -182251 -780 -208456 -92747 -11488 50371 -26078 -424787
19048 -424787 186340 -559823 -150725 -64075 -241111 38014 53625 53183 -72836 178531 69549
19036 -145740 144426 -348760 81939 8137 54842 -13891 112938 316445 -76539 -33859 -61066
19025 -61066 203885 -128524 274075 85447 13730 -261243 241064 -30994 100334 183678
19015 183678 -25818 -399257 -79128 -84946 -35603 -57996 -164121 -65465 -181683 56845 -94907
19003 -180400 -31537 -96114 -319309 -37654 79610 13118 -88431 -21469 -88527 -272170 -204763
18992 -204763 143449 102952 -286224 -32182 -13276 33197 -361286 -103322 -73569 253716
$$ packed form
19071a63119B55117b66084K1189D3326c7839k52773B19933D5608L310a20697A34848
19059g7448D9157a28692p5140K1581g80k07676i2747a1488E0371b6078l98709
19048d24787A86340e59823a50725f4075j77036C8014J5611m42g2836A78531F9549
19036a45740A44426c48760H1939H137M6705a3891A12938K03507g6539c3859k7207
19025f1066B03885a28524B74075H5447A3730b61243B41064c0994A00334Q3344
19015A83678b5818l73439g9128n818c5603k2393j06125f5465j16218E6845i4907
19003a80400c1537o4577k23195c7654G9610A3118h8431b1469o7058j83643O7407
18992b04763A43449m0497b86224c2182a3276C3197c61286a03322K9753B53716
$$ plain form
18981 72839 -1336 -80651 -318391 -245928 -18082 164663 -168976 69300 -282441 1935 24677
18970 24677 -105175 284081 -125949 225856 165878 98917 -34196 32025 65057 -517 -118801
18959 -118801 -198785 -70714 129253 -270485 -197934 -159125 -194773 -50675 -188324 1251 -198951
18947 -76004 -105186 216792 49662 -188974 -175868 185125 -126238 -42822 -23806 -56142 135043
18935 -151664 109025 -76206 53193 -336763 76784 143510 -59941 -68272 -294886 -335043 67205
18923 58226 -110192 -57499 -78293 74313 -217352 252017 -190776 56134 161078 -200978
18912 -212161 23180 52006 -230942 323218 -24105 -52502 -64072 75586 -108467 -378772 226803
18900 77247 -22196 -33249 496798 87267 45599 314982 -102833 -21726 193419 38935 -2821
$$ packed form
18981G2839a336p9315k37740P2463a8082A64663a68976F9300b82441A935K2742
18970B4677a05175B84081a25949B25856n9978o6961c4196C2025L3032e17j18284
18959a18801p9984g0714A29253b70485P2551L8809l5648e0675j37649A251a98951
18947g6004k9182B16792D9662a88974J3106A85125a26238d2822J9016l2336A35043
18935a51664A09025g6206E3193c36763G6784O6726e9941q331k26614m0157F7205
18923E8226a10192N2693k0794G4313b17352B52017a90776E6134J04944b00978
18912b12161B3180K8826b30942C23218b4105k8397j1570G5586a08467k70305B26803
18900G7247b2196j1053D96798H7267m1668K69383a02833b1726A93419C8935b821
$$ plain form
18888 15981 -105933 -412923 66959 -64838 -226911 -156522 -9680 -233826 -12440 -313114 -184869
18877 -184869 325962 427895 -75287 218744 -11010 -160572 43945 158088 275340 -36257
18866 -340754 -92916 105513 -27548 -142800 -167703 -178166 117173 -112507 -5237 98054 -83087
18854 156861 -117958 -136191 132792 130982 232464 -88234 -188302 -36205 -513297 -58975 -139686
18843 -139686 -56086 -173271 -42855 -87464 160790 -5748 -190494 -262692 -228805 -44025 18589
18831 -356137 -193544 109074 -54056 -314718 63470 12482 338300 14193 -71263 108815
18820 80692 -132971 338051 160903 86062 12922 -206668 74464 236758 -115853 -95342
18810 -95342 -30565 170969 88212 233672 -484138 78700 -11494 833 -275830 -137929 -172957
$$ packed form
18888A5981a05933l06990F6959f4838j62073P0389i680k24146a2440l00674J28245
18877a84869C25962J01933g5287B18744a1010j49562D3945J14143J17252c6257
18866c40754i2916A05513b7548j15252k4903j0463A17173a12507e237I8054h3087
18854A56861a17958j8233A32792j810J01482h8234j00068c6205m77092e8975q0711
18843a39686e6086j17185d2855m4609A60790e748j84746p2198L3887d4025A8589
18831c56137J62593A09074e4056k60662F3470A2482L25818A4193g1263A08815
18820H0692a32971C38051A60903p4841A2922b06668G4464J62294a15853K0511
18810i5342c0565A70969q2757J45460d84138G8700a1494H33b75830J37901l5028
$$ plain form
18799 -172957 -434495 -305118 70873 -158926 113573 95735 -88207 -246489 -58141 -107339
18789 -107339 -60343 -578002 110545 57044 -428339 179540 272902 53344 -84359 -53285 10607
18777 10939 -205270 -71601 7320 56504 -28487 -154720 -251662 80284 6511 -98580 84229 -262721
18764 175843 -273052 -258281 -49417 33313 36070 -69754 -66800 50757 68399 54800 -333440
18752 310176 -267888 -253650 99367 37990 112990 45718 -422898 102696 -149668 180314
18741 -137222 -119384 -37343 -289254 -118379 -199185 -169233 53324 -273030 10314 181627 -285008
18729 -424965 -153720 -266833 94367 214210 62790 349711 190247 49210 226965 -436950
18718 -43360 63089 -210557 95518 152604 -20116 -320895 -14756 40081 -15688 86446 -229294
$$ packed form
18799a72957k61538J29377G0873a58926A13573j7838h8207j58282e8141m9198
18789a07339M6996n17659A10545n3501d28339A79540R3362E3344h4359L1074A0607
18777A0939b05270g1601G320M9184b8487j26233r6942H0284F511i8580H4229b62721
18764A75843b73052J4771d9417C3313K757f9754K954E0757J7642j3599c33440
18752C10176b67888J4238I9367C7990P5000D5718d22898A02696a49668A80314
18741a37222J7838c7343k51911a18379q0806K9952E3324b73030A0314J71313b85008
18729d24965a53720j13113I4367J19843F2790K86921j59464D9210J77755d36950
18718d3360F3089b10557I5518N7086b0116l00779a4756D0081a5688H6446b29294
$$ plain form
18706 -148132 -391142 -337039 -37898 60566 -371200 145810 157647 68322 197597 17110 160056
18695 160056 -9042 -60795 102142 -77865 20457 -133255 -401466 -402752 -33672 568 -6905 240751
18682 -291963 102666 19648 -244261 78020 -531840 -221604 -26965 -114677 6515 -282842 -316222
18671 -316222 -215279 36190 -50927 213785 197127 186786 -16667 -84607 59404 -138506 110605
18659 71387 -162129 28631 58906 134521 -75722 -173558 -116999 -64395 50634 25996 58707
18648 58707 -37964 -84546 216176 -104766 218282 152412 280452 136891 -37792 141258
18637 -243324 169375 277660 119411 268989 -133261 -100234 -201512 -151402 279436 -122489
18626 -234251 276322 -130163 181232 -285179 -180022 -40059 82493 -152905 -149379 -278811
$$ packed form
18706a48132k43010N4103c7898F0566c71200A45810J1837F8322J29275A7110J42946
18695A60056i042n1753A02142g7865B0457a33255k68211j286c3672E68f905B40751
18682b91963A02666A9648b44261G8020e31840b21604b6965q7712F515b82842l3380
18671c16222J00943C6190e0927B13785j6658j0341a6667o7940E9404a38506A10605
18659G1387a62129B8631L0275P5615g5722r7836N6559N2604E0634k4638L2711
18648E8707c7964m6582B16176a04766B18282o5870J28040A36891c7792A41258
18637b43324A69375J08285A19411J49578a33261L3027j01278N0110B79436a22489
18626b34251B76322a30163A81232b85179J05157d0059H2493a52905L526j29432
$$ plain form
18616 -278811 -345172 -381073 26201 -56289 63896 -3519 -76377 -140907 -150882 -335113 -40253 -404868
18604 -404868 -191396 82892 -342450 167108 -321818 -179878 -60471 9073 -130828 -213365
18594 -213365 -134021 -106916 -243406 110422 -31457 -80115 78270 21867 -228896 -106595 61027
18582 -7728 -67048 -160445 -25803 -360784 -94244 -220326 155912 -411132 5920 -444577 -218814
18570 161801 -48892 -156286 -124423 146542 -38884 -109261 87493 -46595 134074 172361 -162043
18558 -315214 -254280 -414842 -2952 8658 -112257 -221964 -245415 457118 134073 -196382 -83353
18546 53178 -233457 80412 -223745 -353585 136039 -187797 -100274 -43835 -208013 -159868
18536 -159868 -123059 -43101 188703 260414 -133421 -144785 87728 -233148 109547 54258 -39826
$$ packed form
18616b78811o6361l5901B6201e6289F3896c519p2858o4530r975j84231d0253l64615
18604d04868a91396H2892c42450A67108c21818J41940f0471I073a30828q2537
18594b13365P9344K7105j36490A10422c1457m8658G8270B1867b28896a06595F1027
18582g728n9320r3397b5803l34981i4244j26082A55912d11132E920d44577b18814
18570A61801d8892j07394L1863A46542c8884p0377H7493d6595A34074L8287a62043
18558c15214O0934j60562b952H658a12257j09707k3451D57118A34073a96382h3353
18546E3178b33457H0412b23745j29840A36039a87797Q7523d3835j64178M8145
18536a59868L6809d3101A88703P1711a33421j1364H7728b33148A09547E4258c9826
$$ plain form
18524 -62368 -97000 135849 -41670 -103760 156707 156218 -29241 102921 -180111 82116 66211
18513 66211 -175965 -170100 49746 14297 185035 35512 -258562 -116593 61301 251731 -133692
18501 -225296 240405 -148310 -76053 -73144 -254600 -186586 120950 -283275 -288699 -323990 192719
18489 -168965 63167 -106285 23142 134050 -137384 109198 -224739 11175 -13680 95395
18478 -92715 -127694 131096 25735 -380490 74771 310658 -75720 94163 -176287 -271950 -99967
18466 -127054 316839 -119625 -182798 54415 37398 -38805 277337 209189 -25111 122728 -400358
18454 -123546 -175342 -250697 36387 -217066 192577 -222905 -237589 27152 27975 -337338 15148
18442 16591 6629 558 185637 -183458 32387 119259 -4592 -241452 122942 -229700 20059
$$ packed form
18524f2368l4632A35849d1670o2090A56707m89b9241A02921a80111H2116j5905
18513F6211a75965N865D9746A4297J70738C5512b58562a16593F1301J90430a33692
18501b25296B40405a48310P2257K909j81456O8014A20950b83275n424l5291A92719
18489a68965F3167a06285B3142J10908a37384A09198b24739A1175a3680I5395
18478i2715l4979A31096B5735c80490G4771K35887g5720I4163a76287r5663i9967
18466a27054C16839a19625o3173E4415j7017c8805B77337o8148b5111A22728d00358
18454a23546n1796p5355C6387b17066A92577b22905j4684B7152Q23c37338A5148
18442A6591F629E58J85079a83458C2387Q6872d592k36860A22942b29700B0059
$$ plain form
18430 -128422 -43896 -135636 47199 -108483 118077 -113190 243795 126527 372632 -2422
18419 -335614 -258283 474570 309088 -152684 -101903 -26571 -71020 -87483 -22607 -67091 -108574
18408 -108574 -186692 33334 373714 201800 22234 -84782 -8504 70424 225104 22812 -28888
18396 -35600 -315947 -273751 209919 -180872 -17254 97626 195587 -225636 17690 -195885 82458
18384 -85923 91710 -21573 -51160 -185178 -60217 -31638 -45561 230839 41512 -444700 -164694
18372 -265034 -114089 -142757 -147391 -307526 67393 123849 -53545 -38383 130668 146588 289258
18361 289258 -118258 -20299 -387369 130597 -35504 -60749 15789 131388 60447 -55038 -310657
18350 -310657 50386 -103243 -257934 -454515 -42400 -371264 98914 -23505 115008 12205
$$ packed form
18430a28422d3896r1740D7199a08483A18077a13190B43795j17268K46105b422
18419c35614P7331D74570j65482a52684N0781b6571m4449j6463b2607m4484m1483
18408a08574p8118C3334L40380j71914B2234h4782h504G0424J54680B2812b8888
18396c5600k80347M2196B09919a80872a7254I7626R7961b25636A7690a95885H2458
18384h5923I1710b1573k9587j34018f0217K8579j3923B30839D1512d44700a64694
18372b65034a14089k8668m634j60135F7393N6456e3545J5162A30668J5920J42670
18361B89258a18258b0299l67070A30597c5504k5245A5789J15599F0447e5038k55619
18350c10657E0386a03243j54691j96581d2400l28864I8914b3505A15008A2205
$$ plain form
18339 -281920 -181127 -186320 173470 64431 96078 -288332 140449 -150169 -212432 -10341 -317563
18328 -317563 250993 -149946 107941 -307673 22424 -65836 -192577 -108437 -47057 64098
18317 -73353 218957 -19319 -114606 -169831 253956 24714 -124765 -656 -91048 92989 -22341
18305 -293276 -2462 -45332 -182559 26871 316244 28394 -78661 -16721 -47990 -242225 333939
18293 40801 -241376 373852 -262649 205850 -25759 -72764 55841 -253940 -144331 -231377
18283 -231377 328490 -143697 130408 -260307 196266 101329 -148986 -67439 -278742 -128920
18272 123394 -364034 93537 -322722 288729 -91654 -186821 -156811 -55512 -22723 -182469 3029
18260 99856 -150888 -86188 -277368 235378 121049 27657 44600 196074 587 -319569 1118
$$ packed form
18339b81920J00793n193A73470F4431L1647b88332A40449a50169o2263a0341l07222
18328c17563B50993a49946A07941c07673B2424f5836j26741Q4140d7057F4098
18317g3353B18957a9319r5287n5225B53956B4714a24765f56r0392I2989b2341
18305b93276b462m2870j37227B6871K89373B8394g8661a6721l1269j94235C33939
18293D0801b41376C73852b62649B05850b5759m7005E5841b53940J09609q7046
18283b31377C28490a43697A30408b60307A96266r4937a48986f7439k11303a28920
18272A23394c64034I3537c22722B88729i1654r5167L0010e5512b2723j59746C029
18260I9856a50888O4700j91180B35378j14329B7657J6943J51474E87c19569A118
$$ plain form
18248 -478995 -181750 81645 341964 -102491 123629 215860 37806 -195679 90478 37444
18237 20891 -73325 -116802 390496 -104054 6077 156644 -260772 173710 56929 -50977 255226
18225 141075 -227326 -132897 -81590 -141885 102527 -157250 34329 45020 -101161 -249507
18215 -249507 -91358 -107897 -215145 -131867 103738 276587 213420 -83863 -94557 -309445 -93979
18203 -266070 -45526 -115024 76359 53696 -272460 102445 -272224 -10648 61197 14296 12730
18192 12730 6728 -251360 -79394 -487745 110151 -81223 -118435 -18551 23983 -126611 91944
18180 -72674 3031 128322 -38213 39819 215027 -141096 -589354 -156884 -221618 -50111 -286504
18169 -286504 -146075 -190595 255269 -6729 -109079 109838 106567 -292139 -100592 -22055 27816
$$ packed form
18248d78995a81750H1645K60319a02491A23629R2231C7806a95679I0478C7444
18237B0891g3325m3477C90496a04054F077J50567b60772A73710E6929e0977B55226
18225A41075b27326R4429N1307o0295A02527a57250C4329J0691a01161j48346
18215b49507i1358j6539j07248Q3278A03738J72849o3167h3863j0694k14888i3979
18203b66070d5526o9498G6359k2663b72460A02445b72224a0648F1197A4296j566
18192A2730o002b51360g9394m08351A10151h1223l7212a8551B3983a26611I1944
18180g2674C031J25291c8213C9819J75208a41096m48258a56884o4734e0111k36393
18169b86504J40429m4520B55269f729j02350A09838l271b92139a00592b2055B7816
$$ plain form
18157 106872 242642 -313238 -118641 175300 -181253 -137136 210170 19993 63662 -133235
18146 105708 -76710 -10685 124106 -263022 -93622 -43098 104905 -327163 167844 -5070 245401
18134 -16454 -278914 194758 86954 -377298 -123944 -107917 419429 -105480 106867 149782
18124 149782 98067 -17610 8812 -175725 110867 172359 -166588 -63106 246886 -93404 -74910
18113 -74910 -93461 135854 63434 161557 88631 6039 -386819 -61206 53999 216670 -49378
18101 299137 114117 -115121 53736 6675 149370 -93857 79283 143595 198219 88649 238680
18090 238680 275920 236016 -102323 -83500 -22236 263474 -480241 -189891 132922 116908
18080 116908 -21088 -130787 230699 -221270 -7184 -274591 316540 144588 71440 -1063 -260421
$$ packed form
18157A06872J35770c13238a18641A75300a81253M4117B10170A9993M3669a33235
18146A05708g6710a0685A24106b63022i3622d3098A04905c27163A67844e070B45401
18134a6454k62460A94758H6954c77298a23944J6027D19429a05480A06867M2915
18124A49782n1715a7610H812a75725A10867O1492a66588f3106B46886i3404J8494
18113g4910j8551A35854F3434R8123p2926F039c86819f1206E3999J62671d9378
18101B99137A14117a15121E3736F675J42695i3857G9283O4312N4624H8649J50031
18090B38680L7240l9904a02323J8823b2236B63474d80241a89891A32922j6014
18080A16908b1088j09699B30699b21270g184k67407C16540A44588G1440a063k59358
$$ plain form
18069 -260421 -69992 78769 -207707 -31276 7199 -346742 -257431 32635 -167358 -84113 169550
18057 -12469 125197 17903 -16321 -217534 -343954 -131226 228533 45746 -35896 -140312
18047 -140312 -40820 -95532 -212090 -147751 232227 4095 6815 -168728 232409 -64044 68754
18035 87026 6911 85108 -91326 -12588 24698 -203321 -44196 234942 -317830 407891 150194
18023 85856 114897 -14296 85503 -69541 -184603 78107 -39712 51250 -100037 -23601 -101689
18012 -101689 -123905 -218697 155542 -40347 -7793 30035 -174481 -123919 -275265 250337 42448
18000 222265 213027 160509 137581 223249 169446 -15563 -158872 -19050 159236 -26754 -61116
17989 -61116 35054 104843 245563 31678 -194071 -184946 234856 -183189 158313 -191888 -99519
$$ packed form
18069b60421f9992G8769b07707c1276G199c46742Q9311C2635a67358Q3245A69550
18057a2469A25197A7903a6321k01213j26420a31226B28533D5746c5896j04416
18047a40312d0820n4712j16558O4339B32227D095K720a68728B32409f4044F8754
18035H7026F911P8197i1326a2588B4698b03321d4196B34942c17830D07891A50194
18023H5856K9041a4296H5503f9541j15062G8107c9712E1250a00037b3601p8088
18012a01689k2216r4792A55542d0347g793C0035a74481N0562j51346B50337D2448
18000B22265r238n2518k2928Q5668n3803a5563j43309a9050A59236b6754l4362
17989f1116C5054O9789J40720C1678a94071R125B34856a83189A58313a91888R2369
$$ plain form
17978 -99519 -232684 19478 -149608 -28139 -257362 -155735 -136996 149444 -137761 -226134
17968 -226134 -422593 113794 136279 -178560 23291 -302093 -3123 40531 -9525 -459815 -114211
17956 -80039 -110995 77598 207969 -217793 83161 32688 -246409 188102 181898 175075 2156
17944 1965 107765 74349 -97038 -104544 155944 -33169 -165081 -70116 88221 143322 100337
17933 100337 160704 110797 -19197 274776 -366 136474 41010 -22633 155358 149322 206062
17922 206062 -57146 117505 -161200 -105118 94005 -34855 79058 5455 194568 260181 -33234
17910 -356956 305430 246739 41208 -33999 -7283 -207319 71904 11851 99479 -82120 153960
17898 -332611 -83730 100278 -67533 -92012 -194450 -325465 -54986 -184890 102157 -544723
$$ packed form
17978i9519j33165A9478a49608b8139k29223J01627J8739A49444a37761q8373
17968b26134j96459A13794K2485a78560B3291c02093c123D0531i525m50290a14211
17956h0039l0956G7598J30371b17793H3161C2688b46409A88102o204o823B156
17944A965J05800l3416i7038p506A55944c3169j31912g0116H8221N5101m2985
17933A00337O0367m9907a9197B74776c66A36474D1010b2633A55358o036N6740
17922B06062e7146A17505a61200N6082I4005c4855G9058E455J89113O5613c3234
17910c56956C05430n8691D1208c3999g283k00036G1904A1851Q7628h2120A53960
17898c32611h3730A00278f7533k4479j02438j31015e4986j29904A02157e44723
$$ plain form
17887 -105479 -131722 99199 50039 138632 -11252 -174260 -181687 223913 140000 300706 -10073
17875 -22665 -108946 -219958 22090 -188116 -153726 -59587 -40187 9160 -116720 -53537 -96786
17864 -96786 207484 179221 198737 21352 -51000 116850 52181 193859 169030 -51832 70945
17852 -40078 -212083 -243408 -101490 -183943 -191844 61977 -14547 247811 -340730 -230658 -229441
17841 -229441 -55315 -434539 -36673 -124319 129966 -204 27337 191375 -329627 -87794 -148312
17830 -148312 -9022 50699 -99154 -191164 -152018 -212983 -793 -204993 -31492 336299 30599 -65792
17817 -55552 -25628 32776 73535 138588 30170 147443 353687 -239861 -138844 44268 212394
17806 212394 92908 321086 -44985 162592 -90225 46172 218888 -55604 -71483 211269 41149
$$ packed form
17887a05479k6243I9199m9160Q8593a1252j63008p427B23913q3913J60706a0073
17875b2665q6281j11012B2090a88116L4390e9587J9400I160a16720e3537m3249
17864i6786B07484k8263J9516B1352e1000A16850E2181J41678k4829e1832G0945
17852d0078j72005l1325a01490q2453p901F1977a4547B47811c40730J10072J217
17841b29441e5315l79224c6673q7646A29966b04B7337J64038c29627h7794o0518
17830a48312i022E0699i9154r2010L9146o0965g93k04200c1492C36299C0599f5792
17817e5552b5628C2776M0759O5053C0170J17273K06244b39861J01017D4268J68126
17806B12394I2908K28178d4985A62592i0225D6172J72716e5604j5879B11269D1149
$$ plain form
17794 263614 -202557 -54650 -242501 32608 -37833 128292 112479 114426 -463340 186089 -16180
17782 -335751 158710 -220352 157252 -89521 142579 243269 202503 -176986 48154 76114
17772 76114 134550 173771 -339935 64795 169946 -166729 118735 96893 -353373 362599
17761 31926 -74916 -351975 56807 -94602 280020 179348 -278918 -132194 -118919 6707 365159
17750 365159 71267 -219772 63380 546 153171 31534 -1559 26752 96856 48331 60864 114774
17738 114774 120418 5182 -59008 333791 -167464 -10485 59037 204301 -142007 267024 -117412
17726 -569679 753 167061 -142634 122762 -69856 258262 159393 215160 94914 -273498 28151
17714 35160 355374 -39066 100199 133610 -196664 -431693 158188 -134944 -90602 -65728
$$ packed form
17794B63614b02557e4650j87851C2608c7833A28292j5813J947d63340A86089a6180
17782c35751A58710b20352A57252h9521A42579J00690m0766a76986D8154K7960
17772G6114N8436L9221c39935F4795J05151a66729A18735k1842c53373C62599
17761C1926g4916k77059E6807i4602B80020j00672b78918a32194J3275F707L58452
17750C65159G1267b19772F3380E46J52625C1534a559B6752P0104D8331J2533N3910
17738A14774N644E182e9008C33791a67464a0485E9037J45264a42007B67024a17412
17726e69679G53J66308a42634A22762f9856B58262r8869N5767I4914b73498B8151
17714C5160L20214c9066A00199L3411a96664k35029A58188a34944M4342K4874
$$ plain form
17704 -65728 -36398 170494 -42751 72884 68923 31552 57921 139176 -230081 -14500 500686
17692 -240290 5400 340311 116724 47429 196099 -150939 -183612 1266 171643 -54753 -21768
17680 -294765 60747 48862 253032 210252 -127061 38550 310712 -67196 154651 137304 69046
17669 69046 -145014 253246 116726 198937 192598 202568 -206457 110510 52849 -307401 -169443
17658 -169443 -132813 -29994 7548 421658 -291029 -34769 -88332 73720 -1980 -249847 28020
17646 66852 -69928 -50532 -177105 8420 -167410 144679 5439 314510 172036 -138300 35038
17634 45541 -174984 139278 -341518 -251837 61313 -93891 -245300 152063 281924 -77373
17623 -80191 -117068 18632 -142056 27672 146477 -175833 124304 50159 -25135 143402 201157
$$ packed form
17704f5728K9330A70494d2751G2884l961C1552K6369Q1255b30081a4500E00686
17692b40290E400L34911A16724D7429J48670a50939l2673A266J70377e4753b1768
17680b94765F0747j1885K04170m2780a27061C8550K72162f7196A54651j7347o8258
17669F9046a45014B53246A16726Q2211o339R970b06457A10510E2849c07401J37958
17658a69443L6630b9994G548M14110b91029c4769n3563G3720a980k47867B8020
17646F6852f9928J9396j26573H420a67410A44679E439L09071j42474a38300C5038
17634D5541a74984A39278c41518Q9681F1313i3891j51409A52063J29861g7373
17623h0191l6877A8632a42056B7672J18805a75833A24304E0159b5135A43402N7755
$$ plain form
17612 201157 65933 274399 -288384 -63644 2951 -128866 171377 -33552 -284205 366869
17601 -151259 204644 258388 249708 -162063 -173369 -165519 187938 181987 194928 -29999 142661
17589 153433 103126 74056 111210 477460 -224061 370250 126446 227516 67159 -314894
17578 -273473 126351 -75406 -23830 138110 -193161 75418 108838 277247 -62369 104918
17567 56803 -103181 -230889 -70417 -146234 487251 1020 -86240 274210 63301 82315 89196
17556 89196 -41370 193984 -130274 70795 111244 280742 83461 -97364 276321 -302414 -49416
17544 149265 45193 -167506 300293 179312 220568 -155521 -46027 -44043 274803 137619
17534 137619 163610 184633 119768 -116841 -149914 140611 -21903 -134733 -147224 -70304 -122768
$$ packed form
17612B01157F5933K08466b88384f3644B951a28866A71377c3552k50653C66869
17601a51259B04644N3744q680a62063j1306P850A87938n951J2941b9999A42661
17589A53433n0307k9070L7154L66250b24061C70250A26446J01070F7159c14894
17578b73473A26351g5406b3830A38110a93161G5418L3420J68409f2369A04918
17567E6803a03181j27708g0417p5817D87251A020h6240B74210F3301J9014O881
17556H9196d1370A93984a30274G0795M0449J69498H3461i7364B76321c02414d9416
17544A49265D5193a67506C00293j20981M1256a55521d6027J984B74803j37184
17534A37619K5991K1023o4865a16841l3073A40611b1903j12830j2491g0304n2464
$$ plain form
17523 -122768 -43164 252099 -25488 242362 114034 145261 295870 242064 282000 361550 -40833
17511 97705 -14823 -18067 111784 66495 -233128 43130 290335 -1457 90199 328524 203873
17500 203873 -75378 -22634 48719 -76519 76652 69675 219064 152989 265178 -16815 101534
17488 27335 -162711 247753 -13869 20028 -204332 193200 76192 317778 276641 344701 245639
17477 245639 204563 -68463 154014 186090 143005 83138 100662 -166015 281657 264816 -88486
17465 484260 48922 37646 14862 294286 2368 165550 235955 -211186 378752 -18403 282043
17453 297065 329545 -38142 280996 104520 -629 143403 365465 267215 354089 233791 340290
17442 340290 203309 257025 250325 300133 273509 110949 -70501 345638 -12954 303398 327431
$$ packed form
17523a22768d3164B52099b5488B42362A14034L1227J50609n3806L9936P9550d0833
17511I7705a4823l244A11784m5289b33128D3130K47205a457I0199K38325j24651
17500B03873g5378b2634D8719g6519G6652o977J49389o6075J12189a6815A01534
17488B7335a62711B47753a3869B0028b04332A93200G6192K41586m1137O8060r9062
17477B45639m1076f8463A54014L2076m3085n9867J7524a66015B81657j6841h8486
17465D84260D8922j1276A4862K79424B368J63182P0405b11186C78752a8403B82043
17453B97065L2480c8142B80996A04520f29A43403K22062r8250Q6874j20298J06499
17442C40290j36981N3716o700M9808k6624A10949g0501C45638a2954C03398K4033
$$ plain form
17431 327431 137314 339861 55991 155304 207803 445125 111058 149273 131099 456355
17421 456355 142809 338159 180093 236625 107790 284517 419194 200842 492642 38553
17410 17742 323621 83158 4440 -189947 205977 3999 11536 -66905 -142807 54386 89237 139470
17398 139470 25372 213716 328982 21809 423393 69430 84696 426303 76082 435800
17388 435800 471282 -444088 167532 161539 -3850 33509 -17384 199801 409213 -37310 278980
17376 -151077 101292 92333 207727 56040 92920 -255606 528132 238822 42938 140409 118802
17365 118802 354862 16409 -77596 -51795 -56938 42204 231489 41136 82370 188758 -95579
17353 206341 262002 -79051 352224 39036 -96056 -237682 43935 -25362 202599 34048 60788
$$ packed form
17431C27431A37314K02547E5991R9313N2499K37322A11058L8215j8174L25256
17421D56355A42809J95350j58066N6532A07790J76727J34677B00842K91800C8553
17410A7742L05879H3158D440a89947B05977C999P537f6905p5902E4386L4851N0233
17398A39470B5372J88344J15266B1809M01584F9430J5266L41607G6082L59718
17388D35800L5482d44088A67532n993c850C3509a7384A99801K09412c7310B78980
17376a51077A01292q959J15394E6040L6880b55606E28132B38822D2938R7471k1607
17365A18802K36060A6409g7596K5801n143D2204J89285D1136M1234J06388i5579
17353B06341N5661g9051C52224C9036i6056j41626D3935b5362B02599C4048K6740
$$ plain form
17342 60788 124052 142759 -16337 293151 211292 381146 220533 155265 137182 75055 -7444
17330 423967 396782 -54299 128531 -144104 -93096 91118 211379 -325151 -24336 234085
17319 269529 161354 78156 28190 85543 83215 375807 499376 302236 272959 158663 520754
17308 520754 202259 175051 157923 116840 94379 262872 186075 322725 10041 578103 30805
17296 177696 239364 398108 75425 182469 -96981 299947 -33072 178068 111511 81910 497474
17285 497474 -17496 305556 92098 283762 640121 347528 -54429 347273 -106803 47988
17274 315742 548234 272420 106309 74576 338040 26014 202926 306708 373433 87900
17263 182900 90644 71386 150665 120565 53248 -91457 46400 210916 168036 83320 107180
$$ packed form
17342F0788O3264J8707a6337B93151q1859J69854j60613o5268j8083o2127g444
17330D23967k7185e4299A28531a44104N1008I1118J20261c25151b4336B34085
17319B69529j08175G8156B8190N7353k328K92592J23569j97140k9277j14296L62091
17308E20754B02259k7208j7128m1083k2461J68493p6797J36650A0041N68062C0805
17296A77696O1668J58744G5425J07044i6981B99947c3072A78068o6557k9601M15564
17285D97474a7496C05556I2098J91664L56359k92593e4429C47273a06803D7988
17274C15742K32492B72420A06309l1733K63464B6014J76912J03782O6725H7900
17263A82900I0644j9258P9279l0100E3248i1457D6400J64516m2880H3320K3860
$$ plain form
17252 107180 401610 307649 97432 11376 316276 217364 505036 585768 218731 440500
17242 440500 179585 327627 68489 93390 260729 -90358 502043 222289 223186 131268 156852
17231 156852 398650 182174 228050 159526 164641 274320 51870 235474 384730 336051 60752
17219 316331 139796 207779 546489 149871 -256768 208622 287489 268548 180535 558390
17209 558390 133885 172266 277206 145537 342269 127524 230811 146584 562153 110318
17198 -40609 115812 115590 179040 35404 76587 265171 73886 258383 150002 278209 116815
17186 152702 -101009 369336 209451 160772 75038 189763 233213 -37093 233489 501973
17176 501973 419439 129464 359958 214003 390021 203276 493313 354504 235619 -107712
$$ packed form
17252A07180K94430r3961I7432A1376L04900r8912K87672Q0732B18731K21769
17242D40500A79585J48042F8489K4901J67339i0358E02043B22289Q97r1918K5584
17231A56852K41798A82174M5876o8524N115J09679E1870J83604J49256m8679F0752
17219C16331A39796O7983L38710A49871b56768B08622P8867j8941q8013L77855
17209E58390A33885L8381J04940j31669J96732A27524J03287q4227M15569A10318
17198d0609A15812k22O3450C5404M1183J88584G3886J84497j08381J28207A16815
17186A52702a01009C69336j59885m8679G5038J14725M3450c7093B33489K68484
17176E01973q2534A29464K30494j45955J76018j86745K90037j38809j18885a07712
$$ plain form
17165 205292 529695 145339 426991 234734 571390 34321 404889 417270 372706 572160
17155 572160 341660 375412 208888 186844 270403 16710 584743 490732 274747 330684 442936
17144 442936 183226 712995 468004 115493 179718 646778 345230 493154 26550 75602
17134 75602 340590 204951 350363 269959 258979 169825 385055 76667 384226 482194 219018
17122 337619 -20353 352985 485355 297345 154242 242661 138458 260104 527329 495781
17112 495781 382467 149032 729339 448904 173409 472178 386599 296030 451361 262267
17102 262267 409756 468372 370791 625830 270469 636053 626121 652979 513315 510950 371387
17091 371387 675101 282966 491978 295921 274161 352398 411566 96501 651541 477666
$$ packed form
17165B05292L24403A45339K81652j92257L36656C4321L70568J2381m4564J99454
17155E72160k30500L3752j66524k2044Q3559A6710N68033r4011k15985N5937J12252
17144D42936A83226N29769k44991A15493O4225M67060l01548J47924B6550M9052
17134G5602K64988j35639J45412q0404j0980q9154K15230G6667L07559R7968B19018
17122C37619b0353C52985J32370j88010j43103Q8419j04203J21646K67225l1548
17112D95781j13314A49032N80307k80435A73409K98769q5579r0569J55331j89094
17102B62267J47489N8616r7581K55039B70469L65584r932K6858j39664k365j39563
17091C71387L03714B82966K09012j96057k1760P8237N9168I6501N55040j73875
$$ plain form
17081 477666 317230 510196 172916 569403 483548 453092 339571 76983 354989 431840
17071 431840 540545 66763 321343 530259 544231 285372 899233 680891 468645 343619
17061 343619 457670 605579 434765 502474 203075 635703 453947 263483 456280 492191
17051 492191 502646 475359 533333 405216 436859 667404 350844 731502 670955 873476
17041 873476 350737 799806 609880 629068 395361 424448 615598 554877 434892 259363
17031 259363 617813 470028 840017 528590 396618 725304 531557 698474 673833 521456
17021 521456 781827 1128003 777598 556208 752421 792277 538970 1104059 630187 870059
17011 870059 927093 550719 704751 531654 483590 891981 799181 1021142 968865 604955
$$ packed form
17081D77666j60436J92966A72916L96487q5855l0456j13521G6983K78006P6851
17071D31840J08705F6763K54580K08916J3972k58859O13861k18342k12246j25026
17061C43619J14051J47909j70814O7709B03075M32628j81756j90464J92797L5911
17051D92191J0455k7287N7974j28117L1643K30545l16560L80658o0547K02521
17041H73476C50737M49069j89926J9188k33707K9087J91150o0721j19985j75529
17031B59363L58450j47785L69989l11427j31972L28686j93747J66917k4641j52377
17021E21456K60371L46176l50405k21390J96213L9856k53307N65089m73872K39872
17011H70059N7034l76374J54032j73097m8064M08391r2800K21961n2277l63910
$$ plain form
17001 604955 668812 971449 486973 787805 728884 924363 1035390 780683 665040 926779
16991 926779 692111 952851 740248 1243683 809270 777963 592414 704841 893526 847253
16981 847253 709256 738877 966395 799602 861569 340844 716863 878179 995399 1152947
16971 1152947 681300 850168 758475 720338 1227870 964793 918163 719527 1094020 829492
16961 829492 943692 690330 922310 813271 1185975 1054021 592612 1175299 988146 1026036
16951 1026036 1228701 1171417 1171986 859461 1008201 944588 1096101 1098684 1500548 958952 903958
16940 903958 1313620 1216169 1202809 1083962 1111938 975024 1336522 1288097 891258 1221303
16930 1221303 1344633 1332943 1166229 1709250 1168902 1336500 1546229 1426278 1333354 1609170
$$ packed form
17001F04955O3857L02637m84476L00832n8921J95479J11027k54707j15643K61739
16991I26779k34668K60740k12603N03435m34413l1307j85549J12427J88685m6273
16981H47253j37997K9621K27518j66793O1967C40844L76019J61316J17220J57548
16971A152947m71647J68868r1693l8137N07532k63077m6630j98636L74493k64528
16961H29492J14200k53362K31980j09039L72704j31954m61409N82687j87153L7890
16951A026036K02665n7284N69l12525J48740o3613J51513K583M01864n41596n4994
16940I03958M09662r7451j3360j18847K7976j36914L61498m8425l96839L30045
16930A221303J23330j1690j66714N43021n40348J67598K09729j19951r2924K75816
$$ plain form
16920 1609170 1726982 1650686 1658339 1501107 1596350 1292957 1489570 1682685 1776950 1541128
16910 1541128 1303106 1550685 1813985 1395263 1675273 1765675 1791792 1727747 1928206 1748901
16900 1748901 1918160 1841800 1786286 1870634 1802679 1537671 1732707 1817726 1917376 2147337
16890 2147337 1925724 2034470 1815182 1653839 1759900 2220030 1844828 1950785 2307660
16881 2307660 2183045 2081603 2036878 2357914 2353794 2354113 2004907 2379036 2357047 2544570 2562677
16870 2562677 2562835 2723223 2441306 2538872 2285604 2688010 2550934 2671041 2820904 3058623
16860 3058623 2892929 2601908 2837743 2828833 2724808 2580934 2800467 3335134 3329386 3294987
16850 3294987 3302943 3235173 3184764 3377461 3416958 3337825 3440929 3750468 3716542 3714253 3731355
$$ packed form
16920A609170J17812p6296P653j57232R5243l03393J96613J93115R4265k35822
16910A541128k38022K47579K63300m18722K80010R0402K6117o4045K00459j79305
16900A748901J69259p6360n5514Q4348o7955k65008J95036Q5019R9650K29961
16890B147337k21613J08746k19288j61343J06061M60130l75202J05957L56875
16881B307660j24615j01442m4725L21036m120L19l49206L74129k1989J87523J8107
16870B562677J58J60388k81917R7566k53268M02406j37076J20107J49863K37719
16860C058623j65694k91021K35835q910j04025j43874K19533N34667n748l4399
16850C294987P956o7770n0409J92697L9497p9133J03104L09539l3926k289J7102
$$ plain form
16839 3731355 3897017 3647056 3658656 4138164 4157086 3960308 4282374 4251946 4700525 4590427
16829 4590427 4245489 4643758 4583853 4832443 4426828 4969372 5275531 5130704 5207732 5256311
16819 5256311 5408205 5626525 5690058 5474119 5812413 5822669 6040906 6144354 5925713 6593974
16809 6593974 6498564 6578231 6759918 6938499 7028537 7360308 7414781 7892326 7706979 8164644
16799 8164644 7869704 8352060 8695796 8759367 8910961 9065588 9549845 9399739 9597006 9979005
16789 9979005 10509486 10610571 10739028 11632122 11838888 11913473 11759843 12292329 13101082 13552314
16779 13552314 13567309 13999351 14521519 15102935 15335343 15951189 16202265 16905442 17324118
16770 17324118 17877670 18511644 19345126 19949591 20560199 21312198 22293780 23217873 23453481
$$ packed form
16839C731355J65662k49961J1600M79508J8922j96778L22066l0428M48579j10098
16829D590427l44938L98269n9905K48590m05615N42544L06159j44827P7028M8579
16819E256311J51894K18320O3533k15939L38294J0256K18237J03448k18641O68261
16809F593974r5410P9667J81687J78581R0038L31771N4473M77545j85347M57665
16799H164644k94940M82356L43736O3571J51594J54627M84257j50106J97267L81999
16789I979005N30481J01085J28457Q93094K06766P4585j53630N32486Q08753M51232
16779A3552314J4995M32042N22168N81416K32408O15846K51076P03177M18676
16770A7324118N53552O33974Q33482O04465O10608P51999R81582R24093K35608
$$ plain form
16761 23453481 24810165 25761599 26564781 28160487 29114905 30140835 31302989 32692176
16753 32692176 34145468 35412137 37426927 39198290 41037702 42999248 44912093 47325503
16745 47325503 49967201 52358372 55168645 58094937 61148124 64742878 68539527 72383038
16737 72383038 76391100 81022003 86015830 91021077 96371443 102234249 108239088 115162818
16729 115162818 121591048 128386817 135793075 143399918 150955086 158194246 165691672 172731870
16721 172731870 179066442 185160870 189874852 194129429 197060054 198192894 199049798 197856626
16713 197856626 195860214 192432835 187964447 182581928 176501245 169708422 162703796 155253759
16705 155253759 147900926 140153731 132403492 125332205 118134088 111675530 104664858 98820357
$$ packed form
16761B3453481J356684R51434Q03182J595706R54418J025930J162154J389187
16753C2692176J453292J266669K014790J771363J839412J961546J912845K413410
16745D7325503K641698K391171K810273K926292L053187L594754L796649L843511
16737G2383038M008062M630903M993827N005247N350366N862806O004839O923730
16729A15162818O428230O795769P406258P606843P555168P239160P497426P040198
16721A72731870O334572O094428M713982M254577K930625J132840Q56904j193172
16713A97856626j996412l427379m468388n382519o080683o792823p004626p450037
16705A55253759p352833p747195p750239p071287p198117o458558p010672n844501
$$ plain form
16697 98820357 93190503 88086454 82398963 78217563 73506036 69579680 65475839 62142434
16689 62142434 58715250 56003172 52412739 50041212 47315186 44741475 42771346 40719201
16681 40719201 38616735 37262176 35262025 34060478 32454729 30684539 29336086 28164163
16673 28164163 27128847 26167481 25047030 24116030 23069637 22001565 21381961 20362884
16665 20362884 19796857 19023134 18431270 17720890 16821127 16568890 16083497 14996591 15116747
16656 15116747 14675826 13917488 13331848 13132334 12728762 12531372 11932535 11254763 11219920
16647 11219920 10864514 10839015 10235911 9873001 10054824 9516043 9414997 8908574 8771235
16638 8771235 8772776 8717956 8129719 8038937 7906090 7527307 7407678 7153388 6728788 6746943
$$ packed form
16697I8820357n629854n104049n687491m181400m711527l926356m103841l333405
16689F2142434l427184k712078l590433k371527k726026k573711j970129k052145
16681D0719201k102466j354559k000151j201547j605749j770190j348453j171923
16673B8164163j035316r61366j120451r31000j046393j068072o19604j019077
16665B0362884n66027p73723n91864p10380q99763k52237m85393j086906J20156
16656A5116747m40921p58338n85640j99514m03572j97390n98837o77772l4843
16647A1219920l55406k5499o03104l62910J81823n38781j01046n06423j37339
16638H771235J541n4820n88237r0782j32847l78783j19629k54290m24600J8155
$$ plain form
16628 6746943 7012955 6617905 6592968 6496416 6399058 6205443 5957736 5587150 5518065 5634363
16618 5634363 5284789 5073133 5136740 5057152 4932348 4989369 4769284 4334287 4466818 4492937
16608 4492937 4557614 4369628 4055439 4402922 4092929 3934507 4001518 3891561 3945440 3743096
16598 3743096 3583880 3819462 3449899 3850272 3589713 3288832 3406985 3370649 3270685 2701516
16588 2701516 3151423 2965704 2834396 2887630 2871794 2980014 2790373 2773218 2872729 2747328
16578 2747328 2723059 2532818 2713461 2681109 2700800 2433286 2686675 2160331 2220823 2365862
16568 2365862 2122412 2216191 2518010 2272952 2276271 1801439 2318370 1838306 1836516 1993665
16558 1993665 2124124 2180593 2113992 1851507 2085203 1884983 1980317 1756985 1605181 1713349
$$ packed form
16628F746943K66012l95050k4937r6552r7358j93615k47707l70586o9085J16298
16618E634363l49574k11656O3607p9588j24804N7021k20085m34997J32531K6119
16608D492937O4677j87986l14189L47483l09993j58422O7011j09957N3879k02344
16598C743096j59216K35582l69563M00373k60559l00881J18153l6336r9964n69169
16588B701516M49907j85719j31308N3234j5836J08220j89641j7155R9511j25401
16578B747328k4269j90241J80643l2352J9691k67514K53389n26344O0492J45039
16568B365862k43450R3779L01819k45058L319m74832N16931m80064j790J57149
16558A993665J30459N6469o6601k62485K33696k00220R5334k23332j51804J08168
$$ plain form
16548 1713349 1665068 1791743 2178351 1513829 1582178 1639352 1426472 1651889 1392503 1710747
16538 1710747 1817979 1443260 1752772 1571358 1361575 1516145 1579245 1549805 1367988 1199075
16528 1199075 1624941 1725653 1380716 1383018 1335689 1392259 1378841 1377213 1283441 1473088 1498846
16517 1498846 1110116 1131002 1163588 973349 833649 1116904 1039054 1301749 1303827 1304324 1453846
16506 1453846 1098346 955023 1113648 1279681 1454452 808929 841723 1552514 1365650 1146926
16496 1146926 1231525 1155250 1074006 1286284 1300531 677256 1169637 906053 682396 1030431
16486 1030431 890561 918327 699414 884007 1017124 809091 866255 737769 844724 522496
16476 522496 836747 658987 685164 938298 911024 761776 894473 840775 789585 880366
$$ packed form
16548A713349m8281J26675L86608o64522O8349N7174k12880K25417k59386L18244
16538A710747J07232l74719L09512j81414k09783J54570O3100k9440j81817j68913
16528A199075M25866J00712l44937K302m7329N6570j3418j628r3772J89647K5758
16517A498846l88730K0886L2586j90239j39700K83255p7850K62695K078M97J49522
16506A453846l55500j43323J58625J66033J74771o45523L2794P10791j86864k18724
16496A146926Q4599p6275q1244K12278J4247o23275M92381k63584k23657L48035
16486A030431j39870K7766k18913J84593J33117k08033N7164j28486J06955l22228
16476E22496L14251j77760K6177K53134k7274j49248J32697n3698n1190R0781
$$ plain form
16466 880366 932198 685996 733955 558430 1082078 640086 741718 314429 700268 747061
16456 747061 837454 973605 590220 708697 818923 868072 632442 520619 717407 753236
16446 753236 899605 883628 761533 386030 627021 284618 848286 594740 781102 795970
16436 795970 458404 456089 461069 675468 726656 650289 225261 538839 606637 460892 620765
16425 620765 710777 171272 375798 393709 846267 364066 675836 453314 579276 266721
16414 63362 583182 840217 274093 428194 442881 219595 532103 840650 260759 753748
16404 753748 295087 518900 444820 420151 288664 537667 393304 267970 445984 390358
16394 390358 259759 -67400 346727 182902 486396 558542 770905 496454 265800 534257
$$ packed form
16466H80366N1832k46202M7959j75525N23648m41992J01632C14429L85839M6793
16456G47061R0393J36151l83385J18477J10226M9149k35630j11823J96788L5829
16446G53236J46369j5977j22095l75503K40991B84618N63668k53546J86362J4868
16436G95970l37566k315M980K14399N1188p6367B25261L13578O7798j45745J59873
16425F20765R0012A71272K04526J7911M52558C64066L11770k22522J25962B66721
16414F3362N19820K57035B74093J54101J4687B19595L12508L08547B60759M92989
16404G53748B95087K23813p4080k4669j31487K49003j44363j25334J78014n5626
16394C90358j30599f7400C46727j63825L03494P2146K12363k74451k30654K68457
$$ plain form
16384 534257 563988 291239 155889 342720 102625 198694 141622 130222 283000 314321
16374 314321 325969 169001 533718 401908 311340 440343 390495 503802 343987 290203
16364 290203 173496 129447 400217 590079 395876 251156 39153 220623 603952 204009
16353 399713 240642 159780 334987 195954 191022 190986 267034 143579 209694 345532 406846
16342 406846 164042 490741 146930 267625 220067 344179 434527 400503 120158 62455
16332 62455 332976 347983 443784 87372 90432 -50001 345274 66422 242855 508574 26489
16320 306605 -41261 395519 78885 202232 268565 229434 285729 44602 174075 140769 163385
16309 163385 -84228 200204 503297 -68799 374449 -70049 -28637 528807 -103061 311885
$$ packed form
16384E34257K9731k72749j35350J86831A02625R6069n7072j1400J52778L1321
16374C14321J1648j56968L64717j31810r0568J29003m9848J13307j59815n3784
16364B90203j16707m4049K70770J89862j94203j44720C9153J81470L83329B04009
16353C99713j59071q0862J75207j39033m932l6P6048j23455O6115J35838O1314
16342D06846A64042L26699A46930J20695m7558J24112R0348l4024A20158n7703
16332F2455K70521J5007R5801H7372L060e0001C45274F6422J76433K65719B6489
16320C06605d1261C95519G8885J23347O6333l9131N6295D4602J29473l3306K2616
16309A63385h4228B00204L03093f8799C74449g0049b8637E28807a03061C11885
$$ plain form
16298 223158 383015 53355 -899 178673 217080 -43750 279296 108532 50866 160384 394602
16287 394602 -139125 68172 107597 501126 68826 158582 141818 269984 30921 75014 426477
16276 426477 243286 -78901 313419 233672 322762 -163408 -107065 365857 204267 -8102 147501
16264 432875 220585 219779 -34522 411185 36946 161275 50729 54583 32351 146749 272949
16253 272949 -25821 58503 222326 -157433 -64371 86530 -23986 197630 -40751 -5055 -253913
16242 -253913 432317 228771 140560 89346 -94184 505948 278536 -131610 111622 131997
16232 131997 284722 133024 254939 292875 -208714 179857 69050 323 245626 329888 214325
16221 214325 166889 134641 308039 162712 10810 291516 166177 83378 70911 352029
$$ packed form
16298B23158J59857E3355h99A78673L8407d3750B79296A08532E0866J09518K34218
16287C94602a39125F8172L9425L93529F8826Q9756j6764J28166C0921M4093L51463
16276D26477j83191g8901C13419p9747Q9090a63408N6343C65857j61590h102A47501
16264D32875k12290q06c4522D11185C6946J24329E0729L854k2232J14398J26200
16253B72949b5821E8503J63823a57433f4371H6530b3986A97630d0751e055k48858
16242b53913D32317k03546q8211n1214i4184E05948k27412a31610A11622K0375
16232A31997J52725A33024J21915L7936b08714A79857F9050C23K45303Q4262j15563
16221B14325m7436l2248J73398j45327A0810K80706j25339q2799j2467K81118
$$ plain form
16211 352029 221512 90391 41472 271503 -32534 16944 154133 63929 173213 129297 209226
16200 209226 249218 145655 30201 129594 -49886 102821 217537 189668 267126 209652 105728
16189 105728 232928 164711 206550 -50672 135918 231966 217028 -78038 -174795 164676 172785
16178 172785 -147591 58080 306937 -133109 282965 209707 -10631 105344 176932 -93217
16167 15205 38892 85253 266201 -326911 -52036 55109 79859 -39809 139964 237861 365832
16156 365832 -113796 125033 274628 -176367 -20615 133893 24171 77155 -213216 135152
16145 -48521 -97975 158890 67189 199036 201441 313216 77798 117092 -33120 169793 430307
16134 430307 -100903 426422 -444126 92625 91287 39960 -138473 102600 15646 227791
$$ packed form
16211C52029j30517I0391D1472K30031c2534A6944J37189F3929J09284m3916P9929
16200B09226L9992j03563C0201R9393d9886A02821J14716k7869P7458n7474j03924
16189A05728J27200o8217M1839e0672A35918R6048j4938g8038r6757A64676Q109
16178A72785a47591E8080K48857a33109B82965p3258a0631A05344P1588i3217
16167A5205K3687M6361J80948c26911e2036E5109K4750c9809A39964R7897J27971
16156C65832a13796A25033J49595a76367b0615A33893B4171N2984b13216A35152
16145d8521m9454A58890F7189J31847K405J11775G7798L9294c3120A69793K60514
16134D30307a00903D26422d44126I2625j338C9960a38473A02600A5646K12145
$$ plain form
16124 227791 -25366 131077 -69224 -39765 7370 -148961 -283728 105275 210856 -2242 -325573
16113 -325573 4302 130665 96489 -84530 -82190 373549 -269483 -34673 159791 107391 196324
16102 196324 -17655 49835 227013 173159 31462 148485 -167530 110904 -185781 44414
16091 -76899 -2438 -211998 -122140 254495 -94876 258317 121235 5362 -206466 185499 -21408
16079 81860 -307797 164815 98003 -121367 124791 -287660 33685 34447 -85121 -198599 257852
16067 63066 -159188 93809 308754 -5221 -157974 281742 -71893 -206573 73222 -213030 169896
16055 353781 84290 -70032 -115214 153876 302554 158628 -67144 -371625 159431 -350722
16044 53836 -144622 228032 209598 84171 -65592 211678 -276916 -124747 -221055 -158877 62126
$$ packed form
16124B27791b5366A31077f9224K9459G370a48961j34767A05275J05581b242l23331
16113c25573D302J26363l4176h4530K340C73549b69483c4673A59791n2400Q8933
16102A96324a7655D9835J77178n3854C1462J17023a67530A10904a85781D4414
16091g6899b438k09560Q9858B54495i4876B58317A21235E362b06466A85499b1408
16079H1860c07797A64815o6812a21367A24791b87660C3685P62h5121j13478B57852
16067F3066a59188I3809K14945e221j52753B81742g1893j34680G3222b13030A69896
16055C53781H4290g0032m5182A53876J48678j43926f7144l04481A59431c50722
16044E3836a44622B28032j8434H4171f5592B11678b76916a24747r6308O2178F2126
$$ plain form
16032 -42566 -158799 228307 -37110 22708 -69503 102580 -192279 -56993 -259874 216247
16021 224382 -4235 10258 70630 111645 -87797 -115424 17056 321462 115846 -65273 69758
16009 116062 -238129 23837 -144139 -31958 314172 101447 -174128 148113 118752 -132217
15998 109120 161370 -313620 42036 114944 -88333 144872 109135 -169788 -121822 171371 36872
15986 191759 -151073 147981 239820 5787 -249025 -104503 318556 343051 312684 -109159
15975 36448 12440 40008 522796 -107692 -201548 -109768 36359 23281 38658 233674 191534
15964 191534 195743 260711 -111119 447823 15762 103482 363122 -163076 -304016 155250
15953 -12274 -49791 107913 -196880 -106645 32387 90824 315523 -56041 77634 -18995 -183194
$$ packed form
16032d2566j16233B28307c7110B2708f9503A02580a92279e6993k02881B16247
16021B24382d235A0258O0372M1015h7797k7627A7056L04406A15846f5273F9758
16009A16062b38129B3837a44139c1958C14172A01447a74128A48113k9361a32217
15998A09120N2250c13620D2036P2908h8333A44872l5737a69788M7966A71371C6872
15986A91759a51073A47981R1839E787b49025a04503C18556K4495l0367a09159
15975C6448A2440K7568M82788a07692r3856R1780C6359j3078J5377J95016m2140
15964A91534M209O4968a11119D47823A5762Q7720K59640a63076j40940A55250
15953a2274l7517A07913a96880R0235C2387N8437K24699e6041G7634a8995j64199
$$ plain form
15942 -183194 -75227 -41768 -13968 -338510 -23936 -253871 26642 226161 -318598 -35773 215623
15930 -82905 61665 -160836 -28615 -146656 45717 -51556 -124936 -310098 -240168 -118259 62915
15918 -289391 17975 50069 12300 -22033 -181101 -110612 -140828 -24458 -4237 124886 255222
15907 255222 -298463 -186112 197018 -27824 40094 -126434 -51323 153023 85155 -70095
15896 -27610 -88087 -127033 -237304 308263 77197 -256215 -208274 -338655 354541 3560 -168832
15884 165415 248566 40918 57252 12312 -101613 284202 18520 147891 -104377 -331088
15874 -331088 69151 197254 -135953 -133187 -514080 -407206 -38121 -62504 -100980 -185492 79454
15862 -149454 230071 116155 -103406 49801 -527594 -105056 116339 -97274 -62602 -335746
$$ packed form
15942a83194g5227L3459a3968l24542b3936k29935B6642J99519c18598c5773B15623
15930h2905F1665a60836b8615j18041D5717e1556p3380j85162O9930a18259F2915
15918b89391A7975L2094A2300b2033j59068P0489l0216b4458d237A24886J30336
15907B55222b98463J12351A97018b7824D0094a26434e1323A53023o7868g0095
15896b7610o0477l8946j10271C08263G7197b56215M7941j30381C54541C560a68832
15884A65415Q3151D0918J6334A2312a01613B84202A8520J29371a04377k26711
15874c31088F9151J28103a35953K766l80893J06874c8121k4383l8476q4512G9454
15862a49454B30071j13916a03406D9801e27594a05056A16339i7274L4672k73144
$$ plain form
15852 -335746 94033 209836 13685 50539 113257 256930 -126158 -243157 -329511 -300019 -86852
15840 -123667 -235660 408839 339480 -643918 -172383 160476 19940 -19001 82623 305816
15830 305816 203964 45947 -285114 -413215 -132113 -39803 61640 -148663 -66194 -99064
15820 -99064 -184919 -157878 100383 -15834 -302527 -87897 -183629 -7789 42495 -156186 -252454
15809 -252454 -218972 4921 210521 -206122 48428 429391 131366 77190 141123 -7323 -181218
15798 -181218 202764 -366191 -18600 -52630 10058 -32908 -27814 54806 -5974 -88532 297130
15786 113792 48809 -467807 -187729 -140784 -41320 61078 246839 40249 -51131 83712 -46989
15774 49763 20185 -202388 -261160 -59925 29479 -58565 19656 149182 775 102460 57844
$$ packed form
15852c35746I4033J15803A3685L6854O2718J43673a26158j16999q6354K9492h6852
15840a23667j11993D08839o9359f43918a72383A60476A9940a9001H2623K23193
15830C05816j01852D5947b85114j28101a32113c9803F1640a48663f6194l2870
15820i9064q5855K7041A00383a5834k86693h7897r5732g789D2495a56186r6268
15809b52454L3482D921K05600b06122D8428L80963A31366n4176O3933g323j73895
15798a81218B02764c66191a8600l4030A0058c2908N094E4806e974q2558B97130
15786A13792D8809d67807a87729M6945d1320F1078J85761D0249e1131H3712d6989
15774D9763B0185b02388n8772e9925B9479e8565A9656J29526G75J01685m4616
$$ plain form
15763 57844 -85512 121859 -196353 75383 -239728 296374 -55391 32565 16666 261288 -325111
15751 -52195 -22903 -267266 86569 -53928 -328384 123826 184082 331474 -66799 429050 -10386
15739 -174825 -142958 -394162 166835 187970 263775 -137399 -22928 -39848 33540 -331891 -51344
15727 -117466 94432 25731 -48827 -146717 -42770 -101184 -221607 144011 145443 -141774 16915
15715 -213119 -77153 -35555 -210726 -179784 -42126 11194 -211363 -77243 76264 264925 -311264
15703 -180149 97081 231902 -456450 -227087 -20966 280746 72355 -175341 -113220 282668
15692 34168 84675 171689 -45510 -167606 -313520 -82073 -27715 -515973 46951 -187104 -103831
15681 -103831 134743 -124973 68711 29634 57421 -171580 139189 170880 315419 66617
$$ packed form
15763E7844h5512A21859a96353G5383b39728B96374e5391C2565j5899K44622c25111
15751e2195b2903k44363H6569e3928k74456A23826O0256J47392f6799D29050a0386
15739a74825L1867k51204A66835K1135P5805a37399b2928j6920C3540c31891e1344
15727a17466I4432B5731d8827r7890d2770n8414j20423A44011J432a41774A6915
15715b13119g7153c5555j75171L0942d2126A1194b11363g7243G6264J88661c11264
15703a80149I7081J34821d56450b27087b0966B80746G2355a75341O2121B82668
15692C4168N0507Q7014d5510j22096j45914h2073b7715m88258D6951a87104Q3273
15681a03831A34743a24973F8711B9634K7787a71580A39189L1691J44539F6617
$$ plain form
15670 256162 -240237 166998 323154 147617 -7838 281865 151086 -346784 -6472 -114943
15660 -114943 -7748 -65233 114499 110540 86728 190445 4121 76732 -167756 72509 -52720
15648 241255 -126210 -93307 -219794 -182083 90077 -124672 -8420 -21411 109480 591889 -427635
15636 -352339 -108160 82345 -83317 325847 42364 -20460 -46695 -121132 439151 -288568 -279472
15625 -279472 -297348 111646 -47007 -56543 -48064 236632 -13405 -297509 191522 -281005 -8568
15613 -131480 -127121 95789 133003 234654 -83141 -150133 13439 238843 -136216 179 222775
15602 222775 31668 184382 -237277 60632 108704 -189251 -131629 -129559 -42686 -168568 307175
15590 17898 -374710 249318 49163 122345 -64674 -215836 101607 -250383 259682 -132363
$$ packed form
15670B56162b40237A66998J56156A47617g838B81865j30779c46784f472j08471
15660a14943g748n7485A14499l959k3812J03717D121P2611a67756G2509e2720
15648B41255a26210L2903j26487L7711I0077a24672h420j2991A09480M82409d27635
15636c52339a08160H2345h3317C25847D2364b0460k6235p4437D39151b88568R096
15625b79472j7876A11646d7007r536Q479B36632a3405k84104A91522b81005h568
15613a31480M359I5789L7214J01651h3141o6992A3439K25404a36216A79K22596
15602B22775C1668J52714b37277F0632M8072a89251N7622K070d2686j25882C07175
15590A7898c74710B49318D9163P3182f4674j51162A01607b50383B59682a32363
$$ plain form
15579 200470 196990 38485 193984 -6959 -123194 -106786 -22204 -159681 -167176 93324 -108618
15567 -15677 119859 -397826 -185542 -92635 -277287 -184926 -417383 -48381 -106204 325145
15556 -120671 -105583 -121490 204973 -275062 124851 -9678 -3321 77844 3753 -70159 155127
15544 -359151 88094 20797 138876 -289792 -257530 50926 61174 4690 282974 -78604 262274
15532 159624 224878 81885 -276904 65231 10175 -364226 -179654 -129149 38242 110752 -171821
15520 221395 -79571 -254535 109205 310466 189214 -22324 -58833 -139771 402119 10268
15509 186950 200894 -38529 67658 141123 123647 100132 296660 151880 28999 205741 -113900
15497 129365 -93864 99501 203005 -501132 -163055 -79341 45463 200185 -230739 -240035 -37516
$$ packed form
15579B00470l480C8485J55499f959j16235J6408b2204j37477p495I3324a08618
15567a5677A19859c97826a85542i2635j84652R2361k32457d8381n7823C25145
15556a20671J5088j5907B04973b75062A24851i678c321G7844C753g0159A55127
15544c59151H8094B0797J18079b89792L2262E0926J0248D690K78284g8604B62274
15532A59624O5254H1885b76904F5231A0175c64226a79654N0505C8242P2510a71821
15520B21395g9571j74964A09205K01261j21252b2324l6509q0938D02119A0268
15509A86950J3944c8529F7658P3465j7476k3515J96528j44780B8999J76742a13900
15497A29365i3864I9501J03504e01132a63055g9341D5463J54722b30739r296c7516
$$ plain form
15485 -2445 179423 -149107 168822 1192 4434 48286 -65590 -43885 -14566 -205950 -180320
15474 -180320 286963 -104487 -306458 -220773 119814 212762 142432 -101042 -3843 -73022 -231852
15463 -231852 -160192 2585 -197603 178120 -227326 17582 51478 -77612 69068 48448 -212600
15451 165694 -228202 -11078 105037 45148 -132610 -251734 106853 527020 -102618 67137
15440 -318833 102102 -203964 -358636 226611 112820 259859 27199 -204282 -12214 197906
15429 -284612 -210751 105992 640 251755 -164420 87788 -72123 -181350 -62609 122671 -117971
15417 2897 90363 116765 102152 -42969 108646 155349 32711 366134 65758 -81477 -254374
15406 -254374 -192628 -131274 253963 8563 -142625 -17687 -59231 209865 -118465 89253 51503
$$ packed form
15485b445A79423a49107A68822A192L242M3852f5590K1705a4566j91384K5630
15474a80320B86963a04487k01971Q5685A19814R2948p0330a01042c843o9179j58830
15463b31852P1660B585a97603A78120b27326A7582L3896g7612F9068k0620b12600
15451A65694b28202a1078A05037D5148a32610j19124A06853M20167a02618F7137
15440c18833A02102b03964j54672B26611A12820J47039B7199b04282a2214A97906
15429b84612P3861A05992F40K51115a64420H7788g2123j09227f2609A22671a17971
15417B897Q7466K6402j4613d2969A08646M6703C2711L33423F5758h1477j72897
15406b54374O1746O1354B53963H563a42625a7687m1544B09865a18465H9253l7750
$$ plain form
15395 51503 259722 -56494 -130019 152082 -109609 -280314 4008 252028 27846 -73792 -194170
15384 -194170 -197473 14957 -104775 -148667 386746 -132121 112106 4258 132330 231008 214886
15373 214886 -507031 -66244 -85656 22871 84841 338132 261789 216891 150606 -189115 -308298
15362 -308298 1446 241039 135736 -475730 -115466 -178055 -30192 57318 -120989 254142
15351 73466 -7931 51554 -102705 158829 -40798 -93982 38127 165232 141497 -95283 -202232
15340 -202232 182800 -123863 108264 -98659 27237 24719 84511 -119638 35251 64778 86287
15329 86287 -169413 186691 -2210 217654 33309 -211759 168532 203596 206294 230417 -205217
15317 -2787 289431 -237420 58625 124133 27117 253156 69868 217487 147040 36888 -45015
$$ packed form
15395E1503K08219e6494p3525A52082a09609j70705D008K48020B7846g3792j20378
15384a94170l303A4957a04775m3892C86746a32121A12106D258J28072R8678j6122
15373B14886e07031f6244j9412B2871O1970K53291p6343m4898o6285a89115j19183
15362c08298A446K39593j05303d75730a15466o2589c0192E7318a20989B54142
15351G3466g931E1554a02705A58829d0798n3184C8127J27105k3735i5283j06949
15340b02232A82800a23863A08264i8659B7237k518N9792a19638C5251K9527K1509
15329H6287a69413A86691b210B17654C3309b11759A68532L5064K698K4123b05217
15317b787B89431b37420E8625O5508B7117K26039F9868J47619p0447C6888d5015
$$ plain form
15305 -83945 282401 183925 -37315 -198076 428444 -54407 48125 168880 -22162 90342 -24562
15293 100837 -142846 304802 -298353 78362 -216804 -325830 16181 -24157 152553 122201
15283 122201 -45775 59331 14865 27769 31504 -2633 25636 136555 11688 147108 -166206
15271 132902 177145 538434 -20235 294200 86005 -59003 338083 51190 355736 101856
15260 226625 -16345 173777 52692 -245104 -17072 191868 545568 98350 309807 -164308
15249 323374 749296 1211457 1849588 1391964 1822729 1442351 479050 563376 95887 137664
15239 137664 232859 82721 -269646 175446 -60400 -96661 9546 260463 79871 91887 97101
15228 97101 220606 158773 61017 66107 -80020 169735 -114952 94555 -179133 -101155 279711
$$ packed form
15305h3945B82401r8476c7315j60761D28444e4407D8125J20755b2162I0342b4562
15293A00837a42846C04802b98353G8362b16804j09026A6181b4157A52553l0352
15283A22201d5775E9331A4865J2904L735b633B5636J10919A1688J35420a66206
15271A32902M4243L61289b0235B94200H6005e9003C38083E1190L04546A01856
15260B26625a6345A73777E2692b45104a7072A91868L53700I8350K11457a64308
15249C23374M25922M62161O38131m57624M30765l80378D79050Q4326I5887M1777
15239A37664R5195H2721b69646A75446f0400l6261I546K50917G9871J2016N214
15228I7101J23505o1833F1017N090h0020A69735a14952I4555a79133P7978B79711
$$ plain form
15216 34925 188596 67583 181165 -85371 167484 276117 260432 36049 158617 -138230
15205 488706 143236 -100856 235222 207204 203299 -17211 207299 172872 216118 419005 -99005
15193 -131469 151623 46025 249504 -98135 196295 -293284 214498 -123606 611288 216480
15182 340548 171442 -21421 230947 50598 53202 -275110 -8562 -125183 195513 -78507 23812
15170 74156 -15696 -217388 -83887 92665 42507 -20321 29235 269395 259389 144419 26158
15158 20227 144735 346717 493127 236109 80476 -207105 -127781 238004 281491 67138
15147 -125874 8960 -103007 405714 324706 85490 323857 25012 -25231 228104 -143631 497473
15135 85419 97682 15555 85772 87645 86406 149214 303643 -53940 58723 620205 167962
$$ packed form
15216C4925J53671F7583J13582h5371A67484J08633j5685C6049J22568a38230
15205D88706A43236a00856B35222k8018l905a7211B07299l4427M3246K02887i9005
15193a31469A51623D6025K03479i8135A96295b93284B14498a23606F11288B16480
15182C40548j69106b1421B30947E0598K604b75110h562j16621A95513g8507B3812
15170G4156a5696k01692h3887I2665D2507b0321B9235K40160j0006j14970B6158
15158B0227J24508K01982J46410B36109H0476b07105P9324B38004M3487F7138
15147a25874H960a03007D05714q1008H5490K38367B5012b5231B28104a43631D97473
15135H5419J2263A5555P0217J873j239O2808J54429e3940E8723N61482A67962
$$ plain form
15123 659918 197553 206662 255740 -128862 537539 6868 13588 300890 203230 21927 314330
15112 314330 -65247 -52199 339686 57569 49005 -301902 131694 181019 9829 58721 304931
15101 304931 391645 -61232 292320 277604 271245 151780 -142968 52803 177418 3133 -91869
15089 231099 196834 434817 -89994 199254 6742 295274 57047 40274 153286 -73495 101487
15077 143303 55481 107915 175362 -70413 134598 131376 212540 264797 -142376 212493 90272
15065 172604 -48140 190898 35574 527141 36013 188415 107996 -114081 206923 393139
15055 393139 298913 9630 148260 102826 470399 311923 56815 206699 383758 -20450 -56503
15044 -56503 302503 408388 106693 273011 235546 350225 342907 120066 -280511 -25466
$$ packed form
15123F59918A97553R109M9078a28862E37539F868O720K87302r7660B1927K92403
15112C14330f5247J3048C39686E7569q564c01902A31694M9325I829M8892K46210
15101C04931Q6714f1232B92320j4716o359j19465a42968E2803J24615C133i1869
15089B31099l4265K37983h9994A99254F742K88532E7047j6773J13012g3495A01487
15077A43303E5481N2434O7447g0413A34598l222Q1164N2257a42376B12493I0272
15065A72604d8140A90898C5574M91567C6013J52402q0419a14081B06923J86216
15055C93139r4226I630J38630m5434L67573j58476E6815J49884J77059b0450l6053
15044e6503C02503J05885A06693J66318l7465J14679p318A20066b80511b5466
$$ plain form
15033 80196 437399 132911 299300 329851 463136 77155 127266 250691 574999 -199557
15022 309261 38444 386963 400578 371437 22434 158526 221784 627019 308277 266559 499972
15011 499972 298986 183759 430832 243453 459096 81160 251218 144466 95099 -94328
15000 450125 236540 411609 214350 290484 74401 -39891 274686 -56626 282172 193367
14990 193367 463613 345502 151645 389070 273650 -159718 364021 145132 177248 297225
14980 297225 327258 -7829 424214 197605 306108 485144 353835 329491 254847 162622 90755
14969 90755 46378 165056 114364 54048 561124 276801 552613 487460 190134 482312
14959 482312 320340 428666 332239 212490 730518 289785 286074 501159 248196 311744
$$ packed form
15033H0196L57203A32911J66389L0551J33285G7155N0111J23425L24308a99557
15022C09261C8444L48519J3615k9141B2434J36092O3258M05235C08277m1718K33413
15011D99972k00986j15227K47073j87379K15643H1160J70058j06752m9367i4328
15000D50125k13585J75069j97259P6134G4401c9891B74686e6626B82172q8805
14990A93367K70246j18111A51645K37425j15420a59718C64021A45132L2116J19977
14980B97225L0033g829D24214A97605J08503J79036j31309k4344p4644r2225p1867
14969I0755m4377J18678n0692E4048N07076B76801K75812o5153A90134K92178
14959D82312j61972J08326r6427j19749N18028B89785l711K15085B48196O3548
$$ plain form
14949 311744 34810 219821 89590 277149 416260 221911 192814 -80980 469374 279284
14939 279284 209800 125798 237863 245431 51262 315394 54755 353330 228808 483493 359012
14928 359012 391412 368545 207456 273388 376344 121393 590470 117403 452691 384530
14918 384530 452428 201095 60001 407129 323589 514335 272112 136751 362676 240174
14908 240174 254972 707758 211295 369394 268958 390975 55226 392715 395518 421824
14898 421824 148864 133516 197886 142713 320282 168822 247722 520182 280509 461301
14888 461301 71797 331834 318510 113781 439825 455378 471043 352936 498956 235254
14877 369827 517327 800740 256766 343852 470789 436594 428680 509257 547438 407106 454792
$$ packed form
14949C11744C4810J85011H9590J87559J39111j94349k9097h0980D69374j90090
14939B79284o9484q4002J12065P568E1262K64132E4755K98575j24522K54685j24481
14928C59012L2400k2867j61089O5932J02956A21393M69077A17403L35288o8161
14918C84530O7898B01095F0001L47128q3540J90746k42223j35361K25925j22502
14908B40174J4798M52786B11295J58099j00436J22017E5226L37489K803K6306
14898D21824A48864j5348O4370n5173J77569j51460P8900K72460k39673J80792
14888D61301G1797K60037j3324A13781L26044J5553J5665j18107J46020B35254
14877C69827J47500K83413B56766Q7086J26937l4195p914Q0577L8181j40332M7686
$$ plain form
14866 454792 63125 196755 324958 186350 116657 635296 352086 203207 422102 265823
14856 265823 843245 183928 329673 420808 572389 723343 420153 516952 379494 538747
14846 538747 397061 558633 453564 25469 241729 515682 476174 411941 356208 630967
14836 630967 149867 526308 370101 221700 383762 127885 485147 460612 345659 117425
14825 582716 360832 136967 851717 584912 543296 557695 323315 547503 362161 439318
14815 439318 391768 203373 663591 802898 255237 352611 746357 679940 515510 847567
14805 847567 587068 503196 442564 353896 835997 576429 340977 881133 678239 713699
14795 713699 724322 800006 764208 592677 561915 606234 700341 718655 751598 288060 704379
$$ packed form
14866D54792F3125J33630J28203j38608o9693N18639k83210j48879K18895j56279
14856B65823N77422A83928J45745R1135J51581J50954l03190R6799j37458J59253
14846E38747j41686J61572j05069B5469K16260K73953l9508o4233n5733K74759
14836F30967A49867L76441j56207j48401J62062A27885L57262k4535j14953A17425
14825E82716k21884A36967P14750k66805m1616J4399k34380K24188j85342P7157
14815D39318m7550j88395M60218J39307B55237R7374L93746o6417j64430L32057
14805H47567k60499q3872o0632q8668M82101k59568k35452N40156k02894L5460
14795G13699J0623P5684l5798j71531l0762M4319R4107J8314L2943B88060M16319
$$ plain form
14784 704379 871982 591126 466771 478640 703434 707059 739276 746069 493781 355548 588175
14773 588175 996685 571842 431391 464179 615207 744513 820416 562728 803090 288849
14762 683629 988834 338527 637436 648892 789896 482684 428298 717692 580625 691636
14752 691636 797115 748613 578772 790280 547801 578818 443902 599816 626925 831626
14742 831626 795631 669556 689872 550505 756243 684967 899639 1069289 1107465 516158
14731 711481 810580 684038 929424 559313 949332 795216 367215 887798 800864 581894
14721 581894 1076539 950969 809651 536052 1173049 715193 568082 856666 941665 887771
14711 887771 611228 749107 1116135 691887 872003 861848 786404 756626 966755 847428
$$ packed form
14784G04379J67603k80856j24355J1869K24794L625L2217O793k52288j38233K32627
14773E88175M08510m24843j40451L2788J51028J29306P5903k57688K40362B88849
14762F83629L05205C38527K98909J1456J41004l07212n4386K89394j37067J11011
14752F91636J05479m8502j69841K11508k42479L1017j34916J55914K7109K04701
14742H31626l5995j26075K0316j39367K05738p1276K14672J69650L8176E16158
14731G11481R9099j26542K45386l70111L90019j54116C67215N20583q6934k18970
14721E81894M94645j25570j41318k73599O36997m57856j47111K88584Q4999n3894
14711H87771k76543J37879L67028m24248J80116j0155p5444k9778K10129j19327
$$ plain form
14701 847428 651487 1087672 933233 917656 880492 974882 774832 789207 1019424 1149240
14691 1149240 1032846 876891 697344 956402 1058400 1107147 992290 927824 1205357 1077114
14681 1077114 1142437 1164455 1168086 1068377 1149912 1076582 1007701 1070769 885005 1034984 1398670
14670 1398670 1003648 877120 1058482 1029993 1198085 1076030 1250900 984744 947496 999833
14660 999833 1105336 1135786 869605 1156203 1220617 1090003 1061136 1112066 852645 1190311
14650 1190311 1315513 1205165 1004554 928458 1423997 1013485 1455582 1434497 1000940 1274398
14640 1274398 1367818 1172553 1497420 1410430 1128045 1401655 1562071 1176439 1738310 1588112
14630 1588112 1419293 1428588 1321176 1508925 1476115 1559726 1594057 1537663 1173568 1630209
$$ packed form
14701H47428j95941M36185j54439j5577l7164R4390k00050J4375K30217J29816
14691A149240j16394j55955j79547K59058J01998M8747j14857o4466K77533j28243
14681A077114O5323K2018L631r9709Q1535p3330o8881O3068j85764J49979L63686
14670A398670l95022j26528J81362k8489J68092j22055J74870k66156l7248N2337
14660I99833J05503L0450k66181K86598O4414j30614k8867N0930k59421L37666
14650A190311J25202j10348k00611p6096M95539m10512M42097k1085m33557K73458
14640A274398R3420j95265L24867q6990k82385K73610J60416l85632N61871j50198
14630A588112j68819R295j07412J87749l2810Q3611L4331n6394l64095M56641
$$ plain form
14620 1630209 1442701 1491175 1497811 1755057 1645006 1249214 1477628 1331487 1633885 1801140
14610 1801140 1721653 1636550 1370728 1709579 1561428 1649782 1618447 1480926 1719990 1904175
14600 1904175 1685120 1864486 1693147 1665018 1799473 1789559 1833913 1714551 1926852 1955673
14590 1955673 1882752 2049985 1953762 1775446 1754801 2156528 1955402 2346822 1996190 2216733
14580 2216733 2365433 2068748 2202087 2202345 2233274 2438775 2330912 2384879 1994246 2218327
14570 2218327 2323034 2347362 2667884 2296947 2695928 2463070 2709527 2917737 2609646 3053691
14560 3053691 2868811 2809505 2860833 3040141 3344349 3796291 4122213 4162797 4553427 5145558
14550 5145558 6112416 8916154 13769032 22830379 36590292 41571261 26090230 13298683
$$ packed form
14620A630209j87508M8474O636K57246j10051l95792K28414j46141L02398J67255
14610A801140p9487q5103k65822L38851j48151Q8354l1335j37521K39064J84185
14600A904175k19055J79366j71339k8129J34455r914M4354j19362K12301K8821
14590A955673p2921J67233r6223j78316k0645M01727k01126L91420l50632K20543
14580B216733J48700k96685J33339K58L0929K05501j07863N3967l90633K24081
14570B218327J04707K4328L20522l70937L98981k32858K46457K08210l08091M44045
14560C053691j84880n9306N1328J79308L04208M51942L25922M0584L90630N92131
14550E145558R66858K803738M852878R061347J3759913M980969j5481031j2791547
$$ plain form
14542 13298683 6591440 3781350 3267720 2560146 2106461 2468041 2327609 2185611 2616547
14533 2616547 2207907 2171496 2059149 2331009 2559059 2424021 2641510 2315364 2611338 2642870
14523 2642870 2830043 2737871 2623776 2595859 2749847 2737158 2833252 2936509 2633669 2653228
14513 2653228 2635477 3015230 2904132 3059654 3178349 3051597 3466831 3077110 2862016 3320746
14503 3320746 3038852 3114445 3499341 3541398 2916264 3446007 3246200 2844556 3820289 3476766
14493 3476766 3356021 3576988 3689525 3599226 3838648 3789279 4093857 3670024 4066821 3892278
14483 3892278 4310428 3875074 3686667 3723528 4051667 4164828 4262801 4095815 4559871 4343568
14473 4343568 4355746 4198154 4455539 4602437 4554820 4998837 4879956 4792189 4658160 5134128
$$ packed form
14542A3298683F591440k810090n13630p07574m53685L61580j40432j41998M30936
14533B616547m08640l6411j12347K71860K28050j35038K17489l26146K95974L1532
14523B642870J87173r2172j14095k7917J53988j2689R6094J03257l02840J9559
14513B653228j7751L79753j11098J55522J18695j26752M15234l89721k15094M58730
14503C320746k81894P5593L84896M2057o25134N29743j99807m01644R75733l43523
14493C476766j20745K20967J12537r0299K39422m9369L04578m23833L96797j74543
14483C892278M18150m35354j88407L6861L28139J13161R7973j66986M64056k16303
14473D343568J2178j57592K57385J46898m7617M44017j18881q7767j34029M75968
$$ plain form
14463 5134128 4991593 5150867 4988312 4549084 5555752 5187218 5058873 5224234 5084621
14454 5084621 5455513 5602376 5667619 5506836 5786132 5973670 5773070 5774022 6030911 6419781
14444 6419781 6259900 6515338 6325611 6275153 6414261 6501840 6656013 6964159 6921768 6974243
14434 6974243 7135536 7246667 7129930 7324173 7416058 7324698 6979054 7479085 7756519 7810452
14424 7810452 8244598 7676878 7819794 8188527 8349043 8545620 8679863 8587906 8932430 9189387
14414 9189387 9293208 9564142 9324807 9363900 9442249 9735550 9955784 10194523 10036055 10736391
14404 10736391 10473332 10631348 10919790 11136720 11258428 11717425 11634709 11493106 12047061
14395 12047061 12114215 12237070 12472466 12920749 13244491 13009901 12971073 13570153 13841988 14119386
$$ packed form
14463E134128j42535J59274j62555m39228J006668l68534j28345J65361j39613
14454E084621L70892J46863O5243j60783K79296J87538k00600R52K56889L88870
14444F419781j59881K55438j89727n0458J39108Q7579J54173L08146m2391N2475
14434F974243J61293J11131j16737J94243R1885r1360l45644N00031K77434N3933
14424G810452M34146n67720J42916L68733J60516J96577J34243r1957L44524K56957
14414I189387J03821K70934k39335L9093P8349K93301K20234K38739j58468P00336
14404A0736391k63059J58016K88442K16930J21708M58997q2716j41603N53955
14395A2047061O7154J22855K35396M48283L23742k34590l8828N99080K71835K77398
$$ plain form
14385 14119386 14332278 14949436 14797442 15044945 15476741 16084351 16355454 16115728 16740301
14376 16740301 16718677 17224122 17651005 18140230 18112710 18811994 19155207 19361863 19767606 19859834
14366 19859834 20871618 21420377 21615788 21521060 22737296 22771191 23436195 23998596 24498045
14357 24498045 25526463 25624733 26133290 27014654 27365878 28035595 28686998 29622457 30011829
14348 30011829 30919967 31652641 32382527 33162233 34093245 34957106 35845754 37185424 37966401
14339 37966401 38843759 40154005 41226721 42230395 43550322 44643100 46256649 47203383
14331 47203383 48795881 50515921 52283181 53950109 55387747 56883510 59106336 61132882
14323 61132882 63057383 65398459 67604935 69827960 72388516 75169926 77986411 80976170
$$ packed form
14385A4119386K12892O17158j51994K47503M31796O07610K71103k39726O24573
14376A6740301k1624N05445M26883M89225k7520O99284L43213K06656M05743R2228
14366A9859834J011784N48759J95411r4728J216236L3895O65004N62401M99449
14357B4498045J028418R8270N08557Q81364L51224O69717O51403R35459L89372
14348C0011829R08138P32674P29886P79706R31012Q63861Q88648J339670P80977
14339C7966401Q77358J310246J072716J003674J319927J092778J613549R46734
14331D7203383J592498J720040J767260J666928J437638J495763K222826K026546
14323F1132882J924501K341076K206476K223025K560556K781410K816485K989759
$$ plain form
14315 80976170 84287157 87640334 90748694 94394570 98184120 101879870 106655788 111102249
14307 111102249 115931542 120565505 126126332 132047566 137780082 144185903 151016508 158658699
14299 158658699 166191112 173869593 182498104 191741520 201289284 211207394 222079723 233417931
14291 233417931 245037765 257686763 270580156 284147533 298252391 313003447 327861897
14284 327861897 343623225 358990778 374459801 390169726 405291476 420183321 434162192
14277 434162192 446739707 458187540 467865282 475103981 478510872 476899869 473424391 471090158
14269 471090158 469433485 466510857 461846844 454083985 443820166 432544058 420113747
14262 420113747 406213851 391633183 376032327 359903991 344141539 328065325 312267338
$$ packed form
14315H0976170L310987L353177L108360L645876L789550L695750M775918M446461
14307A11102249M829293M633963N560827N921234N732516O405821O830605P642191
14299A58658699P532413P678481Q628511R243416R547764R918110J0872329J1338208
14291B33417931J1619834J2648998J2893393J3567377J4104858J4751056J4858450
14284C27861897J5761328J5367553J5469023J5709925J5121750J4891845J3978871
14277D34162192J2577515J1447833R677742P238699L406891j611003l475478k334233
14269D71090158j656673k922628m664013p762859j0263819j1276108j2430311
14262D20113747j3899896j4580668j5600856j6128336j5762452j6076214j5797987
$$ plain form
14255 312267338 297039842 283511863 269971723 256324464 243820569 231453021 220056980
14248 220056980 209268786 199169690 189429900 180442762 172229527 164166555 156331880 149271704
14240 149271704 142266300 135926621 130232540 124559697 119181751 114173794 109270536 104689572
14232 104689572 100685672 97105625 93057711 89201019 85629315 82500097 79487881 76558980
14224 76558980 73871113 70752177 68407426 66181993 64083709 61866242 59745272 58308140
14216 58308140 55960603 54452573 52394668 51511371 49799880 48010369 46199535 45283439
14208 45283439 43922023 43057747 41800518 40350212 39406033 37909029 37253953 36551869 36152357
14199 36152357 34580318 33500514 32732198 31878502 31221799 30418756 29625809 28844556 28072316
$$ packed form
14255C12267338j5227496j3527979j3540140j3647259j2503895j2367548j1396041
14248B20056980j0788194j0099096r739790q987138q213235q062972p834675p060176
14240A49271704p005404o339679n694081n672843n377946n007957m903258m580964
14232A04689572m003900l580047m047914l856692l571704l129218l012216k928901
14224G6558980k687867l118936k344751k225433k098284k217467k120970j437132
14216E8308140k347537j508030k057905q83297j711491j789511j810834r16096
14208D5283439j361416q64276j257229j450306r44179j497004o55076p02084l99512
14199C6152357j572039j079804p68316q53696o56703q03043p92947p81253p72240
$$ plain form
14190 28072316 27797681 26745170 26103024 25791400 24958280 24380247 24006660 23075411 22600095
14181 22600095 22177903 22027012 21408776 20927008 20430802 20200718 20300701 19401029 18937299
14172 18937299 18635564 18469419 17609455 17542114 17296117 17048576 16601636 16403139 16198643
14163 16198643 15898884 15101595 15300361 15274497 14699616 14166085 14169554 13881870 13643596 13247296
14153 13247296 13224011 12834997 12852629 12532722 12405813 12189656 12159358 11787036 11456685 11628240
14143 11628240 11303771 11122363 10823492 10365316 10409689 10322213 10471355 10128783 10146086 10090135
14133 10090135 9575207 9250319 9663025 8801095 9172536 8966815 9260154 8764285 8326363
14124 8326363 8460710 8432867 7798079 8206748 8128566 8086733 7753974 7671049 7656375 7522688
$$ packed form
14190B8072316k74635j052511o42146l11624q33120n78033l73587r31249m75316
14181B2600095m22192j50891o18236m81768m96206k30084R9983q99672m63730
14172A8937299l01735j66145q59964o7341k45997k47541m46940j98497k04496
14163A6198643k99759p97289J98766k5864n74881n33531L469k87684k38274l96300
14153A3247296k3285l89014J7632l19907j26909k16157l0298l72322l30351J71555
14143A1628240l24469j81408k98871m58176M4373q7476J49142l42572J7303n5951
14133A0090135n14928l24888M12706q61930L71441k05721K93339m95869m37922
14124H326363J34347k7843o34788M08669p8182m1833l32759q2925j4674j33687
$$ plain form
14114 7522688 7169285 7321703 7415052 7345605 6861763 7105349 7025638 6801252 6493361 6873307
14104 6873307 6498950 6475879 6684977 6611808 6247721 5867837 5873618 5933281 5967658 5409211
14094 5409211 6146017 5712141 6203366 5692499 5591197 5118690 5547447 5339968 5698288
14085 5698288 5497535 5182079 4853292 5217173 5259033 4761108 4989854 5139978 4779605 4824450
14075 4824450 4817905 4886760 4663450 4443554 4568162 4360731 4338183 4435991 4511156 3961602
14065 3961602 4644507 4333063 4222928 4038631 4438314 3919609 4211294 4311558 3933944
14056 3933944 3997657 3634165 4006128 3933944 4030734 3769917 3799708 3584617 3747509 3446591
14046 3446591 3725132 3820785 3590751 3294617 3201747 3420157 3272923 3366518 3406965 3118631
$$ packed form
14114G522688l53403J52418R3349o9447m83842K43586p9711k24386l07891L79946
14104F873307l74357k3071K09098p3169l64087l79884N781N9663L4377n58447
14094E409211P36806m33876M91225n10867j01302m72507M28757k07479L58320
14085E698288k00753l15456l28787L63881M1860m97925K28746J50124l60373M4845
14075D824450o545O8855k23310k19896J24608k07431k2548R7808P5165n49554
14065C961602O82905l11444j10135j84297L99683n18705K91685J00264l77614
14056C933944O3713l63492L71963p2184R6790k60817K9791k15091J62892l00918
14046C446591K78541R5653k30034k96134r2870K18410j47234R3595M0447k88334
$$ plain form
14036 3118631 3374875 3195608 3688836 3301507 3313141 3103450 3065718 2723934 2974518 2998186
14026 2998186 2941891 3019062 2904470 2981071 2882615 2577793 2597079 2711960 2749421 2699362 2139889
14015 2139889 2837072 2561271 2514124 2597826 2499427 2365225 2134188 2165147 2120858 2398570
14005 2398570 2140526 2118363 2250903 2312551 2108926 2210622 2305049 2084306 2322011 2218663
13995 2218663 2212196 2018281 2032850 2026502 2718510 2770084 4134523 8112106 15840629 30507795
13985 30507795 41232728 28829705 15347090 8882184 6315985 5137848 3873653 3967126
13977 3967126 3685310 3084308 3225968 2883552 2988182 2955184 2892330 2568321 2624989 2863645
13967 2863645 2484668 2505531 2253347 2216117 2231652 2181550 2297635 2270031 2126292 2133385 2032848
$$ packed form
14036C118631K56244j79267M93228l87329J1634k09691l7732l41784K50584K3668
14026B998186n6295P7171j14592P6601r8456l04822J9286J14881L7461n0059n59473
14015B139889O97183k75801m7147Q3702r8399j34202k31037L0959m4289K77712
14005B398570k58044k2163J32540O1648k03625J01696R4427k20743K37705j03348
13995B218663o467j93915J4569o348O92008N1574J364439L977583P728523J4667166
13985C0507795J0724933j2403023j3482615o464906k566199j178137j264195R3473
13977C967126k81816o01002J41660l42416J04630l2998o2854l24009N6668K38656
13967B863645l78977K0863k52184l7230J5535n0102J16085k7604j43739P093j00537
$$ plain form
13956 2032848 2221502 2137563 2076824 2054198 2083208 2154873 2114867 1790678 1746903 1925196 1941810
13945 1941810 1875523 1904308 1736915 1772560 1870214 1765048 1390271 1654040 2100233 1879822
13935 1879822 1507165 1654691 1715314 1887870 1499915 1562427 1759836 1657923 1950028 1596009
13925 1596009 1865701 1910604 1579171 1883868 1480595 1509988 1935385 1649081 1587364 1599234
13915 1599234 1334573 1284311 1305843 1798786 1618826 1749115 1195877 1686668 1462964 1638206
13905 1638206 1630636 1249612 1332665 1060336 1306265 1468529 1709655 1530982 1212379 1342667
13895 1342667 1245416 860437 1691952 1739109 1092113 1325554 1375065 981244 1350785 1328640
13885 1328640 1357930 1059005 1265591 1151142 1472376 974695 1248682 1472444 1024979 1348667
$$ packed form
13956B032848J88654q3939o0739k2626K9010P1665m0006l24189m3775J78293J6614
13945A941810o6287K8785j67393L5645R7654j05166l74777K63769M46193k20411
13935A879822l72657J47526O0623J72556l87955O2512J97409j01913K92105l54019
13925A596009K69692M4903l31433L04697m03273K9393M25397k86304o1717J1870
13915A599234k64661n0262K1532M92943j79960J30289n53238M90791k23704J75242
13905A638206p570l81024Q3053k72329K45929J62264K41126j78673l18603J30288
13895A342667r7251l84979Q31515M7157o46996K33441M9511l93821L69541k2145
13885A328640K9290k98925K06586j14449L21234m97681K73987K23762m47465L23688
$$ plain form
13875 1348667 1203257 1064928 1167103 1380050 1186133 914364 1408444 955509 1251743
13866 1251743 1122475 1013798 1260493 1235184 1134722 1239390 1401827 1173725 1089484 878333
13856 878333 1054722 1093932 1160851 869297 1140140 1133029 1038724 920088 839425 1126654 810536
13845 810536 1036023 803461 969656 1016938 863540 682699 1139583 794575 1014856 1243464
13835 1243464 1168831 902447 962940 864437 1165015 676144 578869 1010368 1066977 812001
13825 812001 861762 769564 702954 782241 729279 1050737 1331662 605431 1009374 867763
13815 867763 942229 848971 1027485 439678 834170 646685 920974 588385 811014 551381
13805 551381 1095904 721263 1122899 636107 1297339 1064467 625547 658684 881184 622477
$$ packed form
13875A348667j45410j38329J02175K12947j93917k71769M94080m52935K96234
13866A251743j29268j08677K46695k5309j00462J04668J62437k28102q4241k11151
13856H78333J76389L9210O6919k91554K70843p111r4305j18636q0663K87229l16118
13845H10536K25487k32562J66195M7282j53398j80841M56884l45008K20281K28608
13835A243464p4633k66384O0493r8503L00578m88871r7275M31499N6609k54976
13825H12001M9761r2198o6610P9287n2962L21458K80925F05431M03943j41611
13815H67763P4466r3258J78514D39678L94492j87485K74289l32589K22629k59633
13805E51381N44523l74641M01636m86792O61232k32872m38920L3137K22500k58707
$$ plain form
13795 622477 1078357 835604 689926 933850 750169 853762 977812 828210 782192 684455
13785 684455 668008 523932 702453 359120 759394 530259 800401 723720 892068 404056
13774 739511 526609 554609 979025 599544 868820 249655 1028299 851964 866605 592526
13764 592526 676863 499904 575235 926988 570168 678998 492736 576625 831607 953224
13754 953224 714572 865811 622883 530296 508805 559882 650546 365135 837498 706597
13744 706597 677387 724456 621504 473978 701687 545192 685034 389245 280129 856957
13734 856957 717764 479327 151107 648049 373533 508963 605677 282152 870645 348346
13723 348018 247613 589890 468687 205804 637664 768342 418524 533736 684666 378439
$$ packed form
13795F22477M55880k42753j45678K43924j83681J03593J24050j49602m6018r7737
13785F84455j6447j44076J78521l43333M00274k29135K70142p6681J68348D04056
13774G39511k12902K8000M24416l79481K69276B49655P78644j76335J4641k74079
13764E92526Q4337j76959P5331L51753l56820J08830j86262Q3889K54982J21617
13754I53224k38652J51239k42928r2587k1491N1077R0664k85411M72363j30901
13744G06597k9210M7069j02952j47526K27709j56495J39842k95789j09116N76828
13734H56957j39193k38437A51107M96942k74516J35430R6714B82152N88493C48346
13723C48018j00405L42277j21203B05804M31860J30678l49818J15212J50930l06227
$$ plain form
13713 378439 196392 535539 441594 513378 640567 615663 426093 721897 612146 489813
13703 489813 291024 612355 473992 450836 811510 315046 660896 491821 527014 574123
13693 574123 460615 286059 592084 593925 531008 503409 599123 143604 563266 582395 672217
13682 672217 475474 685112 458839 698533 518930 817459 405940 255062 189272 498774
13672 498774 148322 197495 729516 455910 480944 646164 582866 318505 462474 607680
13662 607680 728840 398656 478179 313914 453955 604063 614480 598551 190774 622375
13652 622375 418855 588353 292029 390333 253991 570829 239315 464470 658179 218530
13641 279348 260238 97990 552979 383044 398648 394530 434644 297315 436408 550924 202813
$$ packed form
13713C78439j82047L39147r3945P1784J27189k4904j89570K95804j09751j22333
13703D89813j98789L21331j38363k3156L60674C15046L45850j69075L5193M7109
13693E74123j13508j74556L06025J841o2917k7599R5714A43604M19662J9129Q9822
13682F72217j96743K09638k26273K39694j79603K98529D05940j50878o5790L09502
13672D98774A48322M9173N32021k73606K5034J65220o3298k64361J43969J45206
13662F07680J21160l30184P9523j64265J40041J50108J0417j5929A90774M31601
13652F22375k03520J69498B92029R8304j36342L16838B39315K25155J93709B18530
13641B79348j9110I7990M54989j69935J5604m118M0114j37329J39093J14516B02813
$$ plain form
13629 627314 177582 537389 599119 202088 342977 468578 364599 198644 578095 647088
13619 647088 92934 65170 226499 749037 513652 458290 304053 -8585 255037 392453
13609 392453 279325 442841 588108 387694 406715 667266 315099 -15220 204395 264128
13599 264128 303985 257998 549718 354613 604390 472247 628644 212121 436577 433178
13589 433178 303533 394555 282690 403030 593744 288660 312435 462089 126169 294919
13579 294919 237371 124949 486140 177931 237777 641325 267112 334743 560334 -37245
13568 220911 513824 423893 225261 270560 148534 219009 320020 425953 228376 389031
13558 389031 341505 86511 121961 448218 149437 297697 151017 336273 246786 436662
$$ packed form
13629F27314A77582L59807O1730B02088J40889J25601j03979j65955L79451O8993
13619F47088I2934k7764J61329N22538k35385n5362j54237h585B55037J37416
13609C92453j13128J63516J45267k00414J9021K60551C15099a5220B04395N9733
13599B64128L9857m5987K91720j95105K49777j32143J56397B12121K24456l399
13589D33178j29645R1022j11865J20340J90714B88660K3775J49654A26169J68750
13579B94919n7548j12422L61191A77931N9846M03548B67112O7631K25591c7245
13568B20911K92913q9931j98632M5299j22026P0475J01011J05933j97577J60655
13558C89031m7526H6511L5450L26257A49437J48260j46680J85256q9487J89876
$$ plain form
13548 436662 334123 294032 171637 169810 481249 273679 280689 135978 139779 -242347 553877
13536 282085 413139 200086 -38920 538211 177634 269496 -27790 -182003 110507 399105
13526 399105 308055 312937 344764 226073 416822 246301 357598 128354 568192 120616
13515 531416 -20392 279843 242745 363873 142583 167143 335704 168191 94304 16174
13504 266401 255454 155320 513639 191181 356473 215075 136164 206169 53006 157156
13494 157156 344332 152159 184260 124990 154825 121278 291627 431631 584821 742421
13484 742421 350369 302451 262751 120727 158562 151716 388510 555182 296573 409928
13474 409928 263030 294114 232336 334961 327748 68902 258218 366836 84082 273358 70735
$$ packed form
13548D36662j02539m0091j22395j827L11439k07570P010A35978L801b42347E53877
13536B82085J31054B00086c8920E38211A77634R1862b7790j54213A10507K88598
13526C99105r1050M882L1827j18691J90749j70521J11297A28354M39838A20616
13515E31416b0392B79843l7098J21128A42583K4560J68561j67513p3887A6174
13504B66401j0947j00134L58319A91181J65292j41398p8911P0005E3006J04150
13494A57156J87176A52159L2101n9270K9835l3547J70349J40004J53190J57600
13484G42421C50369m7918l9700A20727L7835o846K36794J66672k58609J13355
13474D09928j46898L1084o1778J02625p213F8902J89316J08618H4082J89276G0735
$$ plain form
13462 -25633 278439 -380723 60809 43012 496322 266216 194125 173954 318438 -20550 484157
13450 204352 35856 166537 268353 230623 357828 331006 144942 174294 -40890 46803 10586
13438 290686 206478 77687 337249 45786 335159 395885 312490 388341 -150217 101768 88062
13427 88062 -105423 461819 271050 243284 341062 323349 405914 -17179 432018 163694 580331
13416 580331 -111412 54582 114906 214836 -111725 110294 86554 393649 275145 111243
13405 421203 27653 293434 232016 432581 237145 25597 241149 205557 117544 291355
13395 291355 235138 39936 97187 -170649 83404 268065 334297 134275 35820 24860 426752
13384 426752 221230 169313 45392 116592 154278 136381 218994 -178412 143000 40141 292200
$$ packed form
13462b5633B78439c80723F0809j7797M53310k30106p2091k0171J44484b0550D84157
13450B04352C5856J30681J01816l7730J27205k6822A44942K9352d0890D6803A0586
13438B90686q4208G7687K59562D5786K89373O0726q3395P5851a50217A01768j3706
13427H8062a05423D61819j90769k7766R7778j7713Q2565a7179D32018A63694M16637
13416E80331a11412E4582O0324R9930a11725A10294k3740L07095j18504A11243
13405D21203B7653K65781o1418K00565j95436B5597K15552l5592q8013J73811
13395B91355n6217C9936N7251a70649H3404J84661O6232A34275C5820j0960M01892
13384D26752k05522n1917D5392P1200L7686j7897Q2613a78412A43000D0141K52059
$$ plain form
13373 292200 341034 589546 297699 341573 121704 333221 223609 188292 237580 528829
13363 528829 4468 364282 152013 27560 255092 40929 107726 -220910 28077 212105 46403
13351 473825 417863 195008 -229247 44402 331047 202102 445333 388482 302020 -90660
13340 219722 207818 299814 -20097 124124 -23040 402399 267668 -160788 -44154 -170587
13330 -170587 210391 192812 103864 182266 157472 197709 267932 258865 124175 191519 442640
13319 442640 141703 304429 355136 233054 -60734 477766 357609 315087 286883 101464
13308 232191 30095 57987 183630 -133360 243804 80517 149778 -67646 562379 48966 274068
13297 274068 188668 129930 192906 -13691 223090 106784 346544 340089 234006 253193 217269
$$ packed form
13373B92200M8834K48512k91847M3874A21704K11517j09612l5317M9288K91249
13363E28829D468L59814A52013B7560K27532D0929O6797b20910B8077J84028D6403
13351D73825n5962A95008b29247D4402K86645j28945K43231n6851q6462i0660
13340B19722j1904R1996b0097A24124b3040D02399j34731a60788d4154j26433
13330a70587B10391j7579q8948P8402k4794M0237P0223r067A24175O7344K51121
13319D42640A41703J62726N0707j22082f0734D77766j20157m2522k8204A01464
13308B32191C0095K7892J25643a33360B43804H0517O9261f7646E62379D8966K25102
13297B74068q5400n8738O2976a3691B23090A06784K39760o455j06083J9187l5924
$$ plain form
13286 217269 78009 146696 4600 141190 56164 232517 26876 124724 53339 -119285 -211407
13275 -211407 245822 128261 499713 446738 192792 -79937 159888 291328 227678 413497
13265 413497 76729 230685 -95685 -93364 670686 -65319 118276 -87701 383739 180843 191256
13254 191256 -79502 45839 229170 128739 -72035 55656 -124246 71276 443746 28565 74415
13243 74415 -103127 92147 -166697 188673 -177945 -116327 371049 -33380 128846 59737
13232 53468 16505 296458 80907 227648 -25772 226085 -72030 145492 183200 256510 40868
13220 -88691 203688 143133 -103501 -175164 226694 -195786 191565 302320 -62835 64527
13209 -119921 99717 9491 69895 205342 99367 327834 -56252 176749 -24143 311766 178214
$$ packed form
13286B17269G8009O8687D600J36590E6164J76353B6876R7848E3339a19285r2122
13275b11407B45822j17561L71452n2975A92792g9937A59888J31440o3650J85819
13265D13497G6729J53956i5685K321F70686f5319A18276h7701C83739A80843J0413
13254A91256g9502D5839J83331j00431g2035E5656a24246G1276L72470B8565M5850
13243G4415a03127I2147a66697A88673a77945O1618C71049c3380A28846E9737
13232E3468A6505K79953H0907J46741b5772B26085g2030A45492L7708P3310D0868
13220h8691B03688o0555a03501p1663B26694a95786A91565J10755f2835F4527
13209a19921I9717I491O0404J35447I9367K28467e6252A76749b4143C11766j33552
$$ plain form
13198 178214 309978 4786 287120 116034 82408 176650 18012 -287106 -42146 261153 254043
13187 254043 34404 90584 76437 91812 210789 -156175 106696 195177 44571 67805 -307163
13175 -90852 18254 62739 283891 237701 309233 425278 -274075 195841 335676 157515
13164 -2161 337727 223735 -86150 -36508 -94132 84022 64761 -121248 189588 -45737 283720
13152 -36675 -102505 21338 -22094 122038 147136 42751 -151311 44592 176745 245380 105340
13140 347992 245149 3617 -153418 32710 362417 -92939 214416 -49833 149013 83713 362309
13129 362309 -123499 229843 14773 22003 -259457 15779 77396 284692 107558 -30267 -347477
13118 -347477 281552 -115905 -576648 114062 -334327 307138 283534 177805 -193788 21919
$$ packed form
13198A78214J31764D786K82334A16034l3626R4242A8012b87106d2146B61153p110
13187B54043C4404N6180j4147J5375J18977a56175A06696Q8481D4571K3234c07163
13175i0852A8254M4485K21152m6190P1532J16045b74075A95841J39835A57515
13164b161C37727j13992h6150c6508n7624H4022j9261a21248A89588d5737B83720
13152c6675o5830B1338b2094A22038K5098D2751a51311D4592J32153O8635A05340
13140C47992j02843C617a53418C2710L29707i2939B14416d9833A49013o5300K78596
13129C62309a23499B29843A4773P230b59457A5779O1617K07296A07558c0267l17210
13118c47477B81552a15905m60743A14062c34327C07138k3604j05729a93788B1919
$$ plain form
13107 179752 -92169 48349 181975 -90077 -131740 -131628 -20677 62652 28875 157084 33948
13095 -59735 283955 106383 5360 100166 -210482 -208856 94260 458969 204224 -111369 211266
13083 119147 109101 288093 111390 289671 85831 68967 -48618 39955 -63189 -58965 -54424
13072 -54424 219999 336986 -100378 84358 13007 -116829 -161016 -16354 16921 135753 167495
13061 167495 26912 165917 -25543 4925 278372 52519 -58517 -223209 189150 -53870 170890
13049 -128900 -9176 -345130 158202 172955 19561 57114 274305 249779 144356 229099 -18923
13037 150064 282619 43683 10178 -101148 249425 168357 -66332 121124 12845 289460
13027 289460 262269 -28645 -110711 117785 111741 188740 157896 134455 111076 282414 94057
$$ packed form
13107A79752i2169D8349J33626i0077m1663J12b0677F2652B8875J28209C3948
13095e9735B83955A06383E360R4806b10482J626I4260L64709B04224a11369B11266
13083A19147j0046J78992A11390J78281H5831j6864d8618C9955f3189M224M541
13072e4424B19999J16987a00378H4358A3007a16829m4187a6354A6921J18832L1742
13061A67495B6912J39005b5543D925K73447E2519e8517j64692A89150e3870A70890
13049a28900i176l35954A58202J4753A9561L7553K17191k4526j05423Q4743a8923
13037A50064J32555D3683A0178a01148B49425q1068f6332A21124A2845K76615
13027B89460k7191b8645q2066A17785o044P6999l0844k3441k3379J71338I4057
$$ plain form
13015 270885 61883 -42208 233370 364446 91662 165039 -19677 160628 439335 247228
13005 247228 315283 19845 117439 107298 -190564 -7491 65184 43562 98241 160361 -128753
12993 -64557 27815 -29890 235627 268098 -368435 198929 198376 -295029 -14902 71260 171216
12982 171216 169226 -307639 -1867 -196848 289123 337197 212382 396731 -57939 -49954 303496
12970 -173426 -152759 113122 12245 -240562 -127760 227874 2864 259043 96821 240896
12960 240896 319040 385059 40794 -238336 -131528 -215806 266395 247636 48347 -27853 -142555
12949 -142555 -22622 -59466 -6997 262484 242051 -320043 -232596 425975 53818 -27802 -150897
12938 -150897 133833 77707 116473 150106 -106267 392967 46571 -11891 260356 114628
$$ packed form
13015B70885F1883d2208B33370J31076I1662P3377a9677A60628K78707j92107
13005B47228O8055A9845R7594j0141a90564g491F5184k1622N4679O2120a28753
12993f4557B7815b9890B35627L2471c68435A98929n53b95029a4902G1260R9956
12982A71216j990c07639a867j94981B89123M8074j24815J84349e7939P985C03496
12970a73426K0667A13122A2245b40562J12802B27874B864K56179I6821J44075
12960B40896P8144O6019D0794b38336J06808q4278B66395j8759D8347b7853j14702
12949a42555b2622l6844f997B62484k0433c20043Q7447D25975E3818b7802j23095
12938a50897A33833n6126L8766L3633a06267C92967D6571a1891B60356A14628
$$ plain form
12927 -225826 -210776 12340 -177543 457616 -8564 215426 228422 314164 -77337 183856 244639
12916 244639 303328 485869 15072 118801 -187415 -461359 58202 27742 6313 -83452 346181
12904 -117034 -448703 -288979 52185 134544 -85339 240551 188297 -100911 162094 333202
12894 333202 -252996 111213 18026 6568 100363 -72053 -85305 220726 36244 186665 -34616
12882 265519 -251978 -44630 523919 265605 197643 75954 -42429 -150031 -41708 121456
12871 149408 157102 -143131 -1188 -43768 -196957 53509 136703 8451 -49509 28399 -74046 -152872
12859 -152872 131669 -135070 160099 185197 369291 -108835 332670 -24902 171925 -267342
12848 247918 252974 -209941 -25767 226894 19885 -124385 59346 -76102 -248367 -281410 -103838
$$ packed form
12927b25826J5050A2340a77543D57616h564B15426J2996Q5742g7337A83856O0783
12916B44639N8689J82541A5072J03729a87415k73944E8202B7742F313h3452C46181
12904a17034l31669J59724E2185Q2359h5339B40551n2254a00911A62094J71108
12894C33202b52996A11213A8026F568R3795g2053j3252B20726C6244J50421c4616
12882B65519b51978d4630E23919k58314o7962G5954d2429j07602d1708A21456
12871A49408P694a43131a188m2580j53189E3509Q3194H451d9509B8399g4046p8826
12859a52872A31669a35070A60099K5098J84094a08835C32670b4902A71925b67342
12848B47918N056b09941b5767B26894A9885a24385E9346g6102j72265l3043a03838
$$ plain form
12836 169035 -134944 -266677 16710 63950 126144 -74411 -102925 -186851 -63151 170496 209898
12825 209898 -149291 -48415 86119 185455 -105558 304115 40429 -116051 111381 286132
12815 286132 -18238 172492 -73315 155784 2071 -118282 72914 174578 -114481 70732 -257720
12803 96447 -159451 84451 8797 7966 -95718 128649 337333 -268766 -72054 306383 332915
12792 332915 -42922 -118923 -267277 4331 -294245 145959 181774 66957 -51580 -102855 -101518
12781 -101518 69196 -157909 -110325 -9189 -177338 37068 148986 -66662 -569287 -8531 106181
12769 -83476 -100253 405161 -6360 -109748 -237225 90472 190753 125651 -95010 -133792 105954
12757 -245717 -269865 -28491 -143332 189842 26340 85856 -32540 -197139 185480 -189733
$$ packed form
12836A69035a34944j31733A6710M7240O2194g4411k8514q3926f3151A70496L9402
12825B09898a49291d8415H6119R9336a05558C04115D0429a16051A11381J74751
12815B86132a8238A72492g3315A55784B071a18282G2914J01664a14481G0732b57720
12803I6447a59451H4451H797q31i5718A28649K08684b68766g2054C06383K6532
12792C32915d2922p6001j48354D331b94245A45959L5815F6957e1580n1275J337
12781a01518F9196a57909M7584i189j68149C7068J11918f6662n02625h531A06181
12769h3476j6777D05161f360j03388j27477I0472J00281o5102i5010l8782A05954
12757b45717k4148b8491j14841A89842B6340N9516c2540j64599A85480a89733
$$ plain form
12746 -112175 288497 22742 -171202 3836 -44804 85224 -312516 -60043 -116713 4981 307277
12735 307277 344597 281493 224263 -23095 -6818 71499 -45067 -32463 114856 -221728 41006
12723 166560 -177308 58183 -166203 169631 20006 32564 28416 53131 70104 -117984 -340779
12712 -340779 751 243763 -14752 152830 9202 335121 220380 6833 65143 203401 138587
12701 138587 125841 152874 -44592 3578 210451 8683 22909 -33065 113368 277549 -106247
12689 -42973 74780 -268386 -302246 -213754 -28797 -63440 282864 -307296 28144 435327 120657
12677 -215126 573388 -71649 -242757 38375 -54539 357755 -55239 47104 180613 -68485 -134751
12666 -134751 -381226 107495 45411 189791 376798 -82143 76205 408602 33051 175571
$$ packed form
12746a12175B88497B2742a71202C836d4804H5224c12516f0043n6670D981L02296
12735C07277L7320o3104n7230b3095f818G1499d5067J2604A14856b21728D1006
12723A66560a77308E8183a66203A69631B0006J2558m148K4715J6973a17984k22795
12712c40779G51K43012a4752A52830I202L25919j14741F833N8310J38258o4814
12701A38587j2746K7033d4592C578K06873H683J4226c3065A13368J64181a06247
12689d2973G4780b68386l3860Q8492b8797l4643B82864c07296B8144M07183A20657
12677b15126E73388g1649j71108C8375e4539C57755e5239D7104J33509f8485o6266
12666a34751k46475A07495D5411J44380J87007h2143G6205L32397C3051J42520
$$ plain form
12656 175571 240453 201289 68842 -93657 130545 155064 27133 -119245 -75541 31630 -50048
12644 448630 -203838 -26965 -186262 -72966 14157 -33629 -39747 -331872 160304 -11343 -220442
12633 -220442 -38448 -303124 123541 182752 258390 424359 63546 125491 365174 175636
12622 489755 388663 147653 117907 42067 -280556 285115 -157601 35105 -264636 85745
12611 -125568 -174935 -97666 147046 64811 40273 155160 140744 150609 293602 138764 62207
12599 -26300 -19576 225908 293115 -255359 186462 -284169 -67233 307357 53403 -28448 -220738
12588 -220738 -27958 -104634 -84328 -55026 48954 -359144 -151986 -70279 -167534 -12687 307922
12576 -46954 3818 99545 -99595 -19576 -542958 -54997 104535 -92493 261875 129647 -186082
$$ packed form
12656A75571O4882l9164F8842i3657A30545K4519B7133a19245M3704C1630e0048
12644D48630b03838b6965j59297g2966A4157c3629o118k92125A60304a1343k09099
12633b20442c8448k64676A23541N9211P5638J65969F3546O1945K39683A75636
12622D89755j01092A47653k9746D2067b80556B85115a57601C5105b64636H5745
12611a25568m9367P7269A47046F4811k4538J14887j4416R865J42993A38764F2207
12599b6300O724B25908O7207b55359A86462b84169f7233C07357E3403b8448j92290
12588b20738b7958p6676K0306K9302D8954c59144a51986g0279r7255a2687C07922
12576d6954C818R5727i9595a9576n23382e4997A04535i2493B61875A29647a86082
$$ plain form
12564 286883 75436 52196 -269104 230261 147162 -379171 89824 32399 -176164 -1622 532703
12552 162907 -173545 -54051 174740 384187 -74693 -19404 174237 -443151 197976 56545
12541 -215416 -52293 267530 -103567 346278 -231764 -73961 285839 -73915 293057 114522
12530 -97941 70025 -96362 -132791 -103507 75867 196017 80071 5843 -136664 217038 -74321
12518 -125947 96401 192901 160426 -223007 -81141 -49771 146167 -303973 -69082 202225 119654
12507 119654 -235394 -198767 -132558 -50540 -330380 23141 -196284 12583 4866 -430871 -135181
12495 145385 33650 -27401 -81800 -80945 -299895 172873 316766 -50353 196171 142499 -22452
12483 -175569 -94313 -78302 135869 -154341 -112977 -235349 627 114354 80226 -206674 -110793
$$ packed form
12564B86883G5436k3240b69104B30261q3099c79171H9824C2399a76164a622E32703
12552A62907a73545e4051A74740K09447g4693a9404A74237d43151A97976E6545
12541b15416e2293B67530a03567C46278b31764g3961B85839g3915B93057A14522
12530i7941G0025i6362l6429K9284G5867J20150H0071E843a36664B17038g4321
12518a25947I6401R6500l2475b23007h1141L1370A46167c03973f9082B02225q2571
12507A19654b35394L6627O6209e0540k79840B3141a96284A2583D866d30871a35181
12495A45385C3650b7401n4399Q55k18950A72873J43893e0353A96171n3672b2452
12483a75569Q1256J6011A35869a54341M1364j22372F27J13727l4128b06674R5881
$$ plain form
12472 -110793 -384929 -50707 149275 -32884 136275 214280 -139971 -361356 -46416 -70008
12462 -70008 192382 39380 317985 -228888 -62795 95885 61275 -70954 -242544 -78841 194425
12450 -202580 -271762 39786 95649 -218138 211066 99426 51629 79402 151049 -234494 -565758
12439 -565758 128687 -144817 190357 -349869 92284 119806 -155001 -27426 -188453 -65251
12428 -32957 -38616 73900 1224 251283 -95931 128108 126580 159646 -129690 -74084 -131288 179410
12415 93882 -14984 -110054 -65700 -138349 -10552 -10894 -47323 -26178 -95301 -340414 -273853 -198176
12403 -198176 180852 34493 -271276 -31098 113493 43077 67295 109221 -225045 -3080 -34022
12392 -34022 -92713 383523 270695 300036 -10720 -76523 109669 -348919 -51670 -15876 -182268
$$ packed form
12472a10793k74136e0707A49275c2884A36275P8005a39971k21385d6416k3592
12462g0008A92382C9380K78605b28888f2795I5885l4610g0954j71590g8841A94425
12450b02580o9182C9786N5863b18138B11066I9426m7797K7773P1647b34494l31264
12439e65758A28687a44817A90357c49869I2284K7522a55001b7426j61027f5251
12428c2957n659G3900A224K50059i5931A28108j528L3066a29690N5606n7204A79410
12415I3882a4984r5070M4354p2649a0552l42l6429K1145o9123k45113O6561P5677
12403a98176A80852C4493b71276c1098A13493D3077K4218M1926b25045c080l0942
12392c4022n8691C83523j12828K9341a0720o5803A09669c48919e1670a5876j66392
$$ plain form
12381 -182268 -152916 -367181 -224355 -256686 330551 -37164 -9760 -271797 -111773 -279967
12371 -279967 -101006 150185 -54221 -196829 -31928 -65083 -193881 -187367 -136177 -17068 20934
12359 217259 68882 216572 -74661 -174330 60114 306992 124534 240628 -165318 -185732
12349 -185732 146607 -25856 -54014 -289309 -77888 -122509 350583 -210589 92195 -219384
12338 -22524 16087 46224 -163876 206450 158838 215303 301347 130859 -168958 124355 18353
12326 -74400 -137265 127745 221718 -255092 -166569 -72793 -107720 -295450 -104538 85620 260566
12315 260566 -276891 -63125 11406 -301842 -54962 31274 -134168 -140910 184381 -178807 -165012
12304 -165012 234847 -397117 -165488 -20821 -23972 3070 -174526 -95184 155514 -169873 245379
$$ packed form
12381a82268K9352k14265J42826l2331C30551c7164i760k62037a11773j68194
12371b79967a01006A50185e4221j42608c1928l3155j28798O514N1190a7068B0934
12359B17259F8882J47690g4661r9669F0114K46878A24534J16094a65318k0414
12349a85732A46607b5856k8158k35295g7888m4621C50583b10589I2195b19384
12338b2524A6087L0137a63876B06450m7612N6465Q6044A30859a68958A24355A8353
12326g4400o2865A27745R3973b55092Q8523g2793l4927j87730a04538H5620J74946
12315B60566b76891f3125A1406c01842e4962C1274a34168o742A84381a78807J3795
12304a65012B34847c97117a65488b0821l151C070a74526P9342A55514a69873B45379
$$ plain form
12292 -237575 -255278 61645 13706 -270388 4645 266480 224139 -38902 150951 305847 151576
12280 227488 -208295 148829 119789 150963 135211 58755 -26383 413074 40807 550492 98082
12268 103713 -207405 243223 -388084 -70163 -183860 161063 92568 -179640 -280896 -56797
12257 171127 223403 -155178 68394 81728 314414 -46620 140857 129464 59761 445720 95404
12245 182263 -81401 176105 -214261 -34421 155160 -338682 226255 174816 125960 229239
12235 229239 326053 119951 -75160 -122919 20306 154294 -64530 263239 228390 241496 152985
12224 152985 -88849 166389 39047 71272 202773 113452 404734 405192 109795 194719 -166996
12212 -350967 67416 42842 76020 267369 75804 122339 189215 289009 339673 -231186 46641
$$ packed form
12292b37575j7703F1645A3706b70388D645K61835m2341c8902A50951J54896A51576
12280B27488b08295A48829k9040L1174j5752E8755b6383D13074D0807N09685I8082
12268A03713b07405B43223c88084g0163j13697A61063o8495a79640j01256e6797
12257A71127N2276a55178F8394J3334K32686d6620A40857j1393E9761L85959I5404
12245A82263h1401A76105b14261c4421A55160c38682B26255n1439m8856J03279
12235B29239R6814A19951g5160m7759B0306J33988f4530B63239l4849J3106q8511
12224A52985h8849A66389C9047L2225J31501q9321K91282M58A09795Q4924a66996
12212c50967F7416k4574L3178J91349G5804M6535O6876R9794N0664b31186D6641
$$ plain form
12200 -3596 54460 111684 288620 129298 294562 182995 139318 -60163 34482 -144854 -188339
12189 -188339 46734 204760 139543 187690 -233626 88711 166577 -5050 63231 -87893 -157950
12178 -157950 -65558 155898 -15934 -143734 82406 141598 193250 85181 -67170 -99676 -165571
12167 -165571 83406 -7900 99418 265113 -108817 49501 -63388 341996 -65096 130455 -77674
12155 197147 -170896 170969 114821 59754 -36647 -185476 135801 -86435 -213688 -221454 -18274
12143 -228471 290849 -18803 -234715 404345 148156 -81397 -163028 91452 112211 -426821
12132 -23106 18700 -167013 148361 120182 469207 18588 -26309 263113 220178 -955 157391
12120 -220699 58905 -29390 143022 -6993 -125742 93216 171390 -59901 -158120 42209 -127476
$$ packed form
12200c596E4460N7224J76936A29298J65264j11567m3677f0163C4482a44854m3485
12189a88339D6734J58026o5217M8147b33626H8711P7866e050F3231h7893p0057
12178a57950f5558A55898a5934j27800H2406N9192N1652H5181f7170l2506o5895
12167a65571H3406g900I9418J65695a08817D9501f3388C41996f5096A30455g7674
12155A97147a70896A70969n6148n5067c6647j48829A35801h6435j27253p766a8274
12143b28471B90849a8803k15912D04345A48156h1397q1631I1452K0759d26821
12132b3106A8700a67013A48361k8179L49025A8588b6309B63113m2935i55A57391
12120b20699E8905b9390A43022f993j18749I3216P8174e9901r8219D2209a27476
$$ plain form
12108 -38246 -25209 102951 -116203 -7265 173852 267957 -93417 -87152 362296 -168464 -106867
12097 -106867 -142258 -74342 3471 263163 -63074 169467 312989 -95153 98010 15718 2907
12085 -296752 48169 -89564 132309 -20366 -65409 32158 -288459 108901 224093 17788 -49547
12073 246102 -90217 534150 -11224 -452893 141156 352745 928756 1775596 862581 341760
12062 80658 44673 263499 150307 -120316 175370 -64171 -56121 -202162 -101549 98037 -165146
12050 168893 -248759 58054 -77788 -304357 -131155 -69563 -19808 9330 -253113 9162 -72183
12038 60632 -52348 -212151 46020 139270 183057 -33297 -39253 21591 -146101 211247 -85066
12026 -121752 -58774 73347 242933 13722 -104424 401748 182512 -82037 -187453 152983
$$ packed form
12108c8246J3037A02951a16203g265A73852R4105i3417O265C62296a68464O1597
12097a06867l5391O7916C471K59692f3074A69467J43522i5153I8010A5718B907
12085b96752D8169h9564A32309b0366m5043C2158b88459A08901J15192A7788d9547
12073B46102i0217E34150a1224m41669A41156K11589N76011Q46840H62581C41760
12062H0658l5985K18826j13192a20316A75370f4171Q050j46041J00613I8037a65146
12050A68893b48759E8054g7788k26569a31155O1592a9808I330b53113I162g2183
12038F0632e2348j59803D6020R3250M3787c3297n956B1591a46101B11247h5066
12026a21752e8774G3347J69586A3722a04424D01748A82512h2037j05416A52983
$$ plain form
12015 135992 45806 -247552 -296829 -32930 96078 136232 78092 -134724 -100650 6884 -185119
12003 -67278 -172881 182513 -313832 -38878 -58825 287121 -102705 -36491 212520 42791
11992 -172133 -242067 -393759 253545 -156135 67526 -4480 -114052 161902 -233461 -142110
11982 -142110 3711 185731 -197004 -457104 -456478 -98944 -26273 -196714 -22569 32872 63474
11971 63474 -41045 58344 40433 -84360 16159 -143379 -186223 -100535 -86262 -13131 -91808
11960 -91808 70909 -146119 -108966 37026 -75308 -224130 -103906 -166116 -153475 -304 11355
11948 121845 154736 -358684 23471 177204 -118123 -109631 18502 64010 -16038 -17938 -204957
11937 -204957 5499 93539 107831 -135694 112050 18565 -52776 -163016 -193528 112454 -214520
$$ packed form
12015A35992D5806b47552m9277c2930I6078M0154n8140a34724L4074F884a85119
12003f7278j05603A82513c13832c8878j9947B87121a02705c6491B12520D2791
11992a72133o9934j51692B53545a56135F7526d480j09572A61902b33461R1351
11982a42110C711J82020a97004k60100O26i8944b6273j70441b2569C2872L0602
11971F3474d1045E8344j7911h4360A6159a43379m2844Q5688J4273a3131p8677
11960i1808G0909a46119L7153C7026g5308j48822a03906o2210J2641c04A1355
11948A21845L2891c58684B3471J53733a18123Q492A8502M5508a6038j900j87019
11937b04957E499Q8040J4292a35694A12050A8565e2776j10240l0512A12454b14520
$$ plain form
11925 -58264 -81221 32713 -87619 239035 -252468 -158505 -50689 -244002 -62452 -228661 -78056
11913 45907 -26048 110563 21584 53898 257564 59859 -3878 -161250 -268550 58291 14219
11901 87984 359447 335263 -133373 -349735 142610 -115102 -14324 130292 144273 164203
11891 164203 -78379 2071 33158 32241 21637 21250 99303 -298431 -296580 -71739 -403279 -86744
11878 -238385 140658 267140 -639581 -359195 148236 -325636 109943 321457 -221450 284693
11867 -117740 -69613 -117670 -322071 -156159 113324 -66676 110560 163540 62824 284018
11857 284018 22592 150327 -375850 34659 69070 -186511 -98589 -337973 -397421 115827
11846 -20054 -48022 -6469 91486 -76191 -72529 179245 -314343 -24431 77337 91291 -184939
$$ packed form
11925e8264k2957C2713h7619B39035b52468R3963e0689j93313f2452j66209g8056
11913D5907b6048A10563B1584L2314K03666E9859c878j57372j07300E8291A4219
11901H7984K71463k4184a33373k16362A42610a15102a4324A30292J3981J9930
11891A64203g8379B071L1087r17j0604l87P8053b98431J851g1739l31540h6744
11878b38385A40658J26482f39581K80386A48236c25636A09943K11514b21450B84693
11867a17740M8127m8057k04401a56159A13324f6676A10560N2980F2824K21194
11857B84018B2592J27735c75850C4659L4411a86511Q7922k39384n9448A15827
11846b0054k7968f469I1486g6191L662A79245c14343b4431G7337J3954a84939
$$ plain form
11834 190131 139794 -146574 112591 87798 -87106 116315 -212076 146249 58874 -195806
11823 -81259 -364454 78375 -55861 -208371 -401585 133978 -121476 -337343 -65526 -102297
11813 -102297 -261186 26891 94804 -156001 -158831 141542 -3124 -320159 -49237 -142803 -184786
11802 -184786 -510255 -129312 95593 46032 149571 -156052 -1362 87800 128684 23599 113464
11791 113464 -75896 -43939 -365595 -107992 32085 355598 516959 -39100 -545357 -127633
11780 -59864 -148394 -119088 72890 129454 -219370 -20606 240119 63589 85392 232301 -138777
11768 -140568 68214 258281 -15907 -211230 -243967 -233849 -124073 -143881 260149 99174 -299545
11756 -161103 41292 162115 59003 28984 -140338 -262480 -255148 14037 -40177 160755 -116147
$$ packed form
11834A90131n0337a46574A12591k4793h7106A16315b12076A46249E8874a95806
11823h1259k83195G8375e5861j52510j93214A33978a21476k15867f5526l6771
11813a02297j58889B6891O7913a56001k830A41542c124l17035d9237r3566m1983
11802a84786l25469a29312I5593D6032J03539a56052a362H7800M0884B3599Q9865
11791A13464g5896L1957l21656a07992C2085L23513J61361c9100n06257a27633
11780e9864q8530K9306G2890N6564b19370b0606B40119F3589K1803J46909a38777
11768a40568F8214J90067a5907j95323l2737J0118J09776j9808B60149I9174b99545
11756a61103D1292J20823E9003B8984a40338j22142P332A4037d0177A60755a16147
$$ plain form
11744 -196803 -65316 59672 146326 54764 124370 -381048 -272256 -71946 87077 -10350 246493
11732 -80713 73944 -88837 42746 54902 17372 -72267 145434 100755 77371 -63073 102331
11720 -179378 46085 -211124 48226 -178210 60887 -290470 386419 186370 36915 136555
11710 136555 -171935 -226972 -292410 -353379 10238 276759 5698 -139826 273534 74153 172559
11699 172559 83979 199563 180876 88697 -340293 32042 -103347 -106389 -107269 98643 -48728
11687 65386 -235338 22729 -65311 120351 47813 223839 -197644 62920 -192303 -38180 76964
11675 2565 -289652 38919 -134882 158997 144349 49005 -54143 -91019 -196066 165066 -50945
11663 23541 25002 -239582 -63465 -146169 211235 258159 -32316 -114068 -36354 77489 -115445
$$ packed form
11744a96803f5316E9672Q6654E4764O9606c81048J08792g1946H7077a0350B46493
11732h0713G3944h8837D2746J2156A7372g2267A45434m4679k3384f3073A02331
11720a79378D6085b11124D8226a78210F0887b90470C86419A86370C6915R9640
11710A36555a71935n5037o5438o0969A0238K66521E698a39826B73534G4153R8406
11699A72559H3979J15584j8687H8697c40293C2042a03347l042q80I8643d8728
11687F5386b35338B2729f5311A20351D7813J76026a97644F2920a92303c8180G6964
11675B565b89652C8919a34882A58997j4648D9005e4143l6876j05047A65066e0945
11663B3541J461b39582f3465q2704B11235M6924c2316q1752c6354G7489a15445
$$ plain form
11651 26661 24164 -112332 -134061 100423 -158416 -45184 394610 153472 127893 -53316 -375193
11640 -375193 -85389 -304006 312120 47075 398701 -232475 259856 -140690 -332218 141723
11629 29088 272296 165720 56289 121182 -164255 113662 -167678 -143904 148294 -55513
11618 363665 70794 -174026 220117 -104713 -13261 -166471 -16791 -378984 -91267 194549
11607 -173719 -162583 61074 26337 -53719 91026 157190 16378 -92324 -202493 126323 151061
11596 151061 10385 -176742 -1557 -248690 138155 79997 -62855 112641 -57901 -202824 -2551
11584 177868 39328 534313 35470 -78017 222916 -47488 -47414 69453 93304 -75161 4833 150319
11572 150319 -335673 -204765 29789 416463 197049 93242 -8027 55711 163141 228288 145603
$$ packed form
11651B6661k497a12332k1729A00423a58416d5184C94610A53472k5579e3316l21877
11640c75193h5389k18617C12120D7075L51626b32475B59856a40690j91528A41723
11629B9088K43208j06576E6289O4893a64255A13662a67678K3774A48294e5513
11618C63665G0794a74026B20117a04713a3261j53210a6791l62193i1267A94549
11607a73719J1136F1074B6337e3719I1026O6164A6378i2324j10169A26323K4738
11596A51061A0385a76742a557k47133A38155n8158f2855A12641e7901j44923b551
11584A77868C9328M94985C5470g8017B22916d7488P4F9453K3851g5161D833J45486
11572A50319c35673J30908B9789L86674A97049I3242h027E5711J07430O5147q2685
$$ plain form
11561 145603 -28429 104057 -141133 9300 2739 8290 30361 -209319 136694 330276 -223787
11549 -118262 -195851 -154461 -84826 320987 325584 -277042 267340 -56664 -47363 -84379 -55888
11538 -55888 40269 154489 297948 74153 61023 194232 52895 147835 362375 -232563 398218
11526 -56785 312297 -12027 -10457 266423 189738 -23810 -134846 -204834 -312684 -127544 173900
11514 -86202 -172655 134850 10774 -150479 53244 181672 305835 -90235 55332 202260 -53001
11502 19844 318971 65594 -65017 231719 400759 102299 223074 124147 266022 177943
11492 177943 141765 138742 -90973 -111839 145927 200340 251101 152109 -161515 92356 302548
11481 302548 15144 244929 139249 113416 97683 231215 278534 299548 200136 399734 18933
$$ packed form
11561A45603b8429A04057a41133I300B739N551K2071b09319A36694J93582b23787
11549a18262p7589M1390O9635C20987M597b77042B67340e6664R301l7016K8491
11538e5888D0269J14220J43459G4153j3130J33209E2895R4940K14540b32563C98218
11526e6785C12297a2027J570B66423p6685b3810j11036o9988j07850a27544A73900
11514h6202q6453A34850A0774a50479E3244J28428J24163i0235E5332J46928e3001
11502A9844K99127F5594f5017B31719J69040A02299J20775r8927J41875q8079
11492A77943l6178l023i0973k0866A45927N4413N0761r8992a61515I2356K10192
11481C02548A5144K29785j05680k5833j5733J33532M7319K1014r9412J99598A8933
$$ plain form
11469 139730 21608 -248825 163979 -234533 -192608 350842 201193 -107815 -55289 -251216
11459 -251216 17717 91230 -116060 -76184 140636 -25459 -125540 80941 130387 -123643 -174127
11448 -174127 -127199 15252 -79671 83942 196805 22903 -5090 -38742 60354 -36781 68340
11436 96321 -56421 231664 40784 -45022 -78800 -13441 -64389 -16998 -254640 -39918 44976
11424 22860 126536 -19213 225104 -81760 -2611 -56392 -111183 -107532 -136053 10809 -116955
11412 381266 -207694 359286 15730 264947 -120691 115724 138768 -41830 -128654 18142
11401 142230 171684 329693 29211 352797 -3510 98387 416124 -172026 -26942 28690 -511385
11389 162784 -7844 -311077 -67868 250375 239535 230812 50067 163356 -108834 260846 72083
$$ packed form
11469A39730B1608b48825A63979b34533M1925C50842j49649a07815N2526j95927
11459b51216A7717P3513a16060L9876A40636b5459j00081H0941M9446a23643n0484
11448a74127M6928A5252g9671H3942J12863B2903e090l3652F0354c6781F8340
11436I6321e6421B31664D0784d5022l3778a3441n0948a6998k37642c9918D4976
11424B2860J03676a9213B25104h1760b611n3781n4791L651k8521A0809a16955
11412C81266b07694C59286A5730K49217a20691A15724K3044d1830q6824A8142
11401A42230K9454J58009B9211L23586c510I8387L17737a72026b6942B8690e11385
11389A62784g844l03233f7868B50375j0840q723E0067J13289a08834B60846G2083
$$ plain form
11377 -154185 -322722 225486 84735 -80905 96891 108858 -246743 226335 -165411 99939
11366 194665 -9098 274880 -17689 371269 -26100 24609 -238608 -145877 -233182 91789 187696
11355 187696 84907 340885 -307133 -177846 76611 123293 78817 -106510 204266 199227 -177603
11343 -343318 137025 -34689 131207 -133401 -1524 31214 -187176 -7748 14298 31608 -86299
11331 -175662 -280171 17330 -187004 -19847 -106350 -107 -109719 43907 178111 -21083 -168613
11320 -168613 39785 17402 199705 189008 150928 -15813 -106397 -11339 -55653 13248 -285770
11308 298327 118666 40812 115785 333420 310704 193669 -226568 126807 -222505 -124359
11298 -124359 87863 -189660 -2046 -66535 -108718 -88250 -87159 -156729 -190808 117133 -35543
$$ packed form
11377a54185j68537B25486H4735h0905I6891J1967b46743B26335a65411I9939
11366A94665i098B74880a7689C71269b6100B4609b38608R2731q7305I1789R5907
11355A87696H4907K55978c07133J29287G6611M6682m4476a06510B04266n039a77603
11343c43318A37025c4689A31207a33401a524C1214a87176g748A4298J7310h6299
11331a75662j04509A7330a87004a9847q6503a07j09612D3907J34204b1083j47530
11320a68613C9785A7402J82303j0697l8080a5813r0584a1339m4314A3248b85770
11308B98327A18666D0812P4973K17635k2716j17035b26568A26807b22505R8146
11298a24359H7863a89660b046o4489m2183K0468J091o9570l4079A17133c5543
$$ plain form
11286 -119876 186614 31990 207931 -114816 -212701 97760 -163120 -121258 187050 -584759
11275 -194470 -119406 107471 188770 -258706 42615 146179 102489 -214015 157098 27665
11264 -6765 125732 287304 89006 -84645 -29476 28119 -30600 119888 -189537 -236957 135950
11252 15208 245211 150892 -2881 -172710 301360 -196009 -24073 -32941 49747 -509924 424783
11240 19705 -238130 -108246 -22818 -204640 9322 -250329 -203814 259779 -154945 -215552 168997
11228 -25200 136780 39390 -322816 -166371 -42708 -193988 46638 -424308 -128592 -90837
11218 -90837 20788 22915 138504 26102 -245469 80255 165300 -132817 222848 -20635 -199131
11207 -199131 -99522 62911 -18908 -241243 -103889 226756 32100 17203 144769 -197556
$$ packed form
11286a19876A86614C1990J75941a14816r7885I7760a63120M1862A87050e84759
11275a94470P5064A07471Q1299b58706D2615J03564m3690b14015A57098B7665
11264f765A25732J61572H9006h4645b9476B8119c0600A19888a89537m7420A35950
11252A5208K30003r4319b881j69829C01360a96009b4073q868D9747e09924D24783
11240A9705b38130a08246b2818j81822I322b50329M6515B59779a54945o0607A68997
11228b5200A36780C9390c22816J56445d2708j51280D6638d24308a28592L7755
11218i0837B0788K127J15589B6102b45469H0255Q5045a32817B22848b0635j78496
11207a99131i9522F2911a8908k22335a03889B26756C2100j4897J27566a97556
$$ plain form
11196 -30943 -137654 -28819 -47179 -210411 -165131 78609 151428 -36787 208472 -95046 -282316
11185 -282316 23645 -50471 54348 98144 -95594 33284 53632 87764 -20775 121128 62488
11174 62488 -134769 -51098 -176808 -25533 100831 158409 -88067 -19922 5117 214928 -70779
11162 129867 -86095 -58668 -104401 30983 -88477 49360 -47244 -10067 -345885 -347777 -224388
11151 -224388 -109698 -86863 -253741 -157237 -292364 -96353 -249937 106372 95678 -93580
11140 -201171 93892 -60922 -299444 -2295 -18345 179999 307869 84657 16416 -204920 -93631
11128 173599 -74864 102906 -54015 -164721 52892 94649 394665 -100683 -147080 -23128 -29061
11117 -29061 174205 399049 -400036 135720 -52239 73877 212624 31266 138937 30946
$$ packed form
11196c0943j06711b8819j8360j63232M5280G8609P2819c6787B08472i5046j87270
11185b82316B3645e0471E4348M3796i5594C3284K0348L4132b0775A21128n8640
11174F2488a34769e1098j25710b5533A00831N7578h8067a9922E117K09811g0779
11162A29867h6095K7427m5733C0983h8477D9360d7244a0067l35818j892J23389
11151b24388a09698K2835j66878R6504j35127i6353j53584A06372j0694i3580
11140b01171I3892f0922k38522b295j6050A79999J27870H4657A6416b04920i3631
11128A73599g4864A02906e4015j10706E2892M1757L00016a00683m6397b3128n933
11117b9061A74205K24844d00036A35720e2239G3877J38747C1266J07671C0946
$$ plain form
11106 227723 -182451 -107703 -114775 -26225 358118 319327 -112619 238651 100971 65273 241264
11095 241264 285220 79973 281656 255137 120169 146152 503088 157538 207444 394209
11085 394209 233952 213742 459300 66748 53118 333255 85779 124406 226386 372929
11075 372929 305606 203688 186452 84187 534719 368966 431189 505389 273100 482072
11065 482072 171235 281818 207768 421834 485052 406009 283157 570163 376553 674901
11055 674901 582266 390352 224265 871078 543884 720078 635516 672424 720531 633719
11045 633719 732655 830186 656547 865176 647161 895003 672537 670674 602203 460705
11035 460705 646747 653426 384843 563205 486341 448686 287038 458596 429209 884537
$$ packed form
11106B27723a82451P4748p072b6225C58118l8791a12619B38651A00971l5698J75991
11095B41264M3956G9973K01683k6519A20169K5983L56936A57538M9906J86765
11085C94209j60257k0210K45558F6748j3630K80137H5779L8627J01980J46543
11075C72929o7323j01918j7236H4187M50532j65753O2223P4200k32289K08972
11065D82072A71235J10583p4050K14066O3218p9043j22852K87006j93610K98348
11055F74901r2635j91914j66087O46813l27194J76194q4562L6908M8107q6812
11045F33719R8936R7531j73639K08629k18015K47842k22466j863o8471j41498
11035D60705J86042O679k68583J78362p6864l7655j61648J71558k9387M55328
$$ plain form
11025 884537 550217 767346 645305 852325 698114 760754 753990 218692 601921 471606
11015 471606 770950 572858 822222 259466 497401 544160 567585 676956 750968 403499
11005 403499 688002 501930 399590 678101 741473 862108 520741 575061 762823 201162
10994 890220 717260 648253 741546 775266 336780 726784 953196 779544 833070 902158
10984 902158 1060402 1158013 986994 838808 1076561 1000217 990967 1472705 1537734 2265976
10974 2265976 2131425 2654443 2628797 2897821 2488244 2216726 1914611 1982904 1966621 1270019
10964 1270019 1344450 1431686 1425937 938657 1373500 1419449 943060 1354456 1340065 1095075
10954 1095075 1124854 738335 690015 568779 363872 379047 149630 84836 509065 156207
$$ packed form
11025H84537l34320K17129j22041K07020j54211O2640o764B18692L83229j30315
11015D71606K99344j98092K49364B59466K37935M6759K3425J09371P4012l47469
11005D03499K84503j86072j02340K78511O3372J20635l41367N4320J87762B01162
10994H90220j72960o9007R3293L3720C36780L90004K26412j73652N3526O9088
10984I02158J58244R7611j71019j48186K37753p6344r250M81738O5029P28242
10974B265976j34551N23018k5646K69024m09577k71518l02115O8293j6283o96602
10964A270019P4431Q7236n749m87280M34843M5949m76389M11396j4391k44990
10954A095075K9779l86519m8320j21236k04907J5175A49630o4794M24229A56207
$$ plain form
10943 468935 518032 -168341 200165 222269 12325 245165 -133526 52359 81133 -53699 -78081
10932 -78081 193818 -6928 247566 -18253 48768 29054 152100 -38938 51299 -23099 117838
10920 65102 308691 -92756 230284 41767 157638 82236 176362 325302 -12380 19316 327010
10909 327010 -134683 -2428 2983 -138988 -119007 -285103 -160123 -59036 -95369 106750 -24384
10897 2216 132584 -31111 -5533 191652 -347863 372653 -202038 -49661 -98167 156955 134705
10886 134705 56212 168128 63720 -172141 127055 175675 -184992 -201693 -319145 246515
10875 -458843 -73944 87181 -526389 -41911 -152600 -19039 184474 -208496 -124740 -148893 114306
10863 -56966 172988 -264580 -149284 -176798 205351 52459 212547 -89549 -8763 129405 150192
$$ packed form
10943D68935M9097a68341B00165K2104A2325K32840a33526E2359K8774e3699k4382
10932g8081A93818f928B47566a8253D8768j9714J23046c8938E1299b3099A17838
10920F5102K43589i2756B30284D1767J15871p5402R4126J48940a2380A9316L07694
10909C27010a34683b428B983a38988J9981j66096J24980e9036l6333A06750b4384
10897B216J30368c1111e533A91652c47863C72653b02038d9661m8506A56955k2250
10886A34705E6212J11916F3720a72141A27055M8620a84992j6701j17452B46515
10875d58843g3944H7181e26389d1911j10689a9039A84474b08496Q3756k4153A14306
10863e6966A72988b64580J15296k7514B05351E2459J60088h9549h763A29405K0787
$$ plain form
10852 150192 -55949 -291506 55228 -155914 -432588 -98812 147505 -179271 81935 -99529
10841 -184477 202226 -298102 253840 137951 16947 222447 79458 -211914 163229 -313810
10830 -26906 -58750 58942 64160 134886 -208333 -77651 -153430 -79465 418087 56172 77055
10819 77055 -277578 -109153 -51613 13708 -58009 -140952 -184635 159913 -94941 149314 127977
10808 127977 -198430 -133198 -248675 74805 171516 -18279 -89400 -121444 227899 53594 -133987
10796 -308452 -169357 -248363 -72298 -15417 -186228 206065 57045 -151655 -208122 -91982 -18099
10784 155819 -119423 -148785 50258 -230477 -435802 -201961 -356077 49681 -241760 27772
10773 96108 -297151 52004 39381 -221392 1563 7455 67238 -113124 -185839 -240435 51987
$$ packed form
10852A50192e5949k35557E5228a55914k76674i8812A47505a79271H1935i9529
10841a84477B02226b98102B53840j15889A6947K05500G9458b11914A63229c13810
10830b6906l1844E8942N218P0726b08333g7651p5779P3965D18087E6172K0883
10819G7055b77578a09153e1613A3708e8009q2943m3683A59913i4941A49314k1337
10808A27977a98430O5232j15477G4805R6711a8279p1121l2044B27899E3594a33987
10796c08452J39095p9006g2298a5417j70811B06065E7045a51655n6467i1982a8099
10784A55819a19423k9362E0258b30477k05325b01961j54116D9681b41760B7772
10773I6108b97151E2004j2623b21392A563N892N9783a13124p2715n4596E1987
$$ plain form
10761 377205 -107824 178053 -20874 -205350 -253214 197151 346365 141106 -132391 79680
10750 -204674 -29952 54121 182438 133127 163618 -223998 -117880 277142 -224615 -37517
10739 110971 85399 -31566 32188 -225418 -16342 -186602 -199283 92814 -247775 1090 519548
10728 519548 -260643 9312 -205989 -33601 -220897 -368384 384831 -223279 -81833 -4837 -329070
10717 -329070 201400 -287672 -222850 224470 -238273 -259759 -223878 -256329 -23395 -117838 -30036
10705 -53686 -78201 -272092 -3001 165051 -11368 176771 111749 -15537 -65366 -93530 -191443
10694 -191443 51459 102448 -290459 -46310 -157383 -200317 -377772 75641 5895 -35426 -124447
10683 -124447 67146 -81534 3544 -31370 117735 16888 11421 12779 -44795 -159058 -134721 -96143
$$ packed form
10761C77205a07824A78053b0874j84476m7864A97151J49214A41106a32391G9680
10750b04674b9952E4121J28317m9311L0491b23998J06118B77142b24615c7517
10739A10971k5572c1566C2188b25418a6342j70260j2681I2814b47775A090N18458
10728E19548b60643I312b05989c3601j87296j47487C84831b23279h1833d837l24233
10717c29070B01400b87672O4822B24470b38273k1486L5881l2451b3395r4443c0036
10705e3686k4515j93891c001A65051a1368A76771o5022a5537m9829k8164r7913
10694a91443E1459N0989b90459d6310j11073m2934j77455G5641E895c5426q9021
10683a24447F7146h1534C544c1370A17735A6888n467J358d4795j14263K4337L8578
$$ plain form
10671 -96143 -93400 219062 -38921 -408124 -42938 -244103 176405 -303834 -183265 3615 -160686
10659 -129230 -453701 -25664 202044 -228982 -203970 -120516 -17597 -108635 -146912 130599 9744
10647 -92875 -85091 83699 -52712 -269474 43191 -70563 -294694 136261 -28202 351017 36646
10635 -16172 -26907 180471 -27451 -361250 28408 -118532 12908 -103715 24476 -79601 -55664
10624 -55664 -242573 227590 98233 -51495 200852 181920 18045 89941 169098 -71424 -219243
10613 -219243 134083 -222311 -506555 14941 -50253 -224120 -149828 -389097 -82728 53650
10602 124818 -149367 -212444 313159 -162639 42419 -99871 132044 -82387 -57560 -76478 -401444
10591 -401444 -125761 -95682 -179152 -318199 64487 -169069 163425 379389 -103254 -441911
$$ packed form
10671i6143K743B19062c8921l69203d2938k01165A76405c03834J20569C615a60686
10659a29230l24471b5664B02044b28982K5012Q3454a7597r1038l8277A30599I744
10647i2875P784H3699e2712k16762D3191g0563k24131A36261b8202C51017C6646
10635a6172j0735A80471b7451l33799B8408a18532A2908a03715B4476g9601K3937
10624e5664j86909B27590I8233e1495B00852j8932A8045P1896P9157g1424j47819
10613b19243A34083b22311k84244A4941e0253j73867P4292k39269h2728E3650
10602A24818a49367o3077C13159a62639D2419i9871A32044h2387K4827j8918l24966
10591d01444a25761L0079q3470j39047F4487a69069A63425K15964a03254l38657
$$ plain form
10581 -441911 186443 75703 -34692 2972 111671 39041 -90704 -7971 -125142 229311 -101130
10569 16091 -50107 -2961 -12921 221670 -127584 314271 151695 -104933 -333461 -30796 4694
10557 50642 -342588 -218483 -265232 -166351 -193616 -98267 -18434 177128 -309443 -120907 244145
10545 4208 -298747 173458 -378681 5527 265844 17345 -177308 -69685 27740 210567 -98716
10533 138117 24922 11901 42120 -48879 -40820 255828 48576 -155281 223266 -200307 -219287
10522 -219287 184593 -75361 321800 -427599 -156452 -66163 -182247 -376421 7735 -300413
10511 -361261 165023 255181 -132087 162325 71740 323092 -298276 22196 -153991 -240905
10501 -240905 -20217 37270 -275404 -35227 92386 98503 -204243 -20589 -223074 171917 -232497
$$ packed form
10581d41911A86443G5703c4692B972J08699C9041i0704g971j17171B29311a01130
10569A6091e0107b961r960B21670a27584C14271A51695a04933k28528c0796D694
10557E0642c42588J24105m6749R8881k7265R5349a8434A77128c09443a20907B44145
10545D208b98747A73458c78681E527K60317A7345a77308f9685B7740J82827i8716
10533A38117B4922A1901L0219d8879Q059B55828D8576a55281B23266b00307j8980
10522b19287A84593g5361C21800d27599a56452f6163j16084j94174G735c00413
10511c61261A65023R0158a32087A62325G1740K51352b98276B2196a53991q6914
10501b40905b0217C7270b75404c5227I2386O117b04243b0589k02485A71917b32497
$$ plain form
10489 333335 -242032 -127478 127227 -38172 -230342 306504 343781 107667 330209 223859
10479 223859 -17833 43008 229127 189423 68212 -325730 135562 110276 21863 -99839 57064
10467 -332564 -333035 -216039 -152804 144700 199288 92104 164331 -134343 320820 182612 -80455
10455 27802 57515 -162041 -204686 -138009 261521 -9112 51137 -340592 102215 -81812 -330679
10444 -330679 -179049 -218423 4129 -287475 -62798 -109297 -204993 171323 15576 -240399 -123398
10433 -123398 4985 373899 150002 82954 -21534 173682 216291 -164462 -26027 -194399 -67787
10421 -114656 88554 -53764 122676 6690 -228347 92588 -43910 -88203 -281629 -308304 -179845
10410 -179845 45190 -29597 -62418 -34789 -95951 24450 26019 31742 -97789 -83128 167248 -90903
$$ packed form
10489C33335b42032J14554A27227c8172j92170C06504L7277A07667K22542j06350
10479B23859a7833D3008J86119l9704F8212c25730A35562k5286B1863i9839E7064
10467c32564m71J16996O3235A44700N4588I2104P2227a34343C20820j38208h0455
10455B7802K9713a62041m2645O6677B61521i112E1137c40592A02215h1812k48867
10444c30679J51630l9374D129b87475f2798m6499r5696A71323A5576b40399J17001
10433a23398D985L68914A50002o7048b1534A73682M2609a64462b6027j68372f7787
10421a14656H8554e3764A22676F690b28347I2588d3910m4293j93426k6675J28459
10410a79845D5190b9597l2821K7629o1162B4450J569N723i7789J4661A67248i0903
$$ plain form
10397 261006 -21864 -40736 25385 -114269 76432 252751 -31756 -44580 -64356 20595 94059
10386 94059 183903 -250208 -198634 151824 295211 210731 276374 215599 591648 49940 354220
10375 354220 263059 -69602 -11010 -66600 119487 205665 459490 304382 457846 708900
10365 708900 82517 225855 78461 286479 -102053 300339 249905 350320 -14037 395551
10354 35960 27765 621803 246835 689840 248405 215143 286136 -135910 285449 574250
10344 574250 115709 257615 316390 344144 306492 296489 54481 -161731 -12774 -18021 98884
10332 249434 -35965 39150 4213 123918 167751 224918 -333795 213121 -94886 106522 252014
10321 252014 296364 217773 120680 243561 49211 389927 160803 94522 240907 238748 -8528
$$ packed form
10397B61006b1864j8872B5385a14269G6432J76319c1756j2824j9776B0595P3464
10386I4059Q9844b50208N1574A51824J43387q4480O5643o0775L76049D9940L04280
10375C54220r1161f9602a1010n5590A19487Q6178K53825j55108J53464K51054
10365G08900H2517J43338G8461K08018a02053C00339n0434J00415a4037C95551
10354C5960q195N94038B46835M43005B48405l3262P0993a35910B85449K88801
10344E74250A15709J41906N8775K7754l7652j0003E4481a61731a2774n247I8884
10332B49434c5965C9150D213J19705M3833N7167c33795B13121i4886A06522J45492
10321B52014M4350p8591r7093J22881D9211L40716A60803o6281J46385k159h528
$$ plain form
10309 -2302 -79615 -68696 -46243 -336692 22433 -131783 148702 -289723 178648 26464 332412
10298 332412 287143 40461 51997 -109 -8714 -63565 -214651 105431 -97877 157988 -91745
10286 -335357 -22932 -27363 -94253 -20250 112899 -110070 -376168 231429 46885 168288 -23142
10274 -210404 -11355 -70277 194150 3022 -139544 86539 -118271 177126 185562 -85558 -32418
10262 245687 383487 131460 94400 190280 314066 333568 343262 364187 -41059 -86933 54042
10250 -278246 -177666 -89950 -328357 -121384 30760 -135288 -164224 69682 -340984 -171087
10240 -171087 104219 -249794 87633 98299 -155898 -76424 19207 -305056 -120312 236951
10229 -250370 -228735 43075 291427 -339033 124054 10147 295947 -72292 -13042 -184655
$$ packed form
10309b302p7313J0919K2453k90449B2433a31783A48702b89723A78648B6464L05948
10298C32412m5269D0461J1536a09q605n4851j51086A05431i7877A57988i1745
10286c35357b2932m431o6890b0250A12899a10070k66098B31429D6885J21403b3142
10274b10404a1355n8922A94150C022a39544H6539a18271A77126Q436h5558c2418
10262B45687J37800A31460l7060R5880J23786J9502R694K0925d1059m5874E4042
10250b78246J00580Q7716k38407a21384C0760a35288k8936F9682c40984J69897
10240a71087A04219b49794H7633J0666a55898g6424A9207c05056a20312B36951
10229b50370K1635D3075K48352c39033A24054A0147K85800g2292a3042j71613
$$ plain form
10219 -184655 -285344 73873 141229 -140416 -167546 37177 -1019 -99083 176747 -103855 -32783
10207 -39383 92116 -252863 -107574 28768 162048 -301782 -168233 39886 -44612 -77881 30489
10195 124685 -72279 -20487 340823 -167635 27328 52429 -27530 -18179 -209643 -343365 5054
10183 -202889 -186407 -175556 -56596 -288511 -182065 -150342 33139 90518 -217983 187152 -16339
10171 -71616 395 -255442 -298378 212677 -132212 313246 -51100 110489 -158167 219904 177749
10160 177749 -90427 -173264 9917 -218741 -198992 26696 -337791 -288403 -105936 -100098 -110342
10149 -110342 12086 -403478 9126 8826 -110377 -35530 -104912 93752 40719 -165758 -279770
10138 -279770 -220306 200732 -204072 28861 -62735 -121648 10281 -96746 -76905 -129807 41343
$$ packed form
10219a84655j00689G3873O7356a40416k7130C7177a019r8064A76747a03855c2783
10207c9383I2116b52863a07574B8768J33280c01782J33549C9886d4612l3269C0489
10195A24685g2279b0487C40823a67635B7328K5101b7530R351j91464j33722E054
10183b02889J6482J0851e6596k31915J06446L1723C3139N7379b17983A87152a6339
10171g1616C95b55442m2936B12677a32212C13246e1100A10489a58167B19904m2155
10160A77749i0427q2837I917b18741J9749B6696c37791M9388a05936N838j0244
10149a10342A2086d03478I126l00a10377c5530o9382I3752D0719a65758j14012
10138b79770N9464B00732b04072B8861f2735n8913A0281i6746J9841n2902D1343
$$ plain form
10126 -131915 16410 162179 208696 -233562 329434 -102973 -109124 -55354 50424 -95925 -25748
10114 -64374 29501 -97519 -22139 233615 401667 -272633 -117126 -112118 194631 -255206 388945
10102 -27083 119660 189461 -56667 -116320 -220017 -148998 184994 -200545 274637 196532 -68003
10090 -255394 83673 -77423 114785 -168302 -286093 306029 -34974 -8628 125722 -277520
10079 -9941 -61913 53212 307447 95296 -127522 80126 -26552 -224014 -91876 -167160 -108892
10068 -108892 -353993 14190 -304352 -215069 -262651 -260170 -345837 -141978 72354 349278 -63640
10056 34531 -489717 19041 -150092 -146292 -192414 -184778 -299199 -121983 -217006 -319700 -60705
10044 -68603 -181254 -10824 -52229 -51777 -181492 -4382 -2622 -138212 -98620 143673 106631 -111818
$$ packed form
10126a31915A6410J45769M6517b33562C29434a02973o151N3770E0424i5925b5748
10114f4374B9501i7519b2139B33615J68052b72633a17126N008A94631b55206C88945
10102b7083A19660O9801e6667n9653j03697P1019A84994b00545B74637p8105f8003
10090b55394H3673g7423A14785a68302j17791C06029c4974h628A25722b77520
10079i941n1972E3212K54235I5296a27522H0126b6552j97462i1876p5284N8268
10068a08892k45101A4190c04352Q9283m7582K481q5667a41978G2354K76924f3640
10056C4531d89717A9041a50092L800m6122P636j14421a21983r5023j02694f0705
10044f8603j12651a0824m1405M52j29715d382J760j35590L9592A43673l7042a11818
$$ plain form
10031 74079 -296900 -425955 -319044 -159146 -193318 -106081 -5732 35930 -16971 -336621 90327
10019 -199067 -380524 149253 185331 7934 -10445 -153582 85660 2988 -291000 168531 226297
10008 226297 36200 -16915 -100455 -369164 -231592 -130676 -229259 -174725 -254566 -39906 162210
9996 23161 91602 4263 -213994 -123385 -286059 -23224 187669 -36967 -15755 -35255 -401853
9985 -401853 39476 -44148 -231658 78014 -15726 -152658 -220234 -209497 -175049 -74820 -50607
9974 -50607 100158 135487 85810 -271560 78497 -226044 29932 171259 68844 -323555 -218970
9963 -218970 35020 -73041 1632 58900 275092 -94276 -48820 -34980 -53401 -509813 -185794
9951 5599 -110140 -42087 -177294 -10788 36690 -52203 -315148 -365270 -104278 -145699 -57931
$$ packed form
10031G4079b96900j29055J06911a59146l4172Q7237e732C5930a6971l19650I0327
10019a99067j81457A49253L6078G934a0445j43137H5660B988b91000A68531N7766
10008B26297C6200a6915q3540k68709J37572J00916r8583N4534p9841c9906A62210
9996B3161O8441D263b13994R0609j62674b3224A87669c6967a5755j9500l66598
9985d01853C9476d4148j87510G8014a5726j36932o7576J0737L4448g4820K4213
9974e0607A00158L5329m9677b71560G8497b26044B9932J41327F8844c23555J04585
9963b18970C5020g3041A632N7268K16192i4276M5456J3840j8421m56412a85794
9951E599a10140d2087j35207a0788C6690e2203k62945n0122a04278m1421e7931
$$ plain form
9939 62716 -95584 75773 -75641 29024 -38012 -144159 160691 -317793 123230 145822 -92533
9927 201860 -136083 71746 38402 -194585 38673 -61557 2960 -100867 -65924 -182679 -12669
9915 152933 -30574 -32949 -293201 -2138 81888 -57119 -68743 235134 125649 -49127 247471
9903 -173901 61019 -399973 -193537 -167679 -95549 -133753 -48605 -154022 168525 -119007 -72180
9892 -72180 78601 -223575 -95231 -156228 -153384 -203823 -102547 48682 10248 -126668 76050
9880 -192093 263179 -94174 2919 16894 172654 68188 37886 88722 -134888 -82677 137269
9868 -72159 120912 -49715 183636 172520 -262949 -271786 -56707 -277179 -78252 -81279 15497
9856 20092 77908 16042 -114272 -289819 -29355 -471706 -47658 -299811 -73471 -97655 -152587
$$ packed form
9939F2716i5584G5773g5641B9024c8012j06147A60691c17793A23230K2592i2533
9927B01860a36083G1746l3344a94585C8673f1557B960a00867L4943j16755a2669
9915A52933c0574k375k60252b138H1888e7119j1624B35134j09485d9127B47471
9903a73901F1019c99973a93537K5858P2130l8204d8605j05417A68525a19007M6827
9892g2180G8601b23575i5231o0997K844n0439J01276D8682A0248a26668G6050
9880a92093B63179i4174B919J3975J55760F8188l0302N0836a34888N2211A37269
9868g2159A20912d9715A83636j1116b62949q837e6707k20472g8252l027A5497
9856B0092N7816A6042a14272j75547b9355m42351d7658k52153g3471k4184n4932
$$ plain form
9845 -152587 -271186 -114650 -91990 165458 -300930 75514 -6615 -78683 -233388 -274302 153996
9833 -148044 116842 -133743 18239 -273790 174456 -19673 -47215 205142 16602 -108318
9822 309767 -398637 -479357 -91206 159608 -297267 226770 10521 -363045 -79701 7519 -9001
9810 -459007 -170123 19352 -153820 -470058 -307874 -266399 -312098 -158426 -143360 -80390 214914
9798 -150027 -92790 -175614 -10472 16444 -461083 2547 -119823 -13685 18065 -188364 -148531
9787 -148531 109167 -86225 -89874 -97061 -331604 8596 -354641 -25578 -206265 -17671 -84565
9776 -84565 63460 -286820 -74299 -18898 -123726 175665 -48510 -329503 63835 -54426 33148
9764 237105 -19458 -411682 -9435 113585 -75036 -279157 90266 -165656 137455 -108168 -98876
$$ packed form
9845a52587j18599a14650K2660A65458c00930G5514f615p2068j54705m0914A53996
9833a48044A16842a33743A8239b73790A74456a9673k7542B05142A6602a08318
9822C09767c98637q0720i1206A59608b97267B26770A0521c63045g9701G519i001
9810d59007a70123A9352a53820l16238J62184M1475m5699J53672J5066O2970B14914
9798a50027N7237q2824a0472A6444d61083B547a19823a3685A8065a88364L9833
9787a48531A09167h6225l649p187k34543H596c54641b5578j80687a7671o6894
9776h4565F3460b86820g4299a8898j04828A75665d8510k80993F3835e4426C3148
9764B37105a9458l92224i435A13585g5036k04121I0266a65656A37455a08168R292
$$ plain form
9753 -98876 -151861 -369435 -191176 230095 -20553 -18602 -465538 -33231 -93431 241759 -187661
9741 66992 -73995 -86543 -115461 -1798 -23581 119024 -369539 -115287 -328195 -384726 12766
9729 -136030 16806 -92141 -18675 -196387 100824 -99653 -219892 106749 -85163 13208 241485
9718 241485 166923 123788 -53879 -217038 -360534 190448 -200517 -216095 -286912 53982 242771
9707 242771 52830 -258255 -61832 74570 -100164 -90409 -126345 77962 169558 58703 -59055
9695 -65783 8665 -31156 -9529 -357426 -194422 -377726 252240 -333545 -403874 216666 104499
9683 -293519 -269977 -61412 -109745 111947 -103849 -314188 -234482 -324030 129455 191242 -313088
9671 -319332 -270416 -16898 -272615 -130506 161830 -69321 210647 -139124 -110362 -250260
$$ packed form
9753i8876n2985k17574J78259B30095b0553J951m46936c3231o0200B41759a87661
9741F6992g3995j2548k8918a798k1783A19024c69539a15287k12908n6531A2766
9729a36030A6806i2141a8675j77712A00824i9653j20239A06749h5163A3208K28277
9718B41485p4562m3135e3879j63159j43496A90448b00517j5578p0817E3982J88789
9707B42771E2830b58255f1832G4570a00164R755l5936G7962R1596E8703e9055
9695f5783H665c1156i529l47897J63004j83304B52240c33545p0329B16666A04499
9683b93519K3542f1412m8333A11947a03849k10339P9706q9548A29455O1787c13088
9671c19332M8916a6898k55717a30506A61830f9321B10647a39124K8762j39898
$$ plain form
9661 -250260 92578 130459 58525 -152613 -54364 -70825 -3185 45506 -345066 -150279 -3818
9649 -120350 -75673 -55604 -193190 -44386 -11264 197688 -133867 236735 -203890 -507842
9639 -507842 -95427 -308521 76287 -170870 -97429 -122088 20623 155958 -321886 -58881 -149185
9628 -149185 -134132 14983 162053 -93303 144135 -323548 226235 175118 -144723 69227 -207961
9616 -324478 -189862 -168045 -83408 371067 -214092 113221 168604 -157479 -46914 -224633
9606 -224633 -96096 -26553 -5433 219183 49119 -24980 -15625 208039 79412 70659 -6078 -30375
9594 -30375 28247 -163389 -16418 -92345 109535 139064 70292 -33326 -244094 165957 -358434
9582 -339085 -57500 226297 146719 -114188 103776 219795 -206790 203277 -159681 -31469
$$ packed form
9661b50260I2578L7881E8525a52613e4364j6461c185D5506c45066a50279c818
9649a20350M4677K0069j37586d4386a1264A97688a33867B36735b03890l03952
9639e07842i5427k13094G6287a70870P3441k4659B0623J35335c21886e8881r0304
9628a49185J5053A4983J47070i3303A44135c23548B26235n1117a44723F9227b07961
9616c24478J34616K1817h3408C71067b14092A13221N5383a57479d6914j77719
9606b24633i6096b6553e433B19183D9119b4980R355B08039G9412q753f078k4297
9594c0375B8247a63389a6418p5927A09535K9529o8772c3326k10768A65957c58434
9582c39085e7500B26297p9578a14188A03776J16019b06790B03277a59681c1469
$$ plain form
9571 -74044 -111280 -207939 136910 -102766 63512 -9174 -277222 -143379 3290 46572 -107840
9559 -304025 -129531 143589 -103052 306640 -290556 -284156 102964 -404463 64171 -162834
9548 -152648 181068 -355976 -65220 23491 77928 167900 100886 -120712 49556 -43609 -359145
9537 -359145 -457510 -127357 -120367 -292628 82142 -84032 75578 33605 -77864 -211273 -228478
9526 -228478 -67922 -247017 195912 167984 -303877 59818 289324 -58249 -84900 -126662 20236
9514 -274361 -289150 -303578 -110825 -225201 -124826 -44062 75027 46952 -128435 14414 -33741
9502 -80495 -193292 349586 -18248 36759 -225076 -46811 2302 -115179 -192260 -36628 128618
9490 15349 -256994 -39308 85581 72840 72030 -50194 -47974 -167246 -200593 -117688 1142 225115
$$ packed form
9571g4044l7236r6659A36910a02766F3512i174k68048J33843C290M3282a07840
9559c04025a29531A43589a03052C06640b90556O400A02964d04463F4171a62834
9548a52648A81068c55976f5220B3491N4437Q9972o7014a20712D9556d3609l15536
9537c59145r8365a27357O990j72261H2142h4032G5578C3605g7864j33409j7205
9526b28478f7922j79095A95912k7928c03877E9818K29506e8249k6651m1762B0236
9514b74361j4789j4428a10825j14376J00375d4062G5027k8075a28435A4414c3741
9502h0495j12797C49586a8248C6759b25076d6811B302a15179p7081c6628A28618
9490A5349b56994c9308H5581j2741q10e0194K220j19272l3347Q2905A142K23973
$$ plain form
9478 225115 -359342 -124733 -326384 222551 175475 -89583 252806 -316433 -39806 -26096
9468 -26096 -207852 44615 -148743 -9337 197566 48222 71981 -68260 -153426 -105771 -50445
9456 42629 56151 -66006 -87342 2649 -50451 -455480 -524921 69216 -318799 39433 197 -282112
9443 217358 251980 70863 -165088 -315318 -52345 -175348 -16447 25585 -272031 -159560 105059
9431 146830 -152270 219284 -7599 -10994 -166547 105388 -277322 -34399 -64049 -61794 -139273
9420 -139273 137564 -252875 64971 34673 -166725 -288138 -270081 -46969 -72570 62608 -252725
9408 -37191 -328365 -343453 -254472 -205313 -137351 -125879 -87012 -129889 -354473 62362 -162324
9396 -128214 -6948 40340 -237731 -163752 130250 -177374 -272730 -303572 158667 -189170 -86893
$$ packed form
9478B25115c59342a24733k01651B22551m7076h9583B52806c16433c9806J3710
9468b6096j81756D4615a48743i337A97566D8222K3759f8260q5166M7655e0445
9456D2629J3522f6006k1336B649e0451m05029o9441F9216c18799C9433A97b82112
9443B17358L4622G0863a65088j50230e2345j23003a6447B5585b72031J12471A05059
9431A46830a52270B19284g599l395j55553A05388b77322c4399k9650K255p7479
9420a39273A37564b52875F4971l0298a66725j21413J8057d6969k5601F2608b52725
9408c7191k91174j5088Q8981M9159O7962J1472L8867m2877k24584F2362a62324
9396a28214f948D0340b37731P3979A30250a77374r5356l0842A58667a89170h6893
$$ plain form
9384 -41209 -193262 85451 159648 109181 -14507 -257250 -18563 -285898 63546 323 -196875
9372 -354455 -101266 -317613 -120235 -131872 19692 -296967 235378 -338901 22764 194933
9362 194933 20429 175421 -35340 -93806 -159191 -261927 473967 87541 -315258 -252903 -31539
9350 116045 98678 72333 -103680 55703 40054 -101994 241038 120662 91219 -154895 -12536
9338 214707 114821 -125908 75173 197891 -311939 -14123 210665 -22149 -240694 29043 -416356
9326 309006 -203286 -181398 -86789 288043 110132 193966 -88416 -28621 -202512 -50152 137133
9314 -634715 277709 94752 -39183 -213116 -365706 97550 -329 -264525 101482 29166 153765
9303 153765 12797 -360386 -46325 77689 -292896 -4702 -95650 -289818 -40381 -110231 -115648
$$ packed form
9384d1209j52053H5451P4197n0467a4507k42743a8563k67335F3546C23a96875
9372c54455a01266k16347a20235j1637A9692b96967B35378c38901B2764J72169
9362A94933B0429J54992c5340n8466o5385j02736D73967H7541c15258O2355c1539
9350A16045j7367k6345a03680E5703j5649a01994B41038j20376k9443a54895a2536
9338B14707r9886a25908G5173J22718c11939a4123B10665b2149k18545B9043d16356
9326C09006b03286K1888h6789B88043A10132Q3834h8416b8621j73891e0152A37133
9314f34715B77709I4752c9183j73933j52590I7550c29k64196A01482B9166J24599
9303A53765A2797c60386d6325G7689b92896d702r0948j94168d0381o9850n417
$$ plain form
9292 -115648 -4661 -359188 263231 -254148 -157743 130456 -45984 -42050 113278 -7936 -358566
9281 -358566 -82335 -176417 -59090 -27030 -59571 449050 -99865 -63730 -162968 67741 -75668
9269 -138026 -152536 397267 -64061 24771 -253009 115426 -24092 13127 -106873 -198308 -26566
9257 84894 23475 -75167 71401 110360 173675 165444 -345581 -3078 19324 -278156 -85133 -355451
9245 -355451 -48066 -149969 -17421 -354548 50046 123586 -172618 -87204 -221703 -216234 48049
9233 -153517 109917 -290312 -320411 60634 -215360 -246657 94729 99500 -477250 220598 -107563
9221 66496 257751 7561 -181658 6332 -210081 45183 -70799 -68433 -42251 -179336 -4653 -86106
9209 -86106 88796 54129 -331046 234920 146439 -337966 -54061 181300 -240286 -61185 85587
$$ packed form
9292a15648d661l54527B63231b54148R6405A30456d5984L934A13278g936l50630
9281c58566h2335r4082e9090b7030l2541D49050i9865L6135r9238F7741g5668
9269a38026j4510C97267f4061B4771b53009A15426b4092A3127a06873r1435b6566
9257H4894B3475g5167G1401L8959O3315q231c45581c078A9324b78156h5133k70318
9245c55451d8066j01903a7421l37127E0046P3540a72618Q5414j34499N469D8049
9233a53517A09917b90312l0099F0634b15360l1297I4729M771d77250B20598a07563
9221F6496J91255G561a81658F332b10081D5183g0799K366K6182j37085d653q1453
9209h6106H8796l4667c31046B34920q8481c37966e4061A81300b40286f1185H5587
$$ plain form
9197 138633 137599 89511 -84556 31444 -148917 -137388 238721 183109 -120537 361722 14950
9185 172475 80640 -321976 161846 51674 112372 406475 -285930 68976 293013 1423 -59828
9173 -276597 -68508 40697 -577678 -88961 193980 -159216 -226757 -178569 27898 -131431 -51292
9161 13842 184436 -186071 107137 -209686 241090 -173857 -37460 290259 -227393 167306
9150 295333 -178661 -157420 36250 198226 -101665 -32157 160357 -139405 107109 -72016
9139 59225 -322668 -268081 -22590 -338141 -234011 83279 -155330 377025 75164 -300678 -89315
9127 -173298 -42393 -163903 18599 -243066 -96123 159197 -228471 -180153 -122104 -41670 -61260
9116 -61260 958 32783 -3927 90746 -24921 199448 34757 -193302 120841 -185135 -309853
$$ packed form
9197A38633j034m8088h4556C1444a48917J1529B38721n5612a20537C61722A4950
9185A72475H0640c21976A61846E1674O0698K94103b85930F8976K24037A423e9828
9173b76597f8508D0697e77678h8961A93980a59216o7541M8188B7898a31431e1292
9161A3842J70594a86071A07137b09686B41090a73857c7460B90259b27393A67306
9150B95333a78661K1241C6250J61976a01665c2157A60357a39405A07109g2016
9139E9225c22668N4587b2590l15551J04130H3279a55330C77025G5164c00678h9315
9127a73298d2393j21510A8599b43066i6123A59197b28471M8318N8049d1670j9590
9116f1260I58L1825c927I0746b4921A99448C4757a93302A20841a85135j24718
$$ plain form
9105 -309853 165518 -157684 33136 -174126 -101059 -208702 -218516 -81576 -31394 -42408 95644
9093 -25258 44089 35969 -211292 138667 -322913 -90865 201098 77517 -148050 -33657 -5662
9081 438599 -22646 -14276 -240596 -12536 -146363 -164401 70940 171217 -287970 -206732 46340
9069 -33483 155964 -6998 -37702 -124221 -270535 43615 16710 -193143 107979 -228695 244550
9057 148198 -178619 -203368 -231409 -5518 132201 -102353 137879 -107727 -134948 -123960 147213
9045 103763 -176450 -233094 -89916 16155 -221290 -74068 123083 3802 12895 265151 -43115
9033 96293 -259901 -262373 -169092 1671 -196614 -231925 116513 109477 -352668 140596 -239058
9021 -107877 -29411 65884 -38665 -44676 123820 30784 -95509 -103011 133583 131688 158033 98093
$$ packed form
9105c09853A65518a57684C3136a74126P3067j07643r814h1576c1394j1014I5644
9093b5258D4089q120b11292A38667c22913i0865B01098G7517a48050c3657e662
9081D38599b2646Q370k26320a2536j33827j8038G0940J00277b87970Q1238D6340
9069c3483A55964f998l0704q6519j46314D3615A6710a93143A07979b28695B44550
9057A48198a78619k4749k8041e518A32201a02353A37879a07727k7221J0988A47213
9045A03763a76450n6644h9916A6155b21290g4068A23083C802R093K52256d3115
9033I6293b59901k472R3281A671a96614l5311A16513p036c52668A40596b39058
9021a07877b9411F5884c8665o011A23820C0784i5509p502A33583j895K6345n9940
$$ plain form
9009 98093 298100 112220 -12424 -269840 -284644 -72502 -375823 -263567 41074 -156842 67622
8997 32438 -119718 -423334 -276300 22765 163236 -132481 210658 -86961 -66296 90285 13604
8985 -161556 132413 50478 38747 -147849 -43695 -39959 -85735 -98439 -25391 -246104 159202
8973 -211386 -122977 -102902 564823 60228 -235818 127030 53055 -166517 58928 -135170 163968
8961 -107205 -279053 150488 -200683 -360568 228469 -22071 -36652 -43258 -33108 180348 103245
8950 103245 110471 42355 -14058 -34942 -134429 -203312 615497 -37395 -57311 52138 -119348
8938 -191357 -58785 -17985 157490 84515 217128 104709 -248710 -57716 -194888 -132963 83666
8926 -159640 263766 460336 1349433 3636045 8681069 8053520 2546676 545399 498088
$$ packed form
9009I8093K00007A12220a2424k57416j4804g2502l03321J12256D1074a56842F7622
8997C2438a19718l03616J47034B2765J40471a32481B10658h6961K0665I0285A3604
8985a61556A32413E0478j1731a47849d3695L736m5776j2704b5391k20713A59202
8973b11386Q8409K0075E64823F0228b35818A27030E3055a66517E8928a35170A63968
8961a07205j71848A50488b00683j59885B28469b2071j4581o606J0150A80348p7103
8950A03245P226D2355a4058k0884r9487o8883F15497c7395j9916E2138a19348
8938a91357e8785a7985A57490p2975J32613A04709b48710e7716j37172O1925H3666
8926a59640B63766J96570Q89097K286612N045024o27549B546676E45399m7311
$$ plain form
8917 498088 462208 154973 375607 -45083 -96481 -357609 -445049 100543 -5951 77678 -400549
8905 -101284 -63421 36743 130600 -104434 -361167 48334 301922 -72714 -206204 -138091 -209147
8894 -209147 -40719 -5997 -32102 -11063 -291209 -5993 301042 21479 -329162 -146652 -61313
8882 -212436 -140102 -337321 -7889 -169532 -145241 -109811 44034 77927 27288 -22139 25341
8870 -60142 -75098 -4465 94013 88267 -227363 -500224 -88422 127796 270829 -6627 33626 -254828
$$ packed form
8917D98088l5880A54973K20634d5083n1398k61128q7440A00543e951G7678d00549
8905a01284L7863C6743R3857a04434k56733D8334K53588g2714j33490O8113p1056
8894b09147d0719e997k6105a1063k80146e993C01042B1479c29162a46652f1313
8882b12436P2334j97219g889j61643K4291L5430D4034L3893B7288b2139B5341
8870f0142j4956d465I4013n746b27363k72861h8422A27796J43033f627C3626b54828
$$ [...]
##END NTUPLES=NMR SPECTRUM
##END=
