
##TITLE=UV1211_M4_1332-1205_7185644_mEKHBzjl5w
##JCAMPDX= 6.0         $$ Bruker NMR JCAMP-DX V2.0
##DATA TYPE= NMR SPECTRUM
##DATA CLASS= NTUPLES
##ORIGIN= BRUKER
##OWNER= Administrator
$$ 1.72 TOPSPIN		Version 2.1
$$ 2012-12-05 21:04:16.237 -0500  Administrator@X
$$ Compression mode = diff/dup
##.OBSERVE FREQUENCY= 400.02188249412
##.OBSERVE NUCLEUS= ^1H
##.ACQUISITION MODE= SIMULTANEOUS (DQD)
##.ACQUISITION SCHEME= undefined
##.AVERAGES= 64
##.DIGITISER RES= 22
##SPECTROMETER/DATA SYSTEM= spect
##.PULSE SEQUENCE= noesygpps1d.comp
##.SOLVENT NAME= COFFEE_meoh
##.SHIFT REFERENCE= INTERNAL, COFFEE_meoh, 1, 14.96081
##AUDIT TRAIL= $$ (NUMBER, WHEN, WHO, WHERE, PROCESS, VERSION, WHAT)
$$ ##TITLE= Audit trail, TOPSPIN		Version 2.1
$$ ##JCAMPDX= 5.01
$$ ##ORIGIN= Bruker BioSpin GmbH
$$ ##OWNER= Administrator
$$ $$ E:\/data/COFFEE/nmr/UV1211_M4_1332-1205_7185644_mEKHBzjl5w/12/pdata/1/auditp.txt
$$ ##AUDIT TRAIL=  $$ (NUMBER, WHEN, WHO, WHERE, PROCESS, VERSION, WHAT)
(   1,<2012-12-05 21:04:10.503 -0500>,<Administrator>,<X>,<go>,<TOPSPIN 2.1>,
      <created by zg
	started at 2012-12-05 20:52:40.475 -0500,
	POWCHK enabled, PULCHK disabled,
       configuration hash MD5:
       86 BA 57 50 F2 9D 5C 9B 26 00 A9 28 5F 66 2E 89
       data hash MD5: 64K
       F2 4C DA D7 31 7F F7 CC 5E 18 FB 6C 6F BF 2A 74>)
(   2,<2012-12-05 21:04:13.534 -0500>,<Administrator>,<X>,<proc1d>,<TOPSPIN 2.1>,
      <Start of raw data processing
       efp LB = 0.3 FT_mod = 6 PKNL = 1 PHC0 = 0 PHC1 = 0 SI = 128K 
       data hash MD5: 128K
       6E 21 B9 16 88 BA 6F BB 0B DB 44 71 DD 9C 69 8F>)
(   3,<2012-12-05 21:04:14.565 -0500>,<Administrator>,<X>,<proc1d>,<TOPSPIN 2.1>,
      <pk PHC0 = -82.08435 PHC1 = 0 
       data hash MD5: 128K
       8D FA 7C 9C FD 5F 70 1F 63 F9 8D D3 F9 8C B9 84>)
(   4,<2012-12-05 21:04:15.253 -0500>,<Administrator>,<X>,<proc1d>,<TOPSPIN 2.1>,
      <abs ABSG = 1 
       data hash MD5: 128K
       83 83 D2 62 30 AD 4E 68 70 68 5A 67 D1 F1 AC 91>)
(   5,<2012-12-05 21:04:15.440 -0500>,<Administrator>,<X>,<proc1d>,<TOPSPIN 2.1>,
      <abs ABSG = 2 
       data hash MD5: 128K
       15 59 F3 7F 59 10 E2 65 38 B2 A3 F1 02 A4 E5 D1>)
(   6,<2012-12-05 21:04:15.581 -0500>,<Administrator>,<X>,<proc1d>,<TOPSPIN 2.1>,
      <abs ABSG = 3 
       data hash MD5: 128K
       FC 42 99 63 44 92 CA E6 0B 95 7D 29 53 39 C5 F3>)
(   7,<2012-12-05 21:04:15.722 -0500>,<Administrator>,<X>,<proc1d>,<TOPSPIN 2.1>,
      <abs ABSG = 4 
       data hash MD5: 128K
       C9 B5 E3 04 3B F4 2C 67 EB 5F 1E C8 34 DA 8C 99>)
(   8,<2012-12-05 21:04:15.925 -0500>,<Administrator>,<X>,<proc1d>,<TOPSPIN 2.1>,
      <abs ABSG = 5 
       data hash MD5: 128K
       7F 66 03 74 8B CB 55 55 2C 7F 2D 72 0A 0A 3F 08>)
$$ ##END=
$$ 
$$ $$ hash MD5
$$ $$ 93 DE B0 18 7E 9A C8 28 7C B5 23 8C 08 E9 39 A8
##$RELAX= 
##$RELAX= 
##$RELAX= 
##$RELAX= 
##$RELAX= 
##$RELAX= 
##$RELAX= 
##$RELAX= 
$$ Bruker specific parameters
$$ --------------------------
##$DU= <E:\>
##$EXPNO= 12
$$ [...]
150 150 150 150 150 150 150 150
##$TP07= 0
##$TPNAME0= <>
##$TPNAME1= <>
##$TPNAME2= <>
##$TPNAME3= <>
##$TPNAME4= <>
##$TPNAME5= <>
##$TPNAME6= <>
##$TPNAME7= <>
##$TPOAL= (0..7)
0.5 0.5 0.5 0.5 0.5 0.5 0.5 0.5
##$TPOFFS= (0..7)
0 0 0 0 0 0 0 0
##$TUNHIN= 0
##$TUNHOUT= 0
##$TUNXOUT= 0
##$USERA1= <user>
##$USERA2= <user>
##$USERA3= <user>
##$USERA4= <user>
##$USERA5= <user>
##$V9= 5
##$VALIST= <valist>
##$VCLIST= <CCCCCCCCCCCCCCC>
##$VD= 0
##$VDLIST= <DDDDDDDDDDDDDDD>
##$VPLIST= <PPPPPPPPPPPPPPP>
##$VTLIST= <TTTTTTTTTTTTTTT>
##$WBST= 1024
##$WBSW= 4
##$XGAIN= (0..3)
0 0 0 0
##$XL= 0
##$YL= 0
##$YMAX_a= 6100566
##$YMIN_a= -11942055
##$ZGOPTNS= <>
##$ZL1= 120
##$ZL2= 120
##$ZL3= 120
##$ZL4= 120
##$ABSF1= 14.96081
##$ABSF2= -5.597372
##$ABSG= 5
##$ABSL= 3
##$ALPHA= 0
##$AQORDER= 0
##$ASSFAC= 0
##$ASSFACI= 0
##$ASSFACX= 0
##$ASSWID= 0
##$AUNMP= <proc_prof1d_extract.lims>
##$AXLEFT= 0
##$AXNAME= <>
##$AXNUC= <1H>
##$AXRIGHT= 0
##$AXTYPE= 0
##$AXUNIT= <>
##$AZFE= 0.1
##$AZFW= 0.1
##$BCFW= 0
##$BC_mod= 0
##$BYTORDP= 0
##$COROFFS= 0
##$CY= 15
##$DATMOD= 1
##$DC= 0
##$DFILT= <>
##$DTYPP= 0
##$F1P= 0
##$F2P= 0
##$FCOR= 0.5
##$FTSIZE= 131072
##$FT_mod= 6
##$GAMMA= 0
##$GB= 0
##$INTBC= 1
##$INTSCL= 1
##$ISEN= 128
##$LB= 0.3
##$LEV0= 0
##$LPBIN= 0
##$MAXI= 10000
##$MC2= 0
##$MEAN= 0
##$ME_mod= 0
##$MI= 0
##$NCOEF= 0
##$NC_proc= -2
##$NLEV= 6
##$NOISF1= 0
##$NOISF2= 0
##$NSP= 0
##$NTH_PI= 0
##$NZP= 0
##$OFFSET= 14.96081
##$PC= 1
##$PHC0= -82.08435
##$PHC1= 0
##$PH_mod= 1
##$PKNL= yes
##$PPARMOD= 0
##$PPDIAG= 0
##$PPIPTYP= 0
##$PPMPNUM= 2147483647
##$PPRESOL= 1
##$PSCAL= 4
##$PSIGN= 0
##$PYNMP= <proc.py>
##$REVERSE= no
##$SF= 400.02000971222
##$SI= 131072
##$SIGF1= 0
##$SIGF2= 0
##$SINO= 400
##$SIOLD= 131072
##$SPECTYP= <>
##$SREGLST= <1H.CDCl3>
##$SSB= 0
##$STSI= 131072
##$STSR= 0
##$SW_p= 8223.68421052631
##$SYMM= 0
##$S_DEV= 0
##$TDeff= 65536
##$TDoff= 0
##$TI= <>
##$TILT= no
##$TM1= 0
##$TM2= 0
##$TOPLEV= 0
##$USERP1= <user>
##$USERP2= <user>
##$USERP3= <user>
##$USERP4= <user>
##$USERP5= <user>
##$WDW= 1
##$XDIM= 131072
##$YMAX_p= 409918152
##$YMIN_p= -12078
##$CURPLOT= <Network HP LaserJet P1505>
##$CURPRIN= <$Network HP LaserJet P1505>
##$DFORMAT= <normdp>
##$LAYOUT= <+/1D_H.xwp>
##$LFORMAT= <normlp>
##$PFORMAT= <normpl>
##$SURQMSG= 1
$$ End of Bruker specific parameters
$$ ---------------------------------
##NTUPLES= NMR SPECTRUM
##VAR_NAME=  FREQUENCY,     SPECTRUM/REAL,   SPECTRUM/IMAG
##SYMBOL=    X,             R,               I
##VAR_TYPE=  INDEPENDENT,   DEPENDENT,       DEPENDENT
##VAR_FORM=  AFFN,          ASDF,            ASDF
##VAR_DIM=   131072,        131072,          131072
##UNITS=     HZ,            ARBITRARY UNITS, ARBITRARY UNITS
##FACTOR=    0.0627417313425164, 1,          1
##FIRST=     8223.62146879497, -470,         -55657
##LAST=      0,             1487,            -55528
##MIN=       0,             -12078,          0
##MAX=       8223.62146879497, 409918152,    0
$$ Real data points
##PAGE= N=1
##DATA TABLE= (X++(R..R)), XYDATA
$$ [...]
63911B455026j80642j74533j67057j58445j48360j36563j23433j09827r6620q4480
$$ 2455026 2274384 2099851 1932794 1774349 1625989 1489426 1365993 1256166 1159546 1075066
63901A075066p3785o4552n6502m9352m2957l7190l1854k6965k2930k0128j8305
$$ 1075066 1001281 936729 880227 830875 787918 750728 718874 691909 668979 648851 630546
63890F30546j6687j4863j3303j2668j2722j2375j0891q657o523m733l024j340
$$ 630546 613859 598996 585693 573025 560303 547928 537037 528380 521857 517124 514100 512760
63878E12760J07J498L347N646P684R067J0382J2443J5276J8349K1435K4636K7712
$$ 512760 512867 514365 517712 523358 531042 540109 550491 562934 578210 596559 617994 642630 670342
63865F70342L0064L1450L2205L2676L2824L2535L1935L1231L0497K9782K9125
$$ 670342 700406 731856 764061 796737 829561 862096 894031 925262 955759 985541 1014666
63854A014666K8393K7301K5672K3376K0070J5414R778M198o61n129r751j4290
$$ 1014666 1043059 1070360 1096032 1119408 1139478 1154892 1164670 1168868 1168207 1163078 1153327 1139037
63842A139037j8100k1278k4681k8645l2354l4846l6219l7385l8781l9852l9830
$$ 1139037 1120937 1099659 1074978 1046333 1013979 979133 942914 905529 866748 826896 787066
63831G87066l8657l6971l5408l4110l2786l1100k8955k6554k4161k1852j9589
$$ 787066 748409 711438 676030 641920 609134 578034 549079 522525 498364 476512 456923
63820D56923j7514j6005j5216j4749j4023j2961j1959j1165j0136q494o639n403
$$ 456923 439409 423404 408188 393439 379416 366455 354496 343331 333195 324701 318062 312659
63808C12659n111n330n510n499n319m873m118l302k709k353k155k254k757l274
$$ 312659 307548 302218 296708 291209 285890 281017 276899 273597 270888 268535 266380 264126 261369 258095
63794B58095l195k537k119k576l483l854l391k738k533k645k584k220j712j122
$$ 258095 254900 252363 250244 247668 244185 240331 236940 234202 231669 229024 226440 224220 222508 221386
63780B21386n37l86r80j785j840r96k18k39o33n81p6L45N67Q24R02L42n75r49
$$ 221386 220849 220463 219483 217698 215858 214862 214644 214405 213772 213191 213115 213460 214027 214851 215753 216095 215520 214571
63762B14571n53j92m72j003j224j274j412j305o44%j20o99p33j0O41O91O21J030
$$ 214571 214018 213826 213354 212351 211127 209853 208441 207136 206492 206492 206372 205673 204940 204930 205571 206262 206883 207913
63744B07913J727K155K230K276K393K334J910J297R12J060J649K292K764L145
$$ 207913 209640 211795 214025 216301 218694 221028 222938 224235 225147 226207 227856 230148 232912 236057
63730B36057L375L046K073J251J468K523L503M219N255O474O713N477L971L519
$$ 236057 239432 242478 244551 245802 247270 249793 253296 257515 262770 269244 275957 281434 285405 288924
63716B88924L764L479K516J767J478Q81l61j481j786j618j725k258k891l357l505
$$ 288924 292688 296167 298683 300450 301928 302809 302448 300967 299181 297563 295838 293580 290689 287332 283827
63701B83827l195k578k096j906j608q57Q8P96J337K038K876L538L954M277M419
$$ 283827 280632 278054 275958 274052 272444 271587 271675 272471 273808 275846 278722 282260 286214 290491 294910
63686B94910M078L310K625K364K271J968J539J317J241Q55L8o17m59L70J114J329
$$ 294910 298988 302298 304923 307287 309558 311526 313065 314382 315623 316478 316516 315899 315440 315810 316924 318253
63670C18253J296J403J615J764J955K306K564K384J843J207M57n87j777k855l951
$$ 318253 319549 320952 322567 324331 326286 328592 331156 333540 335383 336590 337047 336460 334683 331828 327877
63655C27877n290o456o719o142n607n448m929l486j818j062j329j788j837j544
$$ 327877 322587 316131 309412 303270 297663 292215 287286 283800 281982 280920 279591 277803 275966 274422
63641B74422j098n07K07J015K041L284M261M480M183M090M378M500M128L777M162
$$ 274422 273324 272817 273024 274039 276080 279364 283625 288105 292288 296378 300756 305256 309384 313161 317323
63626C17323N309O565P349P634P864Q514R712J1184J2612J3966J5382J6884J8405
$$ 317323 322632 329197 336546 344180 352044 360558 370270 381454 394066 408032 423414 440298 458703
63613D58703J9988K1730K3630K5680K7925L0167L1810L2400L2154L1539L0419
$$ 458703 478691 500421 524051 549731 577656 607823 639633 672033 704187 735726 766145
63602G66145K8177K4606K0111J5013R325L463j561n031p185q622r526r915j0169
$$ 766145 794322 818928 839039 854052 863377 866840 865279 860248 853063 844441 834915 825000 814831
63589H14831j0782j1826j3206j5189j8024k1183k3490k4180k3462k2060k0544
$$ 814831 804049 792223 779017 763828 745804 724621 701131 676951 653489 631429 610885
63578F10885j9125j7740j6206j4457j2623j0739q543n927l367j470j43J263L033
$$ 610885 591760 574020 557814 543357 530734 519995 511452 505525 502158 500688 500545 501808 504841
63565E04841M812O314P695Q993R801R909R778R908J0137J0144J0333J1519J3776
$$ 504841 509653 515967 523662 532655 542456 552365 562143 572051 582188 592332 602665 614184 627960
63552F27960J6308J8557K0897K3936K7589L1214L4443L7513M0695M3463M4223
$$ 627960 644268 662825 683722 707658 735247 766461 800904 838417 879112 922575 966798
63541I66798M1080L3303K2211J0333l70r235j6001j9908k0353j8092j5096j3038
$$ 966798 1007878 1041181 1063392 1073725 1073355 1064120 1048119 1028211 1007858 989766 974670 961632
63529I61632j2236j2072j2143j2746j4459j7376k0899k4273k7283l0052l2201
$$ 961632 949396 937324 925181 912435 897976 880600 859701 835428 808145 778093 745892
63518G45892l2766l1408k9223k7630k6649k5029k2170j9054j6968j6007j5263
$$ 745892 713126 681718 652495 624865 598216 573187 551017 531963 514995 498988 483725
63507D83725j4063j2425j0709r241q160p296o287n156m392m228m169l695l095
$$ 483725 469662 457237 446528 437287 429127 421831 415544 410388 405996 401768 397599 393904 390809
63494C90809l019l435l642l248k583k065j757j564j424j193p54k89j2L72J401
$$ 390809 387790 384355 380713 377465 374882 372817 371060 369496 368072 366879 366125 365836 365824 366196 367597
63479C67597K912L982M114L909M119M493M180L041J887J345J027R6j666l574m751
$$ 367597 370509 374491 378605 382514 386633 391126 395306 398347 400234 401579 402606 402702 401036 397462 392711
63464C92711m892m424m067m213m644m779m269l409k837k830k987k749k060j206
$$ 392711 387819 383395 379328 375115 370471 365692 361423 358014 355177 352347 349360 346611 344551 343345
63450C43345j86J262K929M076M464M919O346Q494J0335J1468J2467J3963J6028
$$ 343345 343159 344421 347350 351426 355890 360809 367155 375649 385984 397452 409919 423882 439910
63437D39910J8506K1308K4273K7289L0645L4516L7913L8802L5781K9305K1041
$$ 439910 458416 479724 503997 531286 561931 596447 634360 673162 708943 738248 759289
63426G59289J2567N075l38k883k513K47M696R976J5105J9587K3780K8176L2459
$$ 759289 771856 776931 776593 773710 771197 771444 776140 786116 801221 820808 844588 872764 905223
63413I05223L5641L6928L6012L2718K7044J9615J1657M303j901o834j0496j2908
$$ 905223 940864 977792 1013804 1046522 1073566 1093181 1104838 1109141 1107240 1100406 1089910 1077002
63401A077002j4154j4537j4734j5570j7380j9801k2405k5278k8575l1797l4037
$$ 1077002 1062848 1048311 1033577 1018007 1000627 980826 958421 933143 904568 872771 838734
63390H38734l4888l4598l3407l1289k8382k5162k2051j9186j6676j4590j2635
$$ 838734 803846 769248 735841 704552 676170 651008 628957 609771 593095 578505 565870
63379E65870j0329p756n677m534l692k119L20K737M318N251O413Q330J0655J2640
$$ 565870 555541 547785 542108 537574 533882 531763 532083 534820 539138 544389 550802 559132 569787 582427
63365E82427J4018J5282J7059J9360K1614K3369K4830K6637K9182L2131L4693
$$ 582427 596445 611727 628786 648146 669760 693129 717959 744596 773778 805909 840602
63354H40602L6371L7374L7981L7667L5334L0636K4500J7972J1073L507l932r646
$$ 840602 876973 914347 952328 989995 1025329 1055965 1080465 1098437 1109510 1113017 1109085 1099439
63342A099439j2904j4423j5172j5437j5405j5760j7067j9042k1091k3225k5771
$$ 1099439 1086535 1072112 1056940 1041503 1026098 1010338 993271 974229 953138 929913 904142
63331I04142k8479l0537l1442l1305l0289k8310k5351k1678j7604j3350r222n588
$$ 904142 875663 845126 813684 782379 752090 723780 698429 676751 659147 645797 636575 630987
63319F30987k499K58K448K948M71n162j2561j9554k4393k6341k5606k3051j9859
$$ 630987 628488 628746 631194 634142 634613 629451 616890 597336 572943 546602 520996 497945 478086
63306D78086j6970j4558j2137r432p058o041o639p880q418p718o322n104m447
$$ 478086 461116 446558 434421 424989 417931 411890 405251 397371 388953 381235 374913 369809 365362
63293C65362m153l975m012m450n003m957l981k654j893k011k558k973k930k258
$$ 365362 361209 357234 353222 348772 343769 338812 334831 332177 330284 328273 325715 322742 319812 317554
63279C17554j052pO7p24j313r91k97j09m08n27k90j67l49m48k03J20K18J69J13
$$ 317554 316502 316495 316562 315838 314525 313534 313237 313128 312720 312193 311903 311736 311387 310939 310736 310856 311074 311243 311356
63260C11356j8j84n1N35J201J472J339J120J023J140J608K343K826K620K055J951
$$ 311356 311338 311154 311103 311638 312839 314311 315650 316770 317793 318933 320541 322884 325710 328330 330385 332336
63244C32336K637L667M512N101N584O015O586P657R220J0648J1398J1703J2078
$$ 332336 334973 338640 343152 348253 353837 359852 366438 374095 383315 393963 405361 417064 429142
63231D29142J2431J2320J1964J2233J3378J4451J4383J3269J2087J1510J1475
$$ 429142 441573 453893 465857 478090 491468 505919 520302 533571 545658 557168 568643
63220E68643J1712J2104J2588J3067J3509J3776J3439J2135J0140Q164O501M771
$$ 568643 580355 592459 605047 618114 631623 645399 658838 670973 681113 689277 695778 700549
63208G00549K573K1k628n407q322j0912j2661j3696j4634j5690j6350j6092j5040
$$ 700549 703122 703143 700515 695108 686786 675874 663213 649517 634883 619193 602843 586751 571711
63195E71711j3656j2049j0004p548n111k975r28J321L656N749P574R349J1015
$$ 571711 558055 546006 536002 528454 523343 520368 519440 520761 524417 530166 537740 547089 558104
63182E58104J2229J2959J3644J4504J5051J4718J3760J3080J3189J3696J3959
$$ 558104 570333 583292 596936 611440 626491 641209 654969 668049 681238 694934 708893
63171G08893J3828J3579J3319J2757J1614J0034Q425O825M588J063l488p919j1378
$$ 708893 722721 736300 749619 762376 773990 784024 792449 799274 803862 804925 801437 793518 782140
63158G82140j4110j6876j9919k2805k4982k6051k5803k4519k3022k1845k0520
$$ 782140 768030 751154 731235 708430 683448 657397 631594 607075 584053 562208 541688
63147E41688j8354j5786j4021j3275j2397j0636q828q029p798o841m948l181k215
$$ 541688 523334 507548 493527 480252 467855 457219 448391 440362 432564 425723 420775 417594 415379
63134D15379j586q34m47j028k112k530j841p62o2L88J187K370L309L614L616L746
$$ 415379 413793 412959 412512 411484 409372 406842 405001 404239 404177 404565 405752 408122 411431 415045 418661 422407
63118D22407L881L695L372L411L812M080M033M008M123L977L412K996L248L828
$$ 422407 426288 429983 433355 436766 440578 444658 448691 452699 456822 460799 464211 467207 470455 474283
63104D74283M035L827L743M032M408M611M699M751M720M637M647M781M973N245
$$ 474283 478318 482145 485888 489920 494328 498939 503638 508389 513109 517746 522393 527174 532147 537392
63090E37392N504N275M064K093K62p99j307j818k427k803k794k665k682k705k392
$$ 537392 542896 548171 552235 554328 554590 553791 552484 550666 548239 545436 542642 539977 537295 534590 532198
63075E32198j773j393j718k443k679j863l23J180K245L093M194N752P397Q422
$$ 532198 530425 529032 527314 524871 522192 520329 520006 521186 523431 526524 530718 536470 543867 552289
63061E52289Q632Q859J0130J2283J4092J5029J6095J8299K1125K3362K4961K6893
$$ 552289 560921 569780 579910 592193 606285 621314 637409 655708 676833 700195 725156 752049
63049G52049K9401L1588L2834L3563L4250L4641L4429L3977L3732L3475L2739
$$ 752049 781450 813038 845872 879435 913685 948326 982755 1016732 1050464 1083939 1116678
63038A116678L1648L0800L0510L0518L0354K9741K8808K7918K7018K5302K1930
$$ 1116678 1148326 1179126 1209636 1240154 1270508 1300249 1329057 1356975 1383993 1409295 1431225
63027A431225J7149J1967O704O94o304j3366j9651k5508l1415l6567l9668m0777
$$ 1431225 1448374 1460341 1467045 1467739 1461435 1448069 1428418 1402910 1371495 1334928 1295260 1254483
63015A254483m1147m1269m0271l7444l3387k9167k5117k0924j6388j1528o397
$$ 1254483 1213336 1172067 1131796 1094352 1060965 1031798 1006681 985757 969369 957841 951444
63004I51444j231L458P370J0759J4036J7239K0178K2761K4857K6033K5926K4889
$$ 951444 950213 953671 961041 971800 985836 1003075 1023253 1046014 1070871 1096904 1122830 1147719
62992A147719K3873K3573K3864K4122K3876K3115K2111K1005J9544J7187J3552
$$ 1147719 1171592 1195165 1219029 1243151 1267027 1290142 1312253 1333258 1352802 1369989 1383541
62981A383541Q785L502j703o750j2071j8112k4734l1123l6391m0232m2899m4600
$$ 1383541 1392326 1395828 1394125 1387375 1375304 1357192 1332458 1301335 1264944 1224712 1181813 1137213
62969A137213m5201m4596m3068m1080l8853l6401l3845l1390k9004k6384k3415
$$ 1137213 1092012 1047416 1004348 963268 924415 888014 854169 822779 793775 767391 743976
62958G43976k0478j8185j6838j6213j5760j5047j4078j3290j3082j3287j3275
$$ 743976 723498 705313 688475 672262 656502 641455 627377 614087 601005 587718 574443
62947E74443j2728j2120j2119j2590j2555j1345r460q045p627p689p455o705n754
$$ 574443 561715 549595 537476 524886 512331 500986 491526 483481 475854 468165 460710 454005 448251
62934D48251m943m466m476m957n510n595n110m470l964l313k212j075p07j212
$$ 448251 443308 438842 434366 429409 423899 418304 413194 408724 404760 401447 399235 398160 397453 396241
62920C96241j722j500r10q16j227j229l12P82R46J20o50n26J86N53K15k58j44
$$ 396241 394519 393019 392109 391293 390066 388837 388525 389307 390253 390373 389723 389197 389383 389936 390151 389893 389749
62903C89749N64J273J583J652J772J934K048K292K869L555L853L569K951K293
$$ 389749 390313 391586 393169 394821 396593 398527 400575 402867 405736 409291 413144 416713 419664 421957
62889D21957J793J710K128K533K205J177K40k00o77j655k648k951k727k672k896
$$ 421957 423750 425460 427588 430121 432326 433503 433743 433543 432866 431211 428563 425612 422885 420213 417317
62874D17317k914k545k130j986k274l217m675n641n081l332j855j392j344j128
$$ 417317 414403 411858 409728 407742 405468 402251 397576 391935 386854 383522 381667 380275 378931 377803
62860C77803j094j549j794j069J74Q46P52O62J009J326J033J56q45j483j412o42
$$ 377803 376709 375160 373366 372297 372471 373317 374069 374731 375740 377066 378099 378255 377410 375927 374515 373873
62844C73873L17Q14O57J56l31o30o50m07j57j69l58m31l20j71J6L24M69p4j281
$$ 373873 374190 375004 375661 375817 375486 374856 374206 373799 373642 373473 373115 372684 372364 372193 372209 372533 373002 372928 371647
62825C71647k276k107p40R77K158K550K403K013J515J004O67O84J085J759K539
$$ 371647 369371 367264 366524 367501 369659 372209 374612 376625 378140 379144 379811 380495 381580 383339 385878
62810C85878L148L269K932K689L053L757M048L808L785M452N240N421N241N513
$$ 385878 389026 392295 395227 397916 400969 404726 408774 412582 416367 420819 426059 431480 436721 442234
62796D42234O343P073P401P790Q607R574J0335J1048J2073J3475J5216J7523K0612
$$ 442234 448577 455650 463051 470841 479448 489022 499357 510405 522478 535953 551169 568692 589304
62783E89304K4181K7584L0491L3158L6007L9146M2312M5206M7759N0066N2093
$$ 589304 613485 641069 671560 704718 740725 779871 822183 867389 915148 965214 1017307
62772A017307N3458N3599N2064M8709M3750L7677L0937K3522J5090N708l788j2470
$$ 1017307 1070765 1124364 1176428 1225137 1268887 1306564 1337501 1361023 1376113 1381821 1378033 1365563
62760A365563k0151k7153l3413l8396m1993m4856m7554m9765n0629m9744m7532
$$ 1365563 1345412 1318259 1284846 1246450 1204457 1159601 1112047 1062282 1011653 961909 914377
62749I14377m4835m2345m0297l8435l6303l3723l0902k8098k5308k2510j9911
$$ 914377 869542 827197 786900 748465 712162 678439 647537 619439 594131 571621 551710
62738E51710j7769j6037j4390j2616j0852r424q510p909p213o223n163m314l566
$$ 551710 533941 517904 503514 490898 480046 470622 462112 454203 446990 440767 435604 431290 427724
62725D27724k619j554q33n57j67Q40K120K915L095L422M604O455Q116Q988R267
$$ 427724 425105 423551 422718 422161 421994 422834 424954 427869 430964 434386 438990 445445 453561 462549 471816
62710D71816R664J0716J2414J4359J6270J8306K0827K3879K6981K9594L1766L4145
$$ 471816 481480 492196 504610 518969 535239 553545 574372 598251 625232 654826 686592 720737
62698G20737L7213M0676M3792M6255M8362N0321N1796N2341N1973N0937M9091
$$ 720737 757950 798626 842418 888673 937035 987356 1039152 1091493 1143466 1194403 1243494
62687A243494M5893M0879L4002K5608J6365P000k240j1673k1340l0313l7462m2751
$$ 1243494 1289387 1330266 1364268 1389876 1406241 1413241 1411001 1399328 1377988 1347675 1310213 1267462
62675A267462m7104n0971n3760n4876n4528n3183n0934m7995m5096m2669m0051
$$ 1267462 1220358 1169387 1115627 1060751 1006223 953040 902106 854111 809015 766346 726295
62664G26295l6397l2124k8608k6437k4783k2635j9949j7343j5196j3475j2080
$$ 726295 689898 657774 629166 602729 577946 555311 535362 518019 502823 489348 477268
62653D77268j0950j0038r408r135q908q045o325m553l853m397n229n357m690l739
$$ 477268 466318 456280 446872 437737 428829 420784 414459 409906 406053 401656 396427 391070 386380 382641
62639C82641k824j924j095n82m21l31j46j12m56q72q22l15rl85j138j540j230
$$ 382641 379817 377893 376798 376216 375795 375464 375318 375206 374750 373878 373056 372741 372732 372347 371209 369669 368439
62622C68439m87J31K01l14r84j143m51P50J767K192K090J700J252J116J742L147
$$ 368439 367952 368083 368284 367970 366986 365843 365392 366142 367909 370101 372191 373891 375143 376259 378001 381148
62606C81148M632N325N114M861N486O992Q559R596J0415J1714J3687J5921J8028
$$ 381148 385780 391105 396219 401080 406566 413558 422117 431713 442128 453842 467529 483450 501478
62593E01478J9970K1753K3188K4193K4969K5603K5634K4472K2213J9699J7588
$$ 501478 521448 543201 566389 590582 615551 641154 666788 691260 713473 733172 750760
62582G50760J5495J2279P259J057m878r548j3098j6216j9110k1345k2572k2995
$$ 750760 766255 778534 785793 786850 781972 772424 759326 743110 724000 702655 680083 657088
62570F57088k3037k2847k2332k1485k0411j9165j7789j6398j5066j3724j2301
$$ 657088 634051 611204 588872 567387 546976 527811 510022 493624 478558 464834 452533
62559D52533j0927r786q840p829o610n376m553m444m906n321n042l975k683j844
$$ 452533 441606 431820 422980 415151 408541 403165 398612 394168 389262 383941 378899 374924 372241 370397
62545C70397j641j690j412n07P94J889K392K557K888L339L270K338J056K29J09
$$ 370397 368756 367066 365654 365147 365941 367830 370222 372779 375667 379006 382276 384614 385670 385899 386008
62530C86008M47J053J850K583K990L244L855N031O509P988R428J0889J2397J4130
$$ 386008 386455 387508 389358 391941 394931 398175 402030 407061 413570 421558 430986 441875 454272 468402
62516D68402J6365J9042K1624K3594K5015K6372K7890K9272L0134L0486L0619
$$ 468402 484767 503809 525433 549027 574042 600414 628304 657576 687710 718196 748815
62505G48815L0460K9338K6671K2751J8537J4593J0523N710K38n145r777j3452
$$ 748815 779275 808613 835284 858035 876572 891165 901688 907398 907636 902491 892714 879262
62493H79262j6146j7755j8123j7231j5377j3133j0951q643n626j889J729M584
$$ 879262 863116 845361 827238 810007 794630 781497 770546 761903 756277 754388 756117 760701
62481G60701P155J0276J3817J6857J9012K0670K1831K1670J9658J6359J2586Q351
$$ 760701 767856 778132 791949 808806 827818 848488 870319 891989 911647 928006 940592 948943
62469I48943L355k032p035j1595j6372k1598k6545l0296l2594l3724l4015l3792
$$ 948943 952298 950266 943231 931636 915264 893666 867121 836825 804231 770507 736492 702700
62457G02700l3455l3117l2241l0067k6580k2754j9623j7252j4911j2188r535p581
$$ 702700 669245 636128 603887 573820 547240 524486 504863 487611 472700 460512 450977 443396
62445D43396o299n242m310l775l541k985j719j49J009J494J466J076M30j20j80
$$ 443396 437097 431855 427545 423770 420229 417244 415525 415376 416385 417879 419345 420421 420851 420731 420551
62430D20551J21J27n68j668k650l475m497n711o483o270n352m556m333m372m118
$$ 420551 420672 420799 420231 418563 415913 412438 407941 402230 395747 389477 384125 379569 375236 370864 366746
62415C66746l372k320j267n77n15r25j245j161j004j188j481j285o05j30l57r65
$$ 366746 363374 361054 359787 359210 358695 357770 356525 355364 354360 353172 351691 350406 349801 349671 349314 348349
62399C48349j271q97N2J142J830J857J605J747K457L189L372K963K286J706J622
$$ 348349 347078 346181 346233 347375 349205 351062 352667 354414 356871 360060 363432 366395 368681 370387 372009
62384C72009K303L514M657N498O371P479Q484R067R403R668R596R083Q794R489
$$ 372009 374312 377826 382483 387981 394352 401831 410315 419382 428785 438453 448049 457132 465926 475415
62370D75415J0962J2371J3447J4691J6431J8416K0415K2620K5217K8114L1278
$$ 475415 486377 498748 512195 526886 543317 561733 582148 604768 629985 658099 689377
62359F89377L4872L8870M2917M6804N0670N4441N7500N9175N9275N7828N4572
$$ 689377 724249 763119 806036 852840 903510 957951 1015451 1074626 1133901 1191729 1246301
62348A246301M9109M1513L2506K3031J3747M868l613j1621j8886k5324l1262l6946
$$ 1246301 1295410 1336923 1369429 1392460 1406207 1411075 1407462 1395841 1376955 1351631 1320369 1283423
62336A283423m1890m5211m6704m7030m6699m5445m3033m0003l7043l3993l0311
$$ 1283423 1241533 1196322 1149618 1102588 1055889 1010444 967411 927408 890365 856372 826061
62325H26061k6278k2927k0769j9371j8357j7984j8336j8679j8288j7432j6900
$$ 826061 799783 776856 756087 736716 718359 700375 682039 663360 645072 627640 610740
62314F10740j6803j6517j5734j4861j4279j3774j2947j1783j0556r465q583p926
$$ 610740 593937 577420 561686 546825 532546 518772 505825 494042 483486 474021 465438 457512
62302D57512p332o500n351m162l167k277j458j025j103j042J0J905L462L840L445
$$ 457512 450180 443680 438329 434167 431000 428723 427265 426240 425137 424095 424105 426010 429472 433312 436757
62287D36757L168L223L211L082L297M057M833M957M381L568K962K789L203M254
$$ 436757 439925 443148 446359 449441 452738 456795 461628 466585 470966 474534 477496 480285 483488 487742
62273D87742N682P030Q029Q751R333R888J0766J2524J5270J8258K0600K2382K4599
$$ 487742 493424 500454 508483 517234 526567 536455 547221 559745 575015 593273 613873 636255 660854
62260F60854K7888L1891L6093M0697M5994N1326N5494N8197O0247O2081O2703
$$ 660854 688742 720633 756726 797423 843417 894743 950237 1008434 1068681 1130762 1193465
62249A193465O0624N5417M7880L8978K9201J8900Q602j180j0234j8571k6235l3242
$$ 1193465 1254089 1309506 1357386 1396364 1425565 1444465 1453067 1451887 1441653 1423082 1396847 1363605
62237A363605l9621m5369n0384n4358n6819n7451n6498n4658n2385m9492m5612
$$ 1363605 1323984 1278615 1228231 1173873 1117054 1059603 1003105 948447 896062 846570 800958
62226H00958m0893l5989l1486k7665k4653k2446k0676j8777j6553j4351j2570
$$ 800958 760065 724076 692590 664925 640272 617826 597150 578373 561820 547469 534899
62215E34899j1223j0180r454r034q568p654o450n626n543n717n362m320l114k109
$$ 534899 523676 513496 504042 495008 486440 478786 472336 466710 461167 455450 450088 445768 442654 440545
62201D40545j060K99J595K245K363K717L702M845N550N897O414P357Q640J0202
$$ 440545 439485 439784 441379 443624 445987 448704 452406 457251 462801 468698 475112 482469 491109 501311
62187E01311J1953J3508J4416J4717J4902J5327J5963J6692J7454J8014J8024
$$ 501311 513264 526772 541188 555905 570807 586134 602097 618789 636243 654257 672281
62176F72281J7509J6965J6752J6664J6430J6417J7443J9909K3397K7190L0836
$$ 672281 689790 706755 723507 740171 756601 773018 790461 810370 833767 860957 891793
62165H91793L4103L6721L8496L9654M0652M1481M1357L9299L4941K8617K0900
$$ 891793 925896 962617 1001113 1040767 1081419 1122900 1164257 1203556 1238497 1267114 1288014
62154A288014J2450M133l260r623j5465k1026k5918k9917l3536l7306m0800m3007
$$ 1288014 1300464 1304597 1301337 1291714 1276249 1255223 1229305 1199388 1165852 1128546 1087746 1044739
62142A044739m3558m2863m1242l8603l5103l1360k7723k3950j9978j6555j4457
$$ 1044739 1001181 958318 917076 878473 843370 812010 784287 760337 740359 723804 709347
62131G09347j3382j2172j0080p393m820k702r77L50J080J203J257K069M004O572
$$ 709347 695965 683793 673713 666320 661500 658798 657821 658171 659251 660454 661711 663780 667784 674356
62117F74356Q957J0820J2339J3498J3733J2482R859O594L370M79j967l621l961
$$ 674356 683313 694133 706472 719970 733703 746185 756044 762638 766008 766487 764520 760899 756938
62104G56938k878j268o66j996m757p717j0170j2053j3076j2578j0464p593m801
$$ 756938 754060 752792 752126 750130 745373 737656 727486 715433 702357 689779 679315 671722 666921
62091F66921k056Q80L534N173N907O588P645Q741R633J0652J2054J3475J4465
$$ 666921 664865 665745 669279 674452 680359 686947 694592 703333 712966 723618 735672 749147 763612
62078G63612J5300J6742J9064K1681K3771K5044K5847K6685K7717K8670K9167
$$ 763612 778912 795654 814718 836399 860170 885214 911061 937746 965463 994133 1023300
62067A023300K9108K8790K8701K9161L0114L1179L1919L2033L1307K9428K6116
$$ 1023300 1052408 1081198 1109899 1139060 1169174 1200353 1232272 1264305 1295612 1325040 1351156
62056A351156K1486J6079J0399M545j498p383j2517j6717k0445k4233k8060l1470
$$ 1351156 1372642 1388721 1399120 1403665 1402167 1394784 1382267 1365550 1345105 1320872 1292812 1261342
62044A261342l4208l6442l8404l9997m0970m1269m1010m0149l8519l6231l3787
$$ 1261342 1227134 1190692 1152288 1112291 1071321 1030052 989042 948893 910374 874143 840356
62033H40356l1578k9457k7072k4354k1522j8745j6218j4286j3051j1897j0088
$$ 840356 808778 779321 752249 727895 706373 687628 671410 657124 644073 632176 622088
62022F22088p893o474o434p020p236p119p305p759p783p222o764o819o755n776
$$ 622088 614195 607721 601287 594267 587031 579912 572607 564848 557065 549843 543079 536260 529505 523729
62008E23729m181l087k981l053k276p08O98J470K177L412M762N350N100M737M527
$$ 523729 519548 516461 513480 510427 508151 507443 508141 509611 511788 515200 519962 525312 530412 535149 539676
61993E39676L783J966l54k178l268m186n361o684p900q906r704j0316j0739j0755
$$ 539676 543459 545425 545071 542893 539625 535439 530078 523394 515494 506588 496884 486568 475829 465074
61979D65074j0020q632p308o610o213n426m232l296k992l020k980k845k727k653
$$ 465074 455054 446422 439114 432504 426291 420865 416633 413337 410345 407325 404345 401500 398773 396120
61965C96120k602k462j941r51L5M58M49N17N42k9q61n36J603M226N407M919M308
$$ 396120 393518 391056 389115 388164 388199 388657 389106 389623 390165 390136 389275 388739 390342 394568 399975 404894 409202
61948D09202M937O678Q564R972J0943J1928J3480J5894J8803K1341K2900K3651
$$ 409202 414139 420817 429381 439353 450296 462224 475704 491598 510401 531742 554642 578293
61936E78293K4176K4753K5237K5495K5646K5767K5517K4313K1914J8752J5564
$$ 578293 602469 627222 652459 677954 703600 729367 754884 779197 801111 819863 835427
61925H35427J2789J0364Q026N622L075J97l159o682r482j0747j0597j0048r786
$$ 835427 848216 858580 866606 872228 875303 875500 872341 865659 856177 845430 834833 824785 814999
61912H14999r231p247l672M06M011P242J0577J3803J6285J7786J8355J7679J5359
$$ 814999 805768 798521 794849 795255 799266 806508 817085 830888 847173 864959 883314 900993 916352
61899I16352J1744P723L686o36n217r370j2496j4644j6100j7013j7644j8331j8959
$$ 916352 928096 935819 939505 938869 933652 924282 911786 897142 881042 864029 846385 828054 809095
61886H09095j9055j8555j7899j7148j5796j3850j2232j1563j1328j0925j0800
$$ 809095 790040 771485 753586 736438 720642 706792 694560 682997 671669 660744 649944
61875F49944j1525j2409j2123j0533q841p896p329o460n185l731k221p88M24J601
$$ 649944 638419 626010 613887 603354 594513 586617 579288 572828 567643 563912 561691 560903 561327 562928
61861E62928L131M998O719Q091R500J1325J3482J5732J8121K0839K3931K7252
$$ 562928 566059 571057 577776 585867 595367 606692 620174 635906 654027 674866 698797 726049
61849G26049L0494L3216L5186L6585L7563L7684L6402L3957L1163K8165K4183
$$ 726049 756543 789759 824945 861530 899093 936777 973179 1007136 1038299 1066464 1090647
61838A090647J8731J2376N936l62o338j1232j4311j5726j6020j5119j2595q757
$$ 1090647 1109378 1121754 1127690 1127328 1120990 1109758 1095447 1079721 1063701 1048582 1035987 1027230
61826A027230m650q71K845O777J0549J3518J5356J5925J5006J2472Q446L080l513
$$ 1027230 1022580 1021709 1024554 1031331 1041880 1055398 1070754 1086679 1101685 1114157 1122603 1125683 1122170
61813A122170j0893j8152k4478k9675l3848l6878l8509l8843l8246l6814l4336
$$ 1122170 1111277 1093125 1068647 1038972 1005124 968246 929737 890894 852648 815834 781498
61802G81498l0942k7327k4148k1441j8915j6574j4650j3093j1551r875q338p236
$$ 781498 750556 723229 699081 677640 658725 642151 627501 614408 602857 592982 584644 577408
61790E77408o561o153n833n291m234k894k089k313l041l331k975k580k573k725
$$ 577408 570847 564694 558861 553570 549336 546442 544353 542040 538999 535668 532693 530113 527540 524815
61776E24815k754k870l346l927m034l418k351j388j011j278j586j106J89J289
$$ 524815 522061 519191 515845 511918 507884 504466 502115 500727 499716 498438 496852 495746 495935 497224
61762D97224J340P95P75J418J706J052K52L24J078J505J241Q09N44K05k09j09
$$ 497224 498564 499359 500134 501552 503258 504310 504562 504886 505964 507469 508710 509519 510063 510268 510059 509950
61746E09950O51J103K60j457k626k576j999j794j994k049j621p71J91Q11P13P8
$$ 509950 510601 511704 511964 510507 507881 505305 503306 501512 499518 497469 495848 495077 495268 496079 496792 496870
61730D96870m65n84n77p22p28k24P08J789K912L801L786K655J316Q88J321J750
$$ 496870 496405 495821 495244 494522 493794 493570 494278 496067 498979 502780 506566 509221 510537 511425 512746 514496
61714E14496J915K229K548K055O55o07j042j292k110l072l307k935k817l276l918
$$ 514496 516411 518640 521188 523243 523898 523291 522249 520957 518847 515775 512468 509533 506716 503440 499522
61699D99522m496n026n206m578l398k624k790l535m212m433l894k469p85n0p46
$$ 499522 495026 490000 484794 480216 476818 474194 471404 467869 463657 459224 455330 452861 452076 452026 451280
61684D51280j900k157j336m61m05r54j217o46M00R60M02q24j552j142j93L31L21
$$ 451280 449380 447223 445887 445426 445021 444067 442850 442204 442604 443564 443966 443142 441590 440448 440255 440586 440907
61667D40907M54R53J171O26j31k55J45J68n28j185r49P4J094J580J543J197Q19
$$ 440907 441361 442314 443485 444111 443980 443725 443870 444038 443510 442325 441376 441450 442544 444124 445667 446864 447683
61650D47683P81J205J667J688J483J700K386K768K330J602J565K522L888M771
$$ 447683 448464 449669 451336 453024 454507 456207 458593 461361 463691 465293 466858 469380 473268 478039
61636D78039M525L047R39q71j977k875m118n408n934n443m509l777l372l101k823
$$ 478039 482564 485611 486550 485679 483702 480827 476709 471301 465367 459924 455415 451638 448266 445165 442342
61621D42342k512k180j889j673j419j044o75m93m16k29J3M0k97r86k096l660n271
$$ 442342 439830 437650 435761 434088 432669 431625 430950 430457 430041 429812 429825 429865 429568 428582 426486 422826 417555
61604D17555o274o447o153n769n275m639m127l948l914l787l751m115m722n002
$$ 417555 411281 404834 398681 392912 387637 382998 378871 374923 371009 367222 363471 359356 354634 349632
61590C49632m658l974l409l069k756k327j912j774k013k411k594k391k006j766
$$ 349632 344974 341000 337591 334522 331766 329439 327527 325753 323740 321329 318735 316344 314338 312572
61576C12572j690j469r55n65r30k016k902k718j715j002j172j659j585q33J0M63
$$ 312572 310882 309413 308458 307893 306963 304947 302045 299327 297612 296610 295438 293779 292194 291361 291371 291834
61560B91834M55R6m03o37l25K87O42N22K54K95Q68J826K617K569J664P91P53J192
$$ 291834 292289 292385 291982 291345 291020 291307 291949 292471 292725 293020 293888 295714 298331 300900 302564 303355 304108 305300
61542C05300J210Q63J109K145K799K143Q56K71N94R16O72K39J37L89P45J027J025
$$ 305300 306510 307373 308482 310627 313426 315569 316425 316696 317290 318206 318878 319117 319254 319643 320388 321415 322440
61525C22440M83n28j501j899j631j098q34j055j484j629j386j131j191j400j411
$$ 322440 322923 322395 320894 318995 317364 316266 315432 314377 312893 311264 309878 308747 307556 306156 304745
61510C04745j159p76l25P6M7o22j480j762j322q10q66j388j734j449o68M2K77
$$ 304745 303586 302810 302485 302561 302608 301986 300506 298744 297422 296612 295746 294358 292624 291175 290507 290549 290826
61493B90826K08L57Q43J124P47N3k23O5L99M22L30L92N99Q84J277J579J348M64
$$ 290826 291034 291391 292234 293358 294105 294158 293935 294000 294399 294821 295151 295543 296142 297026 298303 299882 301230 301694
61475C01694n55j111j149r45n89l5N17P50O74N66M28k0p17j035n43K76N42J53
$$ 301694 301139 300028 298879 297934 297345 297310 297827 298577 299251 299817 300245 300225 299508 298473 297930 298206 298748 298901
61457B98901p9L80R88R60N57P84J818K530J914M64m96m59j03j19l42k11M71J451
$$ 298901 298822 299202 300190 301150 301707 302491 304309 306839 308753 309217 308721 308262 308159 308040 307698 307487 307958 309409
61439C09409K368K938L047K865K756K916L193L406L612L950M321M373L841K806
$$ 309409 311777 314715 317762 320627 323383 326299 329492 332898 336510 340460 344781 349154 352995 355801
61425C55801J668Q74O23Q26J324K025K787L371L619L542L162K487J785J515J694
$$ 355801 357469 358343 358966 359792 361116 363141 365928 369299 372918 376460 379622 382109 383894 385409 387103
61410C87103J680J036K57N9J70l98j925l535m330m235l563k515j469j041j355
$$ 387103 388783 389819 390076 390135 390305 389907 387982 384447 380117 375882 372319 369804 368335 367294 365939
61395C65939j750j688j457j496j575j271p81n57m53kO68R38O97M87O13P78P26
$$ 365939 364189 362501 361044 359548 357973 356702 355921 355364 354911 354909 355577 356515 357212 357699 358312 359090 359816
61378C59816P07J018J503J746J534J016N78N49Q49J020R44J142J962K752K577
$$ 359816 360523 361541 363044 364790 366324 367340 367918 368467 369316 370336 371280 372422 374384 377136 379713
61363C79713J606R90J325K065K600L024L476L557L087K751L311M554N622O107
$$ 379713 381319 382309 383634 385699 388299 391323 394799 398356 401443 404194 407505 412059 417681 423788
61349D23788O204O206O410P273Q945J0736J1623J1258J0056Q509O946N778N269
$$ 423788 429992 436198 442608 449881 458826 469562 481185 492443 502499 511008 517954 523732 529001
61336E29001M956L996K254N80k10j80j2k36r60j960k844l377l758m308m893n017
$$ 529001 533957 537953 540207 540787 540577 540397 540385 540149 539189 537229 534385 531008 527250 522942 518049 513032
61320E13032m516l784l154k580j940j286n82L32J339K016K264K512L066L705M250
$$ 513032 508516 504732 501578 498998 497058 495772 495190 495522 496861 498877 501141 503653 506719 510424 514674
61305E14674N017O266P663Q715R428R961J0055R364Q107O736N149K868m1k774
$$ 514674 519691 525957 533620 542335 551763 561724 571779 581143 589250 595986 601135 604003 603962 601188
61291F01188m540n087m662m001m130n399o760o751n273l702l080l012k613j782
$$ 601188 596648 591561 586899 582898 578768 573369 566609 559858 554585 550883 547803 544791 542178 540396
61277E40396r98m26J45Q22J605K625L971N405O535P134P130O574N778N172M904
$$ 540396 539398 538972 539117 539939 541544 544169 548140 553545 560080 567214 574344 580918 586696 591868 596772
61262E96772M862N143N935O852P154O923P294Q854J0589J1159J0629R922R096
$$ 596772 601634 606777 612712 619564 626718 633641 640935 649789 660378 671537 682166 692088 701184
61249G01184P305M403J473m40j330j782k297l217m656o191p283q112r353j0937
$$ 701184 708489 712892 714365 713925 712595 710813 708516 705299 700643 694452 687169 679057 669704 658767
61235F58767j1731j0865q740o440m701l816l862m391m350l024q77R85K028K556
$$ 658767 647036 636171 627431 620991 616290 612474 608612 604221 599871 596847 595970 596955 598983 601539
61221F01539L029L492L693L394K703K147K264K938L485L530L440L628L884L739
$$ 601539 604568 608060 611753 615147 617850 619997 622261 625199 628684 632214 635654 639282 643166 646905
61207F46905L206K685K412K386K530K598K227J549J415K465M241N773O825P981
$$ 646905 650111 652796 655208 657594 660124 662722 664949 666498 667913 670378 674619 680392 687217 695198
61193F95198R649J1686J3861J5988J7616J8205J7780J6835J5565J3764J1554R504
$$ 695198 704847 716533 730394 746382 763998 782203 799983 816818 832383 846147 857701 867205
61181H67205P879O358M786L579L023K777K468K210K085J566Rk507n293p709r325
$$ 867205 875084 881442 886228 889807 892830 895607 898075 900285 902370 903936 903945 901438 896145 888436 879111
61166H79111r876r631r493j0172j1385j2420j3152j3940j4715j5024j4888j4852
$$ 879111 869235 859604 850111 839939 828554 816134 802982 789042 774327 759303 744415 729563
61154G29563j5018j4800j3825j2378j0703q649o407m775l999l059j005J410K422
$$ 729563 714545 699745 685920 673542 662839 654190 647783 643008 639009 635950 634945 636355 638777
61141F38777J410n93k543m471o658q607r521r309q502p439o067m318k302k29J548
$$ 638777 640187 639594 637051 632580 625922 617315 607794 598485 589983 582544 576477 572159 569857 569628 571176
61126E71176K620L016L435M613O553Q697J0708J2697J4766J6753J8450J9778K0742
$$ 571176 573796 576812 580247 584860 591413 600110 610818 623515 638281 655034 673484 693262 714004
61113G14004K1499K2434K3751K5089K5870K5992K5789K5340K4377K2926K1546
$$ 714004 735503 757937 781688 806777 832647 858639 884428 909768 934145 957071 978617
61102I78617K0615J9774J8349J6088J3231J0150P068L851nm771r709j3435j5394
$$ 978617 999232 1019006 1037355 1053443 1066674 1076824 1083892 1087743 1087738 1082967 1073258 1059823 1044429
61089A044429j6534j8032j9814k0990k1366k1729k2559k3329k3289k2424k1231
$$ 1044429 1027895 1009863 990049 969059 947693 925964 903405 880076 856787 834363 813132
61078H13132j9961j8542j6985j5506j4212j2959j1610j0257r103q206p346o216
$$ 813132 793171 774629 757644 742138 727926 714967 703357 693100 683997 675791 668445 662229
61066F62229m725l160j929j132m61M11J401K128K482K891L808N058O129P056Q520
$$ 662229 657504 654344 652415 651283 650822 651233 652634 654762 657244 660135 663943 669001 675130 682186 690706
61051F90706J0727J2768J3672J3746J4106J5098J6064J6789J8085K0550K3565
$$ 690706 701433 714201 727873 741619 755725 770823 786887 803676 821761 842311 865876
61040H65876K6123K8100K9956L1798L3404L4886L6589L8518M0469M2545M4957
$$ 865876 891999 920099 950055 981853 1015257 1050143 1086732 1125250 1165719 1208264 1253221
61029A253221M7537N0022N2582N5509N8505O0931O2565O3598O4152O4629O6296
$$ 1253221 1300758 1350780 1403362 1458871 1517376 1578307 1640872 1704470 1768622 1833251 1899547
61018A899547P0645P8102Q8027R9922J13693J28891J44771J61638J81534K07472
$$ 1899547 1970192 2048294 2136321 2236243 2349936 2478827 2623598 2785236 2966770 3174242
61008C174242K42683K90376L53129M32035N27128O38352P65101R05622J059880
$$ 3174242 3416925 3707301 4060430 4492465 5019593 5657945 6423046 7328668 8388548
60999H388548J234055J439715J685827J970557K275934K558793K739005K708445
$$ 8388548 9622603 11062318 12748145 14718702 16994636 19553429 22292434 25000879
60991B5000879K382537J771792J009815K98388j93455l97071l41652j17422J46704
$$ 25000879 27383416 29155208 30165023 30463411 30269956 29872885 29531233 29413811 29560515
60982B9560515K95030J85797k37051q97449j618688k215902k578756k692581k606591
$$ 29560515 29855545 30041342 29804291 28906842 27288154 25072252 22493496 19800915 17194324
60973A7194324k390926k109953j812288j528855j275173j056468q72623p20848
$$ 17194324 14803398 12693445 10881157 9352302 8077129 7020661 6148038 5427190
60965E427190n96836m95917m14143l48658k97222k57430k26280k00819j79237
$$ 5427190 4830354 4334437 3920294 3571636 3274414 3016984 2790704 2589885 2410648
60956B410648j60880j45077j30503j16127j02142q9323p7905o7687n8911n2205
$$ 2410648 2249768 2104691 1974188 1858061 1755919 1666596 1588691 1521004 1462093 1409888
60946A409888m7818m5417m4471m4208m3518m1606l8724l5764l3291l1426l0255
$$ 1409888 1362070 1316653 1272182 1227974 1184456 1142850 1104126 1068362 1035071 1003645 973390
60935I73390k9550k8433k6305k3934k2616k2292k1655k0163j8776j8159j7446
$$ 973390 943840 915407 889102 865168 842552 820260 798605 778442 759666 741507 724061
60924G24061j5576j3043j1239j0559j0168r435q653q268q096p629o762n899n456
$$ 724061 708485 695442 684203 673644 663476 654041 645388 637120 629024 621395 614633 608734 603278
60911F03278n332m937l892k619j943k100k479k502k326k377k625k725k602k454
$$ 603278 597946 593009 589117 586498 584555 582455 579976 577474 575148 572771 570146 567421 564819 562365
60897E62365k335k125j824j500j070m78n9l15j283k385k954k738j988j293j262
$$ 562365 560030 557905 556081 554581 553511 553033 552974 552659 551376 548991 546037 543299 541311 540018 538756
60882E38756k051l141l781l671l069k312j589j060q05n21L46J942L664M812N372
$$ 538756 536705 533564 529783 526112 523043 520731 519142 518082 517277 516756 517102 519044 522708 527520 532892
60867E32892N894O714P552P967P944P834P904Q111Q387Q864R683J0601J1047J0674
$$ 532892 538786 545500 553052 561019 568963 576797 584701 592812 601199 610063 619746 630347 641394 652068
60853F52068R800R128R067R455R928J0325J0706J1106J1479J1802J2005J1904
$$ 652068 661868 670996 680063 689518 699446 709771 720477 731583 743062 754864 766869 778773
60841G78773J1472J1138J1434J2219J2638J2179J1407J1170J1342J0972R670Q170
$$ 778773 790245 801383 812817 825036 837674 849853 861260 872430 883772 894744 904414 912584
60829I12584P213O522N386L769K210Q79o47k652m940p320r879j2575j4966j6644
$$ 912584 919797 926319 931705 935474 937684 938563 937916 935264 930324 923004 913125 900550 885584 868940
60815H68940j7720j8626j9545k0259k0459k0054j9193j8125j7063j6078j5088
$$ 868940 851220 832594 813049 792790 772331 752277 733084 714959 697896 681818 666730
60804F66730j3967j2693j1417j0382r659r008q178p309o771o535o082n180m294
$$ 666730 652763 640070 628653 618271 608612 599604 591426 584117 577346 570811 564729 559549 555255
60791E55255l899l688l020j950j244j416k229l143l723l651k913k138k162l006
$$ 555255 551356 547668 544648 542698 541454 540038 537809 534666 530943 527292 524379 522241 520079 517073
60777E17073l783l844l609l878m748n597n821n244m069k838k213k426l025l428
$$ 517073 513290 509446 505837 501959 497211 491614 485793 480549 476480 473642 471429 469003 465978 462550
60763D62550l566l722l963m123m188m345m583m609m227l642l266l304l512l427
$$ 462550 458984 455262 451299 447176 442988 438643 434060 429451 425224 421582 418316 415012 411500 408073
60749D08073k912k393k277k248j577k20R55J312J277J510J783J336R8j222k143
$$ 408073 405161 402768 400491 398243 396666 396446 397401 398713 399990 401500 403283 404619 404717 403495 401352
60734D01352k792l175k906j947r89n98m63J0O89R54P72Q42J519K177J981R54j67
$$ 401352 398560 395385 392479 390532 389543 388945 388482 388492 389181 390135 390907 391749 393268 395445 397426 398380 398213
60717C98213r69j739k780l752m063l667l145l064l502m142m579m527m057l618
$$ 398213 397244 395505 392725 388973 384910 381243 378098 375034 371532 367390 362811 358284 354227 350609
60703C50609l585l775l712l344l052k925k535j692q98o07n20j21M19N57L43L65
$$ 350609 347024 343249 339537 336193 333141 330216 327681 325989 325091 324484 323964 323843 324262 324819 325162 325527
60687C25527P48R46O69L71N17R46J351J871K674L329L243K590K233K592L134L153
$$ 325527 326275 327221 327890 328261 328778 329724 331075 332946 335620 338949 342192 344782 347015 349607 352741 355894
60671C55894K651K207K182K420K604K557K197J526P94M45O84J213J570J686J895
$$ 355894 358545 360752 362934 365354 367958 370515 372712 374238 375032 375477 376161 377374 378944 380630 382525
60656C82525K410L034L494L823M232M689M891M682M307M116M089L840L128K210
$$ 382525 384935 387969 391463 395286 399518 404207 409098 413780 418087 422203 426292 430132 433260 435470
60642D35470J493R48J30j192k696l947m884n605n991n922n613n310m773l671k469
$$ 435470 436963 437911 438041 436849 434153 430206 425322 419717 413726 407804 402191 396881 392108 388437 385968
60627C85968k167k941l652l218j925q82n41m18j19J20l8m96r08j039p81j11P43
$$ 385968 383801 380860 377208 373990 372065 371183 370642 370224 370105 370225 370187 369691 368783 367744 366963 366852 367595
60610C67595J262J073L37l43m49O8P82J160R09R6r10j514j151J82J655K242J780
$$ 367595 368857 369930 370267 369924 369475 369543 370325 371485 372394 372490 371580 370066 368915 369097 370752 372994 374774
60593C74774J085Q72R72Q83O30N87P42O71K58j33k06m2K50P82J575K253K290J563
$$ 374774 375859 376731 377703 378586 379216 379803 380545 381216 381474 381341 381135 381093 381343 382125 383700 385953 388243 389806
60575C89806O21L87J479L674O088P963R229J0304J1548J3005J4472J5625J6215
$$ 389806 390427 390814 392293 395967 402055 410018 419247 429551 441099 454104 468576 484201 500416
60562E00416J6273J5882J4739J2406R128N814K869l29m173p642r286r062q264
$$ 500416 516689 532571 547310 559716 568844 574658 577527 577198 573025 565383 556097 547035 538771
60549E38771p707o941n315k925k61K397M892P139R396J1997J4642J6597J7836
$$ 538771 531064 524123 518808 515883 515622 518019 522911 530050 539446 551443 566085 582682 600518
60536F00518J9137K0726K1567K0592J8000J4686J0939O483J459l407p438j0214
$$ 600518 619655 640381 661948 682540 700540 715226 726165 732648 734107 730700 723262 713048
60524G13048j1381j0921r567q361p671p082o205n160m242l503k823k094j301n16
$$ 713048 701667 690746 681179 672818 665147 658065 651860 646700 642458 638955 636132 634038 632737 632221
60510F32221J97J034K390M299O195P670R181J1477J4479J7486K0554K4820L0927
$$ 632221 632418 633452 635842 640141 646336 654006 663187 674664 689143 706629 727183 752003 782930
60497G82930L7820M3859M8809N3796N9228O3691O5478O4558O2110N8266N1434
$$ 782930 820750 864609 913418 967214 1026442 1090133 1155611 1220169 1282279 1340545 1391979
60486A391979M0188K5112Q149r165k6017m1325n3747o2823o9145p2997p3642p0621
$$ 1391979 1432167 1457279 1465428 1456263 1430246 1388921 1335174 1272351 1203206 1130209 1056567 985946
60474I85946o5065n8989n3490m8312m2910l7387l2345k8309k5328k2895k0323
$$ 985946 920881 861892 808402 760090 717180 679793 647448 619139 593811 570916 550593
60463E50593j7408j4546j2140j0173q666p955q072q221p580o332n276m665m154
$$ 550593 533185 518639 506499 496326 487660 479705 471633 463412 455832 449500 444224 439559 435405
60450D35405l698l564l495k799j564q32j144j723j697j409j669k264k239j455
$$ 435405 431707 428143 424648 421849 420285 419453 418309 416586 414889 413480 411811 409547 407308 405853
60436D05853q37q91r29k16Q27J259R86O84N61M5j050j916j835j263j173j603j724
$$ 405853 405016 404125 403196 402980 403807 405066 406052 406736 407297 407342 406292 404376 402541 401278 400105 398502 396778
60419C96778j243p85p24n41J68P96N82j50m13J23R02J434J659J487P94j6j70N11
$$ 396778 395535 394750 394026 393485 393653 394449 395031 394881 394468 394591 395493 396927 398586 400073 400867 400851 400681 401192
60401D01192J329J572J187N18p9k11L08R94J107Q04J077K213L085K676J608J257
$$ 401192 402521 404093 405280 405798 405719 405508 405816 406810 407917 408721 409798 412011 415096 417772 419380 420637
60385D20637J753J980J419Q93J220J982K173J531O64K11L23Q78J692K481K900
$$ 420637 422390 424370 425789 426682 427902 429884 432057 433588 434252 434463 434786 435664 437356 439837 442737
60370D42737K815K427K094K017K130K218K127J818J277N26k42o70n07J65J077
$$ 442737 445552 447979 450073 452090 454220 456438 458565 460383 461660 462186 461944 461274 460767 460932 462009
60355D62009K001K813L451L959M434M850N061N180N678O816Q095Q584P805O043
$$ 462009 464010 466823 470274 474233 478667 483517 488578 493758 499436 506252 514347 522931 530736 536779
60341E36779L943K069P57l6p75j908l349m655n640o355o514n633l911k384j793
$$ 536779 540722 542791 543548 543512 542737 540829 537480 532825 527185 520830 514316 508683 504772 502388 500595
60326E00595j830j824j651j403q45Q2O47J69p38q41p9L55m6k57P09K393L817M979
$$ 500595 498765 496941 495290 493887 493042 493124 493771 493940 493202 492361 492282 492637 492591 492334 493043 495436 499253 504232
60308E04232O528Q538J0635J2985J6081J9669K2866K5273K7109K8155K7554K4926
$$ 504232 510760 519298 529933 542918 558999 578668 601534 626807 653916 682071 709625 734551
60296G34551K0769J5418Q494l0q991j6932k3227k7723k9861k9158k6278k2747
$$ 734551 755320 770738 779232 779202 770211 753279 730052 702329 672468 643310 617032 594285
60284E94285j9605j6933j4577j2543j0668q638o564m958m004l359k813k535k514
$$ 594285 574680 557747 543170 530627 519959 511321 504757 499799 495795 492436 489623 487088 484574
60271D84574k434k373k925m146m984m443k881j504q88p53r18j493k120k018j093
$$ 484574 482140 479767 476842 472696 467712 463269 460388 458884 457996 457243 456325 454832 452712 450694 449601
60256D49601k44r1j42J75M12j49j069j163k51N66N69M27J004J939K167J470O74
$$ 449601 449357 449266 449124 449299 449711 449562 448493 447330 447079 447645 448214 448641 449645 451584 453751 455221 455895
60239D55895M47N43L84j24n01k12P96J961K478K091J325Q63P99Q12Q54J179J814
$$ 455895 456342 456885 457269 457145 456644 456432 457228 459189 461667 463758 465083 465946 466745 467557 468411 469590 471404
60222D71404K407K628K359J575M60l74l48L88J138J605K115K846L467L724L777
$$ 471404 473811 476439 478798 480373 480833 480459 480111 480499 481637 483242 485357 488203 491670 495394 499171
60207D99171L770L620L474L714M174M090L284K679K998L634L638L191L112L349
$$ 499171 502941 506561 510035 513749 517923 522013 525297 527976 530974 534608 538246 541437 544549 547898
60193E47898L083K244J716J945K261J956J136K21o86j480j836j724j733k301l134
$$ 547898 550981 553225 554941 556886 559147 561103 562239 562460 561774 560294 558458 556734 555001 552700 549566
60178E49566l700l994m346m758m863m400l444k313j444j117j125r51m89k72p00
$$ 549566 545866 541872 537526 532768 527905 523505 520061 517748 516304 515187 514062 513111 512622 512350 511650
60163E11650j381j609j257p79n01l56k95n15j075j533j176K13J948K950K847K412
$$ 511650 510269 508660 507403 506624 506123 505767 505472 504957 503882 502349 501173 501386 503334 506284 509131 511543
60147E11543K659L620M477M808N052N538N769N255M511M521N400O341O804P029
$$ 511543 514202 517822 522299 527107 532159 537697 543466 548721 553232 557753 563153 569494 576298 583327
60133E83327P243P070O121M669L287K090Q09o05j903k957l828m300l876k429o22
$$ 583327 590570 597640 603761 608430 611717 613807 614616 614011 612108 609151 605323 601023 597147 594718 594096
60118E94096N71P05P8o20p16Q5J385K260K187J646J435J509J109M2r82j512k028
$$ 594096 594667 595372 595450 594830 594114 594199 595584 597844 600031 601677 603112 604621 605730 605772 604790 603278 601250
60101F01250k992l888m036l766l875m252m061l181k379j944j206K17J606K175
$$ 601250 598258 594370 590334 586568 582693 578441 574380 571199 568820 566876 565670 565887 567493 569668
60087E69668K241K676L600M357M449M041L569L316L234K989K227J053o8r69j924
$$ 569668 571909 574585 578185 582542 586991 591032 594601 597917 601151 604140 606367 607420 607352 606383 604459
60072F04459k967l564l421l224l892n377o713p171o918o524o366o475o645o570
$$ 604459 601492 597928 594507 591283 587391 582014 575301 568130 561212 554688 548322 541847 535202 528632
60058E28632o141n590n195m948m661m308l952l546l039k569k256j903j208j55
$$ 528632 522491 516901 511706 506758 502097 497789 493837 490291 487252 484683 482427 480524 479316 479161
60044D79161R80J857K163J736R52O89J426K530K895K317J713J940K711K952K041
$$ 479161 480141 481998 484161 485897 486849 487538 488964 491494 494389 496706 498419 500359 503070 506022 508063
60029E08063N79k10Q5L57q50l436n568n826m843m311m813n545n827n861n927n774
$$ 508063 508642 508432 508517 508874 508024 504588 499020 493194 488351 484040 479227 473682 467855 461994 456067 450293
60013D50293n164m344l589k841k087j610j523j482j133n90j59Pj80p75j471j625
$$ 450293 445129 440785 437196 434355 432268 430658 429135 427653 426520 425930 425771 425778 425598 424823 423352 421727
59997D21727j008j89J32q2l25j93M28J482K645L345L233K578J938J632J739K244
$$ 421727 420719 420530 420662 420580 420255 420062 420490 421972 424617 427962 431195 433773 435711 437343 439082 441326
59981D41326K897L141K690J934J397J045N66J27J65N61O97M56M15Q59J216R08
$$ 441326 444223 447364 450054 451988 453385 454430 454996 455123 455288 455849 456546 457002 457417 458276 459492 460400
59965D60400J97k55k86j04L85J449K834L797L916L446K778K027J247O14K48J28
$$ 460400 460597 460342 460056 459952 460337 461786 464620 468417 472333 475779 478557 480584 481831 482445 482693 482821
59949D82821K67O10P03J4j171j748j111l5K81l44j134j555j763k044k544l445
$$ 482821 483088 483698 484401 484415 483244 481496 480385 480350 480631 480287 479153 477598 475835 473791 471247 467802
59933D67802m673n383m568k393k75O84P19N81M81L55M63J006J557J558J184J074
$$ 467802 463129 457746 453178 450785 450510 451194 451913 452494 452975 453330 453793 454799 456356 457914 459098 460172
59917D60172J414J933K586L591M738N362N181M683M510M778N163N367N337N194
$$ 460172 461586 463519 466105 469696 474434 479796 484977 489660 494170 498948 504111 509478 514815 520009
59903E20009N031M711L955K752J511O53J00n50j534k690l548l524k398q57j05
$$ 520009 525040 529751 533706 536458 537969 538622 538722 538172 536638 533948 530400 526876 524478 523621 523516
59888E23516m76q70q6J594K865L125K979L110L536M037M514M714M291L446K963
$$ 523516 523040 522170 522084 523678 526543 529668 532647 535757 539293 543330 547844 552558 556849 560295 563258
59873E63258L216L614L372K343Q49q89k688m084m593m198l358k525j838j246p69
$$ 563258 566474 570088 573460 575803 576652 575763 573075 568991 564398 560200 556842 554317 552479 551233 550464
59858E50464n88p69r80p48o9N05P25J103K226L920N679P497R609J1656J2933J3222
$$ 550464 549876 549107 548127 547379 547310 547815 548540 549643 551869 555789 561468 568965 578574 590230 603163 616385
59842F16385J2578J0577O905K615m46j631j871j824j122J28N52p76k946m598n851
$$ 616385 628963 639540 646445 649060 648614 646983 645112 643288 642166 642294 642846 642070 639124 634526 628675
59827F28675p558r452j0443j0347r988r734r137q084p174o700o222n420m593m047
$$ 628675 621117 611665 601222 590875 580887 571153 562016 553932 546758 540058 533836 528416 523823 519776
59813E19776l582k936k224j695j386j168q97m60N8L32K46J32K29J63m95j446k094
$$ 519776 516194 513258 511034 509339 507953 506785 505888 505428 505486 505818 506064 506196 506425 506588 506093 504647 502553
59796E02553k534l331m354m772m291l646l547l768l659l022k158j471j268j588
$$ 502553 500019 496688 492334 487562 483271 479625 476078 472310 468651 465629 463471 462000 460732 459144
59782D59144j991j940j478j212j403j659j675j701j913j851j044J47Q66P77L10
$$ 459144 457153 455213 453735 452523 451120 449461 447786 446085 444172 442321 441277 441424 442290 443067 443377
59767D43377Kl4n3l22q15j096p01K96J275J824K171K585K800K463J996K263L391
$$ 443377 443379 443345 443292 442970 442155 441059 440358 440654 441929 443753 445924 448509 451309 453772 455768 458031 461422
59750D61422M419M440L655K964K838K947K785K231J495R05Q46J526K555L101K769
$$ 461422 465841 470281 473936 476900 479738 482685 485470 487701 489196 490101 490947 492473 495028 498129 500898
59735E00898K160K068K366K199J240J71k79j97r4r0jJ36K9l98q69j021o49R5O47
$$ 500898 503058 505126 507492 509691 510931 511102 510823 510626 510532 510442 510441 510577 510606 510208 509339 508318 507669 507764 508411
59716E08411M45l88j116j279j107q77m39J73L84j15o67m99J76O40Q05J044J270
$$ 508411 508856 508468 507352 506073 504966 504089 503650 503823 504207 504092 503425 502926 503102 503742 504547 505591 506861
59699E06861J161J026J391J918J827J315J333J905K032J483J305J941K241J165
$$ 506861 508022 509048 510439 512357 514184 515499 516832 518737 520769 522252 523557 525498 527739 528904
59685E28904n63j490j304o88q4M15N11R3k74j77k83j415l062l881l541l015l070
$$ 528904 528341 526851 525547 524859 524775 525190 525701 525794 525520 525343 525060 523645 520583 516702 513161 510146 507076
59668E07076l454l746m048m429m395l502k155j379j792k885l319k200j39J365
$$ 507076 503622 499876 495828 491399 487004 483502 481347 479968 478176 475291 471972 469772 469633 470998
59654D70998J754K030L087M199M102K980K195K277K425K037J479J041L40p46j580
$$ 470998 472752 474782 477869 482068 486170 489150 491345 493622 496047 498084 499563 500604 500944 500198 498618
59639D98618j787j918k442k798k315j390r41j126j364j293r79m56K00O02N64O37
$$ 498618 496831 494913 492471 489673 487358 485968 485027 483901 482537 481244 480265 479809 480009 480611 481175 481812
59623D81812J366K150J757Pj778k292j508l61K01l56j914l485l847k888j854j762
$$ 481812 483178 485328 487085 487092 485314 483022 481514 481153 481354 480998 479084 475599 471752 468864 467010 465248
59607D65248k043j396L59K040K585K047J091J80m81p76p88p42o52l77j53n20j363
$$ 465248 463205 461809 462168 464208 466793 468840 469931 470111 469630 468854 468066 467324 466672 466295 466142 465622 464259
59590D64259j613n81Q55J200L09n35m99j95m18r19j041q94j010j353j550j815
$$ 464259 462646 462065 462920 464120 464429 463894 463395 463200 462782 461863 460822 459928 458918 457565 456015 454200
59574D54200k591l406l169j830o66n45p58l13M62N34j10l99K18J020J021J05j037
$$ 454200 451609 448203 445034 443204 442538 441993 441235 440922 441384 441918 441808 441409 441627 442647 443668 443773 442736
59557D42736j609j168J26J478K067J900J714J957K303K385K503L161M322N511
$$ 442736 441127 439959 440085 441563 443630 445530 447244 449201 451504 453889 456392 459553 463875 469386
59543D69386O395O864O869O712P208Q958J1559J4090J6122J7536J7443J4416Q249
$$ 469386 475781 482645 489514 496226 503434 512392 523951 538041 554163 571699 589142 603558 611807
59530F11807Q12n444r295j0694r789p006l724j579q40k46J164K800L472L077K595
$$ 611807 612619 607175 597880 587186 577397 570391 566667 565088 564248 564002 565166 567966 571438 574515 577110
59515E77110K662K783K074L87j535k943l868m942o511q116r024r058q672q283
$$ 577110 579772 582555 584629 585016 583481 580538 576670 571728 565217 557101 548077 539019 530347 522064
59501E22064p866p249o485n814n435n346n273m772l718k633k140k054j498j53
$$ 522064 514198 506949 500464 494650 489215 483869 478596 473824 470106 467473 465333 463279 461781 461628
59487D61628J098J196K21p15o92K40J324J815J566J219J637K949M328M954M865
$$ 461628 462726 463922 464143 463428 462736 462976 464300 466115 467681 468900 470537 473486 477814 482768 487633
59472D87633M557M172L595L050K854K767K290J572J301J607J865J776J898K703
$$ 487633 492190 496362 499957 503007 505861 508628 510918 512490 513791 515398 517263 519039 520937 523640
59458E23640L755M388M700N283O216P003P393P705Q274Q980R426R371Q902Q307
$$ 523640 527395 531783 536483 541766 547982 554985 562378 570083 578357 587337 596763 606134 615036 623343
59444F23343P787P134N748L173m04m218p434r519j0350j0220r670r094q470p560
$$ 623343 631130 638264 644012 647185 646781 642563 635129 625610 615260 605040 595370 586276 577806 570246
59430E70246o333n089m183l681l234k288o34J294K887M189N901Q386J1075J3210
$$ 570246 563913 558824 554641 550960 547726 545438 544804 546098 548985 553174 559075 567461 578536 591746
59416E91746J4864J6754J9207K1845K4296K6580K8448K8736K5827J9002R269j060
$$ 591746 606610 623364 642571 664416 688712 715292 743740 772476 798303 817305 826574 825514
59404H25514r655j5230j7684j7467j5046j0896n738o42K939L325n62p998j6339
$$ 825514 815859 800629 782945 765478 750432 739536 733798 733156 736095 739420 738858 730860 714521
59391G14521k2705k5958k6813k6308k4761k2143j8739j5047j1465q362o130m806
$$ 714521 691816 665858 639045 612737 587976 565833 547094 532047 520582 512220 506090 501284
59379E01284l888k877j780q50q6O39J205J420J464J775K456L157L611L904M130
$$ 501284 497396 494519 492739 491889 491803 492442 493647 495067 496531 498306 500762 503919 507530 511434 515564
59364E15564M147L893L743M176N129N938N990N368M777M919N968P518Q949R868
$$ 515564 519711 523604 527347 531523 536652 542590 548580 553948 558725 563644 569612 577130 586079 595947
59350E95947J0353J0845J1721J2943J4140J5049J5732J6341J6829J7053J7002
$$ 595947 606300 617145 628866 641809 655949 670998 686730 703071 719900 736953 753955
59339G53955J6701J5976J4615J2702J0521Q117N256J923j411m202o350q146r902
$$ 753955 770656 786632 801247 813949 824470 832587 837843 839766 838355 834153 827803 819657 809755
59326H09755j1719j3479j4931j5851j6252j6274j5908j5025j3752j2460j1287
$$ 809755 798036 784557 769626 753775 737523 721249 705341 690316 676564 664104 652817
59315F52817r964q338o787n773n295m985m558l854k696j111N25J918L290M968
$$ 652817 642853 634515 627728 621955 616660 611675 607117 603263 600567 599456 599981 601899 605189 610157
59301F10157O764Q308R795J1820J4406J6839J8561J9513J9292J6703J0894K731
$$ 610157 616921 625229 635024 646844 661250 678089 696650 716163 735455 752158 763052 765783
59289G65783n555j2085j6363j8740j9479j8620j6473j3755j1154q880o817m941
$$ 765783 760228 748143 731780 713040 693561 674941 658468 644713 633559 624679 617862 612921
59277F12921l391k093p01R10K361L324M146N459P215Q596R075R102R466J0248
$$ 612921 609530 607437 606736 607646 610007 613331 617477 622936 630151 638747 647822 656924 666390 676638
59263F76638J0651R798P509M450J609m86k126l928o065q112r622j0526j0965j1068
$$ 676638 687289 697087 704596 709046 710655 710169 708043 704115 698050 689938 680316 669790 658825 647757
59249F47757j0961j0620r735q071o144m966m895n108m588l250j716l43R86K291
$$ 647757 636796 626176 616441 608370 602226 597260 592365 587257 582669 579419 577703 577360 578346 580637
59235E80637L293L788L869L733L524L354L275L207L051K820K472J824P34o88k293
$$ 580637 583930 587718 591587 595320 598844 602198 605473 608680 611731 614551 617023 618847 619581 618893 616600
59220F16600m027n700o875p300p247p160p067o748o142n300m125k623j303p40
$$ 616600 612573 606873 599998 592698 585451 578291 571224 564476 558334 553034 548909 546286 544983 544243
59206E44243q27r08o95m88m40j50O80J621K000J741J388J353J484J472J333J334
$$ 544243 543416 542508 541813 541325 540885 540735 541415 543036 545036 546777 548165 549518 551002 552474 553807 555141
59190E55141J481J495J369J613K594L764M148L567K867K739K953L015K923K752
$$ 555141 556622 558117 559486 561099 563693 567457 571605 575172 578039 580778 583731 586746 589669 592421
59176E92421K160J090M43J137K670L644L615L456L794M130L958L802M454N749
$$ 592421 594581 595671 596114 597251 599921 603565 607180 610636 614430 618560 622518 626320 630774 636523
59162F36523O871P510Q031Q566Q627P756O199M611L227J628n48k892m609n562
$$ 636523 643394 650904 658935 667501 676128 683884 690083 694694 697921 699549 699001 696109 691500 685938
59148F85938o452p712q808r039q519p783o905n789m928m869n078m578l630l554
$$ 685938 679486 671774 662966 653927 645408 637625 630720 624931 620003 615134 610056 605478 601848 598294
59134E98294m547n072m043k425j728j833j521m91L68M78K39K20N73J308K399L556
$$ 598294 593747 588675 584632 582207 580479 578646 577125 576634 577002 577480 577719 577939 578512 579820 582219 585775
59118E85775M440N202O255P508Q382Q674Q832R254R816J0131R926R061P656O328
$$ 585775 590215 595417 601672 609180 617562 626236 635068 644322 654138 664269 674195 683256 690912 697240
59104F97240N836O161O374N671M283L046K303J646P12j96n84n66q81j933l222
$$ 697240 703076 709237 715611 721282 725565 728611 730914 732560 733272 733076 732492 731926 731045 729112 725890
59089G25890l922l788l224k626k169k059k467l134l588l912m726o196p627q382
$$ 725890 721968 718180 714956 712330 710161 708102 705635 702501 698913 695001 690275 684079 676452 668070
59075F68070q681r004r261r100q611q114p518o548n456m795m549m121l242k319
$$ 668070 659389 650385 641124 632024 623413 615299 607781 601233 595777 590982 586433 582312 579070 576751
59061E76751j818j728j832k050k322k473k415k217j908j356n38K05L25m28j616
$$ 576751 574933 573205 571373 569323 567001 564528 562113 559896 557988 556632 556094 556299 556624 556196 554580
59046E54580k320j907o91L58N90K14j77k49o0J20l5n99j096q88J2R51J561K129
$$ 554580 552260 550353 549662 550020 550610 550824 550647 550398 550338 550458 550423 549824 548728 547840 547852 548803 550364 552493
59028E52493K810L233L329L813N208O889P882Q133Q302Q740R449J0580J2060J3013
$$ 552493 555303 558536 561865 565678 570886 577775 585657 593790 602092 610832 620281 630861 642921 655934
59014F55934J2486J0672Q540O473M227J995M16n23j469k418k499j391Q4J169K123
$$ 655934 668420 679092 687632 694105 698332 700327 700743 700220 698751 696333 693834 692443 692527 693696 695819
58999F95819L426M825N712N871N361M251K983K315K390K345J448J19p02q30q80
$$ 695819 699245 704070 709782 715653 721014 725265 728248 730563 732953 735298 736746 736865 736163 735333 734453
58984G34453j359k273l437m646n614o119o154n772n001m069l344k763j692K68
$$ 734453 733094 730821 727384 722738 717124 711005 704851 699079 694078 690009 686665 683902 682210 682478
58970F82478K652M671O076P093P822Q212Q446Q895R603J0261J0596J0570J0255
$$ 682478 685130 689801 695877 702970 710792 719004 727450 736345 745948 756209 766805 777375 787630
58957G87630R700Q877P575N474K577o22l633o463r321j1962j3707j4177j3726
$$ 787630 797330 806207 813782 819256 821833 821211 817578 811115 801794 789832 776125 761948 748222
58944G48222j2983j2241j1407j0454r634r125q680p880o764n867n512n374m959
$$ 748222 735239 722998 711591 701137 691503 682378 673698 665818 659054 653187 647675 642301 637342
58931F37342m270l652l238k907k677k619k571k299j938j857k116k464k719k741
$$ 637342 633072 629420 626182 623275 620598 617979 615408 613109 611171 609314 607198 604734 602015 599274
58917E99274k229j127q5J45k00j89M55J059J249J555K442L501M167M669N647P279
$$ 599274 597045 595918 595833 595978 595778 595589 596044 597103 598352 599907 602349 605850 610017 614686 620333 627612
58901F27612R211J1050J2439J3031J2801J2145J1432J0758J0296J0391J1048J1878
$$ 627612 636823 647873 660312 673343 686144 698289 709721 720479 730775 741166 752214 764092
58889G64092J2852J4556J7171J9846K1594K2402K2787K2758K1965K0549J8968
$$ 764092 776944 791500 808671 828517 850111 872513 895300 918058 940023 960572 979540
58878I79540J7063J4107R925N302J082k694o489j0435j4122j7069j9123k0353
$$ 979540 996603 1010710 1020635 1025937 1027019 1024325 1017836 1007401 993279 976210 957087 936734
58866I36734k0678j9864j7992j5714j3797j2515j1720j1328j1311j1409j1404
$$ 936734 916056 896192 878200 862486 848689 836174 824454 813126 801815 790406 779002
58855G79002j1574j2273j3161j3509j3292j3140j3144j2669j1525j0327r328p958
$$ 779002 767428 755155 741994 728485 715193 702053 688909 676240 664715 654388 645060 637102
58843F37102o180n136n548o335o004m700l761l762m165m616n258n866n827n105
$$ 637102 630922 625786 620238 613903 607899 603199 599438 595676 591511 586895 581637 575771 569944 564839
58829E64839m283l577k724j954j982k732l018k062o02J88L54R67K458L875M057
$$ 564839 560556 556979 554255 552301 550319 547587 544569 542507 541905 542093 542447 543414 545872 549747 553804
58814E53804L120K386K792L769M018L170K171J931K184K030J137o6j049j654j995
$$ 553804 556924 559310 562102 565871 569889 573059 575230 577161 579345 581375 582512 582446 581397 579743 577748
58799E77748k258k479k351j652r04j048k128k961k696k037k223l241l873l286
$$ 577748 575490 573011 570660 569008 568104 567056 564928 561967 559271 557234 555011 551770 547897 544611
58785E44611j729J27J755K728K865K612K742L532M601N453N854N677M845L425
$$ 544611 542882 543009 544764 547492 550357 552969 555711 559243 563844 569297 575151 580828 585673 589098
58771E89098J679J4j097j543j917k830l845l891k963k398k855l247k595j842k446
$$ 589098 590777 590791 589694 588151 586234 583404 579559 575668 572705 570307 567452 564205 561610 559768 557322
58756E57322l963m582l631k078p08O68K160L397M321N214N773N341M168L341L285
$$ 557322 553359 548777 545146 543068 542360 543028 545188 548585 552906 558120 563893 569234 573402 576743 580028
58741E80028L477L723M468N612O307O347O562P364Q038P979P608P475P442P333
$$ 580028 583505 587228 591696 597308 603615 609962 616524 623888 631926 639905 647513 654988 662430 669763
58727F69763P447P793P715O892N961N491N174M622M208M444N180O046P040Q131
$$ 669763 677210 685003 692718 699610 705571 711062 716236 720858 725066 729510 734690 740736 747776 755907
58713G55907Q919R242R476R685R202P664N779M292K865P23k138n102p818j0265
$$ 755907 764826 774068 783544 793229 802431 810095 815874 820166 823031 823754 821616 816514 808696 798431
58699G98431j2336j4076j5885j7894j9542k0282k0287j9943j9152j7735j5989
$$ 798431 786095 772019 756134 738240 718698 698416 678129 658186 639034 621299 605310
58688F05310j4227j2300j0200q599q010p921p475o578n572m417l065k136k167
$$ 605310 591083 578783 568583 559984 551974 544053 536578 530000 524428 520011 516946 514810 512643
58675E12643k501k018p79J18K78N26J571L118M556N671O412O715O884P523Q715
$$ 512643 510142 508124 507345 507463 507741 508267 509838 512956 517512 523183 529595 536310 543194 550717 559432
58660E59432R736R887R121P616N286K181r84l261m355m763n073n371n380m989
$$ 559432 569168 579055 588176 595792 601078 603259 602275 599014 594659 589896 584823 579452 574072 569083
58646E69083m506m340m503m541l976k744j207J02P51O74K68O8K50O46J184J927
$$ 569083 564577 560237 555734 551193 547217 544473 543266 543368 544119 544793 545061 545129 545379 546025 547209 549136
58630E49136K652K857K454J981J875J885J553R43M34J17j11m5O98K040L353M126
$$ 549136 551788 554645 557099 559080 560955 562840 564393 565336 565770 565887 565776 565731 566429 568469 571822 575948
58614E75948M476M915N791O988Q040Q546Q416P689O306M288K065K41j021k043
$$ 575948 580424 585339 591130 598118 606158 614704 623120 630809 637115 641403 643468 643709 642688 640645
58600F40645k989l646l910m041m192m108l626l088k890k905k643j844o26P50K060
$$ 640645 637656 634010 630100 626059 621867 617759 614133 611045 608155 605250 602607 600763 600137 600887 602947
58585F02947L261M535N986P327Q138Q485Q826R208R134Q394P494O943O582O028
$$ 602947 606208 610743 616729 624056 632194 640679 649505 658713 667847 676241 683735 690678 697260 703288
58571G03288N450N432O261P593Q812R574J0175J1322J3328J5647J7539J8941K0178
$$ 703288 708738 714170 720431 728024 736836 746410 756585 767907 781235 796882 814421 833362 853540
58558H53540K1085K1227K0751K0151J9180J7068J3893J0602P487L896j34l315
$$ 853540 874625 895852 916603 936754 955934 973002 986895 997497 1004984 1008880 1008746 1005431
58546A005431m934o002p662r423j0164r994r981j0498j1066j1459j2034j3123
$$ 1005431 1000497 994495 986833 977410 967246 957252 947271 936773 925707 914248 902214 889091
58534H89091j4799j6866j8555j8784j7391j5541j4123j2521r900o889m752l495
$$ 889091 874292 857426 838871 820087 802696 787155 773032 760511 750611 743722 738970 735475
58522G35475k114l68J060K029L079M098M164L072J916J697K154K357J816O65n95
$$ 735475 733361 732993 734053 736082 739161 743259 747423 750495 752411 754108 756262 758619 760435 761100 760505
58507G60505j368j382j092j249k050l093l994m657m998n000m890m820m522l752
$$ 760505 759137 757755 756663 755414 753364 750271 746277 741620 736622 731622 726732 721912 717390 713638
58493G13638k864k413k383k394k358k336j965q45O51J672K010K313L252M930O974
$$ 713638 710774 708361 705978 703584 701226 698890 696925 696080 696731 698403 700413 702726 705978 710908 717882
58478G17882Q736R589R595R605J0243J1086J1382J1021J0164Q481N683K432l08
$$ 717882 726618 736207 745802 755407 765650 776736 788118 799139 809303 817784 823467 825899 825591
58465H25591k443m321n614n740n217n268n985o095m754k552m77J127K339L271
$$ 825591 823148 818827 813213 807473 802256 796988 791003 784908 780154 777602 777125 778252 780591 783862
58451G83862M298N843P558Q342P500N443L055R51n99j600k389l342m389n085n098
$$ 783862 788160 794003 801561 809903 817403 822846 825901 826852 826253 824653 822264 818922 814533 809448 804350
58436H04350m341k897j267k39M0M78J815L508M557M958N332N625N433N246O062
$$ 804350 800009 797112 795845 795606 795646 796124 797939 801447 806004 810962 816294 821919 827352 832598 838660
58421H38660P774R233R869J0091R985Q956O903M572K436K53j944l519m204m530
$$ 838660 846434 855667 865536 875627 885612 894568 901471 906043 908479 908732 906788 903269 899065 894535
58407H94535m892n163n393n974o745o933o362n801n665n303m066k306p73L67J359
$$ 894535 889643 884480 879087 873113 866368 859435 853073 847272 841607 836304 832238 829932 829159 829526 830885
58392H30885K238K843L093L026K823K782K882K578J597O86P85J705K470K866L590
$$ 830885 833123 835966 839059 842085 844908 847690 850572 853150 854747 855433 856218 857923 860393 863259 866849
58377H66849M883O138O943P556Q116Q307Q025P650P410P316P631Q593R700J0149
$$ 866849 871732 877870 884813 892369 900485 908792 916817 924467 931877 939193 946824 955417 965117 975266
58363I75266R995R940J0122J0154J0224J0945J2057J2535J2066J1241J0248Q675
$$ 975266 985261 995201 1005323 1015477 1025701 1036646 1048703 1061238 1073304 1084545 1094793 1103468
58351A103468O787N569N198M772L910L382L707M361M779N129N676O417P598R469
$$ 1103468 1110255 1115824 1121022 1125794 1129704 1133086 1136793 1141154 1145933 1151062 1156738 1163155 1170753 1180222
58337A180222J1362J2227J2302J2912J4345J5413J5496J5476J6040J6485J6045
$$ 1180222 1191584 1203811 1216113 1229025 1243370 1258783 1274279 1289755 1305795 1322280 1338325
58326A338325J5182J4660J4380J3867J3045J1888J0157Q108O601O100O254O704
$$ 1338325 1353507 1368167 1382547 1396414 1409459 1421347 1431504 1439612 1446213 1452313 1458567 1465271
58314A465271P431Q221Q780R484J0878J2419J3024J2896J3375J4875J6354J7106
$$ 1465271 1472702 1480923 1489703 1499187 1510065 1522484 1535508 1548404 1561779 1576654 1593008 1610114
58302A610114J7526J7895J7975J8035J8779J9944K0493K0421K0690K1300K1256
$$ 1610114 1627640 1645535 1663510 1681545 1700324 1720268 1740761 1761182 1781872 1803172 1824428
58291A824428K0682K0978K2448K3779K4370K5177K6674K8029K8952L0388L2584
$$ 1824428 1845110 1866088 1888536 1912315 1936685 1961862 1988536 2016565 2045517 2075905 2108489
58280B108489L4400L5229L5786L6466L6853L7243L8590M0479M1479M1904M3610
$$ 2108489 2142889 2178118 2213904 2250370 2287223 2324466 2363056 2403535 2445014 2486918 2530528
58269B530528M6603M8636M8960M9600N1920N4832N7501O0818O4885O8060O9962
$$ 2530528 2577131 2625767 2674727 2724327 2776247 2831079 2888580 2949398 3014283 3082343 3152305
58258C152305P2442P6152P9128Q0415Q1908Q4769Q7238Q8028Q8817R1176R4053
$$ 3152305 3224747 3300899 3380027 3460442 3542350 3627119 3714357 3802385 3891202 3982378 4076431
58247D076431R6517R9977J05330J10935J15804J21774J30143J39143J47260J55811
$$ 4076431 4172948 4272925 4378255 4489190 4604994 4726768 4856911 4996054 5143314 5299125
58237E299125J65811J75611J84355J94381K07239K20829K33444K47119K63687
$$ 5299125 5464936 5640547 5824902 6019283 6226522 6447351 6680795 6927914 7191601
58228G191601K81204K97877L15912L37797L62291L87858M16497M50215M87332
$$ 7191601 7472805 7770682 8086594 8424391 8786682 9174540 9591037 10041252 10528584
58219A0528584N26217N69114O18446O73352P33811Q03701Q85560R77271J078641
$$ 10528584 11054801 11623915 12242361 12915713 13649524 14453225 15338785 16316056 17394697
58210A7394697J196061J335661J497756J684085J904821K172248K494089K880734
$$ 17394697 18590758 19926419 21424175 23108260 25013081 27185329 29679418 32560152
58202C2560152L353343L937392M654682N529036O591106P866171R361870J1075015
$$ 32560152 35913495 39850887 44505569 50034605 56625711 64491882 73853752 84928767
58194H4928767J3002024J5137919J7484702K0076352K2970590K6170315K9521175
$$ 84928767 97930791 113068710 130553412 150629764 173600354 199770669 229291844
58187B29291844L2641631L4866343L5212286L2535156K6029075J5868840L472977
$$ 229291844 261933475 296799818 332012104 364547260 390576335 406445175 409918152
58180D09918152q943893j9282204k6333962l0015823l1075803l0547333k9254596
$$ 409918152 400974259 381692055 355358093 325342270 294266467 263719134 234464538
58173B34464538k7591827k5625804k3351119k0852246j8287229j5803983j3505627
$$ 234464538 206872711 181246907 157895788 137043542 118756313 102952330 89446703
58166H9446703j1458535r692650q198552o945749n904733n047017m337835l744330
$$ 89446703 77988168 68295518 60096966 53151217 47246484 42199467 37861632 34117302
58158C4117302l246292k830016k478330k175682j916585j699540j517199j360095
$$ 34117302 30871010 28040994 25562664 23386982 21470397 19770857 18253658 16893563
58150A6893563j224905j111095j013497r25458q45684p75296p11457o50155n92107
$$ 16893563 15668658 14557563 13544066 12618608 11772924 10997628 10286171 9636016 9043909
58141I043909n40042m92848m47811m05723l68756l36010l06140k81478k64572
$$ 9043909 8503867 8011019 7563208 7157485 6788729 6452719 6146579 5865101 5600529
58132E600529k52949k41972k30584k19858k08578j94981j80770j68723j58102
$$ 5600529 5347580 5105608 4875024 4655166 4446588 4251607 4070837 3902114 3744012
58123C744012j46646j35237j26314j19316j11899j04311r8512r4143q9150q3437
$$ 3744012 3597366 3462129 3335815 3216499 3104600 3000289 2901777 2807634 2718484 2635047
58113B635047p8444p4196o9896o6273o4205o2395n9416n6651n6107n6726n6125
$$ 2635047 2556603 2482407 2412511 2346238 2282033 2219638 2160222 2103571 2047464 1990738 1934613
58102A934613n4496n3540n2833n0760m7870m5976m4776m2658l9918l8015l6449
$$ 1934613 1880117 1826577 1773744 1722984 1675114 1629138 1584362 1541704 1501786 1463771 1427322
58091A427322l3674l0297k8185k7001k4871k1904j9971j9387j8921j8637j9616
$$ 1427322 1393648 1363351 1335166 1308165 1283294 1261390 1241419 1222032 1203111 1184474 1164858
58080A164858k1159k1442k0746k0973k2063k2002k0512j9578j9928j9985j8996
$$ 1164858 1143699 1122257 1101511 1080538 1058475 1036473 1015961 996383 976455 956470 937474
58069I37474j8329j8806j9284j8809j7973j7227j5911j3869j2181j1326j0340
$$ 937474 919145 900339 881055 862246 844273 827046 811135 797266 785085 773759 763419
58058G63419q675p389p520q526r237r347r325r536r972j0258r835q712p746p494
$$ 763419 754744 747355 739835 731309 722072 712725 703400 693864 683892 673634 663799 655087 647341 639847
58044F39847p277o337n221m896n086m953m767n326o164o082n172m654m913n322
$$ 639847 632570 626233 621012 616116 611030 606077 601310 595984 589820 583738 578566 573912 568999 563677
58030E63677n797o857q212q943r102r463r897r576q750q486q693q241p132o726
$$ 563677 557880 551023 542811 533868 524766 515303 505406 495830 487080 478594 469901 461660 454528 447802
58016D47802p416p933p379o310n354m356l422l215l652l720l155k945l587m172
$$ 447802 440386 432453 425074 418764 413410 409054 405632 402417 398765 395045 391890 388945 385358 381186
58002C81186l908l216k701k179j498j183j497j819j620j207r45n31L84J628K999
$$ 381186 377278 374062 371361 369182 367684 366501 365004 363185 361565 360358 359413 358882 359266 360894 363893
57987C63893M548N894O146N027L371K113J334O42j98j228k281k783k273j288r51
$$ 363893 368441 374335 380481 385508 388879 390992 392326 392968 392770 391542 389261 386478 384205 382917 381966
57972C81966j519k128k168j992j983j764q60M11J187Q81l53j594j746n92Q40J499
$$ 381966 380447 378319 376151 374159 372176 370412 369552 369963 371150 372031 371678 370084 368338 367746 368586 370085
57956C70085J522J603J696J294N51j2n73j540k285j783l74O04R23J597K823L487
$$ 370085 371607 373210 374906 376200 376751 376739 376166 374626 372341 370558 370184 370788 371711 373308 376131 379618
57940C79618L174L000L793M911N730O821Q685J0503J1213J0965J0469R761Q456
$$ 379618 382792 385792 389585 394496 400226 407047 415732 426235 437448 448413 458882 468643 477099
57927D77099O601M457K058l15j934k610l225m605o387p717q460r057r665j0104
$$ 477099 483700 488157 490215 489900 487966 485356 482131 477526 471139 463422 454962 445905 436240 426136
57913D26136j0295j0232r834r207q568p716o266m638l909m263m494l667k382j646
$$ 426136 415841 405609 395775 386568 378000 370284 364018 359380 355471 351208 346714 343047 340665 339019
57899C39019j377r43m90o46j316j743j566j010k38P38J642K108K179K169K158
$$ 339019 337642 336699 336209 335563 334247 332504 330938 329928 329690 330428 332070 334178 336357 338526 340684
57884C40684K037J851J687J373P61M8m80q30j161j494j906k641l776n055o282
$$ 340684 342721 344572 346259 347632 348393 348441 347961 347131 345970 344476 342570 339929 336153 331098 324816
57869C24816p467q403q548p775o689n789m825l493k253j762j791j450l65R49J851
$$ 324816 317349 308946 300398 292623 285934 280145 275320 271827 269574 267812 266021 264571 264206 265155 267006
57854B67006K203K228K225K517L330M525N572N957N610N000M642M456L778K190
$$ 267006 269209 271437 273662 276179 279509 284034 289606 295563 301173 306173 310815 315271 319049 321239
57840C21239J82j349k035k136j880j382j013j239j961k579k768k656k263j487
$$ 321239 321421 320072 318037 315901 314021 312639 311626 310387 308426 305847 303079 300423 298160 296673
57826B96673o14j32J30Q48K078L032L254L190L281L309L075K922L176L668M209
$$ 296673 296059 295927 296057 296905 298983 302015 305269 308459 311740 315049 318124 321046 324222 327890 332099
57811C32099M750M716L137N6l020m833n822p066q517r262q983q185p268o317n629
$$ 332099 336849 341565 344702 344758 341738 336905 331083 324017 315500 306238 297255 289070 281802 275485 269856
57796B69856n547n753n417m200k641j522j193j415j588j263o36l21m98o74m37
$$ 269856 264309 258556 253139 248939 246298 244776 243583 242168 240580 239317 238681 238360 237862 237188 236751
57781B36751J03Q35J964L406M529N015N410O235P179P753Q114Q494Q420P477O306
$$ 236751 236854 237689 239653 243059 247588 252603 258013 264248 271427 279180 287294 295788 304208 311685 317991
57766C17991N816N655M592K324j15j831k964l965m808n313n577n685n412m640
$$ 317991 323807 329462 334054 336378 336263 334432 331468 327503 322695 317382 311805 306120 300708 296068
57752B96068l778l423l699m091l981l336k795k913l391l422k850k463k866l607
$$ 296068 292290 288867 285168 281077 277096 273760 270965 268052 264661 261239 258389 255926 253060 249453
57738B49453l805l251k421j804j621j796j828j148L1P53O93P68J673K572K219
$$ 249453 245648 242397 239976 238172 236551 234755 232927 231779 231810 232563 233256 234024 235697 238269 240488
57723B40488Q38k77o45q71j191j086n26k80o31q36l87O1l26j317k042k159k002
$$ 240488 241326 241049 240404 239533 238342 237256 236730 236450 235819 234983 234596 234657 234331 233014 230972 228813 226811
57706B26811j893j866j919k091k267k209j764r87j66K68J10l97q37j129j426j674
$$ 226811 224918 223052 221133 219042 216775 214566 212802 211815 211649 211917 212027 211630 210793 209664 208238 206564
57690B06564j647j435j387j501j344o97J34Q24J463K272L259M431N987Q003J0218
$$ 206564 204917 203482 202095 200594 199250 198553 198687 199511 200974 203246 206505 210936 216923 224926 235144
57675B35144J2487J5217J8954K3580K8308L2573L6597M0957M5711N0119N2907
$$ 235144 247631 262848 281802 305382 333690 366263 402860 443817 489528 539647 592554
57664E92554N2468M6933L4827J6422n463k6439m2655n2225n5237n3127m8047m2030
$$ 592554 645022 691955 726782 743204 737741 711302 668647 616422 561185 508058 460011 417981
57652D17981l6099l0248k4393j9050j4961j2424j1191j0641r922q395o330m680
$$ 417981 381882 351634 327241 308191 293230 280806 269615 258974 249052 240657 234327 229647
57640B29647l857l238k226j273j179j786k135j742j049n86l32k8L42N51M25Q4
$$ 229647 225790 222552 220326 219053 217874 216088 213953 212211 211162 210576 210244 210216 210558 211109 211534 211618
57624B11618q7J35L91J06o47j167j193j364k113k830k770k257k141k461k533k090
$$ 211618 211531 211666 212057 212163 211516 210349 209156 207792 205679 202849 200079 197822 195681 193220 190687 188597
57608A88597j508r69k84N00J019J180J210J151Q78N08K07k11q47j212r66q56j811
$$ 188597 187089 186120 185836 186336 187355 188535 189745 190896 191774 192282 192489 192278 191431 190219 189253 188397 186586
57591A86586l294l739k772j720j618j904j703j268j299j629j540r40l98l11o27
$$ 186586 183292 179553 176781 175061 173443 171539 169836 168568 167269 165640 164100 163160 162762 162451 161824
57576A61824j127j521j477j033p25r57j453j723j804k104k722l235l091k041l71
$$ 161824 160697 159176 157699 156666 155941 154984 153531 151808 150004 147900 145178 141943 138852 136811 136440
57561A36440J155J861J821J754K072K453K414J956J377R03P32J047J637J905J557
$$ 136440 137595 139456 141277 143031 145103 147556 149970 151926 153303 154206 154938 155985 157622 159527 161084
57546A61084R39L38n65k019l299l256j767l8P21N03J96L24N06J44o43j074p29
$$ 161084 162023 162361 161796 159777 156478 153222 151455 151417 152138 152641 152837 153161 153667 153811 153168 152094 151365
57529A51365j16l2n53j112j397j656k023k102j490l93N95J124J263J204J000O19
$$ 151365 151249 151217 150664 149552 148155 146499 144476 142374 140884 140491 141086 142210 143473 144677 145677 146296
57513A46296J44j36RL17J65o17j317j181m32R1J45K75P73J181J017L87l60j035
$$ 146296 146440 146304 146313 146630 146795 146178 144861 143680 143248 143339 143484 143759 144532 145713 146730 147117 146757 145722
57495A45722j420j287r21j075j908k511j992p08R3k96j448k412k511j645k62R22
$$ 145722 144302 143015 142094 141019 139111 136600 134608 133900 133993 133697 132249 129837 127326 125681 125419 126341
57479A26341J432J331R74O36M55M81N59L76j84q26j108q06J9J149K238K926L002
$$ 126341 127773 129104 130078 130714 131169 131650 132209 132585 132401 131575 130467 129661 129680 130829 133067 135993 138995
57462A38995K470J543P49P65J688K640K619J699Q44N24L32J7L3O61J357J540J437
$$ 138995 141465 143008 143757 144522 146210 148850 151469 153168 154012 154536 154868 154885 154918 155579 156936 158476 159913
57445A59913J523J607J233N98L56O48J012J166J266J394J303Q31K34p2K13J122
$$ 159913 161436 163043 164276 164874 165230 165878 166890 168056 169322 170716 172019 172850 173084 173012 173225 174347
57429A74347K330L153L010K011R35M50N34P27Q17J035J487J680J034j69q80n77
$$ 174347 176677 179830 182840 184851 185786 186236 186770 187497 188314 189349 190836 192516 193550 193381 192501 191924
57413A91924O5K34J71N86J313J556J294J372K078K673K621K293K051J573P14J34
$$ 191924 191989 192223 192394 192980 194293 195849 197143 198515 200593 203266 205887 208180 210231 211804 212518 212652
57397B12652L65R25J144J235J694K154J864J059Q96J955L465M175L608K426J766
$$ 212652 213017 213942 215086 216321 218015 220169 222033 223092 223988 225943 229408 233583 237191 239617 241383
57382B41383K158L028L407L131K819K699K261J368P72R55J329J305J387K189L083
$$ 241383 243541 246569 249976 253107 255926 258625 260886 262254 263026 263981 265310 266615 268002 270191 273274
57367B73274K908J760Q52Q16J131J254J356J797K568L365L749L380K573K335L197
$$ 273274 276182 277942 278794 279610 280741 281995 283351 285148 287716 291081 294830 298210 300783 303118 306315
57352C06315M307M489L846L465L695L829L411K836K577K657L020L602L942L541
$$ 306315 310622 315111 318957 322422 326117 329946 333357 336193 338770 341427 344447 348049 351991 355532
57338C55532K692K207K261K377K465K962L765M094L694L267L336L527L423L240
$$ 355532 358224 360431 362692 365069 367534 370496 374261 378355 382049 385316 388652 392179 395602 398842
57324C98842L279L387L387L402L414L228L145L721M598M559L324K277K675M036
$$ 398842 402121 405508 408895 412297 415711 418939 422084 425805 430403 434962 438286 440563 443238 447274
57310D47274N113N636O045O258N906N355N380N953O361O384O418O524O301N804
$$ 447274 452387 458023 464068 470326 476232 481587 486967 492920 499281 505665 512083 518607 524908 530712
57296E30712N678O276P266Q323R500J0700J1418J1389J1080J1192J1964J3104
$$ 530712 536390 542666 549932 558255 567755 578455 589873 601262 612342 623534 635498 648602
57284F48602J4129J4654J4542J4045J3633J3601J3863J4066J3732J2497J0559
$$ 648602 662731 677385 691927 705972 719605 733206 747069 761135 774867 787364 797923
57273G97923Q789Q030Q236Q594Q469P893P217O664O357O336O410O303O104O251
$$ 797923 806712 814742 822978 831572 840041 847934 855151 861815 868172 874508 880918 887221 893325 899576
57259H99576O820P233O956O275N970O350P017P575Q128Q917R794J0362J0497J0491
$$ 899576 906396 913629 920585 926860 932830 939180 946197 953772 961900 970817 980611 990973 1001470 1011961
57245A011961J0707J1283J2140J3002J3446J3230J2658J2402J2789J3447J3838
$$ 1011961 1022668 1033951 1046091 1059093 1072539 1085769 1098427 1110829 1123618 1137065 1150903
57234A150903J3902J4004J4387J4940J5436J5772J5974J6151J6457J6924J7453
$$ 1150903 1164805 1178809 1193196 1208136 1223572 1239344 1255318 1271469 1287926 1304850 1322303
57223A322303J7922J8208J8067J7289J6216J5714J6250J7259J7847J7848J7787
$$ 1322303 1340225 1358433 1376500 1393789 1410005 1425719 1441969 1459228 1477075 1494923 1512710
57212A512710J7965J8260J8646J9192J9527J9087J8067J7483J7906J8709J8953
$$ 1512710 1530675 1548935 1567581 1586773 1606300 1625387 1643454 1660937 1678843 1697552 1716505
57201A716505J8541J8080J8033J8436J9147J9858K0105J9651J8837J8238J8103
$$ 1716505 1735046 1753126 1771159 1789595 1808742 1828600 1848705 1868356 1887193 1905431 1923534
57190A923534J8322J8650J8777J8378J7464J6459J5682J4973J4099J3278J2867
$$ 1923534 1941856 1960506 1979283 1997661 2015125 2031584 2047266 2062239 2076338 2089616 2102483
57179B102483J2688J2215J1367J0696J0674J1111J1440J1394J1207J1284J1750
$$ 2102483 2115171 2127386 2138753 2149449 2160123 2171234 2182674 2194068 2205275 2216559 2228309
57168B228309J2371J2898J3366J3994J4779J5368J5467J5232J5154J5583J6400
$$ 2228309 2240680 2253578 2266944 2280938 2295717 2311085 2326552 2341784 2356938 2372521 2388921
57157B388921J7096J7193J6672J5996J5598J5456J5274J4980J4801J4939J5393
$$ 2388921 2406017 2423210 2439882 2455878 2471476 2486932 2502206 2517186 2531987 2546926 2562319
57146B562319J5938J6113J5436J3957J2417J1414J0725R858Q970Q554Q387P729
$$ 2562319 2578257 2594370 2609806 2623763 2636180 2647594 2658319 2668177 2677147 2685701 2694088 2701817
57134B701817O495N322M449L522K703K858M217N909P387R324J2294J5562J8078
$$ 2701817 2708312 2713634 2718083 2721605 2724308 2727166 2731383 2737292 2744679 2754003 2766297 2781859 2799937
57121B799937K0019K2261K4968K7689L0481L3841L7792M2001M6635N2291N9279
$$ 2799937 2819956 2842217 2867185 2894874 2925355 2959196 2996988 3038989 3085624 3137915 3197194
57110C197194O7771P8423R2076J08927J28785J52053J79818K13238K53595L02720
$$ 3197194 3264965 3343388 3435464 3544391 3673176 3825229 4005047 4218285 4471880 4774600
57100D774600L62741M35590N23087O26865P47307Q82876J030606J186063J342145
$$ 4774600 5137341 5572931 6096018 6722883 7470190 8353066 9383672 10569735 11911880
57091A1911880J489744J621159J731730J817537J875342J908103J925785J931967
$$ 11911880 13401624 15022783 16754513 18572050 20447392 22355495 24281280 26213247
57083B6213247J909486J829507J681382J487618J280563J065485Q13999M95060
$$ 26213247 28122733 29952240 31633622 33121240 34401803 35467288 36281287 36776347
57075C6776347J07312l18980p43817j136432j478753j760434j974752k117426
$$ 36776347 36883659 36564679 35820862 34684430 33205677 31445243 29470491 27353065
57067B7353065k187299k188009k128760k022734j884268j726852j562041j398528
$$ 27353065 25165766 22977757 20848997 18826263 16941995 15215143 13653102 12254574
57059A2254574j242073j096617r65052q48574p46372o56964n79571n13563m57347
$$ 12254574 11012501 9915884 8950832 8102258 7355886 6698922 6119351 5605788 5148441
57050E148441m08862l66853l30790k99875k73031k49611k29234k11118j94419
$$ 5148441 4739579 4372726 4041936 3742061 3469030 3219419 2990185 2779067 2584648
57041B584648j79123j65666j53800j42631j31717j21136j10474r8876q6280p3684
$$ 2584648 2405525 2239859 2086059 1943428 1811711 1690575 1580101 1481225 1394945 1321261
57031A321261o1767n0079l7910k5131j1646K927J8349L3135M5586N4701N9142
$$ 1321261 1259494 1209415 1171505 1146374 1134728 1137655 1156004 1189139 1234725 1289426 1348568
57020A348568N5983M2069J7201j4493m6519p3028r0573r8428r8196r2762q4763
$$ 1348568 1404551 1446620 1463821 1449328 1402809 1329781 1239208 1140780 1042584 949822 865059
57009H65059p5645o5950n6189m7245l9971l4558l0374k6562k2866j9718j7467
$$ 865059 789414 723464 667275 620030 580059 545501 515127 488565 465699 445981 428514
56998D28514j5824j4298j2903j1932j1226j0167q527o790n467m423l045r46J657
$$ 428514 412690 398392 385489 373557 362331 352164 343637 336847 331380 326957 323912 322966 324623
56985C24623M058N622O383O965P594P341M937M26m555q400j0900j2705j3988j4276
$$ 324623 328681 334303 340686 347651 355245 362586 367523 367949 363394 354994 344094 331389 317401 303125
56971C03125j3276j1301q924o649m823l433j962J21K741N328P556R560J1537J3452
$$ 303125 289849 278548 269624 262975 258152 254719 252757 252878 255619 260947 268503 278063 289600 303052
56957C03052J5214J6603J6932J5200J1021N198q28o005j0005j2891j4775j5747
$$ 303052 318266 334869 351801 367001 378022 383220 382392 376387 366382 353491 338716 322969
56945C22969j5786j4709j2462r513o660m363k362q2K719N779Q669J1171J3456
$$ 322969 307183 292474 280012 270499 263839 259476 257114 257032 259751 265530 274199 285370 298826
56932B98826J5991J9101K2271K3973K2547J7487R774R43p854j5774k1805k5038
$$ 298826 314817 333918 356189 380162 402709 420196 429970 430913 423059 407285 385480 360442
56920C60442k5464k4132k2240k0333j8380j6363j4519j3081j1999j0980r792q518
$$ 360442 334978 310846 288606 268273 249893 233530 219011 205930 193931 182951 173159 164641
56908A64641p495o847o299n601n027n070n641n998n693n178n135n469n414m538
$$ 164641 157146 150299 144000 138399 133372 128302 122661 116663 110970 105792 100657 95188 89774 85236
56894H5236l176j870p09N47K044L829O129R263J3164J7099J9980K0924J9609J6315
$$ 85236 82060 80190 79481 80028 82072 85901 92030 101293 114457 131556 151536 172460 192069 208384
56880B08384J1845P320L646J073o47j596j401K61L098O385R576J2560J5502J8635
$$ 208384 220229 227549 231195 232268 231621 230025 228624 228885 231983 238368 247944 260504 276006 294641
56866B94641K2125K5849K9487L3090L7252M2287M7373N0997N1971M9473M2404
$$ 294641 316766 342615 372102 405192 442444 484731 532104 583101 635072 684545 726949
56855G26949K9956J3278m278j9272l0174l6954l9592l7975l2898k6083j8929j1794
$$ 726949 756905 770183 765905 746633 716459 679505 639913 601938 569040 542957 524028 512234
56843E12234m530K823J0151J7599K5505L4061M3132N2299O1113O9317P6467Q1004
$$ 512234 507704 510527 520678 538277 563782 597843 640975 693274 754387 823704 900171 981175
56831I81175P9979P0390N1315K4837m784l2735n5049o9526p6078p6141p1570o3939
$$ 981175 1061154 1131544 1182859 1207696 1202912 1170177 1115128 1045602 969524 893383 821813 757874
56819G57874n4460m4103l3573k3349j3828n228K644J0254J7988K5986L4237M2487
$$ 757874 703414 659311 625738 602389 588561 583333 585977 596231 614219 640205 674442 716929
56807G16929M9936N5103N6035N0813L8361J9458k972k4892m2911n5302o1905o3517
$$ 716929 766865 821968 878003 928816 967177 986635 983663 958771 915860 860558 798653 735136
56795G35136o1320n6385m9487m1399l3165k5690j9073j2813o687j070L773Q273
$$ 735136 673816 617431 567944 526545 493380 467690 448617 435804 429117 428047 431820 440093
56783D40093J3143J8504K3643K7497K9092K7555K2124J2582r8j3628k5354l3575
$$ 440093 453236 471740 495383 522880 551972 579527 601651 614233 614135 600507 575153 541578
56771E41578l8056l9416l8417l5881l2721k9551k6405k3134j9889j6876j4015
$$ 541578 503522 464106 425689 389808 357087 327536 301131 277997 258108 241232 227217
56760B27217j1311r249q275p944p315o135n052m591m550m546m534m469m046l170
$$ 227217 215906 206657 198382 190438 183123 176988 171936 167345 162795 158249 153715 149246 145200 142030
56746A42030k290j862j817j897k139k601k851k358j317o13p60j291j359p63r0
$$ 142030 139740 137878 136061 134164 132025 129424 126573 124215 122898 122285 121525 120234 118875 118112 118022
56731A18022J53J75M41Q29P05q0p72o29J05O18O78P98J249J595J374Q67Q11J510
$$ 118022 118175 118350 118791 119620 120325 120245 119473 118844 118949 119567 120245 121043 122292 123887 125261 126128 126939 128449
56713A28449K461K789K063P16l86q47r64r53m59P24J807J694M28p88j101q13n80
$$ 128449 130910 133699 135762 136478 136092 135245 134281 133328 132869 133593 135400 137094 137522 136734 135633 134820 134240
56696A34240m48q4N39J118J384J256Q39M27K25Q9j47k59n7m7q37j926k039r52
$$ 134240 133792 133708 134247 135365 136749 138005 138844 139271 139496 139585 139438 139179 139122 139075 138238 136312 134273 133321
56678A33321M3k9n11l39L50P07O05N01L65j49o72l65P79J806K058J787J358P53
$$ 133321 133364 133335 132824 132485 132835 133542 134147 134648 135013 134864 134192 133827 134606 136412 138470 140257 141615 142368
56660A42368J33J07R41J972K368K072J621J349J213J185J343J517J338P68K91
$$ 142368 142501 142608 143549 145521 147889 149961 151582 152931 154144 155329 156672 158189 159527 160295 160586
56645A60586M14J024J493J340O56j22o11o22k24J55k7p42j238r44l84n89j668
$$ 160586 161000 162024 163517 164857 165513 165391 164780 164158 163934 164089 164062 163320 162082 161138 160754 160165 158497
56628A58497k556k367j439p80r24j644k405k799k780k651k604k290j315j59J08
$$ 158497 155941 153574 152135 151355 150431 148787 146382 143583 140803 138152 135548 133258 131943 131784 131892
56613A31892p36j641j680j220j079j208r45j94M39O11O05P98J240J756K062J883
$$ 131892 131156 129515 127835 126615 125536 124328 123383 123189 123628 124239 124844 125642 126882 128638 130700 132583
56597A32583J294P95P62J082J501J968K271J898Q46J1Q9M73J17q28j179m10P31
$$ 132583 133877 134672 135434 136516 138017 139985 142256 144154 145000 145011 145100 145573 145690 144862 143683 143273 144004
56580A44004J350J291P98O6n75o18R5J127J859J908J245L46N4Q19K113L098L683
$$ 144004 145354 146645 147443 147509 146934 146316 146411 147538 149397 151305 152550 152896 152950 153769 155882 158980 162663
56563A62663M300M849M829M488M817O079P195P048N715M003K483J425J098J448
$$ 162663 166963 171812 176641 181129 185946 192025 199220 206268 211983 215986 218469 219894 220992 222440
56549B22440J793J504P51J61p8l24q04j234j196o86k30m28j315k269k672k576
$$ 222440 224233 225737 226488 226649 226571 226247 225443 224209 223013 222327 222097 221669 220354 218085 215413 212837
56533B12837k463k496k387j941j302o77k20j64n85j073j142q80o78m38J96Q12
$$ 212837 210374 207878 205491 203550 202248 201571 201351 201187 200602 199529 198387 197507 196829 196391 196587 197399
56517A97399L89j132k341k017o60K52M0p56j292j187n68M7J19l07n85l60j31m57
$$ 197399 197788 196656 194315 192298 191638 191890 191930 191174 189882 188695 188127 188174 188293 187986 187401 187041 186910 186453
56499A86453j018j067n20K8K29K92M01M06K03p9l50o60r31q79l58M67J283J798
$$ 186453 185435 184368 183848 183876 184105 184397 184798 185204 185407 185328 184978 184318 183387 182508 182150 182617 183900 185698
56481A85698J799J323P21L52J47k28q44j363j483j215p01k1O61J022Q46L67J01
$$ 185698 187497 188820 189541 189893 190040 189812 188968 187605 186122 184907 184206 184185 184846 185868 186714 187081 187182
56464A87182L59R16J260J149Q94R91J537K117K349K321K340K322J726L09j240
$$ 187182 187541 188457 189717 190866 191760 192751 194288 196405 198754 201075 203415 205737 207463 207772 206532
56449B06532j788r62L79J110J046Q23P93O34J53k20q9K59L45K12J51Q4k09m87
$$ 206532 204744 203782 204161 205271 206317 207140 207933 208567 208720 208500 208411 208670 209015 209227 209378 209462 209253 208766
56431B08766l66QK57N17J125J668J281l8j220j480j075n54k1M72O07L67K58N75
$$ 208766 208400 208408 208665 209182 210307 211975 213256 213218 211998 210518 209443 208889 208868 209340 209947 210314 210572 211147
56413B11147R01Q25N10J71l87j179j595j225n86l91m83k68K68O83R84J517K168
$$ 211147 212048 212873 213383 213554 213167 211988 210393 209168 208582 208191 207708 207440 207708 208391 209375 210892 213060
56396B13060K441K302K195K234K063J598J165Q24K39n41q13j26R73J592J563J395
$$ 213060 215501 217803 219998 222232 224295 225893 227058 227882 228121 227580 226767 226641 227614 229206 230769 232164
56380B32164J438J522J441J299J239J130P99M52M99R87J508J792J994K173J901
$$ 232164 233602 235124 236565 237864 239103 240233 241032 241484 241983 242970 244478 246270 248264 250437 252338
56365B52338R07j84m54J12O84Q39R27J094R00K92R6Q18J694J714J067O67O96O24
$$ 252338 253245 253061 252607 252719 253403 254242 255169 256263 257163 257455 257551 258369 260063 261777 262844 263511 264207 264831
56347B64831M09O13J215J384P67J63M24J283J792J519Q08J77n1L61J497K923L759
$$ 264831 265240 265853 267068 268452 269219 269382 269806 271089 272881 274400 275208 275385 275334 275695 277192 280115 283874
56330B83874L341J862K56n09q7J132K390K998K697J801R70O59P58Q78Q81R27J103
$$ 283874 287215 289077 289333 288824 288737 289869 292259 295257 297954 299755 300725 301384 302142 303020 303901 304828 305931
56313C05931J276J309J145O95j2n65m47L60J316J933K120J972J657J578K101K895
$$ 305931 307207 308516 309661 310356 310344 309779 309332 309692 311008 312941 315061 317033 318690 320268 322369 325264
56297C25264L131K556J915J921K291K218J554R84J189K135L148L563L351L155
$$ 325264 328395 330951 332866 334787 337078 339296 340850 341834 343023 345158 348306 351869 355220 358375
56283C58375L538M282M725M593M087L353K558K317L169M631N631O022O614P535
$$ 358375 361913 366195 370920 375513 379600 382953 385511 387828 390997 395628 401259 407281 413895 421430
56269D21430P844P284P151Q439J0195J0819J0290R952J0635J2087J3813J5457
$$ 421430 429274 436558 443709 452148 462343 473162 483452 493404 504039 516126 529939 545396
56257E45396J6680J7639J9279K2289K6068K9540L2629L5983L9760M3706M8060
$$ 545396 562076 579715 598994 621283 647351 676891 709520 745503 785263 828969 877029
56246H77029N3166N8385O2552O5508O8078P0484P1861P1531O9777O7071O3268
$$ 877029 930195 988580 1051132 1116640 1184718 1255202 1327063 1398594 1468371 1535442 1598710
56235A598710N7820N0263M0520K9164J7325N752n718j7194k7780l6434m3381m9459
$$ 1598710 1656530 1706793 1747313 1776477 1793802 1799554 1793836 1776642 1748862 1712428 1669047 1619588
56223A619588n4468n7478n8597n9034n9336n8896n7448n5635n3746n1150m7560
$$ 1619588 1565120 1507642 1449045 1390011 1330675 1271779 1214331 1158696 1104950 1053800 1006240
56212A006240m3755m0420l7226l3714l0207k7202k4588k2099j9879j8062j6365
$$ 1006240 962485 922065 884839 851125 820918 793716 769128 747029 727150 709088 692723
56201F92723j4642j3220j2315j1571j0620r594q755q059p405o755n920m754l635
$$ 692723 678081 664861 652546 640975 630355 620761 612006 603947 596542 589787 583867 579113 575478
56188E75478l125k965k287r72Q2L05J67J33o8o14q41q5J323K506K997K805K103
$$ 575478 572353 569388 567101 566129 566211 566516 566683 566816 566748 566134 565293 565208 566531 569037 572034 574839 576942
56171E76942J326J076J444J933K332L023M073M833M976N172O001O929P093O696
$$ 576942 578268 579344 580788 582721 585053 588076 592149 596982 601958 607130 613131 620060 627153 633849
56157F33849O709P570Q842J0046J1102J2034J2792J3462J4329J5699J7688K0137
$$ 633849 640558 648128 656970 667016 678118 690152 702944 716406 730735 746434 764122 784259
56145G84259K2741K5505K8949L3574L9276M5722N3084O1721P1298Q1012R0547
$$ 784259 807000 832505 861454 895028 934304 980026 1033110 1094831 1166129 1247141 1337688
56134A337688R9935J08380J14251J16302J14066J07068R5174Q0206O5860N5105
$$ 1337688 1437623 1546003 1660254 1776556 1890622 1997690 2092864 2173070 2238930 2294035
56124B294035M8192M3609L9824L5405K8666J8648O242o424j7452k5754l1056l4288
$$ 2294035 2342227 2385836 2425660 2461065 2489731 2508379 2514621 2508197 2490745 2464991 2433935 2399647
56112B399647l7549m2957n1488o2954p6247q9155r8883j03627j03444r9236r1626
$$ 2399647 2362098 2319141 2267653 2204699 2128452 2039297 1940414 1836787 1733343 1634107 1542481
56101A542481q1330o9825n8662m8494l9337l1397k5029k0170j6334j2954r595
$$ 1542481 1461151 1391326 1332664 1284170 1244833 1213436 1188407 1168237 1151903 1138949 1129354
56090A129354o231l465j872j063p6J231K123K458L040M155M952M959N083O319
$$ 1129354 1123123 1119658 1117786 1116723 1116647 1117878 1120001 1122459 1125499 1129654 1134606 1139565 1144648 1150967
56076A150967Q285R882J0613J0620J0191R960J0788J2697J4571J5543J6001J6671
$$ 1150967 1159252 1169134 1179747 1190367 1200558 1210518 1221306 1234003 1248574 1264117 1280118 1296789
56064A296789J7532J8207J8648J8862J8691J8410J8653J9395J9912K0109K0735
$$ 1296789 1314321 1332528 1351176 1370038 1388729 1407139 1425792 1445187 1465099 1485208 1505943
56053A505943K1861K2399K1782K0823K0258J9762J9169J9270K0492K2070K3443
$$ 1505943 1527804 1550203 1571985 1592808 1613066 1632828 1651997 1671267 1691759 1713829 1737272
56042A737272K5102K7238K8918K9694L0578L2386L4403L5711L6520L7158L7258
$$ 1737272 1762374 1789612 1818530 1848224 1878802 1911188 1945591 1981302 2017822 2054980 2092238
56031B092238L7013L7633L9378M0752M0937M1302M3165M5786M8062N0369N3148
$$ 2092238 2129251 2166884 2206262 2247014 2287951 2329253 2372418 2418204 2466266 2516635 2569783
56020B569783N5491N6898N8684O1815O5115O7530P0274P4608P9424Q3292Q7020
$$ 2569783 2625274 2682172 2740856 2802671 2867786 2935316 3005590 3080198 3159622 3242914 3329934
56009C329934R1870R6929J00855J04547J09472J15010J19997J25237J31870J38941
$$ 3329934 3421804 3518733 3619588 3724135 3833607 3948617 4068614 4193851 4325721 4464662
55999D464662J45309J52154J60760J69777J77727J86220J97212K09247K20096
$$ 4464662 4609971 4762125 4922885 5092662 5270389 5456609 5653821 5863068 6083164
55990F083164K31188K45310K61661K77651K94036L13761L36831L60968L86458
$$ 6083164 6314352 6559662 6821323 7098974 7393010 7706771 8043602 8404570 8791028
55981H791028M15831M49537M86286N26785N72910O24256O79999P42878Q16678
$$ 8791028 9206859 9656396 10142682 10669467 11242377 11866633 12546632 13289510 14106188
55972A4106188R01326R95657J103385J230795J380386J553093J755617J999432
$$ 14106188 15007514 16003171 17106556 18337351 19717737 21270830 23026447 25025879
55964B5025879K294325K650242L084744L622179M287211N105742O108172P320773
$$ 25025879 27320204 29970446 33055190 36677369 40964580 46070322 52178494 59499267
55956E9499267Q753320J0401440J2257212J4311127J6556452J9010286K1718353
$$ 59499267 68252587 78654027 90911239 105222366 121778818 140789104 162507457
55949A62507457K4699064K7847356L0853158L3133953L3778533L1638996K5759131
$$ 162507457 187206521 215053877 245907035 279040988 312819521 344458517 370217648
55942C70217648J6038664L640733r303289k0569656k8682826l3215428l4559415
$$ 370217648 386256312 389897045 380593756 360024100 331341274 298125846 263566431
55935B63566431l3511152l0938286k7587084k4002121k0530948j7371944j4617358
$$ 263566431 230055279 199116993 171529909 147527788 126996840 109624896 95007538
55928I5007538j2281272j0330561q717189p392614o306501n409763m663736m040979
$$ 95007538 82726266 72395705 63678516 56285902 49979401 44569638 39905902 35864923
55920C5864923l518088l074233k695351k372529k096107j856318j648159j469587
$$ 35864923 32346835 29272602 26577251 24204722 22108615 20252297 18604138 17134551
55912A7134551j315683j179730j058978r53924q62639p80966p07633o44023n89159
$$ 17134551 15818868 14639138 13580160 12626236 11763597 10982631 10274998 9630975 9041816
55903I041816n39637m94447m55282m21913l91304l61615l33454l07108k81948
$$ 9041816 8502179 8007732 7552450 7130537 6739233 6377618 6044164 5737056 5455108
55894E455108k58522k38023k19611k01339j83470j67852j54231j40343j25549
$$ 5455108 5196586 4958563 4738952 4537613 4354143 4186291 4032060 3891717 3766168
55885C766168j11379r8366q5269p1526n7988m5139l3101k3350j8108j8089k2868
$$ 3766168 3654789 3556423 3471154 3399628 3341640 3296501 3263400 3240050 3221942 3203853 3180985
55874C180985l2731m7647o4944q0828r3940j04918j13031j16392j15256j12113
$$ 3180985 3148254 3100607 3035663 2954835 2860895 2755977 2642946 2526554 2411298 2299185
55864B299185j08141j02467r5121q7892q1694p5628o9272o3483n8450n3239m7878
$$ 2299185 2191044 2088577 1993456 1905564 1823870 1748242 1678970 1615487 1557037 1503798 1455920
55853A455920m3699m0959l8298l5133l2522l1037k9830k8456k7700k7824k7788
$$ 1455920 1412221 1371262 1332964 1297831 1265309 1234272 1204442 1175986 1148286 1120462 1092674
55842A092674k6924k5773k4663k3099k1175j9978j9932k0181k0040j9677j9081
$$ 1092674 1065750 1039977 1015314 992215 971040 951062 931130 910949 890909 871232 852151
55831H52151j7958j6884j6804j7070j5944j3489j1925j2353j3161j2689j1626
$$ 852151 834193 817309 800505 783435 767491 754002 742077 729724 716563 703874 692248
55820F92248j1462j2131j2570j2449j2036j1337j0388r652r265q635p506o501
$$ 692248 680786 668655 656085 643636 631600 620263 609875 600223 590958 582323 574817 568316
55808E68316o018n497m509l516k882k023l16J843L578M463M550M156L963M451
$$ 568316 562298 556801 552292 548776 545894 543871 543555 545398 548976 553439 557989 562145 566108 570559
55794E70559M958M276K449R22N58O58L90r0n39j433l081m963o699q778j1521j4272
$$ 570559 575517 579793 582242 583164 583722 584380 584770 584680 584141 582708 579627 574664 567965 559187 547666 533394
55778E33394j6317j7716j8462j7822j5434j2290r723p897o117m023j873j97K45
$$ 533394 517077 499361 480899 463077 447643 435353 425630 417733 411616 407593 405720 405523 405768
55765D05768j158l890o361p496p715p845p894p518o933o564o307n865n276m602
$$ 405768 404610 400720 394359 386863 379148 371303 363409 355891 348958 342394 336087 330222 324946 320344
55751C20344l585k236j136o54n11o08j418k936m091m080l589l764m506m770m145
$$ 320344 316759 314523 313387 312733 312222 311614 310196 307260 303169 299089 295500 291736 287230 282460 278315
55736B78315l204k532k211k059j807j242o60p64j600k189j852j358j935l479m669
$$ 278315 275111 272579 270368 268309 266502 265260 264600 263836 262236 260047 258195 256837 254902 251423 246754
55721B46754m655l863l169k992l182l261k759j624l06Q28J844K789L302L109K517
$$ 246754 242099 238236 235067 232075 228893 225632 222873 221249 220943 221771 223615 226404 229706 232815 235332
55706B35332K003J602J149P19L93o1q94k056l471n121o514o789n886m965m942
$$ 235332 237335 238937 240086 240805 241198 241137 240243 238187 234716 229595 223081 216292 210406 205441 200499
55691B00499n253m856l865l177k873k153q34K82O27N92P61J158J575K055K632
$$ 200499 195246 190390 186525 183348 180475 178322 177488 177770 178397 178989 179750 180908 182483 184538 187170
55676A87170L032K876K054P30p44j983k837l502m134m420l889k561j088j92j49
$$ 187170 190202 193078 195132 195862 195118 193135 190298 186796 182662 178242 174353 171792 170704 170512 170363
55661A70363o46r24l49R12J952K168J951K001K343K512K473K548K604K037Q34
$$ 170363 169717 168793 168444 169356 171308 173476 175427 177428 179771 182283 184756 187304 189908 191945 192779
55646A92779q4P9R97J683J665J303J048P99Q5j362l308n199o418o574n813m901
$$ 192779 192695 192774 193771 195454 197119 198422 199470 200269 200354 198992 195684 190485 184067 177493 171680 166779
55630A66779m631m960n017m269l239k705k560k181j619j538j935j860q30L69O98
$$ 166779 162148 157188 152171 147902 144663 141958 139398 137217 135598 134060 132125 130265 129435 129804 130502
55615A30502J51n60j050j382j600j715j941k408k778k583j874j165q91j061j294
$$ 130502 130653 130093 129043 127661 126061 124346 122405 119997 117219 114636 112762 111597 110706 109645 108351
55600A08351j064j84P80R69K78m71o13m02m45q42j277j532j469r12K9Q23J074
$$ 108351 107287 107103 107883 108852 109130 108659 108046 107644 107199 106357 105080 103548 102079 101167 101196 102019 103093
55583A03093R23O31K18j83j51L93Q35O56J69j3K14O17J184J892K332K190J752
$$ 103093 104016 104647 104865 104682 104531 104924 105759 106415 106584 106571 106785 107402 108586 110478 112810 115000 116752
55566A16752J404J025M51L2P6J44l22j016j241j097j306k013k577k580k275k021
$$ 116752 118156 119181 119632 119664 119740 119884 119562 118546 117305 116208 114902 112889 110312 107732 105457 103436
55550A03436j913j959k115k066j538p53j70J05K24J60n7m3L69O04J69l19R9J146
$$ 103436 101523 99564 97449 95383 93845 93092 92922 93027 93251 93411 93354 93311 93680 94284 94453 94134 94233 95379
55532I5379J593J048L79J51j82j059j830j657p25J32M93M99K79j43n78p53n89
$$ 95379 96972 98020 98399 98550 98368 97309 95479 93822 93097 93229 93722 94221 94500 94357 93779 93026 92437
55515I2437k29J14K52J72J32L25M83J64n60j182j514j835k177k038j137J5O59
$$ 92437 92208 92322 92574 92746 92878 93203 93686 93850 93290 92108 90594 88759 86582 84544 83407 83422 84081
55498H4081O18K56j04l75m96l27K12R92J700K003J856J601J605J802J821J492
$$ 84081 84699 84955 84851 84476 83980 83653 83865 84857 86557 88560 90416 92017 93622 95424 97245 98737
55482I8737J003N85K63r9o58j460k267k679k530k003j305n31M9O6k89k93J75J98
$$ 98737 99740 100325 100588 100489 99831 98371 96104 93425 90895 88892 87587 87056 87105 87171 86882 86589 86764 86962
55464H6962q69k209k541j792q57j26O90J427J470R30O55Q80Q56K01m42m50j7M32
$$ 86962 86093 83884 81343 79551 78694 78568 79258 80685 82155 83085 83740 84620 85476 85677 85235 84785 84768 85200
55446H5200P88Q21J26r63j295m39N21M58k33l68K24N89J16p37j229j210j029r19
$$ 85200 85988 86809 86935 85972 84677 84238 84759 85217 84984 84616 84840 85429 85545 84808 83579 82369 81340 80421
55428H0421o85oR62J512J210O39P26J449J876J494Q32N37O45R85J527J961J705
$$ 80421 79736 79730 80692 82204 83414 84053 84779 86228 88104 89598 90430 90967 91612 92597 94124 96085 97790
55411I7790Q33J85R0k07j237k246k298j720j479j679j698j450j427j655j627j282
$$ 97790 98623 98808 98898 98691 97454 95208 92910 91190 89711 88032 86334 84884 83457 81802 80175 78893
55395G8893j139j345j397r69l78PK42M93O95P32O68N82M64K99J00j32k63pO77
$$ 78893 77754 76409 75012 74043 73665 73672 73914 74407 75102 75834 76502 77084 77548 77847 77947 77815 77552 77545 78222
55376G8222J339J465J106P20N47M12O1n46j205j518j212n67k26l27k43M47J187
$$ 78222 79561 81026 82132 82852 83399 83811 83872 83326 82121 80603 79391 78824 78598 78271 78028 78475 79662
55359G9662J166N04L5J59M52L89j07p37j037o33K68Q52N87q5l70j26K49O27J045
$$ 79662 80828 81332 81367 81526 81978 82367 82260 81523 80486 79853 80121 80973 81560 81475 81105 80979 81228 81855 82900
55340H2900J102L76p03j181r27p16r78j281j238j081r91o72m1L78K59P6L28O99
$$ 82900 84002 84378 83675 82494 81567 80851 79873 78592 77354 76273 75282 74610 74569 74947 75206 75282 75610 76309
55322G6309N97J35m9K44N89O45N43N86Q34J103J146R04N83M21K97j46r23j581
$$ 76309 76906 77041 76992 77236 77825 78470 79013 79599 80433 81536 82682 83586 84169 84590 84887 84741 83818 82237
55304H2237j750j562j350j181q80k89O44J708K293J784L80q46j031l53M32R55
$$ 82237 80487 78925 77575 76394 75514 75225 75869 77577 79870 81654 82034 81188 80157 79804 80236 81191
55288H1191J265J305R02J94m19p36q33q07p20p44r23q99k94O65J294J260Q38L60
$$ 81191 82456 83761 84663 84857 84438 83702 82869 82062 81342 80598 79675 78776 78482 79147 80441 81701 82539 82899
55270H2899j27n37n79j62L54N94N81M94L30J11J09M52P34M93qj3O47J183Q29k03
$$ 82899 82772 82235 81656 81494 81848 82442 83023 83517 83847 83958 84067 84519 85253 85746 85738 85725 86372 87555 88384 88181
55250H8181j024j094o34k04j72n82j168j468j155l87L05N74O09Q50J390J793J547
$$ 88181 87157 86063 85429 85225 85053 84471 83303 81835 80680 80293 80598 81172 81781 82631 84021 85814 87361
55233H7361O66k83p92r19r96j019o26K08R87J299J245J018M93l42r66r04m68l11
$$ 87361 88027 87744 86952 86033 85037 84018 83392 83600 84587 85886 87131 88149 88642 88300 87334 86430 85962 85651
55215H5651m40l50o4j55o19o30K40J283J652J395J007N61j9l20Q3P92R49L86k79
$$ 85651 85211 84861 84797 84642 84023 83393 83633 84916 86568 87963 88970 89531 89512 89192 89275 90067 91016 91402 91123
55196I1123n80n95m67k27j57o21j351j532q93k27l86j149j467p15O01J427J194
$$ 91123 90543 89948 89481 89254 89097 88476 87125 85593 84700 84473 84087 82938 81471 80756 81357 82784 83978
55179H3978K88m48o31n72o07n15P5R47J468J445J263J155Q76L26l2K28Q01J034
$$ 83978 84266 83818 83187 82615 82008 81493 81568 82515 83983 85428 86691 87846 88722 89048 89016 89244 90045 91079
55161I1079P91N52O53P92M49m02j140j115l84K97K50l75p99n35J24N22M14J19
$$ 91079 91870 92422 93075 93867 94316 93914 92774 91659 91275 91572 91822 91447 90648 90113 90237 90759 91173 91292
55143I1292M9K25K75j12q11j354j373q68j34M37M79o0o41n21L01Q52L11q89j600
$$ 91292 91341 91566 91841 91729 90918 89564 88191 87323 87189 87626 88105 88045 87404 86883 87184 88036 88347 87458 85858
55124H5858j413r87q29m79O82K229K979K346J014J05k4J32J01j5K5Nm47j059j070
$$ 85858 84445 83458 82629 82150 82832 85061 88040 90386 91400 91505 91481 91613 91714 91699 91724 91729 91282 90223 89153
55105H9153l08M02K77m01p65n35j75j8J35N56J142J551J538J192R88J335J889
$$ 89153 88845 89247 89524 89123 88358 87823 87648 87630 87765 88321 89463 91014 92552 93744 94732 96067 97956
55088I7956J675L11j238j690r29J90J108J785J917J064l50j170r55m89n04p91
$$ 97956 99631 99942 98704 97014 96085 96275 97383 99168 101085 102149 101799 100629 99674 99185 98681 97890
55072I7890r05r45j027p35J94J162J345O57l56j194j481r12L08J278J300O36%
$$ 97890 96985 96040 95013 94278 94472 95634 96979 97636 97280 96086 94605 93693 94001 95279 96579 97215 97215
55055I7215l47n09m27j4M57O58O47N28J10o08j052q20l76l44m81j79M31P42P72
$$ 97215 96868 96359 95932 95918 96375 97033 97680 98208 98318 97710 96658 95838 95462 95118 94637 94458 94889 95631 96403
55036I6403R93J237Q66L8k79K11O05J75o09q71m96m0N5k54o89q01m46k09p35j588
$$ 96403 97396 98633 99499 99537 99258 99469 100074 100249 99640 98769 98273 98233 98288 98034 97345 96544 96098 95889 95154 93566
55016I3566j525j58J463K274K359K188J607M26o56p16J12R04J208J201Q54m7j024
$$ 93566 92041 91883 93346 95620 97979 100167 101774 102200 101544 100828 100940 101844 103052 104253 105107 105060 104036
54999A04036j061Q8J397J768J168L03l12n59l98J42P26Q96N41K4j85k8O3l19r80
$$ 104036 102975 103063 104460 106228 107396 107699 107387 106828 106430 106572 107298 108194 108735 108759 108574 108546 108609 108290 107310
54980A07310j268r28m86n17p80n68K59J095J433J325R42K33p04j359j237l76P71
$$ 107310 106042 105114 104628 104111 103331 102763 103022 104117 105550 106875 107817 108050 107346 105987 104750 104374 105145
54963A05145J726K132J944J552J402J278M76j055k244k062q03L54P22M82K8l68
$$ 105145 106871 109003 110947 112499 113901 115179 115655 114600 112356 110294 109491 109845 110567 111049 111077 110709
54947A10709l46L10J208J711J779J853J856J195m3p95m47J88M9n98n89L39J184
$$ 110709 110363 110673 111881 113592 115371 117224 119080 120275 120232 119437 118990 119178 119227 118629 118040 118379 119563
54930A19563J057K22m21l17N22J741K758L031K544J919J780K177K767L379M156
$$ 119563 120620 120842 120421 120104 120626 122367 125125 128156 130700 132619 134399 136576 139343 142722 146878
54915A46878N123N858N790M790L346K013Q55m22j859l145m142n004n636n528m576
$$ 146878 152001 157859 163649 168439 171785 173798 174653 174231 172372 169227 165085 160081 154445 148917 144341
54900A44341l539l168l204k914k325k096k277k090j199l24j97n51o24k27K63N97
$$ 144341 140802 137634 134430 131516 129191 127095 124818 122728 121529 121205 121008 120457 119833 119606 119869 120466
54884A20466R00J296J703J921J830J612J819K849M264N090M986M671M879N431
$$ 120466 121366 122662 124365 126286 128116 129728 131547 134396 138660 143750 148736 153407 158286 163717
54870A63717N667N360M656L524J837k03k180l859n059n502n196m719m588m623
$$ 163717 169384 174744 179400 182924 184761 184558 182378 178519 173460 167958 162762 158043 153455 148832
54856A48832m420m066l760l145j885o90p26j949k971k872k272k219k742l092k828
$$ 148832 144412 140346 136586 133441 131556 130866 130140 128191 125220 122348 120076 117857 115115 112023 109195
54841A09195k059j021K8P34R36R07R08P26M2q50j166n35N15J058O66k34q46p95
$$ 109195 107136 106115 106143 106877 107813 108720 109628 110354 110396 109546 108380 107845 108360 109418 110084 109850 109004 108209
54823A08209l89k9L13Q35J288J106K03q09j311j268j017p87o23n16m26l42l20
$$ 108209 107820 107791 108104 108939 110227 111333 111536 110727 109416 108148 107131 106344 105721 105205 104779 104437 104117
54806A04117k53K36J260K119J941Q55r4l44l07l43j30M25N87j02q24n45M43R97
$$ 104117 103864 104100 105360 107479 109420 110275 110181 109837 109530 109187 109057 109482 110069 109967 109143 108598 109041 110038
54788A10038P79M40M00M88P26J385K146K149J246L38J14K64K65K08L80O85R69
$$ 110038 110817 111257 111657 112145 112871 114256 116402 118551 119797 120135 120249 120513 120778 120986 121366 122051 123020
54771A23020J421K138K804L221L700M425M959M947M837N252N928O024N245M032
$$ 123020 124441 126579 129383 132604 136304 140729 145688 150635 155472 160724 166652 172676 177921 181953
54757A81953K773J543M74k64r47k058l501m611n074n252n404n167m208k941k123
$$ 181953 184726 186269 186743 186479 185532 183474 179973 175362 170288 165036 159632 154465 150257 147316 145193
54742A45193j994k153k151j891j542j255r82n43L6L21p8q17j012l15N66P82M40
$$ 145193 143199 141046 138895 137004 135462 134207 133225 132682 132718 133039 132961 132144 131132 130817 131383 132165 132605
54725A32605L87J064K112L057L869M650N160N103M670M433M573M514L545J775
$$ 132605 132992 134056 136168 139225 143094 147744 152904 158007 162677 167110 171683 176197 179742 181517
54711A81517J10q02j332k274l660m650m638m037l649l652l610l306l034l043l074
$$ 181517 181627 180825 179493 177219 173559 168909 164271 160234 156585 152933 149323 146017 142983 139940 136866
54696A36866k674j758p18j07k57j045j912k271j988j417q93l85K70R06J110P61
$$ 136866 134192 132434 131716 131609 131352 130307 128395 126124 124136 122719 121826 121441 121711 122617 123727 124488
54680A24488K60O1J77K69J51m5k14m45p91j083j149r89n86Q1O59M32p31j785j581
$$ 124488 124748 124809 124986 125255 125406 125361 125147 124702 123911 122828 121679 120690 120104 120185 120844 121276 120545 118760 117179
54661A17179m24K76n4m53J3R36J388J249R51N11k53r37r79o31n64o59j90Q31J449
$$ 117179 116755 117031 116977 116524 116537 117473 118861 120110 121061 121572 121319 120382 119403 118772 118208 117549 117359 118190 119639
54642A19639J122L17l42o92n55L10J390J520M16p37q49k98o5k88n34q18j308j537
$$ 119639 120761 121078 120736 120044 119489 119799 121189 122709 123125 122388 121539 121241 121176 120888 120354 119536 118228 116691
54624A16691r99k28j50n92n10L18R93R47O03L18k03r72j188l16R46J524J286R34
$$ 116691 115692 115464 115314 114722 114212 114530 115523 116470 117073 117391 117188 116216 115028 114712 115658 117182 118468 119402
54606A19402R33J138J198Q55J00o32p52l41k13p30j085m24P92J379J079O10K56
$$ 119402 120335 121473 122671 123526 123626 122994 122242 121901 121688 120958 119873 119449 120241 121620 122699 123309 123565
54589A23565m78j518j775o71P31J032M17K12Q49J295O94l75p64k40M52O50L47
$$ 123565 123087 121569 119794 119123 119854 120886 121303 121515 122364 123659 124353 123978 123214 122974 123426 124076 124423
54572A24423j24m40l50J77Q16J167J132Q61M33l7j77K34O79L51o93j370r20J59
$$ 124423 124299 123859 123509 123686 124502 125669 126801 127662 128095 128058 127881 128115 128794 129145 128452 127082 126162 126321
54554A26321Q18O65L3o27r13m00Q69K021K160J466R36J115J681K164K359K066
$$ 126321 127139 127804 127837 127210 126297 125897 126766 128787 130947 132413 133349 134464 136145 138309 140668 142734
54538A42734J189L21L78J323J989J621Q94Q14J194J063J66q15j391j716j833j350
$$ 142734 143923 144244 144622 145945 147934 149555 150449 151263 152457 153520 153686 152871 151480 149764 147931 146581
54522A46581k65N79L90n12j112r37l99N0M96J037J177L47j074j906j531o94n31
$$ 146581 146316 146895 147285 146773 145661 144724 144325 144375 144871 145908 147085 147432 146358 144452 142921 142227 141696
54505A41696j112j515j182n20q3K38Q06J426J485Q02m2k84K80J086J265M41p96
$$ 141696 140584 139069 137887 137367 137284 137522 138328 139754 141239 142041 141999 141715 141995 143081 144346 144787 143991
54488A43991j345p12M41J061Q21K71L4J77M11N70P24Q82Q82O53M93Q68J760K465
$$ 143991 142646 141934 142375 143436 144257 144528 144562 144739 145150 145720 146444 147326 148208 148861 149354 150222 151982 154447
54470A54447K325J590J094J121J081N21j11j20M26Q28P25L60J6k68l59J5P41J116
$$ 154447 156772 158362 159456 160577 161658 162179 162068 161948 162374 163202 163927 164287 164303 164035 163676 163691 164432 165548
54452A65548N68n59j226q16J55N28j83j183j335o31k66j025k121k154r87Q2op99
$$ 165548 166116 165557 164331 163515 163670 164198 164015 162832 161497 160866 160600 159575 157454 155300 154313 154395 154389 153590
54434A53590j071l17Q60J560J438P76J00k58l07k51k23k02r5J57N14Q11Q22N25
$$ 153590 152519 152202 153062 154622 156060 156836 156936 156678 156371 156120 155897 155695 155600 155757 156271 157082 157904 158429
54416A58429J56j64o60j448k026j682m79O61J040R04Q08P94O14M35O55J126J123
$$ 158429 158585 158421 157761 156313 154287 152605 152126 152787 153827 154731 155539 156333 156947 157382 158037 159163 160286
54399A60286L14p11j074n29M52J290J708J649J140L28m80r52r42n33N6O29R92
$$ 160286 160600 159889 158815 158286 158738 160028 161736 163385 164525 164853 164373 163421 162479 161946 162002 162631 163623
54382A63623R09K68o34j123p85m1K33k41p39m12O16J398J283N31k24o34o36j78
$$ 163623 164532 164800 164166 163043 162258 162217 162450 162209 161470 161058 161674 163072 164355 164886 164662 164028 163392 163214
54364A63214O03J230J301R61O08K52l50j084j442j224p73l48J71P33Q24J47p60
$$ 163214 163817 165047 166348 167309 167917 168169 167819 166735 165293 164069 163296 162948 163119 163852 164676 164823 164063
54347A64063j180j149j181j264q77M6Q54J100J104J263J352R86M39M16J050J656
$$ 164063 162883 161734 160553 159289 158412 158458 159312 160412 161516 162779 164131 165117 165556 165972 167022 168678
54331A68678J512O10n15j431k081k543k752k544j890j025l22o0l12q43j175q42
$$ 168678 170190 170800 170285 168854 166773 164230 161478 158934 157044 156019 155697 155637 155325 154482 153307 152465
54315A52465J23J044J190N96O6K68R55J329R47J20n51p35n34l31n33j217j913
$$ 152465 152588 153632 154822 155418 155484 155752 156707 158036 158983 159103 158552 157817 157283 156952 156419 155202 153289
54298A53289j977j328n99l82m83l06K14M53Jp39j049p14k5O97J250J421J156Q29
$$ 153289 151312 149984 149385 149003 148520 148214 148428 148881 148882 148143 147094 146380 146355 147052 148302 149723 150879 151708
54280A51708Q79J227J382J129P09L08j75p60j250j537j662j517r93n16p67j587
$$ 151708 152587 153814 155196 156325 157034 157342 157167 156407 155157 153620 151958 150441 149448 148932 148165 146578
54264A46578j844q60O56J664K105K390K282J289j31q80o90k77qM73J153J263N13
$$ 146578 144734 143874 144530 146194 148299 150689 152971 154260 154129 153249 152559 152282 152274 152747 153900 155163 155676
54247A55676k59k54J85K67n4k95l30l49k99o2J18o2l31k19K08M35K78Jk01l67
$$ 155676 155417 155163 155348 155615 155561 155266 154936 154587 154288 154226 154344 154282 153951 153732 153940 154375 154653 154654 154453 154086
54227A54086n10o36r35j455j763j390n52O2J55l6k65l96r6Q23J706J489J34j075
$$ 154086 153576 152940 152005 150550 148787 147397 146845 146907 147062 147026 146761 146365 146269 147092 148798 150287 150421 149346
54209A49346j107m18j33m58o01q2O35Q42M72Kk04k08k04j22L08J142J916J974
$$ 149346 148239 147821 147688 147230 146629 146547 147182 148024 148496 148498 148294 148086 147882 147760 148068 149210 151126 153100
54191A53100J085k67j255j358p77k66m04r69j194p71k04L8K52Q96J540J326L61
$$ 153100 154185 153918 152663 151305 150528 150262 149858 148889 147695 146924 146720 146758 147010 147906 149446 150772 151133
54174A51133k54k0J79n65j772k184j393j93M58K31o08j477j780j382p68m11j79
$$ 151133 150879 150859 151038 150473 148701 146517 145124 144931 145389 145620 145012 143535 141755 140373 139605 139194 139015
54157A39015K40O26N38J43K4J95N3n08p26p9Q67J238J000P57P05M67j02n41m17
$$ 139015 139255 139881 140419 140562 140586 140781 140834 140326 139600 139521 140388 141626 142626 143383 144088 144555 144453 143912 143495
54138A43495R4M98O27P11R08J028Q21M47L77Q16J304J118N9j220j772j183qP12
$$ 143495 143589 144087 144714 145425 146333 147361 148182 148629 149006 149822 151126 152244 152303 151083 149311 148128 148120 148832
54120A48832L87n22j025p29j49J62L65P62R72M16n82r79m78P0K5p8M71J294J440
$$ 148832 149219 148697 147672 146943 146794 146956 147321 148083 149055 149471 148889 147910 147432 147502 147527 147449 147920 149214 150654
54101A50654Q29L44N56J137J517J509J097K44p76j299r08%N96M31j87n95l81L39
$$ 150654 151483 151827 152383 153520 155037 156546 157643 157887 157111 155812 154904 154904 155500 155931 155744 155149 154768 155107
54083A55107J102J524J501J102N02N2N5L18K36l36o92j74P66J056M25l18m06J05
$$ 155107 156209 157733 159234 160336 160838 160890 160945 161263 161499 161163 160471 160297 161063 162119 162544 162226 161820 161925
54065A61925Q21J582K228K379J872J161Q16Q89J017R55P22M45L14N21J006J498
$$ 161925 162746 164328 166556 168935 170807 171968 172784 173673 174690 175645 176367 176812 177126 177647 178653 180151
54049A80151J898K320K622K397J737J506K336L771M984N928P059Q183Q596Q422
$$ 180151 182049 184369 186991 189388 191125 192631 194967 198738 203722 209650 216709 224892 233488 241910
54035B41910Q915J0924J3660J5555J5888J5099J3782J1929R168N308O79l854p238
$$ 241910 250825 261749 275409 290964 306852 321951 335733 347662 356830 362138 362817 358963 351725
54022C51725q853q926q203p265o253n222m386l992m057m371m663m678m256l524
$$ 351725 342872 333946 325743 318478 312225 307003 302617 298625 294568 290197 285534 280856 276600 273076
54008B73076l009l268m305n401n759n296m641m295m009l195j883q84r13j767k643
$$ 273076 270067 266799 262494 257093 251334 246038 241397 237102 233093 229898 228015 227131 226218 224451 221808
53993B21808l132l465l801l732k889j643p66m98m68m81p43j191j296r25p76j386
$$ 221808 218676 215211 211410 207678 204789 203146 202380 201882 201414 200933 200190 198999 197703 196778 196002 194616
53977A94616k143k007r25J96P37Q31O51J59m03n39l17m11r99j304p38K04O79O19
$$ 194616 192473 190466 189541 189737 190474 191305 191956 192115 191712 191173 190856 190445 189446 188142 187404 187608 188287 188906
53959A88906N19N76O29P18J031J473J737J718J507J181R03R49J323J679J915K398
$$ 188906 189425 190001 190630 191348 192379 193852 195589 197307 198814 199995 200898 201847 203170 204849 206764 209162
53943B09162L170L495K880K097K344L633M771M878M125L137K367K149K564L143
$$ 209162 212332 215827 218707 220804 223148 226781 231552 236430 240555 243692 246059 248208 250772 253915
53929B53915L278L023K962L259L470L359L248L366L479L410L435L857M616N423
$$ 253915 257193 260216 263178 266437 269907 273266 276514 279880 283359 286769 290204 294061 298677 304100
53915C04100O006O245O384P039Q425R727R870Q880P748P009O363N702N475N578
$$ 304100 310106 316351 322735 329774 338199 347926 357796 366676 374424 381433 387796 393498 398973 404551
53901D04551M993L207J150k6n14j352k802m124m742m913n195n854o738p387p315
$$ 404551 409544 412751 413901 413875 413361 412009 409207 405083 400341 395428 390233 384379 377641 370254 362939
53886C62939o530n649n226n092m644l579k062l35J500L336M889N667N109K940
$$ 362939 356409 350760 345534 340442 335798 332219 330157 329822 331322 334658 339547 345214 350323 353263
53872C53263m81m362p992j0801j2180j1884j0617r560r088q610p786p045o628
$$ 353263 352782 348420 340428 329627 317447 305563 294946 285386 276298 267688 259902 252857 246229
53859B46229n995m842l839l611l658l153k296j884j950j822j371j162j374j470
$$ 246229 240234 235392 231553 227942 224284 221131 218835 216951 215001 213179 211808 210646 209272 207802
53845B07802j047m02j6n3m42r66j238r72l53J74L71K37j40m27j29O65J012K90
$$ 207802 206755 206353 206337 206284 205842 204876 203638 202666 202313 202487 202858 203095 202955 202528 202399 203064 204076 204366
53827B04366q06j184r35j036j665j916j263k96L07N85Q05R62J090J378J627J391
$$ 204366 203560 202376 201441 200405 198740 196824 195561 195265 195572 196157 196962 197924 199014 200392 202019 203410
53811B03410R26J219K530L725L697K806K163K106K253K597L505M723N383N181
$$ 203410 204336 205555 208085 211810 215507 218313 220476 222582 224835 227432 230937 235660 241043 246224
53797B46224M824M962N337N341M927M455L934L081K036J457J638J993J770R71
$$ 246224 251048 256010 261347 266688 271615 276070 280004 283085 285121 286578 288216 290209 291979 292950
53783B92950J81l02o67j007j147j140j364j932k471k758l026l392l553l471l703
$$ 292950 293131 292829 292162 291155 290008 288868 287504 285572 283101 280343 277317 273925 270372 266901 263198
53768B63198m481n034m584l594l151l424l623l294k750k281j878j773k331l254
$$ 263198 258717 253683 249099 245505 242354 238930 235307 232013 229263 226982 225104 223331 221000 217746
53754B17746l713l436k905k323j351q4O09K98k80k50K42M74K22j59l18l7Q11J914
$$ 217746 214033 210597 207692 205369 204018 203934 204543 204841 204561 204311 204553 205027 205249 205090 204772 204735 205546 207460
53736B07460K468J994J005M20M97P42P02M87N54J119J794J840J116N34J027K164
$$ 207460 209928 211922 212927 213347 213844 214586 215288 215775 216329 217448 219242 221082 222198 222732 223759 225923
53720B25923K530J585K71m32o21o07j2J385K611K437J063r9j46O04J502K278K780
$$ 225923 228453 230038 230309 229877 229256 228649 228637 230022 232633 235070 236133 236034 235888 236492 237994 240272 243052
53703B43052K788K321J715J213Q67Q22J315K245L071L306K926K286J794J625J587
$$ 243052 245840 248161 249876 251089 251956 252778 254093 256338 259409 262715 265641 267927 269721 271346 272933
53688B72933J418J189J178J245Q07k71j211j235o07j96k92m20k01K59P27J038
$$ 272933 274351 275540 276718 277963 278770 278499 277288 276053 275446 275250 274958 274538 274337 274596 275323 276361
53672B76361Q88O6j004j423q59o5q8j088k188k429j730q54m97o08p22o39m54j34
$$ 276361 277249 277315 276311 274888 274029 273964 273876 272788 270600 268171 266441 265587 265090 264482 263760 263121 262667 262533
53654B62533L18L61n37j727j693n6J616J741P26O5J00o6p57j135o37J63N67P34
$$ 262533 262851 263212 262675 260948 259255 259199 260815 262556 263282 263347 263447 263381 262624 261489 260852 261015 261582 262316
53636B62316J198J958K570K698K206J184J61l2R02K284L110K991K282J486Q89
$$ 262316 263514 265472 268042 270740 272946 274130 274291 274259 275161 277445 280555 283546 285828 287314 288203
53621B88203N84N92Q55J219J565J975K680L598M120L744K960K938M013N045M805
$$ 288203 288787 289379 290234 291453 293018 294993 297673 301271 305391 309135 312095 315033 319046 324091 328896
53606C28896L480K207J567J285J184J454J981K241K072J858J840J727J203L45
$$ 328896 332376 334583 336150 337435 338619 340073 342054 344295 346367 348225 350065 351792 352995 353340
53592C53340n52j161j166o07j06k44p53r26o89n21m76j55K95K03l71m25N06J592
$$ 353340 352788 351627 350461 349854 349748 349504 348751 347825 347136 346615 346139 345984 346279 346482 346111 345686 346192 347784
53574C47784J937J754J647J518J006L97K35L57J15o70j599k371k919l046k527
$$ 347784 349721 351475 353122 354640 355646 356043 356278 356635 356750 356080 354481 352110 349191 346145 343618
53559C43618j576p48l34k06j11J21N78J155J545J540J237Q43N91Q15J750K963
$$ 343618 342042 341294 340960 340754 340643 340764 341342 342497 344042 345582 346819 347662 348253 349068 350818 353781
53543C53781L549L184K551K405K721L140L710M567N351N640N717O239P326Q535
$$ 353781 357330 360514 363065 365470 368191 371331 375041 379608 384959 390599 396316 402555 409881 418416
53529D18416R562J0414J1000J1181J1115J1215J1667J2397J3247J3923J4067J3825
$$ 418416 427978 438392 449392 460573 471688 482903 494570 506967 520214 534137 548204 562029
53517E62029J4021J5215J6938J8461J9848K1557K3288K4242K4384K4505K4960
$$ 562029 576050 591265 608203 626664 646512 668069 691357 715599 739983 764488 789448
53506G89448K5258K5035K4570K4079K3325K2262K1322K0759K0327J9906J9768
$$ 789448 814706 839741 864311 888390 911715 933977 955299 976058 996385 1016291 1036059
53495A036059J9903J9813J9361J9161J9514J9701J8943J7600J6648J6433J6544
$$ 1036059 1055962 1075775 1095136 1114297 1133811 1153512 1172455 1190055 1206703 1223136 1239680
53484A239680J6634J6546J5916J4489J2763J1627J1271J1076J0513R582Q313O530
$$ 1239680 1256314 1272860 1288776 1303265 1316028 1327655 1338926 1350002 1360515 1370097 1378410 1384940
53472A384940M331K211L71j678m439p684j0639j2779j4205j5388j6734j8181j9136
$$ 1384940 1389271 1391482 1391853 1390175 1385736 1378052 1367413 1354634 1340429 1325041 1308307 1290126 1270990
53459A270990j9035j8158j7597j8170j9582k0865k1464k1517k1284k0797k0096
$$ 1270990 1251955 1233797 1216200 1198030 1178448 1157583 1136119 1114602 1093318 1072521 1052425
53448A052425j9460j9182j9255j9355j8997j7793j5828j3802j2385j1392r916
$$ 1052425 1032965 1013783 994528 975173 956176 938383 922555 908753 896368 884976 875060
53437H75060p553n107l653l193k684j351N54K352L818N167O527P758Q764R767
$$ 875060 867507 862400 858747 855554 852870 851519 852073 854425 858243 863410 869937 877695 886459 896226
53423H96226J1145J3027J5006J6397J6989J7402J8395J9960K1424K2496K3636
$$ 896226 907371 920398 935404 951801 968790 986192 1004587 1024547 1045971 1068467 1092103
53412A092103K5263K7117K8786L0401L2385L4741L7086L9127M0776M1993M2967
$$ 1092103 1117366 1144483 1173269 1203670 1236055 1270796 1307882 1347009 1387785 1429778 1472745
53401A472745M4259M6266M8632N0605N1820N2391N2467N2317N2611N3811N5259
$$ 1472745 1517004 1563270 1611902 1662507 1714327 1766718 1819185 1871502 1924113 1977924 2033183
53390B033183N5639N4592N3096N2052N1095M9354M6688M3642M0613L7719L5083
$$ 2033183 2088822 2143414 2196510 2248562 2299657 2349011 2395699 2439341 2479954 2517673 2552756
53379B552756L2640K9785K5855K0894J5566J0444N797J825j577n200j0022j6149
$$ 2552756 2585396 2615181 2641036 2661930 2677496 2687940 2693737 2695562 2693985 2688785 2678763 2662614
53367B662614k2722k8980l4942m0824m6378n1086n4698n7217n8647n9078n8809
$$ 2662614 2639892 2610912 2575970 2535146 2488768 2437682 2382984 2325767 2267120 2208042 2149233
53356B149233n8040n6688n4809n3016n1920n1246m9986m7700m5161m3507m3005
$$ 2149233 2091193 2034505 1979696 1926680 1874760 1823514 1773528 1725828 1680667 1637160 1594155
53345A594155m3038m2948m2468m1452l9772l7682l5765l4204l2480l0114k7397
$$ 1594155 1551117 1508169 1465701 1424249 1384477 1346795 1311030 1276826 1244346 1214232 1186835
53334A186835k4937k2712k0229j7533j5409j4330j3780j2931j1667j0519r870
$$ 1186835 1161898 1139186 1118957 1101424 1086015 1071685 1057905 1044974 1033307 1022788 1012918
53323A012918r562r179q451p440o459n683m824l514k040j176j059p84M25K245
$$ 1012918 1003356 994177 985726 978286 971827 966144 961320 957806 955766 954590 953531 952747 953172 955417
53309I55417M008N871Q318J0861J2361J2697J3061J4315J6012J7446J8750K0343
$$ 955417 959425 965296 973614 984475 996836 1009533 1022594 1036909 1052921 1070367 1089117 1109460
53297A109460K1955K3011K3586K4234K5122K5935K6458K6711K6662K6309K5875
$$ 1109460 1131415 1154426 1178012 1202246 1227368 1253303 1279761 1306472 1333134 1359443 1385318
53286A385318K5401K4339K2116J9058J6156J4007J2411J0932R255P028L974L30
$$ 1385318 1410719 1435058 1457174 1476232 1492388 1506395 1518806 1529738 1538993 1546021 1549995 1550325
53274A550325l312o697r947j2913j5111j6543j7935j9827k1870k3463k4626k5784
$$ 1550325 1547013 1540316 1530369 1517456 1502345 1485802 1467867 1448040 1426170 1402707 1378081 1352297
53262A352297k7004k7980k8654k9331l0192l0991l1363l1204l0687l0011k9188
$$ 1352297 1325293 1297313 1268659 1239328 1209136 1178145 1146782 1115578 1084891 1054880 1025692
53251A025692k8119k6933k6101k5973k6240k6268k5879k5366k4756k3670k2203
$$ 1025692 997573 970640 944539 918566 892326 866058 840179 814813 790057 766387 744184
53240G44184k1228k1272k1607k1092j9613j7942j6467j4865j3004j1323j0085
$$ 744184 722956 701684 680077 658985 639372 621430 604963 590098 577094 565771 555686
53229E55686q933p574o391o011o492p317p988q389q685r111r728j0257j0273r659
$$ 555686 546753 539179 532788 526777 520285 512968 504980 496591 487906 478795 469067 458810 448537 438878
53215D38878q772q057p673p553p576p589p441p178p045p103p000o319n128m007
$$ 438878 430106 422049 414376 406823 399247 391658 384217 377039 369994 362891 355891 349572 344444 340437
53201C40437l554l897m626n158n276n281n543n924n884n170m104l161k483k040
$$ 340437 336883 332986 328360 323202 317926 312645 307102 301178 295294 290124 286020 282859 280376 278336
53187B78336j919k195k650k883k722k292j780j312r83q08o37l18P1K80J60k63
$$ 278336 276417 274222 271572 268689 265967 263675 261895 260583 259600 258792 258155 257837 257908 258188 258348 258085
53171B58085r48j789k433k445j836j164q71p17j51P80J322R05j85j209j762j905
$$ 258085 257137 255348 252915 250470 248634 247470 246599 245882 245731 246511 247833 248738 248553 247344 245582 243677
53155B43677j732j319r78j047j311j134l91J13l92j545k179j622l46O89R75P28
$$ 243677 241945 240626 239648 238601 237290 236156 235765 235878 235486 233941 231762 230140 229794 230483 231458 232186
53139B32186M23K46k8n83j051p85K55J285J650J576J553J450Q47k7o04j000j838
$$ 232186 232609 232855 232827 232244 231193 230408 230663 231948 233598 235174 236727 238177 239024 238997 238393 237393 235555
53122B35555k941l166j920n9J201J641J746J732J507J143P55J99m79p28k98l2
$$ 235555 232614 229448 227528 227469 228670 230311 232057 233789 235296 236439 237194 237393 236914 236186 235888 235856
53106B35856r39k617l481k749j341n45m88m39n3K95J85l18q31r78o16J5M30L86
$$ 235856 234917 232300 228819 226070 224729 224184 223696 223257 223204 223499 223684 223366 222535 221557 220941 220956 221386 221772
53088B21772J98L41P59Q92M29k34m70k19L3n0k99m75p10j195j615j377m02O32
$$ 221772 221970 222311 223070 223962 224391 224157 223687 223468 223501 223451 223152 222677 221967 220772 219157 217780 217378 218010
53070B18010J003O54P4l34n89r36j449j786j430l44O87P40j60j042j154p71n68
$$ 218010 219013 219667 219741 219407 218818 217882 216433 214647 213217 212873 213560 214300 214140 213098 211944 211173 210605
53053B10605o36n42j06L45M68K96J18J81M61O72N69K30r3l95q14j126q36j9M87
$$ 210605 209969 209427 209321 209666 210134 210430 210548 210729 211190 211862 212431 212661 212568 212173 211359 210233 209397 209378 209865
53034B09865J12o92j222j466j739j763j011K79J237J495J390J044J79r57j336
$$ 209865 209977 209285 208063 206597 204858 203095 202084 202363 203600 205095 206485 207529 207708 206751 205415
53019B05415l84J093J791J359N11k7j89l15o24r71r39k99N73R05L53n40r66p18
$$ 205415 205031 206124 207915 209274 209785 209758 209569 209254 208630 207659 206720 206421 206994 207899 208252 207712 206746 206028
53001B06028k49M0K81P91J514J954J770J225Q62P88N76j6o62j003j179j395j358
$$ 206028 205779 205819 206100 206891 208405 210359 212129 213354 214216 215004 215580 215564 214902 213899 212720 211325 209967
52984B09967p19J79O58P45J037J553J551P34j30k94m1j4j22J71Q16J219J223J303
$$ 209967 209248 209427 210085 210830 211867 213420 214971 215705 215575 215281 215240 215226 215104 215275 216091 217310 218533 219836
52966B19836J701K013J823J372J207J388J378P76j19o28n52m65r39j737k113j856
$$ 219836 221537 223550 225373 226745 227952 229340 230718 231494 231375 230747 230195 229730 228791 227054 224941 223085
52950B23085j528j599j896k060k079j981j480m73M54N83K8m31m23k76k52r4L84
$$ 223085 221557 219958 218062 216002 213923 211942 210462 209989 210443 211026 211054 210623 210200 209924 209672 209578 209962
52933B09962P85N90p0n35l80J80O22N94J00n82j060j037n26J18M66L59K1k34l45
$$ 209962 210747 211337 211267 210732 210352 210532 211154 211748 211848 211266 210206 209169 208643 208761 209227 209586 209607 209373 209028
52914B09028m75o71o80k59M15Q11O07O5k76k27j46m47j085j628j800j712j526
$$ 209028 208553 207882 207202 206943 207358 208169 208776 208841 208565 208338 208192 207745 206660 205032 203232 201520 199994
52897A99994j209o68K7P17J282J583J470J106R84J317J577J101R1n58m21r3k92
$$ 199994 198785 198117 198144 198861 200143 201726 203196 204302 205286 206603 208180 209281 209372 208814 208393 208300 208008
52880B08008q68j056n48J22K57j74n34k29O82J647K245K445K312J877J398J393
$$ 208008 207140 206084 205536 205658 205915 205741 205207 204978 205660 207307 209552 211997 214309 216186 217584 218977
52864B18977J983K601K664K333K073J779R90j88j094j441j545j605j449j133j126
$$ 218977 220960 223561 226225 228558 230631 232410 233400 233212 232118 230677 229132 227527 226078 224945 223819
52849B23819j580k101k387k534k482j914j074q82j730k827l281l168k934k372
$$ 223819 222239 220138 217751 215217 212735 210821 209747 208865 207135 204308 201027 197859 194925 192553
52835A92553j127L30J137J251J361J741J955J687J234J015J150J511J750J380
$$ 192553 191426 191756 192893 194144 195505 197246 199201 200888 202122 203137 204287 205798 207548 208928
52821B08928K48j094j852j769j110j85O92J088Q63N74Q63J619K230K502K684K774
$$ 208928 209176 208082 206230 204461 203351 203166 203858 204946 205809 206383 207246 208865 211095 213597 216281 219055
52805B19055K504J877J100L7j534l154l956l745l180k797k525k181j757j199o00
$$ 219055 221559 223436 224536 224573 223039 219885 215929 212184 209004 206207 203682 201501 199744 198545 197945
52790A97945n28j340k122j470M85J914J605M45j22rl7l57m44k16m8N2M02Q81J021
$$ 197945 197417 196077 193955 192485 192970 194884 196489 196934 196812 196803 196766 196409 195965 195749 195701 195753 196155 197036 198057
52771A98057Q18O78O38L14k64n61l82j63j73rO48J306J152R3j085j556j173l23
$$ 198057 198875 199553 200191 200505 200241 199680 199298 199135 198962 198953 199601 200907 202059 202152 201067 199511 198338 198015
52753A98015N72J225J371Q59Jm84k17L49N00K12Qj6k95p83n96P07K205K653K153
$$ 198015 198587 199812 201183 202042 202043 201559 201342 201691 202191 202403 202411 202395 202100 201317 200721 201428 203633 206286 208439
52734B08439J857K244K579K211J558J358J559J497Q62Qn46o04l95m28j085k109
$$ 208439 210296 212540 215119 217330 218888 220246 221805 223302 224164 224172 223626 223022 222627 222199 221114 219005
52718B19005k632k086r58k75l65n89m21k59p04j462j674j241j005j396j664r83
$$ 219005 216373 214287 213329 213054 212689 212100 211679 211420 210716 209254 207580 206339 205334 203938 202274 201291
52702B01291K05Q03N88L06L47L13K8oL85M73k70j139j099l00K34K18M27J323K246
$$ 201291 201496 202299 202887 203193 203540 203853 203881 203875 204260 204733 204463 203324 202225 201925 202159 202377 202804 204127 206373
52683B06373K348J704J008O01L06oj62m7J45J50j4p9Q4K39R1k29j94M61J305J666
$$ 206373 208721 210425 211433 212034 212340 212334 212172 212125 212270 212420 212406 212327 212411 212650 212741 212512 212318 212779 214084 215750
52663B15750J420J059R84J069J000P91O83P06N61J20j79K99J598K880L198K395
$$ 215750 217170 218229 219213 220282 221282 222073 222756 223462 224023 224143 223964 224263 225861 228741 231939 234334
52647B34334J066k62j470k433k742k207j283o18l98m89q86j549j931j333J13J316
$$ 234334 235400 235138 233668 231235 228493 226286 225003 224385 223987 223498 222612 221063 219132 217799 217912 219228
52631B19228J328L27p17j062o56J82J170K074K545K225J096k75j125j168q14n95
$$ 219228 220556 220883 220166 219104 218448 218630 219800 221874 224419 226644 227740 227465 226340 225172 224358 223763
52615B23763n75m14M7N85Q43N75k00j055j296o49L06O79K98j88k48q5j59n14q21
$$ 223763 223188 222774 222821 223406 224249 224824 224624 223569 222273 221624 221930 222609 222907 222719 222471 222386 222227 221713 220892
52596B20892q23m49K06Q29J008P29N34Q68J432J528R76L17O1R8l5n14j029j119
$$ 220892 220069 219620 219826 220655 221663 222392 222926 223794 225226 226754 227730 228047 228108 228206 228171 227657 226628 225509
52578B25509n70M03J250J462J043N31M46P06P67L60j63l71l57n53j029j403j447
$$ 225509 224939 225342 226592 228054 229097 229628 230074 230780 231547 231907 231744 231373 231016 230463 229434 228031 226584
52561B26584j330j163p26L3O47O83M09L62N44N06J78p5j61m18q71r93m80K19N30
$$ 226584 225254 224091 223365 223398 224045 224728 225137 225499 226043 226549 226727 226652 226491 226073 225202 224209 223729 223948 224478
52542B24478M22J42k37n78m18L88J102Q65j38q71p53j75L20O20P45N23k5m84n14
$$ 224478 224900 225042 224805 224227 223809 224197 225299 226164 226026 225155 224402 224227 224547 225167 225912 226435 226410 225926 225412
52523B25412k65j8K56O08P97N71J45j5K08N04O41P40J030J562K130K454K416K226
$$ 225412 225147 225129 225385 225993 226790 227361 227506 227491 227699 228203 228844 229584 230614 232176 234306 236760 239176 241402
52505B41402K199K321K182J475L50q41j905k637k713k121j478j351j429r82j09
$$ 241402 243601 245922 248104 249579 249929 249088 247183 244546 241833 239712 238234 236883 235454 234472 234363
52490B34363K60k32p28l82M17P22M87N01J009J299Q38J56J26P98J441J520J179
$$ 234363 234623 234391 233663 233281 233698 234420 234907 235408 236417 237716 238554 238710 238836 239634 241075 242595 243774
52473B43774Q27O43N93O70Q70J033R03M50M5K39J227K528L378L408K901K299J648
$$ 243774 244601 245244 245837 246507 247377 248410 249313 249763 249808 250047 251274 253802 257180 260588 263489 265788 267436
52456B67436O94n14j463j773j742j977k556k916k687k251k132k158j719p51P7
$$ 267436 268130 267616 266153 264380 262638 260661 258105 255189 252502 250251 248119 245961 244242 243491 243568
52441B43568L12K36K16N6n17j127j138o00j88k04k68o6R2k09p83j021o22P9M71
$$ 243568 243880 244116 244332 244388 243871 242744 241606 241006 240818 240614 240346 240280 240372 240163 239380 238359 237737 237816 238287
52422B38287K80j10m4N69J000O12j16r1Q52J617J350O69Q41K204L993N429O352
$$ 238287 238567 238457 238413 238982 239982 240594 240478 240387 241239 242856 244206 244875 245716 247920 251913 257342 263694
52405B63694O939P435Q106Q904R134P980N496K569j81k880n603p703q444p952
$$ 263694 270633 278068 286174 295078 304212 312192 317688 320257 320076 317196 311593 303890 295446 287494
52391B87494p021o153n185l875k355r88n4K97J15k49l33n2K07J27k7K55J008J696
$$ 287494 280473 274320 269135 265260 262905 261917 261863 262160 262275 262026 261693 261641 261848 261975 261948 262203 263211 264907
52373B64907J913J874K042K486K895L085L203L310L187K620J767R47K69l49q17
$$ 264907 266820 268694 270736 273222 276117 279202 282405 285715 288902 291522 293289 294236 294505 294156 293339
52358B93339q43l51K50L99k6n95q20p02o11o89n83J05J210K111K409K311K276
$$ 293339 292496 292145 292395 292794 292768 292173 291353 290651 290040 289351 288768 288873 290083 292194 294603 296914 299190
52341B99190K500K805K916K777K655K922L610M291M598M791N401O361P025P192
$$ 299190 301690 304495 307411 310188 312843 315765 319375 323666 328264 333055 338456 344817 351842 359034
52327C59034P539Q559R633R829R358R426J0571J1878J2165J1442J0641J0298J0063
$$ 359034 366573 375132 384765 394594 403952 413378 423949 435827 447992 459434 470075 480373 490436
52314D90436R532R010R148J0018J0962J1393J1433J1523J1599J1170J0217R518
$$ 490436 499968 508978 518126 528144 539106 550499 561932 573455 585054 596224 606441 615959
52302F15959R660J0164J0054R135Q196P933Q160Q231P763O764N307L458J442l68
$$ 615959 625619 635783 645837 654972 663168 671101 679261 687492 695255 702019 707326 710784 712226 711858
52288G11858j678k489l105l795m416m506l949l359l348l550k923j192N87J272
$$ 711858 710180 707691 704586 700791 696375 691869 687920 684561 681213 677663 674740 673548 674135 675407
52274F75407J037R76J607K419K881L263M086N259O221O719O979P164P132O842
$$ 675407 676444 677420 679027 681446 684327 687590 691676 696935 703156 709875 716854 724018 731150 737992
52260G37992O597O676O989P423Q228R560J0826J1040R973Q566P940Q274Q841Q782
$$ 737992 744589 751265 758254 765677 773905 783465 794291 805331 815304 823870 831810 840084 848925 857707
52246H57707P667N647L384J602M52n12j540k235k290k210k769l888m715m766m446
$$ 857707 865374 871021 874405 876007 876459 875947 874407 872172 869882 867672 864903 861015 856300 851534 847088
52231H47088m372m618m792m524l790l002k709l003l295l001k304j772j444q85
$$ 847088 842716 838098 833306 828782 824992 821990 819281 816278 812983 809982 807678 805906 804462 803577
52217H03577q0M88P08J074J802K370K271J735J349J468K246L669N180N808N199
$$ 803577 803497 803985 804693 805767 807569 809939 812210 813945 815294 816762 819008 822677 827857 833665 838864
52202H38864M159L712L920M087L782L130K423J971K135K946L830M136L870L532
$$ 838864 843023 846735 850655 854742 858524 861654 864077 866048 868183 871129 874959 879095 882965 886497
52188H86497L419L438L443L247K470R21r25k264k872l284m101n345o506p026o835
$$ 886497 889916 893354 896797 900044 902514 903435 902510 900246 897374 894090 889989 884644 878138 871112 864277
52173H64277o545o848p481p212n329k760j117q79j169j126o66K9Q87J640J858
$$ 864277 857732 850884 843403 836191 830862 828102 826985 826106 824937 823811 823145 823174 824061 825701 827559
52158H27559J645J660K153K558K308J586Q71K68k72n20k62K38N91Q80J458K224
$$ 827559 829204 830864 833017 835575 837883 839469 840340 840608 840336 839816 839554 839792 840383 841263 842721 844945
52142H44945K584K160J212K74m45j123j879k433k349j629p58J7J091K804M629
$$ 844945 847529 849689 850901 851175 850730 849607 847728 845295 842946 841317 840559 840576 841667 844471 849100
52127H49100N774O450P756J0132J2714J4524J5608J6523J7393J8064J8660J9270
$$ 849100 854874 861324 869080 879212 891926 906450 922058 938581 955974 974038 992698 1011968
52115A011968J9460J8840J7822J7099J6552J5425J3522J1501R956Q856P950P133
$$ 1011968 1031428 1050268 1068090 1085189 1101741 1117166 1130688 1142189 1152145 1161001 1168951 1176084
52103A176084O292N329M499M193M263M087L455K827K536K282J695R37K64n59j995
$$ 1176084 1182376 1187705 1192204 1196397 1200660 1204747 1208202 1211029 1213565 1215847 1217542 1218479 1218743 1218184 1216189
52088A216189m101o490q736j0526j1652j2125j2145j1735j0646q824o670m613
$$ 1216189 1212088 1205598 1196862 1186336 1174684 1162559 1150414 1138679 1128033 1119209 1112539 1107926
52076A107926k716j024P1K64o1j03N68J805L298M814O133P147P903Q353Q197P358
$$ 1107926 1105210 1104186 1104257 1104521 1104460 1104357 1104925 1106730 1110028 1114842 1120975 1128122 1136025 1144378 1152575 1159933
52060A159933O295N494M820L970L276L365M092M585M434M065L776L132J757lj654
$$ 1159933 1166228 1171722 1176542 1180512 1183788 1187153 1191245 1195830 1200264 1204329 1208105 1211237 1212994 1212991 1211337
52045A211337l266n073o806q042q839r464r754r436q817q504q476q093p120o118
$$ 1211337 1208071 1202998 1196192 1188150 1179311 1169847 1160093 1150657 1141840 1133336 1124860 1116767 1109647 1103529
52031A103529n663n697n810n761n461m867m203l996m572n663o727p431p653p298
$$ 1103529 1097866 1092169 1086359 1080598 1075137 1070270 1066067 1062071 1057499 1051836 1045109 1037678 1030025 1022727
52017A022727o464n645n385n641n848n667n422n573o047o436o776p618r139j0722
$$ 1022727 1016263 1010618 1005233 999592 993744 988077 982655 977082 971035 964599 957823 950205 941066 930344
$$ [...]
##END NTUPLES=NMR SPECTRUM
##END=
