
##TITLE=UV1212_M4_1332-1205_7185202_V5d4kNJXSd
##JCAMPDX= 6.0         $$ Bruker NMR JCAMP-DX V2.0
##DATA TYPE= NMR SPECTRUM
##DATA CLASS= NTUPLES
##ORIGIN= BRUKER
##OWNER= Administrator
$$ 1.72 TOPSPIN		Version 2.1
$$ 2012-12-06 03:37:05.569 -0500  Administrator@X
$$ Compression mode = diff/dup
##.OBSERVE FREQUENCY= 400.02188249412
##.OBSERVE NUCLEUS= ^1H
##.ACQUISITION MODE= SIMULTANEOUS (DQD)
##.ACQUISITION SCHEME= undefined
##.AVERAGES= 8
##.DIGITISER RES= 22
##SPECTROMETER/DATA SYSTEM= spect
##.PULSE SEQUENCE= zg30
##.SOLVENT NAME= COFFEE_meoh
##.SHIFT REFERENCE= INTERNAL, COFFEE_meoh, 1, 14.98509
##AUDIT TRAIL= $$ (NUMBER, WHEN, WHO, WHERE, PROCESS, VERSION, WHAT)
$$ ##TITLE= Audit trail, TOPSPIN		Version 2.1
$$ ##JCAMPDX= 5.01
$$ ##ORIGIN= Bruker BioSpin GmbH
$$ ##OWNER= Administrator
$$ $$ E:\/data/COFFEE/nmr/UV1212_M4_1332-1205_7185202_V5d4kNJXSd/10/pdata/1/auditp.txt
$$ ##AUDIT TRAIL=  $$ (NUMBER, WHEN, WHO, WHERE, PROCESS, VERSION, WHAT)
(   1,<2012-12-06 03:36:57.350 -0500>,<Administrator>,<X>,<go>,<TOPSPIN 2.1>,
      <created by zg
	started at 2012-12-06 03:35:50.757 -0500,
	POWCHK enabled, PULCHK disabled,
       configuration hash MD5:
       86 BA 57 50 F2 9D 5C 9B 26 00 A9 28 5F 66 2E 89
       data hash MD5: 64K
       A3 0C E0 0C 09 67 1A 1A 38 84 AF 93 B3 67 DB 48>)
(   2,<2012-12-06 03:37:00.491 -0500>,<Administrator>,<X>,<proc1d>,<TOPSPIN 2.1>,
      <Start of raw data processing
       efp LB = 0 FT_mod = 6 PKNL = 1 PHC0 = 0 PHC1 = 0 SI = 32K 
       data hash MD5: 32K
       55 3D A9 08 64 5A B6 0D 23 96 8F 68 F2 85 C2 B7>)
(   3,<2012-12-06 03:37:00.960 -0500>,<Administrator>,<X>,<proc1d>,<TOPSPIN 2.1>,
      <pk PHC0 = 97.69592 PHC1 = 0 
       data hash MD5: 32K
       B3 3B 53 84 93 EC 2B 66 38 CF 67 25 7B 94 4A 36>)
(   4,<2012-12-06 03:37:01.210 -0500>,<Administrator>,<X>,<proc1d>,<TOPSPIN 2.1>,
      <abs ABSG = 1 
       data hash MD5: 32K
       20 9C 55 9D F1 3F DA 88 8D 71 73 84 9A 71 8E 54>)
(   5,<2012-12-06 03:37:01.350 -0500>,<Administrator>,<X>,<proc1d>,<TOPSPIN 2.1>,
      <abs ABSG = 2 
       data hash MD5: 32K
       98 08 E0 C6 D3 FD 9B 93 85 80 65 D9 AA 4E 12 86>)
(   6,<2012-12-06 03:37:01.507 -0500>,<Administrator>,<X>,<proc1d>,<TOPSPIN 2.1>,
      <abs ABSG = 3 
       data hash MD5: 32K
       FC 97 4B 8D A1 7C 60 63 51 43 54 AF 4C EB 5B F5>)
(   7,<2012-12-06 03:37:01.647 -0500>,<Administrator>,<X>,<proc1d>,<TOPSPIN 2.1>,
      <abs ABSG = 4 
       data hash MD5: 32K
       B5 7E 6C EE 62 E3 CB 3B 8F 46 35 FD 43 7A 9B FA>)
(   8,<2012-12-06 03:37:01.803 -0500>,<Administrator>,<X>,<proc1d>,<TOPSPIN 2.1>,
      <abs ABSG = 5 
       data hash MD5: 32K
       7C 69 F0 1B C4 33 AC 1B 36 24 D1 06 EE FA D7 B3>)
$$ ##END=
$$ 
$$ $$ hash MD5
$$ $$ 43 7E 82 0D 1C A9 45 2F E6 86 A3 5F 37 8D 3B F1
##$RELAX= 
##$RELAX= 
##$RELAX= 
##$RELAX= 
##$RELAX= 
##$RELAX= 
##$RELAX= 
$$ Bruker specific parameters
$$ --------------------------
##$DU= <E:\>
##$EXPNO= 10
$$ [...]
##$TP= (0..7)
150 150 150 150 150 150 150 150
##$TP07= 0
##$TPNAME0= <>
##$TPNAME1= <>
##$TPNAME2= <>
##$TPNAME3= <>
##$TPNAME4= <>
##$TPNAME5= <>
##$TPNAME6= <>
##$TPNAME7= <>
##$TPOAL= (0..7)
0.5 0.5 0.5 0.5 0.5 0.5 0.5 0.5
##$TPOFFS= (0..7)
0 0 0 0 0 0 0 0
##$TUNHIN= 0
##$TUNHOUT= 0
##$TUNXOUT= 0
##$USERA1= <user>
##$USERA2= <user>
##$USERA3= <user>
##$USERA4= <user>
##$USERA5= <user>
##$V9= 5
##$VALIST= <valist>
##$VCLIST= <CCCCCCCCCCCCCCC>
##$VD= 0
##$VDLIST= <DDDDDDDDDDDDDDD>
##$VPLIST= <PPPPPPPPPPPPPPP>
##$VTLIST= <TTTTTTTTTTTTTTT>
##$WBST= 1024
##$WBSW= 4
##$XGAIN= (0..3)
0 0 0 0
##$XL= 0
##$YL= 0
##$YMAX_a= 680161
##$YMIN_a= -578744
##$ZGOPTNS= <>
##$ZL1= 120
##$ZL2= 120
##$ZL3= 120
##$ZL4= 120
##$ABSF1= 14.98509
##$ABSF2= -5.573092
##$ABSG= 5
##$ABSL= 3
##$ALPHA= 0
##$AQORDER= 0
##$ASSFAC= 0
##$ASSFACI= 0
##$ASSFACX= 0
##$ASSWID= 0
##$AUNMP= <proc_prof1d_extract_pilot.lims>
##$AXLEFT= 0
##$AXNAME= <>
##$AXNUC= <1H>
##$AXRIGHT= 0
##$AXTYPE= 0
##$AXUNIT= <>
##$AZFE= 0.1
##$AZFW= 0.1
##$BCFW= 0
##$BC_mod= 0
##$BYTORDP= 0
##$COROFFS= 0
##$CY= 15
##$DATMOD= 1
##$DC= 0
##$DFILT= <>
##$DTYPP= 0
##$F1P= 0
##$F2P= 0
##$FCOR= 0.5
##$FTSIZE= 32768
##$FT_mod= 6
##$GAMMA= 0
##$GB= 0
##$INTBC= 1
##$INTSCL= 1
##$ISEN= 128
##$LB= 0
##$LEV0= 0
##$LPBIN= 0
##$MAXI= 10000
##$MC2= 0
##$MEAN= 0
##$ME_mod= 0
##$MI= 0
##$NCOEF= 0
##$NC_proc= -8
##$NLEV= 6
##$NOISF1= 0
##$NOISF2= 0
##$NSP= 0
##$NTH_PI= 0
##$NZP= 0
##$OFFSET= 14.98509
##$PC= 1
##$PHC0= 97.69592
##$PHC1= 0
##$PH_mod= 1
##$PKNL= yes
##$PPARMOD= 0
##$PPDIAG= 0
##$PPIPTYP= 0
##$PPMPNUM= 2147483647
##$PPRESOL= 1
##$PSCAL= 4
##$PSIGN= 0
##$PYNMP= <proc.py>
##$REVERSE= no
##$SF= 400.02
##$SI= 32768
##$SIGF1= 0
##$SIGF2= 0
##$SINO= 400
##$SIOLD= 32768
##$SPECTYP= <>
##$SREGLST= <1H.CDCl3>
##$SSB= 0
##$STSI= 32768
##$STSR= 0
##$SW_p= 8223.68421052631
##$SYMM= 0
##$S_DEV= 0
##$TDeff= 65536
##$TDoff= 0
##$TI= <>
##$TILT= no
##$TM1= 0
##$TM2= 0
##$TOPLEV= 0
##$USERP1= <user>
##$USERP2= <user>
##$USERP3= <user>
##$USERP4= <user>
##$USERP5= <user>
##$WDW= 1
##$XDIM= 32768
##$YMAX_p= 478486298
##$YMIN_p= -680627
##$CURPLOT= <Network HP LaserJet P1505>
##$CURPRIN= <$Network HP LaserJet P1505>
##$DFORMAT= <normdp>
##$LAYOUT= <+/1D_H.xwp>
##$LFORMAT= <normlp>
##$PFORMAT= <normpl>
##$SURQMSG= 1
$$ End of Bruker specific parameters
$$ ---------------------------------
##NTUPLES= NMR SPECTRUM
##VAR_NAME=  FREQUENCY,     SPECTRUM/REAL,   SPECTRUM/IMAG
##SYMBOL=    X,             R,               I
##VAR_TYPE=  INDEPENDENT,   DEPENDENT,       DEPENDENT
##VAR_FORM=  AFFN,          ASDF,            ASDF
##VAR_DIM=   32768,         32768,           32768
##UNITS=     HZ,            ARBITRARY UNITS, ARBITRARY UNITS
##FACTOR=    0.250966925370066, 1,           1
##FIRST=     8223.43324360094, -185974,      25608
##LAST=      0,             96604,           -34293
##MIN=       0,             -680627,         0
##MAX=       8223.43324360094, 478486298,    0
$$ Real data points
##PAGE= N=1
##DATA TABLE= (X++(R..R)), XYDATA
$$ [...]
$$ plain form
19531 148908 84561 -117855 25576 99411 -250120 -209356 -333465 -138133 -285564 17037
19520 -143425 64228 1307 -355642 -191900 156983 156002 -41414 68747 -227552 33678 -155201
19508 -40199 -241662 311260 204554 73310 171050 -208479 -172652 -248751 -133381 -73084 113842
19496 854 -54868 202360 -188851 17981 -309782 7581 -114436 -109937 -188390 56435 -218883
19484 -248806 49177 -282582 -284226 -272368 141904 -487320 65370 -172330 1422 -232350 -219184
19473 -219184 -119636 194202 -122581 65046 -259752 47147 -10354 75320 271610 -380469
19462 -225404 -161225 -217679 -209605 -173361 105343 -146317 261381 -127359 94191 -178390 172145
19450 103328 -78938 234781 -125929 -5666 -174927 -204009 224220 -136070 -240809 -136093
$$ packed form
19531A48908o4347a17855B5576P3835b50120M0764j24109a38133j47431A7037
19520a43425F4228A307c55642J63742A56983r81d1414F8747b27552C3678a55201
19508d0199k01463C11260j06706G3310R7740b08479L5827p6099J15370O0297A13842
19496H54e4868B02360a88851A7981c09782G581a14436M499p8453E6435b18883
19484b48806D9177b82582j644J1858A41904d87320F5370a72330A422b32350J3166
19473b19184R9548A94202a22581F5046b59752D7147a0354G5320J96290c80469
19462b25404O4179n6454Q074L6244A05343a46317B61381a27359I4191a78390A72145
19450A03328g8938B34781a25929e666j69261k9082B24220a36070j04739J04716
$$ plain form
19440 -136093 -19827 114192 -203425 58416 -74528 336497 229677 -258145 -60431 -150023
19430 -150023 128377 253970 -239944 315706 -158444 -9174 42310 -193016 -92693 -147136
19420 -147136 7652 -27617 -84011 -119310 -82981 -191587 -253319 -287637 -94639 -160408 -51282
19408 -156902 -193957 303044 -76272 -117657 -403858 -478984 4428 -72442 258095 -77579 -259759
19397 -259759 91156 282016 -187918 -573104 176852 17052 -17558 -345528 -254962 -317147
19387 -317147 -152264 -444692 41892 3432 125289 87363 -101876 -163787 59917 68724 342435
19376 342435 -119 -97151 -192786 31184 -226425 -29673 -140658 -121106 -236038 222940 -65628
19364 -46967 18084 -4486 -24572 -154403 -10355 232984 -257951 -251010 -477916 108893 146961
$$ packed form
19440a36093a9827A14192b03425E8416g4528C36497j06820b58145f0431q9592
19430a50023A28377J25593b39944C15706a58444i174D2310a93016i2693n4443
19420a47136G652b7617n6394l5299L6329j08606o1732l4318i4639o5769e1282
19408a56902l7055C03044g6272m1385k86201p5126D428g2442B58095g7579j82180
19397b59759I1156J90860a87918l85186A76852A7052a7558l27970R0566o2185
19387c17147a52264k92428D1892C432J21857l7926a01876o1911E9917Q807K73711
19376C42435a19r7032r5635C1184b26425b9673j10985J9552j14932B22940f5628
19364d6967A8084d486k0086j29831a0355B32984b57951O941k26906A08893L8068
$$ plain form
19353 146961 -32682 -240897 -20780 195612 63636 -201358 -255153 12593 -112872 382901
19342 160968 160575 211709 75208 -134797 296502 -73399 80813 171820 -352254 95578 153597
19331 153597 -2247 -210564 40047 -206012 -108483 -370849 28204 85035 412899 25437 160456
19320 160456 -44547 -99733 21301 -186138 -142734 -198189 -203882 121413 -249041 -98578 196615
19308 10976 16532 160107 -94282 169296 85309 190229 79650 147950 -214886 -401106 -142071
19296 137941 -119725 -277632 -76805 -79884 17462 -136821 74255 -43753 155067 30053 303677
19285 303677 5425 -211492 -85649 198530 202095 239025 -137097 -95536 18036 -328758 -115797
19273 -83660 51026 211641 213609 -284304 -314344 -396317 4024 -88341 197831 132856 83887
$$ packed form
19353A46961c2682k08215b0780A95612F3636b01358n3795A2593a12872C82901
19342A60968l93N1134G5208a34797B96502g3399H0813R1007c52254I5578N8019
19331A53597b247k08317D0047b06012R7529k62366B8204N6831L27864B5437J35019
19320A60456d4547n5186B1301a86138M3404n5455n693A21413b49041i8578A96615
19308A0976N556J43575i4282A69296q3987J04920G9650O8300b14886j86220a42071
19296A37941a19725j57907g6805l079A7462a36821G4255d3753A55067C0053K73624
19285C03677E425b11492h5649A98530L565L6930a37097M1561A8036c28758a15797
19273h3660E1026J60615J968b84304l0040q1973D024h8341A97831o4975m8969
$$ plain form
19262 83887 105743 91942 -343207 154540 22412 -12121 -379917 -160660 -259569 -228403 -53379
19250 -5921 -146488 132044 175816 274915 58808 -118168 -39842 -305506 -101259 -263758 -133873
19239 -133873 54697 -23380 -44330 148620 303123 449475 147303 143944 -170861 410992
19228 386337 -157039 230424 67655 100220 -174578 -14915 -56580 -15436 -16924 -128106 -208591
19217 -208591 -790 -45585 109907 -41477 -239426 24393 -221507 40065 -257272 -179027 -102573
19206 -102573 133458 -105246 35945 -18065 5929 -64594 105021 -52753 -44327 -66215 -6252
19194 -96516 -8646 233871 -54228 79844 -62691 -332744 249838 -282377 -94205 -138405 272795
19182 -100305 -85349 -20165 -96119 -253557 -288510 -213996 -364654 -78743 -47225 85496 -29690
$$ packed form
19262H3887K1856j3801c43207A54540B2412a2121l67796a60660r8909L1166e3379
19250e921j40567A32044M3772R9099E8808a18168c9842k65664a01259j62499J29885
19239a33873E4697b3380k0950A48620J54503J46352A47303l359a70861D10992
19228C86337a57039B30424F7655L2565a74578a4915m1665a5436j488j11182q0485
19217b08591g90m4795A09907d1477j97949B4393b21507D0065b57272P8245P6454
19206a02573A33458a05246C5945a8065E929f4594A05021e2753Q426k1888f252
19194i6516h646B33871e4228G9844f2691k70053B49838b82377i4205m4200B72795
19182a00305J4956b0165p5954j57438l4953P4514j50658g8743L1518H5496b9690
$$ plain form
19170 -157726 88018 -73580 236030 -18491 152992 -120173 -186624 -67736 -509745 -144613
19159 -254817 -43347 273794 -289390 -55582 -17446 -25179 -197902 -41263 -238593 -90048 -71007
19148 -71007 -155098 29372 -325512 258436 95336 -19399 -1566 -73559 -58178 116800 269279
19137 269279 -334793 12729 -118348 -38386 -299174 -40534 413623 19156 -263051 8828 49938
19126 49938 -40971 -123427 -122312 184439 294375 152689 258031 -412690 247406 -30546 -24752
19115 -24752 -71654 -26020 -266611 -34351 -212084 -258936 118064 135509 182582 5674 -42404
19103 -115414 -332223 -402361 65349 -197883 -114337 30820 -56489 -314821 68097 -158194 137533
19091 -65584 -102716 -156014 -69827 -144884 139879 -240375 -59507 -206759 98460 -91807 -247098
$$ packed form
19170a57726H8018g3580B36030a8491A52992a20173o6451f7736m42009a44613
19159b54817d3347B73794b89390e5582a7446p733j72723d1263j97330i0048J9041
19148g1007q4091B9372c25512B58436I5336a9399a566p1993J5381A16800J52479
19137B69279c34793A2729a18348c8386k60788d0534D13623A9156b63051H828M1110
19126D9938d0971q2456J115A84439J09936j41686J05342d12690B47406c0546N794
19115b4752m6902b6020k40591c4351j77733m6852A18064J7445M7073E674d2404
19103a15414k16809p0138F5349a97883Q3546C0820e6489k58332F8097a58194A37533
19091f5584l7132n3298f9827p5057A39879b40375e9507j47252I8460i1807j55291
$$ plain form
19080 -247098 -186399 -176975 157488 -678639 -38621 189374 188788 -207745 186375 137873 -21449
19068 42048 -445124 70097 218631 -299165 89582 -14191 111803 -158820 166360 133825
19058 133825 -37384 -186240 -199617 -240066 194686 -133257 72022 -119893 -61664 -310935
19048 -310935 172681 35216 -195756 -304924 1258 279166 12698 155712 19424 119543
19038 119543 -119904 -168018 304702 -232488 -199170 163760 41376 199371 -111498 115727
19027 197376 50475 -213693 -423201 99048 -233250 -117042 -281121 -135423 -89966 -298910
19017 -298910 257895 407417 -386922 22509 -61248 -140418 -143441 15959 49096 41104 -169075
19005 36536 -57540 -188022 -127542 -143397 -117121 499435 -259381 -256606 -97925 15632 -173856
$$ packed form
19080b47098O0699R424A57488f78639c8621A89374n86b07745A86375m8502b1449
19068D2048d45124G0097J48534b99165H9582a4191A11803a58820A66360l2535
19058A33825c7384j48856j3377m0449A94686a33257G2022a19893N8229k49271
19048c10935A72681C5216a95756j09168A258K77908A2698J43014A9424J00119
19038A19543a19904m8114C04702b32488L3318A63760D1376J57995a11498A15727
19027A97376E0475b13693k09508I9048b33250J16208j64079a35423M5457k08944
19017b98910B57895J49522c86922B2509f1248p9170l023A5959L3137p992a69075
19005C6536e7540j30482O0480j5855K6276D99435b59381K775i7925A5632a73856
$$ plain form
18993 277133 -258819 -292350 -36114 -13318 -116310 -65563 -187812 -174357 286933 334152 150452
18981 -20772 185883 -5283 -351696 -10235 9014 -212047 -252429 -65742 242636 -49370 220153
18969 -15051 60212 -35753 -4634 -146103 168643 -264402 230694 302940 -81042 -312829 -117378
18957 56994 -48766 92095 981 -354912 156880 -105557 515484 -61882 80352 453637 -172241
18945 183063 174479 -319258 -136163 98334 -271942 403685 50775 -160950 -115456 -211854 264640
18933 -98606 -182102 -115382 56888 424807 153985 10577 -45883 78390 8661 -114467 18513
18921 -229771 -92337 -252960 -149515 -96231 67914 -85593 9006 -19155 -129167 48507 28484
18910 28484 -270880 11715 62560 -925 37107 -55686 188228 -15750 85026 76887 505795 -393505
$$ packed form
18993B77133b58819l3531c6114a3318j02992N0747j22249J3455B86933M7219A50452
18981b0772A85883e283l46413a0235I014b12047m0382f5742B42636d9370B20153
18969a5051F0212c5753d634j41469A68643b64402B30694P2246h1042k31787a17378
18957E6994d8766I2095I81c54912A56880a05557E15484f1882H0352L73285a72241
18945A83063q584c19258a36163I8334b71942D03685E0775a60950M5494r6398B64640
18933i8606q3496O6720E6888L67919A53985A0577d5883G8390H661a14467A8513
18921b29771i2337j60623J03445N3284F7914h5593I006a9155j10012D8507k0023
18910B8484b70880A1715N0845i25C7107e5686A88228a5750H5026q139M28908c93505
$$ plain form
18897 4808 -272790 -220236 -74064 -259033 34400 -17133 268853 15624 -14282 -252494 -57572
18885 -88461 89461 -33134 164402 -122840 -287356 -228144 46665 -32312 3043 -29283 -168332
18874 -168332 -276796 -206593 -86793 -108140 42402 -241974 -100272 73828 -141627 46815 -39991
18862 158486 -170295 -162096 -197669 136099 65091 54648 -229444 -251099 -186228 41508 -23547
18850 262206 -162727 -218894 -206527 -2092 -32197 -151666 30206 197810 87287 210123 -343161
18838 140115 -371102 -27071 192349 -178141 -89032 62914 -42463 -121727 -195644 39251 -75219
18826 -243553 86095 -157196 43085 13042 -281344 67225 -86258 129746 11605 51503 229194
18815 229194 -24393 277769 -155215 374932 146794 156221 115179 114892 102299 210381 227019
$$ packed form
18897D808b72790N2554g4064j84969C4400a7133B68853A5624a4282k38212e7572
18885h8461H9461c3134A64402a22840j64516N9212D6665c2312C043b9283j39049
18874a68332j08464P0203h6793k1347D2402b41974a00272G3828a41627D6815c9991
18862A58486a70295Q199l5573A36099F5091j0443b29444k1655O4871D1508b3547
18850B62206a62727n6167J2367b092l0105j19469C0206J67604H7287J22836c43161
18838A40115c71102b7071A92349a78141h9032F2914d2463p9264p3917C9251g5219
18826b43553H6095a57196D3085A3042b81344F7225h6258A29746A1605L9898J77691
18815B29194b4393B77769a55215C74932A46794R427m1042k87j2593J08082J6638
$$ plain form
18804 227019 75749 -51464 -247897 59031 -102080 482841 -492649 179924 67387 -88777
18793 -291840 -53101 -58539 -145562 -166028 34065 -60351 -529414 -88490 -130783 -117067 -98299
18782 -98299 4057 130542 -177177 43209 -225057 29328 226223 -231403 139137 -95270 102124
18770 -101652 -50447 -316835 -161421 -2314 -24941 -170665 -152288 -286465 -52385 -39769 -329571
18759 -329571 -170808 -20781 -144980 -207034 -177304 -28205 -216358 -93533 -252375 -292083 -138816
18747 -100637 163190 76067 -283148 195071 -39122 85997 77771 62529 -469357 255146 74684
18735 -115392 -7068 -53782 -63456 -196175 189040 70961 -102077 -269686 109934 -151081 11281
18723 -46584 -320492 465574 -192632 -189607 -57267 -46403 -254938 -65666 -220103 44156 155833
$$ packed form
18804B27019G5749e1464j96433E9031a02080D82841d92649A79924F7387h8777
18793b91840e3101n438q7023k0466C4065f0351m69063h8490m2293J3716J8768
18782i8299D057J26485a77177D3209b25057B9328J96895b31403A39137i5270A02124
18770a01652e0447k66388J55414b314k2627j45724J8377j34177e2385J2616k89802
18759c29571J58763b0781j24199o2054K9730b8205j88153i3533j58842l9708a38816
18747a00637A63190G6067b83148A95071c9122H5997q226j5242d69357B55146G4684
18735a15392g068m6714r674j32719A89040G0961a02077j67609A09934a51081A1281
18723d6584k73908D65574a92632L025e7267J0864k08535f5666j54437D4156J11677
$$ plain form
18712 155833 -175896 -339051 97366 -115948 262953 -18285 -174999 208359 -145159 135202
18701 229930 -162854 171045 -48696 -118001 -28127 -228198 152692 -190665 -172433 -285370
18691 -285370 -22468 -93970 -57136 -26020 -67610 101794 -19518 208901 -24801 -213260 -200019
18680 -200019 -30463 -48584 60680 -229863 176066 -161404 156519 -41505 -58787 125132
18669 156558 -27830 136700 -299215 -242189 -242869 -21683 -219687 231924 -175907 28779 -305588
18657 -233147 25791 330508 -212249 -205629 52193 102334 108120 202819 -114275 -156918 71129
18645 -1958 -58967 -205981 130430 179527 224013 170744 -149807 -429280 73351 60617 249153
18634 249153 -195344 -6640 -24036 -113798 -63783 -386712 -241500 -101128 100908 -205725
$$ packed form
18712A55833a75896j63155I7366a15948B62953a8285j56714B08359a45159A35202
18701B29930a62854A71045d8696o9305b8127k00071A52692a90665J8232j12937
18691b85370b2468p1502L6834b6020m1590A01794a9518B08901b4801j88459J3241
18680b00019c0463j8121F0680b29863A76066a61404A56519d1505j7282A25132
18669A56558b7830A36700b99215N7026o80b1683j98004B31924a75907B8779c05588
18657b33147B5791L04717b12249O620E2193N0141N786R4699a14275m2643G1129
18645a958n7009j47014A30430M9097M4486n3269a49807k79473G3351j2734J88536
18634B49153a95344f640j7396q9762N0015l22929J45212a01128A00908b05725
$$ plain form
18623 137928 -123451 -227305 -98603 -320 -43151 -59460 -19806 -162559 -20174 121484 212640
18612 212640 72218 -345839 -516180 32161 195948 472443 80824 107963 -190521 25598
18601 149813 -111155 385322 39457 167777 -224263 -127137 -57161 -87745 -174433 109710
18590 -256993 3431 -110953 -16633 -164028 -430470 -156120 214890 -21823 -370085 -40069
18579 30382 -150148 -67296 -127276 -239649 188004 1591 110618 -96088 78681 -177987 -108727
18568 -108727 157277 117726 -245871 -198953 -51806 97377 -47973 -183528 17464 -186392 99467
18556 120755 29211 -115535 7711 -450189 -94891 284065 -12958 -159478 -38228 78147 45846
18545 45846 296062 -173834 62878 86328 100437 -91227 -64680 -214213 -263956 -72793 9086
$$ packed form
18623A37928a23451j03854i8603c20m2831j6309a9806j42753b0174A21484R1156
18612B12640G2218c45839j70341C2161J63787K76495H0824K7139a90521B5598
18601A49813a11155C85322C9457J28320b24263R7126e7161l0584q6688A09710
18590b56993C431a10953a6633j47395k66442a56120B14890b1823l48262d0069
18579C0382a50148f7296n9980j12373A88004A591J09027i6088G8681a77987O9260
18568a08727A57277l9551b45871M6918e1806I7377d7973j35555A7464a86392I9467
18556A20755B9211a15535G711d50189i4891B84065a2958j46520c8228G8147l2301
18545D5846K50216a73834F2878K3450J4109i1227K6547j49533m9743g2793I086
$$ plain form
18533 -119736 8183 -18204 -60783 93855 -201694 70485 -115156 -410277 -204017 202351 143055
18522 143055 -132810 208688 -258442 -12607 317727 -53325 71235 60447 243750 6677 67552
18511 67552 -282076 -190972 32595 -371872 179911 170360 -96820 50023 -102513 -96385 -111410
18500 -111410 18285 -156450 -112884 22772 -90529 167390 -126012 215197 -64826 90308 -145697
18488 81752 11293 -300110 359400 47507 -467574 -240487 -42155 -85699 105240 -112816
18477 111436 -157943 -29714 308695 150033 20383 -73976 -81267 -105770 -285459 213485 2114
18465 112855 -21099 380731 -30148 218541 40074 68137 -70108 -369725 147691 -3121 -230011
18454 -230011 15933 -152690 -43806 365504 -243906 16217 -124951 -103017 -3261 -36249 -525424
$$ packed form
18533a19736H183a8204m2579I3855b01694G0485a15156k95121b04017B02351n9296
18522A43055a32810B08688b58442a2607C17727e3325G1235j0788J83303F677O0875
18511F7552b82076R1104C2595c71872A79911r551i6820E0023a02513O128j5025
18500a11410A8285a56450M3566B2772i0529A67390a26012B15197f4826I0308a45697
18488H1752A1293c00110C59400D7507d67574K27087d2155m3544A05240a12816
18477A11436a57943b9714C08695A50033B0383g3976p291k4503j79689B13485B114
18465A12855b1099C80731c0148B18541D0074K8063g0108k99617A47691c121k26890
18454b30011A5933a52690d3806C65504b43906A6217a24951K1934c261l2988m89175
$$ plain form
18443 -525424 -111714 9329 -248028 162023 -91643 -152500 105578 -183564 170284 -126927
18432 -258442 -135032 147398 -65276 -5934 -385355 8087 67770 -134561 62291 31196 -188054
18420 -11102 159844 63212 36482 -189589 107915 -435147 -21213 357247 -75823 -252168
18410 -252168 251469 -320919 -201571 -128466 309892 65776 22822 -225313 -70180 -132917
18400 -132917 438156 -95692 -337314 100777 -277618 -122872 -305046 -194286 -62683 -20099
18389 -10291 -154543 -16221 -18283 6712 -385540 25772 7776 -285992 160367 -136046 -37014
18377 103021 474 -178386 35448 115297 -54064 -201571 136482 100588 42528 -183912 -64088
18365 -75694 -136072 60147 -249647 -71528 17934 127015 -178046 -231072 69197 -121089 80067
$$ packed form
18443e25424a11714I329b48028A62023i1643o0857A05578a83564A70284a26927
18432b58442J23410A47398f5276e934l79421H087N9683a34561F2291l1095a88054
18420a1102A59844F3212k6730a89589A07915d35147b1213C57247g5823j76345
18410b52168B51469c20919J19348P3105C09892F5776B2822b25313g0180o2737
18400a32917D38156i5692k41622A00777b77618a22872j82174J10760f2683b0099
18389a0291j44252a6221k062F712c85540B5772G776b85992A60367a36046c7014
18377A03021D74a78386C5448P9849e4064j47507A36482l5894D2528a83912f4088
18365g5694o0378F0147b49647g1528A7934J09081a78046n3026F9197a21089H0067
$$ plain form
18353 -191208 -64207 189014 -66250 -251948 140174 -164407 232862 79876 -91700 156211
18342 -17780 -115834 -257891 -53766 -206966 -72591 -222014 -387088 217906 -36223 -14899 -237136
18331 -237136 152747 46683 -46183 -396654 248555 -48453 119764 -131066 59460 -14843
18320 141818 -113584 -29491 298794 17163 189406 71059 105107 -233738 49225 147179 422714
18309 422714 -255168 94354 -124890 367352 -168137 21746 -161814 -172109 -191766 -240109
18299 -240109 82602 8888 -76150 112625 -219932 -218348 -92522 82078 -37547 -217289 -93143
18287 60835 46091 66635 -187167 -176692 -9640 -85741 101931 24640 155891 155370 -42380 25176
18274 -46544 113736 200316 -196756 298186 155866 -427904 207765 -168160 -174244 -18225
$$ packed form
18353a91208f4207A89014f6250j85698A40174a64407B32862G9876i1700A56211
18342a7780r8054j42057e3766j53200g2591j49423j65074B17906c6223a4899k22237
18331b37136A52747D6683d6183l50471B48555d8453A19764a31066E9460a4843
18320A41818a13584b9491B98794A7163J72243G1059L4048b33738D9225R7954K75535
18309D22714b55168I4354a24890C67352a68137B1746a61814j0295j9657m8343
18299b40109H2602H888g6150A12625b19932J584i2522H2078c7547j79742i3143
18287F0835j4744K0544a87167J0475i640p6101A01931B4640J31251n21d2380B5176
18274d6544A13736Q6580a96756B98186j42320d27904B07765a68160o084a8225
$$ plain form
18263 -188401 -87512 393776 16140 -13889 16019 -168944 -456651 104780 -229033 -71965
18252 -15049 259363 112511 -222082 -216852 15704 438514 -105068 -199212 -451472 -265818
18242 -265818 -210812 -13195 60533 129064 73243 78217 -77903 16323 174718 -315244 -151733
18230 104562 -26772 -450051 344814 -219121 109362 -83551 204860 9193 -41450 16015 -123402
18218 99728 -298243 -67918 15475 -37352 18624 -101239 -138865 89266 -333235 49639 52730
18207 52730 51563 -525952 -296426 -159211 -104657 13994 37275 99874 -345803 -581 -328494
18196 -328494 -4954 -284772 -355375 140249 -132195 171838 -294072 75064 -143403 62695
18185 62197 31547 -14221 -145233 144726 -237469 -179677 200883 -136629 383823 316444
$$ packed form
18263a88401h7512C93776A6140a3889A6019a68944k87707A04780b29033g1965
18252a5049B59363A12511b22082N230A5704M22810a05068r4144k52260J85654
18242b65818N5006a3195F0533O8531n5821M974g7903A6323J58395c15244a51733
18230A04562b6772m23279C44814b19121A09362h3551B04860I193d1450A6015a23402
18218I9728b98243f7918A5475c7352A8624a01239l7626H9266c33235D9639L091
18207E2730j167e25952K29526J37215N4554A3994K3281O2599c45803e81l27913
18196c28494d954k79818p0603A40249a32195A71838b94072G5064a43403F2695
18185F2197l0650a4221j31012A44726b37469N7792B00883a36629C83823o7379
$$ plain form
18175 316444 5179 101063 -89149 61547 163997 -69897 -97704 168594 -92395 -178734 91384
18163 141848 -81497 -9905 -12570 -67600 -401783 79247 27021 138946 -198641 270785 4833
18151 117947 -132931 -9703 -116951 -123077 20287 -71436 6143 50516 -61369 38697 -79570 -14125
18138 88831 -169518 -80041 190023 154512 49593 -66415 -43887 50707 -19117 100184 -97894
18126 -153322 -29712 -87856 65394 195451 -194870 199840 148345 -281089 -93302 -287021
18116 -287021 -15901 -280061 -315760 -16200 -199006 -89508 19117 -519315 -12120 -346495 75891
18104 -10995 69602 -388457 -168053 57351 -279252 153448 231917 17295 7866 -200454 204526
18092 -104236 -229772 -136944 19042 72758 99056 163726 -133572 -80008 -202833 145599 164347
$$ packed form
18175C16444E179R5884h9149F1547J02450f9897k7807A68594i2395q6339I1384
18163A41848h1497i905k665n5030l34183G9247B7021J11925a98641B70785D833
18151A17947a32931i703j07248o126B0287g1436F143M4373f1369C8697g9570a4125
18138H8831a69518h0041A90023l5511D9593f6415K2528E0707a9117A00184i7894
18126a53322b9712n8144F5394J30057a94870A99840n1495b81089i3302j93719
18116b87021a5901k64160l5699a6200j82806h9508A9117e19315a2120l34375G5891
18104a0995F9602c88457a68053E7351b79252A53448P8469A7295G866b00454B04526
18092a04236j25536R2828A9042N3716K6298O4670a33572N3564j22825A45599J8748
$$ plain form
18081 164347 -258911 42214 -20552 -33884 -37475 -50534 91132 -37520 -286907 -15191 70297
18069 160691 134178 176567 -75283 -43692 195074 211145 155118 357562 152202 -155932 -91493
18058 -91493 140526 155010 308779 -212604 235444 -174455 142122 208098 -261231 -239451
18048 -239451 -273272 -114714 72895 41230 -126770 1381 -113515 124182 111906 151616 -377750
18036 -4781 -136280 -15432 -52939 289128 -143947 29301 -74518 -548689 144166 151257 -54936
18024 96574 -205103 -288581 -134175 121959 -196012 -290175 67566 -252434 -12553 -160474
18014 -160474 -124046 -58054 43090 -208479 -60415 99868 111276 -82260 100451 156757 115198
18003 115198 328611 42149 148099 -202508 148011 124418 437767 285177 -41113 -104855
$$ packed form
18081A64347b58911D2214b0552j3332l591j3059I1132c7520k49387a5191G0297
18069A60691k6513M2389g5283L1591A95074J6071n6027K02444A52202a55932O4439
18058i1493A40526J4484J53769b12604B35444a74455A42122O5976b61231K1780
18048b39451l3821a14714G2895l1665a26770A381a13515A24182j2276L9710c77750
18036d781j31499a5432l7507B89128a43947B9301g4518m74171A44166P091e4936
18024I6574b05103q3478a34175A21959a96012r4163F7566b52434a2553j47921
18014a60474L6428e8054D3090b08479f0415I9868J1408h2260A00451N6306m1559
18003A15198K13413D2149J05950b02508A48011k3593L13349j52590d1113o3742
$$ plain form
17993 -104855 -244757 7542 -52753 -60796 -178377 -258419 -70719 -202787 -139249 222868 -232521
17981 -198536 12211 -154002 -73304 274248 -206952 -90074 155490 106856 101147 41686 -166678
17969 126148 108678 -19273 114288 -312546 -17719 77891 -924 5758 -330027 118783 -195377
17957 30517 -59043 131180 100123 -265223 -86651 -31198 -28670 66178 85281 -56970 10080
17945 153573 -25247 122522 -197278 -96718 -98320 -75216 234711 172621 -10214 65206 207006
17934 207006 5057 122775 -79372 141866 -118868 40961 250075 49739 241556 202042 -79653
17922 35210 -87521 -11096 210827 -174562 -248413 172865 -133071 -71375 159621 351373
17912 351373 120150 -29208 65360 102080 -140729 -137488 45071 19251 73173 -224171 44231
$$ packed form
17993a04855j39902G542e2753q043j17581q0042g0719j32068O3538B22868b32521
17981a98536A2211a54002g3304B74248b06952i0074A55490m8634n709D1686a66678
17969A26148j7470a9273A14288c12546a7719G7891i24E758c30027A18783a95377
17957C0517e9043A31180l1057b65223h6651c1198K528F6178J9103e6970A0080
17945A53573b5247A22522a97278i6718j602K3104B34711o2090a0214F5206J41800
17934B07006E057J17718g9372A41866a18868D0961K09114D9739J91817l9514g9653
17922C5210h7521a1096B10827a74562p3851A72865a33071O1696A59621J91752
17912C51373A20150b9208F5360L6720a40729L241D5071A9251N3922b24171D4231
$$ plain form
17900 -13468 65969 -182868 -117138 -370362 -26084 -199050 170334 -376398 135442 67660
17889 -93177 -543650 -61070 240007 -308322 -263002 144643 5909 -95068 81699 -6191 -53955
17878 -53955 242501 -4853 -88214 -30433 -145164 60924 -1032 -76655 117467 43484 253925
17867 253925 -40777 103579 -59379 -100867 -543717 -175328 14783 -221124 -41844 -291570
17857 -291570 -35971 -30663 349019 -247496 -188162 355193 -181033 298761 -116686 -58524
17847 -58524 -227127 -63317 -15626 -113729 -65983 -33354 113421 127449 334893 227631 272461
17836 272461 149482 -146322 333989 170357 -121079 -21681 -124310 -24883 -273952 161212
17825 9154 217921 -411622 550 10028 -161848 -124470 49498 120499 85564 316603 270393 72714
$$ packed form
17900a3468F5969a82868O5730k53224b6084j72966A70334c76398A35442F7660
17889i3177m50473f1070B40007c08322M5320A44643E909i5068H1699f191m7764
17878e3955B42501d853q3361c0433j14731F0924a032p5623A17467D3484K10441
17867B53925d0777A03579e9379m1488m42850a75328A4783b21124d1844k49726
17857b91570c5971N308C49019b47496N9334C55193a81033B98761a16686N8162
17847e8524j68603f3317a5626r8103M7746L2629A13421J4028K07444j07262M4830
17836B72461j22979a46322C33989j63632a21079b1681j02629b4883k49069A61212
17825I154K08767d11622E50R478a61848L7378D9498P1001l4935K31039m6210G2714
$$ plain form
17812 130878 102496 444278 -198486 -53554 -119260 148004 -208296 -21580 152630 26118
17801 -255537 118612 103430 -269757 -42019 144121 -67851 -8154 201844 101216 -53447 233487
17789 -211700 -33274 -10872 -83600 457629 -183777 173844 -279 -378194 -98470 -103217 179860
17777 42151 -115588 -10917 204327 416692 306891 81952 -110788 -58550 103004 55374
17767 55374 -80542 203282 99822 54694 -61877 -28520 251602 68713 135792 191334 -99139
17755 125502 169266 -132088 139101 -266736 -67444 240123 -31753 -162693 99500 111468
17745 111468 162672 220513 297075 -50888 -25769 13517 -117664 105743 1223 -256420 -67052
17733 346362 -255504 -72408 -44159 -179670 -87860 63385 -100743 11363 84948 -580539 462893
$$ packed form
17812A30878k8382L41782a98486e3554o5706A48004b08296b1580A52630B6118
17801b55537A18612j5182b69757d2019A44121f7851h154B01844j00628e3447B33487
17789b11700c3274a0872p2728D57629a83777A73844b79l77915i8470m747A79860
17777D2151a15588a0917B04327K12365j09801H1952a10788N2238A03004m7630
17767E5374h0542B03282I9822m5128f1877b8520B51602F8713O7079N5542i9139
17755A25502M3764a32088A39101b66736f7444B40123c1753j30940I9500J1968
17745A11468N1204N7841P6562e0888K5119A3517a17664A05743A223b56420f7052
17733C46362b55504g2408K8249j35511h7860F3385a00743A1363P3585e80539D62893
$$ plain form
17721 92542 50687 -83919 235969 141760 -95620 -13250 -323270 -225580 242944 -125439 -142386
17710 -142386 113050 -115723 134480 -116313 49093 -24174 31966 32456 -196811 51612 20422
17698 -128963 -174656 59805 -230142 131551 -66792 -45920 -215371 52546 319788 99507 124042
17687 124042 -66872 -76431 -33445 139680 142710 -98737 231839 79118 -190405 135418 -168149
17675 -207079 10383 160795 128631 74460 -224094 20057 25473 -48881 -157722 299576 10569
17663 -71374 231578 -151350 -258566 -92659 -37534 30276 95425 48393 183014 220035 35260
17651 137560 365213 -120113 884 103621 134241 -35618 -135982 124080 -20733 113059 118424
17640 118424 47770 105445 95457 122709 -96164 -58187 49038 -153969 -211643 90148 113150
$$ packed form
17721I2542m1855h3919B35969r4209i5620a3250l10020R7690B42944a25439j6947
17710a42386A13050a15723A34480a16313D9093b4174C1966M90a96811E1612B0422
17698a28963m5693E9805b30142A31551f6792K0872j69451E2546K67242I9507K4535
17687A24042f6872r559c3445A39680L030i8737B31839G9118a90405A35418a68149
17675b07079A0383J50412l2164n4171b24094B0057N416d8881j08841B99576A0569
17663g1374B31578a51350j07216i2659c7534C0276O5149m7032J34621L7021C5260
17651A37560K27653a20113H84J02737L0620c5618j00364A24080b0733A13059N365
17640A18424D7770N7675r988K7252i6164L7977D9038a53969n7674I0148K3002
$$ plain form
17629 113150 -32061 56344 133372 -266637 -282169 -68130 254568 91541 -5497 115299 -225802
17617 116764 5076 -255992 226736 216185 -145880 168499 -76751 100300 374430 -23536
17606 153800 -128988 42743 -142867 -7898 112696 -65013 121472 402643 71314 202459
17596 202459 -74601 29685 -132183 -188986 101318 -6447 -109391 330521 -110262 -67604 -20786
17584 -121320 386281 237901 255612 -200979 -96602 -305321 23196 158121 5713 -331534
17573 162036 146140 140545 -27977 6526 184716 259433 -66148 231142 76735 129505 93186
17562 93186 -90139 -214973 293795 126380 54067 -53069 252291 15326 -87451 -147127 190394
17550 -79901 -25633 -39710 477174 -158979 -128240 -38713 -18959 -51699 72776 110329 46449
$$ packed form
17629A13150c2061E6344P7028b66637j5532f8130B54568I1541e497A15299b25802
17617A16764E076b55992B26736j0551a45880A68499g6751A00300K74130b3536
17606A53800a28988D2743a42867g898A12696f5013A21472K81171G1314J31145
17596B02459g4601B9685a32183n6803A01318f447j02944C30521a10262M2658b0786
17584a21320C86281j48380J7711b00979i6602k08719B3196J34925E713c31534
17573A62036j5896n595b7977F526J78190P4717f6148B31142G6735N2770l6319
17562I3186i0139j24834B93795A26380E4067e3069B52291A5326h7451n9676A90394
17550g9901b5633j4077D77174a58979L0739c8713a8959l2740G2776L7553D6449
$$ plain form
17538 162673 214289 -278908 4848 19950 188976 103146 -180533 158566 -270554 71325 -317765
17526 219042 -199958 -236220 187371 9519 -131425 123107 277983 515741 99918 -118615
17515 426590 240567 36839 247988 248749 -52888 432673 259396 130113 -49028 660838 151847
17503 -411385 130693 -116937 457898 -51444 -7044 -34623 363465 -343844 171889 48346
17492 -19549 369266 408966 -259828 -274909 101747 260571 -138639 111823 -96196 -166637
17482 -166637 -59641 90600 355099 311503 364590 -189838 109663 -14996 22353 131666 47848
17470 457255 276695 -33978 -17357 66311 81426 19085 151149 -133308 -5868 43068 7455
17458 176677 261777 114767 125073 430860 161386 -136306 386701 13519 233841 138897
$$ packed form
17538A62673N1616b78908D848J5102J69026q5830a80533A58566b70554G1325c17765
17526B19042a99958l6262A87371I519a31425A23107J54876K37758I9918a18615
17515D26590j86023C6839K11149P61e2888D32673j73277j29283d9028F60838A51847
17503d11385A30693a16937D57898e1444g044k7579C63465c43844A71889D8346
17492a9549C69266L9700b59828j5081A01747J58824a38639A11823i6196p0441
17482a66637e9641I0600K64499m3596N3087a89838A09663a4996B2353J09313D7848
17470D57255j80560c3978J6621F6311J5115A9085J32064a33308e868D3068G455
17458A76677Q5100A14767J0306L05787A61386a36306C86701A3519K20322r4944
$$ plain form
17448 138897 90099 445889 348140 155714 220075 242291 297973 -94807 294280 491867 128184
17436 170032 297562 198421 342767 -12539 247593 107243 -62196 -5849 -13822 126213 372042
17425 372042 396950 126077 443893 -89447 -10021 404442 279749 355853 279469 133666
17414 404245 392406 116202 282091 195078 44165 439986 -14603 322813 224003 215147 -40450
17402 164501 161149 170441 -126863 224448 46860 60240 121809 163110 325923 277395 101021
17390 279642 294203 158284 226635 -28278 -14932 231751 296287 185393 137096 296195 407559
17379 407559 -124345 114453 125053 196842 198186 101970 11626 159063 60779 8842 173642
17368 173642 -71018 81758 166930 379453 129487 392847 -112241 19447 16496 254087 83649
$$ packed form
17448A38897m8798L55790r7749A55714O4361K2216N5682i4807B94280J97587A28184
17436A70032J27530r9141J44346a2539B47593A07243f2196e849p973A26213K45829
17425C72042K4908A26077L17816h9447a0021D04442j24693P6104p6384A33666
17414D04245j1839A16202J65889q7013D4165L95821a4603C22813r8810q856d0450
17402A64501l352R292a26863B24448D6860J3380O1569M1301J62813m8528A01021
17390B79642J4561j35919O8351b8278J3346B31751O4536j10894m8297J59099J11364
17379D07559a24345A14453J0600P1789J344r6216A1626J47437F0779H842J64800
17368A73642g1018H1758Q5172K12523A29487K63360a12241A9447k951K37591H3649
$$ plain form
17356 211390 622 102845 -38043 261494 -14689 174575 -147986 -116186 -264182 -39537 -23158
17345 -23158 -98494 188339 -176448 241932 566240 322909 154891 -157738 104373 -85646
17334 242191 243766 77601 -125086 246641 203203 188400 152215 174262 -21727 231891 164877
17323 164877 311073 38399 161886 444556 245752 241597 156971 372086 105963 138595
17313 138595 54521 287172 215728 323593 75836 242798 89331 36790 145700 167277 487012
17302 487012 213364 520417 417230 354515 151064 75162 184980 -149394 226885 145409
17292 145409 175857 -146748 -193349 36017 179645 50961 -214180 107372 -42535 -1274 96186
17280 -29935 273892 110602 247313 171841 414223 -18424 231478 -101370 376076 -64459
$$ packed form
17356B11390F22J02223c8043B61494a4689A74575a47986L1800j47996c9537J6379
17345b3158p5336A88339a76448B41932L24308k43331A54891a57738A04373h5646
17334B42191J575G7601a25086B46641m3438j4803l6185K2047b1727B31891o7014
17323A64877J46196C8399J23487K82670j98804m155q4626K15115A05963L2632
17313A38595E4521K32651p1444J07865G5836J66962H9331C6790J08910K1577L19735
17302D87012B13364L07053j03187o2715A51064G5162J09818a49394B26885q1476
17292A45409L0448a46748m6601C6017J43628E0961b14180A07372d2535a274I6186
17280b9935B73892A10602J36711p5472K42382a8424B31478a01370C76076f4459
$$ plain form
17269 82938 501188 703602 -15399 -57525 13826 196397 255401 314773 286244 -109535 -44505
17257 227793 28814 448012 162444 -145362 271269 185018 -57389 206571 -356697 183788
17246 104967 -5315 267560 375624 188770 126006 116639 283836 189866 134976 152477 446368
17235 446368 397310 176522 255641 257533 409375 294115 90429 156552 404333 57268 417533
17224 417533 6510 71843 276137 187664 172690 422219 -26306 174370 219479 43282 262370
17213 262370 104725 26643 302910 109620 52666 444049 50330 330336 331600 88268 58157
17202 58157 104577 150873 166902 199270 212703 261821 -36785 272044 217702 357848 55202
17190 8747 161140 702141 172001 134631 33066 230387 368080 378859 -151406 134247
$$ packed form
17269H2938M18250K02414a5399m2126A3826J82571N9004N9372k8529a09535d4505
17257B27793B8814M19198A62444a45362B71269q6251e7389B06571c56697A83788
17246A04967e315B67560J08064j86854o2764r367J67197r3970n4890J7501K93891
17235D46368m9058A76522P9119J892J51842j15260I0429O6123K47781E7268L60265
17224D17533F510O5333K04294q8473j4974K49529b6306A74370M5109D3282K19088
17213B62370A04725B6643K76267A09620E2666L91383E0330K80006J264H8268l0111
17202E8157M6420M6296J6029L2368J3433M9118c6785B72044n4342J40146E5202
17190H747J52393N41001A72001l7370C3066J97321J37693J0779a51406A34247
$$ plain form
17179 159370 212882 145975 360727 436170 549192 325953 117463 348591 134709 143800
17169 143800 207252 354799 27973 132890 126696 306833 443077 279247 375259 145133
17158 292047 404841 369694 147721 220927 159018 277347 287048 437078 448818 76176 266632
17147 266632 348767 307642 -32072 538654 317753 88931 541580 280010 279683 327078 145183
17135 240724 305379 332318 395116 375288 472251 551635 107336 156467 -65380 488022 454750
17124 454750 198135 386196 652209 510844 504827 230610 131693 467665 474250 896905
17114 896905 248086 245121 484268 594987 87706 331854 673219 276698 552461 285692
17104 285692 404354 273382 522683 434141 615896 420680 484111 178580 459752 462636
$$ packed form
17179A59370N3512o6907K14752P5443J13022k23239A17463K31128A34709R091
17169A43800O3452J47547B7973J04917o194J80137J36244j63830R6012A45133
17158B92047J12794l5147A47721P3206o1909J18329R701J50030J1740G6176J90456
17147B66632Q2135m1125c2072E38654k20901H8931M52649k61570l27M7395A45183
17135B40724O4655K6939O2798j9828R6963P9384A07336M9131f5380D88022l3272
17124D54750A98135J88061K66013j41365o017B30610r8917L35972O585M22655
17114H96905B48086k965K39147J10719H7706K44148L41365B76698K75763k66769
17104B85692J18662j30972K49301q8542J81755j95216O3431A78580K81172K884
$$ plain form
17094 462636 794423 314002 184577 377750 260147 275858 63645 515612 588508 341531
17084 341531 412227 640892 -3845 486581 510370 411335 208807 242761 466987 372802 340154
17073 340154 263993 427279 221441 830353 611001 533206 836074 525754 469837 260838
17063 260838 322185 631175 510768 118699 620225 843780 594357 639705 423352 604034
17053 604034 421057 459670 305526 640260 964554 728058 537728 631165 530867 434390
17043 434390 328344 257273 372894 304117 357105 990017 766121 844518 651952 330717
17033 330717 550199 593692 892593 605425 443984 870162 651174 902302 633430 581197
17023 581197 596271 796752 525646 571445 738396 324569 696133 718889 444654 697256
$$ packed form
17094D62636L31787C14002j29425J93173j17603J5711F3645M51967P2896k46977
17084C41531P0696K28665c845D86581K3789r9035k02528L3954K24226r4185l2648
17073C40154p6161J63286k05838O08912k19352p7795L02868l10320n5917k08999
17063B60838O1347L08990j20407A18699N01526K23555k49423M5348k16353J80682
17053F04034j82977L8613j54144L34734L24294k36496j90330R3437j00298r6477
17043D34390j06046p1071J15621o8777N2988O32912k23896P8397j92566l21235
17033C30717K19482M3493K98901k87168j61441M26178k18988K51128k68872n2233
17023E81197J5074K00481k71106M5799J66951C24569L71564K2756k74235K52602
$$ plain form
17013 697256 396227 535915 900594 527191 618629 515663 825059 671092 602153 429328
17003 429328 541152 639361 278251 580660 590760 980406 529781 814255 592598 769800
16993 769800 1044529 758079 756100 919268 849026 973410 710007 1001754 543888 1018938
16983 1018938 816118 1224410 1009323 801286 1014503 644905 817242 1068765 696709
16974 696709 1063045 799954 615173 918269 919216 739352 971689 840731 632202 666979
16964 666979 993559 1212844 1079526 612609 785223 1053101 1331752 877788 860032 715309
16954 715309 614577 1132781 1019222 936773 958238 630749 1324543 1118043 1162856 1010349
16944 1010349 912962 1199856 1122880 1100445 1182806 1288114 1090655 1342064 926774 1077461
$$ packed form
17013F97256l01029J39688L64679l73403R1438j02966L09396j53967o8939j72825
17003D29328J11824R8209B78251L02409J0100L89646m50625K84474k21657J77202
16993G69800K74729k86450j979J63168p0242J24384k63403K91747m57866M75050
16983A018938k02820M08292k15087k08037K13217l69598J72337K51523l72056
16974F96709L66336k63091j84781L03096R47j79864K32337j30958k08529L4777
16964F66979L26580K19285j33318m66917J72614K67878K78651m53964j7756j44723
16954G15309j00732N18204j13559q2449K1465l27489O93794k06500M4813j52507
16944A010349r7387K86894p6976k2435Q2361J05308j97459K51409m15290J50687
$$ plain form
16934 1077461 783778 1141928 1411154 1273826 1273663 1384024 1382701 1550131 1022953 1367703
16924 1367703 1160410 1244948 1590355 1334371 1147928 1157829 1508598 1727876 1585845 1359468
16914 1359468 1619270 1454887 1814964 1710148 1311969 1312234 1881543 1428165 2198012 1348966
16904 1348966 1674883 1383687 1505561 1624891 1744516 1761242 1854251 1655938 1707020 1905486
16894 1905486 1647846 1498317 1982283 2109433 1916784 1916745 1808127 2009905 2090818 1716682
16884 1716682 2015675 1981158 1781081 2152706 1887200 2240273 2161716 2376486 2114176 2027013
16874 2027013 2253661 2123476 2474213 2368964 2572432 2509517 2290478 2619945 2798519 2775678
16864 2775678 2532621 2659757 2685655 2705836 2820133 2817152 2876291 2379291 3033326 2819015
$$ packed form
16934A077461k93683L58150K69226j37328j63J10361j323J67430n27178L44750
16924A367703k07293Q4538L45407k55984j86443R901L50769K19278j42031k26377
16914A359468K59802j64383L60077j04816l98179K65N69309m53378P69847q49046
16904A348966L25917k91196J21874J19330J19625J6726R3009j98313N1082J98466
16894A905486k57640j49529M83966J27150j92649l9j08618K01778Q0913l74136
16884A716682K98993l4517k00077L71625k65506L53073p8557K14770k62310q7163
16874B027013K26648j30185L50737j05249K03468o2915k19039L29467J78574k2841
16864B775678k43057J27136K5898K0181J14297k981N9139m97000O54035k14311
$$ plain form
16854 2819015 3042915 3099135 3179940 3564240 3153425 3134093 3194720 3313710 3427677 3332802
16844 3332802 3312938 3673758 3506154 3737878 3522912 3522555 3855503 3747320 3812260 4194290
16834 4194290 3996313 4222137 4324945 4263526 4578163 4542522 4362992 4712804 4695459 4913373
16824 4913373 5128002 4677244 4861024 4998871 5176604 5404287 5442932 5095214 5472939 5914035
16814 5914035 5931957 5945716 6015861 6137793 6209525 6702006 6597825 6528095 6977864 7167003
16804 7167003 7245456 7582240 7645565 7804730 7963887 7901030 8425151 8504055 8662109 8860031
16794 8860031 8973870 9359593 9793662 9836032 10274506 10166114 10688478 11216244 11357199 11807103
16784 11807103 11941277 12429676 12678403 12696492 13471172 13641209 14025767 14696086 15126234
$$ packed form
16854B819015K23900N6220Q0805L84300m10815j9332O0627J18990J13967r4875
16844C332802j9864L60820j67604K31724k14966l57L32948j08183O4940L82030
16834D194290j97977K25824J02808o1419L14637l5641j79530L49812j7345K17914
16824D913373K14629m50758J83780J37847J77733K27683L8645l47718L77725M41096
16814E914035J7922J3759P0145J21932P1732M92481j04181o9730M49769J89139
16804G167003P8453L36784O3325J59165J59157o2857N24121P8904J58054J97922
16794H860031J13839L85723M34069M2370M38474j08392N22364N27766J40955M49904
16784A1807103J34174M88399K48727J8089P74680J70037L84558O70319M30148
$$ plain form
16775 15126234 15799849 16029271 16440722 16990803 17554277 18410579 18882354 20043828 20171560
16766 20171560 21053284 21938594 22594510 23594705 24383155 25330437 26630505 27597094 28578931
16757 28578931 29808139 30797329 32264268 33933993 35432613 36751591 39053382 40593897
16749 40593897 42803391 44852968 47204329 49666847 52241570 54918961 57986978 61059444
16741 61059444 65094583 67864563 72202240 76662640 81128029 85920585 91311192 96706685
16733 96706685 102479241 109078208 115570108 122548282 129784134 137874235 145431120 153467906
16725 153467906 161426186 169738537 177128942 184380961 190753551 196427288 200594651 204356141
16717 204356141 206226557 207147012 205735278 203910403 200289021 195091785 189558505 182764180
$$ packed form
16775A5126234O73615K29422M11451N50081N63474Q56302M71775J161474J27732
16766B0171560Q81724Q85310O55916J000195P88450R47282J300068R66589R81837
16757B8578931J229208R89190J466939J669725J498620J318978K301791J540515
16749D0593897K209494K049577K351361K462518K574723K677391L068017L072466
16741F1059444M035139K769980M337677M460400M465389M792556N390607N395493
16733I6706685N772556O598967O491900O978174P235852Q090101P556885Q036786
16725A53467906P958280Q312351P390405P252019O372590N673737M167363L761490
16717B04356141J870416R20455j411734j824875l621382n197236n533280o794325
$$ plain form
16709 182764180 175406140 167583768 160014196 151710560 143186634 135444858 127704439 120306766
16701 120306766 112898500 106511858 99945265 93827310 88069729 82943951 78303781 73678492
16693 73678492 69471598 65300789 61729343 58176618 55144470 51924950 49385940 46910415
16685 46910415 44666281 42233795 40198373 38443314 36594692 34992104 33261296 31866947
16677 31866947 30305152 29069336 27770428 26799102 25174573 24310141 23396254 22397641 21820379
16668 21820379 20737556 20222805 19652988 18805751 18018674 17372561 16910818 16498343 15771701
16659 15771701 15198109 15016268 14384836 13827065 13401937 13035314 12647034 12375002 11623192
16650 11623192 11621934 11235208 10675159 10557849 10377262 10083007 9726869 9254117 9130191 9069723
$$ packed form
16709A82764180p358040p822372p569572q303636q523926p741776p740419p397673
16701A20306766p408266o386642o566593o117955n757581n125778m640170m625289
16693G3678492m206894m170809l571446l552725l032148l219520k539010k475525
16685D6910415k244134k432486k035422j755059j848622j602588j730808j394349
16677C1866947j561795j235816j298908r71326j624529q64432r13887r98613n77262
16668B1820379j082823n14751n69817q47237p87077o46113m61743m12475p26642
16659A5771701n73592j81841o31432n57771m25128l66623l88280k72032p51810
16650A1623192j258l86726n60049j17310j80587k94255l56138m72752j23926o0468
$$ plain form
16640 9069723 8609736 8608256 8253897 8210491 7933555 7761225 7533796 7443086 7107568 6541619
16630 6541619 7006344 6849821 6798780 6347598 6230439 6210897 5988230 5920721 6000638 5691281
16620 5691281 5668053 5554133 5479621 5339882 5201344 4871534 5064414 4686016 4541543 4856691
16610 4856691 4592792 4442829 4629521 4212414 4353843 4022190 3967274 3927803 3920720 3933872
16600 3933872 3869469 3895630 3804104 3279677 3513518 3384138 3393144 3207133 3515555 2923312
16590 2923312 3198729 3076678 3196037 2897417 2860351 2526554 3047152 3041448 2995058 2742727
16580 2742727 2624074 3073368 2732994 2451685 2809668 2320621 2222793 2191169 2039059 2402888
16570 2402888 2401254 1924251 2107763 1993619 2463104 2280717 1936618 2244952 2082008 1988590
$$ packed form
16640I069723m59987j480l54359m3406k76936j72330k27429r0710l35518n65949
16630F541619M64725j56523n1041m51182j17159j9542k22667o7509P9917l09357
16620E691281k3228j13920p4512j39739j38538l29810J92880l78398j44473L15148
16610D856691k63899j49963J86692m17107J41429l31653n4916l9471p083J3152
16600C933872o4403K6161r1526n24427K33841j29380R006j86011L08422n92243
16590B923312K75417j22051J19359k98620l7066l33797N20598n704m6390k52331
16580B742727j18653M49294l40374k81309L57983m89047r7828l1624j52110L63829
16570B402888j634m77003J83512j14144M69485j82387l44099L08334j62944r3418
$$ plain form
16560 1988590 2057494 1628252 1697491 1806608 1768799 1412882 1937191 1451068 1789599 2170707
16550 2170707 1767853 1557762 2047720 1532276 1692310 1765544 1660262 1632429 1431763 1470841
16540 1470841 1260190 1519653 1432879 1579519 1542449 1444035 1344227 1412624 1406316 1687602 1463588
16529 1463588 1234305 1108832 1640895 1379941 1239761 1423918 1205199 1079814 1217791
16520 1217791 1102783 1191339 916184 1136843 1232601 1038542 1485151 846639 1029270 1463509
16510 1463509 984292 965453 1246825 1139859 858463 1174270 974851 1080066 614623 885442
16500 885442 1018608 1088077 876104 1032812 626799 1156503 943776 827810 942430 1228935
16490 1228935 812604 1044820 796264 1243565 939264 717401 1086233 802383 606819
$$ packed form
16560A988590O8904m29242O9239J09117l7809l55917N24309m86123L38531L81108
16550B170707m02854k10091M89958n15444J60034P3234j05282k7833k00666L9078
16540A470841k10651K59463q6774J46640l7070r8414r9808O8397o308K81286k24014
16529A463588k29283j25473N32063k60954j40180J84157k18719j25385J37977
16520A217791j15008Q8556k75155K20659R5758j94059M46609o38512J82631M34239
16510A463509m79217j8839K81372j06966k81396L15807j99419J05215m65443K70819
16500H85442J33166O9469k11973J56708m06013N29704k12727j15966J14620K86505
16490A228935m16331K32216k48556M47301l04301k21863L68832k83850j95564
$$ plain form
16481 606819 600091 604004 1073616 908617 803852 808958 661421 861103 1141509 1220743 1039444
16470 1039444 833372 917758 786867 574858 674842 919206 722115 806875 949827 991352
16460 991352 819990 578083 585957 664957 801271 459685 717284 631333 579978 797315
16450 797315 601165 785771 456991 139550 377981 901543 553487 698417 624398 1159760
16440 1159760 397856 551970 752273 874719 687715 665718 592645 548129 517398 1111829
16430 1111829 400858 556480 571069 750342 488569 466731 462991 223285 640918 674483
16420 674483 1076759 422809 627276 735909 913264 570302 353633 458267 382180 713290
16410 713290 503834 205081 152912 440051 227590 643627 540143 585483 423941 182308
$$ packed form
16481F06819o728L913M69612j64999j04765N106j47537J99682K80406P9234j81299
16470A039444k06072Q4386j30891k12009R9984K44364j97091Q4760J42952M1525
16460I91352j71362k41907P874P9000J36314l41586K57599q5951n1355K17337
16450G97315j96150J84606l28780A39550K38431N23562l48056J44930p4019N35362
16440A159760C97856J54114K00303J22446j87004k1997p3073m4516l0731N94431
16430A111829D00858J55622J4589J79273k61773k1838l740B23285M17633L3565
16420F74483M02276D22809K04467J08633J77355l42962k16669J04634p6087L31110
16410G13290k09456B05081n2169K87139k12461M16037j03484M5340j61542A82308
$$ plain form
16399 451193 363875 499338 277999 432259 441397 410182 416457 638375 437758 602037 175951
16387 589537 445472 693894 143248 408874 51921 254341 187672 221168 350271 263113
16377 263113 181146 423814 554925 384831 202067 188774 385607 452183 336943 376250
16367 376250 18201 139441 192809 336282 446864 361167 136849 511197 324433 435138
16357 435138 308787 394326 226674 8505 105885 276038 300953 64446 160149 236652 320274
16346 320274 269772 54724 455243 235563 124932 210004 116749 24469 398553 545679
16336 545679 343440 91921 228337 95855 269147 275234 302536 204112 -31441 303800 15321
16324 207418 451122 314530 335579 96233 301703 145032 243874 119233 36373 173450
$$ packed form
16399D51193q7318J35463k21339J54260R138l1215O275K21918k00617J64279A75951
16387E89537j44065K48422A43248K65626E1921K02420o6669L3496J29103q7158
16377B63113q1967K42668J31111j70094j82764j3293J96833O6576j15240L9307
16367C76250A8201J21240N3368J43473J10582q5697A36849L74348j86764J10705
16357D35138j26351Q5539j67652H505R7380J70153K4915F4446R5703P6503Q3622
16346C20274n0502E4724M00519k19680j10631Q5072r3255B4469L74084J47126
16336E45679k02239I1921J36416I5855J73292O087K7302r8424c1441C03800A5321
16324B07418K43704j36592K1049I6233K05470A45032R8842A19233C6373J37077
$$ plain form
16314 173450 185833 288221 611601 511434 48123 294283 577684 401429 141213 462704
16304 462704 682313 -100171 182862 471012 65710 30781 346361 -92685 336706 504402
16294 504402 -140971 309546 146724 302045 136137 -190947 223138 431067 20554 130610
16284 130610 134674 54552 500958 160453 150081 6240 305323 607159 -247979 325281 64573
16272 262776 224004 330783 200248 107487 -118267 -109892 157333 77338 -18236 371271 119992
16260 215099 174303 -79737 40343 282408 47950 70031 393848 309690 328277 96491 38185
16248 568456 -177376 544736 107149 68638 -89482 261708 115745 217049 98894 166110
16238 166110 339444 52296 -164205 209062 207839 26219 304723 140093 233280 357606
$$ packed form
16314A73450J2383J02388L23380j00167D8123K46160K83401j76255A41213L21491
16304D62704K19609a00171A82862K88150F5710C0781L15580i2685C36706J67696
16294E04402a40971C09546A46724J55321A36137a90947B23138K07929B0554J10056
16284A30610M064E4552M46406A60453j0372F240K99083L01836b47979C25281F4573
16272B62776l8772J06779j30535r2761a18267Q375A57333G7338a8236C71271A19992
16260B15099m0796g9737D0343K42065D7950K2081L23817q4158J8587I6491C8185
16248E68456a77376E44736A07149l8511h9482B61708A15745J01304I8894O7216
16238A66110J73334E2296a64205B09062j223B6219K78504A40093R3187J24326
$$ plain form
16228 357606 134502 304815 -221320 -45861 155408 300890 75950 148407 145935 367861
16218 367861 341349 374110 72305 -178202 235719 222890 -50478 372994 68823 90046 175204
16207 175204 -16574 -122551 9891 -9013 241616 -12906 153368 -101028 -242491 147090 298283
16196 298283 148178 143820 235295 230227 40328 174353 207536 -185838 -101790 11628 126676
16185 126676 164280 45092 147523 31518 156799 33718 88889 159697 178093 422796 36332
16173 69502 205863 250765 -183316 283522 234454 -270487 293472 -129970 135870 -16295
16162 -452286 -30714 19495 219552 -128458 -56121 197125 118589 -48088 311964 148318
16151 186864 -76116 -67952 285406 -100376 164132 93358 39914 40912 87761 -258562 144174
$$ packed form
16228C57606A34502J70313b21320d5861A55408J45482G5950P2457k472K21926
16218C67861k6512L2761G2305a78202B35719j2829e0478C72994F8823K1223Q5158
16207A75204a6574j05977I891i013B41616a2906A53368a01028j41463A47090J51193
16196B98283A48178m358R1475n068D0328J34025L3183a85838Q4048A1628J15048
16185A26676L7604D5092J02431C1518J25281C3718N5171P0808J8396K44703C6332
16173F9502J36361M4902a83316B83522m9068b70487B93472a29970A35870a6295
16162d52286c0714A9495K00057a28458e6121A97125p8536d8088C11964A48318
16151A86864g6116Q164B85406a00376A64132p0774C9914R98M6849b58562A44174
$$ plain form
16139 143255 -146105 37263 113662 68411 107298 85274 354435 -142434 479954 229211
16128 165369 425027 -138444 71851 163102 -145705 162890 -113031 240265 -250103 19466
16117 54523 -100581 -64087 -328049 115319 222512 84599 -48689 -89311 -88933 15405 -339952
16105 68437 -26825 250528 -86339 137342 171873 -13004 187069 -53524 -119775 137582 194112
16094 194112 -129558 -278561 -290282 -116728 399723 -52252 42402 -140151 -262040 302628
16083 218666 283777 -116673 -180688 25483 -8104 -168410 136353 -312643 -54222 -17777 51482
16071 -79911 182667 24238 12219 -231427 182556 -3572 78531 35473 164475 141571 -239289
16059 -171610 -408815 -53826 -59366 305463 50374 306376 129201 180013 83211 8103 -57552
$$ packed form
16139A43255a46105C7263P6399m5251L8887k2024K69161a42434D79954B29211
16128A65369K59658a38444G1851R1251a45705A62890a13031B40265b50103A9466
16117E4523a00581L6494k63962A15319J07193H4599d8689m0622L78A5405c39952
16105F8437b6825B50528h6339A37342L4531a3004A87069e3524o6251A37582N6530
16094A94112a29558j49003j1721a16728C99723e2252D2402a40151j21889C02628
16083B18666O5111a16673o4015B5483h104j60306A36353c12643e4222a7777E1482
16071g9911A82667B4238j2019b31427A82556c572G8531C5473J29002k2904b39289
16059a71610k37205e3826n540C05463E0374K56002A29201N0812H3211H103e7552
$$ plain form
16047 11179 186452 -75587 -193033 -85401 -352365 -39355 -19006 -36406 -180299 31156 -128742
16035 -76424 -95983 -104019 -246065 53780 -41560 -174016 -55751 -117552 222315 -245752 6944
16023 119155 -91152 -230396 81515 -138616 -117139 81256 -27947 45740 210538 41127 128131
16012 128131 -221080 -341857 -10823 -12775 -257108 233839 -156995 -45372 -130547 137406
16001 40871 20029 -43215 150741 -196059 -33856 -389636 -77481 -62320 -162729 -286920 174164
15989 139911 152768 88470 73398 54575 -48090 -140965 42597 283852 199871 253363 231853
15978 231853 -130564 27521 313562 -384343 -200805 -256451 -209331 486306 -104730 153222
15967 55081 4204 45112 -211907 -89133 -185545 376420 242753 45160 -6999 27875 -60778
$$ packed form
16047A1179J75273g5587j17446h5401k66964c9355a9006j7400j43893C1156a28742
16035g6424j9559q036j42046E3780d1560j32456e5751o1801B22315b45752F944
16023A19155i1152j39244H1515a38616K1477H1256b7947D5740J64798D1127Q7004
16012A28131b21080j20777a0823j952k44333B33839a56995d5372q5175A37406
16001D0871B0029d3215A50741a96059c3856l55780g7481J5161j00409j24191A74164
15989A39911J2857o4298j5072j8823d8090r2875D2597K41255q3981N3492k1510
15978B31853a30564B7521K86041c84343J83538n5646M7120D86306a04730A53222
15967E5081D204M0908b11907h9133r6412C76420j33667D5160f999B7875f0778
$$ plain form
15955 -533930 -292137 -5745 -60791 -246722 76896 -21585 -40081 -14229 -121061 -127371 -252118
15944 -252118 358 -113986 -94412 316015 117191 -148516 -189359 -51356 343573 -12966 -106373
15933 -106373 -32095 21307 -395677 -50911 -161865 -56824 -144458 148022 -38444 45820 -98175
15921 -90827 -143947 234378 -133012 -71540 -30670 -138313 -109264 97690 92374 -43129 -334612
15910 -334612 42857 -232222 -80984 -252770 -172121 78623 -84501 -163493 85123 39749 62263
15899 62263 -178941 142353 16407 72470 -175650 127739 -23737 46063 45686 17009 -160311
15887 141377 167554 -99555 -42685 -25796 -262746 32141 -52013 -314680 -68860 34732 -11544
15875 -291272 -355564 -169193 -36575 -76111 39757 -253912 -150348 -103040 102310 -134062
$$ packed form
15955e33930K41793e745n5046j85931G6896b1585j8496a4229j06832o310j24747
15944b52118C58a13986J9574C16015A17191a48516m0843e1356C43573a2966r3407
15933a06373c2095B1307c95677e0911j10954e6824q7634A48022c8444D5820i8175
15921i0827n3120B34378a33012O1472c0670j07643K9049I7690n316d3129k91483
15910c34612D2857b32222h0984j71786Q0649G8623h4501p8992H5123C9749K2514
15899F2263a78941A42353A6407N6063a75650A27739b3737D6063l77A7009a60311
15887A41377K6177i9555d2685J6889k36950C2141e2013k62667f8860C4732a1544
15875b91272o4292a69193c6575l9536C9757b53912J03564M7308A02310a34062
$$ plain form
15864 -140010 132035 -122275 -151381 -65226 13822 -244693 329277 -345184 -114478 111357
15853 301477 265965 229525 13884 120199 123413 13014 -24817 -174180 -40844 210152 -12405
15841 -192483 -55341 -45909 242425 -175819 -57886 343365 -129312 29730 -206136 51294 -5110
15829 -295824 221127 -50274 121321 -48547 -225468 -12696 2097 -6216 -379214 -194717 -278785
15818 -278785 -192422 -398490 107320 -69545 34348 -84094 -241695 -144473 105766 4461 -323638
15806 19079 -85602 -44573 -116491 196255 -56887 410677 102203 -64182 178828 -124726 73090
15794 409876 115083 -298104 134147 -230249 -2802 44524 -476733 52171 -68818 -144482 -60448
15782 -255014 -89434 89876 203629 -116519 168424 18543 20711 85555 156586 -100860 5847
$$ packed form
15864a40010A32035a22275k9106f5226A3822b44693C29277c45184a14478A11357
15853C01477l5512l6440A3884J06315L214A3014b4817j49363d0844B10152a2405
15841a92483e5341R432B42425a75819e7886C43365a29312B9730b06136E1294e110
15829b95824B21127e0274A21321d8547j76921a2696B097f216l72998J84497q4068
15818b78785Q6363k06068A07320f9545C4348h4094j57601R7222A05766D461c23638
15806A9079h5602M1029p1918A96255e6887D10677A02203f4182A78828a24726G3090
15794D09876A15083b98104A34147b30249b802D4524d76733E2171f8818p5664f0448
15782b55014h9434H9876J13753a16519A68424A8543K168O4844P1031a00860E847
$$ plain form
15770 -211055 -52282 46099 -40901 -318270 110743 -55916 -132210 410435 -80438 74951 -25592
15758 49756 -71132 69106 -329570 -28406 -2023 -136601 272399 -219464 -195209 -111552 -125752
15747 -125752 43118 1588 -206912 160247 15349 -47027 -8318 59785 12850 345679 13263
15735 -123670 23073 147712 -276047 43853 -61073 -71301 146167 69132 -285354 281515
15724 24268 -281184 87615 20277 122770 144938 44061 -452108 -238463 291962 -51814 -114589
15713 -114589 -107499 -231030 57493 -27780 -332703 -179694 -36292 -63651 -146530 -264744 -47080
15701 -92753 -68935 47774 -100454 -108863 6 -112032 -29542 -72934 -95617 77742 -64693 109136
15688 96836 11514 -174235 -272790 -214811 -129548 -131585 -376920 -142990 85563 145437 -191575
$$ packed form
15770b11055e2282D6099d0901k77369A10743e5916p6294D10435h0438G4951b5592
15758D9756g1132F9106c29570b8406b023j34578B72399b19464K4255Q3657j4200
15747a25752D3118A588b06912A60247A5349d7027h318E9785A2850L32829A3263
15735a23670B3073J24639b76047D3853f1073j0228A46167F9132b85354B81515
15724B4268b81184H7615B0277J02493K2168D4061d52108K13645B91962e1814o2775
15713a14589P090j23531E7493b7780l04923J53009c6292k7359q2879j18214d7080
15701i2753K3818D7774a00454q409Fa12032b9542m3392k2683G7742f4693A09136
15688I6836A1514a74235r8555N7979Q5263k037k45335a42990H5563N9874a91575
$$ plain form
15676 31426 84020 -181644 -271195 -87075 159830 -18795 31961 46757 -70815 -25610 -78601
15665 -78601 -176194 186316 -434508 -60116 -331142 94178 -189083 25346 -407913 68604 -2771
15653 -226383 -240526 -72732 -88376 -388227 31643 -198690 -209508 137219 -279624 -25297 80528
15641 98846 -109168 57353 86791 -244274 144787 88934 -152231 151632 -129932 -15535
15630 -173567 -221475 311687 65931 -139942 -103792 20255 -47303 247043 103005 -193112
15619 113128 -148819 -78061 292921 -89405 -8781 147154 -50928 100986 -83144 51592 85354
15608 85354 -113847 67158 80684 233940 269120 -252224 -73316 -131646 -210013 -74965 -205890
15597 -205890 -335912 -163189 -244297 -100518 -28431 -255265 32345 40726 -113446 -104532 -245646
$$ packed form
15676C1426N2594a81644q9551h7075A59830a8795C1961J4796g0815b5610n2991
15665g8601r7593A86316d34508f0116k71026I4178a89083B5346d07913F8604b771
15653b26383j4143g2732j5644k99851C1643a98690j0818A37219b79624b5297H0528
15641I8846a09168E7353K9438b44274A44787n5853a52231A51632a29932a5535
15630a73567m7908C11687F5931a39942L6150B0255d7303B47043A03005a93112
15619A13128a48819P0758B92921h9405h781A47154e0928A00986h3144E1592L3762
15608H5354a13847F7158J3526J53256L5180b52224g3316n8330p8367g4965j30925
15597b05890j30022a63189q1108a00518b8431k26834C2345Q381a13446Q914j41114
$$ plain form
15586 -245646 217743 198896 -63221 -209201 -165861 433893 -10838 86128 -179562 -174 52281
15574 -320408 -329074 -94425 -330252 385146 -137781 36039 -57584 -64351 228549 -44527 39735
15562 350121 154212 237588 -82901 -188510 68870 -67721 -152270 197900 -140507 28825 -338999
15550 56002 83723 328425 4156 104179 77421 -20021 -206541 425260 131451 276403 97289
15538 -21276 -453804 -46298 107183 -166939 -259750 85172 -159461 63300 -69583 -114272 105629
15526 -71891 22360 358893 41756 -198167 66671 -10130 10186 15379 63566 -35893 132887
15514 79241 -38763 133051 -114635 142305 -43358 20933 265860 -77798 -83718 95053 345152
15503 345152 -140069 -56224 -275641 -76817 -19801 93056 -116512 -155127 -1636 -75276 94787
$$ packed form
15586b45646B17743j8847f3221j45980M3340D33893a0838H6128a79562a74E2281
15574c20408q666i4425k35827C85146a37781C6039e7584o767B28549d4527C9735
15562C50121A54212Q3376h2901j05609F8870f7721q4549A97900a40507B8825c38999
15550E6002K7721K44702D156J00023k6758b0021j86520D25260A31451J44952I7289
15538b1276m32528d6298A07183a66939r2811H5172a59461F3300f9583m4689A05629
15526g1891B2360L36533D1756a98167F6671a0130A0186N193M8187c5893A32887
15514G9241c8763A33051a14635A42305d3358B0933K44927g7798n920I5053K50099
15503C45152a40069e6224k19417g6817a9801I3056a16512l8615a636p3640I4787
$$ plain form
15491 -118851 3176 -199459 154109 178432 -220689 271244 40229 -289056 -225770 118859
15480 100224 -141802 10615 232292 122588 5926 -83064 -61885 -136733 -514021 360999 243898
15469 243898 218409 -212934 -109331 182557 273124 -76272 -38531 357099 -166470 234274
15458 -54970 3703 -255159 -59320 43932 48154 -37923 -111914 108496 -53078 -49765 -86507 -9777
15445 -35663 100362 137878 -174738 -18005 371290 -123365 85142 -168540 -82888 -1087 24600
15433 130770 -99523 -18534 -94530 -154764 -65551 -179522 -69072 117321 -22152 -36177 -51056
15422 -51056 -103035 315413 -192916 -96353 137324 315700 45881 265921 -58660 -156971 185804
15410 -119148 -144462 69075 -136726 159136 40244 -173795 -224438 56956 -77663 252754 322710
$$ packed form
15491a18851C176a99459A54109K4323b20689B71244D0229b89056O3286A18859
15480A00224a41802A0615K21677j09704E926h3064K1179p4848l77288C60999j17101
15469B43898k5489b12934J03603A82557R0567g6272L7741C57099a66470B34274
15458e4970C703b55159e9320D3932M222c7923p3991A08496e3078L313l6742i777
15445c5663A00362L7516a74738a8005C71290a23365H5142a68540h2888a087B4600
15433A30770i9523a8534p5996o0234f5551j13971f9072A17321b2152j4025j4879
15422e1056n1979C15413a92916i6353A37324J78376D5881K20040e8660r8311A85804
15410a19148k5314F9075a36726A59136D0244a73795n0643E6956g7663B52754O9956
$$ plain form
15399 322710 -94782 61847 66826 -202430 -71170 -144331 89957 -93668 89597 -133084 218331
15387 -52198 -130148 54781 -99409 179543 142352 -769 494 -412485 100926 44992 -318449 131010
15374 -156478 67302 -75866 -96735 23731 158592 -326405 -179048 -348847 16281 -225124
15363 -126429 252021 175877 -107941 69790 279455 -167796 282580 79895 -56864 -19487
15352 -165405 62520 106928 27589 -2631 -84494 921 13660 -131826 67585 33653 245343 -40181
15339 237209 168690 174961 111045 -318403 9510 207516 -45601 371920 4329 -106382 -27264
15327 66780 52372 55355 -213506 328859 -5047 -178747 -5391 -153382 91522 112351 65985
15316 65985 327885 177202 158544 289353 350031 -32920 198200 325674 9303 232102 -51542
$$ packed form
15399C22710i4782F1847M979b02430g1170p3161H9957i3668H9597a33084B18331
15387e2198p7950E4781i9409A79543l7191g69D94d12485A00926D4992c18449A31010
15374a56478F7302g5866k0869B3731J34861c26405J47357j69799A6281b25124
15363a26429B52021p6144a07941F9790K09665a67796B82580G9895e6864a9487
15352a65405F2520M4408B7589b631q1863I21J2739a31826F7585C3653K11690d0181
15339B37209o8519O271o3916c18403I510J98006d5601C71920D329a06382b7264
15327F6780j4408K983b13506C28859e047j73700e391j47991I1522K0829m6366
15316F5985K61900j50683j8658J30809O0678c2920A98200J27474I303K22799e1542
$$ plain form
15304 -5402 29134 96868 -237424 -97309 2835 137639 175910 330115 227662 -54131 98293
15292 -256177 321269 62432 -78637 -163341 -29309 -381420 -305646 -162756 111881 -181250
15281 -87606 90011 293987 125445 28296 166926 303614 -147408 379569 280701 400277
15271 400277 -464733 96360 96386 167947 -37453 60566 153900 125554 -41118 137564 383391
15260 383391 -74032 199642 -177610 -42710 -89740 130279 -93925 72203 -8167 239335 11613
15248 530004 942574 1852456 2077568 1590428 1819256 1047350 452868 282545 203300 124048
15238 124048 94864 -70374 202753 131660 117559 -235857 118536 -39402 226753 79850 -52638
15226 -162823 -39156 37485 -39137 -261854 34223 -26168 230196 210105 280248 171097 110644
$$ packed form
15304e402B9134O7734b37424i7309B835J34804L8271J54205j02453e4131I8293
15292b56177C21269F2432g8637q4704b9309l52111P5774J42890A11881a81250
15281h7606I0011K03976A25445B8296J38630J36688a47408C79569r8868J19576
15271D00277d64733I6360K6P1561c7453F0566R3334k8346d1118A37564K45827
15260C83391g4032A99642a77610d2710m7030A30279i3925G2203h167B39335A1613
15248E30004M12570R09882K25112m87140K28828p71906D52868j70323p9245p9252
15238A24048k9184g0374B02753p1093j4101b35857A18536c9402B26753G9850e2638
15226a62823c9156C7485c9137k22717C4223b6168B30196k0091P0143j09151o0453
$$ plain form
15215 110644 173518 473032 -19979 68898 155830 248350 319435 99636 -42604 26838 180826
15204 180826 4670 246536 288400 12808 -391791 -52535 69649 77250 -108663 186424 84074
15192 80368 -5217 141049 253173 151620 176913 36977 13559 -98389 64828 160525 131335
15181 131335 201949 315815 149405 249577 458674 -22066 91806 81464 -17929 96933 -138591
15169 111698 285025 279174 111624 63467 -10238 -29232 150938 171665 135446 -111222 -219394
15158 -219394 314941 136837 294231 -20976 -122078 -233938 -91061 66743 204924 9588
15147 -142040 -252914 453570 -284702 -71611 8843 123652 75711 -110023 113832 321388
15137 321388 508001 199867 298759 523845 -13210 79150 341018 -108590 99295 511116
$$ packed form
15215A10644O2874K99514a9979F8898Q6932R2520P1085I9636d2604B6838J53988
15204A80826D670K41866M1864A2808c91791e2535F9649P601a08663A86424H4074
15192H0368e217A41049J12124j01553K5293C6977A3559i8389F4828R5697k9190
15181A31335P0614J13866A49405J00172K09097b2066I1806j0342a7929I6933a38591
15169A11698J73327n851A11624m8157a0238j8994A50938K0727l6219a11222j08172
15158b19394C14941A36837J57394b0976j01102j11860i1061F6743J38181I588
15147a42040j10874D53570b84702g1611H843J14809m7941a10023A13832K07556
15137C21388J86613A99867R8892K25086a3210G9150K61868a08590I9295M11821
$$ plain form
15127 511116 237767 129478 87317 383164 188409 31388 334533 616146 -76982 160866
15116 -43227 487675 59380 -250888 170317 96297 -77252 13244 408110 -51965 82484 38438
15104 320311 375767 528357 -125138 39431 219942 -34143 86450 275472 -118718 279534
15093 14481 28917 102063 232660 -47439 -7180 109688 15992 110846 60232 411488 -16546
15081 514457 166507 121455 4710 -82072 313321 390271 85247 -98340 233049 -233480 82685
15069 33715 643611 108349 111813 -44166 229601 437098 67721 323251 217991 28217 304693
15058 304693 350035 6931 224512 200697 269528 35223 -54177 259553 259278 241121 214894 -167599
15045 176664 10136 146277 261499 334652 233438 15527 272165 122413 220170 92091
$$ packed form
15127E11116B37767j08289m2161K95847A88409C1388L03145K81613g6982A60866
15116d3227D87675E9380b50888A70317p4020g7252A3244L94866e1965H2484C8438
15104C20311N5456J52590a25138C9431J80511c4143H6450J89022a18718B79534
15093A4481J4436P3146J30597d7439g180A09688A5992R4854n0614L51256a6546
15081E14457A66507m5052D710h2072C13321P6950H5247i8340B33049b33480H2685
15069C3715O09896A08349L464d4166B29601K07497F7721K55530j05260B8217K76476
15058C04693M5342F931K17581k3815O8831C5223e4177B59553k75j8157k6227a67599
15045A76664A0136J36141J15222P3153j01214A5527K56638A22413R7757I2091
$$ plain form
15034 306520 128044 -58924 252761 320426 422156 323668 251270 399905 -57632 209910
15023 299754 426287 -145653 350926 193991 186929 -83562 308710 236640 189304 357438
15013 357438 321215 263895 75038 129624 251453 492001 14628 92773 -102437 181900 336533
15002 336533 158933 174345 243526 211925 191551 146671 163009 177670 176960 179231 116163 370038
14990 370038 441107 65679 745754 -51632 75480 452077 -110863 224782 422103 256276
14980 256276 286826 209643 39590 18649 498835 264686 242004 282058 561528 189382 176094
14969 176094 349560 408150 395077 201137 393055 6940 362517 278918 125159 191400 376773
14958 376773 130828 314214 366555 455620 579197 -100704 466062 97057 447483 577987
$$ packed form
15034C06520A28044e8924B52761O7665J01730r8488p2398J48635e7632B09910
15023B99754J26533a45653C50926j56935p062h3562C08710p2070m7336J68134
15013C57438l6223n7320G5038N4586J21829K40548A4628P8145a02437A81900J54633
15002C36533A58933J5412O9181l1601k0374m4880J6338J4661p10K271o3068K53875
14990C70038P1069F5679O80075e1632G5480L76597a10863B24782J97321j65827
14980B56276L0550p7183C9590A8649M80186k34149k2682M0054K79470A89382j3288
14969A76094J73466N8590j3073j93940J91918F940L55577q3599A25159O6241J85373
14958C76773A30828J83386N2341Q9065J23577a00704D66062I7057L50426J30504
$$ plain form
14948 577987 298527 330287 151065 355379 390068 350471 172005 352470 120014 323456
14938 323456 414923 -59681 142087 243188 507823 256583 82853 499863 436991 286103
14928 286103 171477 459147 83666 201116 390110 434224 324062 557512 371682 411814
14918 411814 310331 271542 382813 417000 205625 599257 358308 291478 310990 13241
14907 219101 334053 145120 204411 247643 462192 118294 623530 617197 156113 192590
14897 192590 491790 228578 100799 362154 358433 424931 536607 307267 204865 235351
14887 235351 435713 166173 197429 227528 -59568 591098 362123 328959 312649 470075
14877 470075 612463 384914 489579 384977 503631 319352 269494 295452 781823 413087
$$ packed form
14948E77987k79460L1760A51065K04314L4689l9597A72005J80465A20014K03442
14938C23456R1467e9681A42087J01101K64635k51240H2853M17010o2872j50888
14928B86103j14626K87670H3666J17450J88994M4114j10162K33450j85830M0132
14918D11814j01483l8789J11271L4187B05625L93632k40949o6830J9512A3241
14907B19101J14952A45120N9291M3232K14549A18294N05236o333A56113L6477
14897A92590K99200B28578A00799K61355l721O6498J11676k29340j02402L0486
14887B35351K00362A66173L1256L0099e9568E91098k28975l3164j6310J57426
14877D70075J42388k27549J04665j04602J18654j84279m9858K5958M86371l68736
$$ plain form
14867 413087 396918 211779 642801 166622 641234 526158 195094 272182 492842 384674
14857 384674 831446 497898 497201 572609 266283 589431 657709 698563 516291 729007 503492
14846 503492 522751 474867 260606 540768 522467 688179 606622 456752 254441 338370
14836 338370 472278 393659 360034 592691 612104 379525 405026 415894 504359 396241 630899
14825 630899 324652 823542 742287 440398 415740 245916 416682 595670 353430 631352
14815 631352 684501 485488 -38661 528704 334883 515094 417546 975235 274389 669157
14805 669157 845808 549459 616401 533248 657218 586895 552320 784884 687094 913874
14795 913874 613951 567850 441117 541112 606450 271685 679638 658729 892274 925844
$$ packed form
14867D13087j6169j85139M31022A66622M74612j15076A95094P7088K20660j08168
14857C84674M46772l33548o97P5408B66283L23148O8278M0854j82272K12716k25515
14846E03492J9259m7884k14261K80162j8301J65712q1557j49870k02311Q3929
14836C38370J33908p8619l3625K32657J9413k32579K5501J0868Q8465j08118K34658
14825F30899l06247M98890q1255l01889k4658j69824J70766J78988k42240K77922
14815F31352N3149j99013c8661E28704j93821J80211r7548N57689B74389L94768
14805F69157J76651k96349O6942q3153J23970p0323l4575K32564r7790K26780
14795I13874k99923m6101j26733R9995O5338B71685M07953k0909K33545L3570
$$ plain form
14785 925844 652270 906826 707891 518115 585539 604051 778294 785376 201716 686078
14775 686078 634710 815072 656789 156216 821742 442402 760537 590330 764291 615941
14765 615941 751057 803711 666777 649631 1016377 649979 610020 653296 447361 741331
14755 741331 240778 805296 633043 457800 592153 913535 673411 891006 804248 697422
14745 697422 726407 885560 627092 758360 351765 816467 605531 798411 751514 1186377
14735 1186377 1158059 984644 716283 643232 569001 622162 729304 987867 855850 804460
14725 804460 771434 883001 867896 924288 865286 716618 893831 1025404 837559 751845
14715 751845 855469 629023 726654 595279 1102162 864121 1163725 850653 832337 869341
$$ packed form
14785I25844k73574K54556j98935j89776O7424J8512J74243P082B01716M84362
14775F86078n1368J80362j58283A56216O65526l79340L18135j70207J73961j48350
14765F15941J35116N2654j36934j7146L66746l66398l9959M3276k05935K93970
14755G41331B40778N64518j72253j75243J34353L21382k40124K17595q6758j06826
14745F97422K8985J59153k58468J31268C51765M64702k10936J92880m6897M34863
14735A186377k8318j73415k68361p3051p4231N3161J07142K58563j32017n1390
14725H04460l3026J11567j5105N6392n9002j48668J77213J31573j87845q5714
14715G51845J03624k26446R7631j31375N06883k38041K99604l13072j8316L7004
$$ plain form
14705 869341 886642 729815 809901 867007 1217054 1114816 1308092 921196 882110 758945
14695 758945 970746 785236 1042062 890893 700393 1084328 926498 941060 859934 1007670
14685 1007670 1060472 937731 1229677 925430 1156265 717071 1169573 1084248 800242 1166539
14675 1166539 769224 1012528 1125564 1149898 810847 1027536 1236730 906134 1238203 1311623
14665 1311623 1325463 1215826 1243112 1055570 1281316 1106836 1308000 1136568 1124332 1442279
14655 1442279 1269181 1165017 1061733 1365909 1412976 1023734 1196006 1277074 1115943 1473825
14645 1473825 882528 1159243 1175623 1367392 1285621 1302855 1379503 1128562 1314111 1447599
14635 1447599 1341067 1709338 1137371 1425056 1132055 1456265 1325142 1215941 1446568
$$ packed form
14705H69341J7301j56827Q0086N7106L50047j02238J93276l86896l9086j23165
14695G58945K11801j85510K56826j51169j90500L83935j57830J4562q1126J47736
14685A007670N2802j22741K91946l04247K30835m39194M52502q5325k84006L66297
14675A166539l97315K43304J13036K4334l39051K16689K09194l30596L32069P3420
14665A311623J3840j09637K7286j87542K25746j74480K01164j71432j2236L17947
14655A442279j73098j04164j03284L04176M7067l89242J72272Q1068j61131L57882
14645A473825n91297K76715J6380J91769q1771J7234P6648k50941J85549J33488
14635A447599j06532L68271n71967K87685k93001L24210j31123j09201K30627
$$ plain form
14626 1446568 1556724 1451750 1506534 1583610 1496742 1540153 1508160 1443153 1612232 1526580 1414035
14615 1414035 1562105 1664099 1478190 1626921 1674474 1516052 1362678 1685892 1489989 1787839
14605 1787839 1882248 1633743 2020206 1760690 2042427 1442198 1571852 1678469 1807965 1941332
14595 1941332 2110025 1858959 1875778 2124626 1874630 2175428 1961274 1891084 1831841 1906787
14585 1906787 1893085 2148750 2143899 2217939 2265628 2380497 2059618 2325628 2066744 2407535
14575 2407535 2045944 2459847 2020895 2087758 2160352 2226826 2029135 2644860 2205632 2483949
14565 2483949 2932999 2678633 2937296 2684663 2796013 2853464 2703617 3146311 3432520 3194248
14555 3194248 3711776 3679532 4151964 4641883 4794637 5726095 7377813 11470365 19370037
$$ packed form
14626A446568J10156j04974N4784P7076q6868M3411l1993o5007J69079q5652j12545
14615A414035J48070J01994j85909J48731M7553j58422j53374L23214j95903K97850
14605A787839R4409k48505L86463k59516K81737o00229J29654J06617J29496J33367
14595A941332J68693k51066J6819K48848k49996L00798k14154p0190n9243P4946
14585A906787j3702K55665m851P4040M7689J14869l20879K66010k58884L40791
14575B407535l61591M13903m38952O6863P2594O6474j97691O15725m39228K78317
14565B483949M49050k54366K58663k52633J11350N7451j49847M42694K86209k38272
14555C194248N17528l2244M72432M89919J52754R31458J651718M092552P899672
$$ plain form
14546 19370037 35690972 46802211 25923827 14552651 9929161 5370751 3356757
14539 3356757 2607223 2219701 2189345 2029545 2061716 2199708 2020764 2242674 2343181 2334527
14529 2334527 2260297 2447891 2120122 2272983 2600105 2217337 2636457 2672193 2605886 3127530
14519 3127530 2715227 2527707 2755732 2456477 2758432 2531416 2669116 2845313 2918468 2817304
14509 2817304 3021266 2811963 3244547 2940842 3216411 3076802 3294687 3151349 3108111 3255148
14499 3255148 3567836 3455588 3299124 3807141 3524842 3868816 3906181 3512678 3233505 3623171
14489 3623171 3667807 3821356 3815611 3461731 4128620 3957233 3899812 4057624 4057462 4220885 4305312
14478 4305312 4511648 4329963 4220041 4354538 4316838 4569298 4575980 4354507 4402348 4570489
$$ packed form
14546A9370037J6320935J1111239k0878384j1371176m623490m558410k013994
14539C356757p49534l87522l0356j59800L2171J37992j78944K21910J00507q654
14529B334527p4230J87594l27769J52861L27122l82768M19120L5736o6307N21644
14519C127530m12303j87520K28025k99255L01955k27016J37700J76197P3155j01164
14509B817304K03962k09303M32584l03705K75569j39609K17885j43338m3238J47037
14499C255148L12688j12248j56464N08017k82299L43974L7365l93503k79173L89666
14489C623171M4636J53549n745l53880O66889j71387n7421J57812j62J63423Q4427
14478D305312K06336j81685j09922J34497l7700K52460O682k21473M7841J68141
$$ plain form
14468 4570489 4444157 4965575 4995384 4842686 4847889 5055153 5020351 5277426 5244104 4918277
14458 4918277 5153191 5338074 5279208 5707204 5363944 5227913 5755757 5601969 5671627 5680881
14448 5680881 5698752 6004383 6298397 6234829 6185141 6152929 6261227 6617035 6091953 6512146
14438 6512146 6655291 7060635 6875395 7003657 7026195 6816331 7088503 7086017 7267297 7418581
14428 7418581 7527172 7489348 7818795 7879894 8332753 8091011 8166903 8308245 8277325 8469015
14418 8469015 8539303 8773458 8952098 9208965 9452519 9422834 9465693 9572335 9506843 9984786
14408 9984786 9981695 10245726 10214232 10443406 10313136 10930542 10744366 11221534 11249038 11392634
14398 11392634 11431685 11875610 11837432 12152166 12374812 12592036 12780261 12909150 13386191 13371809
$$ packed form
14468D570489j26332N21418K9809j52698N203K07264l4802K57075l3322l25827
14458D918277K34914J84883n8866M27996l43260j36031N27844j53788O9658R254
14448E680881J7871L05631K94014o3568m9688l2212J08298L55808n25082M20193
14438F512146J43145M05344j85240J28262K2538k09864K72172k486J81280J51284
14428G418581J08591l7824L29447O1099M52859k41742P5892J41342l0920J91690
14418H469015P0288K34155J78640K56867K43554k9685M2859J06642o5492M77943
14408I984786l091K64031l1494K29174j30270O17406j86176M77168K7504J43596
14398A1392634L9051M43925l8178L14734K22646K17224J88225J28889M77041j4382
$$ plain form
14388 13371809 13683445 13945834 14213787 14506254 14322243 14848111 15282799 15963070 15570121
14379 15570121 16203984 16594876 16419194 16987459 17098547 17706822 18166584 18773036 18756708
14370 18756708 18864772 19194499 19772839 20196893 20697693 21268543 21370538 21911725 22642216
14361 22642216 22833419 23532648 23607328 24306285 25395571 25761396 26340657 26657256 27420029
14352 27420029 28172590 28545179 29830261 30142683 30956938 32031336 32405521 33634977 34203866
14343 34203866 35391887 36079620 37025933 38046643 39373374 40401985 41172699 42511687
14335 42511687 43502611 45087451 46286242 47851320 49230206 50785800 52298130 53727129
14327 53727129 56015585 57587798 59180640 61185459 63587280 65676417 67673383 70236118
$$ packed form
14388A3371809L11636K62389K67953K92467j84011N25868M34688O80271l92949
14379A5570121O33863L90892j75682N68265J11088O08275M59762O06452j6328
14370A8756708J08064L29727N78340M24054N00800N70850J01995N41187P30491
14361B2642216J91203O99229P4680O98957J089286L65825N79261L16599P62773
14352B7420029P52561L72589J285082L12422Q14255J074398L74185J229456N68889
14343C4203866J188021O87733R46313J020710J326731J028611P70714J338988
14335D2511687R90924J584840J198791J565078J378886J555594J512330J428999
14327E3727129K288456J572213J592842K004819K401821K089137J996966K562735
$$ plain form
14319 70236118 72620107 75496181 78305530 81367509 84211320 87652353 91050029 94635454
14311 94635454 98275593 102404741 106571758 110897405 115645425 120895768 125955803 131296182
14303 131296182 137403117 143831963 150339265 156884451 164607220 172593026 181093547 189489847
14295 189489847 198880579 208695319 219356917 230333454 241578357 253909942 266427062
14288 266427062 279473848 293186093 307947070 322267908 337025227 352591385 367658655
14281 367658655 382963052 397755410 412448767 426535138 439527552 451126669 461641896
14274 461641896 469897719 475730423 478486298 477940377 475635379 473851630 470821362 465605997
14266 465605997 458732615 450426632 440503104 428598602 416041005 401859035 386651652
$$ packed form
14319G0236118K383989K876074K809349L061979K843811L441033L397676L585425
14311I4635454L640139M129148M167017M325647M748020N250343N060035N340379
14303A31296182O106935O428846O507302O545186P722769P985806Q500521Q396300
14295A89489847R390732R814740J0661598J0976537J1244903J2331585J2517120
14288B66427062J3046786J3712245J4760977J4320838J4757319J5566158J5067270
14281C67658655J5304397J4792358J4693357J4086371J2992414J1599117J0515227
14274D61641896Q255823N832704K755875n45921k304998j783749l030268n215365
14266D65605997o873382q305983r923528j1904502j2557597j4181970j5207383
$$ plain form
14259 386651652 370752689 354848964 338943373 323231093 308094843 293004437 280343824
14252 280343824 267002806 253900866 241313688 229379435 218108430 207460089 197399586
14245 197399586 188043222 179346816 171199038 162966052 155664708 148413724 141674703 135552131
14237 135552131 129829249 124215493 119212974 113876848 109090772 104679632 100860693 96977324
14229 96977324 93045902 89294311 85782809 82500900 79845479 76887653 74327670 71455127
14221 71455127 68949187 66718672 64622469 62548975 60169987 58280980 56576756 54801029
14213 54801029 53267356 51711523 50163610 48660996 46946638 45937754 45116541 44050122
14205 44050122 42620726 41057068 39753069 38789546 38124955 37366434 36093063 35004918
$$ packed form
14259C86651652j5898963j5903725j5905591j5712280j5136250j5090406j2660613
14252B80343824j3341018j3101940j2587178j1934253j1271005j0648341j0060503
14245A97399586r356364q696406q147778q232986p301344p250984o739021o122572
14237A35552131n722882n613756n002519n336126m786076m411140l818939l883369
14229I6977324l931422l751591l511502l281909k655421k957826k559983k872543
14221G1455127k505940k230515k096203k073494k378988j889007j704224j775727
14213E4801029j533673j555833j547913j502614j714358j008884q21213j066419
14205D4050122j429396j563658j303999r63523o64591p58521j273371j088145
$$ plain form
14197 35004918 34185837 33628788 32299536 31799828 31017391 30126685 29520444 28705919 28274026
14188 28274026 27471022 26834674 25949216 25763190 24815478 24309210 24116342 23703310 23410787
14179 23410787 22691528 22003427 21469888 21075067 20697699 20480308 19807847 19680825 19103336
14170 19103336 19013793 18415472 18310426 17654973 17126495 16929114 16987296 16687253 16344934 15767283
14160 15767283 15778481 15651538 15415745 14932495 14211755 14463236 13775228 13913102 13761820
14151 13761820 13091001 13399055 12741157 12726708 12554260 12199392 12327636 11991081 11930881 11509806
14141 11509806 11519047 10916511 11322413 10821366 10777704 10523211 10072014 10249631 9990946 10343167
14131 10343167 9991389 9944571 9443623 9521273 9200332 9555685 9098502 8981115 8595530 8671351
$$ packed form
14197C5004918q19081n57049j329252m99708p82437q90706o06241q14525m31893
14188B8274026q03004o36348q85458j86026r47712n06268j92868m13032k92523
14179B3410787p19259o88101n33539l94821l77368k17391o72461j27022n77489
14170A9103336q9543n98321j05046o55453n28478j97381N8182l00043l42319n77651
14160A5767283J1198j26943k35793m83250p20740K51481o88008J37874j51282
14151A3761820o70819L08054o57898j4449j72448l54868J28244l36555o0200m21075
14141A1509806R241o02536M05902n01047m3662k54493m51197J77617k58685L52221
14131A0343167l51778m6818n00948P7650l20941L55353m57183j17387l85585P5821
$$ plain form
14121 8671351 8621883 8486548 8499290 8273347 8382537 8315788 7723435 7789842 7831141 7621683
14111 7621683 7487625 7432855 7410113 7285287 6806946 6985277 7315904 7055688 6881723 6654935
14101 6654935 6949075 6568358 6648394 6599336 6268631 6415231 6172697 6122261 6030003 5839905
14091 5839905 6044158 6157160 5737400 5676684 5829771 5424770 5643219 5404479 5655843 5196725
14081 5196725 5261074 5424958 5193825 4978490 4875033 5114591 5117021 5110459 5020672 4477902
14071 4477902 5085492 4916007 4601186 4835500 4367217 4486893 4517979 4451932 4254815 4312715
14061 4312715 4522745 4217321 4477697 4289487 4033763 4088825 4068771 4118945 4308582 4026994
14051 4026994 4010033 3967542 3831724 4060836 3706520 3402925 3771568 3614940 3532577 3416041
$$ packed form
14121H671351m9468j35335J2742k25943J09190o6749n92353O6407M1299k09458
14111G621683j34058n4770k2742j24826m78341J78331L30627k60216j73965k26788
14101F654935K94140l80717Q0036m9058l30705J46600k42534n0436r2258j90098
14091E839905K04253J13002m19760o0716J53087m05001K18449k38740K51364m59118
14081E196725O4349J63884k31133k15335j03457K39558K430o562q9787n42770
14071D477902O07590j69485l14821K34314m68283J19676L1086o6047j97117N7900
14061D312715K10030l05424K60376j88210k55724N5062k0054N0174J89637k81588
14051D026994j6961m2491j35818K29112l54316l03595L68643j56628q2363j16536
$$ plain form
14041 3416041 3504608 3633321 3552552 3394142 3544270 3396997 3514150 3200973 3121519 3452287
14031 3452287 3230256 3417892 3342784 3453883 3124219 3313745 2971831 2944893 2888949 3202069
14021 3202069 2869320 2847780 2749414 2692762 2891246 2709944 2923767 2920964 2654651 2642732
14011 2642732 2556761 2671705 2842206 2430353 2540323 2785873 2825776 1996984 2430000 2324934
14001 2324934 2309270 2113796 2522888 2522464 2161580 1909740 2552431 2449970 2087015 2374934
13991 2374934 2807483 2822094 3568216 5698542 12522627 28602401 45765064 31079934
13983 31079934 16801460 10170614 7259671 5682972 4830748 4398121 3763515 3157417
13975 3157417 3404994 3062170 2992605 2911181 2865463 2850089 2790528 2499937 2717743 2506317
$$ packed form
14041C416041Q8567J28713q0769j58410J50128j47273J17153l13177p9454L30768
14031C452287k22031J87636p5108J11099l29664J89526l41914k6938n5944L13120
14021C202069l32749k1540r8366n6652J98484j81302K13823k803k66313j1919
14011B642732q5971J14944J70501m11853J09970K45550L9903q28792M33016j05066
14001B324934j5664j95474M09092m24l60884k51840O42691j02461l62955K87919
13991B374934M32549J4611P46122K130326O824085J6079774J7162663j4685130
13983C1079934j4278474o630846k910943j576699q52224m32627o34606o06098
13975C157417K47577l42824o9565q1424m5718j5374n9561k90591K17806k11426
$$ plain form
13965 2506317 2539457 2601889 2351592 2624237 2512091 2286475 2356272 2337846 2288480 1995162
13955 1995162 2251834 2516756 2576512 2166846 1942658 2514104 1931184 2147647 1886944 1825729
13945 1825729 2111235 2244327 2024293 1735093 1945183 1988467 2111123 1833876 1982564 2038100
13935 2038100 1918397 1722490 2125397 1710296 1718392 1933556 1681018 1753463 1597823 1794134
13925 1794134 1800321 1629579 1800717 1618256 1889422 1654420 1697659 1616707 1538597 1719204
13915 1719204 1617066 1548782 1859322 1433304 1589764 1500970 1819871 1920554 1596452 1388567
13905 1388567 1711514 1487462 1439003 1669984 1533362 1514298 1507872 1602914 1809991 1266698
13895 1266698 1288621 1656546 1435100 1322330 1266811 1207567 1271952 1242737 1437093 1612403
$$ packed form
13965B506317L3140O2432k50297K72645j12146k25616O9797j8426m9366k93318
13955A995162K56672K64922N9756m09666k24188N71446n82920K16463k60703o1215
13945A825729K85506J33092k20034k89200K10090M3284J22656k77247J48688N5536
13935B038100j19703j95907M02907m15101Q096K15164k52538P2445j55640J96311
13925A794134O187j70742J71138j82461K71166k35002M3239q0952p8110J80607
13915A719204j02138o8284L10540m26018J56460q8794L18901J00683l24102k07885
13905A388567L22947k24052m8459K30981j36622j9064o426R5042K07077n43293
13895A266698K1923L67925k21446j12770n5519n9244O4385k9215J94356J75310
$$ plain form
13885 1612403 1085542 1427099 1408057 1461637 1725523 1122764 1380911 1343437 1517081 1296272
13875 1296272 1144822 1237830 1210650 1434214 910679 1090279 1414529 1139265 1045233 1386217
13865 1386217 1287676 1063986 1223790 891125 751758 1440583 1413420 871379 1190989 1064967
13855 1064967 1181732 1013896 1246700 1187334 1439901 929013 1060152 907728 552270 956174
13845 956174 1084462 846564 991627 922221 875126 1068354 1285875 1191589 1143155 1118943
13835 1118943 1093976 915201 1083063 926779 799376 1042199 1165593 1343792 1011469 851244
13825 851244 602894 785084 1209513 838610 797906 997105 923650 1448344 958196 912311
13815 912311 719663 1083651 804935 880729 688069 837670 807307 837652 388055 449712
$$ packed form
13885A612403n26861L41557j9042N3580K63886o02759K58147l7474J73644k20809
13875A296272j51450R3008k7180K23564n23535J79600L24250k75264r4032L40984
13865A386217r8541k23690J59804l32665j39367O88825k7163n42041L19610j26022
13855A064967J16765j67836K32804n9366K52567n10888J31139j52424l55458M03904
13845I56174J28288k37898J45063o9406m7095J93228K17521r4286m8434k4212
13835A118943k4967j78775J67862j56284j27403K42823J23394J78199l32323j60225
13825H51244k48350J82190M24429l70903m0704J99199p3455N24694m90148m5885
13815I12311j92648L63988k78716P5794j92660J49601l0363L0345C88055O1657
$$ plain form
13805 449712 835401 1216597 751722 906972 1109758 809259 880730 825701 880840 856863
13795 856863 1029071 845434 915688 959802 618988 873331 744556 798717 931706 744156
13785 744156 793491 1067737 655654 915239 1049452 691774 644973 948370 326181 625475
13775 625475 919018 518152 832011 657611 943525 946759 673527 693117 525338 535986
13765 535986 516858 504573 681345 636292 672530 835262 1006475 557375 671693 686607
13755 686607 712387 579776 766103 727120 638516 947123 667110 480281 982116 643662
13745 643662 442389 676887 489108 785330 692077 528518 345395 690134 510814 883559
13735 883559 239292 689032 493954 803623 894951 965981 825264 585794 810448 401836
$$ packed form
13805D49712L85689L81196m64875J55250K02786l00499P1471n5029N5139k3977
13795H56863J72208j83637P0254M4114l40814K54343j28775N4161J32989j87550
13785G44156M9335K74246m12083K59585J34213l57678m6801L03397C26181K99294
13775F25475K93543m00866L13859j74400K85914L234k73232J9590j67779J0648
13765E35986j9128j2285J76772m5053L6238J62732J71213m49100J14318J4914
13755F86607K5780j32611J86327l8983q8604L08607k80013j86829N01835l38454
13745F43662k01273K34498j87779K96222r3253j63559j83123L44739j79320L72745
13735H83559B39292M49740j95078L09669R1328P1030j40717k39470K24654D01836
$$ plain form
13724 63069 880683 1004868 464004 417195 675539 680325 438434 764848 798339 593218
13714 593218 631272 381537 545928 394692 346486 583131 603294 438664 502979 768960
13704 768960 512011 388494 93338 558933 543474 369043 633608 819131 497963 309790
13694 309790 433323 551863 715371 434714 616512 293404 359346 596840 270190 493130
13684 493130 531741 724727 706115 485269 550019 272410 392748 457361 513691 541097 269307
13672 743523 479081 201146 604816 455537 732504 226103 262205 254095 730404 394371
13662 394371 462162 629197 493849 113932 437851 251649 479793 412122 394426 431605
13652 431605 247961 455696 454657 477603 317411 654218 359482 795123 586339 514853
$$ packed form
13724F3069Q17614J24185D64004m6809K58344M786k41891L26414L3491k05121
13714E93218L8054k49735J64391j51236m8206K36645K0163j64630O4315K65981
13704G68960k56949j23517I3338M65595j5459j74431K64565J85523l21168j88173
13694C09790J23533J18540J63508k80657J81798B93404O5942K37494B70190K22940
13684D93130L8611J92986j8612k20846O4750B72410J20338O4613N6330K7406B69307
13672G43523k64442B01146M03670j49279K76967B26103L6102q110M76309l36033
13662C94371O7791J67035j35348A13932L23919j86202K28144o7671j7696L7179
13652D31605j83644K07735j039K2946j60192L36807k94736M35641k08784p1486
$$ plain form
13642 514853 638220 263259 456849 490913 123775 437951 680856 621249 204157 501255
13632 501255 48850 348631 262000 282500 348841 448045 420929 560283 475775 286601 439843
13621 439843 540956 356476 675859 430069 142114 439484 311429 653732 261052 352155
13611 352155 149957 304911 416274 478902 369229 167118 212772 514597 367403 577348
13601 577348 100295 355109 387029 443401 280214 212181 357012 499372 213313 463970
13591 463970 394800 401275 409735 194738 399934 126406 157993 130667 481997 473432 296172
13580 296172 324896 541716 214695 466353 342007 471440 703881 304768 301049 583575
13570 583575 361709 502115 346788 861487 480035 295050 303697 294466 207793 545420
$$ packed form
13642E14853J23367B63259J93590L4064A23775L14176K42905n9607B04157K97098
13632E01255D8850K99781q6631K0500O6341R9204k7116J39354q4508j89174J53242
13621D39843J01113j84480L19383k45790A42114K97370j28055L42303B61052R1103
13611C52155A49957J54954J11363O2628j09673A67118M5654L01825j47194K09945
13601E77348A00295K54814L1920N6372j63187o8033J44831J42360B13313K50657
13591D63970o9170O475Q460A94738K05196A26406L1587k7326L51330q565j77260
13580B96172K8724K16820B14695K51658j24346J29433K32441C04768l719K82526
13570E83575k21866J40406j55327N14699l81452j84985Q647r231q6673L37627
$$ plain form
13560 545420 212658 359488 238718 167663 383500 293405 629043 191028 39390 569718
13550 569718 86537 218322 390738 89309 333050 234125 355077 409363 51908 518052
13540 518052 475300 171872 20303 331993 281623 -103027 31501 346976 102809 155264
13530 155264 215865 399526 203782 376731 220808 765814 338776 337236 321181 262092
13520 262092 472782 340096 513793 431748 214219 236199 413057 163118 335280 164810
13509 260152 287387 172066 409059 -34585 166898 324204 455657 242813 69124 352325
13499 352325 380126 339315 209207 304516 149587 122525 518592 268220 729413 487612
13489 487612 386396 211216 283742 139930 463516 128427 118140 154291 281419 523369
$$ packed form
13560E45420B12658J46830j20770p1055K15837r0095L35638A91028C9390N30328
13550E69718H6537J31785J72416H9309K43741r8925J20952N4286E1908M66144
13540E18052m2752A71872B0303L11690n0370a03027C1501L15475A02809N2455
13530A55264O0601J83661j95744J72949j55923N45006C38776j540j6055n9089
13520B62092K10690j32686J73697q2045B14219K1980J76858A63118J72162A64810
13509B60152K7235j15321K36993c4585A66898J57306J31453k12844F9124K83201
13499C52325K7801m0811j30108R5309A49587k7062L96067k50372M61193k41801
13489D87612j01216j75180P2526A39930L23586A28427j0287L6151J27128K41950
$$ plain form
13479 523369 116683 196700 253414 440932 506094 127239 208245 123889 280516 517029
13469 517029 344825 593341 142004 203788 280549 50205 268202 -64767 -39309 157015
13458 327926 528964 57268 -99758 203813 119812 163872 -1447 162961 102857 419408 494470
13447 494470 254360 234956 293168 224533 159403 147328 431369 383363 178716 308686 258737
13436 258737 248127 414608 257609 191280 365336 498025 233809 2407 469082 111923
13425 143885 214304 347596 104837 405296 174905 270550 360016 256871 362540 136668
13414 52706 90907 241774 121366 147611 540616 206758 174342 429480 326716 117291
13403 527456 314923 30173 210189 143328 174749 16138 220602 465631 290276 83760
$$ packed form
13479E23369A16683Q0017N6714J87518O5162A27239Q1006q4356J56627K36513
13469E17029j72204K48516A42004O1784P6761E0205K17997f4767K5458A57015
13458C27926K01038E7268i9758B03813q4001M4060a447A62961o0104L16551P5062
13447D94470k40110j9404N8212o8635o5130j2075K84041m8006A78716J29970m9949
13436B58737j0610J66481j56999o6329J74056J32689B33809B407M66675A11923
13425A43885P0419J33292A04837L00459A74905R5645Q9466j03145J05669A36668
13414E2706L8201J50867j20408K6245L93005B06758l2416K55138j02764A17291
13403E27456k12533C0173J80016o6861L1421A6138K04464K45029j75355H3760
$$ plain form
13392 238659 608312 153863 308943 96339 -149162 248265 69825 292584 337965 124827
13381 291814 204572 98468 287828 438252 224323 540236 469634 -1728 153164 -79444 156753
13369 342128 107569 357148 226270 223129 150207 -38318 206018 434110 509649 164089
13358 -46073 502894 212069 -95074 608539 392517 354768 198140 439657 -185295 376360
13347 210780 144774 449109 268930 -51183 185878 208035 264120 361627 -213338 361560
13336 441999 37555 419271 221087 4213 -4561 198216 292987 60055 142396 -6145 126403
13324 365194 169126 21559 -14394 185082 -45114 115008 312312 33331 164603 184395
13314 184395 127017 137984 350238 180113 483259 174070 128598 -82912 -92960 79631 332501
$$ packed form
13392B38659L69653A53863J55080I6339a49162B48265F9825K22759M5381A24827
13381B91814q7242I8468J89360J50424k13929L15913p0602a728A53164g9444A56753
13369C42128A07569K49579j30878l141p2922c8318B06018K28092P5539A64089
13358d6073E02894B12069i5074F08539k16022l7749j56628K41517a85295C76360
13347B10780o6006L04335j80179e1183A85878K2157N6085R7507b13338C61560
13336D41999C7555L81716j98184D213d561A98216R4771F0055Q2341f145A26403
13324C65194A69126B1559a4394A85082d5114A15008J97304C3331J31272J9792
13314A84395n7378J0967K12254j70125L03146A74070m5472h2912j0048G9631K52870
$$ plain form
13303 332501 -27862 131941 389536 98499 208595 -16627 127707 113740 213574 -21395 169807
13291 343481 153833 -35236 136455 26951 43972 6130 96291 65062 301778 374561 295749
13280 295749 279459 145545 455204 234649 198500 -178863 -137561 235279 272763 310082
13270 310082 145260 131787 348128 569473 120747 336720 388914 555565 31991 400915
13260 400915 76999 401555 -138921 -122401 126178 163002 335988 -131008 143651 -40862
13249 113225 -192037 88947 -93462 -197162 215193 -128700 156969 163721 229191 214393 -123884
13237 127241 -18721 293175 200877 33969 -319024 120852 220648 140244 -113946 200347
13226 175185 114683 287217 375174 -73213 90310 -144377 257334 198427 292168 129890 204345
$$ packed form
13303C32501b7862A31941K57595I8499J10096a6627A27707j3967R9834b1395A69807
13291C43481A53833c5236A36455B6951J7021F130R0161l1229K36716P2783p8812
13280B95749j6290j33914L09659k20555l6149a78863M1302B35279L7484L7319
13270C10082A45260j3473K16341K21345A20747K15973N2194J66651C1991L68924
13260D00915G6999L24556a38921J6520A26178L6824J72986a31008A43651d0862
13249A13225a92037H8947i3462j03700B15193a28700A56969O752O5470j4798a23884
13237A27241a8721B93175r2298C3969c19024A20852R9796q0404a13946B00347
13226A75185o0502J72534Q7957g3213I0310a44377B57334n8907R3741A29890P4455
$$ plain form
13215 204345 421123 285093 -86671 -189761 355252 -200296 133654 40961 39386 149551
13205 149551 368984 95856 64108 82152 399275 -40694 468710 140111 176743 234095 242107
13194 242107 319503 72646 309585 59212 -48860 269132 131430 16086 334444 -53391 -240418
13183 -240418 196409 224379 204341 153195 214164 129016 94991 304101 28393 -27944 350320
13171 62214 166002 -53364 199969 68075 -323127 448984 315424 411704 -222455 244782
13160 196392 -358520 230148 343175 183092 292450 -59292 48011 232797 393729 -32050
13149 45152 123884 75533 -199609 49225 -64887 149085 289294 -23419 99759 69515 224059
13138 224059 21711 4792 -214142 -33194 35745 26967 -194950 -15000 -109365 325714 -140942
$$ packed form
13215B04345K16778j36030h6671j03090C55252b00296A33654D0961j575J10165
13205A49551K19433I5856l1748J8044L17123d0694D68710A40111L6632N7352Q012
13194B42107P7396G2646K36939E9212d8860B69132A31430A6086L18358e3391j87027
13183b40418A96409K7970k0038n1146O0969q5148l4025K09110B8393b7944C50320
13171F2214J03788e3364A99969F8075c23127D48984j33560R6280b22455B44782
13160A96392c58520B30148J13027j60083J09358e9292D8011J84786J60932c2050
13149D5152P8732m8351a99609D9225f4887A49085J40209b3419I9759l0244J54544
13138B24059B1711D792b14142c3194C5745q778a94950a5000r4365C25714a40942
$$ plain form
13126 208169 -50368 95592 -85304 50415 -68318 209199 134652 318623 -31941 -233468 299241
13114 16001 162523 -45434 -47780 129193 166515 19146 -264580 92103 359376 85871 204865
13103 204865 215364 264924 98044 -30626 117974 98719 260510 230817 185375 -110717 11219
13091 -36813 -305781 -156145 -264412 157276 -34272 -237141 -144988 -112305 173076 -93593
13080 -58073 229109 -37583 -6453 -474876 -62850 90501 44647 396168 176162 -83046 -110783
13069 -110783 282971 62284 260455 128514 146667 432918 20012 105314 30994 -205767
13058 -192093 -147885 280491 89673 115221 -171512 -143555 277017 328973 160101 187952 107996
13047 107996 294662 -45233 -5447 285372 170893 113099 -132272 82988 -12001 213518 171062
$$ packed form
13126B08169e0368I5592h5304E0415f8318B09199p4547J83971c1941k01527B99241
13114A6001J46522d5434k346A29193L7322A9146b64580I2103K67273H5871J18994
13103B04865J0499M9560I8044c0626A17974j9255J61791k9693m5442a10717A1219
13091c6813k68968J49636j08267A57276c4272k02869R2153L2683A73076i3593
13080e8073B29109c7583f453m68423f2850I0501D4647L51521A76162h3046k7737
13069a10783B82971F2284J98171A28514J8153K86251B0012Q5302C0994b05767
13058a92093M4208B80491H9673K5548a71512K7957B77017N1956A60101K7851p9956
13047A07996J86666d5233e447B85372j14479n7794a32272H2988a2001B13518m2456
$$ plain form
13036 171062 236080 -198467 185933 -81842 -247763 4460 -5601 293171 312898 -122113 213439
13024 48617 225446 -201353 -222883 340915 -24788 302191 92846 -41008 168916 146129 -254122
13012 223029 57691 187768 -73167 181762 78359 261053 -2219 -74168 -95468 87805 203457
13001 203457 -103897 226423 -235698 20128 244409 492364 -76474 4834 -49239 59661 88998
12990 88998 136320 370589 245268 80890 166472 2557 19461 -404093 -54188 190748 -167306
12978 15111 -120707 81950 352351 170736 129814 244806 -140012 3181 128953 66531 255355
12967 255355 321407 -40382 220546 30261 177759 -50451 390954 222403 114191 244445
12957 244445 257028 -70141 -101480 479876 65057 -172091 128506 272449 -73754 386344
$$ packed form
13036A71062O5018a98467A85933h1842j65921D460e601B93171J9727a22113B13439
13024D8617J76829b01353k1530C40915b4788C02191I2846d1008A68916k2787b54122
13012B23029E7691J30077g3167A81762G8359J82694b219p1949k1300H7805J15652
13001B03457a03897B26423b35698B0128K24281K47955g6474D834d9239E9661K9337
12990H8998M7322K34269j25321H0890Q5582B557J6904d04093e4188A90748a67306
12978A5111a20707H1950K70401A70736m0922J14992a40012C181J25772o2422J88824
12967B55355O6052d0382B20546C0261J47498e0451C90954j68551j08212J30254
12957B44445J2583g0141l1339D79876F5057a72091A28506J43943g3754C86344
$$ plain form
12946 120782 105695 229234 -140505 -157554 238221 -89487 -4325 207377 75771 261375 217600
12935 217600 -25164 -6068 -73868 -8237 197412 45866 234740 128463 217108 -141360 410641
12923 483487 -101158 371371 -27124 -8931 142095 -41071 -5079 162807 -100037 -38136 62287
12911 -15853 155365 -210982 189505 46839 4817 113749 34148 233945 -338126 90308 317805
12900 317805 110757 137507 -121815 -183970 71972 -91221 20084 -183399 169169 280257
12890 280257 137408 109452 -67289 348993 176680 120988 127994 -93438 39535 -252485 -261595
12879 -261595 227230 15969 138821 -101226 183751 -483310 -62151 114447 -77611 -12262
12868 -316075 -13809 159690 249190 -384609 -194017 54645 132888 -38542 -159633 74678 -287708
$$ packed form
12946A20782j5087J23539a40505j7049B38221h9487d325B07377G5771J85604m3775
12935B17600b5164f068o7800h237A97412D5866J88874j06277Q8645a41360D10641
12923D83487a01158C71371b7124h931A42095d1071e079A62807a00037c8136F2287
12911a5853A55365b10982A89505D6839D817J08932C4148J99797c38126I0308K27497
12900C17805A10757K6750a21815o2155G1972i1221B0084a83399A69169J11088
12890B80257A37408k7956f7289C48993j72313n5692P006i3438C9535b52485r110
12879b61595B27230A5969J22852a01226A83751d83310f2151A14447g7611a2262
12868c16075a3809A59690Q9500c84609J90592E4645P8243c8542j21091G4678b87708
$$ plain form
12856 -142601 -77927 -179185 -172202 -361894 31293 -449397 -57402 177391 173961 64288 45777
12845 45777 -206061 409406 -209138 -276462 80168 81752 80746 115842 156549 9933 320741
12834 320741 -27890 -214274 184359 86999 45715 209948 -74350 242989 -138989 -200667
12824 -200667 185645 -92215 -463 12206 -112616 21414 -23953 99581 96069 268635 -203079
12812 12155 149652 -10292 24574 -182904 -32086 342261 -219558 -16476 -72919 -205205 80881
12800 129242 69355 169227 175714 256262 31274 50303 249487 -67998 132422 -154856 196965
12788 28430 -46620 -366053 50213 49145 102253 271434 164539 -174339 717913 -58373 -8274
12776 -272473 64994 264983 24692 -102220 -79653 -90817 -389926 -190302 -101241 -61500 201813
$$ packed form
12856a42601O4674j01258O983j89692C1293d49397e7402A77391l430F4288j8511
12845D5777b06061D09406b09138o7324H0168J584j006L5096M0707I933L10808
12834C20741b7890j86384A84359H6999m1284J64233g4350B42989a38989o1678
12824b00667A85645i2215d63A2206a12616B1414b3953I9581l512J72566b03079
12812A2155J37497a0292B4574a82904c2086C42261b19558a6476n6443j32286H0881
12800A29242n9887R9872O487Q0548C1274J9029J99184f7998A32422a54856A96965
12788B8430d6620l19433E0213j068N3108J69181j06895a74339G17913e8373h274
12776b72473F4994J99989B4692a02220K2567j1164k99109a90302Q9061L9741B01813
$$ plain form
12764 230736 46543 312274 -143370 102682 -470668 298105 -61314 -235886 66845 -9076
12753 122143 304689 -11851 -4006 -15225 252943 -249529 -45861 -335192 32263 -288537 -198698
12742 -198698 43501 -305308 -108950 -109729 19904 -155693 135826 17619 223878 -58066 -124963
12731 -124963 64539 238269 136567 31351 145833 -42483 -94923 317120 265000 223172 125142
12720 125142 268179 -14140 36069 -47032 166186 -54887 -98164 193191 -184156 -328183
12710 -328183 235457 110923 -204124 -66350 397933 41652 -132222 254994 -89031 46448
12699 -15697 2019 292920 -234840 170048 -76048 -15285 -19973 -359187 -79461 -83557 227747
12687 28485 -116368 7832 53041 -45750 113863 408207 -333637 62835 128272 -107801 319972
$$ packed form
12764B30736D6543K65731a43370A02682d70668B98105f1314j74572F6845i076
12753A22143J82546a1851d006j1219B52943b49529d5861k89331C2263b88537Q9839
12742a98698D3501c05308a08950p79A9904a55693A35826A7619K06259e8066o6897
12731a24963F4539J73730j01702C1351J14482d2483n2440C17120n2120m1828r8030
12720A25142J43037a4140C6069d7032A66186e4887m3277A93191a84156j44027
12710c28183B35457A10923b04124f6350C97933D1652a32222B54994h9031D6448
12699a5697B019K90901b34840A70048g6048a5285m688l39214g9461m096B27747
12687B8485a16368G832M5209d5750A13863K94344c33637F2835O5437a07801C19972
$$ plain form
12675 -147017 -18790 277642 298068 -297420 294737 200771 172135 202294 -130284 226829
12664 -124655 576162 -12482 254204 329677 -135131 274720 191668 215104 123293 346747
12654 346747 -96632 226780 2327 128377 305715 270610 182952 81382 -20634 167596 227301
12643 227301 157161 -5025 139656 85661 253859 -106223 -111751 174081 28620 109898 208143
12632 208143 35026 93730 -33462 334740 607562 265880 470719 302657 196152 -60334
12621 -16750 299692 120705 -103078 251382 302210 82319 69954 214225 -84072 -322414
12611 -322414 108523 389398 -81245 37263 228040 -202388 261038 -113406 359180 135885
12600 82506 238357 73665 138106 -26021 -51913 -30530 -176706 -14422 162627 -57233 64330
$$ packed form
12675a47017a8790B77642K0426b97420B94737r3966k8636L0159a30284B26829
12664a24655E76162a2482B54204P5473a35131B74720q3052K3436r1811K23454
12654C46747i6632B26780B327J26050J77338l5105q7658H1382b0634A67596N9705
12643B27301p0140e025A39656n3995J68198a06223n528A74081B8620Q1278R8245
12632B08143C5026N8704c3462C34740K72822B65880K04839j68062j06505f0334
12621a6750B99692A20705a03078B51382N0828H2319j2365J44271h4072k38342
12611c22414A08523K80875h1245C7263J90777b02388B61038a13406C59180A35885
12600H2506J55851G3665O4441b6021k5892K1383j46176a4422A62627e7233F4330
$$ plain form
12588 -112210 149268 153810 129390 100214 8584 -77631 301301 77589 21659 102171 -99551
12576 293253 -24863 -262478 66512 -264423 -201177 -234763 -123601 340220 109656 109218 185086
12565 185086 -288590 -130037 86168 -32975 -108061 89209 139009 283617 -93674 20225 28447
12554 28447 -142603 108821 -55991 -30542 87502 214233 129381 160665 51673 -146640 58628
12542 -525809 -115229 -68215 283097 -193379 -57972 30681 109454 -50358 16597 304216 4477
12530 121211 -58944 -34054 11760 22027 -36486 -182758 77520 92653 -4058 300489 86761
12518 -54721 113572 -106102 195348 115722 50030 29138 -89324 287328 -300515 -456501
12508 -456501 -58049 32075 -52711 177093 -190858 -118223 -152603 172435 -78287 143132 151608
$$ packed form
12588a12210A49268M542k4420k9176H584g7631C01301G7589B1659Q0512i9551
12576B93253b4863k37615F6512b64423O3246l3586J11162C40220A09656m38P5868
12565A85086b88590a30037H6168c2975p5086H9209M9800J44608i3674B0225Q222
12554B8447a42603A08821e5991K5449H7502J26731q4852L1284E1673a46640E8628
12542e25809a15229M7014B83097a93379e7972C0681P8773e0358A6597K87619D477
12530A21211e8944K4890A1760J0267c6486j46272G7520J5133d058C00489H6761
12518e4721A13572a06102A95348p9626E0030k0892h9324B87328c00515j55986
12508d56501e8049C2075e2711A77093a90858P2635l4380A72435g8287A43132Q476
$$ plain form
12497 151608 -247974 -358026 -175002 52622 73254 -37779 194559 80136 177071 277857
12487 277857 119484 64145 342997 5219 158928 -362550 -76209 11529 307702 -343779
12476 104707 112672 -51116 29861 236138 -99595 127305 -56762 273588 -101119 -105716 -146401
12465 -146401 61006 -50888 -215617 75994 21569 -24728 -47157 -247515 280834 301495 62459
12453 183866 -104640 426022 -190982 -90401 10297 -13060 111446 14369 -209026 101996
12442 -198168 -110299 -118263 526471 -73424 330266 -229017 89078 -72081 -200820 365982 -51171
12430 -103266 240121 -124291 -50696 -35204 113709 -91430 4493 -144823 17051 77736 244768
12419 244768 9262 151798 -110732 212746 275318 -311376 -153655 -106700 262716 -22209
$$ packed form
12497A51608b47974j10052a75002E2622K0632c7779A94559H0136R6935J00786
12487B77857A19484n5339K78852E219J53709c62550g6209A1529K96173c43779
12476A04707P965e1116B9861K06277i9595A27305e6762B73588a01119m597m0685
12465a46401F1006e0888j64729G5994B1569b4728k2429k00358B80834K0661F2459
12453A83866a04640D26022a90982i0401A0297a3060A11446A4369b09026A01996
12442a98168Q7869p964E26471g3424C30266b29017H9078g2081j28739C65982e1171
12430a03266B40121a24291e0696J5492A13709i1430D493a44823A7051O0685J67032
12419B44768I262J42536a10732B12746O2572c11376a53655M6955B62716b2209
$$ plain form
12408 237220 -4638 279656 17275 -72816 -67160 353001 246337 -116692 373595 5596 -116499
12396 182008 -74616 -44319 -21341 -217707 119406 -274837 -127303 -142319 32135 -311612
12385 -7574 -227010 219048 -3577 -104881 -248877 -38908 -149034 170793 -154015 -164480 32047
12373 91559 245002 -78412 -87581 -22582 34161 -254095 -166247 -50271 -59696 -50016 -215064 -125291
12361 -125291 3342 117842 21415 146021 -27020 184056 -127975 -44943 50202 -193417 124945
12349 -299925 134061 119168 -192758 -73457 -451840 106466 175776 -148781 60329 -174098
12338 149097 165360 209923 -145305 28482 -79371 164072 159969 -24212 212237 32979 242764
12327 242764 254718 -2320 196464 309336 198128 -41218 61605 255673 -46945 1551 -85427
$$ packed form
12408B37220d638B79656A7275g2816N656C53001j06664a16692C73595E596a16499
12396A82008g4616L0297b1341j96366A19406b74837a27303j5016C2135c11612
12385g574k19436B19048c577j01304j43996c8908j10126A70793a54015j0465C2047
12373I1559J53443g8412r169b2582C4161b54095Q7848e0271r425R680j65048Q9773
12361a25291C342J14500B1415J24606b7020A84056a27975d4943E0202a93417A24945
12349b99925A34061j4893a92758g3457l78383A06466O9310a48781F0329a74098
12338A49097J6263M4563a45305B8482g9371A64072m103b4212B12237C2979K09785
12327B42764J1954b320A96464J12872j11208d1218F1605J94068d6945A551h5427
$$ plain form
12315 -245819 347347 334721 -142483 -122812 -93219 -225604 -31091 -328814 325973 72235
12304 -92898 48686 -77670 218394 -78483 -333560 105830 115582 -67218 247335 19344 322765
12293 322765 -46712 346653 -270546 46550 40060 57175 26602 -82363 115174 -239493 -73070
12281 125384 225935 88941 62494 -86414 -166057 145533 173821 234273 -206897 252411 102813
12269 163099 168295 16381 -247708 109179 -74581 -110270 40357 284840 -243299 -150081 39486
12257 106711 422605 147666 114336 -241094 94255 110095 126627 -85536 136932 141450 -47419
12245 57283 -27677 -61379 -102349 145967 43526 -26150 294115 372473 -41186 -119347 13507
12233 34246 41942 11247 64458 -48090 153248 30907 -201983 133364 226063 -152892 126565
$$ packed form
12315b45819C47347j2626a42483J9671K9593j32385c1091k97723C25973G2235
12304i2898D8686g7670B18394g8483k55077A05830R752f7218B47335A9344L03421
12293C22765d6712C46653b70546D6550o490J7115B6602h2363A15174b39493g3070
12281A25384J00551H8941k6447h6414p9643A45533K8288O0452b06897B52411A02813
12269A63099N196A6381b47708A09179g4581l5689D0357K44483b43299R3218C9486
12257A06711L15894A47666l3330b41094I4255J5840J6532h5536A36932M518d7419
12245E7283b7677l3702m0970A45967D3526b6150B94115P8358d1186p8161A3507
12233C4246P696A1247N3211d8090A53248C0907b01983A33364R2699a52892A26565
$$ plain form
12221 306865 263339 97853 298156 -107617 -272452 -38666 60198 180821 -86773 228774
12210 6593 310547 -89976 160412 332301 -136592 -59209 -73919 139587 63440 130522 117251
12199 117251 162252 75244 446116 151217 -50226 469881 193683 222097 99036 595036
12189 595036 124485 -139701 -204820 130209 -136728 178150 -39750 214644 -104823 324939
12178 -258703 -23084 -44599 102085 93188 -49721 -88405 277344 264974 -303959 368563 317859
12167 317859 153413 33701 157171 272824 -303757 436059 -3052 57543 126142 15569 24960
12156 24960 -151332 104555 25187 -299492 -56794 18443 10473 266289 8489 -39651 268643
12144 -43224 197418 -116079 95574 209528 32430 152730 201769 -64507 233504 -12365 99171
$$ packed form
12221C06865m3526I7853K00303a07617j64835c8666F0198J20623h6773B28774
12210F593L03954h9976A60412J71889a36592e9209j4710A39587F3440O7082j3271
12199A17251M5001G5244L70872A51217e0226D69881A93683K8414I9036M96000
12189E95036A24485a39701o5119A30209a36728A78150c9750B14644a04823C24939
12178b58703b3084k1515A02085q897d9721l8684B77344j2370c03959C68563n0704
12167C17859A53413C3701J23470J15653c03757D36059c052E7543O8599A5569R391
12156B4960a51332A04555B5187b99492e6794A8443p970K55816H489c9651B68643
12144d3224A97418a16079I5574J13954C2430J20300M9039f4507B33504a2365I9171
$$ plain form
12132 170298 11183 -68108 44479 47505 -233315 294745 123489 89757 209074 -12471 7206
12120 45773 -221364 137679 -130611 -208868 18226 84675 314506 51787 -32765 -122317 1789
12108 191827 -57373 132592 22097 -203289 85003 -324248 112440 -62489 -147529 -111279 -48037
12096 116729 -12192 -145556 -105370 -23386 279627 -110652 207158 -183021 -322378 66341
12085 -11066 160889 47341 -163619 -394107 -170666 26404 140975 -162110 -46070 299998
12074 235147 -15012 17362 93259 -114238 189160 80617 272524 13867 -551120 -126528
12063 137667 351266 1598176 1177447 517203 352727 -41571 -86956 99866 -240 611116
12052 177464 77166 -122018 -91488 -108919 -5560 15804 48116 202901 -89517 130011 4191
$$ packed form
12132A70298A1183f8108D4479L026b33315B94745A23489l3732J19317a2471G206
12120D5773b21364A37679a30611p8257A8226O6449K29831E1787c2765q9552A789
12108A91827e7373A32592B2097b03289H5003c24248A12440f2489q5040L6250d8037
12096A16729a2192j33364M0186b3386B79627a10652B07158a83021j39357F6341
12085a1066A60889D7341a63619k30488a70666B6404J14571a62110d6070B99998
12074B35147a5012A7362P5897a14238A89160H0617J91907A3867e51120a26528
12063A37667K13599J246910m20729E17203j64476d1571m5385I9866b40F11116
12052A77464G7166a22018L0530j7431e560A5804L2312J54785h9517A30011D191
$$ plain form
12040 35899 -280228 -175567 -203100 -312656 98085 -50963 -314457 139076 -162824 48394
12029 -189009 62281 -191603 -313953 -123540 170405 -254622 -32956 -117659 -142984 -84007
12019 -84007 18609 81713 -60663 -73956 -370772 -67997 -138934 300719 -401397 63526 -66761
12007 -240481 134198 -102510 37312 -408229 -147185 4952 141335 -67883 14901 6516 -19366
11995 19598 -185350 65159 -456192 -56524 62348 63378 -42171 -174333 273113 105174 -40640
11983 208405 365900 319464 -106939 238047 63138 -36780 -159554 69755 -86765 -45129 35251
11971 -182078 -341839 -39195 -12918 -87288 -13347 -189472 163024 24437 -116138 -233199
11961 -233199 -52166 52729 338856 -56118 -108921 -256522 -80203 30359 252629 203990 -383284
$$ packed form
12040C5899b80228J04661k7533j09556I8085e0963k63494A39076a62824D8394
12029a89009F2281a91603j22350a23540A70405b54622c2956q4703k5325N8977
12019h4007A8609O3104f0663j3293k96816f7997p0937C00719d01397F3526f6761
12007b40481A34198a02510C7312d08229a47185D952J36383f7883A4901F516a9366
11995A9598a85350F5159d56192e6524F2348J030d2171j32162B73113A05174d0640
11983B08405J57495m6436a06939B38047F3138c6780j22774F9755h6765M1636C5251
11971a82078j59761c9195a2918p4370a3347j76125A63024B4437a16138j17061
11961b33199e2166E2729K86127e6118n2803j47601h0203C0359K22270m8639c83284
$$ plain form
11949 135033 -215723 123774 -417209 40497 -4847 2420 -266226 -212501 78815 -88440 -253215
11938 -253215 -10722 -127273 247997 -205960 -423124 -176802 -112691 93151 27192 305714
11928 305714 208988 -167902 288183 -68921 -55808 -179957 -169107 129856 -199203 -172743
11918 -172743 152936 -234366 -201047 -64423 -78707 26852 -15235 -29533 36293 148984 75143
11907 75143 -367283 224691 42415 -116092 164578 -365663 36352 129037 -5320 -19861 82762
11895 234218 -67881 -68701 -64397 -142071 178261 -258257 283111 9625 198660 26572 66593
11884 66593 -144657 72262 52135 -70389 13153 16090 -216349 -229252 246255 -143917 -45325
11872 39104 -355702 110066 182216 122175 81009 103039 -104952 14468 -18698 -125774 89555
$$ packed form
11949A35033b15723A23774d17209D0497d847B420b66226N3725G8815h8440j64775
11938b53215a0722j16551B47997b05960k17164a76802O4111I3151B7192K78522
11928C05714r6726a67902B88183f8921J3113j24149J0850A29856a99203K6460
11918a72743A52936b34366L3319f4423j4284B6852a5235j4298C6293J12691p3841
11907G5143c67283B24691D2415a16092A64578c65663C6352R2685e320j4541H2762
11895B34218f7881q20M304p7674A78261b58257B83111I625J89035B6572M0021
11884F6593a44657G2262k0127g0389A3153K937b16349j2903B46255a43917d5325
11872C9104c55702A10066P2150o0041m1166K2030a04952A4468a8698j07076H9555
$$ plain form
11860 -166393 232933 -265739 -212530 79853 -1211 311114 -207453 -39355 43447 58897 29031
11848 -46503 45163 -58629 -7189 23616 -79063 32022 86639 -111926 -59537 85522 -160123
11836 -327540 225901 169804 181159 22433 -513852 -244189 -45449 -22293 -26179 6496 -35062
11824 -72912 -90004 -79980 -72615 341255 -260743 -62509 -316843 -16272 -204202 -4775 85697
11812 -247612 105620 223520 -88157 -30612 -325965 166599 -358952 -475734 -322880 -482345
11802 -482345 -78229 7946 43213 -242746 -107304 -25417 38347 -39462 -244641 50119 -2332
11790 -22091 137829 263077 -355317 -19232 -21705 11237 -66392 13344 149835 -284895 90386
11778 -101846 71767 -145511 -244939 185043 25424 77779 94193 18096 -92042 -197468 -249394
$$ packed form
11860a66393B32933b65739N3209G9853a211C11114b07453c9355D3447J5450B9031
11848d6503D5163e8629g189B3616g9063C2022N4617a11926N2389H5522a60123
11836c27540B25901n6097J1355B2433e13852b44189d5449b2293l886F496c5062
11824g2912j7092J0024P365C41255b60743f2509k54334a6272j87930d775H5697
11812b47612A05620J17900h8157c0612k95353A66599c58952j16782J52854j59465
11802d82345g8229G946L5267b42746a07304b5417C8347c9462k05179E0119b332
11790b2091A37829J25248c55317a9232k473A1237f6392A3344J36491b84895I0386
11778a01846G1767a45511r9428A85043B5424N2355J6414A8096i2042j05426n1926
$$ plain form
11767 -249394 -104704 -216449 105005 7671 -292874 346412 251084 -37931 187875 -184110
11756 212216 30058 1291 -313270 116689 -44358 -357663 48384 152483 -22743 -3032 236946
11744 -157155 -238323 -127916 200322 123182 -160650 215087 -184918 133338 258074 281422
11734 281422 -104857 -76059 -237159 6079 89171 204593 59515 -254412 -81019 55323 -225746
11722 -30453 62891 -386728 306506 100798 170541 -29219 -14913 -228448 -31596 157216 53509
11710 -60883 -96169 -260906 89488 -129575 -227734 169256 -214698 -268896 94137 140304 214865
11699 214865 -210889 23244 -92130 86378 -234661 -110875 30911 -129860 -186052 265252
11688 -188634 246076 -67419 -3252 -52699 13394 -216353 -66533 -70219 48742 -245992 -225748
$$ packed form
11767b49394a04704j11745A05005G671b92874C46412r5328c7931A87875a84110
11756B12216C0058A291c13270A16689d4358l13305D8384J04099b2743c032B36946
11744a57155q1168J10407B00322p7140a60650B15087a84918A33338J24736K3348
11734B81422a04857K8798j61100F079Q3092J15422E9515b54412h1019E5323b25746
11722c0453F2891c86728C06506A00798O9743b9219J4306k13535c1596A57216E3509
11710f0883l5286j64737H9488a29575r8159A69256b14698n4198I4137M6167P4561
11699B14865b10889B3244i2130H6378b34661a10875C0911a29860n6192B65252
11688a88634B46076f7419c252m9447A3394b16353f6533l686D8742b45992K0244
$$ plain form
11677 -225748 107653 -52528 192863 -15887 71252 275609 -440382 -21781 268430 -200500
11666 -212906 25142 196909 -163403 104001 26530 59761 -72552 -98049 -190165 30217 86832
11655 86832 56353 -365915 -179669 -85993 44122 54104 -36227 -147255 108226 78329 -169749
11643 310095 -71185 255576 2427 -234409 37193 -315083 -265929 75907 -127610 -196278 -77310
11631 223908 -9968 81728 -28992 225859 -46617 -99351 363537 159289 406839 177624 118921
11620 118921 -94302 -65429 -25252 -921 279499 -278612 -55452 -215221 -230539 237120 -206804
11608 -199638 -126922 219366 282078 265929 263757 213093 -34250 65306 -281373 -140714 -2675
11596 118592 89698 -168919 261911 -112047 -70990 -15340 363136 -174707 422703 159793
$$ packed form
11677b25748A07653e2528A92863a5887G1252K04357d40382b1781B68430b00500
11666b12906B5142J71767a63403A04001B6530L3231g2552k5497r2116C0217N6615
11655H6832l0479c65915a79669h5993D4122R982c6227j11028A08226k9897a69749
11643C10095g1185B55576B427b34409C7193c15083M9154G5907a27610o8668g7310
11631B23908i968H1728b8992B25859d6617n2734C63537A59289K47550A77624n8703
11620A18921i4302K8873b5252i21B79499b78612e5452j59769j5318B37120b06804
11608a99638P2716B19366O2712j6149k172n0664c4250F5306b81373J40659b675
11596A18592k8894a68919B61911a12047M1057a5340C63136a74707D22703A59793
$$ plain form
11585 -109869 112134 -14493 164273 -148054 188883 133404 120670 115060 36032 168742 79074
11573 65483 -326472 489107 -307347 227449 158767 70894 -91604 140101 -125458 -251881
11563 -251881 22885 -165394 -314672 -299592 -124248 -201313 -172793 -492888 94199 -96866 115848
11551 38361 249488 62807 202643 -134819 -109511 310709 80933 69794 -47301 185416 59510
11539 34031 162726 -246663 -3709 205768 39536 61592 -109255 105615 -10203 109899 132430
11528 132430 83032 -88448 82043 -132281 -176083 165666 -42327 -12696 -239188 -114864 126651
11516 -176916 -15666 83160 159048 -46421 71714 116193 258906 -221504 350479 -123920 174442
11504 274547 20424 149892 -148690 33224 -168161 -276707 251480 96143 321853 273194
$$ packed form
11585a09869A12134a4493A64273a48054A88883n5479j2734n610C6032J32710G9074
11573F5483c26472D89107c07347B27449o8682G0894i1604A40101a25458j26423
11563b51881B2885a65394j49278J5080a24248p7065K8520l20095I4199i6866A15848
11551C8361K11127F2807J39836a34819K5308C10709H0933j1139d7301A85416E9510
11539C4031J28695b46663c709B05768C9536K2056a09255A05615a0203A09899K2531
11528A32430m9398h8448H2043a32281m3802A65666d2327a2696k26492a14864A26651
11516a76916a5666H3160P5888d6421G1714M4479J42713b21504C50479a23920A74442
11504B74547B0424J29468a48690C3224a68161j08546B51480I6143K25710m8659
$$ plain form
11494 273194 -138609 50323 311267 -182979 -46228 -57420 -249037 116956 173386 -248662
11483 87205 177525 185316 177603 464692 -172719 213535 -86362 49989 123996 280469 67447
11471 37747 -102634 350648 290337 -19529 4942 222502 142221 84563 -126732 109075 323993
11460 323993 -110862 135828 102417 -316782 229162 276698 -227248 -40502 85235 -341242
11449 123074 514090 89388 3938 -45372 36433 219079 191067 84108 -239207 -160481 500913
11437 48798 -284381 38332 -61627 217275 264109 168438 -78904 -42469 22082 -138557 240406
11425 -38476 19891 -118629 121457 -304501 -156575 -118121 -86989 301097 -166379 -108575
11415 -108575 216722 -336738 -236136 95003 -47164 -159914 -107354 -142620 -81017 164132
$$ packed form
11494B73194a38609E0323K60944a82979d6228j1192j91617A16956N6430b48662
11483H7205R0320P791p713K87089a72719B13535h6362D9989P4007J56473F7447
11471C7747a02634C50648o0311a9529D942K17560q0281n7658a26732A09075K14918
11460C23993a10862A35828l3411c16782B29162M7536b27248d0502H5235c41242
11449A23074L91016H9388C938d5372C6433J82646k8012H4108b39207P8726E00913
11437D8798b84381C8332f1627B17275M6834r5671g8904L6435B2082a38557B40406
11425c8476A9891a18629A21457c04501J47926L8454L1132C01097a66379N7804
11415a08575B16722c36738J00602I5003d7164j12750N2560l5266O1603A64132
$$ plain form
11404 202929 245677 100622 -166138 -143466 139438 72085 -267394 51217 111896 126659 -183236
11392 -32613 216551 -25007 374488 33269 -88218 386217 53132 158087 7766 -281092 -74158
11380 23181 73208 53785 -39798 34891 -248158 -122236 -20199 -165478 4448 -97778 82714
11368 -110673 15758 -174293 48201 -146466 -231812 -41435 -200174 -85963 1926 -101253 155051
11356 -146532 -192816 -81376 162769 247398 54828 -209403 185269 -128429 -23896 120162
11345 -96293 -195265 62288 -98449 363920 -408685 -117789 95405 42376 -85009 25853 -38723
11333 -141619 316828 -49572 -152081 262116 70669 -137970 -36239 -302156 -204394 -230289
11323 -230289 83041 -198035 -280248 -182751 -214971 -312534 113115 -6958 -87786 97371 15887
$$ packed form
11404B02929M2748A00622a66138K2672A39438o7353b67394E1217O0679J4763a83236
11392c2613B16551b5007C74488C3269h8218C86217E3132J04955G766b81092g4158
11380B3181N0027j9423c9798C4891b48158a22236b0199j45279D448i7778H2714
11368a10673A5758a74293D8201a46466q5346d1435j58739h5963A926a01253A55051
11356a46532m6284h1376A62769Q4629E4828b09403A85269a28429b3896A20162
11345i6293r8972F2288i8449C63920d08685a17789I5405D2376h5009B5853c8723
11333a41619C16828d9572j02509B62116G0669a37970c6239k65917R7762k5895
11323b30289H3041a98035q2213R7497l2220r7563A13115f958q0828I7371A5887
$$ plain form
11311 -59842 -348 194763 -181658 -3280 -61402 -156475 112526 26128 -137775 -154213 119866
11299 -332755 1092 50857 239193 -175440 -111813 -148724 -129102 -104371 87598 -267592 -88005
11287 -165767 -119312 -48446 -48392 196263 -77917 134001 364670 172981 -18738 -128083 50076
11275 -276066 -145266 190811 43149 -5725 246412 70555 115326 -21854 152274 -258210 227826
11263 -109448 69777 -393420 140290 -2387 -332014 -266462 -144573 108882 155336 -79470 59980
11251 100088 323162 106130 -109576 -156616 59906 -292793 166686 -46550 221491 68056
11240 -36018 -12524 -213946 -183524 -169883 -97154 -278911 27324 -97209 19524 -67270 -158042
11229 -158042 136290 -93754 256000 105875 -106790 -88724 -32931 -207008 199376 167444
$$ packed form
11311e9842c48A94763a81658c280n8122r5073A12526B6128a37775j6438A19866
11299c32755A092M9765J88336a75440O3627l6911J9622K4731H7598b67592h8005
11287a65767M6455d8446N4A96263g7917A34001K30669A72981a8738j09345E0076
11275b76066J30800A90811D3149e725B46412G0555M4771b1854A52274b58210B27826
11263a09448F9777c93420A40290b387l29627O5552J21889A08882M6454g9470E9980
11251A00088K23074A06130a09576m7040E9906b92793A66686d6550B21491F8056
11240c6018a2524k01422L0422J3641P2729j81757B7324i7209A9524f7270r0772
11229a58042A36290i3754B56000A05875a06790J8066c2931j74077A99376l1932
$$ plain form
11219 167444 194310 -238208 -39643 -189075 69378 -214227 -206016 -287591 -210504 149803 -55649
11207 -167533 96240 61159 -187741 311696 -109471 -443024 -165832 146565 48166 -61890
11196 -81844 21778 144713 -390021 -111753 -170102 -68661 -257087 -2277 162171 148526 -314254
11184 145027 134700 -328942 -256671 -214690 110073 -114269 -5190 -102628 -73186 35003 19205
11173 19205 230433 53646 113710 -10768 -183193 -449442 -116788 91177 -66510 -81285 180773
11161 19952 167127 122660 -213889 131055 92392 -155238 -50378 -268634 -28991 107936
11150 153734 488098 72814 340828 -66861 18222 -81053 -206376 -335833 -29189 43696 264992
11139 264992 -211460 -153851 -57720 -15427 -46727 158551 -459185 -195799 192000 38467
$$ packed form
11219A67444K6866b38208c9643j49432F9378b14227Q211q1575P7087A49803e5649
11207a67533I6240l5081a87741C11696a09471l33553a65832A46565D8166f1890
11196h1844B1778J22935c90021a11753n8349f8661j88426b277A62171j3645c14254
11184A45027j0327c28942P2271M1981A10073a14269e190r7438K9442C5003j5798
11173A9205K11228E3646O0064a0768j72425k66249a16788I1177f6510j4775A80773
11161A9952J47175m4467b13889A31055l8663a55238e0378k18256b8991A07936
11150A53734L34364G2814K68014f6861A8222h1053j25323j29457b9189D3696K21296
11139B64992b11460N7609e7720a5427l1300A58551d59185a95799A92000C8467
$$ plain form
11128 325461 278386 136304 53131 133640 -213725 -223847 217007 -153357 225117 -411119
11117 -95061 7026 160001 48337 170570 -67147 -35464 93689 -100246 161664 33658 -12444
11105 258286 240512 -86679 253156 132749 115451 33925 203941 71715 55942 -70638 264853
11093 -58020 62911 275620 91561 198514 -21158 277319 287657 281650 377800 173865 279915
11082 279915 704881 22703 71288 48234 102252 231153 -183654 196806 -117885 54796
11071 232474 503035 442137 45411 -195286 299506 359226 192368 387460 271354 362097
11061 362097 -10227 608979 460424 714860 735605 469878 332625 391816 445078 581055
11051 581055 457230 699868 910952 718846 584767 579372 205617 555528 941963 881336
$$ packed form
11128C25461m7075A36304E3131Q0509b13725j0122B17007a53357B25117d11119
11117i5061G026J52975D8337J22233f7147L1683I3689a00246A61664C3658a2444
11105B58286j7774h6679B53156j20407j7298C3925J70016G1715j5773g0638B64853
11093e8020F2911K12709I1561J06953b1158B77319J0338o007R6150A73865J06050
11082B79915M24966B2703M8585k3054N4018J28901a83654A96806a17885E4796
11071B32474K70561o0898D5411a95286B99506N9720j66858J95092j16106R0743
11061C62097a0227F08979j48555K54436K0745k65727j37253N9191N3262J35977
11051E81055j23825K42638K11084j92106j34079n395B05617L49911L86435o0627
$$ plain form
11041 881336 831778 472001 294581 684447 855853 612979 753035 757092 590642 540444
11031 540444 959826 683774 654453 578413 385106 888166 709645 572694 712368 293191
11020 663749 516563 507076 301733 512938 591769 331078 190505 306392 644606 513718
11010 513718 516325 377806 386457 418231 387838 617413 460901 774364 408522 721548 409755
10999 409755 502808 392505 466831 412779 771520 876459 478583 604079 574701 520546
10989 520546 637323 712713 661044 686221 1105082 755514 698588 791652 900267 1278898
10979 1278898 1193651 1188721 1547410 1976046 2216131 2363834 2721851 2782230 2782827 2687026 2326707
10968 2326707 2243618 1836330 1606380 1509969 1304020 1263134 1075959 1301948 1332499 1204540
$$ packed form
11041H81336m9558l59777j77420L89866J71406k42874J40056M057j66450n0198
11031E40444M19382k76052k9321p6040j93307N03060j78521j36951J39674B93191
11020F63749j47186r487k05343K11205P8831k60691j40573J15887L38214j30888
11010E13718K607j38519Q651L1774l0393K29575j56512L13463l65842L13026l11793
10999D09755R3053j10303P4326n4052L58741J04939l97876J25496k9378n4155
10989E20546J16777P5390n1669K5177M18861l49568n6926R3064J08615L78631
10979A278898q5247m930L58689M28636K40085J47703L58017O0379N97r5801l60319
10968B326707q3089m07288k29950r6411k05949m0886j87175K25989L0551j27959
$$ plain form
10958 1204540 1068368 909687 1239078 931610 1288964 877942 774326 652825 554623 605350
10948 605350 327710 641609 -963 377028 244231 137813 98147 142051 64719 226191 160901
10937 160901 -75918 39602 56230 128929 89907 204717 132511 260152 146236 55825 90825
10926 90825 -215051 12271 -62140 136704 184029 240690 115989 -264896 197227 148636 -353264
10914 271201 -214087 116647 -141332 393291 217740 -474978 180155 -47906 -321052 184797
10903 -174502 -111664 27959 -119685 -74803 178053 313276 -176377 -26509 -4877 88322 7670
10891 293870 -20333 201003 -132496 -159393 170371 -345761 -1478 -307809 -140112 1259 -22272
10879 -244758 13143 -322689 -44960 95578 110693 -367489 -92332 -134022 -14165 -59869 6198
$$ packed form
10958A204540j36172j58681L29391l07468L57354m11022j03616j21501r8202N0727
10948F05350k77640L13899i63C77028j32797j06418l9666M3904F4719J61472o5290
10937A60901g5918C9602J6628P2699l9022J14810p2206J27641j13916E5825L5000
10926I0825b15051A2271f2140A36704M7325N6661A15989b64896A97227m8591c53264
10914B71201b14087A16647a41332C93291j75551d74978A80155d7906k73146A84797
10903a74502O2838B7959a19685M4882A78053J35223a76377b6509d877H8322G670
10891B93870b0333B01003a32496k6897A70371c45761a478l06331a40112A259b2272
10879b44758A3143c22689d4960I5578J5115c67489i2332m1690a4165m5704F198
$$ plain form
10867 -105147 123094 45508 223311 -56556 445108 120323 -90143 -64516 49883 -227768
10856 -503321 64700 -336768 71110 7637 -189914 23554 -206493 76553 -126301 444789 -82334
10844 225296 290151 -50622 67117 39321 -159725 -33780 -20337 129645 -63566 -46353 48589
10832 145080 -314590 -24611 -70583 143834 -153896 245780 58152 -12450 -102903 72139 231508
10821 231508 -176650 268480 323895 234455 -159722 -36250 -122886 -354741 101309 -329561
10810 -421213 -123574 -70731 -68398 -175540 -6115 187410 -266062 71745 -29674 74239 -107404
10798 -26467 257793 -227802 -209046 -19512 -152769 -96707 -190409 -231665 73432 -90700 -253341
10787 -253341 225346 -83475 111298 -141307 -178354 -165105 -124215 -216454 -13398 160907 -91482
$$ packed form
10867a05147A23094D5508J77803e6556D45108A20323i0143K5627D9883b27768
10856e03321F4700c36768G1110G637a89914B3554b06493G6553a26301D44789h2334
10844B25296O4855e0622F7117k7796a59725c3780J3443A29645f3566J7213D8589
10832A45080c14590b4611m5972A43834a53896B45780E8152a2450r0453G2139J59369
10821B31508a76650B68480N5415q9440a59722c6250q6636k31855A01309c29561
10810d21213a23574N2843K333j07142f115A87410b66062G1745b9674G4239a07404
10798b6467B57793b27802J8756a9512j33257N6062r3702m1256G3432i0700j62641
10787b53341B25346h3475A11298a41307l7047J3249M0890r2239a3398A60907i1482
$$ plain form
10775 -94917 50711 -106307 -29160 -802 173415 -147237 -61298 223612 75264 -26435 -119102
10764 -119102 27607 -265107 223489 -45871 58130 96690 -98464 90432 -225035 80008 -296251
10752 -146335 -59441 30404 133246 -108340 -259955 -257214 -37552 -43470 -219015 158076 46669
10740 -267604 -238383 56752 -251417 -175555 -127598 339969 128033 -120779 -278791 -59714
10729 -344309 44349 105625 1889 -28929 -75773 -61533 -176827 82694 82485 -163655 -55562 -82255
10717 -82255 81265 38154 -449819 -91982 -602974 92245 -133609 18619 -136515 144086 263803
10706 263803 -17668 -201030 43914 16102 66699 43544 -12228 -105023 230175 -90304 93354
10694 -87733 -197461 -235889 215889 -319419 43862 86626 86921 -188012 -154277 139005 21752
$$ packed form
10775i4917E0711a06307b9160h02A73415a47237f1298B23612G5264b6435r2667
10764a19102B7607b65107B23489d5871E8130L8560i8464I0432b25035H0008b96251
10752a46335e9441C0404J02842a08340j51615K741c7552n918j75545A58076D6669
10740b67604K9221E6752b51417P5862M7957C39969A28033a20779j58012e9714
10729c44309D4349O1276A889b8929m6844J4240j15294H2694k09a63655e5562k6693
10717h2255H1265C8154d49819i1982n10992I2245a33609A8619a36515A44086J19717
10706B63803a7668j83362D3914A6102N0597k3155a2228r2795B30175i0304I3354
10694h7733j09728l8428B15889c19419D3862M2764K95a88012L3735A39005B1752
$$ plain form
10682 -375344 390102 -73289 -38815 315606 213630 -200364 -149739 -56301 -156670 125361
10671 -107521 22375 -104738 -350277 33989 -233641 327816 -251025 10318 41795 -113142
10660 -65634 -73711 -27544 257551 -9469 32450 183345 -170924 90551 -35651 -63441 -137839
10649 -137839 436931 125871 174985 -80918 198687 -120785 -349443 65832 -78954 -450971
10639 -450971 -45162 -240880 -58298 -195241 69423 -176077 -355610 141436 50953 -177903
10628 -190997 -207680 -12713 182845 -248670 -89002 121137 35237 -130893 146143 -138791
10617 -83400 252352 241565 -183576 -69282 192299 -243771 -267204 252250 125941 -34268
10606 -137730 131600 37008 -396632 161693 -81462 -96848 162848 60643 -308594 -111013
$$ packed form
10682c75344C90102g3289L4474C15606j01976b00364N0625e6301j00369A25361
10671a07521B2375a04738k45539C3989b33641C27816b51025A0318L1477a13142
10660f5634q077b7544B57551i469C2450J50895a70924I0551c5651k7790p4398
10649a37839D36931A25871M9114h0918A98687a20785k28658F5832g8954l72017
10639d50971d5162j95718e8298j36943F9423a76077j79533A41436E0953a77903
10628a90997j6683a2713A82845b48670h9002A21137C5237a30893A46143a38791
10617h3400B52352j0787a83576f9282A92299b43771k3433B52250A25941c4268
10606a37730A31600C7008c96632A61693h1462j5386A62848F0643c08594a11013
$$ plain form
10595 -152817 8149 -89090 121407 -60036 -403130 -162228 255500 11115 42027 37336 94786
10584 94786 187077 -179522 -97240 -68720 -71887 -31811 -134112 -56439 302111 -149950 -84890
10573 -84890 8591 -199704 22438 29046 -110422 94405 -51667 -14033 -107105 109623 -147475
10561 -104 -151485 38333 -183787 -98174 82819 75352 -51677 -85137 85358 -202521 134519
10549 27746 -16113 256197 54873 -109931 -294063 24810 39808 -137693 277721 -9884 -131718
10538 -131718 -148639 -503341 6033 -349853 -34623 168692 -164496 100883 -259564 8993 -261359
10526 -230339 38285 190065 327539 209032 -518934 214417 19025 -10054 -193730 179561
10515 -111969 19378 -26218 -461906 -26087 -165901 85522 -136818 -146421 -225526 -70754 -192443
$$ packed form
10595a52817H149h9090A21407f0036l43094a62228B55500A1115L0912m691N7450
10584I4786R2291a79522Q2282K8520l167c1811j02301e6439C02111a49950O5060
10573h4890H591a99704B2438O608a10422I4405e1667a4033r3072A09623a47475
10561a04j51381C8333a83787Q5613H2819p467e1677l3460H5358b02521A34519
10549B7746a6113B56197E4873a09931j84132B4810J4998a37693B77721i884j21834
10538a31718j6921l54702F033c49853c4623A68692a64496A00883b59564H993b61359
10526b30339C8285J51780J37474j18507e18934B14417A9025a0054j83676A79561
10515a11969A9378b6218m35688b6087j39814H5522a36818r603p9105g0754j21689
$$ plain form
10504 -192443 -107147 77343 -272723 13633 -117395 -130531 148709 -72743 215727 -129866
10493 114348 -384937 70250 -93635 -359541 171802 -71686 37340 65028 -117899 -57501 129795
10481 35712 -2634 -66440 9799 -207935 -11750 -375813 148661 -154436 36782 -41852 -114544
10470 -114544 26677 107438 -62421 -220193 -81578 -49147 270855 161807 83514 -24727 271348
10458 122988 -163382 145608 -103878 -69793 141629 -127273 -157970 -167830 40855 63058 -171987
10446 -46012 -46101 60827 178033 -112782 154272 -148196 -18294 -74934 -26658 170820 -239936
10434 9288 25540 20817 -84712 -245904 -1196 233752 -253758 98806 31837 113472 -251467
10422 7760 176148 -83099 151718 115207 -199227 278125 -175911 -127945 -680627 -238531
$$ packed form
10504a92443Q5296G7343b72723A3633a17395j3136A48709g2743B15727a29866
10493A14348c84937G0250i3635k65906A71802g1686C7340K7688a17899e7501A29795
10481C5712b634o3806I799b07935a1750l64063A48661a54436C6782d1852p2692
10470a14544B6677Q0761f2421j57772h1578L2431B70855j09048p8293b4727B71348
10458A22988a63382A45608a03878L4085A41629a27273l0697r860D0855K2203a71987
10446d6012q9F0827J17206a12782A54272a48196a8294n6640b6658A70820b39936
10434I288J6252m723h4712j61192a196B33752b53758I8806C1837Q1635b51467
10422G760J68388h3099A51718l6511a99227B78125a75911M7966n52682b38531
$$ plain form
10411 57933 -158358 116874 -183292 -76421 130847 68471 1664 -75117 -991 -69475 327580
10399 87774 -31214 -315310 106113 4443 -5298 -12597 113728 -43072 145735 76180 259003
10388 259003 164134 130938 -154027 457187 -221835 128605 222763 -58869 602199 93344
10377 154518 261404 4479 282812 164296 -80286 118414 300499 478963 613741 227191
10366 416296 205464 458258 514418 176268 295938 113216 45199 357816 297805 -179187
10355 78823 514986 -11214 338237 602649 457438 479453 502564 24429 347755 130997
10344 99674 228485 247417 304647 39382 303756 118430 134890 267524 188746 407215 177495
10332 215062 245145 47816 -37328 -224503 -71611 156481 357368 52662 252161 -144560
$$ packed form
10411E7933a58358A16874a83292g6421A30847o2376A664g5117i91o8484C27580
10399H7774c1214k84096A06113D443e298p299A13728d3072A45735o9555J82823
10388B59003r4869l3196a54027D57187b21835A28605R4158e8869F02199I3344
10377A54518J06886D479K78333j18516h0286A18414J82085J78464J34778B27191
10366D16296B05464K52794N6160A76268J19670A13216D5199L12617o0011a79187
10355G8823M36163a1214C38237K64412j45211K2015K3111B4429L23326A30997
10344I9674J28811J8932N7230C9382K64374A18430J6460J32634p8778K18469A77495
10332B15062L0083D7816c7328j87175g1611A56481K00887E2662J99499a44560
$$ plain form
10321 438304 87859 105284 -106522 1583 -247843 279421 233796 376654 -177148 266170
10310 -494083 -327679 -197302 162761 17114 -45864 -137075 -221036 252005 27810 174862
10300 174862 -71477 110364 143732 132860 -278708 -23082 70125 -361761 -17272 40801 -50981
10288 -102358 -113728 -157593 -367193 -135809 198362 169664 -30157 -162861 -79092 104559
10277 -66741 84694 -16496 -89913 204572 326903 -48137 -106936 55639 102894 121019 232103
10266 232103 -254609 -194120 154269 125023 234043 305866 -246548 444365 188135 72893
10255 163425 253992 40962 -145281 -91884 71303 272118 165163 -210703 13875 124069
10245 124069 177858 -49033 -182620 -64758 -286729 -237501 32047 123122 224183 142676 49409
$$ packed form
10321D38304H7859J7425a06522A583b47843B79421m5625J42858a77148B66170
10310d94083J66404J30377A62761A7114d5864r1211q3961B52005B7810J47052
10300A74862g1477A10364L3368j0872b78708b3082G0125c61761a7272D0801e0981
10288a02358j1370m3865k09600a35809A98362k8698c0157j32704g9092A04559
10277f6741H4694a6496p3417B04572J22331d8137n8799E5639M7255J8125J11084
10266B32103b54609O0489A54269k9246J09020P1823b46548D44365A88135G2893
10255A63425R0567D0962a45281N3397G1303K00815j06955b10703A3875J10194
10245A24069N3789d9033j33587f4758k21971M9228C2047R1075J01061q1507D9409
$$ plain form
10233 86920 124834 -108865 -130148 -43481 -64458 -51531 102738 111885 223382 -343031 -233740
10222 -233740 -292452 -149802 109063 166245 -478575 150725 -226481 -40086 -146677 105316
10211 92551 -93074 -52371 15575 89477 -57706 -236734 -148715 19469 -38593 -244989 -159774
10200 -159774 37732 136938 98403 -12792 -352314 -30509 -125125 50801 -133209 -151859 137681
10188 -14956 27248 -432746 47858 -80097 -144016 -106375 106223 16235 -61468 -251229 14605
10176 -220092 46035 -185861 302492 -45901 -89971 -196183 129034 50624 -339086 -233803
10166 -233803 -114409 180989 -84897 -205542 -71930 44772 -89503 -193439 -363954 176781
10155 -16306 -183281 -164733 17470 -58899 -82804 -82890 -165438 -106189 -66779 -111859 -34565 10115
$$ packed form
10233H6920L7914a08865k1283d3481k0977J2927A02738R147J11497c43031J09291
10222b33740n8712J42650A09063N7182d78575A50725b26481d0086j06591A05316
10211I2551i3074M0703A5575P3902e7706j79028Q8019A9469c8593k06396Q5215
10200a59774C7732R9206l8535a2792l39522c0509r4616E0801a33209j8650A37681
10188a4956B7248d32746D7858h0097o3919L7641A06223A6235f1468j89761A4605
10176b20092D6035a85861C02492d5901m4070j06212A29034E0624c39086J05283
10166b33803a14409A80989h4897j20645g1930D4772h9503j03936j70515A76781
10155a6306j66975J8548A7470e8899k3905q6q2548N9249L9410m5080c4565A0115
$$ plain form
10142 83112 64999 -41536 -249500 -142761 49035 -71336 -341927 -318983 -28268 46920 -27404
10130 106484 -236539 248444 105990 -72544 -198858 -270940 -23672 -100776 -126456 -164188 -30279
10118 -70170 9095 -73908 -188483 -159326 -153565 -54473 -84109 153144 -282178 324816 -25573
10106 -142442 -97100 -251962 -112869 116154 -170356 113601 -253110 60300 -119284 -224532
10096 -224532 -87310 -539044 76995 232613 183475 315414 -89938 277988 -129685 114877
10085 71060 -454101 -27907 -51079 -417795 -121898 -24945 8394 -236461 -323603 -70885 -321270
10074 -321270 -245003 -25783 -227072 -130403 -110568 182653 -166642 -100483 78123 -16532 -165085
10063 -165085 -258699 -52078 -145301 47291 -60113 -54014 -122814 47022 -33814 -78848 88093 -259415
$$ packed form
10142H3112j8113d1536k07964J06739D9035g1336k70591K2944b8268D6920b7404
10130A06484b36539B48444A05990g2544j26314p2082b3672p7104k5680l7732c0279
10118g0170I095g3908j14575K9157N761e4473k9636A53144b82178C24816b5573
10106a42442M5342j54862a12869A16154a70356A13601b53110F0300a19284j05248
10096b24532h7310m51734G6995J55618m9138J31939h9938B77988a29685A14877
10085G1060d54101b7907k3172l66716a21898b4945H394b36461q7142g0885k50385
10074c21270P6267b5783k01289R6669J9835A82653a66642O6159G8123a6532j48553
10063a65085r3614e2078r3223D7291f0113O099o8800D7022c3814m5034H8093b59415
$$ plain form
10050 -69489 133927 164731 4514 195356 -148667 194281 33278 -109687 -258009 -100580
10039 198167 -289878 234487 -243593 -62814 5549 94731 149937 -119038 28809 -140293 -25195
10027 157361 -76299 -263028 -63124 -117913 -47003 81174 -11081 -175733 -68868 -142023 -154703
10016 -154703 -128144 -187966 -33400 8923 15677 -4141 -165528 -100287 -40792 158506 -245572
10004 -169505 -285682 -487963 121635 -152906 -324648 -289004 126646 -56076 -295976 -113456
9993 83184 148767 -96198 -202891 -187224 -289895 -11092 -79041 56991 -135497 -166636 136282
9981 24480 62 -91329 66145 13434 -329081 -230280 -373198 5589 -205565 -66555 -433130 -196108
9968 -358763 -51419 3307 -145571 -9999 145403 -163689 -302604 -239486 -97246 77394 -204682
$$ packed form
10050f9489A33927L0804D514J90842a48667A94281C3278a09687j48322a00580
10039A98167b89878B34487b43593f2814E549Q9182N5206a19038B8809a40293b5195
10027A57361g6299j86729f3124n4789d7003H1174a1081j64652f8868p3155j2680
10016a54703K6559n9822c3400H923O754d141j61387O5241d0792A58506b45572
10004a69505j16177k02281A21635a52906j71742L5644A26646e6076k39900a13456
9993H3184O5583i6198j06693J5667j02671a1092o7949E6991a35497l1139A36282
9981B4480F2i1329F6145A3434c29081R8801j42918E589b05565f6555l66575a96108
9968c58763e1419C307a45571i999A45403a63689j38915O3118i7246G7394b04682
$$ plain form
9956 -287653 -234987 -24739 -177628 -12858 92928 -83654 -395007 -82729 -34358 -105033 -194631
9945 -194631 -42040 153684 -110059 -96397 98666 -151295 -110523 -289093 -49647 152132 76343
9934 76343 130818 59118 -120470 256690 99958 117457 -110893 321875 40250 110627 -245691
9922 112955 -22993 -8831 45710 -238977 -382997 333400 43570 -103120 282398 -240390 -40461
9910 296659 24608 -159055 -57429 -127576 -142630 -172685 -203990 -192823 -137849 -189018 66192
9898 -389334 -73616 -128999 -67908 5489 -79290 122803 -12891 -107300 -205777 566 -168949 -66995
9885 5500 -247556 173462 -251390 -162356 -279400 -25477 3598 131374 -52238 -128766 -75234
9874 -75234 -202558 -79420 -194775 37048 -419215 -263210 277333 -80147 -220679 -208764 -184534
$$ packed form
9956b87653N2666b4739j52889a2858I2928h3654l11353h2729c4358p0675q9598
9945a94631d2040A53684a10059J3662I8666a51295M0772j78570d9647A52132p5789
9934G6343N4475E9118a20470B56690I9958J7499a10893C21875D0250P0377b45691
9922A12955b2993h831D5710b38977j44020C33400D3570a03120B82398b40390d0461
9910B96659B4608a59055e7429p0147j5054l0055l1305J1167N4974n1169F6192
9898c89334g3616n5383O1091E489g9290A22803a2891r4409r8477E66a68949f6995
9885E500b47556A73462b51390Q9034j17044b5477C598J27776e2238p6528N3532
9874g5234j27324g9420j15355C7048d19215J56005B77333h0147j40532J1915K4230
$$ plain form
9863 -184534 22629 119090 -433725 -9303 -57398 -24174 89404 -97307 108744 55641 -242765
9851 -105810 -30098 38652 -179813 119220 -193298 59457 99140 116446 -209822 -69076 -114968
9840 -114968 -49500 74515 80161 314372 -289109 358983 176393 86745 -92285 47810 -123564
9828 133397 -137509 -70167 -490012 229701 -952 -190024 -168423 -164744 -385746 39910 7492
9816 15016 -226825 -315233 -127191 274177 -46638 -496424 -233834 -236842 -409686 39131 37795
9805 37795 -312613 -198483 -78624 -152548 -27330 -147206 -262694 127 -98662 -110291 -2357 -244316
9793 -244316 -197774 111752 -5768 -254387 -11300 140290 1734 347161 119977 -329137 14356
9781 182721 302162 -289928 3928 -359268 -388379 51955 -131181 -226902 -212783 80851 145994
$$ packed form
9863a84534B2629R6461d33725i303m8095b4174H9404i7307A08744n3103b42765
9851a05810c0098C8652a79813A19220a93298E9457L9683J7306b09822f9076m5892
9840a14968d9500G4515N646K34211b89109C58983A76393H6745i2285D7810a23564
9828A33397a37509O7342m19845B29701i52j89072K1601L679k21002C9910G492
9816A5016b26825q8408a27191B74177d6638m49786b33834l008j72844C9131j336
9805C7795c12613J14130g8624p3924b7330j19876j15488A27i8662j1629b357k41959
9793b44316M6542A11752e768k48619a1300A40290A734L45427A19977c29137A4356
9781A82721J19441b89928C928c59268k9111E1955a31181r5721J4119H0851O5143
$$ plain form
9770 145994 -232833 -175986 76194 -274430 -276133 -206004 227129 98237 -411320 112769 5486
9758 -433672 -18844 65663 1811 -301498 -139553 -99895 -261875 63677 20216 29012 176368
9747 176368 -210848 395371 -153406 -113302 -38823 -36060 198164 -235371 58859 -209165 -4363
9735 246836 -368004 75534 -168197 -99315 -213327 44219 7648 -8526 -55899 -130566 72640
9723 -81714 -294564 -189229 206145 -289080 -327259 -55781 -173068 -82449 -312339 -19728 -91690
9712 -91690 -328830 221185 -144946 -178435 208269 -143880 -388962 -184550 -236730 -225754
9702 -225754 -186183 -62679 -44927 -2787 -326051 141525 -236764 -98687 54359 249638 -271141
9690 -205430 71925 -376723 -68871 -246126 -177616 -325230 -255582 -154437 4137 63061 20860
$$ packed form
9770A45994b32833N6847G6194b74430j703P0129B27129I8237d11320A12769E486
9758d33672a8844F5663A811c01498a39553L9658j61980F3677B0216Q796J47356
9747A76368b10848C95371a53406M0104c8823K763A98164b35371E8859b09165d363
9735B46836c68004G5534a68197O8882j14012D4219G648h526m7373p4667G2640
9723h1714k12850J05335B06145b89080l8179e5781j17287h2449k29890a9728p1962
9712i1690k37140B21185a44946l3489B08269a43880k45082a84550n2180J0976
9702b25754L9571f2679J7752b787l23264A41525b36764i8687E4359J95279b71141
9690b05430G1925c76723f8871j77255O8510j47614O9648J01145D137N8924B0860
$$ plain form
9678 42812 -174603 -406695 255198 -360764 -182822 356849 -151677 73260 -94702 -103284 265722
9666 184638 -92384 -87937 120901 10134 35795 -360304 180860 -88170 82487 -260428 495409
9654 198424 385579 -143658 -54225 -153820 -72413 -156362 -96760 -381699 -221802 -3308 -165437
9643 -165437 98407 65684 -299069 -111575 104062 -151292 70248 -22901 -485389 -53448 88189
9631 -54146 -389606 -4993 -107747 -151519 -74353 -197065 131742 -338286 -16517 -104386 -169963
9620 -169963 -198323 -313475 -122551 -92908 -8437 163585 233295 -49485 160767 -143236 152915
9608 73846 -81637 -53433 50309 176989 77278 157678 -232651 -28754 293239 -246562 7555
9596 -124528 96110 203433 -148937 77320 106966 -31900 -480412 -228161 -84273 -56988 -249751
$$ packed form
9678D2812a74603k32092B55198c60764J77942C56849a51677G3260i4702q582B65722
9666A84638i2384M447A20901A0134K5661c60304A80860h8170H2487b60428D95409
9654A98424J87155a43658e4225r9595g2413q3949N9602k84939J59897c308j62129
9643a65437I8407l2723b99069a11575A04062a51292G0248b2901m62488e3448H8189
9631e4146l35460d993j02754m3772g4353j22712A31742c38286a6517q7869o5577
9620a69963k8360j15152a22551K9643h437A63585O9710d9485A60767a43236A52915
9608G3846h1637K8204E0309J26680G7278Q0400b32651b8754B93239b46562G555
9596a24528I6110J07323a48937G7320K9646c1900m48512b28161h4273K7285j92763
$$ plain form
9585 -249751 -163798 -99611 -34808 286311 5005 -159296 57885 154354 -437714 101121 229096
9574 229096 -246200 -320566 157654 -47448 -239 -239373 -11935 -152992 21515 -30249 -505485
9563 -505485 -322923 -135368 168813 -236508 -8370 -56666 125251 176554 -276868 -153861
9553 -153861 -88998 -161070 121468 81085 -244444 -131258 187900 -311847 8554 6837 213408
9542 213408 -356008 121543 12180 138523 -97601 41134 103589 -50051 73955 -169289 -310492
9531 -310492 -266663 19805 -117909 -53238 -227165 155459 -306216 56527 -74086 173559 130685
9520 130685 18639 -222309 172636 -144297 227451 -51174 52020 131787 -200020 -236292 103603
9508 211487 -118272 -99768 82138 -251992 -92044 -264968 23277 -194701 303363 41944 -246209
$$ packed form
9585b49751Q5953O4187c4808B86311E005a59296E7885R6469d37714A01121J27975
9574B29096b46200p4366A57654d7448b39k39134a1935j41057B1515c0249m75236
9563e05485J82562a35368A68813b36508h370m8296A25251N1303b76868J23007
9553a53861O4863p2072A21468m0383b44444J13186A87900c11847H554j717K06571
9542B13408c56008A21543A2180J26343i7601D1134O2455e0051G3955a69289j41203
9531c10492M3829A9805a17909e3238j73927A55459c06216E6527g4086A73559m2874
9520A30685A8639b22309A72636a44297B27451e1174E2020P9767b00020l6272A03603
9508B11487a18272J8504H2138b51992i2044j72924B3277a94701C03363D1944b46209
$$ plain form
9496 70294 104771 -68737 -474551 -365521 83007 -206723 179848 51884 -178268 89329 -237092
9484 35923 -196035 75309 -33079 107063 -264283 68400 -270388 -34433 -37326 -319356 -36732
9472 126991 -18583 26594 -134607 -20963 -137334 -261820 154344 -133913 -321659 -229807
9462 -229807 -188514 -264164 -240333 57964 -394158 195211 -300634 80502 128702 283530 -298883
9450 -288412 216292 -309411 340897 -134023 55844 122964 -229041 -67261 -195337 188067
9439 -85353 -186333 57887 24039 -572037 -99663 -65493 187147 233297 156057 -126741 -121312
9428 -121312 -11528 123131 38964 195297 -127602 70517 -240380 -116946 116831 89115
9418 89115 196950 78157 -340112 11896 -42449 -14168 278297 -97125 -307787 -85379 69557
$$ packed form
9496G0294L4477f8737m05814J09030H3007b06723A79848E1884a78268H9329b37092
9484C5923a96035G5309c3079A07063b64283F8400b70388c4433k893k82030c6732
9472A26991a8583B6594a34607b0963j16371j24486A54344a33913j87746R1852
9462b29807M1293p5650K3831E7964c94158A95211c00634H0502M8200J54828b98883
9450b88412B16292c09411C40897a34023E5844O7120b29041f7261j28076A88067
9439h5353j00980E7887B4039e72037i9663L4170A87147M6150p7240a26741N429
9428a21312a1528A23131C8964J56333a27602G0517b40380a16946A16831k7716
9418H9115J07835G8157c40112A1896d2449a4168B78297i7125k10662h5379F9557
$$ plain form
9406 -71130 -79599 -309069 -121728 -168831 31245 -65669 193312 57879 146279 -203516 -139434
9395 -139434 -349245 -77768 5479 253383 -88979 60594 -160275 -120309 134381 -96386 -175098
9384 -175098 -243120 81086 121728 51755 151168 -182596 6172 -27707 -25112 -184588 -413106
9373 -413106 -20543 133990 67648 -189242 -158210 -100404 150436 -379301 -268007 194842
9362 -127487 -294118 -270565 -134244 41476 -206784 114731 -121084 70897 -16578 252975
9351 -281278 -92021 28993 -28857 159327 -339478 223768 -58286 -250097 -123145 -218654 -120280
9340 -120280 -239972 -7700 -99278 393470 14934 99112 -138786 -28989 -1278 -89327 -132867
9329 -132867 -68499 -138697 -142554 55908 41172 -123350 -288237 43731 -79672 -77303 -182669
$$ packed form
9406g1130q469k29470a21728m7103C1245f5669A93312E7879Q8400b03516O4082
9395a39434k09811g7768E479K47904h8979F0594a60275L9966A34381i6386p8712
9384a75098o8022H1086M0642E1755R9413a82596F172b7707K595j59476k28518
9373d13106b0543A33990o6342a89242L1032N7806A50436c79301J11294A94842
9362a27487j66631K3553a34244D1476b06784A14731a21084G0897a6578B52975
9351b81278i2021B8993b8857A59327c39478B23768e8286j91811a23145r5509R8374
9340a20280j19692g700r1578C93470A4934Q4178a38786b8989a278q8049m3540
9329a32867O4368p0198l857E5908j4736a23350j64887D3731g9672K369j05366
$$ plain form
9318 -182669 -163350 -482135 -188808 -66556 14551 136385 -292952 160770 143530 -35040 -218981
9307 -218981 188008 -80203 14367 -182815 -304655 125693 -96623 38586 -104222 -70708 125675
9295 64794 -436052 -36621 -335758 -151681 -98467 -351312 -162021 -88893 -208915 -14396 115004
9283 -18371 -353481 -79251 -148161 -168637 399154 266845 128913 -320796 -63218 61697 -209072
9271 103925 -50259 -313748 239558 -43313 -271717 -151125 -46531 67497 -127835 -8206 32542
9259 -179540 6217 152616 -34458 -446158 -390133 81726 20892 75112 -225831 -92758 7678
9247 -108390 -56393 249414 -50480 -369938 9503 -307945 -339143 -306718 136787 27478 -382974
9235 356729 -42172 -149838 -42797 -168980 -136069 -233850 104050 75731 -121876 -24096 -11510
$$ packed form
9318a82669J9319l18785a88808f6556A4551J21834b92952A60770j7240c5040j83941
9307b18981A88008h0203A4367a82815j21840A25693i6623C8586a04222L3514A25675
9295F4794d36052c6621k99137a51681N3214k52845a62021P3128j20022a4396A15004
9283a8371l35110g9251o8910k0476C99154j32309A28913c20796f3218F1697b09072
9271A03925e0259k63489B39558d3313k28404J20592d6531F7497a27835h206C2542
9259a79540F217J46399c4458m11700N6025H1726B0892N4220b25831i2758G678
9247a08390N1997B49414e0480l19458I503c07945l1198L2425A36787B7478c82974
9235C56729d2172j07666d2797j26183L2911r7781A04050k8319a21876b4096a1510
$$ plain form
9223 30651 -77621 12462 -99845 -114807 -78 -14140 35741 -211576 -338355 -95327 -75925 65192
9210 -137756 187694 -290623 -284605 196589 -169616 -118469 -114046 -8448 -399287 -266009 -93231
9198 -253418 -35003 131934 -80320 380300 -22973 9975 -90252 -309950 -47354 -163529 90007
9186 -45563 -455488 -237899 1324 52330 -276058 138237 220822 -127816 84373 167824 -234756
9174 -25113 74229 -265853 -35000 146569 -372267 34327 -107143 -52902 -140219 -8077 -141244
9163 -141244 2192 56401 15632 17819 -92256 -125686 -286456 182968 144893 38256 -32565 86589
9150 -297707 -202082 -280760 -310355 -231696 20649 -145446 -3029 -123313 -251389 12044 -5793
9138 115321 -285565 -302262 -139933 -35078 -2785 -28121 -87055 -160986 -99304 67730 -97379
$$ packed form
9223C0651g7621A2462i9845j4962g8j4062C5741b11576j26779i5327J9402F5192
9210a37756A87694b90623O018A96589a69616N1147M423h448l90839J33278i3231
9198b53418c5003A31934h0320C80300b2973I975i0252k19698d7354j16175I0007
9186d5563m09925K17589A324N1006b76058A38237Q2585a27816H4373Q3451b34756
9174b5113G4229b65853c5000A46569c72267C4327a07143e2902q7317h077j33167
9163a41244B192N4209A5632K187i2256l3430j60770A82968l8075C8256c2565H6589
9150b97707R5625p8678k9595P8659B0649a45446c029j20284j28076A2044e793
9138A15321b85565j6697a39933c5078b785k5336n8934p3931O1682F7730i7379
$$ plain form
9126 -51123 -82475 -235207 28737 -24840 -297392 -56662 -265121 -15290 -50470 860 6234 88109
9114 88109 114055 -225343 139860 -134372 -83434 9288 -339275 151130 8706 -98876 106433
9102 203050 -358220 -13148 -62043 320156 -13927 -364371 -74267 -91951 -407587 -133224 174491
9090 -178428 91947 -206038 31359 -82400 -212947 -202868 -250526 -334864 -285200 -218294 33729
9078 -98248 -37334 -301743 -154091 -244919 388167 -368130 46707 8619 62493 129917 -67007
9066 -155947 -221533 68794 -101829 -225180 24256 -92944 -19466 -75576 -176815 -64834 -183474
9055 -183474 113921 -397802 99757 -35806 -205241 -61343 -52180 -67129 10086 125941 -133840
9043 -206668 -176991 231131 -150169 144685 27041 277102 -50733 44561 -163599 -234536 163319
$$ packed form
9126e1123l1352j52732B8737b4840k72552e6662k08459a5290l5180H60N374Q1875
9114H8109K5946b25343A39860a34372N0938I288c39275A51130H706i8876A06433
9102B03050c58220a3148m8895C20156a3927l50444g4267j7684l15636a33224A74491
9090a78428I1947b06038C1359h2400j30547J0079m7658q4338M9664O6906C3729
9078i8248c7334k64409J47652r0828C88167c68130D6707H619N3874O7424f7007
9066a55947o5586F8794a01829j23351B4256i2944a9466n6110j01239f4834j18640
9055a83474A13921c97802I9757c5806j69435f1343R163j4949A0086J15855a33840
9043b06668K9677B31131a50169A44685B7041K50061e0733D4561a63599p0937A63319
$$ plain form
9031 92865 211075 -186753 52288 37341 -116855 -283658 -441097 -11008 88938 -88334 -191873
9020 -191873 -19066 -29885 136319 -132954 -263281 -191299 -194161 -71448 -292567 -30090 -34205
9009 -34205 -130200 439566 -222604 -217499 75582 89266 28923 20413 122243 179962 51018 312345
8997 312345 229613 36649 241052 -359934 -315320 -18705 -143767 144648 -282090 187393
8986 -266042 38918 112330 129019 2814 30642 -267268 -258436 -68814 172661 -128776 276326
8974 -242632 482999 108119 -60926 -127827 39969 -488572 -75278 333805 -41861 28887 -167163
8962 208265 59445 -332224 -142907 174557 -141291 -76638 3945 -50555 226086 -154764 -60541
8950 -218290 123136 141668 -155240 148747 -29061 -286677 -26136 380709 -140843 120650
$$ packed form
9031I2865J18210a86753E2288j4947a16855j66803j57439a1008H8938h8334j03539
9020a91873a9066j0819A36319a32954j30327P1982k862g1448k21119c0090m115
9009c4205r5995D39566b22604N105G5582J3684B8923q510J01830N7719E1018K61327
8997C12345q2732C6649K04403c59934M4614a8705j25062A44648b82090A87393
8986b66042C8918P3412J6689B814K7828b67268Q832f8814A72661a28776B76326
8974b42632D82999A08119f0926o6901C9969d88572g5278C33805d1861B8887a67163
8962B08265E9445c32224a42907A74557a41291O4653C945e0555B26086a54764f0541
8950b18290A23136J8532a55240A48747b9061k57616b6136C80709a40843A20650
$$ plain form
8939 91023 158268 104151 290199 248786 132670 231656 -11225 148881 -113764 126872 54664
8927 75355 -103648 151745 412903 247311 1949064 7449979 10129842 3105618 1034890
8917 340670 422444 83559 125583 -47389 -165769 -62426 161228 -68896 232337 167618 -91913
8905 456664 -180336 -30466 -92477 -161950 -308783 104914 -71694 107715 -32571 151849 96573
8894 96573 -271010 -122896 77666 -500300 -62855 15486 32121 -342521 -159335 -2802 231971
8882 -178311 46351 -479816 -227149 -182080 -105908 -58189 -27948 -46042 -353651 75087 -117980
8870 59643 178339 -88724 43076 -14779 220079 264426 122339 -72422 156392 57852 -46808
$$ packed form
8939I1023O7245n4117J86048m1413j16116R8986a1225A48881a13764A26872E4664
8927G5355a03648A51745K61158j65592J701753N500915K679863C105618A034890
8917C40670Q1774H3559M2024d7389j18380f2426A61228f8896B32337o4719i1913
8905D56664a80336c0466o2011o9473j46833A04914g1694A07715c2571A51849n5276
8894I6573b71010a22896G7666e00300f2855A5486J6635c42521a59335b802B31971
8882a78311D6351d79816b27149M5069P6172M7719b7948j8094l07609G5087a17980
8870E9643J18696h8724D3076a4779B20079M4347A22339g2422A56392E7852d6808
$$ [...]
##END NTUPLES=NMR SPECTRUM
##END=
