
##TITLE=UV1212_M4_1332-1205_7185202_V5d4kNJXSd
##JCAMPDX= 6.0         $$ Bruker NMR JCAMP-DX V2.0
##DATA TYPE= NMR SPECTRUM
##DATA CLASS= NTUPLES
##ORIGIN= BRUKER
##OWNER= Administrator
$$ 1.72 TOPSPIN		Version 2.1
$$ 2012-12-06 03:50:07.835 -0500  Administrator@X
$$ Compression mode = diff/dup
##.OBSERVE FREQUENCY= 400.02188249412
##.OBSERVE NUCLEUS= ^1H
##.ACQUISITION MODE= SIMULTANEOUS (DQD)
##.ACQUISITION SCHEME= undefined
##.AVERAGES= 64
##.DIGITISER RES= 22
##SPECTROMETER/DATA SYSTEM= spect
##.PULSE SEQUENCE= noesygpps1d.comp
##.SOLVENT NAME= COFFEE_meoh
##.SHIFT REFERENCE= INTERNAL, COFFEE_meoh, 1, 14.96095
##AUDIT TRAIL= $$ (NUMBER, WHEN, WHO, WHERE, PROCESS, VERSION, WHAT)
$$ ##TITLE= Audit trail, TOPSPIN		Version 2.1
$$ ##JCAMPDX= 5.01
$$ ##ORIGIN= Bruker BioSpin GmbH
$$ ##OWNER= Administrator
$$ $$ E:\/data/COFFEE/nmr/UV1212_M4_1332-1205_7185202_V5d4kNJXSd/12/pdata/1/auditp.txt
$$ ##AUDIT TRAIL=  $$ (NUMBER, WHEN, WHO, WHERE, PROCESS, VERSION, WHAT)
(   1,<2012-12-06 03:50:01.975 -0500>,<Administrator>,<X>,<go>,<TOPSPIN 2.1>,
      <created by zg
	started at 2012-12-06 03:38:32.210 -0500,
	POWCHK enabled, PULCHK disabled,
       configuration hash MD5:
       86 BA 57 50 F2 9D 5C 9B 26 00 A9 28 5F 66 2E 89
       data hash MD5: 64K
       E3 B2 E9 58 DC FD 54 BD EF 51 5D 35 76 F0 BA D2>)
(   2,<2012-12-06 03:50:05.069 -0500>,<Administrator>,<X>,<proc1d>,<TOPSPIN 2.1>,
      <Start of raw data processing
       efp LB = 0.3 FT_mod = 6 PKNL = 1 PHC0 = 0 PHC1 = 0 SI = 128K 
       data hash MD5: 128K
       6D 88 A9 BD 14 A9 10 D2 C1 AE 62 DF 8F 81 15 64>)
(   3,<2012-12-06 03:50:06.132 -0500>,<Administrator>,<X>,<proc1d>,<TOPSPIN 2.1>,
      <pk PHC0 = -80.1178 PHC1 = 0 
       data hash MD5: 128K
       DE 8F 95 58 72 9D F1 CE 45 94 31 1C 51 BB 37 77>)
(   4,<2012-12-06 03:50:06.819 -0500>,<Administrator>,<X>,<proc1d>,<TOPSPIN 2.1>,
      <abs ABSG = 1 
       data hash MD5: 128K
       C5 EA DB 1A DC 74 F6 0F 6E EB 39 E9 BE 1B 49 05>)
(   5,<2012-12-06 03:50:06.991 -0500>,<Administrator>,<X>,<proc1d>,<TOPSPIN 2.1>,
      <abs ABSG = 2 
       data hash MD5: 128K
       04 24 65 42 5D BE D6 43 0B 8B 7A 97 C3 F1 E8 11>)
(   6,<2012-12-06 03:50:07.178 -0500>,<Administrator>,<X>,<proc1d>,<TOPSPIN 2.1>,
      <abs ABSG = 3 
       data hash MD5: 128K
       84 E0 7E 8A CE A3 00 C2 2B 0D 9D 65 A8 D8 E1 08>)
(   7,<2012-12-06 03:50:07.382 -0500>,<Administrator>,<X>,<proc1d>,<TOPSPIN 2.1>,
      <abs ABSG = 4 
       data hash MD5: 128K
       3D 36 6F 76 FE CE 6A B1 6A C8 25 68 28 9E 31 DF>)
(   8,<2012-12-06 03:50:07.553 -0500>,<Administrator>,<X>,<proc1d>,<TOPSPIN 2.1>,
      <abs ABSG = 5 
       data hash MD5: 128K
       75 97 41 D5 45 87 A2 78 26 51 D5 31 6B 4E 61 86>)
$$ ##END=
$$ 
$$ $$ hash MD5
$$ $$ 19 10 7A 00 9F 75 7D 53 5D 64 E5 BC FF 0F CA 9B
##$RELAX= 
##$RELAX= 
##$RELAX= 
##$RELAX= 
##$RELAX= 
##$RELAX= 
##$RELAX= 
##$RELAX= 
$$ Bruker specific parameters
$$ --------------------------
##$DU= <E:\>
##$EXPNO= 12
$$ [...]
150 150 150 150 150 150 150 150
##$TP07= 0
##$TPNAME0= <>
##$TPNAME1= <>
##$TPNAME2= <>
##$TPNAME3= <>
##$TPNAME4= <>
##$TPNAME5= <>
##$TPNAME6= <>
##$TPNAME7= <>
##$TPOAL= (0..7)
0.5 0.5 0.5 0.5 0.5 0.5 0.5 0.5
##$TPOFFS= (0..7)
0 0 0 0 0 0 0 0
##$TUNHIN= 0
##$TUNHOUT= 0
##$TUNXOUT= 0
##$USERA1= <user>
##$USERA2= <user>
##$USERA3= <user>
##$USERA4= <user>
##$USERA5= <user>
##$V9= 5
##$VALIST= <valist>
##$VCLIST= <CCCCCCCCCCCCCCC>
##$VD= 0
##$VDLIST= <DDDDDDDDDDDDDDD>
##$VPLIST= <PPPPPPPPPPPPPPP>
##$VTLIST= <TTTTTTTTTTTTTTT>
##$WBST= 1024
##$WBSW= 4
##$XGAIN= (0..3)
0 0 0 0
##$XL= 0
##$YL= 0
##$YMAX_a= 6078441
##$YMIN_a= -11895979
##$ZGOPTNS= <>
##$ZL1= 120
##$ZL2= 120
##$ZL3= 120
##$ZL4= 120
##$ABSF1= 14.96095
##$ABSF2= -5.597232
##$ABSG= 5
##$ABSL= 3
##$ALPHA= 0
##$AQORDER= 0
##$ASSFAC= 0
##$ASSFACI= 0
##$ASSFACX= 0
##$ASSWID= 0
##$AUNMP= <proc_prof1d_extract.lims>
##$AXLEFT= 0
##$AXNAME= <>
##$AXNUC= <1H>
##$AXRIGHT= 0
##$AXTYPE= 0
##$AXUNIT= <>
##$AZFE= 0.1
##$AZFW= 0.1
##$BCFW= 0
##$BC_mod= 0
##$BYTORDP= 0
##$COROFFS= 0
##$CY= 15
##$DATMOD= 1
##$DC= 0
##$DFILT= <>
##$DTYPP= 0
##$F1P= 0
##$F2P= 0
##$FCOR= 0.5
##$FTSIZE= 131072
##$FT_mod= 6
##$GAMMA= 0
##$GB= 0
##$INTBC= 1
##$INTSCL= 1
##$ISEN= 128
##$LB= 0.3
##$LEV0= 0
##$LPBIN= 0
##$MAXI= 10000
##$MC2= 0
##$MEAN= 0
##$ME_mod= 0
##$MI= 0
##$NCOEF= 0
##$NC_proc= -2
##$NLEV= 6
##$NOISF1= 0
##$NOISF2= 0
##$NSP= 0
##$NTH_PI= 0
##$NZP= 0
##$OFFSET= 14.96095
##$PC= 1
##$PHC0= -80.1178
##$PHC1= 0
##$PH_mod= 1
##$PKNL= yes
##$PPARMOD= 0
##$PPDIAG= 0
##$PPIPTYP= 0
##$PPMPNUM= 2147483647
##$PPRESOL= 1
##$PSCAL= 4
##$PSIGN= 0
##$PYNMP= <proc.py>
##$REVERSE= no
##$SF= 400.020009657811
##$SI= 131072
##$SIGF1= 0
##$SIGF2= 0
##$SINO= 400
##$SIOLD= 131072
##$SPECTYP= <>
##$SREGLST= <1H.CDCl3>
##$SSB= 0
##$STSI= 131072
##$STSR= 0
##$SW_p= 8223.68421052631
##$SYMM= 0
##$S_DEV= 0
##$TDeff= 65536
##$TDoff= 0
##$TI= <>
##$TILT= no
##$TM1= 0
##$TM2= 0
##$TOPLEV= 0
##$USERP1= <user>
##$USERP2= <user>
##$USERP3= <user>
##$USERP4= <user>
##$USERP5= <user>
##$WDW= 1
##$XDIM= 131072
##$YMAX_p= 425540968
##$YMIN_p= -12170
##$CURPLOT= <Network HP LaserJet P1505>
##$CURPRIN= <$Network HP LaserJet P1505>
##$DFORMAT= <normdp>
##$LAYOUT= <+/1D_H.xwp>
##$LFORMAT= <normlp>
##$PFORMAT= <normpl>
##$SURQMSG= 1
$$ End of Bruker specific parameters
$$ ---------------------------------
##NTUPLES= NMR SPECTRUM
##VAR_NAME=  FREQUENCY,     SPECTRUM/REAL,   SPECTRUM/IMAG
##SYMBOL=    X,             R,               I
##VAR_TYPE=  INDEPENDENT,   DEPENDENT,       DEPENDENT
##VAR_FORM=  AFFN,          ASDF,            ASDF
##VAR_DIM=   131072,        131072,          131072
##UNITS=     HZ,            ARBITRARY UNITS, ARBITRARY UNITS
##FACTOR=    0.0627417313425164, 1,          1
##FIRST=     8223.62146879497, 5303,         -53151
##LAST=      0,             7344,            -52190
##MIN=       0,             -12170,          0
##MAX=       8223.62146879497, 425540968,    0
$$ Real data points
##PAGE= N=1
##DATA TABLE= (X++(R..R)), XYDATA
$$ [...]
$$ plain form
61651 481601 483257 484804 485985 486863 488196 491017 495615 501080 506095 510070 513299 516240 519087 522007
61637 522007 525275 528912 532408 535020 536305 536306 535347 533709 531420 528363 524592 520364 515747 510494 504625
61622 504625 498881 494127 490410 487155 484230 482198 481367 481163 480755 479851 478607 477176 475743 474623 473837
61607 473837 472751 470534 466888 462124 456690 450953 445242 439801 434723 430171 426448 423521 420606 416685
61593 416685 411534 405959 400891 396570 392709 389210 386334 384197 382411 380434 378187 376063 374349 372888
61579 372888 371366 369658 367739 365599 363553 362292 362126 362304 361563 359374 356231 352776 349194 345525 342032
61564 342032 339021 336648 334966 333775 332375 330090 327259 325136 324446 324494 324120 323073 321974 321307 321038 321042
61548 321042 321348 321926 322615 323351 324234 325337 326512 327335 327340 326574 325862 326135 327408 328878 330086 331445 333458
$$ packed form
61651D81601J656J547J181Q78J333K821M598N465N015L975L229K941K847K920
61637E22007L268L637L496K612J285Jr59j638k289l057l771m228m617n253n869
61622E04625n744m754l717l255k925k032q31k04m08r04j244j431j433j120p86
61607D73837j086k217l646m764n434n737n711n441n078m552l723k927k915l921
61593D16685n151n575n068m321l861l499k876k137j786j977k247k124j714j461
61579C72888j522j708j919k140k046j261j66J78p41k189l143l455l582l669l493
61564C42032l011k373j682j191j400k285k831k123o90M8l74j047j099o67k69M
61548C21042L06N78O89P36Q83J103J175Q23Np66p12K73J273J470J208J359K013
$$ plain form
61531 333458 336032 338917 342140 345480 348085 349262 349348 349174 349032 348678 347994 346937 345138 342264 338686 335206
61515 335206 332236 329783 327995 327053 326657 326253 325729 325324 325001 324551 324161 324148 324179 323501 321997 320315 318930
61498 318930 317748 316700 315950 315359 314529 313649 313509 314330 315208 315188 314316 313270 312478 312034 311950 311969 311511 310293
61480 310293 308749 307494 306754 306656 307500 309150 310618 311004 310701 310955 312242 313742 314494 314529 314569 315053 315765 316231
61462 316231 316198 315778 315271 314908 314736 314737 314957 315459 316205 317064 317865 318399 318510 318307 318194 318521 319221 319868 320111 320005
61442 320005 319918 320196 320928 322039 323541 325590 328281 331506 335120 339104 343404 347776 352016 356215 360510
61427 360510 364671 368270 371232 373830 376126 377744 378406 378369 378205 378357 379074 380515 382661 385268 388084 391021
61411 391021 394032 396946 399540 401623 402945 403164 402064 399777 396746 393481 390317 387283 384226 381163
$$ packed form
61531C33458K574K885L223L340K605J177Q6j74j42l54o84j057j799k874l578l480
61515C35206k970k453j788r42l96m04n24m05l23m50l90j3L1o78j504j682j385
61498C18930j182j048p50n91q30q80j40Q21Q78k0q72j046p92m44q4J9m58j218
61480C10293j544j255p40r8Q44J650J468L86l03K54J287J500P52L5M0M84P12M66
61462C16231l3m20n07l63j72JK20N02P46Q59Q01N34J11k03j13L27P00O47K43j06
61442C20005q7K78P32J111J502K049K691L225L614L984M300M372M240M199M295
61427C60510M161L599K962K598K296J618O62l7j64J52P17J441K146K607K816K937
61411C91021L011K914K594K083J322K19j100k287l031l265l164l034l057l063
$$ plain form
61397 381163 378479 376599 375518 374815 374047 372979 371535 369847 368247 366865 365261 362887 359949 357388 355869
61382 355869 355204 354923 354965 355501 356394 357244 357856 358416 359264 360660 362613 364840 367024 369201 371706 374607 377436
61365 377436 379665 381317 382968 385210 388163 391342 393992 395789 397295 399508 402930 407244 411843 416371
61351 416371 420781 425319 430555 437009 444619 452936 461900 471888 482834 493954 504690 515321 526145
61338 526145 536550 545510 552652 558226 562376 565187 567252 569376 571621 573212 573501 572426 569961 565811
61324 565811 560057 553660 547763 542624 537592 532124 526560 521806 518376 515918 513734 511654 510152 509611
61310 509611 509814 510307 510975 511998 513464 515438 518274 522435 527970 534518 541874 550249 559799 570093 580134
61295 580134 588835 595493 599973 602429 602783 600577 595617 588684 581250 574349 567947 561536 555087 549158
$$ packed form
61397C81163k684j880j081p03p68j068j444j688j600j382j604k374k938k561j519
61382C55869o65k81M2N36Q93Q50O12N60Q48J396J953K227K184K177K505K901K829
61365C77436K229J652J651K242K953L179K650J797J506K213L422M314M599M528
61351D16371M410M538N236O454P610Q317Q964R988J0946J1120J0736J0631J0824
61338E26145J0405Q960P142N574M150K811K065K124K245J591K89j075k465m150
61324E65811n754o397n897n139n032n468n564m754l430k458k184k080j502n41
61310E09611K03M93O68J023J466J974K836M161N535O548P356Q375R550J0294J0041
61295E80134Q701O658M480K456L54k206m960o933p434o901o402o411o449n929
$$ plain form
61281 549158 544230 540247 536919 534238 532521 531994 532573 534140 536832 540821 545834 551135 556097 560765 565875
61266 565875 572390 580871 590947 601373 610861 619035 626451 633772 641235 648974 657436 667223 678766
61253 678766 692355 708122 725577 743294 759420 772532 781982 787713 790138 790064 788238 784796 779331
61240 779331 771612 762132 751874 741574 731252 720525 709322 698145 687568 677794 668977 661651
61228 661651 656254 652326 648781 645071 641536 638568 636159 634474 634063 635046 636739 638577 640765 643433 645829
61213 645829 647153 647698 648235 648643 648093 646470 644748 643983 644662 646824 649944 652685 653742 653212 652487 652693
61197 652693 653848 655626 658126 661680 666657 673744 683678 696418 711190 727671 746389 767552 790170
61184 790170 812840 834722 855132 872819 886647 896818 904691 911454 917486 922974 928473 934519 940923
$$ packed form
61281E49158m928l983l328k681j717n27N79J567K692L989N013N301M962M668N110
61266E65875O515Q481J0076J0426R488Q174P416P321P463P739Q462R787J1543
61253F78766J3589J5767J7455J7717J6126J3112R450N731K425p4j826l442n465
61240G79331p719r480j0258j0300j0322j0727j1203j1177j0577r774q817p326
61228F61651n397l928l545l710l535k968k409j685m11R83J693J838K188K668K396
61213F45829J324N45N37M08n50j623j722p65O79K162L120K741J057n30p25K06
61197F52693J155J778K500L554M977P087R934J2740J4772J6481J8718K1163K2618
61184G90170K2670K1882K0410J7687J3828J0171P873O763O032N488N499O046O404
$$ plain form
61171 940923 946664 950507 951836 950949 948505 944729 939386 932486 924563 916103 907055 897097 886035 873726
61157 873726 860006 845062 829574 814214 799278 785031 771980 760373 749760 739603 730101 721988
61145 721988 715724 711394 709183 709178 710617 711968 712014 710477 707449 702737 696142 688048 679237 670232 661172
61130 661172 652326 644334 637840 633101 630053 628560 628395 629206 630787 633353 637346 643026 650505 660106 672185
61115 672185 686534 702421 719529 738491 760033 783908 809047 834511 859827 884674 908897
61104 908897 932730 956406 979510 1001356 1021979 1042079 1061780 1080087 1095878 1108871 1119228
61093 1119228 1126622 1130129 1128858 1122469 1111355 1096553 1079262 1060201 1039590 1017745 995329 972973
61081 972973 950982 929474 908383 887297 865910 844773 825068 807355 791109 775699 761262
$$ packed form
61171I40923N741L843J329q87k444l776n343o900p923q460r048r958j1062j2309
61157H73726j3720j4944j5488j5360j4936j4247j3051j1607j0613j0157r502q113
61145G21988o264m330k211nJ439J351M6j537l028m712o595q094q811r005r060
61130F61172q846p992o494m739l048j493j65Q11J581K566L993N680P479R601J2079
61115F72185J4349J5887J7108J8962K1542K3875K5139K5464K5316K4847K4223
61104I08897K3833K3676K3104K1846K0623K0100J9701J8307J5791J2993J0357
61093A119228P394L507j271o389j1114j4802j7291j9061k0611k1845k2416k2356
61081I72973k1991k1508k1091k1086k1387k1137j9705j7713j6246j5410j4437
$$ plain form
61070 761262 748296 736990 727360 719478 713123 707757 703304 700431 699517 699835 700325 700764 701601 703051 705065
61055 705065 707869 711866 717108 723360 730498 738462 747172 756863 768139 781202 795519 810743 827415
61042 827415 846069 866164 886825 908382 932259 959406 989544 1021858 1055764 1091023 1127681
61031 1127681 1165943 1205823 1247225 1290644 1337152 1387158 1439872 1494709 1552469 1614107 1679016
61020 1679016 1745656 1813312 1882053 1951751 2022911 2098213 2181509 2275274 2380439 2498433 2631396
61009 2631396 2780213 2944390 3124706 3324963 3551471 3813075 4122218 4494189 4945178
61000 4945178 5493536 6163706 6987098 8000189 9246597 10781354 12664611 14941409 17621521
60991 17621521 20664939 23954844 27254453 30200886 32403995 33630407 33941844 33666238
$$ packed form
61070G61262j2966j1306r630p882o355n366m453k873r14L18M90M39Q37J450K014
61055G05065K804L997N242O252P138P964Q710R691J1276J3063J4317J5224J6672
61042H27415J8654K0095K0661K1557K3877K7147L0138L2314L3906L5259L6658
61031A127681L8262L9880M1402M3419M6508N0006N2714N4837N7760O1638O4909
61020A679016O6640O7656O8741O9698P1160P5302Q3296R3765J05165J17994J32963
61009B631396J48817J64177J80316K00257K26508K61604L09143L71971M50989
61000D945178N48358O70170Q23392J013091J246408J534757J883257K276798K680112
60991A7621521L043418L289905L299609K946433K203109J226412L11437k75606
$$ plain form
60983 33666238 33224338 32954706 33040176 33505361 34206139 34818004 34908069 34114839 32327154
60974 32327154 29723537 26652510 23464936 20413726 17641357 15206643 13112257 11329155
60966 11329155 9819239 8547792 7483078 6593516 5849948 5228493 4708913 4271980 3900169
60957 3900169 3579413 3298735 3049499 2826242 2626716 2449465 2292005 2151998 2028620
60948 2028620 1921295 1828066 1746557 1675556 1613993 1558918 1506099 1452673 1398304 1344136 1291653
60937 1291653 1242187 1196190 1152734 1110532 1069429 1030219 993220 957971 924278 892584 863104
60926 863104 835425 809278 785041 763118 743316 725165 708510 693398 679629 666745 654433
60915 654433 642771 632063 622527 614194 607139 601623 597744 595024 592779 591009 590443 591458 593407 595376
$$ packed form
60983C3666238m41900k69632Q5470M65185P00778O11865R0065p93230j787685
60974C2327154k603617l071027l187574l051210k772369k434714k094386j783102
60966A1329155j509916j271447j064714q89562p43568o21455n19580m36933l71811
60957C900169l20756k80678k49236k23257j99526j77251j57460j40007j23378
60948B028620j07325r3229q1509p1001o1563n5075n2819n3426n4369n4168n2483
60937A291653m9466m5997m3456m2202m1103l9210l6999l5249l3693l1694k9480
60926H63104k7679k6147k4237k1923j9802j8151j6655j5112j3769j2884j2312
60915F54433j1662j0708r536q333p055n516l879k720k245j770n66J015J949J969
$$ plain form
60901 595376 597205 599270 601584 603630 604877 604974 603646 601030 598046 595805 594437 592871 589875 585078 579005
60886 579005 572464 565970 559453 552447 544732 536729 529034 521679 514193 506399 498747 491770 485511 479596
60872 479596 473721 467952 462695 458361 455011 452385 450372 449281 449426 450557 452063 453703 455879 459167
60858 459167 463741 469278 475313 481693 488719 496652 504979 512525 518578 523683 528948 534736 540428 545336
60844 545336 549370 552788 555705 557997 559466 560001 559696 558747 557129 554529 550853 546596 542385 538285 533866
60829 533866 528784 522944 516310 509062 501822 495160 488873 482277 475237 468381 462179 456409 450760 445519
60815 445519 441329 438492 436715 435292 433444 430790 427701 425007 423249 422467 422651 423924 426119 428580 430773
60800 430773 432895 435666 439631 444726 450377 455961 461351 467005 473371 480324 487483 494856 502749 511229
$$ packed form
60901E95376J829K065K314K046J247R7j328k616k984k241j368j566k996m797o073
60886E79005o541o494o517p006p715q003p695p355p486p794p652o977o259n915
60872D79596n875n769n257m334l350k626k013j091J45J131J506J640K176L288
60858D59167M574N537O035O380P026P933Q327P546O053N105N265N788N692M908
60844E45336M034L418K917K292J469N35l05r49j618k600l676m257m211m100m419
60829E33866n082n840o634p248p240o662o287o596p040o856o202n770n649n241
60815D45519m190k837j777j423j848k654l089k694j758p82J84J273K195K461K193
60800D30773K122K771L965N095N651N584N390N654O366O953P159P373P893Q480
$$ plain form
60786 511229 520312 530566 542738 556629 571151 585776 601187 618134 636376 655221 674429 693918
60774 693918 713259 732214 751386 771540 792548 813735 834987 856720 878906 900895 922188
60763 922188 942654 961953 979424 994642 1007468 1017420 1023607 1025494 1023268 1017301 1007726 994731 978721
60750 978721 959932 938353 914385 889207 864104 839682 815998 793154 771303 750238 729449
60739 729449 708742 688589 669712 652273 635511 618296 600187 581936 564788 549409 535656
60728 535656 523302 512508 503428 495754 488971 482878 477587 473128 469338 466107 463512 461621 460367 459685
60714 459685 459701 460583 462161 463742 464464 463847 461982 459240 455985 452572 449290 446103 442655 438734 434556
60699 434556 430389 426113 421468 416545 411640 406739 401608 396340 391378 386913 382696 378537 374618 371177
$$ packed form
60786E11229R083J0254J2172J3891J4522J4625J5411J6947J8242J8845J9208J9489
60774F93918J9341J8955J9172K0154K1008K1187K1252K1733K2186K1989K1293
60763I22188K0466J9299J7471J5218J2826R952O187J887k226n967r575j2995j6010
60750I78721j8789k1579k3968k5178k5103k4422k3684k2844k1851k1065k0789
60739G29449k0707k0153j8877j7439j6762j7215j8109j8251j7148j5379j3753
60728E35656j2354j0794r080p674o783o093n291m459l790l231k595j891j254o82
60714D59685J6Q82J578J581P22o17j865k742l255l413l282l187l448l921m178
60699D34556m167m276m645m923m905m901n131n268m962m465m217m159l919l441
$$ plain form
60685 371177 368251 365921 364451 363933 364051 364337 364431 364026 363019 361929 361745 362986 365180 367524 369708 371728
60669 371728 373353 374404 375362 377015 379374 381463 382349 382014 381057 379942 378797 377735 377058 377083 377837 378913
60653 378913 379787 380447 381633 384125 387844 391982 396117 400777 406683 413716 420979 427684 433734 439459 445072
60638 445072 450317 454476 456779 457056 455907 454105 451950 449530 447360 446170 445923 445614 444362 442316 440065
60623 440065 437568 434322 430390 426527 423169 419973 416609 413437 410961 409028 407123 405208 403735 402882
60609 402882 402219 401135 399373 397234 395558 395290 396591 398476 399733 400110 400130 399931 399102 397680 396421 395706
60593 395706 394991 393897 393151 393633 394950 395806 395563 394607 393376 391984 390876 390896 392247 394031 395276 395962
60577 395962 396690 397871 399675 402367 406093 410604 415656 421470 428363 436183 444711 454451 466374 480748
$$ packed form
60685C71177k926k330j470n18J18K86R4m05j007j090j84J241K194K344K184K020
60669C71728J625J051R58J653K359K089Q86l35r57j115j145j062o77K5P54J076
60653C78913Q74O60J186K492L719M138M135M660N906P033P263O705O050N725N613
60638D45072N245M159K303K77j149j802k155k420k170j190k47l09j252k046k251
60623D40065k497l246l932l863l358l196l364l172k476j933j905j915j473q53
60609D02882o63j084j762k139j676k68J301J885J257L77K0j99q29j422j259p15
60593C95706p15j094p46M82J317Q56k43r56j231j392j108K0J351J784J245O86
60577C95962P28J181J804K692L726M511N052N814O893P820Q528R740J1923J4374
$$ plain form
60563 480748 496814 513796 531731 550937 570995 590586 608162 622462 632530 637673 637635 632861
60551 632861 624535 614189 603106 592085 581884 573599 568167 565555 565006 566280 570169 577526 588320
60538 588320 602171 619360 640523 665368 692245 719038 743991 765661 782764 794453 800479 800918
60526 800918 796070 786828 774792 761739 749104 737909 728685 721190 714627 708529 703141 698672 694648
60513 694648 690545 686714 684032 682844 682888 684150 687020 691485 696919 703045 710551 720384 732919 748307
60499 748307 767247 790827 819807 854637 896064 945128 1002363 1067393 1139342 1217132 1299049
60488 1299049 1382270 1463141 1537796 1602275 1652305 1683750 1693842 1682151 1650215 1600306 1534771
60477 1534771 1456647 1370483 1281856 1195549 1114139 1038433 969010 906884 852649 805526 763792
$$ packed form
60563D80748J6066J6982J7935J9206K0058J9591J7576J4300J0068N143l8m774
60551F32861q326j0346j1083j1021j0201q285n432k612n49J274L889P357J0794
60538E88320J3851J7189K1163K4845K6877K6793K4953K1670J7103J1689O026M39
60526H00918m848r242j2036j3053j2635j1195r224p495o563o098n388m469m024
60513F94648m103l831k682j188M4J262K870M465N434O126P506R833J2535J5388
60499G48307J8940K3580K8980L4830M1427M9064N7235O5030P1949P7790Q1917
60488A299049Q3221Q0871P4655O4479N0030L1445J0092j1691l1936m9909o5535
60477A534771p8124q6164q8627q6307q1410p5706o9423o2126n4235m7123m1734
$$ plain form
60466 763792 726132 692299 662527 636683 614154 594275 576586 560775 546589 533864 522555
60455 522555 512735 504505 497805 492219 487144 482299 477900 474197 470910 467354 463117 458456 454078 450660
60441 450660 448435 446984 445481 443467 441401 440202 440200 440866 441534 442007 442304 442245 441591 440402 438932 437309 435473
60424 435473 433333 430838 428029 425156 422542 420279 418311 416852 416294 416501 416685 416411 416284 417105 418676 420084
60408 420084 420941 421645 422481 423233 423770 424328 424930 425211 425187 425654 427286 429651 431607 432530 432712 432715 432845 433278 434281
60389 434281 436038 438355 440700 442571 443869 444917 446058 447211 447988 448341 448960 450725 453748 457142 459891
60374 459891 461868 463798 466189 468609 470281 471228 472403 474617 477762 481256 484741 487946 490299 491390
60360 491390 491731 492410 493797 495072 495259 494416 493586 493796 495221 497138 498620 499434 500285 502020 504720 507875
$$ packed form
60466G63792l7660l3833k9772k5844k2529j9879j7689j5811j4186j2725j1309
60455E22555r820q230o700n586n075m845m399l703l287l556m237m661m378l418
60441D50660k225j451j503k014k066j199kO66O68M73K97n9o54j189j470j623j836
60424D35473k140k495k809k873k614k263j968j459n58K07J84k74j27Q21J571J408
60408D20084Q57P04Q36P52N37N58O02K81k4M67J632K365J956R23J82LJ30M33J003
60389D34281J757K317K345J871J298J048J141J153P77L53O19J765L023L394K749
60374D59891J977J930K391K420J672R47J175K214L145L494L485L205K353J091
60360D91390L41O79J387J275J87q43q30K10J425J917J482Q14Q51J735K700L155
$$ plain form
60344 507875 511322 515530 520929 527389 534424 541397 547372 551338 552950 552749 551407 549112 545931 542234
60330 542234 538267 533728 528388 523035 519133 517456 517444 517996 518511 518985 519425 519569 519236 518753 518828 519963 522043
60313 522043 524566 527067 529230 530935 532693 535837 541597 549811 559157 569051 580848 596727 617815
60300 617815 643844 674088 707507 741854 773653 799857 819322 832229 838271 836133 824970 805954
60288 805954 781882 755389 728007 700760 674898 651541 631015 613091 597688 584875 574403
60277 574403 565747 558493 552179 545992 539357 532800 527441 523468 519839 515640 510965 506144 501026 495577
60263 495577 490538 486770 484374 483026 482659 483182 483924 484130 483824 483582 483648 483780 483729 483286 482109 480099 477865
60246 477865 476311 475868 476436 477753 479335 480446 480849 481305 482588 484193 484835 484158 483188 483057 483975 485524
$$ packed form
60344E07875L447M208N399O460P035O973N975L966J612k01j342k295l181l697
60330E42234l967m539n340n353l902j677j2N52N15M74M40J44l33m83P5J135K080
60313E22043K523K501K163J705J758L144N760Q214R346R894J1797J5879K1088
60300F17815K6029L0244L3419L4347L1799K6204J9465J2907O042k138j1163j9016
60288H05954k4072k6493k7382k7247k5862k3357k0526j7924j5403j2813j0472
60277E74403q656p254o314o187o635o557n359l973l629m199m675m821n118n449
60263D95577n039l768k396j348l67N23P42K06l06k42O6J32n1m43j177k010k234
60246D77865j554m43N68J317J582J111M03M56J283J605O42o77r70j31R18J549
$$ plain form
60230 485524 487200 488522 489276 489905 491137 493098 495255 497351 499760 502704 505712 508161 509933 511326 512681
60215 512681 514289 516197 517973 519106 519817 521008 523152 525726 528044 530193 532716 535734 538838 541691
60201 541691 544334 546978 549789 552851 556215 559908 563917 568051 571901 575107 577605 579411 580341 580255 579480
60186 579480 578543 577509 576033 574023 571766 569366 566612 563618 561070 559521 558719 557848 556216 553641 550515
60171 550515 547634 545615 544370 543353 542247 540988 539263 536725 533875 531965 531602 531960 531811 530870 529715
60156 529715 528826 528329 528395 529305 531151 533768 536864 539974 542650 545045 548051 552360 557546 562496 566759
60141 566759 570984 575965 581600 587005 591526 595387 599328 603741 608430 613207 618345 624082 629964 635168
60127 635168 639341 642560 644494 644359 641932 638055 633859 629929 626492 623822 622044 620992 620651 621397 623399
$$ packed form
60230D85524J676J322P54O29J232J961K157K096K409K944L008K449J772J393J355
60215E12681J608J908J776J133P11J191K144K574K318K149K523L018L104K853
60201E41691K643K644K811L062L364L693M009M134L850L206K498J806R30q6p75
60186E79480r37j034j476k010k257k400k754k994k548j549q02q71j632k575l126
60171E50515k881k019j245j017j106j259j725k538k850j910l63L58j49r41j155
60156E29715q89m97O6R10J846K617L096L110K676K395L006M309N186M950M263
60141E66759M225M981N635N405M521L861L941M413M689M777N138N737N882N204
60127F35168M173L219J934j35k427l877m196l930l437k670j778j052l41P46K002
$$ plain form
60112 623399 626180 629111 631964 634630 636823 638575 640531 642999 645063 645432 644120 642443 641262 639879
60098 639879 637013 632384 626922 621660 616850 612202 607729 604057 601815 600939 600857 601252 602259 604010 606430
60083 606430 609619 613825 618733 623261 626479 628477 630022 631689 633550 635239 635904 634532 630929 626128
60069 626128 621368 616918 612349 607557 602850 598196 593061 586985 579907 572039 563884 556215 549481 543339
60055 543339 537241 531356 526324 522202 518313 514156 509884 505835 502211 499354 497704 497213 497243 497295 497488 498172
60039 498172 499456 501320 503798 506859 510317 514000 517715 521053 523665 525879 528560 532021 535412 537535
60025 537535 537989 537299 536089 534447 531944 527966 522197 515030 507458 500265 493306 485852 477724 469853 463512
60010 463512 459092 455857 452890 449964 447361 445259 443760 443302 444299 446237 447816 448395 448772 450046 452165
$$ packed form
60112F23399K781K931K853K666K193J752J956K468K064L69j312j677j181j383
60098F39879k866m629n462n262m810m648m473l672k242q76q2L95J007J751K420
60083F06430L189M206M908M528L218J998J545J667J861J689O65j372l603m801
60069F26128m760m450m569m792m707m654n135o076p078p868q155p669o734o142
60055E43339o098n885n032m122l889m157m272m049l624k857j650m91L0N2J93O84
60039D98172J284J864K478L061L458L683L715L338K612K214K681L461L391K123
60025E37535M54o90j210j642k503l978n769p167p572p193o959p454q128p871o341
60010D63512m420l235k967k926k603k102j499m58R97J938J579N79L77J274K119
$$ plain form
59995 452165 454223 455786 457102 458134 458350 457726 457287 458187 460583 463725 466846 469712 472494 475470 478846
59980 478846 482695 486975 491461 495667 499062 501625 504027 506958 510306 513247 515064 515706 515672 515623 515896 516114
59964 516114 515432 513598 511539 510465 510575 511132 511581 511856 511693 510572 508701 507258 507118 507791 508114 507655 506901
59947 506901 506262 505493 504147 502257 500350 498897 497953 497397 497364 498123 499424 500332 500050 498710 497030 495457
59931 495457 494088 493161 492947 493218 493478 493748 494501 495752 496963 498010 499476 501610 503701 504980 505653 506542
59915 506542 508053 509971 511889 513400 514269 514884 516186 518613 521346 523160 523826 524215 525159 526737 528551
59900 528551 530173 531330 532083 532882 534140 535789 537514 539271 541166 542959 544164 544683 544922 545248 545743 546534
59884 546534 548002 550469 553965 558359 563434 568821 574193 579635 585443 591480 597098 601959 606487 611179
$$ packed form
59995D52165K058J563J316J032K16o24m39R00K396L142L121K866K782K976L376
59980D78846L849M280M486M206L395K563K402K931L348K941J817O42l4m9K73K18
59964E16114o82j834k059j074J10N57M49K75j63j121j871j443j40O73L23m59p54
59947E06901o39p69j346j890j907j453r44n56l3P59J301R08k82j340j680j573
59931D95457j369r27k14K71K60K70P53J251J211J047J466K134K091J279O73Q89
59915E06542J511J918J918J511Q69O15J302K427K733J814O66L89R44J578J814
59900E28551J622J157P53P99J258J649J725J757J895J793J205N19K39L26M95P91
59884E46534J468K467L496M394N075N387N372N442N808O037N618M861M528M692
$$ plain form
59870 611179 615752 619333 621279 621396 619512 615470 609692 603273 597236 591884 587065 582789 579324 576839
59856 576839 575203 574053 572863 571162 569012 567176 566475 567041 568562 571186 575708 582736 592118 603326
59842 603326 615971 629667 643721 657227 669154 678202 683248 684532 684083 684338 686418 690032 694596
59829 694596 699601 704027 706281 705046 699892 691124 679622 666817 654057 641704 629315 616861 605182
59816 605182 594982 586029 577729 569991 563001 556572 550317 544291 538968 534600 530928 527499 523989 520262
59802 520262 516381 512578 509067 505897 503025 500399 497900 495375 492823 490451 488447 486753 485078 483038
59788 483038 480384 477278 474260 471677 469315 466891 464636 462849 461066 458444 455088 452182 450584 450009
59774 450009 449913 450368 451442 452463 452711 452449 452511 453190 454242 455687 457733 460010 461685 462467 462848 463311 463893
$$ packed form
59870F11179M573L581J946J17j884m042n778o419o037n352m819m276l465k485
59856E76839j636j150j190j701k150j836p01N66J521K624M522P028R382J1208
59842F03326J2645J3696J4054J3506J1927R048N046J284m49K55K080L614M564
59829F94596N005M426K254j235n154q768j1502j2805j2760j2353j2389j2454j1679
59816F05182j0200q953q300p738o990o429o255o026n323m368l672l429l510l727
59802E20262l881l803l511l170k872k626k499k525k552k372k004j694j675k040
59788D83038k654l106l018k583k362k424k255j787j783k622l356k906j598n75
59774D50009r6M55J074J021K48k62O2O79J052J445K046K277J675P82L81M63N82
$$ plain form
59757 463893 464667 465971 467908 470101 472218 474342 476602 478835 480932 483192 485981 489242 492630 495996
59743 495996 499436 502971 506412 509497 511952 513461 513895 513688 513762 514798 516486 517725 517685 516660 515708 515507
59727 515507 515753 515681 514927 513802 512953 512906 513708 514767 515146 514362 512947 512046 512376 513617 514814 515283 515110 514866
59709 514866 514985 515490 516229 517135 518179 519299 520568 522220 524210 525965 526983 527606 528746 530852 533633
59694 533633 536793 540416 544460 548447 551981 555075 557597 558918 558669 557511 556589 556334 556299 556036 555660 555503
59678 555503 555631 555766 555477 554406 552498 550002 547217 544355 541704 539573 537871 536004 533423 530030 525924
59663 525924 521149 516008 511224 507387 504521 502528 501614 501767 502239 502306 502327 503367 505818 509056 512419 515830
59647 515830 519321 522636 525548 528066 530105 531380 531838 531739 531105 529503 526727 523327 520145 517578 515573
$$ packed form
59757D63893P74J304J937K193K117K124K260K233K097K260K789L261L388L366
59743D95996L440L535L441L085K455J509M34k07P4J036J688J239m0j025r52k01
59727E15507K46p2p54j125q49m7Q02J059L79p84j415r01L30J241J197M69j73k44
59709E14866J19N05P39R06J044J120J269J652J990J755J018O23J140K106K781
59694E33633L160L623M044L987L534L094K522J321k49j158r22k55l5k63l76j57
59678E55503J28J35k89j071j908k496k785k862k651k131j702j867k581l393m106
59663E25924m775n141m784l837k866j993r14J53M72O7K1J040K451L238L363L411
59647E15830L491L315K912K518K039J275M58r9o34j602k776l400l182k567k005
$$ plain form
59632 515573 514068 513077 512470 512011 511605 511301 511149 511186 511488 511998 512321 511916 510625 508964 507795 507678 508441 509299
59614 509299 509344 508024 505372 501957 498559 495718 493551 492030 491288 491385 491955 492489 492998 493939 495363 496624
59598 496624 497191 497288 497325 497094 496031 494083 491870 490088 489089 488893 489188 489443 489382 489248 489334 489467 489318 488930 488409
59579 488409 487357 485287 482548 480097 478203 476046 472884 469072 465574 462880 460841 459290 458334 458040 458129
59564 458129 458131 457735 456965 456054 455224 454662 454651 455507 457241 459395 461333 462618 463132 463115 463192 464004 465631 467648
59546 467648 469876 472639 476030 479521 482777 486388 491222 497501 505173 514785 527122 542250 559692
59533 559692 579193 600068 619719 634040 640048 637737 629360 617784 605744 595486 588126 583611
59521 583611 581718 582628 586189 591275 596564 601568 606400 610919 614736 617737 619985 621231 621045 619277 615956
$$ packed form
59632E15573j505r91o07m59m06l04j52L7L02N10L23m05j291j661j169j17P63Q58
59614E09299M5j320k652l415l398k841k167j521p42R7N70N34N09R41J424J261
59598D96624N67R7L7k31j063j948k213j782r99j96K95K55o1j34Q6J33j49l88n21
59579D88409j052k070k739k451j894k157l162l812l498k694k039j551r56k94Q9
59564D58129Kl96p70r11q30n62j1Q56J734K154J938J285N14j7P7Q12J627K017
59546D67648K228K763L391L491L256L611M834O279P672R612J2337J5128J7442
59533E59692J9501K0875J9651J4321O008k311q377j1576j2040j0258p360m515
59521E83611j893R10L561N086N289N004M832M519L817L001K248J246j86j768l321
$$ plain form
59506 615956 610897 603877 595164 585448 575332 565285 555951 547926 541099 534652 527967 521280 515324 510541
59492 510541 506864 504066 502052 500757 499971 499398 498840 498199 497380 496457 495966 496656 498755 501785 505409 510140
59476 510140 516695 524819 533409 541839 550500 559854 569439 578111 584824 588952 590374 589657 587871 585827
59462 585827 583693 581552 579970 579572 580331 581794 583942 587372 592569 599365 607269 616110 626174 637797
59448 637797 651041 665822 682167 699998 718575 736386 751803 763656 771031 773015 769297 760918
59436 760918 749775 737277 723976 710437 697618 685978 674823 663123 650749 638541 627448
59425 627448 617967 610235 604248 600062 597936 598184 600837 605699 612789 622356 634358 648512 665103 685169
59411 685169 709429 737452 768196 800525 832181 858661 874580 876980 867164 849373 828276 807709
$$ packed form
59506F15956n059p020q713r716j0116j0047r334q025o827o447o685o687n956m783
59492E10541l677k798k014j295p86n73n58o41q19r23m91O90K099L030L624M731
59476E10140O555Q124Q590Q430Q661R354R585Q672O713M128J422p17j786k044
59462E85827k134k141j582l98P59J463K148L430N197O796P904Q841J0064J1623
59448F37797J3244J4781J6345J7831J8577J7811J5417J1853P375J984l718q379
59436G60918j1143j2498j3301j3539j2819j1640j1155j1700j2374j2208j1093
59425F27448r481p732n987m186k126K48K653M862P090R567J2002J4154J6591K0066
59411F85169K4260K8023L0744L2329L1656K6480J5919K400r816j7791k1097k0567
$$ plain form
59399 807709 790605 778886 773184 773015 777164 783393 787845 785632 773136 750261 720404 688168 656990
59386 656990 628552 603514 582170 564553 550459 539556 531316 525008 520015 516124 513244 511048 509272
59373 509272 508153 508056 508644 509036 508843 508545 508733 509520 510825 512687 514993 517366 519606 521838 524017 525884
59357 525884 527702 530475 534875 540390 546029 551548 557456 564148 571689 580325 590623 603003 617417
59344 617417 633420 650325 667511 684946 703231 722766 742984 762766 781422 798853 814859
59333 814859 828755 839718 847244 851324 852430 851232 848059 842681 834881 825011 813675 801075 787203
59320 787203 772569 758193 744753 732182 720211 708878 698285 688248 678594 669580 661626 654742
59308 654742 648552 642972 638458 635346 633217 631284 629352 628036 628002 629466 632591 637926 646029 657017
$$ packed form
59399H07709j7104j1719n702j69M149O229M452k213j2496k2875k9857l2236l1178
59386F56990k8438k5038k1344j7617j4094j0903q240o308m993l891k880k196j776
59373E09272j119r7N88L92j93k98J88P87J305J862K306K373K240K232K179J867
59357E25884J818K773M400N515N639N519N908O692P541Q636J0298J2380J4414
59344F17417J6003J6905J7186J7435J8285J9535K0218J9782J8656J7431J6006
59333H14859J3896J0963P526M080J106j198l173n378p800r870j1336j2600j3872
59320G87203j4634j4376j3440j2571j1971j1333j0593j0037r654r014p954o884
59308F54742o190n580m514l112k129j933j932j316l4J464L125N335Q103J0988
$$ plain form
59294 657017 670906 688105 709005 733174 759310 785498 808757 824807 829778 822873 806859 785756
59282 785756 762702 739974 719653 703088 690177 680020 672146 666693 663797 663391 665342 669314 674771
59269 674771 681508 689831 699806 710756 721976 733522 745693 758083 769745 779924 787954 792795
59257 792795 793552 790472 784713 777012 767152 754843 740549 725256 709786 694604 680088 666751 655131
59244 655131 645417 637242 630049 623640 618114 613419 609534 607076 606903 608823 611490 614051 617124 621551
59230 621551 626968 632486 638103 644303 650587 655572 658485 659687 659688 658493 655915 651766 645711 637659 628354
59215 628354 618918 609721 600345 590686 581385 573072 565820 559486 554084 549636 546082 543376 541332 539461
59201 539461 537451 535647 534631 534514 535161 536751 539343 542185 544364 546053 548194 551065 554229 557879 562945
$$ packed form
59294F57017J3889J7199K0900K4169K6136K6188K3259J6050M971o905j6014k1103
59282G85756k3054k2728k0321j6565j2911j0157p874n453k896m06J951L972N457
59269F74771O737Q323R975J0950J1220J1546J2171J2390J1662J0179Q030M841
59257G92795P57l080n759p701r860j2309j4294j5293j5470j5182j4516j3337j1620
59244F55131r714q175p193o409n526m695l885k458j73J920K667K561L073M427
59230F21551N417N518N617O200O284M985K913J202Jj195k578m149o055q052r305
59215F28354r436r197r376r659r301q313p252o334n402m448l554k706k044j871
59201E39461k010j804j016j17O47J590K592K842K179J689K141K871L164L650N066
$$ plain form
59186 562945 569466 575985 581192 585343 589425 593709 597843 601790 605848 610063 614238 618346 622428 626308
59172 626308 629801 633120 636803 641357 647043 653725 660824 667823 674981 683202 692960 703679 714266 723885
59158 723885 732142 739075 745151 750803 755619 758464 758696 756863 753844 749713 743857 735977 726575 716563
59144 716563 706652 696999 687342 677606 668328 660212 653307 647045 641131 635876 631557 627948 624722 621851
59130 621851 619349 617083 615140 614036 614221 615605 617749 620302 623171 626609 631217 637452 644986 653018
59116 653018 661306 670438 680936 692554 704625 716528 727595 737292 745896 754512 763912 773710 782980
59103 782980 791193 798111 803315 806525 808153 808966 809316 809048 807955 805960 803111 799790 796648 793884 790784
59088 790784 786502 781231 776226 772703 770973 770490 770253 769124 766153 760895 753522 744701 735316 726021 716859
$$ packed form
59186E62945O521O519N207M151M082M284M134L947M058M215M175M108M082L880
59172F26308L493L319L683M554N686O682P099O999P158Q221R758J0719J0587R619
59158G23885Q257O933O076N652M816K845K32j833l019m131n856p880r402j0012
59144G16563r911r653r657r736r278q116o905o262n914n255m319l609l226k871
59130F21851k502k266j943j104J85J384K144K553K869L438M608O235P534Q032
59116F53018Q288R132J0498J1618J2071J1903J1067R697Q604Q616R400R798R270
59103G82980Q213O918N204L210J628Q13L50k68j093j995k849l321l142k764l100
59088G90784m282n271n005l523j730m83k37j129k971n258p373q821r385r295r162
$$ plain form
59073 716859 707401 697359 686980 676845 667484 659183 651893 645298 639173 633639 628759 624046 618896
59060 618896 613540 608943 605651 603306 601450 600118 599268 598306 596744 594906 593440 592440 591553 590640 589796
59045 589796 588962 588002 587079 586502 586319 586410 586863 587854 589224 590504 591342 591755 592078 592848 594526 597094 600023
59028 600023 602795 605336 607851 610618 614171 619256 626196 634467 643282 652456 662442 673611 685823 698563
59014 698563 711130 722729 732634 740386 745858 749232 750928 751368 750676 748729 745524 741409 737044 733371
59000 733371 731431 731744 733840 736822 740470 745383 751986 759859 768087 775725 781820 785681 787463 788075 788190
58985 788190 787721 786363 784077 780787 776215 770400 763852 756848 749155 740873 732939 726274 720943 716654
58971 716654 713616 712279 712611 714330 717511 722366 728623 735712 743388 751723 760717 770355 780799 791971
$$ packed form
59073G16859r458j0042j0379j0135r361q301p290o595o125n534m880m713n150
59060F18896n356m597l292k345j856j332q50r62j562j838j466j000q87r13q44
59045E89796q34r60r23n77j83R1M53R91J370J280Q38M13L23P70J678K568K929
59028F00023K772K541K515K767L553N085O940Q271Q815R174R986J1169J2212J2740
59014F98563J2567J1599R905P752N472L374J696M40o92j947l205m115m365l673
59000G33371j940L13K096K982L648M913O603P873Q228P638O095L861J782O12J15
58985G88190m69j358k286l290m572n815o548p004p693q282p934o665n331m289
58971G16654l038j337L32J719L181M855O257P089P676Q335Q994R638J0444J1172
$$ plain form
58957 791971 803147 813482 822729 830925 837501 841234 841125 837050 829659 819887 808373 795191 780433
58944 780433 765131 751063 739235 729109 719749 711158 703882 697940 692988 689123 686469 684129 680590
58931 680590 675355 669452 664129 659650 655540 651408 647217 643066 639017 634995 630861 626745 623148 620419
58917 620419 618237 615972 613528 611497 610532 610842 612166 613869 615200 615869 616442 617893 620804 625164 630812
58902 630812 637670 645603 654406 664105 675101 687908 702592 718327 733613 747263 759238 770262
58890 770262 780797 790970 801439 813521 828192 845633 866009 889796 916706 944957 972303
58879 972303 997354 1019418 1037770 1051916 1062088 1068652 1071302 1069542 1063584 1054041 1041041 1024512
58867 1024512 1005098 984085 962568 941391 921557 903887 888343 874345 861578 849801 838180
$$ packed form
58957G91971J1176J0335R247Q196O576L733j09m075p391r772j1514j3182j4758
58944G80433j5302j4068j1828j0126r360q591p276n942m952l865k654k340l539
58931F80590n235n903n323m479m110m132m191m151m049m022m134m116l597k729
58917F20419k182k265k444k031r65L10J324J703J331O69N73J451K911M360N648
58902F30812O858P933Q803R699J0996J2807J4684J5735J5286J3650J1975J1024
58890G70262J0535J0173J0469J2082J4671J7441K0376K3787K6910K8251K7346
58879I72303K5051K2064J8352J4146J0172O564K650j760n958r543j3000j6529
58867A024512j9414k1013k1517k1177j9834j7670j5544j3998j2767j1777j1621
$$ plain form
58856 838180 825773 812645 799703 787348 774983 761853 747769 733060 718465 704992 693183
58845 693183 682539 672267 662502 654089 647218 641068 634864 628622 622733 617400 612584 607976 602988 597264
58831 597264 591214 585611 580787 576620 573066 570060 567166 564063 561260 559581 559045 558964 558991 559282 559795 560334
58815 560334 561291 563358 566396 569470 572180 575096 578589 582087 584900 587130 589371 591914 594493 596439
58801 596439 597015 596116 594675 593901 594058 594460 594474 593863 592327 589654 586456 583924 582609 582050 581695 581470 581366
58784 581366 581284 581542 582801 585238 588451 592331 597277 603234 609291 614638 619405 624207 629358 634655 639381
58769 639381 642283 642196 639040 633826 627611 620968 614392 608412 603059 597947 593140 589257 586506 584382 582628
58754 582628 581710 581950 582878 583933 585216 587097 589539 592216 594927 597616 600377 603645 607915 613095 618609
$$ packed form
58856H38180j2407j3128j2942j2355j2365j3130j4084j4709j4595j3473j1809
58845F93183j0644j0272r765q413o871o150o204o242n889n333m816m608m988n724
58831E97264o050n603m824m167l554l006k894l103k803j679n36q1K7K91N13N39
58815E60334R57K067L038L074K710K916L493L498K813K230K241K543K579J946
58801E96439N76q99j441p74J57M02J4o11j536k673l198k532j315n59l55k25j04
58784E81366q2K58J259K437L213L880M946N957O057N347M767M802N151N297M726
58769F39381K902q7l156n214o215o643o576n980n353n112m807l883k751k124j754
58754E82628r18K40R28J055J283J881K442K677K711K689K761L268M270N180N514
$$ plain form
58739 618609 624212 630114 636279 642391 648709 656075 664651 673402 681322 688571 695961 703907 712347 721117
58725 721117 729896 738240 746160 754211 762575 770481 777003 782163 786865 792034 798064 804880 812224 820054
58711 820054 828675 838243 848302 858252 868065 877813 886584 892741 895374 894692 890905 883711 873135 859868
58697 859868 844252 825824 804442 781166 757424 733924 710850 688546 667516 648280 631566
58686 631566 618015 607269 597985 589195 581028 573822 567341 561358 556202 552083 548544 545251 542696 541379
58672 541379 540826 540132 539158 538568 539053 540976 544420 549097 554562 560872 568652 578210 589055 600495 611949
58657 611949 622308 629879 633717 634513 633600 631711 629181 626616 624404 622039 618693 614282 609425 604694
58643 604694 600373 596550 592909 588843 584307 580125 576984 574587 572327 570323 569170 569109 570014 571813 574389
$$ packed form
58739F18609N603N902O165O112O318P366Q576Q751P920P249P390P946Q440Q770
58725G21117Q779Q344P920Q051Q364P906O522N160M702N169O030O816P344P830
58711H20054Q621R568J0059R950R813R748Q771O157K633o82l787p194j0576j3267
58697H59868j5616j8428k1382k3276k3742k3500k3074k2304k1030j9236j6714
58686F31566j3551j0746r284q790q167p206o481n983n156m119l539l293k555j317
58672E41379n53o94r74n90M85J923L444M677N465O310P780R558J0845J1440J1454
58657F11949J0359P571L838P96r13j889k530k565k212k365l346m411m857m731
58643F04694m321l823l641m066m536m182l141k397k260k004j153o1R05J799K576
$$ plain form
58628 574389 577376 580604 584440 589151 594194 598526 601420 602830 603403 604328 606595 610053 613718 617223 621263
58613 621263 626408 632348 638759 646000 654352 663317 672250 680887 688598 694014 696251 695940 694285 691753
58599 691753 688345 684420 680380 676136 671634 667304 663289 658930 653831 648775 644706 641572 639119 638092
58585 638092 639458 642938 647500 652926 659806 668211 677438 686952 696731 706807 717122 727557 737451
58572 737451 745579 751366 755672 759706 763824 768269 774284 783215 794936 808446 823666 841405 861760
58559 861760 883808 906841 930691 954842 978323 1000540 1021271 1039768 1054861 1065962 1073084 1075846
58547 1075846 1073595 1066748 1057083 1046356 1035254 1023894 1012533 1001397 990332 978967 966930 953870
58535 953870 939558 924000 907222 889217 870470 852224 835645 820926 807615 795552 784992
$$ packed form
58628E74389K987L228L836M711N043M332K894J410N73R25K267L458L665L505M040
58613F21263N145N940O411P241Q352Q965Q933Q637P711N416K237l11j655k532
58599F91753l408l925m040m244m502m330m015m359n099n056m069l134k453j027
58585F38092J366L480M562N426O880Q405R227R514R779J0076J0315J0435R894
58572G37451Q128N787M306M034M118M445O015Q931J1721J3510J5220J7739K0355
58559H61760K2048K3033K3850K4151K3481K2217K0731J8497J5093J1101P122K762
58547A075846k251o847r665j0727j1102j1360j1361j1136j1065j1365j2037j3060
58535I53870j4312j5558j6778j8005j8747j8246j6579j4719j3311j2063j0560
$$ plain form
58524 784992 776117 769019 763915 760840 759342 758952 759656 761419 763684 765925 768360 771538 775461 779567 783234
58509 783234 785938 787459 788384 789779 791842 793464 793639 792584 790902 788581 785606 782661 780168 777406 773639
58494 773639 769518 766238 763908 761753 759371 756698 753376 749391 745824 743811 743168 743113 743714 745442 747962
58479 747962 750850 755065 762167 772284 784173 797023 810743 824702 837684 849136 859178 867333
58467 867333 872510 874309 873238 869666 863718 856224 848618 841755 835692 830555 826679 823990 822224 821600
58453 821600 822418 824292 826750 830275 835638 842442 849344 855385 860119 862823 862864 860606 856927 852169 846544
58438 846544 840980 836371 832513 829009 826549 825918 826473 827191 828573 831712 836031 839948 843464 848007 853878
58423 853878 859956 866048 873475 882963 893677 904728 915959 926897 936434 943992 949755 953548 954813
$$ packed form
58524G84992q875p098n104l075j498l90P04J763K265K241K435L178L923M106L667
58509G83234K704J521R25J395K063J622J75j055j682k321k975k945k493k762l767
58494G73639m121l280k330k155k382k673l322l985l567k013o43n5O01J728K520
58479G47962K888M215P102J0117J1889J2850J3720J3959J2982J1452J0042Q155
58467H67333N177J799j071l572n948p494p606o863o063n137l876k689j766o24
58453H21600Q18J874K458L525N363O804O902O041M734K704M1k258l679m758n625
58438H46544n564m609l858l504k460o31N55P18J382L139M319L917L516M543N871
58423H53878O078O092P427R488J0714J1051J1231J0938R537P558N763L793J265
$$ plain form
58410 954813 953802 951500 948385 944416 939954 935251 929474 921946 913980 907540 902419 896805 890510 885312
58396 885312 882028 879627 877639 877183 878875 881686 884591 887656 891010 894362 897901 901939 905375 906384
58382 906384 904971 903067 901811 900699 899701 900064 902441 906179 910979 917307 924741 931895 938540 945789 953821
58367 953821 961541 968922 977287 986713 995578 1003579 1012755 1024541 1038014 1052046 1066872 1082427 1097431
58354 1097431 1111372 1125272 1139248 1151486 1160945 1168982 1176931 1184112 1189688 1194538 1199781 1205254 1210787
58341 1210787 1217218 1224780 1232326 1239538 1248089 1259195 1271771 1284412 1297446 1311603 1326382 1341179
58329 1341179 1356444 1372406 1388259 1403781 1419926 1436602 1451760 1464105 1474873 1485535 1495661
58318 1495661 1504535 1512974 1521875 1530679 1538807 1547009 1555820 1564370 1572163 1580426 1590388 1601906 1614956
$$ packed form
58410I54813j011k302l115l969m462m703n777p528p966o440n121n614o295n198
58396H85312l284k401j988m56J692K811K905L065L354L352L539M038L436J009
58382I06384j413j904j256j112r98L63K377L738M800O328P434P154O645P249Q032
58367I53821P720P381Q365R426Q865Q001R176J1786J3473J4032J4826J5555J5004
58354A097431J3941J3900J3976J2238R459Q037P949P181N576M850N243N473N533
58341A210787O431P562P546P212Q551J1106J2576J2641J3034J4157J4779J4797
58329A341179J5265J5962J5853J5522J6145J6676J5158J2345J0768J0662J0126
58318A495661Q874Q439Q901Q804Q128Q202Q811Q550P793Q263R962J1518J3050
$$ plain form
58305 1614956 1630540 1648779 1668068 1687479 1708014 1730191 1752561 1774086 1795815 1818653 1841632
58294 1841632 1864022 1886942 1911181 1935598 1959372 1983630 2009189 2034955 2060299 2086716 2115311
58283 2115311 2144973 2174841 2206118 2239497 2273283 2306219 2339758 2375422 2412293 2449251 2487306
58272 2487306 2527562 2569294 2612111 2657511 2706123 2756027 2806063 2858252 2914782 2975289 3039213
58261 3039213 3107803 3181368 3257639 3335331 3416247 3501354 3588129 3674506 3761922 3851590 3941450
58250 3941450 4030081 4120008 4213665 4309795 4407461 4509842 4620006 4736476 4857095 4983768
58240 4983768 5119244 5262823 5413590 5574232 5747158 5930490 6122417 6325771 6543639
58231 6543639 6774556 7017062 7274866 7552217 7848388 8162395 8498804 8862814 9253916
$$ packed form
58305A614956J5584J8239J9289J9411K0535K2177K2370K1525K1729K2838K2979
58294A841632K2390K2920K4239K4417K3774K4258K5559K5766K5344K6417K8595
58283B115311K9662K9868L1277L3379L3786L2936L3539L5664L6871L6958L8055
58272B487306M0256M1732M2817M5400M8612M9904N0036N2189N6530O0507O3924
58261C039213O8590P3565P6271P7692Q0916Q5107Q6775Q6377Q7416Q9668Q9860
58250C941450Q8631Q9927R3657R6130R7666J02381J10164J16470J20619J26673
58240D983768J35476J43579J50767J60642J72926J83332J91927K03354K17868
58231F543639K30917K42506K57804K77351K96171L14007L36409L64010L91102
$$ plain form
58222 9253916 9670655 10117411 10600121 11119997 11678460 12283638 12944756 13664969 14447446
58213 14447446 15303525 16246781 17284475 18423799 19681543 21078899 22633368 24366614
58205 24366614 26315052 28523019 31033680 33900330 37201452 41033965 45502441 50733028
58197 50733028 56893128 64185993 72844034 83157803 95511254 110372078 128258116
58190 128258116 149721842 175298756 205331147 239707201 277633188 317430058 356288401
58183 356288401 390198868 414549636 425540968 421737451 404690735 378186813 346711464
58176 346711464 314141615 283186024 255384347 231240441 210345021 191646213 173972653
58169 173972653 156601139 139503020 123134458 108017859 94468429 82574007 72281907
$$ packed form
58222I253916M16739M46756M82710N19876N58463O05178O61118P20213P82477
58213A4447446Q56079R43256J037694J139324J257744J397356J554469J733246
58205B4366614J948438K207967K510661K866650L301122L832513M468476N230587
58197E0733028O160100P292865Q658041J0313769J2353451J4860824J7886038
58190A28258116K1463726K5576914L0032391L4376054L7925987L9796870L8858343
58183C56288401L3910467K4350768J0991332l803517j7046716k6503922l1475349
58176C46711464l2569849l0955591k7801677k4143906k0895420j8698808j7673560
58169A73972653j7371514j7098119j6368562j5116599j3549430j1894422j0292100
$$ plain form
58162 72281907 63455469 55907097 49446805 43917644 39186839 35126296 31620943 28584313
58154 28584313 25949958 23655465 21646100 19883665 18337345 16970981 15749276 14649712
58146 14649712 13657707 12755466 11925295 11158989 10454537 9807175 9211252 8666268 8172632
58137 8172632 7724645 7314754 6941208 6604691 6300779 6022198 5765066 5526417 5299036
58128 5299036 5075672 4856159 4644587 4442037 4247578 4063329 3892290 3733160 3582733
58119 3582733 3441328 3310769 3189306 3073726 2964418 2863295 2768809 2677980 2591406 2511319
58109 2511319 2436535 2364148 2294520 2229855 2169394 2110590 2053489 1999478 1947301 1894802 1843145
58098 1843145 1794789 1748694 1702026 1655316 1611434 1570623 1530998 1492961 1458550 1427170 1396251
$$ packed form
58162G2281907q826438p548372o460292n529161m730805m060543l505353l036630
58154B8584313k634355k294493k009365j762435j546320j366364j221705j099564
58146A4649712r92005r02241q30171p66306p04452o47362n95923n44984m93636
58137H172632m47987m09891l73546l36517l03912k78581k57132k38649k27381
58128E299036k23364k19513k11572k02550j94459j84249j71039j59130j50427
58119C582733j41405j30559j21463j15580j09308j01123r4486r0829q6574q0087
58109B511319p4784p2387o9628o4665o0461n8804n7101n4011n2177n2499n1657
58098A843145m8356m6095m6668m6710m3882m0811l9625l8037l4411l1380l0919
$$ plain form
58087 1396251 1365603 1337046 1310424 1284135 1258935 1236959 1217250 1196434 1173729 1151412 1130380
58076 1130380 1109149 1087352 1066449 1046550 1025978 1004444 983598 964138 945307 927376 911591
58065 911591 897455 882996 867994 854188 842147 830717 819739 810455 802783 794811 785451 775308
58053 775308 764726 753334 741724 731182 721499 711223 700199 689662 679885 670087 660732 653381
58041 653381 647986 642611 636181 629389 622724 615812 608981 603275 598523 593306 587091 580501 573386 564727
58027 564727 554682 544712 535402 526070 516660 507997 499978 491571 482942 475504 469489 463425 456534 449733
58013 449733 443774 438170 432578 427567 423388 419466 415617 412401 409881 407328 404451 401654 398953 395948
57999 395948 392859 390301 388103 385847 384376 385104 387873 391217 394753 399565 406158 413787 421873 430235
$$ packed form
58087A396251l0648k8557k6622k6289k5200k1976j9709k0816k2705k2317k1032
58076A130380k1231k1797k0903j9899k0572k1534k0846j9460j8831j7931j5785
58065I11591j4136j4459j5002j3806j2041j1430j0978r284p672p972r360j0143
58053G75308j0582j1392j1610j0542r683j0276j1024j0537r777r798r355p351
58041F53381n395n375o430o792o665o912o831n706m752n217o215o590p115q659
58027E64727j0045r970r310r332r410q663q019q407q629p438o015o064o891o801
58013D49733n959n604n592n011m179l922l849l216k520k553k877k797k701l005
57999C95948l089k558k198k256j471P28K769L344L536M812O593P629Q086Q362
$$ plain form
57985 430235 437790 442954 445707 447538 449045 449306 447933 445923 444024 441921 439488 437213 434955 431854
57971 431854 427954 424327 421279 418070 414775 412710 412407 412818 413123 413785 415188 416761 418090 419528 421050
57956 421050 421870 421743 421349 420942 419979 418468 417193 416149 414388 411917 410126 409554 408883 407030 404763 403312
57940 403312 402698 402453 402782 404005 405790 407746 409870 411911 413495 415436 419628 426788 435418 443698 451236
57925 451236 458203 464084 468356 471416 473808 475291 475359 473869 470598 465239 458458 451866 446152 440309 433454
57910 433454 426280 419828 413950 408056 402450 397812 394031 390519 387068 383603 379722 375257 370657 366140
57896 366140 361185 355511 349779 344607 339654 334428 329229 324575 320488 317064 314859 313853 312877 311047
57882 311047 309049 308063 308173 308838 310188 312512 314907 315798 314768 312826 310859 308714 305921 302513 298856
$$ packed form
57985D30235P555N164K753J831J507K61j373k010j899k103k433k275k258l101
57971D31854l900l627l048l209l295k065l03M11L05O62J403J573J329J438J522
57956D21050Q20j27l94m07r63j511j275j044j761k471j791n72o71j853k267j451
57940D03312o14k45L29J223J785J956K124K041J584J941M192P160Q630Q280P538
57925D51236O967N881M272L060K392J483O8j490l271n359o781o592n714n843o855
57910D33454p174o452n878n894n606m638l781l512l451l465l881m465m600m517
57896C66140m955n674n732n172m953n226n199m654m087l424k205j006r76j830
57882C11047j998r86J10O65J350K324K395Q91j030j942j967k145k793l408l657
$$ plain form
57867 298856 295148 291329 287266 282887 278216 273270 268084 263088 259194 257034 256249 256177 257043 259571 263516
57852 263516 267707 271762 276599 282819 289702 296402 303048 309852 316119 321167 325575 330487 336030 341239
57838 341239 345283 348086 349963 351218 351943 351937 351018 349553 348192 346964 345246 342782 340001 337143 333976
57823 333976 330772 328621 328195 329000 330359 332314 334912 337413 338985 339612 339682 339304 338666 338367 338660 338848 338037
57806 338037 335956 332603 327820 321845 315525 309229 302263 294099 285512 277671 270787 264546 259248 255417
57792 255417 252700 250140 247355 244636 242136 239808 237979 237150 237334 238140 239409 241247 243603 246312 249409
57777 249409 253014 257174 262000 267559 273369 278652 283456 288829 295394 302388 308719 314200 319006 322596
57763 322596 324116 323502 321447 318572 315170 311295 306489 300042 292123 284019 276515 268795 259838 250245
$$ packed form
57867B98856l708l819m063m379m671m946n186m996l894k160p85p2Q66K528L945
57852B63516M191M055M837O220O883O700O646O804O267N048M408M912N543N209
57838C41239M044K803J877J255P25or19j465j361j228j718k464k781k858l167
57823C33976l204k151m26Q05J359J955K598K501J572O27P0l78o38k99K93J88q11
57806C38037k081l353m783n975o320o296o966q164q587p841o884o241n298l831
57792B55417k717k560k785k719k500k328j829q29J84Q06J269J838K356K709L097
57777B49409L605M160M826N559N810N283M804N373O565O994O331N481M806L590
57763C22596J520o14k055k875l402l875m806o447p919q104p504p720q957r593
$$ plain form
57749 250245 241585 234441 228269 222801 218388 215064 212407 210372 209362 209421 210074 210993 212118 213216 213982
57734 213982 214502 215021 215412 215503 215688 216545 218010 219501 220604 221103 220797 220026 219916 221188 223060 224174 224262
57717 224262 223987 223524 222548 221440 221183 221857 222337 221821 220767 220007 219696 219403 218552 216573 213318 209584 206610
57700 206610 204847 203691 202480 201077 199418 197311 195050 193563 193514 194617 196047 197139 197554 197250 196609
57685 196609 196215 196258 196441 196616 197198 198715 201224 204404 208176 213142 220379 230701 244116 260290 279639
57670 279639 303649 333951 371514 416861 470315 531227 596974 662805 722069 766516 788073
57659 788073 782510 752098 704203 647168 587569 530083 477953 432760 394489 362365 335532 313170
57647 313170 294638 279551 267317 256828 247223 238742 232114 227300 223566 220618 218702 217604 216578
$$ packed form
57749B50245q660p144o172n468m413l324k657k035j010N9O53R19J125J098P66
57734B13982N20N19L91R1J85Q57J465J491J103M99l06p71j10J272J872J114Q8
57717B24262k75m63r76j108k57O74M80n16j054p60l11k93q51j979l255l734k974
57700B06610j763j156j211j403j659k107k261j487m9J103J430J092M15l04o41
57685A96609l94M3J83J75N82J517K509L180L772M966P237J0322J3415J6174J9349
57670B79639K4010L0302L7563M5347N3454O0912O5747O5831N9264M4447K1557
57659G88073n563l0412m7895n7035n9599n7486n2130m5193l8271l2124k6833k2362
57647C13170j8532j5087j2234j0489r605q481o628m814l734k948j916j098j026
$$ plain form
57634 216578 215395 214616 214550 214759 214795 214694 214483 213941 213197 212905 213371 214040 214167 213577 212532 211285 210031 208897
57616 208897 207783 206543 205384 204640 204142 203336 202077 200741 199496 198072 196376 194756 193468 192447 191732
57601 191732 191517 191607 191436 190809 190034 189173 187864 186148 184692 183734 182483 180155 177125 174419 172448 170760
57585 170760 168798 166414 163791 161360 159669 158931 158691 158197 157080 155528 153850 152091 150018 147458 144618
57570 144618 142013 139959 138226 136427 134661 133453 133065 133079 132692 131286 128848 126104 124080 123231 123081 122981
57554 122981 122945 123402 124384 125550 126824 128455 130471 132586 134600 136381 137594 138002 138034 138495 139724 141477
57538 141477 143481 145566 147383 148701 149907 151584 153643 155557 157274 159086 160687 161329 161000 160494 160172
57523 160172 159664 159002 158961 159794 160631 160800 160883 161735 163176 164449 165426 166539 167868 169070 170042 171074 172401
$$ packed form
57634B16578j183p79o6K09L6j01k11n42p44k92M66O69J27n90j045j247j254j134
57616B08897j114j240j159p44m98q06j259j336j245j424j696j620j288j021p15
57601A91732k15R0j71o27p75q61j309j716j456r58j251k328l030k706j971j688
57585A70760j962k384k623k431j691p38k40m94j117j552j678j759k073k560k840
57570A44618k605k054j733j799j766j208l88J4l87j406k438k744k024q49j50j00
57554A22981l6M57R82J166J274J631K016K115K014J781J213M08L2M61J229J753
57538A41477K004K085J817J318J206J677K059J914J717J812J601O42l29n06l22
57523A60172n08o62m1Q33Q37J69Q3Q52J441J273R77J113J329J202R72J032J327
$$ plain form
57506 172401 173968 175496 176495 176509 175590 174329 173182 172073 170793 169395 167995 166589 165319 164461 163952 163370
57490 163370 162645 162322 162799 163748 164513 164662 163979 162520 160971 160310 160769 161612 162240 162866 163732 164416 164492 164204
57472 164204 163838 162990 161271 159291 158147 158125 158580 158898 158989 158985 159004 159138 159266 159091 158664 158519 158853 159042 158536
57453 158536 157900 158278 160011 162345 164297 165264 165041 164014 163251 163724 165287 166884 167816 168354 169042 169891 170452
57436 170452 170476 170329 170774 172292 174572 176899 178996 181040 182811 183557 183134 182630 183192 184668 186134 187296
57420 187296 188523 189728 190252 189932 189443 189327 189376 189223 188985 189006 189457 190458 192145 194274 196093 197041 197469
57403 197469 198388 200484 203493 206427 208274 208654 208028 207394 207622 208926 210864 212867 214784 216825 218989
57388 218989 220859 222166 223286 224776 226625 228478 230462 233073 236284 239491 242534 245908 249579 252429
$$ packed form
57506A72401J567J528R99J4r19j261j147j109j280j398j400j406j270q58n09n82
57490A63370p25l23M77R49P65J49o83j459j549o61M59Q43O28O26Q66O84P6k88
57472A64204l66q48j719j980j144k2M55L18R1mJ9J34J28j75m27j45L34J89n06
57453A58536o36L78J733K334J952R67k23j027p63M73J563J597R32N38O88Q49N61
57436A70452K4j47M45J518K280K327K097K044J771P46m23n04N62J476J466J162
57420A87296J227J205N24l20m89j16M9j53k38K1M51J001J687K129J819R48M28
57403A97469R19K096L009K934J847L80o26o34K28J304J938K003J917K041K164
57388B18989J870J307J120J490J849J853J984K611L211L207L043L374L671K850
$$ plain form
57374 252429 253574 253649 254097 255587 257810 260334 262885 265024 266345 266971 267331 267570 267690 268055 269160 271031
57358 271031 273361 276031 278964 281751 284078 286379 289364 293020 296735 300258 303777 307153 309935 312237
57344 312237 314780 317907 321244 324504 327879 331395 334710 337834 341268 344946 347809 349161 349824 351176
57330 351176 353373 355419 356861 358525 361361 365244 369327 373185 377105 381381 385792 389898 393636 397386
57316 397386 401540 406128 410831 415184 418856 421991 425320 429633 434955 440427 445219 449402 453745 458867
57302 458867 464780 471110 477419 483395 489005 494510 500228 506352 513075 520646 529115 538208 547688 557612
57288 557612 567965 578299 588155 597725 607719 618612 630326 642579 655204 668118 681257 694566
57276 694566 707833 720638 732711 744239 755492 766232 775900 784428 792486 800748 809100 816778 823267
$$ packed form
57374B52429J145P5M48J490K223K524K551K139J321O26L60K39J20L65J105J871
57358B71031K330K670K933K787K327K301K985L656L715L523L519L376K782K302
57344C12237K543L127L337L260L375L516L315L124L434L678K863J352O63J352
57330C51176K197K046J442J664K836L883M083L858L920M276M411M106L738L750
57316C97386M154M588M703M353L672L135L329M313N322N472M792M183M343N122
57302D58867N913O330O309N976N610N505N718O124O723P571Q469R093R480R924
57288E57612J0353J0334R856R570R994J0893J1714J2253J2625J2914J3139J3309
57276F94566J3267J2805J2073J1528J1253J0740R668Q528Q058Q262Q352P678O489
$$ plain form
57263 823267 829042 835331 842985 851563 859778 866890 873351 879994 887064 894405 902131 910534 919556 928894
57249 928894 938546 948820 959844 971442 983423 995618 1007723 1019527 1031244 1043369 1056220 1069880
57237 1069880 1084343 1099399 1114592 1129688 1145000 1160861 1176996 1192860 1208366 1223765 1239073
57226 1239073 1254189 1269391 1285078 1301163 1317365 1333979 1351527 1369671 1387319 1403999 1420390
57215 1420390 1437208 1454248 1470872 1486876 1502466 1517851 1533218 1548763 1564402 1579792 1594862
57204 1594862 1610079 1625973 1642701 1660227 1678528 1697444 1716671 1736112 1755879 1775801 1795314
57193 1795314 1814080 1832337 1850406 1868180 1885379 1901945 1917932 1933347 1948383 1963484 1978769
57182 1978769 1993667 2007463 2020068 2031897 2043200 2053943 2064237 2074418 2084582 2094409 2103671 2112721
$$ packed form
57263H23267N775O289P654Q578Q215P112O461O643P070P341P726Q403R022R338
57249I28894R652J0274J1024J1598J1981J2195J2105J1804J1717J2125J2851J3660
57237A069880J4463J5056J5193J5096J5312J5861J6135J5864J5506J5399J5308
57226A239073J5116J5202J5687J6085J6202J6614J7548J8144J7648J6680J6391
57215A420390J6818J7040J6624J6004J5590J5385J5367J5545J5639J5390J5070
57204A594862J5217J5894J6728J7526J8301J8916J9227J9441J9767J9922J9513
57193A795314J8766J8257J8069J7774J7199J6566J5987J5415J5036J5101J5285
57182A978769J4898J3796J2605J1829J1303J0743J0294J0181J0164R827R262R050
$$ plain form
57170 2112721 2122163 2132137 2142259 2152355 2162878 2174260 2186198 2198150 2210431 2224031 2239192 2254943
57158 2254943 2270496 2286294 2303016 2320181 2336774 2352895 2369754 2388142 2407831 2428460 2449995
57147 2449995 2472117 2494087 2515531 2536604 2557126 2576315 2593695 2609475 2623602 2635281 2644109
57136 2644109 2650968 2657023 2662193 2665437 2666392 2666044 2665919 2667246 2671046 2678433 2690350 2706919 2727179 2749529
57122 2749529 2772612 2795802 2818849 2841354 2862949 2883901 2905146 2927741 2952681 2981205 3014737
57111 3014737 3054306 3100292 3152884 3212612 3280654 3359170 3451507 3561674 3693601 3851239 4039347
57100 4039347 4263734 4530916 4848320 5224992 5671585 6199583 6820981 7548354 8393845
57091 8393845 9367165 10474264 11716846 13090978 14584847 16178268 17844693 19553214
$$ packed form
57170B112721R442R974J0122J0096J0523J1382J1938J1952J2281J3600J5161J5751
57158B254943J5553J5798J6722J7165J6593J6121J6859J8388J9689K0629K1535
57147B449995K2122K1970K1444K1073K0522J9189J7380J5780J4127J1679Q828
57136B644109O859O055N170L244R55l48j25J327L800P387J1917J6569K0260K2350
57122B749529K3083K3190K3047K2505K1595K0952K1245K2595K4940K8524L3532
57111C014737L9569M5986N2592N9728O8042P8516R2337J10167J31927J57638J88108
57100D039347K24387K67182L17404L76672M46593N27998O21398P27373Q45491
57091H393845R73320J107099J242582J374132J493869J593421J666425J708521
$$ plain form
57083 19553214 21269042 22954275 24569770 26075015 27424272 28563761 29436465 29993938
57075 29993938 30207200 30070111 29595761 28810779 27751258 26460735 24988721 23388275 21712539
57066 21712539 20011270 18328168 16698970 15150514 13701343 12363359 11142924 10040940
57058 10040940 9053283 8172506 7389645 6694999 6078526 5530700 5043093 4608089 4218567
57049 4218567 3868448 3553115 3268688 3011068 2776129 2560553 2362089 2179302 2011519
57040 2011519 1858727 1720974 1597900 1488968 1393661 1310978 1239043 1175741 1119697 1070431
57030 1070431 1027902 992170 963225 940970 925710 918800 922410 938700 969930 1019301 1090240 1183726
57018 1183726 1296080 1418344 1535696 1627480 1672058 1656804 1585341 1474506 1344227 1210066
$$ packed form
57083A9553214J715828J685233J615495J505245J349257J139489Q72704N57473
57075B9993938K13262j37089m74350p84982j059521j290523j472014j600446j675736
57066B1712539j701269j683102j629198j548456j449171j337984j220435j101984
57058A0040940r87657q80777p82861o94646o16473n47826m87607m35004l89522
57049D218567l50119l15333k84427k57620k34939k15576j98464j82787j67783
57040B011519j52792j37753j23074j08932r5307q2683p1935o3302n6044m9266
57030A070431m2529l5732k8945k2255j5260o910L610J6290L1230M9371P0939R3486
57018A183726J12354J22264J17352R1784M4578j5254p1463j10835j30279j34161
$$ plain form
57008 1210066 1082293 967217 867226 781165 706601 641896 586170 538474 497779 463203 433764
56997 433764 408384 386402 367598 351507 337323 324590 313375 303602 294935 287528 282171 279349
56985 279349 278730 279917 283088 288397 295031 301224 305052 305207 301385 294121 284171 272106 258648 244967
56971 244967 232138 220546 210308 201956 196000 192119 189588 188364 188958 191467 195679 202041 211461 224036
56957 224036 238886 255284 272865 290473 305710 316055 319861 316440 306297 291494 274715 257566
56945 257566 240595 224880 212124 202750 195366 188930 184267 182653 184136 188359 195962 207782 223284
56932 223284 241106 260741 282506 305961 329246 349733 364585 371121 367868 355552 336570 313559
56920 313559 288800 264366 241803 221643 203740 187927 173903 160985 148800 137940 129113 121864
$$ packed form
57008A210066j27773j15076r9991q6061p4564o4705n5726m7696m0695l4576k9439
56997D33764k5380k1982j8804j6091j4184j2733j1215r773q667p407n357k822
56985B79349o19J187L171N309O634O193L828J55l822p264r950j2065j3458j3681
56971B44967j2829j1592j0238q352n956l881k531j224N94K509M212O362R420J2575
56957B24036J4850J6398J7581J7608J5237J0345L806l421j0143j4803j6779j7149
56945B57566j6971j5715j2756r374p384o436m663j614J483M223P603J1820J5502
56932B23284J7822J9635K1765K3455K3285K0487J4852O536l253j2316j8982k3011
56920C13559k4759k4434k2563k0160j7903j5813j4024j2918j2185j0860q827p249
$$ plain form
56908 121864 114993 108084 101755 96370 91430 86447 81683 77716 74717 72414 70406 68436 66679 65759
56894 65759 66228 68084 71139 75604 81927 90364 101281 115560 133892 155691 179408 203787 227894
56881 227894 249932 267259 278288 283752 285536 284821 282016 277977 274266 272152 271945 273524 277057 282957
56867 282957 291512 303035 318321 338485 364085 394642 429392 468402 512419 561177 611839 659107
56855 659107 696802 719742 725211 713713 688652 655001 617818 581315 548365 520326 497480 479992
56843 479992 468319 462777 463310 470181 484513 507625 540049 581681 632605 693115 762772 839566
56831 839566 919435 995825 1059987 1103087 1119190 1106878 1068853 1010919 941148 868335 799523
56820 799523 738257 685062 639347 600800 569465 545284 528102 518208 516724 525133 544271 573772
$$ packed form
56908A21864o871o909o329n385m940m983m764l967k999k303k008j970j757r20
56894F5759M69J856L055M465O323Q437J0917J4279J8332K1799K3717K4379K4107
56881B27894K2038J7327J1029N464J784p15k805m039l711k114k07J579L533N900
56867B82957Q555J1523J5286K0164K5600L0557L4750L9010M4017M8758N0662M7268
56855F59107L7695K2940N469j1498k5061l3651l7183l6503l2950k8039k2846j7488
56843D79992j1673n542N33O871J4332K3112L2424M1632N0924O0510O9657P6794
56831H39566P9869P6390O4162M3100J6103j2312l8025n7934o9771p2813o8812
56820G99523o1266n3195m5715l8547l1335k4181j7182r894j484Q409J9138K9501
$$ plain form
56808 573772 612498 659052 711501 766673 819940 865548 897177 909184 898753 867537 820920
56797 820920 765351 706297 648038 594054 546628 506220 471882 442559 418101 399207 386586
56786 386586 380164 379057 382428 390331 403546 422534 446585 473766 501240 525498 542742 549718
56774 549718 544723 528170 502305 470209 434772 398383 363185 330985 302552 277394 254735 234556
56762 234556 217297 202846 190488 179782 170770 163199 156238 149336 142840 137371 132971 129206 125757
56749 125757 122502 119272 116027 113128 111020 109620 108393 107037 105794 104993 104487 103708 102224 100144 97994
56734 97994 96235 94970 94119 93746 93981 94693 95482 96086 96546 96841 96642 95666 94136 92594 91366 90474 90029
56717 90029 90308 91278 92307 92732 92654 92898 94088 95948 97680 98816 99497 100043 100604 101282 102215 103345 104330
$$ packed form
56808E73772L8726M6554N2449N5172N3267M5608L1629J2007j0431l1216m6617
56797H20920n5569n9054n8259n3984m7426m0408l4338k9323k4458j8894j2621
56786C86586o422j107L371P903J3215J8988K4051K7181K7474K4258J7244O976
56774E49718m995j6553k5865l2096l5437l6389l5198l2200k8433k5158k2659k0179
56762B34556j7259j4451j2358j0706r012p571o961o902o496n469m400l765l449
56749A25757l255l230l245k899k108j400j227j356j243q01n06p79j484k080k150
56734I7994j759j265q51l73K35P12P89O04M60K95j99r76j530j542j228q92m45
56717I0029K79R70J029M25p8K44J190J860J732J136O81N46N61O78R33J130R85
$$ plain form
56700 104330 104934 105368 106005 106902 107831 108720 109697 110684 111254 111081 110400 109854 109855 110145 110020 108961 107064 104843
56682 104843 102733 100906 99502 98687 98351 98013 97282 96319 95674 95693 96273 97112 97987 98778 99346 99492 99053 98103
56664 98103 97026 96277 96035 96144 96367 96524 96520 96497 96890 97986 99471 100877 102451 104893 108078 110828 112400
56647 112400 113488 115051 116782 117601 117296 116627 116025 115262 114506 114602 115840 117303 118036 118257 118737 119460 119661
56630 119661 119073 118430 118597 119658 121112 122631 124312 126233 128120 129681 131063 132631 134310 135548 136072
56615 136072 136308 136713 137127 137173 137025 137160 137458 137169 135854 133893 131930 130266 128924 127921 127179 126410 125282
56598 125282 123661 121707 119892 118816 118728 119306 120104 121050 122160 123011 123054 122404 121794 121751 122272 123261 124681 126193
56580 126193 127311 128101 129167 130691 132067 132756 132999 133338 133955 134929 136628 139272 142333 144939 146767 148174
$$ packed form
56700A04330O04M34O37Q97R29Q89R77R87N70j73o81n46JK90j25j059j897k221
56682A04843k110j827j404q15l36l38p31r63o45J9N80Q39Q75P91N68J46m39r50
56664I8103j077p49k42J09K23J57mk3L93J096J485J406J574K442L185K750J572
56647A12400J088J563J731Q19l05o69o02p63p56R6J238J463P33K21M80P23K01
56630A19661n88o43J67J061J454J519J681J921J887J561J382J568J679J238N24
56615A36072K36M05M14M6j48J35K98k89j315j961j963j664j342j003p42p69j128
56598A25282j621j954j815j076q8N78P98R46J110Q51M3o50o10m3N21R89J420J512
56580A26193J118P90J066J524J376O89K43L39O17R74J699K644L061K606J828J407
$$ plain form
56564 148174 149608 151311 153548 156706 161036 166497 172914 180074 187620 194916 201171 205847 209014 211207
56550 211207 212759 213466 213171 212461 212284 212889 213618 213844 213606 213159 212409 211126 209346 207236 204794 202014 199128
56533 199128 196473 194290 192813 192202 192157 191888 190800 189086 187411 186231 185654 185652 185961 185871 184564 181893 178678
56516 178678 176026 174261 172566 169851 166055 162418 160258 159708 159910 160104 160048 159598 158621 157473 156921 157324
56500 157324 158321 159424 160361 160690 159788 157709 155557 154509 154695 155378 155888 155999 155718 155196 154761 154704 155060 155687
56482 155687 156383 156830 156757 156307 155958 155958 156160 156504 157158 158008 158561 158676 158932 159855 161216 162464 163444 164236 164665
56463 164665 164532 164126 164011 164451 165349 166560 167910 169116 170058 170958 172029 173164 174188 175121 175986 176735 177661
56446 177661 179417 182186 185197 187516 189061 190384 191820 193263 194470 195055 194486 192712 190667 189606 189970
$$ packed form
56564A48174J434J703K237L158M330N461O417P160P546P296O255M676L167K193
56550B11207J552P07k95p10j77O05P29K26k38m47p50j283j780k110k442k780k886
56533A99128k655k183j477o11m5k69j088j714j675j180n77kL09r0j307k671l215
56516A78678k652j765j695k715l796l637k160n50K02J94n6m50r77j148n52M03
56500A57324R97J103R37L29r02k079k152j048J86O83N10J11k81n22m35n7L56O27
56482A55687O96M47p3m50l49%K02L44O54Q50N53J15K56R23J361J248R80P92M29
56463A64665j33m06j15M40Q98J211J350J206R42R00J071J135J024R33Q65P49R26
56446A77661J756K769L011K319J545J323J436J443J207N85n69j774k045j061L64
$$ plain form
56431 189970 191271 192936 194754 196592 198162 199267 200005 200603 201063 200940 199604 197054 194383 192921 192848 193207
56415 193207 193308 193361 193587 193667 193588 194065 195349 196419 196239 195153 194156 193404 192516 191696 191312 190763 189149 186961
56397 186961 185797 186367 187936 189849 192311 195365 198329 200838 203503 206930 210844 214718 218538 222370
56383 222370 225827 228617 231118 233746 236120 237494 237826 237858 238213 238865 239455 239725 239597 239068 238232 237307 236531
56366 236531 235971 235532 235304 235812 237490 239806 241401 241465 240615 240006 239942 239897 239543 239045 238550 238086 237913 238301 238982
56347 238982 239427 239685 240292 241327 242233 242734 243252 244217 245524 246917 248368 249735 250587 250773 250862 251585 252933
56330 252933 254063 254104 253002 251642 251190 252145 254145 256677 259696 263297 267109 270467 273071 275136 276997
56315 276997 278861 280708 282148 282625 282161 281565 281512 281758 281850 282135 283362 285508 287773 289583 290879 291673 292140
$$ packed form
56431A89970J301J665J818J838J570J105P38N98M60j23j336k550k671j462p3L59
56415A93207J01N3K26Q0p9M77J284J070j80j086r97p52q88q20l84n49j614k188
56397A86961j164N70J569J913K462L054K964K509K665L427L914L874L820L832
56383B22370L457K790K501K628K374J374L32L2L55O52N90K70j28n29q36r25p76
56366B36531n60m39k28N08J678K316J595O4q50o09o4m5l54m98m95m64j73L88O81
56347B38982M45K58O07J035R06N01N18R65J307J393J451J367Q52J86Q9P23J348
56330B52933J130M1j102j360m52R55K000K532L019L601L812L358K604K065J861
56315B76997J864J847J440M77m64n96n3K46R2K85J227K146K265J810J296P94M67
$$ plain form
56298 292140 293099 295478 299182 303157 306618 309516 311823 313207 313658 313779 314162 314900 315800 316676 317476 318527
56282 318527 320508 323663 327210 330114 332234 334176 336321 338750 341702 345204 348539 351142 353826 357941
56268 357941 363433 369002 374183 379924 386816 394090 400890 407442 414364 421749 429593 438342 448421 459777
56254 459777 472286 486099 501422 518556 538239 561161 587081 615240 645720 679367 716314
56243 716314 755763 797432 841945 889336 938349 987798 1037466 1087015 1135014 1179715 1219845
56232 1219845 1254073 1280809 1299302 1310052 1313418 1308815 1296047 1276368 1251336 1221511 1187269 1150015
56220 1150015 1111468 1072278 1032406 992333 952968 914805 878079 843385 811298 781655 753918
56209 753918 727967 704019 682125 662297 644706 629260 615348 602441 590501 579462 568952
$$ packed form
56298B92140R59K379L704L975L461K898K307J384M51J21L83P38R00Q76Q00J051
56282C18527J981L155L547K904K120J942K145K429K952L502L335K603K684M115
56268C57941N492N569N181N741O892P274O800O552O922P385P844Q749J0079J1356
56254D59777J2509J3813J5323J7134J9683K2922K5920K8159L0480L3647L6947
56243G16314L9449M1669M4513M7391M9013M9449M9668M9549M7999M4701M0130
56232A219845L4228K6736J8493J0750L366m603j2768j9679k5032k9825l4242l7254
56220A150015l8547l9190l9872m0073l9365l8163l6726l4694l2087k9643k7737
56209G53918k5951k3948k1894j9828j7591j5446j3912j2907j1940j1039j0510
$$ plain form
56198 568952 558948 550072 542779 536822 531892 528099 525333 522903 520281 517587 515075 512885 511533 511567
56184 511567 512369 512456 511530 510979 511691 512680 512806 512550 512912 513677 514089 514404 515420 517141 519063 521246 523943
56167 523943 526727 529061 531269 534073 537596 541633 546213 551137 555708 559777 564259 569771 575685 581496
56153 581496 588074 596388 605917 615620 625661 636925 649651 663837 680143 698962 719421 740837
56141 740837 764535 792778 826576 866101 912513 967571 1031893 1105463 1189552 1286122 1395061
56130 1395061 1513456 1637468 1763304 1886159 2000100 2100201 2184598 2254665 2313996 2366950
56120 2366950 2416759 2464067 2506999 2542108 2565304 2573496 2566940 2549719 2526914 2501459 2473702 2442162
56108 2442162 2403241 2351588 2283085 2197618 2098239 1988822 1873901 1759386 1650922 1551629
$$ packed form
56198E68952j0004q876p293n957m930l793k766k430k622k694k512k190j352L4
56184E11567Q02Q7r26n51P12R89J26k56L62P65M12L15J016J721J922K183K697
56167E23943K784K334K208K804L523M037M580M924M571M069M482N512N914N811
56153E81496O578Q314R529R703J0041J1264J2726J4186J6306J8819K0459K1416
56141G40837K3698K8243L3798L9525M6412N5058O4322P3570Q4089R6570J08939
56130A395061J18395J24012J25836J22855J13941J00101Q4397P0067N9331N2954
56120B366950M9809M7308M2932L5109K3196Q192o556j7221k2805k5455k7757l1540
56108B442162l8921n1653o8503q5467r9379j09417j14921j14515j08464r9293
$$ plain form
56098 1551629 1462728 1385483 1320657 1266888 1221882 1184967 1156567 1135600 1119477 1106553 1096673
56087 1096673 1089476 1084127 1080707 1079959 1081554 1084230 1087531 1091779 1096499 1100700 1104584 1109179 1114399 1119284
56073 1119284 1124078 1130202 1138139 1147048 1156495 1166909 1178446 1191007 1205110 1221081 1237769 1253917
56061 1253917 1270360 1288890 1309365 1330173 1351131 1373544 1397492 1421506 1444939 1468284 1491068
56050 1491068 1511945 1531104 1550277 1570023 1589293 1607926 1627313 1648254 1670283 1693376 1718131
56039 1718131 1744058 1769909 1795924 1823627 1853309 1883969 1915723 1949773 1985913 2022622 2059790
56028 2059790 2098852 2140123 2182639 2226769 2274200 2325089 2377974 2432653 2490207 2549995 2609802
56017 2609802 2669506 2731519 2797029 2864780 2934125 3006260 3081847 3160446 3242831 3330829 3424281
$$ packed form
56098A551629q8901p7245o4826n3769m5006l6915k8400k0967j6123j2924r880
56087A096673p197n349l420p48J595K676L301M248M720M201L884M595N220M885
56073A119284M794O124P937Q909R447J0414J1537J2561J4103J5971J6688J6148
56061A253917J6443J8530K0475K0808K0958K2413K3948K4014K3433K3345K2784
56050A491068K0877J9159J9173J9746J9270J8633J9387K0941K2029K3093K4755
56039A718131K5927K5851K6015K7703K9682L0660L1754L4050L6140L6709L7168
56028B059790L9062M1271M2516M4130M7431N0889N2885N4679N7554N9788N9807
56017B609802N9704O2013O5510O7751O9345P2135P5587P8599Q2385Q7998R3452
$$ plain form
56006 3424281 3521218 3621442 3726802 3837752 3953119 4073595 4201718 4337905 4480283 4628881
55996 4628881 4786067 4952390 5126250 5308298 5501862 5708335 5926552 6157361 6404127
55987 6404127 6667927 6947167 7242919 7559728 7900331 8264803 8655639 9078101 9534720
55978 9534720 10025604 10555304 11133137 11765703 12455942 13210701 14041845 14958469 15966184
55969 15966184 17076333 18308139 19680429 21210866 22926525 24866882 27075294 29599245
55961 29599245 32503478 35874013 39809355 44423074 49861331 56308986 63983353 73147778
55953 73147778 84143393 97393984 113375970 132592869 155539945 182578262 213708213
55946 213708213 248338080 285081183 321520399 354068400 378366972 390497948 388511624
$$ packed form
56006C424281R6937J00224J05360J10950J15367J20476J28123J36187J42378J48598
55996D628881J57186J66323J73860J82048J93564K06473K18217K30809K46766
55987F404127K63800K79240K95752L16809L40603L64472L90836M22462M56619
55978I534720M90884N29700N77833O32566O90239P54759Q31144R16624J007715
55969A5966184J110149J231806J372290J530437J715659J940357K208412K523951
55961B9599245K904233L370535L935342M613719N438257O447655P674367R164425
55953G3147778J0995615J3250591J5981986J9216899K2947076K7038317L1129951
55946B13708213L4629867L6743103L6439216L2548001K4298572J2130976j986324
$$ plain form
55939 388511624 373239699 347805701 316271139 282366031 248859853 217487731 189127142
55932 189127142 164053446 142200183 123345522 107194950 93416650 81680938 71689088
55925 71689088 63172958 55890799 49638671 44255909 39609714 35581815 32073438 29009401
55917 29009401 26326992 23967092 21880435 20032624 18395606 16940342 15641992 14484050
55909 14484050 13451393 12525364 11690108 10937159 10258842 9642995 9078738 8561812 8089521
55900 8089521 7655382 7253041 6880704 6537299 6218470 5920326 5643202 5387834 5151339
55891 5151339 4930416 4725134 4536342 4362575 4202493 4057161 3927122 3810353 3705815
55882 3705815 3616022 3543514 3487751 3447818 3424943 3419575 3428503 3446810 3469416 3488250 3491223 3467529
$$ packed form
55939C88511624j5271925k5433998l1534562l3905108l3506178l1372122k8360589
55932A89127142k5073696k1853263j8854661j6150572j3778300j1735712r991850
55925G1689088q516130p282159o252128n382762m646195m027899l508377l064037
55917B9009401k682409k359900k086657j847811j637018j455264j298350j157942
55909A4484050j032657r26029q35256p52949o78317o15847n64257n16926m72291
55900H089521m34139m02341l72337l43405l18829k98144k77124k55368k36495
55891E151339k20923k05282j88792j73767j60082j45332j30039j16769j04538
55882C705815q9793p2508n5763l9933k2875n368Q928J8307K2606J8834K973k3694
$$ plain form
55870 3467529 3412781 3327925 3216508 3085167 2943445 2799615 2657899 2520975 2392281 2273806
55860 2273806 2164475 2063189 1971106 1888836 1814075 1744421 1680186 1622054 1568366 1517233 1469141
55849 1469141 1424978 1383503 1343218 1304875 1269636 1236494 1203864 1172066 1142024 1113181 1084945
55838 1084945 1058574 1035332 1014231 993757 974274 956582 939695 922360 905396 890193 876177
55827 876177 862108 848684 837444 827933 818243 807658 796758 785603 773698 761192 748431 735025
55815 735025 720856 707154 695012 683718 672084 660463 649877 640182 630846 622610 616573 612365
55803 612365 608957 606603 606277 607750 609853 612154 614959 618129 621286 624705 628760 633044 637038 640893
55789 640893 644422 646266 645375 642453 638757 634390 629087 623530 618214 611920 602944 591172 577462 561861
$$ packed form
55870C467529n4748q4856j11417j31341j41722j43830j41716j36924j28694j18475
55860B273806j09331j01286r2083q2270p4761o9654o4235n8132n3688n1133m8092
55849A469141m4163m1475m0285l8343l5239l3142l2630l1798l0042k8843k8236
55838A084945k6371k3242k1101k0474j9483j7692j6887j7335j6964j5203j4016
55827H76177j4069j3424j1240r511r690j0585j0900j1155j1905j2506j2761j3406
55815G35025j4169j3702j2142j1294j1634j1621j0586r695r336q236o037m208
55803F12365l408k354l26J473K103K301K805L170L157L419M055M284L994L855
55789F40893L529J844q91k922l696m367n303n557n316o294q976j1772j3710j5601
$$ plain form
55775 561861 544300 526482 511255 500208 493156 489512 488839 490534 494347 500644 508672 515054 515718 509271
55761 509271 497436 482727 467087 452278 439698 429451 420627 412620 405425 399004 393269 388347 384025
55748 384025 379353 373688 367572 361732 355895 349591 343367 338030 333352 328786 324818 322355 321355 321264 322154
55733 322154 323990 325355 324550 321734 318637 316318 314435 312355 309627 305593 299946 293696 288370 284262
55719 284262 280426 276219 271879 267851 264518 262373 261514 261316 261433 262587 265377 269030 272539 276329 281310
55704 281310 286805 290971 293020 293457 292327 288861 282922 275355 266732 257077 246986 237842 230591 225173
55690 225173 221161 218096 215275 212204 209213 206823 204860 203019 201820 201839 202504 203002 203892 206302 209786
55675 209786 212612 214041 214718 214802 213524 210895 208245 206443 204944 203158 201544 200681 200241 199536 198353 196854
$$ packed form
55775E61861j7561j7818j5227j1047p052l644o73J695L813O297Q028O382O64o447
55761E09271j1835j4709j5640j4809j2580j0247q824q007p195o421n735m922m322
55748C84025m672n665o116n840n837o304o224n337m678m566l968k463j000r1Q90
55733C22154J836J365q05k816l097k319j883k080k728m034n647o250n326m108
55719B84262l836m207m340m028l333k145q59j98J17J154K790L653L509L790M981
55704B81310N495M166K049M37j130l466n939p567q623r655j0091r144p251n418
55690B25173m012l065k821l071k991k390j963j841j199J9O65M98Q90K410L484
55675B09786K826J429O77Q4j278k629k650j802j499j786j614q63m40p05j183j499
$$ plain form
55659 196854 195326 194280 194155 194766 195702 197135 199436 202151 204399 206201 208359 211058 213717 216184 218862
55644 218862 221609 223777 225519 227741 230453 232378 232601 231458 229382 226041 221115 215019 208337 201358
55630 201358 194453 188061 182078 176137 170612 166331 163145 160048 156956 155055 154868 155260 155013 154165 153074
55615 153074 151338 148716 146187 144963 144955 145097 144780 144130 143267 142056 140450 138503 136197 133657 131345 129703
55599 129703 128756 128187 127614 126765 125710 124860 124415 123955 123056 122054 121552 121349 120686 119414 118055 116827 115518
55582 115518 114282 113539 113067 112281 111493 111783 113407 115414 117030 118347 119422 119958 120264 121313 123290 125258
55566 125258 126768 128636 131408 134226 136064 137110 138030 138714 138676 137921 136529 134047 130138 125346 120521
55551 120521 116061 112296 109854 108841 108260 107022 105084 103026 101150 99685 99173 99820 100964 101917 102827
$$ packed form
55659A96854j528j046j25O11R36J433K301K715K248J802K158K699K659K467K678
55644B18862K747K168J742K222K712J925K23j143k076l341m926o096o682o979
55630B01358o905o392n983n941n525m281l186l097l092j901j87L92k47q48j091
55615A53074j736k622k529j224qJ42l17o50q63j211j606j947k306k540k312j642
55599A29703r47n69n73q49j055q50m45m60q99j002n02k03o63j272j359j228j309
55582A15518j236p43m72p86p88K90J624K007J616J317J075N36L06J049J977J968
55566A25258J510J868K772K818J838J046R20O84l8p55j392k482l909m792m825
55551A20521m460l765k442j013n81j238j938k058j876j465n12O47J144R53R10
$$ plain form
55536 102827 104018 105098 105498 105354 105079 104577 103730 103117 103322 103938 104177 104136 104523 105286 105475 104462 102586 100533
55518 100533 98655 96896 94961 92632 90200 88282 86995 85798 84521 83794 83789 83308 81180 78128 76182
55503 76182 76372 77910 79520 80632 81330 82110 83884 87340 92008 96540 100096 102880 105200 106755 107204
55488 107204 106830 106143 105190 103733 101940 100419 99588 99297 99158 99022 98940 98836 98540 98219 98402 99317 100521 101541
55470 101541 102573 103980 105346 105771 105113 104186 103633 103371 103343 103939 105241 106527 107031 106668 105615 103882 101739
55453 101739 99821 98198 96064 93145 90753 90391 91693 92795 92654 92031 92086 92890 93693 94053 94206 94514 94866
55436 94866 94778 94119 93527 93767 94642 95092 94548 93642 93278 93570 94163 95069 96507 98219 99641 100603 101373 102095
55418 102095 102643 102945 103179 103743 105172 107718 110760 113090 114151 114607 115323 116229 116658 116364 115615 114627 113457
$$ packed form
55536A02827J191J080M00j44k75n02q47o13K05O16K39m1L87P63J89j013j876k053
55518A00533j878j759j935k329k432j918j287j197j277p27nm81k128l052j946
55503G6182J90J538J610J112O98P80J774L456M668M532L556K784K320J555M49
55488A07204l74o87r53j457j793j521q31k91j39j36q2j04k96l21J83R15J204J020
55470A01541J032J407J366M25o58r27n53k62k8N96J302J286N04l63j053j733k143
55453A01739j918j623k134k919k392l62J302J102j41o23N5Q04Q03L60J53L08L52
55436I4866q8o59n92K40Q75M50n44r06l64K92N93R06J438J712J422R62P70P22
55418A02095N48L02K34N64J429K546L042K330J061M56P16R06M29k94p49r88j170
$$ plain form
55401 113457 112203 110830 109105 107108 105403 104198 102846 100827 98816 98007 98637 99859 100810 101092 100565
55386 100565 99443 98473 98190 98074 97148 95354 93602 92527 91920 91430 91069 90903 90840 90877 91053 91126 90843 90518
55368 90518 90757 91556 92236 92334 92001 91453 90672 89816 89343 89442 89798 90162 90723 91638 92532 92803 92248 91224 90349
55349 90349 90116 90574 91286 91727 91792 91793 91973 92235 92311 92119 91942 92316 93490 94890 95384 94428 92763 91688 91808
55330 91808 92769 93940 94922 95523 95678 95459 94922 94018 92833 91726 90959 90351 89620 88892 88628 89110 90226 91565
55312 91565 92602 93015 92986 92950 92969 92718 92189 91801 91641 91282 90716 90710 91677 92891 93470 93482 93335 92771 91439 89965
55292 89965 89320 89438 89494 89363 89745 90931 92497 94237 96387 98756 100501 101044 100574 99603 98624 98199 98641
55275 98641 99513 100124 100432 100807 101068 100665 99781 99277 99402 99520 99269 99079 99262 99449 99326 99110 98949 98572 97992
$$ packed form
55401A13457j254j373j725j997j705j205j352k019k011q09O30J222R51K82n27
55386A00565j122r70k83j16r26j794j752j075o07m90l61j66o3L7J76P3k83l25
55368I0518K39P99O80R8l33n48p81q56m73R9L56L64N61R15Q94K71n55j024q75
55349I0349k33M58P12M41O5JJ80K62P6j92j77L74J174J400M94r56j665j075J20
55330I1808R61J171R82O01J55k19n37r04j185j107p67o08p31p28k64M82J116J339
55312I1565J037M13k9l6J9k51n29l88j60l59n66oR67J214N79J2j47n64j332j474
55292H9965o45J18N6j31L82J186J566J740K150K369J745N43m70r71r79m25M42
55275I8641Q72O11L08L75K61m03q84n04J25J18k51j90J83J87j23k16j61l77n80
$$ plain form
55256 97992 97867 98732 100348 102105 103552 104303 104118 103372 102872 102902 102962 102703 102449 102544 102784 102787 102343 101225 99390
55237 99390 97602 97009 97718 98535 98584 98332 98466 98628 98128 97258 96935 97407 98118 98633 98917 98904 98506 97968 97660
55218 97660 97591 97618 97909 98661 99499 99772 99462 99217 99400 99570 99111 98058 97067 96763 97271 98272 99321 100064 100332
55199 100332 100234 100251 100908 102173 103296 103554 102997 102210 101553 101046 100704 100490 100099 99405 98972 99420 100355 100725 100233
55180 100233 99576 99177 98672 97920 97559 98033 98859 99423 99809 100283 100666 100847 101239 102044 102639 102477 102030 102091 102655
55161 102655 103350 104468 106507 108957 110618 111136 111243 111472 111536 111197 110836 110721 110391 109288 107557 105748 104031
55144 104031 102173 100189 98520 97474 96756 95846 94834 94589 95830 98112 100077 100762 100319 99434 98547 97881
55128 97881 97676 97945 98290 98400 98448 98609 98548 97930 97159 96949 97316 97626 97605 97634 97972 98337 98449 98476 98705 99178 99884
$$ packed form
55256I7992j25Q65J616J757J447P51j85p46n00L0O0k59k54R5K40Lm44j118j835
55237I9390j788n93P09Q17M9k52J34J62n00q70l23M72P11N15K84j3l98n38l08
55218I7660o9K7K91P52Q38K73l10k45J83J70m59j053r91l04N08J001J049P43K68
55199A00332r8J7O57J265J123K58n57p87o57n07l42k14l91o94m33M48R35L70m92
55180A00233o57l99n05p52l61M74Q26N64L86M74L83J81L92Q05N95j62m47O1N64
55161A02655O95J118K039K450J661N18J07K29O4l39l61j15l30j103j731j809j717
55144A04031j858j984j669j046p18r10j012k45J241K282J965O85m43q85q87o66
55128I7881k05K69L45J10M8J61o1o18p71k10L67L10k1K9L38L65J12K7K29M73P06
$$ plain form
55107 99884 100797 101461 101075 99505 97867 97522 98588 99975 100785 101124 101500 102140 103206 105061 107693 110182
55091 110182 111461 111521 111245 111097 110715 109923 109265 109065 108713 107619 106345 105971 106630 107455 107819 107839 107766 107716 107970
55072 107970 108758 109627 109808 109305 108886 108812 108441 107365 106120 105324 104811 104124 103256 102395 101495 100682 100583 101636
55054 101636 103397 105021 106145 106928 107588 108303 109245 110310 111126 111634 112204 112856 112920 111975 110610 109710 109405
55037 109405 109322 109378 109623 109695 109215 108539 108378 108791 109214 109363 109487 109756 109992 109984 109592 108669 107334 106227 105974 106516
55017 106516 107358 108270 109187 109680 109301 108459 108203 108986 110189 110933 110849 109970 108516 107028 106222 106346 106981 107677
54999 107677 108521 109833 111596 113413 114917 116029 116814 117198 116890 115731 114118 112864 112494 112896 113769 115047
54983 115047 116602 117905 118461 118437 118392 118435 118062 116881 115263 114189 114467 115960 117552 118137 117761 117403 117670
$$ packed form
55107I9884R13O64l86j570j638l45J066J387Q10L39L76O40J066J855K632K489
55091A10182J279O0k76j48l82p92o58k00l52j094j274l74O59Q25L64K0p3n0K54
55072A07970P88Q69J81n03m19p4l71j076j245p96n13o87q68q61r00q13r9J053
55054A01636J761J624J124P83O60P15R42J065Q16N08N70O52O4r45j365r00l05
55037A09405q3N6K45P2m80o76j61M13M23J49J24K69K36ql92r23j335j107k53N42
55017A06516Q42R12R17M93l79q42k56P83J203P44q4q79j454j488q06J24O35O96
54999A07677Q44J312J763J817J504J112P85L84l08j159j613j254l70M02Q73J278
54983A15047J555J303N56k4m5M3l73j181j618j074K78J493J592N85l76l58K67
$$ plain form
54966 117670 118238 118739 119360 120041 119917 118444 116592 115982 117049 118879 120596 122009 123044 123551 123797 124296
54950 124296 124989 125251 124847 124216 123671 123053 122270 121481 120593 119294 117857 117140 117417 117872 117717 117205 117068 117461
54932 117461 118101 119072 120784 123193 125596 127367 128608 129910 131580 133255 134395 135098 136147 138158 141018
54917 141018 144463 148822 154627 161664 168959 175643 181347 185849 188969 190829 191622 191087 188731 184632 179440
54902 179440 173576 167137 160650 155050 150665 146908 143343 140289 137936 135678 132989 130417 128898 128487
54888 128487 128496 128635 129194 130162 130934 131129 131170 131800 133311 135455 137883 140397 142891 145263 147541 150052 153310
54871 153310 157624 162893 168899 175540 182455 188569 192566 193941 193196 190937 187254 182207 176388 170537
54857 170537 164881 159273 153800 148836 144567 140881 137688 134975 132468 129633 126274 122986 120728 119890
$$ packed form
54966A17670N68N01O21O81j24j473j852o10J067J830J717J413J035N07K46M99
54950A24296O93K62m04o31n45o18p83p89q88j299j437p17K77M55j55n12j37L93
54932A17461O40R71J712K409K403J771J241J302J670J675J140P03J049K011K860
54917A41018L445M359N805P037P295O684N704M502L120J860P93n35k356m099n192
54902A79440n864o439o487n600m385l757l565l054k353k258k689k572j519m11
54888A28487RJ39N59R68P72J95M1O30J511K144K428K514K494K372K278K511L258
54871A53310M314N269O006O641O915O114L997J375p45k259l683n047n819n851
54857A70537n656n608n473m964m269l686l193k713k507k835l359l288k258q38
$$ plain form
54843 119890 119936 120028 119858 119681 119683 119660 119395 118953 118434 117722 116793 115963 115478 115182 114936 115135 116171 117599 118494 118671
54823 118671 118891 119656 120419 120299 119178 117743 116741 116481 116859 117564 118261 118711 118818 118716 118887 119824 121266
54806 121266 122048 121297 119609 118442 118437 118979 119405 119820 120463 121071 121331 121413 121582 121666 121401 120976 120824 121098 121685
54787 121685 122471 123242 123567 123169 122323 121679 121757 122674 124108 125446 126273 126828 127701 129054 130534 131965 133572
54770 133572 135328 136752 137735 139066 141587 145238 149409 153963 159354 165884 173296 180993 188308 194676
54756 194676 199898 204179 207619 209754 209805 207336 202592 196417 189928 183948 178481 173007 167491 162771 159681
54741 159681 158082 157105 156051 154727 153179 151569 150173 149091 147973 146369 144376 142741 142251 143054 144451
54726 144451 145398 145461 145289 145895 147518 149656 152175 155641 160283 165363 170175 175140 181136 187966 194159
$$ packed form
54843A19890M6R2j70j77Kk3k65m42n19p12r29q30m85k96k46J99J036J428Q95J77
54823A18671K20P65P63j20j121j435j002k60L78P05O97M50J07j02J71R37J442
54806A21266P82p51j688j167nN42M26M15O43O08K60Q2J69Q4k65m25j52K74N87
54787A21685P86P71L25l98q46o44P8R17J434J338Q27N55Q73J353J480J431J607
54770A33572J756J424R83J331K521L651M171M554N391O530P412P697P315O368
54756A94676N222M281L440K135N1k469m744o175o489n980n467n474n516m720l090
54741A59681j599r77j054j324j548j610j396j082j118j604j993j635m90Q03J397
54726A44451R47O3j72O06J623K138K519L466M642N080M812M965N996O830O193
$$ plain form
54711 194159 198264 199910 199680 198411 196580 193987 190023 184483 178071 171905 166665 162415 158974 156106
54697 156106 153554 151253 149437 148237 147323 146197 144695 142997 141382 140173 139592 139307 138487 136737 134754
54682 134754 133572 133324 133206 132570 131615 131028 131280 132221 133137 133311 132713 131940 131303 130390 128858 127194 126164
54665 126164 125814 125607 125293 125048 124850 124400 123656 122976 122715 123047 124055 125561 126989 127890 128490 129267 130140 130629
54647 130629 130684 130683 130637 130091 128981 128017 127951 128811 129971 130656 130385 129365 128473 128433 129011 129439 129531 129764 130248 130347
54627 130347 129591 128349 127300 126727 126645 127094 127861 128372 128362 128359 128982 129932 130249 129582 128678 128461 128966 129510 129662
54608 129662 129632 129611 129197 127918 126176 125144 125552 126949 128320 129076 129214 128974 128788 129222 130435 131822 132602
54591 132602 132589 132100 131386 130634 130239 130458 130945 131167 131119 131077 130912 130382 129938 130405 131836 133428 134673 135753
$$ packed form
54711A94159M105J646k30j269j831k593l964n540o412o166n240m250l441k868
54697A56106k552k301j816j200r14j126j502j698j615j209n81k85q20j750j983
54682A34754j182k48j18o36r55n87K52R41R16J74n98p73o37r13j532j664j030
54665A26164l50k07l14k45j98m50p44o80k61L32J008J506J428R01O00P77Q73M89
54647A30629N5jm6n46j110r64o6Q60J160O85k71j020q92m0N78M28R2K33M84R9
54627A30347p56j242j049n73q2M49P67N11j0lO23R50L17o67r04k17N05N44J52
54608A29662l0k1m14j279j742j032M08J397J371P56J38k40j86M34J213J387P80
54591A32602j3m89p14p52l95K19M87K22m8m2j65n30m44M67J431J592J245J080
$$ plain form
54573 135753 136689 136998 136500 135691 134988 134329 133919 134532 136454 138770 140356 141125 141676 142213 142547 142789 143259 143871
54555 143871 144264 144448 144723 145053 145147 145148 145639 146753 147785 147917 147054 145739 144495 143462 142585 142007 142240 143873
54537 143873 147004 150972 154741 157548 159234 160137 160775 161469 162119 162426 162384 162425 162957 163937 164994 165808 166222
54520 166222 166223 166002 165854 165778 165326 164082 162222 160394 159141 158576 158490 158493 158142 157247 156091 155161 154629 154243 153735
54501 153735 153161 152789 152750 152876 152814 152304 151420 150621 150462 151206 152621 154145 155262 155766 155782 155663 155943 157180
54483 157180 159538 162511 165332 167787 170259 172833 174745 175182 174327 173162 172365 171960 171942 172525 173604 174621
54467 174621 175362 176434 178486 181204 183548 184864 185385 185667 185890 185864 185569 185457 186082 187428 188761 189288 188869
54450 188869 187951 187030 186388 186132 186059 185572 184236 182431 181002 180243 179662 178778 177603 176258 174769 173489 173065
$$ packed form
54573A35753R36L09m98q09p03o59m10O13J922K316J586P69N51N37L34K42M70O12
54555A43871L93J84K75L30R4JM91J114J032J32q63j315j244j033q77n78K33J633
54537A43873L131L968L769K807J686R03O38O94O50L07m2M1N32R80J057Q14M14
54520A66222Jk21j48p6m52j244j860j828j253n65q6Ll51q95j156r30n32l86n08
54501A53735n74l72l9J26o2n10q84p99j59P44J415J524J117N04J6j19K80J237
54483A57180K358K973K821K455K472K574J912M37q55j165p97m05j8N83J079J017
54467A74621P41J072K052K718K344J316N21K82K23k6k95j12O25J346J333N27m19
54450A88869r18r21o42k56p3m87j336j805j429p59n81q84j175j345j489j280m24
$$ plain form
54433 173065 173513 173854 173204 171869 170849 170594 170773 171013 171215 171225 170762 169799 168671 167798 167506 167968 168958 169790
54415 169790 169903 169510 169342 169800 170651 171506 172142 172337 171836 170699 169484 168828 168914 169357 169587 169406 169235 169720
54397 169720 170953 172278 173093 173637 174628 176231 177826 178846 179437 180125 181143 182326 183463 184468 185249 185640
54381 185640 185545 185091 184576 184179 183742 182866 181374 179595 178117 177249 176789 176345 175784 175346 175330 175680 175955 175794
54363 175794 175403 175436 176355 177996 179792 181253 182142 182385 182019 181151 179857 178186 176326 174658 173501 172891
54347 172891 172685 172765 172994 173084 172693 171701 170280 168763 167407 166219 164980 163571 162267 161528 161464 161755 162164
54330 162164 162855 164026 165489 166895 168219 169711 171434 173111 174468 175517 176393 176966 176772 175460 173406
54315 173406 171595 170610 169879 168373 166051 164095 163543 164157 164877 164885 163884 161943 159680 158231 158281 159190 159672
$$ packed form
54433A73065M48L41o50j335j020k55J79K40K02J0m63r63j128q73k92M62R90Q32
54415A69790J13l93j68M58Q51Q55O36J95n01j137j215o56Q6M43K30j81j71M85
54397A69720J233J325Q15N44R91J603J595J020N91O88J018J183J137J005P81L91
54381A85640r5m54n15l97m37q76j492j779j478q68m60m44n61m38j6L50K75j61
54363A75794l91L3R19J641J796J461Q89K43l66q68j294j671j860j668j157o10
54347A72891k06Q0K29R0l91r92j421j517j356j188j239j409j304p39o4K91M09
54330A62164O91J171J463J406J324J492J723J677J357J049Q76N73j94j312k054
54315A73406j811r85p31j506k322j956n52O14P20Qj001j941k263j449N0R09M82
$$ plain form
54298 159672 159229 158384 157569 156570 155272 154241 154130 154848 155720 156223 156242 155785 154853 153589 152326 151356 150670 150055
54280 150055 149518 149527 150570 152393 154012 154802 155268 156236 157480 157847 156851 155491 155106 155836 156666 156750 156232 155862
54262 155862 156119 156766 157088 156574 155470 154628 154690 155513 156476 157147 157481 157547 157337 156876 156334 156023 156276 157225 158558
54243 158558 159654 160090 159909 159281 158213 156860 155856 155750 156188 156236 155634 155176 155589 156582 157467 158181 159024 159708
54225 159708 159504 158305 156816 155553 154385 153234 152435 151997 151267 150000 149185 149942 151934 153736 154628 155099
54209 155099 155534 155388 154067 151943 149989 148821 148448 148598 148904 149025 148915 148761 148537 147952 147057 146495 146820
54192 146820 147857 149100 150415 151955 153595 154919 155663 155860 155664 155332 155257 155643 156181 156354 155983 155274 154485
54175 154485 153892 153956 155031 156747 158060 158123 157032 155570 154314 153138 151611 149783 148362 148030 148677 149533
$$ packed form
54298A59672m43q45q15r99j298j031j11P18Q72N03J9m57r32j264j263r70o86o15
54280A50055n37RJ043J823J619P90M66R68J244L67r96j360l85P30Q30Q4n18l70
54262A55862K57O47L22n14j104q42O2Q23R63O71L34O6k10m61n42l11K53R49J333
54243A58558J096M36j81o28j068j353j004j06M38M8o02m58M13R93Q85P14Q43O84
54225A59708k04j199j489j263j168j151p99m38p30j267q15P57J992J802Q92M71
54209A55099M35j46j321k124j954j168l73J50L06J21j10j54k24n85q95n62L25
54192A46820J037J243J315J540J640J324P44J97j96l32p5L86N38J73l71p09p89
54175A54485n93O4J075J716J313O3j091j462j256j176j527j828j421l32O47Q56
$$ plain form
54159 149533 149906 149567 148624 147552 147294 148627 151122 153253 153935 153561 153180 153178 153299 153512 154068 154842 155341 155401
54141 155401 155379 155558 155851 156131 156437 156751 156980 157255 157887 158889 159845 160439 160824 161279 161694 161631 160886 159842 159143
54122 159143 159013 159003 158553 157709 156972 156498 155938 155208 154934 155762 157580 159713 161534 162537 162285 160865 159174
54105 159174 158217 158291 159174 160710 162683 164475 165545 166044 166288 165890 164200 161519 159032 157501 156753 156467
54089 156467 156663 157246 157880 158619 160013 162188 164371 165642 165752 164995 163840 162937 162934 163906 165276 166449 167191
54072 167191 167346 166846 166156 166046 166592 167068 167122 167398 168481 169861 170561 170322 169601 168805 168153 167920 168186 168545
54054 168545 168604 168595 168994 169776 170635 171697 173421 175817 178351 180666 182922 185333 187785 190079 192337 194991
54038 194991 198370 202244 205803 208369 210249 212572 216096 220522 225254 230324 236110 242463 248712 254414
$$ packed form
54159A49533L73l39r43j072k58J333K495K131O82l74l81kJ21K13N56P74M99O0
54141A55401k2J79K93K80L06L14K29K75O32J002R56N94L85M55M15o3p45j044o99
54122A59143j30j0m50q44p37m74n60p30k74Q28J818K133J821J003k52j420j691
54105A59174r57P4Q83J536J973J792J070M99K44l98j690k681k487j531p48k86
54089A56467J96N83O34P39J394K175K183J271J10p57j155r03lR72J370J173P42
54072A67191J55n00o90j10N46M76N4K76J083J380P00k39p21p96o52k33K66L59
54054A68545N9rL99P82Q59J062J724K396K534K315K256K411K452K294K258K654
54038A94991L379L874L559K566J880K323L524M426M732N070N786O353O249N702
$$ plain form
54024 254414 259576 264241 268323 271828 274874 277563 280164 283193 286822 290352 292829 294184 295313 297057
54010 297057 299571 302684 306317 310407 314898 320019 326197 333565 341735 350011 357386 362335 363221 359300
53996 359300 351133 339943 326932 313208 299797 287292 275789 265381 256415 249007 242666 236798
53984 236798 231369 226731 222950 219595 216125 212263 208202 204631 202274 201175 200633 200130 199936 200358 200762
53969 200762 200120 198408 196687 195640 194821 193665 192493 191904 191742 191448 191177 191770 193615 196199 198892 201517
53953 201517 203980 205964 207388 208697 210240 211663 212374 212439 212587 213357 214634 216079 217743 220123 223621
53938 223621 227957 232153 235391 237934 240861 244790 249242 253489 257477 261473 265315 268723 272031 275720
53924 275720 279377 282045 283678 285395 287977 290961 293671 296378 299767 303800 307855 311744 315918 320756
$$ packed form
54024B54414N162M665M082L505L046K689K601L029L629L530K477J355J129J744
54010B97057K514L113L633M090M491N121O178P368Q170Q276P375M949Q86l921
53996C59300q167j1190j3011j3724j3411j2505j1503j0408q966p408o341n868
53984B36798n429m638l781l355l470l862m061l571k357j099n42n03j94M22M04
53969B00762o42j712j721j047q19j156j172n89j62k94k71N93J845K584K693K625
53953B01517K463J984J424J309J543J423P11O5J48P70J277J445J664K380L498
53938B23621M336M196L238K543K927L929M452M247L988L996L842L408L308L689
53924B75720L657K668J633J717K582K984K710K707L389M033M055L889M174M838
$$ plain form
53910 320756 326152 331771 337336 342698 347980 353589 359722 365878 371096 374668 376492 376924 376629 376337 376278
53895 376278 375805 373955 370509 366304 362395 359061 355677 351476 346391 341112 336330 332012 327604 322825
53881 322825 317878 312904 307712 302270 296990 292195 287721 283416 279652 276808 274563 272232 269613 266913
53867 266913 264078 260890 257672 255064 252970 250504 247323 244341 242579 241814 240958 239498 237881 236591 235492
53852 235492 234339 233412 233240 233832 234588 235101 235789 237568 240967 245760 251465 257943 265383 273793 282671 291090
53836 291090 297957 302294 303526 301647 297204 291172 284804 279317 275408 272976 271290 269412 266594 262615
53822 262615 257946 253450 249661 246373 243023 239353 235627 232344 229850 228074 226546 224884 223327 222514
53808 222514 222557 222763 222551 222317 222917 224566 226771 229227 232180 235859 240021 244259 248423 252560 256717 260935
$$ packed form
53910C20756N396N619N565N362N282N609O133O156N218L572J824M32k95k92n9
53895C76278m73j850l446m205l909l334l384m201n085n279m782m318m408m779
53881C22825m947m974n192n442n280m795m474m305l764k844k245k331k619k700
53867B66913k835l188l218k608k094k466l181k982j762p65q56j460j617j290j099
53852B35492j153r27j72N92P56N13O88J779L399M793N705O478P440Q410Q878Q419
53836B91090O867M337J232j879m443o032o368n487l909k432j686j878k818l979
53822B62615m669m496l789l288l350l670l726l283k494j776j528j662j557q13
53808B22514M3K06k12k34O00J649K205K456K953L679M162M238M164M137M157M218
$$ plain form
53792 260935 265257 269613 273848 277827 281373 284160 285971 287034 287816 288486 288873 289010 289370 290340 291630 292380
53776 292380 291842 289959 287322 284501 281374 277331 272256 267022 262687 259452 256747 254141 251629 249125
53762 249125 246284 242910 239183 235447 232171 230013 229326 229550 229656 229320 229056 229040 228489 226633 223736 220746
53746 220746 218378 216896 216269 215978 215130 213412 211688 211062 211569 212360 212980 213724 214790 215816 216454 216856 217338
53729 217338 217937 218504 218909 218946 218377 217294 216209 215614 215636 216214 217318 218795 220205 221118 221492 221625 221839 222396
53711 222396 223513 225224 227243 229199 231020 232917 234942 236748 237926 238469 238784 239308 240238 241664 243718
53696 243718 246378 249196 251538 253257 254923 257167 259896 262394 264144 265276 266191 267063 267847 268499 268912
53681 268912 268818 268071 266962 265981 265317 264888 264825 265476 266755 267877 268125 267626 266947 266119 264705 262926 262009 262914
$$ packed form
53792B60935M322M356M235L979L546K787J811J063P82O70L87J37L60R70J290P50
53776B92380n38j883k637k821l127m043n075n234m335l235k705k606k512k504
53762B49125k841l374l727l736l276k158o87K24J06l36k64j6n51j856k897k990
53746B20746k368j482o27k91q48j718j724o26N07P91O20P44J066J026O38M02M82
53729B17338N99N67M05L7n69j083j085n95K2N78J104J477J410R13L74J33K14N57
53711B22396J117J711K019J956J821J897K025J806J178N43L15N24R30J426K054
53696B43718K660K818K342J719J666K244K729K498J750J132R15Q72P84O52M13
53681B68912r4p47j109r81o64m29o3O51J279J122K48m99o79q28j414j779r17R05
$$ plain form
53663 262914 264934 266145 265296 262968 260781 259768 259698 259736 259423 258946 258707 258867 259306 259786 259989 259567 258457
53646 258457 257197 256591 256943 257779 258456 258754 258699 258178 257180 256226 255974 256388 256799 256973 257600 259355 261830 263935
53628 263935 265214 266254 267767 269693 271482 272916 274345 276175 278404 280693 282740 284552 286441 288780
53614 288780 291656 294746 297597 300031 302233 304481 306959 309793 313030 316444 319567 322060 323952 325403
53600 325403 326476 327380 328638 330618 332953 334859 335998 336671 337141 337247 336875 336342 336029 335926 335833 335762 335815 335848
53582 335848 335557 334789 333598 332210 331121 330922 331693 332734 333252 333149 332854 332539 331884 330561 328617 326479
53566 326479 324867 324558 325769 327721 329201 329677 329595 329568 329594 329245 328405 327623 327780 329435 332448 336224 340292
53549 340292 344506 348737 352756 356588 360547 364562 367845 369698 370395 370759 371131 371414 371962 373536 376203
$$ packed form
53663B62914K020J211q49k328k187j013p0L8l13m77k39J60M39M80K03m22j110
53646B58457j260o06L52Q36O77K98n5n21r98r54k52M14M11J74O27J755K475K105
53628B63935J279J040J513J926J789J434J429J830K229K289K047J812J889K339
53614B88780K876L090K851K434K202K248K478K834L237L414L123K493J892J451
53600C25403J073R04J258J980K335J906J139O73M70J06l72n33l13j03r3p1N3L3
53582C35848k91p68j191j388j089j99P71J041N18j03k95l15o55j323j944k138
53566C26479j612l09J211J952J480M76q2k7K6l49q40p82J57J655L013L776M068
53549C40292M214M231M019L832L959M015L283J853O97L64L72K83N48J574K667
$$ plain form
53534 376203 379074 381542 384285 388541 394759 402353 410582 419242 428525 438511 448925 459340 469617
53521 469617 480039 490918 502307 514333 527549 542440 558692 575539 592875 611407 631547
53510 631547 652730 674134 695564 717238 739180 761332 783981 807516 831805 856128 879717
53499 879717 902196 923658 944463 964804 984402 1002889 1020636 1038755 1057976 1077828 1097303
53488 1097303 1116035 1134399 1152666 1170587 1187747 1203921 1219011 1233040 1246369 1259696 1273643
53477 1273643 1288274 1302901 1316289 1327205 1335083 1340239 1343439 1345239 1345665 1344315 1340676 1334469 1325803
53464 1325803 1314950 1302068 1287362 1271402 1254919 1238188 1220967 1203158 1185066 1166827 1147962
53453 1147962 1127819 1106210 1083425 1059995 1036747 1014676 994272 975108 956397 937777 919317
$$ packed form
53534C76203K871K468K743M256O218P594Q229Q660R283R986J0414J0415J0277
53521D69617J0422J0879J1389J2026J3216J4891J6252J6847J7336J8532K0140
53510F31547K1183K1404K1430K1674K1942K2152K2649K3535K4289K4323K3589
53499H79717K2479K1462K0805K0341J9598J8487J7747J8119J9221J9852J9475
53488A097303J8732J8364J8267J7921J7160J6174J5090J4029J3329J3327J3947
53477A273643J4631J4627J3388J0916P878N156L200J800M26j350l639o207q666
53464A325803j0853j2882j4706j5960j6483j6731j7221j7809j8092j8239j8865
53453A147962k0143k1609k2785k3430k3248k2071k0404j9164j8711j8620j8460
$$ plain form
53442 919317 901124 883437 866925 852330 839884 829415 820898 814456 809899 806655 804199 802233 800633
53429 800633 799695 800336 803574 809671 818094 828230 839724 852210 865336 879264 894636 911827 930614
53416 930614 950775 972460 995586 1019364 1043050 1067026 1092567 1120524 1150662 1182325 1215286
53405 1215286 1249747 1285881 1323744 1363427 1404979 1448206 1492908 1539276 1587722 1638158 1689736
53394 1689736 1741496 1793159 1845116 1897836 1951430 2005598 2059685 2112904 2164766 2215215 2264111
53383 2264111 2310750 2354245 2394277 2431138 2465129 2496319 2524700 2549965 2571146 2587185 2598112
53372 2598112 2605139 2609295 2610429 2607675 2600177 2586890 2566426 2537956 2502123 2460515 2414397 2364414
53360 2364414 2311212 2255657 2198447 2140053 2081110 2022472 1964803 1908380 1853268 1799466 1746995
$$ packed form
53442I19317j8193j7687j6512j4595j2446j0469q517o442m557l244k456j966j600
53429H00633r38O41L238O097Q423J0136J1494J2486J3126J3928J5372J7191J8787
53416I30614K0161K1685K3126K3778K3686K3976K5541K7957L0138L1663L2961
53405A215286L4461L6134L7863L9683M1552M3227M4702M6368M8446N0436N1578
53394A689736N1760N1663N1957N2720N3594N4168N4087N3219N1862N0449M8896
53383B264111M6639M3495M0032L6861L3991L1190K8381K5265K1181J6039J0927
53372B598112P027M156J134k754p498j3287k0464k8470l5833m1608m6118m9983
53360B364414n3202n5555n7210n8394n8943n8638n7669n6423n5112n3802n2471
$$ plain form
53349 1746995 1696095 1647186 1600375 1555194 1511071 1467814 1425313 1383117 1340877 1299022 1258533
53338 1258533 1220106 1184007 1150486 1119724 1091433 1065109 1040769 1018917 999776 983060 968446
53327 968446 955630 943855 932095 920047 908523 898564 890509 884077 878866 874569 871092 868713 867786
53314 867786 868034 868586 869001 869898 872252 876435 882300 889825 899113 909901 921647 934147 947770 962972
53300 962972 979829 998090 1017514 1038062 1059893 1083175 1107823 1133416 1159466 1185839 1212841
53289 1212841 1240821 1269598 1298261 1325623 1350928 1374164 1395685 1415675 1433912 1449867 1462925
53278 1462925 1472808 1479938 1485089 1488349 1488741 1485288 1478263 1468864 1457862 1445153 1430627 1414683 1397570
53265 1397570 1378799 1357683 1334164 1308769 1282032 1254289 1225803 1196705 1166915 1136377 1105254
$$ packed form
53349A746995n0900m8909m6811m5181m4123m3257m2501m2196m2240m1855m0489
53338A258533l8427l6099l3521l0762k8291k6324k4340k1852j9141j6716j4614
53327I68446j2816j1775j1760j2048j1524r959q055o432n211m297l477k379r27
53314H67786K48N52M15Q97K354M183N865P525R288J0788J1746J2500J3623J5202
53300I62972J6857J8261J9424K0548K1831K3282K4648K5593K6050K6373K7002
53289A212841K7980K8777K8663K7362K5305K3236K1521J9990J8237J5955J3058
53278A462925R883P130N151L260L92l453p025r399j1002j2709j4526j5944j7113
53265A397570j8771k1116k3519k5395k6737k7743k8486k9098k9790l0538l1123
$$ plain form
53254 1105254 1073746 1041955 1010181 979103 949296 920674 892813 865771 840166 816320 793595
53243 793595 770813 747204 722872 698483 674708 651911 630196 609579 590111 571845 554786
53232 554786 538993 524772 512609 502683 494447 486891 479334 471755 464246 456523 448387 440408 433445
53219 433445 427385 421011 413456 405284 397685 391005 384548 377576 369985 362181 354794 348462 343451 339410
53205 339410 335753 332164 328578 324967 321496 318482 315757 312441 308019 303340 299750 297381 295173 292478
53191 292478 289725 287345 285040 282520 280053 277751 275038 271510 267774 264724 262359 260010 257465 255169
53177 255169 253414 251962 250511 249064 247668 246166 244424 242660 241386 241019 241513 242377 243093 243466 243536 243332
53161 243332 242962 242788 243129 243813 244371 244617 244647 244342 243454 242255 241509 241477 241484 240761 239337 237857 236878 236602 236864
$$ packed form
53254A105254l1508l1791l1774l1078k9807k8622k7861k7042k5605k3846k2725
53243G93595k2782k3609k4332k4389k3775k2797k1715k0617j9468j8266j7059
53232E54786j5793j4221j2163r926q236p556p557p579p509p723q136p979o963
53219D33445o060o374p555q172p599o680o457o972p591p804p387o332n011m041
53205C39410l657l589l586l611l471l014k725l316m422m679l590k369k208k695
53191B92478k753k380k305k520k467k302k713l528l736l050k365k349k545k296
53177B55169j755j452j451j447j396j502j742j764j274l67M94Q64P16L73P0k04
53161B43332l70j74L41O84N58K46L0l05q88j199p46l2Pp23j424j480r79k76K62
$$ plain form
53142 236864 237117 236777 235865 235017 234684 234745 235042 235724 236708 237371 237204 236303 234862 232792 230351 228529 228102 228649
53124 228649 229197 229434 229613 229659 229263 228690 228645 229341 230433 231756 233318 234576 234642 233512 232345 232187 232922 233702
53106 233702 233870 233171 231629 229648 227858 226491 225176 223656 222338 221717 221500 220796 219165 217172 215802
53091 215802 215453 215598 215385 214547 213596 213100 212977 212743 212327 212178 212501 212815 212563 211914 211630 212230 213534 215001
53073 215001 216228 217075 217505 217533 217318 217136 217117 217094 216861 216529 216467 216861 217497 218031 218301 218332 218231 218169 218320 218640
53053 218640 218856 218740 218292 217657 217085 216960 217504 218311 218505 217624 216080 214581 213411 212472 211645 210783 209705
53036 209705 208537 207729 207345 206724 205363 203841 203216 203719 204630 205371 206015 206729 207374 207825 208161 208359 208239 207831
53018 207831 207391 206938 206233 205336 204721 204647 204795 204723 204352 203798 203097 202302 201565 200938 200354 199951 200066 200735 201580
$$ packed form
53142B36864K53l40r12q48l33O1K97O82R84O63j67r01j441k070k441j822m27N47
53124B28649N48K37J79M6l96n73m5O96J092J323J562J258O6j130j167j58P35P80
53106B33702J68o99j542j981j790j367j315j520j318o21k17p04j631j993j370
53091B15802l49J45k13q38r51m96j23k34m16j49L23L14k52o49k84O00J304J467
53073B15001J227Q47M30K8k15j82j9k3k33l32o2L94O36N34K70L1j01o2J51L20
53053B18640K16j16m48o35n72j25N44Q07J94q81j544j499j170r39q27q62j078
53036B09705j168q08l84o21j361j522o25N03R11P41O44P14O45M51L36J98j20m08
53018B07831m40m53p05q97o15p4J48p2l71n54p01p95p37o27n84m03J15O69Q45
$$ plain form
52999 201580 202387 203422 204875 206311 207064 206942 206236 205254 204187 203244 202498 201699 200628 199564 199027 199053 199141
52982 199141 199050 199282 200436 202307 203958 204710 204812 205040 205875 207212 208671 209873 210489 210420 210078 210179 211035
52965 211035 212217 213142 213775 214492 215425 216356 217215 218273 219707 221264 222512 223268 223640 223750 223518 222710 221191
52948 221191 219127 216877 214648 212370 209987 207702 205830 204573 204051 204270 204834 204977 204218 202844 201515
52933 201515 200609 200194 200286 200621 200477 199387 197910 197100 197246 197742 198176 198800 199758 200605 200949 200960 200900 200658 200190
52914 200190 199947 200321 201001 201363 201311 201270 201583 202300 203357 204507 205208 205075 204406 203885 203758 203630 203127 202324 201468
52895 201468 200592 199596 198466 197303 196300 195795 196141 197324 198852 200242 201520 202950 204315 204891 204386 203546
52879 203546 203393 204004 204505 204303 203739 203380 203334 203584 204372 205593 206278 205539 203841 202541 202231 202383 202630 203501
$$ packed form
52999B01580Q07J035J453J436P53j22p06r82j067r43p46p99j071j064n37K6Q8
52982A99141r1K32J154J871J651P52J02K28Q35J337J459J202O16o9l42J01Q56
52965B11035J182R25O33P17R33R31Q59J058J434J557J248P56L72J10k32q08j519
52948B21191k064k250k229k278k383k285j872j257n22K19N64J43p59j374j329
52933B01515r06m15R2L35j44j090j477q10J46M96M34O24R58Q47L44J1o0k42m68
52914B00190k43L74O80L62n2m1L13P17J057J150P01j33o69n21j27j28n03q03q56
52895B01468q76r96j130j163j003n05L46J183J528J390J278J430J365N76n05q40
52879B03546j53O11N01k02n64l59m6K50P88J221O85p39j698j300l10J52K47Q71
$$ plain form
52861 203501 205524 208423 211600 214752 217535 219245 219558 219163 219012 219199 219173 218795 218517 218555 218568 218224 217575 216697
52843 216697 215355 213312 210749 208185 206037 204353 202882 201341 199617 197775 195937 194248 192938 192247
52829 192247 192254 192837 193785 194843 195758 196504 197401 198670 199922 200451 200057 199200 198306 197422 196652 196375 196728 197330
52811 197330 197848 198454 199448 200824 202564 204879 207781 210783 213491 216048 218531 220333 220777 219958 218310
52796 218310 215708 211877 207486 203867 201517 199694 197721 195909 194825 194303 193662 192482 190818 188993 187490
52781 187490 186777 186862 187247 187572 188033 188953 190243 191540 192617 193363 193623 193420 193127 193063 193032 192677 192182 192238 193258
52762 193258 194957 196802 198510 199878 200500 200044 198819 197762 197706 198759 200424 202113 203437 204207 204440 204360
52746 204360 204208 203995 203589 203025 202567 202464 202766 203363 204014 204401 204394 204249 204256 204266 203972 203685 204220 205811 207678 209024
$$ packed form
52861B03501K023K899L177L152K783J710L13l95j51J87k6l78k78L8J3l44o49q78
52843B16697j342k043k563k564k148j684j471j541j724j842j838j689j310o91
52829A92247PN83R48J058R15P46Q97J269J252N29l94q57q94q84p70k77L53O02
52811A97330N18O06R94J376J740K315K902L002K708K557K483J802M44q19j648
52796B18310k602l831m391l619k350j823j973j812j084n22o41j180j664j825j503
52781A87490p13Q5L85L25M61R20J290J297J077P46K60k03k93o4l1l55m95N6J020
52762A93258J699J845J708J368O22m56j225j057n6J053J665J689J324P70K33q0
52746B04360j52k13m06n64m58j03L02N97O51L87pj45PJ0k94k87N35J591J867J346
$$ plain form
52726 209024 209953 210915 211801 212253 212440 212720 212749 211857 210289 209149 208894 208699 207704 206120 204647 203434 202293
52709 202293 201447 201297 201662 201912 201775 201413 200777 199569 198051 197269 197979 199589 200642 200379 199547 199532 200861
52692 200861 202717 203889 204001 203672 203621 203871 203877 203182 201866 200507 199886 200565 202514 205096 207515 209259 210159
52675 210159 210219 209606 208744 208176 208218 208776 209467 209868 209692 208943 207996 207433 207635 208439 209224 209428 209077 208780 209164
52656 209164 210282 211632 212703 213432 214167 215368 217357 220205 223652 227167 230151 232096 232632 231619 229320
52641 229320 226280 222884 219154 215235 211933 210360 210859 212490 213816 214132 213840 213789 214490 215863 217475 218934
52625 218934 220220 221724 223841 226443 228816 230143 230012 228490 225967 223030 220318 218235 216782 215680
52611 215680 214636 213527 212513 212013 212339 213225 213905 213826 213147 212413 211961 211871 212259 213233 214671 216347 218107
$$ packed form
52726B09024R29R62Q86M52J87K80K9q92j568j140k55j95r95j584j473j213j141
52709B02293q46j50L65K50j37l62o36j208j518p82P10J610J053k63q32j5J329
52692B00861J856J172J12l29n1K50Oo95j316j359o21O79J949K582K419J744R00
52675B10159O0o13q62n68M2N58O91M01j76p49r47n63K02Q04P85K04l51k97L84
52656B09164J118J350J071P29P35J201J989K848L447L515K984J945N36j013k299
52641B29320l040l396l730l919l302j573M99J631J326L16k92n1P01J373J612J459
52625B18934J286J504K117K602K373J327j31j522k523k937k712k083j453j102
52611B15680j044j109j014n00L26Q86O80p9o79p34m52r0L88R74J438J676J760
$$ plain form
52594 218107 219666 220438 220071 219030 218163 217713 217319 216895 216848 217301 217819 218168 218704 219653 220632 221331 222084 223185
52576 223185 224165 224436 224280 224472 225164 225821 226134 226268 226353 226368 226507 226956 227308 226923 225984 225515 226087 227113 227693
52557 227693 227611 227134 226333 225066 223426 221836 220772 220475 220711 220811 220276 219429 219006 219052 218793 217885 217180 217749
52539 217749 219553 221613 223213 224290 224848 224635 223574 222049 220645 219789 219663 220238 221342 222848 224695
52524 224695 226512 227492 227082 225746 224545 223918 223349 222433 221747 222224 223956 226108 227939 229420 230774 231921
52508 231921 232706 233417 234639 236603 239024 241606 244308 246886 248529 248401 246541 243892 241435 239504 237928
52493 237928 236450 234873 233092 231212 229493 228069 226928 226239 226329 227100 227813 227901 227787 228411 230019 231908
52477 231908 233416 234628 235937 237359 238674 239853 240967 241918 242717 243843 245702 247782 248932 248722 247988
$$ packed form
52594B18107J559P72l67j041q67m50l94m24m7M53N18L49N36R49R79O99P53J101
52576B23185R80K71j56J92O92O57L13J34Q5J5J39M49L52l85r39m69N72J026N80
52557B27693q2m77q01j267j640j590j064k97K36J00n35q47m23M6k59r08p05N69
52539B17749J804K060J600J077N58k13j061j525j404q56j26N75J104J506J847
52524B24695J817R80m10j336j201o27n69r16o86M77J732K152J831J481J354J147
52508B31921P85P11J222J964K421K582K702K578J643j28j860k649k457j931j576
52493B37928j478j577j781j880j719j424j141o89R0P71P13Q8j14O24J608J889
52477B31908J508J212J309J422J315J179J114R51P99J126J859K080J150k10p34
$$ plain form
52462 247988 247750 248116 248714 249670 251360 253377 254659 254890 254989 255742 256518 255972 253716 250669 247854 245499 243419
52445 243419 241668 240424 239503 238415 236940 235431 234445 234107 233972 233555 232892 232362 231985 231246 229777 227921
52429 227921 226328 225249 224559 224243 224430 225028 225770 226554 227371 227947 227988 227802 228140 229249 230647 231984 233518
52412 233518 235350 236851 237508 237989 239574 242639 246412 250300 254728 260386 267264 274922 283341 292729 302447
52397 302447 310672 315490 316243 313643 308798 302453 295131 287574 280678 274965 270344 266479 263313 261144
52383 261144 260206 260244 260578 260600 260187 259567 258870 258053 257271 257028 257681 258955 260290 261663 263760 267210 271866
52366 271866 276927 281559 285241 287698 288825 288777 288007 287073 286275 285482 284355 282814 281199 279894 278877 277823
52350 277823 276604 275535 275048 275230 275778 276431 277392 279184 281941 284967 287334 288936 290558 292725 294973
$$ packed form
52462B47988k38L66N98R56J690K017J282K31R9P53P76n46k256l047k815k355k080
52445B43419j751j244r21j088j475j509r86l38j35m17o63n30l77p39j469j856
52429B27921j593j079o90l16J87N98P42P84Q17N76M1j86L38J109J398J337J534
52412B33518J832J501O57M81J585L065L773L888M428N658O878P658Q419R388R718
52397C02447Q225M818P53k600m845o345p322p557o896n713m621l865l166k169
52383B61144r38L8L34K2m13o20o97q17p82k43O53J274J335J373K097L450M656
52366B71866N061M632L682K457J127m8p70r34p98p93j127j541j615j305j017j054
52350B77823j219j069m87J82N48O53R61J792K757L026K367J602J622K167K248
$$ plain form
52335 294973 296647 298033 300050 303017 306376 309724 313516 318520 324947 332312 339903 347339 354885 363169
52321 363169 372266 381206 388946 395768 403008 411274 419680 427142 433720 440168 446839 453701 460874 468348
52307 468348 475450 481475 486805 492711 499893 507810 515510 522588 529175 535522 541921 548726 556092 563772
52293 563772 571265 577989 583333 586865 588667 589331 589515 589562 589509 589177 588268 586685 584898 583736 583544 583648 582903
52276 582903 580789 577931 575594 574770 575697 578023 581274 585075 589061 592883 596492 600278 604731 609918 615472
52261 615472 621028 626455 631633 636295 640369 644388 649285 655637 663222 671407 679839 688539 697356 705660
52247 705660 712836 718891 724306 729276 733418 736261 737834 738673 739477 740808 742862 745327 747555 749041 749688
52232 749688 749647 749092 748208 747158 745879 744086 741612 738656 735629 732934 730997 730210 730540 731313 731620 731084
$$ packed form
52335B94973J674J386K017K967L359L348L792N004O427P365P591P436P546Q284
52321C63169R097Q940P740O822P240Q266Q406P462O578O448O671O862P173P474
52307D68348P102O025N330N906P182P917P700P078O587O347O399O805P366P680
52293E63772P493O724N344L532J802O64J84M7n3l32r09j583j787j162j92J04p45
52276E82903k114k858k337q24R27K326L251L801L986L822L609L786M453N187N554
52261F15472N556N427N178M662M074M019M897O352P585Q185Q432Q700Q817Q304
52247G05660P176O055N415M970M142K843J573Q39Q04J331K054K465K228J486O47
52232G49688m1n55q84j050j279j793k474k956l027k695j937p87L30P73L07n36
$$ plain form
52216 731084 730209 730052 731363 733792 736029 737149 737854 739887 744017 749156 753839 757969 762521 767912 773440
52201 773440 778242 782041 784895 786863 788239 789723 791998 795235 799047 802766 805820 808159 810368 813177
52187 813177 816784 820792 824661 827992 830515 832222 833457 834485 834994 834349 832349 829291 825373 820552 815054
52172 815054 809423 803812 797776 791076 784285 778154 772818 768053 764039 761309 760082 760115 761111 762843 764968
52157 764968 767200 769726 772903 776407 779156 780404 780573 780668 781097 781558 781892 782453 783514 784826 786179 788015
52141 788015 790885 794394 797248 798500 798340 797439 795946 793554 790259 786622 783318 780822 779442 779256 779922
52126 779922 780976 782510 785356 790434 798055 807892 819449 832422 846759 862465 879268 896477 913319
52113 913319 929389 944573 958610 971087 981933 991561 1000240 1007653 1013390 1017709 1021436 1025142 1028729
$$ packed form
52216G31084q75j57J311K429K237J120P05K033M130N139M683M130M552N391N528
52201G73440M802L799K854J968J376J484K275L237L812L719L054K339K209K809
52187H13177L607M008L869L331K523J707J235J028N09o45k000l058l918m821n498
52172H15054n631n611o036o700o791o131n336m765m014k730j227L3R96J732K125
52157G64968K232K526L177L504K749J248J69R5M29M61L34N61J061J312J353J836
52141G88015K870L509K854J252j60r01j493k392l295l637l304k496j380j86O66
52126G79922J054J534K846N078P621R837J1557J2973J4337J5706J6803J7209J6842
52113I13319J6070J5184J4037J2477J0846R628Q679P413N737M319L727L706L587
$$ plain form
52100 1028729 1031835 1034403 1036801 1039606 1043404 1048582 1055055 1062178 1069067 1075112 1080212 1084502 1087862 1089720
52086 1089720 1089340 1086266 1080482 1072275 1062162 1051077 1040353 1031206 1024049 1018444 1013807 1010091 1007615
52073 1007615 1006317 1005416 1003955 1001602 998857 996632 995788 996943 1000297 1005303 1010587 1014566 1016553 1017429 1019018
52058 1019018 1022446 1027050 1031060 1033434 1034730 1036173 1038312 1040917 1043674 1046323 1048324 1049097 1048660 1047454
52044 1047454 1045512 1042399 1038034 1032856 1027050 1020408 1013282 1006823 1001675 997165 992504 988116 984871 982519
52030 982519 980037 977328 975432 974883 974846 974260 973099 972109 971786 972000 972225 971814 970301 967681 964261 960321
52014 960321 956193 952511 949835 948043 946589 945317 944386 943361 941165 937132 931424 924114 914650 902721
52000 902721 889029 874580 859610 843743 826854 809215 791070 772607 754194 736231 718940
$$ packed form
52100A028729L106K568K398K805L798N178O473P123O889O045N100M290L360J858
52086A089720l80l074n784q207j0113j1085j0724r147p157n605m637l716k476
52073A007615j298r01j461k353k745k225q44J155L354N006N284L979J987Q76J589
52058A019018L428M604M010K374J296J443K139K605K757K649K001P73m37j206
52044A047454j942l113m365n178n806o642p126o459n148m510m661m388l245k352
52030I82519k482k709j896n49l7n86j161r90l23K14K25m11j513k620l420l940
52014I60321m128l682k676j792j454j272r31j025k196m033n708p310r464j1929
52000I02721j3692j4449j4970j5867j6889j7639j8145j8463j8413j7963j7291
$$ plain form
51989 718940 702684 688227 676140 666069 656981 648060 639070 630089 621307 612994 605190 597463 589227
51976 589227 580160 570113 558933 546830 534652 523255 512753 502962 494365 487876 483589 480527 478005
51963 478005 476642 477595 481218 486966 494309 503112 513120 523573 533572 542585 550400 556732 561162 563491
51949 563491 563916 562682 559725 554950 548816 542326 536309 531070 526942 524817 525702 529887 536917 546299 557822
51934 557822 571207 585922 601475 617525 633419 647882 659433 667082 670498 669756 665158 657192 646340
51921 646340 632870 617011 599392 581115 563233 546268 530322 515530 502135 490173 479365
51910 479365 469463 460534 452779 446283 441146 437629 435913 435845 437170 439869 443876 448654 453603 458913 465473
51895 465473 473730 483064 492367 500681 506963 509925 508814 504178 497373 489460 481018 472804 465981 461611
$$ packed form
51989G18940j6256j4457j2087j0071r088q921q990q981q782q313p804p727q236
51976E89227r067j0047j1180j2103j2178j1397j0502r791q597o489m287l062k522
51963D78005j363R53L623N748P343Q803J0008J0453R999R013P815O332M430K329
51949E63491M25j234k957m775o134o490o017n239m128k125Q85M185P030R382J1523
51934E57822J3385J4715J5553J6050J5894J4463J1551P649L416p42m598p966j0852
51921F46340j3470j5859j7619j8277j7882j6965j5946j4792j3395j1962j0808
51910D79365r902q929p755o496n137l517j716o8J325K699M007M778M949N310O560
51895D65473Q257R334R303Q314O282K962j111m636o805p913q442q214o823m370
$$ plain form
51881 461611 460215 461851 466298 473255 482706 495146 511215 531187 555002 582422 612520 643015
51869 643015 670656 692537 706870 712793 710221 700209 684904 666532 646409 624985 602554 579710
51857 579710 557407 536817 519030 504645 493622 485470 479409 474468 469906 465723 462495 460475 459121
51844 459121 457612 455514 452758 449345 445387 441181 436887 432309 427318 422261 417603 413403 409584 406573
51830 406573 405112 405389 406829 408796 411103 413745 416578 419464 422351 424969 426747 427320 426845 425671 423967
51815 423967 421942 420112 418966 418592 418997 420518 423391 427101 430737 434047 437555 441482 445074 447266 447577
51800 447577 446099 443041 438749 433887 429095 424551 420242 416546 414037 412682 411607 409888 407327 404336
51786 404336 401248 397986 394401 390752 387706 385762 384727 383889 382679 380994 378981 376843 374998 374012 374066
$$ packed form
51881D61611j396J636M447O957R451J2440J6069J9972K3815K7420L0098L0495
51869F43015K7641K1881J4333N923k572j0012j5305j8372k0123k1424k2431k2844
51857E79710k2303k0590j7787j4385j1023q152o061m941m562m183l228k020j354
51844D59121j509k098k756l413l958m206m294m578m991n057m658m200l819l011
51830D06573j461K77J440J967K307K642K833K886K887K618J778N73m75j174j704
51815D23967k025j830j146l74M05J521K873L710L636L310L508L927L592K192L11
51800D47577j478l058m292m862m792m544m309l696k509j355j075j719k561k991
51786D04336l088l262l585l649l046j944j035q38j210j685k013k138j845r86N4
$$ plain form
51771 374066 374772 375768 377191 379288 381935 384998 388856 393992 400277 407271 415051 424033 434009 444027
51757 444027 453202 460885 466066 467606 465532 461294 456199 450185 442706 434143 425635 417948 411245 405699
51743 405699 401514 398407 395783 393533 392187 392210 393538 395920 399408 404467 411762 421682 433749 446541
51729 446541 458431 468412 476172 481776 485667 488757 491982 495773 500136 505031 510223 514903 517917 518426
51715 518426 516215 511663 505818 500243 496147 493651 492163 491180 490139 487889 483352 476932 470518 465756
51701 465756 462901 461591 461886 463841 466475 467987 467117 464011 459921 456289 454034 453336 453962 455776 458736
51686 458736 462286 465072 465580 463044 457720 450504 442500 434713 427756 421777 416849 413403 412094 413202
51672 413202 416342 420830 426242 432484 439389 446503 453454 460442 468147 477129 487494 499060 511338
$$ packed form
51771C74066P06R96J423K097K647L063L858N136O285O994P780Q982R976J0018
51757D44027R175P683N181J540k074m238n095o014p479q563q508p687o703n546
51743D05699m185l107k624k250j346K3J328K382L488N059P295R920J2067J2792
51729D46541J1890R981P760N604L891L090L225L791M363M895N192M680L014N09
51715E18426k211m552n845n575m096k496j488r83j041k250m537o420o414m762
51701D65756k855j310K95J955K634J512q70l106m090l632k255o98O26J814K960
51686D58736L550K786N08k536n324p216q004p787o957n979m928l446j309J108
51672D13202L140M488N412O242O905P114O951O988P705Q982J0365J1566J2278
$$ plain form
51659 511338 523092 532266 536897 536103 530051 519377 505231 489701 475385 464046 455937 450524 447595
51646 447595 447466 450331 455541 461370 465561 466440 463712 458051 450096 440231 429205 418229 408115 398805
51632 398805 390097 382415 376387 371948 368359 364986 361727 358756 356304 354681 354137 354508 355215 355705 355871
51617 355871 356061 356735 358046 359636 360839 361180 360670 359613 358283 356861 355508 354315 353246 352304 351709 351794
51601 351794 352707 354307 356278 358322 360297 362324 364735 367867 371919 377011 383279 390872 399837 409941
51587 409941 420403 429809 436556 439704 439538 437284 434336 431707 430044 429928 431929 436332 442945 451479
51573 451479 462198 475885 492897 512416 533024 553959 575451 597807 620535 642544 662877
51562 662877 681034 696885 710727 723601 737355 754209 776079 804138 838793 879665 925199
$$ packed form
51659E11338J1754R174M631p94o052j0674j4146j5530j4316j1339q109n413k929
51646D47595j29K865N210N829M191Q79k728n661p955r865j1026j0976j0114r310
51632C98805q708p682o028m439l589l373l259k971k452j623n44L71P07M90J66
51617C55871J90O74J311J590J203L41n10j057j330j422j353j193j069r42n95Q5
51601C51794R13J600J971K044J975K027K411L132M052N092O268P593Q965J0104
51587D09941J0462R406O747L148j66k254k948k629j663j16K001M403O613Q534
51573D51479J0719J3687J7012J9519K0608K0935K1492K2356K2728K2009K0333
51562F62877J8157J5851J3842J2874J3754J6854K1870K8059L4655M0872M5534
$$ plain form
51551 925199 972307 1016898 1055200 1084626 1103505 1110719 1106203 1091398 1068401 1038589 1002556 961181
51539 961181 916007 868541 819986 771877 726198 684355 646582 612744 583204 558393 537975
51528 537975 521039 506824 494768 484191 474565 465994 458931 453425 449001 445090 441214 436973 432343
51515 432343 427918 424341 421534 418928 416361 414209 412575 410900 408647 405976 403411 401096 398693 395970
51501 395970 393257 391152 389794 388514 386430 383474 380542 378457 377036 375510 373672 372146 371562 371875 372567
51486 372567 373162 373433 373475 373758 374794 376483 377968 378344 377480 376023 374746 374122 374364 375548 377479 379614
51470 379614 381374 382683 384041 385859 387772 388872 388661 387512 386002 384084 381211 377132 372167 366778
51456 366778 361312 356285 352441 350176 349022 348027 346596 344816 343135 342073 342249 344261 348276 353973 361157
$$ packed form
51551I25199M7108M4591L8302K9426J8879P214m516j4805k2997k9812l6033m1375
51539I61181m5174m7466m8555m8109m5679m1843l7773l3838k9540k4811k0418
51528E37975j6936j4215j2056j0577r626q571p063n506m424l911l876m241m630
51515D32343m425l577k807k606k567k152j634j675k253k671k565k315k403k723
51501C95970k713k105j358j280k084k956k932k085j421j526j838j526n84L13O92
51486C72567N95K71M2K83J036J689J485L76q64j457j277o24K42J184J931K135
51470C79614J760J309J358J818J913J100k11j149j510j918k873m079m965n389
51456C66778n466n027l844k265j154r95j431j780j681j062J76K012M015N697P184
$$ plain form
51441 361157 370275 381972 396239 412384 429683 447395 463982 477168 485621 490301 493447 496428
51429 496428 499202 501517 503337 503784 500834 493126 481670 468971 456780 445386 434852 425814 418745
51416 418745 413125 407962 402936 398648 395838 394675 394802 395770 397203 398670 399742 400354 400896 401642 402242 402132
51400 402132 401392 400756 400746 401262 402180 403789 406344 409628 413361 417645 422553 427612 432322 436993 442498 449314
51384 449314 457392 466964 478904 494124 513059 535973 563366 595815 633592 676671 724961 778386
51372 778386 836700 899116 963817 1027726 1086985 1138048 1178607 1207645 1224745 1229377 1220925 1199456
51360 1199456 1166341 1123854 1074137 1018749 959193 897505 836160 777638 724060 676680 635433
51349 635433 599330 567551 539797 515551 493779 473900 456432 441930 429732 418564 408084
$$ packed form
51441C61157R118J1697J4267J6145J7299J7712J6587J3186Q453M680L146K981
51429D96428K774K315J820M47k950p708j1456j2699j2191j1394j0534r038p069
51416D18745n620n163n026m288k810j163J27R68J433J467J072O12N42P46O00j10
51400D02132p40o36j0N16R18J609K555L284L733M284M908N059M710M671N505O816
51384D49314Q078R572J1940J5220J8935K2914K7393L2449L7777M3079M8290N3425
51372G78386N8314O2416O4701O3909N9259N1063M0559K9038J7100M632q452k1469
51360A199456l3115m2487m9717n5388n9556o1688o1345n8522n3578m7380m1247
51349F35433l6103l1779k7754k4246k1772j9879j7468j4502j2198j1168j0480
$$ plain form
51338 408084 398957 391584 385620 380733 376912 373889 371083 368377 366304 365100 364162 362758 360872 359073
51324 359073 357898 357520 357603 357372 356189 354185 351990 350009 348450 347868 348765 350572 351951 352420 352783 353557
51308 353557 353940 353038 351292 349801 348801 347765 346652 346067 346268 346808 347200 347261 346753 345326 343003 340297
51292 340297 337730 335497 333526 331507 328940 325616 322136 319582 318663 319402 321511 324726 328820 333657 339196
51277 339196 345168 350987 356415 362043 368493 375215 380829 384699 387432 389615 390836 390442 388629 386186
51263 386186 383579 380953 378772 377669 377598 377642 376818 374803 371860 368466 365082 361922 358721 355004 350804
51248 350804 346883 344051 342386 341375 340653 340261 340214 340193 339908 339553 339621 340266 341098 341700 342210 343189 344904 346837
51230 346837 348024 347967 347165 346680 347086 347908 348188 347548 346489 345651 345082 344499 344074 344524 346261 348796 351214
$$ packed form
51338D08084r127p373n964m887l821l023k806k706k073j204r38j404j886j799
51324C59073j175l78Q3k31j183k004k195j981j559n82Q97J807J379M69L63P74
51308C53557L83r02j746j491j000j036j113n85K01N40L92O1n08j427k323k706
51292C40297k567k233j971k019k567l324l480k554r19P39K109L215M094M837N539
51277C39196N972N819N428N628O450O722N614L870K733K183J221l94j813k443
51263C86186k607k626k181j103p1M4q24k015k943l394l384l160l201l717m200
51248C50804l921k832j665j011p22l92m7k1k85l55O8O45Q32O02N10R79J715J933
51230C46837J187n7q02m85M06Q22K80o40j059q38n69n83m25M50J737K535K418
$$ plain form
51213 351214 353161 355025 357271 359946 362930 366277 369920 373213 375195 375498 374836 374455 375137 376698 378332
51198 378332 379400 380002 380775 382069 383424 384066 383841 383361 383164 383083 382628 381727 380788 380183 379933 379849 379807 379886 380371
51179 380371 381547 383434 385762 388247 390722 393006 394896 396376 397525 398090 397495 395516 392646 389513 386278
51164 386278 382879 379522 376522 374014 372211 371537 371908 372304 371831 370935 370662 370840 370020 367406 363859 360647
51148 360647 358125 356151 354913 354577 354755 355155 356342 358915 362173 364455 364916 364295 363852 364153 365037 366174
51132 366174 367232 367849 367797 367156 366158 364983 363850 363121 363126 363809 364729 365542 366491 368260 371230 375023 378966
51115 378966 382937 387397 392578 397913 402486 405806 407954 409222 409831 409888 409325 407947 405709 403054 400870
51100 400870 400046 400900 402878 404921 406368 407437 408613 409674 409820 408725 406977 405321 403984 402962 402434
$$ packed form
51213C51214J947J864K246K675K984L347L643L293J982L03o62l81O82J561J634
51198C78332J068O02P73J294J355O42k25m80j97q1m55r01r39o05k50q4m2P9M85
51179C80371J176J887K328K485K475K284J890J480J149N65n95j979k870l133l235
51164C86278l399l357l000k508j803o74L71L96m73q96k73J78q20k614l547l212
51148C60647k522j974j238l36J78M00J187K573L258K282M61o21m43L01Q84J137
51132C66174J058O17n2o41r98j175j133p29NO83R20Q13R49J769K970L793L943
51115C78966L971M460N181N335M573L320K148J268O09N7n63j378k238k655k184
51100D00870q24Q54J978K043J447J069J176J061J46j095j748j656j337j022n28
$$ plain form
51085 402434 402476 402833 403420 404679 406883 409399 411320 412661 414294 416670 419214 421067 421880 421699 420595 418804
51069 418804 417000 415966 415995 416808 418040 419651 421817 424560 427678 431088 435137 440473 447639 456853 467849
51054 467849 479514 489840 496930 500459 501930 503432 506521 512197 520941 532061 543605 553965 563473
51041 563473 573701 585280 597107 607687 616385 623156 627889 630655 632173 633295 633947 632851 628343
51028 628343 619477 606475 590307 571983 552376 532708 514722 499813 488098 478745 471158 465387
51016 465387 461473 459128 458282 459240 461875 465211 468399 471773 476286 482097 488354 494324 500120 506126 512330
51001 512330 518573 525053 532096 539565 546955 554044 561132 568531 576177 583901 591857 600455 610007 620640
50987 620640 632406 645218 658745 672618 686681 700806 714634 727924 741071 754594 767923
$$ packed form
51085D02434M2L57N87J259K204K516J921J341J633K376K544J853Q13j81j104j791
51069D18804j804j034K9Q13J232J611K166K743L118L410M049N336P166R214J0996
51054D67849J1665J0326P090L529J471J502L089N676Q744J1120J1544J0360R508
51041E63473J0228J1579J1827J0580Q698O771M733K766J518J122O52j096m508
51028F28343q866j3002j6168j8324j9607j9668j7986j4909j1715r353p587n771
51016D65387l914k345q46R58K635L336L188L374M513N811O257N970N796O006O204
51001E12330O243O480P043P469P390P089P088P399P646P724P956Q598R552J0633
50987F20640J1766J2812J3527J3873J4063J4125J3828J3290J3147J3523J3329
$$ plain form
50976 767923 779294 787229 791699 793382 792311 788030 780909 772479 764382 757576 752662 750377 751337 755719
50962 755719 763552 775041 790236 808564 829070 851078 874440 899138 924844 950908 976598 1001317
50950 1001317 1024716 1046652 1067058 1085796 1102710 1117957 1132386 1147434 1164325 1183291 1203802
50939 1203802 1225669 1249499 1275625 1302639 1327321 1346215 1357332 1360732 1357983 1351197 1342180 1331982
50927 1331982 1320850 1308367 1293728 1276294 1256156 1233946 1209958 1183776 1155069 1124331 1092388
50916 1092388 1059529 1025859 992300 960405 930960 903498 877444 853109 831145 811596 794051
50905 794051 778338 764455 752014 740350 729154 718479 708120 697539 686678 676443 668009 661673
50893 661673 656676 652099 647671 643610 640003 636698 633732 631441 629975 629029 628324 628083 628638 629724 630678
$$ packed form
50976G67923J1371P935M470J683j071m281p121q430q097o806m914k285R60M382
50962G55719P833J1489J5195J8328K0506K2008K3362K4698K5706K6064K5690K4719
50950A001317K3399K1936K0406J8738J6914J5247J4429J5048J6891J8966K0511
50939A203802K1867K3830K6126K7014K4682J8894J1117L400k749o786r017j0198
50927A331982j1132j2483j4639j7434k0138k2210k3988k6182k8707l0738l1943
50916A092388l2859l3670l3559l1895k9445k7462k6054k4335k1964j9549j7545
50905G94051j5713j3883j2441j1664j1196j0675j0359j0581j0861j0235q434o336
50893F61673m997m577m428m061l607l305k966k291j466r46p05k41N55J086R54
$$ plain form
50878 630678 631296 632086 633541 635549 637670 639666 641563 643562 646093 649693 654544 660333 666766 673967 682074
50863 682074 690762 699618 708945 719679 732379 746695 762066 778643 797087 817590 839559 862569
50851 862569 887299 915199 947261 983449 1023222 1066159 1111951 1160299 1211228 1265193 1322383
50840 1322383 1382085 1443137 1504794 1566577 1627413 1685590 1739767 1789439 1834199 1873114 1905326
50829 1905326 1930906 1950705 1965607 1976486 1984800 1992670 2002043 2013871 2028198 2044980 2064682 2088001
50817 2088001 2115092 2145144 2176631 2207647 2235739 2257920 2271546 2275396 2269539 2254067 2228395 2191999
50805 2191999 2145439 2090378 2028877 1962885 1894128 1824128 1754413 1686785 1623103 1564582 1511576
50794 1511576 1464292 1423331 1389223 1361695 1339901 1323242 1311572 1304692 1302121 1303341 1307792 1314447
$$ packed form
50878F30678O18P90J455K008K121J996J897J999K531L600M851N789O433P201Q107
50863F82074Q688Q856R327J0734J2700J4316J5371J6577J8444K0503K1969K3010
50851H62569K4730K7900L2062L6188L9773M2937M5792M8348N0929N3965N7190
50840A322383N9702O1052O1657O1783O0836N8177N4177M9672M4760L8915L2212
50829A905326K5580J9799J4902J0879Q314P870R373J1828J4327J6782J9702K3319
50817B088001K7091L0052L1487L1016K8092K2181J3626L850n857j5472k5672l6396
50805B191999m6560n5061o1501o5992o8757p0000o9715o7628o3682n8521n3006
50794A511576m7284m0961l4108k7528k1794j6659j1670o880k571J220M451O655
$$ plain form
50782 1314447 1321797 1328528 1334136 1338734 1342446 1345131 1346571 1346662 1345330 1342311 1337142 1329479 1319408 1307330
50768 1307330 1293378 1277034 1257458 1234258 1207864 1179197 1149063 1117924 1086152 1054286 1022976
50757 1022976 992788 964250 938049 914849 894747 877127 861380 847632 836444 827901 821416 816537
50745 816537 813549 813038 815093 819171 824674 831497 840062 850909 864225 879788 897376 917125 939364
50732 939364 964268 991970 1022799 1056939 1093827 1132295 1171428 1210945 1250718 1290344 1329332
50721 1329332 1367249 1403507 1437411 1468626 1497115 1522275 1542532 1556316 1563201 1563819 1559023 1549694
50709 1549694 1537242 1523758 1511505 1502313 1497188 1496226 1499017 1505403 1515708 1530057 1547772 1567733
50697 1567733 1589028 1610798 1631659 1649799 1663659 1672236 1674933 1671631 1662900 1649681 1632744 1612862
$$ packed form
50782A314447P350O731N608M598L712K685J440R1j332l019n169p663j0071j2078
50768A307330j3952j6344j9576k3200k6394k8667l0134l1139l1772l1866l1310
50757A022976l0188k8538k6201k3200k0102j7620j5747j3748j1188q543o485m879
50745H16537k988n11K055M078N503O823Q565J0847J3316J5563J7588J9749K2239
50732I39364K4904K7702L0829L4140L6888L8468L9133L9517L9773L9626L8988
50721A329332L7917L6258L3904L1215K8489K5160K0257J3784O885O18m796r329
50709A549694j2452j3484j2253r192n125r62K791O386J0305J4349J7715J9961
50697A567733K1295K1770K0861J8140J3860Q577K697l302q731j3219j6937j9882
$$ plain form
50685 1612862 1591521 1570938 1553006 1538365 1526592 1517046 1509433 1503811 1500355 1499229 1500719 1505503 1514608
50672 1514608 1528926 1548892 1574705 1606530 1644029 1685790 1729683 1773942 1817648 1860138 1900328
50661 1900328 1936916 1969168 1997394 2022688 2046262 2068865 2090622 2111208 2130006 2146205 2159131
50650 2159131 2168753 2175807 2181283 2185936 2190336 2195092 2200830 2208185 2218101 2231842 2250385 2273895 2302059
50637 2302059 2334635 2371299 2411104 2452528 2493993 2534008 2571052 2603953 2632558 2657683 2680256
50626 2680256 2700687 2718882 2734430 2746665 2754528 2755991 2747235 2723191 2680404 2620282 2549329 2475981
50614 2475981 2407136 2347060 2298079 2261278 2236662 2223200 2218888 2221004 2226758 2233934 2240556 2244069
50602 2244069 2241552 2231021 2211910 2183976 2146556 2099608 2044859 1984930 1921481 1855069 1786734
$$ packed form
50685A612862k1341k0583j7932j4641j1773r546p613n622l456j126J490M784R105
50672A514608J4318J9966K5813L1825L7499M1761M3893M4259M3706M2490M0190
50661A900328L6588L2252K8226K5294K3574K2603K1757K0586J8798J6199J2926
50650B159131R622P054N476M653M400M756N738P355R916J3741J8543K3510K8164
50637B302059L2576L6664L9805M1424M1465M0015L7044L2901K8605K5125K2573
50626B680256K0431J8195J5548J2235P863J463q756k4044m2787o0122p0953p3348
50614B475981o8845o0076m8981l6801k4616j3462m312K116N754P176O622L513
50602B244069k517j0531j9111k7934l7420m6948n4749n9929o3449o6412o8335
$$ plain form
50591 1786734 1718779 1653613 1592372 1534887 1480534 1428867 1380027 1335002 1295267 1261746 1234248
50580 1234248 1212074 1194883 1182587 1174696 1170335 1168934 1170472 1174894 1181686 1190216 1200137 1211104 1222325
50567 1222325 1232803 1242053 1250315 1258077 1265592 1272861 1279875 1286917 1294860 1305100 1318812 1336180 1356700
50554 1356700 1380352 1408052 1440780 1478715 1521485 1568748 1619841 1673108 1726257 1777544 1826273
50543 1826273 1872225 1915184 1955232 1993262 2030962 2070395 2113432 2161209 2213981 2271665 2334446
50532 2334446 2402622 2476056 2554305 2637375 2725932 2820729 2922227 3030860 3147031 3270422
50522 3270422 3399578 3532536 3667638 3803414 3937750 4067441 4188562 4297237 4390234 4464997
50512 4464997 4519175 4550376 4556818 4538273 4495982 4431566 4346468 4242687 4123568 3993526 3857383
$$ packed form
50591A786734o7955o5166o1241n7485n4353n1667m8840m5025l9735l3521k7498
50580A234248k2174j7191j2296p891m361j401J538M422O792Q530R921J0967J1221
50567A222325J0478R250Q262P762P515P269P014P042P943J0240J3712J7368K0520
50554A356700K3652K7700L2728L7935M2770M7263N1093N3267N3149N1287M8729
50543A826273M5952M2959M0048L8030L7700L9433M3037M7777N2772N7684O2781
50532B334446O8176P3434P8249Q3070Q8557R4797J01498J08633J16171J23391
50522C270422J29156J32958J35102J35776J34336J29691J21121J08675R2997P4763
50512D464997N4178L1201O442j8545m2291o4416q5098j03781j19119j30042j36143
$$ plain form
50501 3857383 3720265 3587589 3464330 3354233 3260061 3184305 3128957 3094595 3080244 3084277 3104905
50490 3104905 3139525 3183900 3232240 3277909 3314055 3334286 3333654 3309518 3261666 3191813 3103066 2999479
50478 2999479 2885556 2765731 2643971 2523436 2406129 2292866 2183843 2079368 1979963 1885918
50468 1885918 1797173 1713883 1636813 1566720 1503396 1445686 1392575 1343867 1299759 1260201 1225056
50457 1225056 1194462 1168434 1146250 1126762 1109385 1094315 1081780 1071585 1063559 1057804 1054068 1051343
50445 1051343 1048589 1045748 1043651 1043027 1043998 1046409 1050187 1055268 1061480 1068577 1076181 1083766 1091059 1098582
50431 1098582 1107497 1118738 1132467 1148467 1166690 1187182 1209738 1234103 1260386 1288811 1318971
50420 1318971 1349807 1380638 1411989 1445131 1481104 1520513 1563966 1612021 1664715 1721782 1783564
$$ packed form
50501C857383j37118j32676j23259j10097r4172p5756n5348l4362j4351M033K0628
50490C104905L4620M4375M8340M5669L6146K0231o32k4136m7852o9853q8747j03587
50478B999479j13923j19825j21760j20535j17307j13263j09023j04475r9405r4045
50468A885918q8745q3290p7070p0093o3324n7710n3111m8708m4108l9558l5145
50457A225056l0594k6028k2184j9488j7377j5070j2535j0195q026n755l736k725
50445A051343k754k841k097o24R71K411L778N081O212P097P604P585P293P523
50431A098582Q915J1241J3729J6000J8223K0492K2556K4365K6283K8425L0160
50420A318971L0836L0831L1351L3142L5973L9409M3453M8055N2694N7067O1782
$$ plain form
50409 1783564 1851092 1924752 2003225 2084266 2166222 2248299 2329621 2408774 2484284 2554883 2619130
50398 2619130 2675301 2721880 2757694 2781250 2790417 2783232 2758979 2718298 2662587 2593666 2513943 2426566
50386 2426566 2335325 2244299 2157231 2076849 2004709 1941715 1888710 1846552 1815872 1796848 1789000
50375 1789000 1790982 1800676 1815577 1833062 1850426 1865042 1874609 1877053 1870279 1852635 1823933 1785641
50363 1785641 1739704 1687493 1630153 1569515 1508024 1447821 1390180 1335632 1284179 1235588 1189994
50352 1189994 1148172 1110789 1077412 1046709 1017659 990113 964188 939691 916454 894843 875529
50341 875529 858904 844906 833181 823178 814206 805706 797559 790045 783477 777857 772788 767665 762039
50328 762039 755926 749812 744386 740277 737811 736747 736266 735511 734348 733484 733749 735376 738104 741823 746855
$$ packed form
50409A783564O7528P3660P8473Q1041Q1956Q2077Q1322P9153P5510P0599O4247
50398B619130N6171M6579L5814K3556R167p185k4253m0681n5711o8921p9723q7377
50386B426566r1241r1026q7068q0382p2140o2994n3005m2158l0680j9024p848
50375A789000J982R694J4901J7485J7364J4616R567K444o774j7644k8702l8292
50363A785641m5937n2211n7340o0638o1491o0203n7641n4548n1453m8591m5594
50352A189994m1822l7383l3377l0703k9050k7546k5925k4497k3237k1611j9314
50341H75529j6625j3998j1725j0003q972q500q147p514o568n620n069n123n626
50328G62039o113o114n426m109k466j064m81p55j163q64K65J627K728L719N032
$$ plain form
50313 746855 753613 762091 771805 782143 792794 803988 816460 831105 848429 868209 889659 911910
50301 911910 934137 955188 973383 987009 995089 997595 995107 988571 979315 968870 958500 948984 940759
50288 940759 933957 928233 922922 917637 912565 908145 904814 903191 904023 907545 913263 920796 930535 942738
50274 942738 955917 966820 972377 971555 965443 956152 945888 936494 929008 923388 918856 914661 910486 906185
50260 906185 901469 896129 890572 885880 883071 882311 883001 884551 886803 889645 892576 894981 896654 897805 898619
50245 898619 899062 899055 898616 897792 896675 895508 894536 893733 892776 891397 889727 888322 887847 888554 889946 891067 891344
50228 891344 891137 891339 892484 894428 896818 899681 903526 908977 916373 925726 937194 951528 969727 991999
50214 991999 1017307 1044192 1071891 1100369 1129479 1158467 1186209 1211577 1233728 1252570 1269045
$$ packed form
50313G46855O758Q478R714J0338J0651J1194J2472J4645J7324J9780K1450K2251
50301I11910K2227K1051J8195J3626Q080K506k488o536r256j0445j0370r516q225
50288I40759o802n724n311n285n072m420l331j623Q32L522N718P533R739J2203
50274I42738J3179J0903N557q22o112r291j0264r394p486n620m532m195m175m301
50260I06185m716n340n557m692k809p60O90J550K252K842K931K405J673J151Q14
50245H98619M43pm39q24j117j167r72q03r57j379j670j405m75P07J392J121K77
50228H91344k07K02J145J944K390K863L845N451P396R353J1468J4334J8199K2272
50214I91999K5308K6885K7699K8478K9110K8988K7742K5368K2151J8842J6475
$$ plain form
50203 1269045 1284591 1300155 1315886 1331440 1345865 1357104 1362421 1359976 1349725 1332425 1308234 1276908
50191 1276908 1239247 1197586 1154636 1112312 1071924 1035054 1003550 978475 959332 944533 932653
50180 932653 923064 915418 908687 900937 890106 875078 856179 834893 813172 792775 774826 759655
50168 759655 746869 735697 725544 716452 709073 704025 701218 699794 698824 698048 697910 698868 700859 703626
50154 703626 707477 713226 721089 729972 738411 746144 754176 763137 772076 779189 783352 784672 783916 781896
50140 781896 779210 776083 772361 767952 763210 758786 755260 753087 752591 753713 755977 759049 763046 767918
50126 767918 772838 776727 779266 780891 781988 782685 783384 784812 787453 791380 796610 803045 810100 817144 824508
50111 824508 833396 844559 857685 872372 888962 907924 929038 951945 977118 1005648 1038300 1075380
$$ packed form
50203A269045J5546J5564J5731J5554J4425J1239N317k445j0251j7300k4191l1326
50191A276908l7661m1661m2950m2324m0388l6870l1504k5075j9143j4799j1880
50180I32653r589p646o731p750j0831j5028j8899k1286k1721k0397j7949j5171
50168G59655j2786j1172j0153r092p379n048k807j424r70p76j38R58J991K767
50154G03626L851N749P863Q883Q439P733Q032Q961Q939P113M163J320p56k020
50140G81896k686l127l722m409m742m424l526k173m96J122K264L072L997M872
50126G67918M920L889K539J625J097O97O99J428K641L927N230O435P055P044P364
50111H24508Q888J1163J3126J4687J6590J8962K1114K2907K5173K8530L2652L7080
$$ plain form
50099 1075380 1117368 1164992 1218516 1277208 1339503 1403399 1466935 1528744 1588229 1645006 1698477
50088 1698477 1748354 1795437 1841226 1886611 1931287 1974305 2014419 2049515 2076235 2090927 2091156 2076259
50076 2076259 2046824 2004179 1950428 1888397 1821017 1750659 1679079 1607810 1538326 1471860 1409384
50065 1409384 1351802 1299896 1253914 1213434 1177837 1146659 1119263 1094481 1071084 1048538 1026902
50054 1026902 1006152 986127 967076 949580 933755 919144 905628 893820 884133 876010 868643 862089
50042 862089 857043 853820 852215 852213 853979 857051 860199 862501 864216 866341 869639 874303 880260 887302 894904
50027 894904 902250 908694 914220 919344 924427 929087 932427 933863 933537 931866 928976 924802 919536 913632
50013 913632 907400 900820 893653 885580 876340 866044 855290 844687 834352 824068 813802 803719
$$ packed form
50099A075380M1988M7624N3524N8692O2295O3896O3536O1809N9485N6777N3471
50088A698477M9877M7083M5789M5385M4676M3018M0114L5096K6720J4692K29j4897
50076B076259k9435m2645n3751o2031o7380p0358p1580p1269o9484o6466o2476
50065A409384n7582n1906m5982m0480l5597l1178k7396k4782k3397k2546k1636
50054A026902k0750k0025j9051j7496j5825j4611j3516j1808r687q123p367o554
50042H62089n046l223j605kJ766L072L148K302J715K125L298M664N957P042P602
50027H94904P346O444N526N124N083M660L340J436l26j671k890m174n266n904
50013I13632o232o580p167q073r240j0296j0754j0603j0335j0284j0266j0083
$$ plain form
50001 803719 793861 784385 776210 770886 769516 772079 777975 786885 798797 813458 830104 847630 864783
49988 864783 880431 894107 906397 918574 931779 946589 963194 981607 1001616 1022839 1045152
49977 1045152 1068932 1094581 1121754 1149317 1176187 1201989 1226649 1249578 1269823 1287213 1302929
49966 1302929 1318597 1334985 1351844 1368627 1384713 1398875 1409089 1413120 1409022 1395157 1370472 1335470
49954 1335470 1292719 1245913 1198237 1151765 1108059 1068744 1035183 1007863 986341 969779 957436
49943 957436 948651 942481 937502 932214 925807 918470 910753 902696 893768 883589 872326 860184 846737
49930 846737 831118 812879 792472 770876 748963 727313 706445 686992 669560 654512 641904
49919 641904 631629 623610 617882 614450 613022 612894 613229 613540 613899 614583 615606 616724 617916 619677 622709
$$ packed form
50001H03719r858r476q175n324j370K563N896Q910J1912J4661J6646J7526J7153
49988H64783J5648J3676J2290J2177J3205J4810J6605J8413K0009K1223K2313
49977A045152K3780K5649K7173K7563K6870K5802K4660K2929K0245J7390J5716
49966A302929J5668J6388J6859J6783J6086J4162J0214M031m098j3865k4685l5002
49954A335470m2751m6806m7676m6472m3706l9315l3561k7320k1522j6562j2343
49943I57436q785o170m979n288o407p337p717q057q928j0179j1263j2142j3447
49930H46737j5619j8239k0407k1596k1913k1650k0868j9453j7432j5048j2608
49919F41904j0275q019n728l432j428j28L35L11L59O84J023J118J192J761L032
$$ plain form
49904 622709 627398 633686 641269 649724 658528 667391 676786 687908 701714 717916 735045 751462 766232
49891 766232 779089 789844 797987 802834 804092 802271 798420 793218 786376 777104 765156 751115 735731
49878 735731 719419 702563 685822 669730 654263 639257 625071 612383 601380 591646 582863 575172
49866 575172 568716 563304 558771 555321 553189 552249 552267 553330 555677 559277 564018 570233 578574 589223 601523
49851 601523 614573 628017 642109 657141 672958 688842 703688 716402 726334 733411 737865 739986
49839 739986 740264 739426 737888 735091 729853 721616 711162 699880 688611 677477 666546 656182 646782
49826 646782 638665 632217 627686 624706 622466 620610 619642 620231 622482 626126 631102 637593 645730 655564 667077
49811 667077 679924 693418 707031 720568 733521 744717 753195 759150 763547 767117 770275 773451 776470
$$ packed form
49904F22709M689O288P583Q455Q804Q863R395J1122J3806J6202J7129J6417J4770
49891G66232J2857J0755Q143M847J258j821l851n202o842r272j1948j4041j5384
49878G35731j6312j6856j6741j6092j5467j5006j4186j2688j1003r734q783p691
49866E75172o456n412m533l450k132r40J8J063K347L600M741O215Q341J0649J2300
49851F01523J3050J3444J4092J5032J5817J5884J4846J2714R932P077M454K121
49839G39986K78q38j538k797n238q237j0454j1282j1269j1134j0931j0364r400
49826F46782q117o448m531k980k240j856r68N89K251L644M976O491Q137R834J1513
49811F67077J2847J3494J3613J3537J2953J1196Q478N955M397L570L158L176L019
$$ plain form
49798 776470 777763 775356 768894 759819 749420 737720 724621 711020 698012 685717 673695 662009
$$ packed form
49798G76470J293k407o462r075j0399j1700j3099j3601j3008j2295j2022j1686
$$ [...]
##END NTUPLES=NMR SPECTRUM
##END=
