
##TITLE=UV1213_M4_1332-1205_7185334_0YXdvWmy2V
##JCAMPDX= 6.0         $$ Bruker NMR JCAMP-DX V2.0
##DATA TYPE= NMR SPECTRUM
##DATA CLASS= NTUPLES
##ORIGIN= BRUKER
##OWNER= Administrator
$$ 1.72 TOPSPIN		Version 2.1
$$ 2012-12-06 00:32:36.158 -0500  Administrator@X
$$ Compression mode = diff/dup
##.OBSERVE FREQUENCY= 400.02188249412
##.OBSERVE NUCLEUS= ^1H
##.ACQUISITION MODE= SIMULTANEOUS (DQD)
##.ACQUISITION SCHEME= undefined
##.AVERAGES= 8
##.DIGITISER RES= 22
##SPECTROMETER/DATA SYSTEM= spect
##.PULSE SEQUENCE= zg30
##.SOLVENT NAME= COFFEE_meoh
##.SHIFT REFERENCE= INTERNAL, COFFEE_meoh, 1, 14.98509
##AUDIT TRAIL= $$ (NUMBER, WHEN, WHO, WHERE, PROCESS, VERSION, WHAT)
$$ ##TITLE= Audit trail, TOPSPIN		Version 2.1
$$ ##JCAMPDX= 5.01
$$ ##ORIGIN= Bruker BioSpin GmbH
$$ ##OWNER= Administrator
$$ $$ E:\/data/COFFEE/nmr/UV1213_M4_1332-1205_7185334_0YXdvWmy2V/10/pdata/1/auditp.txt
$$ ##AUDIT TRAIL=  $$ (NUMBER, WHEN, WHO, WHERE, PROCESS, VERSION, WHAT)
(   1,<2012-12-06 00:32:27.908 -0500>,<Administrator>,<X>,<go>,<TOPSPIN 2.1>,
      <created by zg
	started at 2012-12-06 00:31:21.892 -0500,
	POWCHK enabled, PULCHK disabled,
       configuration hash MD5:
       86 BA 57 50 F2 9D 5C 9B 26 00 A9 28 5F 66 2E 89
       data hash MD5: 64K
       50 E3 6F F0 8E 7D E4 1B 85 41 3D 95 15 07 24 B6>)
(   2,<2012-12-06 00:32:31.001 -0500>,<Administrator>,<X>,<proc1d>,<TOPSPIN 2.1>,
      <Start of raw data processing
       efp LB = 0 FT_mod = 6 PKNL = 1 PHC0 = 0 PHC1 = 0 SI = 32K 
       data hash MD5: 32K
       9D 98 79 1C F9 69 38 A3 72 BA C3 7C FF 9A F8 77>)
(   3,<2012-12-06 00:32:31.486 -0500>,<Administrator>,<X>,<proc1d>,<TOPSPIN 2.1>,
      <pk PHC0 = 98.8385 PHC1 = 0 
       data hash MD5: 32K
       53 FB 19 CE 5C 47 E9 41 8D E8 3C 5F 34 7B 43 4D>)
(   4,<2012-12-06 00:32:31.720 -0500>,<Administrator>,<X>,<proc1d>,<TOPSPIN 2.1>,
      <abs ABSG = 1 
       data hash MD5: 32K
       47 BF 8B 42 21 2E 99 F5 E3 80 EA A6 E1 38 FE 9F>)
(   5,<2012-12-06 00:32:31.876 -0500>,<Administrator>,<X>,<proc1d>,<TOPSPIN 2.1>,
      <abs ABSG = 2 
       data hash MD5: 32K
       9F CD B1 82 12 9C 5C 0D C6 E4 7A 4D 6D EC 04 C3>)
(   6,<2012-12-06 00:32:32.033 -0500>,<Administrator>,<X>,<proc1d>,<TOPSPIN 2.1>,
      <abs ABSG = 3 
       data hash MD5: 32K
       18 55 56 0B 0A 7F 52 1E 09 4B 12 FA DF 2A 1A 2D>)
(   7,<2012-12-06 00:32:32.173 -0500>,<Administrator>,<X>,<proc1d>,<TOPSPIN 2.1>,
      <abs ABSG = 4 
       data hash MD5: 32K
       4E 78 3E 7F 65 9E 6E 38 94 C0 43 92 79 BA 40 5F>)
(   8,<2012-12-06 00:32:32.345 -0500>,<Administrator>,<X>,<proc1d>,<TOPSPIN 2.1>,
      <abs ABSG = 5 
       data hash MD5: 32K
       F0 58 83 8E 3B D8 D0 32 DC 32 21 D9 B1 31 6C DD>)
$$ ##END=
$$ 
$$ $$ hash MD5
$$ $$ EC 09 7C DD 25 17 7E 4F 6B 62 E3 14 E3 56 FF 6F
##$RELAX= 
##$RELAX= 
##$RELAX= 
##$RELAX= 
##$RELAX= 
##$RELAX= 
##$RELAX= 
$$ Bruker specific parameters
$$ --------------------------
##$DU= <E:\>
##$EXPNO= 10
$$ [...]
##$TP= (0..7)
150 150 150 150 150 150 150 150
##$TP07= 0
##$TPNAME0= <>
##$TPNAME1= <>
##$TPNAME2= <>
##$TPNAME3= <>
##$TPNAME4= <>
##$TPNAME5= <>
##$TPNAME6= <>
##$TPNAME7= <>
##$TPOAL= (0..7)
0.5 0.5 0.5 0.5 0.5 0.5 0.5 0.5
##$TPOFFS= (0..7)
0 0 0 0 0 0 0 0
##$TUNHIN= 0
##$TUNHOUT= 0
##$TUNXOUT= 0
##$USERA1= <user>
##$USERA2= <user>
##$USERA3= <user>
##$USERA4= <user>
##$USERA5= <user>
##$V9= 5
##$VALIST= <valist>
##$VCLIST= <CCCCCCCCCCCCCCC>
##$VD= 0
##$VDLIST= <DDDDDDDDDDDDDDD>
##$VPLIST= <PPPPPPPPPPPPPPP>
##$VTLIST= <TTTTTTTTTTTTTTT>
##$WBST= 1024
##$WBSW= 4
##$XGAIN= (0..3)
0 0 0 0
##$XL= 0
##$YL= 0
##$YMAX_a= 642192
##$YMIN_a= -547968
##$ZGOPTNS= <>
##$ZL1= 120
##$ZL2= 120
##$ZL3= 120
##$ZL4= 120
##$ABSF1= 14.98509
##$ABSF2= -5.573092
##$ABSG= 5
##$ABSL= 3
##$ALPHA= 0
##$AQORDER= 0
##$ASSFAC= 0
##$ASSFACI= 0
##$ASSFACX= 0
##$ASSWID= 0
##$AUNMP= <proc_prof1d_extract_pilot.lims>
##$AXLEFT= 0
##$AXNAME= <>
##$AXNUC= <1H>
##$AXRIGHT= 0
##$AXTYPE= 0
##$AXUNIT= <>
##$AZFE= 0.1
##$AZFW= 0.1
##$BCFW= 0
##$BC_mod= 0
##$BYTORDP= 0
##$COROFFS= 0
##$CY= 15
##$DATMOD= 1
##$DC= 0
##$DFILT= <>
##$DTYPP= 0
##$F1P= 0
##$F2P= 0
##$FCOR= 0.5
##$FTSIZE= 32768
##$FT_mod= 6
##$GAMMA= 0
##$GB= 0
##$INTBC= 1
##$INTSCL= 1
##$ISEN= 128
##$LB= 0
##$LEV0= 0
##$LPBIN= 0
##$MAXI= 10000
##$MC2= 0
##$MEAN= 0
##$ME_mod= 0
##$MI= 0
##$NCOEF= 0
##$NC_proc= -8
##$NLEV= 6
##$NOISF1= 0
##$NOISF2= 0
##$NSP= 0
##$NTH_PI= 0
##$NZP= 0
##$OFFSET= 14.98509
##$PC= 1
##$PHC0= 98.8385
##$PHC1= 0
##$PH_mod= 1
##$PKNL= yes
##$PPARMOD= 0
##$PPDIAG= 0
##$PPIPTYP= 0
##$PPMPNUM= 2147483647
##$PPRESOL= 1
##$PSCAL= 4
##$PSIGN= 0
##$PYNMP= <proc.py>
##$REVERSE= no
##$SF= 400.02
##$SI= 32768
##$SIGF1= 0
##$SIGF2= 0
##$SINO= 400
##$SIOLD= 32768
##$SPECTYP= <>
##$SREGLST= <1H.CDCl3>
##$SSB= 0
##$STSI= 32768
##$STSR= 0
##$SW_p= 8223.68421052631
##$SYMM= 0
##$S_DEV= 0
##$TDeff= 65536
##$TDoff= 0
##$TI= <>
##$TILT= no
##$TM1= 0
##$TM2= 0
##$TOPLEV= 0
##$USERP1= <user>
##$USERP2= <user>
##$USERP3= <user>
##$USERP4= <user>
##$USERP5= <user>
##$WDW= 1
##$XDIM= 32768
##$YMAX_p= 478150747
##$YMIN_p= -692508
##$CURPLOT= <Network HP LaserJet P1505>
##$CURPRIN= <$Network HP LaserJet P1505>
##$DFORMAT= <normdp>
##$LAYOUT= <+/1D_H.xwp>
##$LFORMAT= <normlp>
##$PFORMAT= <normpl>
##$SURQMSG= 1
$$ End of Bruker specific parameters
$$ ---------------------------------
##NTUPLES= NMR SPECTRUM
##VAR_NAME=  FREQUENCY,     SPECTRUM/REAL,   SPECTRUM/IMAG
##SYMBOL=    X,             R,               I
##VAR_TYPE=  INDEPENDENT,   DEPENDENT,       DEPENDENT
##VAR_FORM=  AFFN,          ASDF,            ASDF
##VAR_DIM=   32768,         32768,           32768
##UNITS=     HZ,            ARBITRARY UNITS, ARBITRARY UNITS
##FACTOR=    0.250966925370066, 1,           1
##FIRST=     8223.43324360094, -115981,      -27094
##LAST=      0,             111990,          -99582
##MIN=       0,             -692508,         0
##MAX=       8223.43324360094, 478150747,    0
$$ Real data points
##PAGE= N=1
##DATA TABLE= (X++(R..R)), XYDATA
$$ [...]
$$ plain form
19553 103490 -204894 -84001 -197405 49965 192690 13478 -129410 -55614 -286234 -373609
19543 -373609 -217915 71586 -198340 -121731 39311 -139907 3334 209898 -216737 -281765 -61146
19531 -17719 96412 -63069 -403525 201169 24681 -193722 -114245 -170596 32108 -307081 -117069
19519 -132710 107211 -125114 -281014 -147126 -142202 96530 -94482 111082 205648 -403106
19508 -459668 -134022 -1493 -119119 -8088 -86596 -198655 255238 -526614 144050 -77622 32601
19496 -36842 246331 -146958 -35440 -156494 -217753 160576 45903 -222128 130040 -284352
19485 118920 193846 -117234 -128218 317946 206932 -316099 -50950 14557 -43397 32346 -177422
19473 -8436 140217 -153124 -54739 -198156 55090 -284687 -54833 -151452 -355796 -63367 -13193
$$ packed form
19553A03490b04894h4001j13404D9965J42725A3478a29410e5614k30620q7375
19543c73609J55694G1586a98340P6609C9311a39907C334K06564b16737o5028f1146
19531a7719I6412f3069l40456B01169B4681a93722P9477n6351C2108c07081a17069
19519a32710A07211a25114j55900J33888M924I6530i4482A11082R4566d03106
19508d59668a34022a493j17626h088p8508j12059B55238e26614A44050g7622C2601
19496c6842B46331a46958c5440j21054o1259A60576D5903b22128A30040b84352
19485A18920P4926a17234j0984C17946j11014c16099e0950A4557d3397C2346a77422
19473h436A40217a53124e4739j43417E5090b84687e4833r6619k04344f3367a3193
$$ plain form
19461 60533 187272 -61116 -107543 -203787 -32373 -182497 -1786 -39466 -8567 -180048 -119165
19450 -119165 96932 -172860 -215349 264803 242063 206260 -228608 34675 83051 38404 -93465
19438 -68267 -13569 235045 -65050 -354905 -167932 147516 -222093 14199 -80835 140203
19427 -157481 64754 115804 94731 28046 -57660 -83193 -209696 -66211 -65454 81338 231161
19416 231161 -27665 186922 -258524 -91460 40771 86624 -62428 8057 -24533 -291591 -178826
19405 -178826 85368 -207899 -333073 -307408 -211552 117270 71226 -7739 -173605 -62948 54669
19393 -107184 -324993 -145234 -260846 -70960 -461503 -119544 166866 -74727 35146 66564
19383 66564 -63832 -114026 -23654 36547 -257145 -326568 -195949 -261824 113812 -97224 35570
$$ packed form
19461F0533J26739f1116m6427r6244c2373j50124a786l7680h567j71481O0883
19450a19165I6932a72860m2489B64803k2740l5803b28608C4675M8376C8404i3465
19438f8267a3569B35045f5050k89855a67932A47516b22093A4199h0835A40203
19427a57481F4754N1050k1073B8046e7660k5533j26503f6211P57H1338J49823
19416B31161b7665A86922b58524i1460D0771M5853f2428H057b4533k67058J12765
19405a78826H5368b07899j25174K5665R5856A17270m6044g739j65866f2948E4669
19393a07184k17809a45234j15612g0960l90543a19544A66866g4727C5146L1418
19383F6564f3832n0194b3654C6547b57145o9423J30619o5875A13812i7224C5570
$$ plain form
19371 -110780 109439 -204855 50090 267639 -140379 -269874 -269701 128768 -103154 -7474 -237360
19360 -237360 76194 -117098 115356 -26980 58048 -260333 362868 -340265 278960 -69582
19349 -113877 -9744 -95464 48759 86986 -399224 75255 -80158 -119737 -118729 65746 -275803
19337 -5762 12978 45630 -229707 -23521 -38304 -391 216141 -43016 -161835 -59908 -5943 -255014
19325 -255014 -330199 248878 -356881 -264828 -47947 -106378 -70310 -48316 -140705 8380 -48955
19313 23681 19637 -87 -59274 -30235 -15949 -49013 20760 -71662 33246 84485 -224032 -165720
19301 -165720 -255101 -20249 -36503 343167 -376637 -179113 174142 -83684 -173191 25407 -222414
19289 -307 -274541 -107662 -227147 40467 121667 321775 -49750 -219602 190807 2497 161194
$$ packed form
19371a10780A09439b04855E0090K17549a40379j29495J73A28768a03154g474k29886
19360b37360G6194a17098A15356b6980E8048b60333C62868c40265B78960f9582
19349a13877i744q5720D8759L8227c99224G5255h0158l9579J008F5746b75803
19337e762A2978L2652b29707b3521j4783c91B16141d3016j18819e9908e943k49071
19325b55014p5185B48878c56881R2053d7947n8431L6068K1994r2389H380d8955
19313B3681m044h7n9187K9039J4286l3064B0760g1662C3246N1239b24032N8312
19301a65720q9381b0249j6254C43167c76637a79113A74142h3684q9507B5407b22414
19289c07k74234a07662j19485D0467Q1200K00108d9750j69852A90807B497J58697
$$ plain form
19278 161194 42847 -269279 135825 2353 -582638 6582 -182557 -57700 33698 70689 -175419
19266 16151 184316 213293 -56004 27206 -108828 21556 -233795 117554 -68316 73878 -141533
19254 -99119 -69859 -374414 -41773 53487 -705 132804 -39163 -155938 -123145 -144921 -252239
19243 -252239 48078 4246 46609 42454 -22341 322934 -337507 182544 73459 -302184 -60222
19231 -106200 -52047 241736 190776 -215530 -354360 -155591 -95048 -11286 -260447 76437
19220 87972 -159916 -82136 373386 158537 -67683 -318151 -30043 -27086 -210428 -50194 32477
19208 -69369 -238600 -271079 159498 -12603 50132 -57143 -234259 -23301 -311142 157274 -121365
19196 46861 318334 -171278 -184111 -208037 -22205 208007 -25699 167034 251357 31904 -123311
$$ packed form
19278A61194D2847b69279A35825B353e82638F582a82557e7700C3698L6991a75419
19266A6151J68165K8977e6004B7206a08828B1556b33795A17554f8316G3878a41533
19254i9119K9260l04555d1773E3487g05A32804c9163j16775L2793k1776j07318
19243b52239D8078D246M2363m155b2341C22934c37507A82544G3459c02184f0222
19231a06200e2047B41736n0960b15530j38830a55591O0543a1286k49161G6437
19220H7972a59916P7780C73386A58537f7683k50468c0043K957j83342e0194C2477
19208f9369j69231l2479A59498a2603E0132e7143j77116b3301k87841A57274a21365
19196D6861K71473a71278j2833k3926b2205B08007b5699A67034Q4323C1904a23311
$$ plain form
19184 -186737 52498 -153660 -249450 -306099 -220945 219852 -13603 -87562 -52572 -15261 98202
19172 -443887 217181 -33817 -178255 64901 -237634 160982 90495 35170 -209346 -81435
19161 53443 -110030 75998 164546 -173001 -149388 26212 -51864 29906 82963 -62011 -129566
19150 -129566 244623 105244 -273114 -98706 -131673 -190715 -206110 -233189 -238118 -80132 -98519
19139 -98519 170826 -356433 88402 -179356 40381 40611 24252 192469 -82738 -130055 -104189
19128 -104189 132148 -85161 148673 -107577 -188248 61193 -56100 -35165 -17143 -172529 9290
19116 -185297 -61174 -172912 39041 -20459 -98018 -133980 -143894 26356 -324692 31158 -129822
19104 31413 124036 -57759 122493 -99720 -23858 -265293 -451663 -117873 403 -89505 -36977
$$ packed form
19184a86737E2498a53660r5790n6649Q5154B19852a3603p3959L4990a5261I8202
19172d43887B17181c3817j44438F4901b37634A60982p0487C5170b09346h1435
19161E3443a10030G5998Q8548a73001K3613B6212e1864B9906N3057f2011o7555
19150a29566B44623A05244b73114i8706l2967n9042j5395k7079m929h0132j8387
19139i8519A70826c56433H8402a79356D0381K30j6359J68217h2738m7317K5866
19128a04189A32148h5161A48673a07577q0671F1193e6100K0935a7143j55386I290
19116a85297f1174j11738C9041b0459p7559l5962r914B6356c24692C1158a29822
19104C1413R2623e7759A22493i9720b3858k41435j86370a17873D03h9505c6977
$$ plain form
19092 124578 -87021 -56202 -120732 -392741 -115661 103325 132175 -452622 -85433 -100916 202157
19080 -91607 -231552 -140224 -327876 -222248 -44513 191929 -2048 117545 -178494 97403 -392138
19068 -205837 -320552 48846 363239 166124 -157357 -28275 -47330 -80855 174696 -69630
19057 223257 90266 225481 181462 -32083 307721 -307754 94433 9355 -227496 322738 -277999
19045 -251280 -60489 -43288 -141558 -48802 -67189 -177404 336604 -141329 223212 27682 -115312
19033 -33589 33640 -108266 -235234 268196 -245594 -26179 56444 -172981 144871 -57668
19022 94799 68763 11985 -141527 -139121 -154020 236337 -104030 223614 -46844 202575 29732
19010 176092 -82195 -437293 -158840 -121658 -42214 -282819 120825 98699 -46791 -145237 -73351
$$ packed form
19092A24578h7021L0819o4530k72009a15661A03325K8850d52622h5433j5483B02157
19080i1607j39945R1328j87652J05628d4513A91929b048A17545a78494I7403c92138
19068b05837j14715D8846L14393A66124a57357b8275j9055l3525A74696f9630
19057B23257I0266J35215m4019c2083C07721c07754I4433I355b27496C22738b77999
19045b51280f0489J7201r8270d8802j8387j10215C36604a41329B23212B7682a15312
19033c3589C3640a08266j26968B68196b45594b6179E6444a72981A44871e7668
19022I4799k6036A1985a41527K406j4899B36337a04030B23614d6844B02575B9732
19010A76092h2195l55098a58840L7182d2214k40605A20825k2126d6791r8446P1886
$$ plain form
18999 -73351 98934 97176 448039 102689 -432046 -363873 -44190 248259 20570 -64058 71852
18987 -9842 18981 -81359 75252 -205492 44673 -115457 -191994 -29609 -254183 139669 38089
18975 -48674 -345085 -484475 -303528 -142257 -101822 469180 210155 82169 148049 177632
18965 177632 82454 -131120 -136912 -84168 185462 189040 -100971 -248395 41379 -39818 -130767
18954 -130767 -17053 -241699 79554 -40480 -368469 80342 -369863 -334785 -372391 249115 -47336
18942 150912 -158185 -129495 -307814 152347 -83292 -299676 -71491 -177097 51375 -94099
18931 -103351 205063 -221693 -334330 335017 56188 -361764 317152 43833 -9830 -321503
18921 -321503 -249721 202714 -4262 -211176 -49193 56635 29467 -42604 -46668 -131318 -27664
$$ packed form
18999g3351I8934j758L50863A02689d32046O8173d4190B48259B0570f4058G1852
18987i842A8981h1359G5252b05492D4673a15457p6537b9609k24574A39669C8089
18975d8674k96411j39390J80947a42257M0435D69180B10155H2169O5880K9583
18965A77632H2454a31120n792N2744A85462L578a00971j47424D1379c9818r0949
18954a30767a7053k24646G9554d0480l27989H0342c69863L5078l7606B49115d7336
18942A50912a58185K8690j78319A52347h3292k16384g1491j05606E1375i4099
18931a03351B05063b21693j12637C35017E6188c61764C17152D3833i830l11673
18921c21503P1782B02714d262k06914d9193E6635k7168d2604m064q4650b7664
$$ plain form
18909 330324 -223371 -132983 -439817 -386222 147555 -246239 -227166 -110533 -12072 -124904
18899 -124904 -107280 -179756 -63162 121241 75830 -224913 142927 73091 -241139 -174261 -145306
18888 -145306 -155448 -37370 -118649 -159872 -184463 186424 -204254 95076 119802 -166708 -101840
18877 -101840 -19197 221264 -148183 -425872 73702 -118022 -86519 -297054 -257841 76631
18866 30192 -186074 -278915 -104853 249462 -233339 317344 -21210 -159212 -35189 -18248
18856 -18248 -17873 -13192 70455 -142712 -104686 108563 -38564 -22484 44270 -313475 183100
18844 76471 32470 -105247 -232681 -411721 -36963 -25213 -91849 15102 -329997 106747 -150085
18832 57994 152409 -157644 13207 -90173 136266 -204647 173597 146571 -166338 -221762 -27059
$$ packed form
18909C30324b23371R0388l06834N3595A47555b46239J9073a10533a2072j12832
18899a24904J7624p2476f3162A21241m5411b24913A42927o9836b41139O6878K8955
18888a45306j0142c7370q1279m1223k4591A86424b04254I5076K4726a66708O4868
18877a01840a9197B21264a48183k77689G3702a18022L1503k10535L9213G6631
18866C0192a86074r2841a04853B49462b33339C17344b1210j38002c5189J6941
18856a8248L75M681G0455a42712L8026A08563c8564J6080D4270c13475A83100
18844G6471C2470a05247j27434j79040c6963J1750o6636A5102c29997A06747a50085
18832E7994R4415a57644A3207i0173A36266b04647A73597k7026a66338n5424b7059
$$ plain form
18820 127237 -145410 -481271 49213 -159757 -41748 -110415 -302009 57506 237173 -4187 73976
18808 242483 289440 115919 -139839 10028 15685 -240979 -46982 -81056 -206992 -42014 -140508
18797 -140508 -145718 1581 -232932 -174038 -256847 265727 61071 68411 -106886 66267 203933
18786 203933 12077 -174536 11137 -62391 91957 -66344 56715 34625 -57104 -237732 169116
18774 257266 -151618 430850 -153088 41411 -160086 -290101 69121 -271571 -345548 -430919
18764 -430919 137697 -193902 74689 106274 5664 220563 -65880 -115717 28148 177155 137747
18753 137747 3858 39679 -258096 -26865 25332 255489 -266957 -133872 -50488 -318608 86020
18741 73058 -286954 112370 226623 -73727 -133951 -28703 -120131 53282 -88115 -73285 119506
$$ packed form
18820A27237a45410l35861D9213a59757d1748o8667j91594E7506J79667d187G3976
18808B42483M6957A15919a39839A0028N657b40979d6982l4074j25936d2014r8494
18797a40508n210A581b32932N8894q2809B65727F1071P340a06886F6267J37666
18786B03933A2077a74536A1137f2391I1957f6344E6715k2090e7104j80628A69116
18774B57266a51618D30850a53088D1411a60086j30015F9121b71571p3977q5371
18764d30919A37697a93902G4689L1585E664K14899f5880m9837B8148J49007l9408
18753A37747C858L5821b58096b6865B5332K30157b66957J33085e0488k68120H6020
18741G3058b86954A12370J14253g3727o0224b8703r1428E3282h8115J4830A19506
$$ plain form
18729 14786 -257570 8063 -383245 -63872 -102637 -57233 -241654 6477 -55133 -251760 67306
18717 30460 -308926 325525 -372051 38401 -176572 -199086 -163753 237660 -223073 -41291
18706 11906 -137349 51033 -115993 -255792 81211 -64560 -148750 -195810 108831 -448 -135852
18695 -135852 -79244 558475 -23118 8019 -88365 -293 -330959 -59745 266865 15071 -22917
18683 23080 -197207 -110023 141510 -128185 124687 -205649 -127579 -146387 20691 -60678 -42864
18672 -42864 12753 -205408 -107004 -110477 -205348 -65384 -131998 -194854 332805 51580 27902
18661 27902 111053 -88525 -399573 32614 -272391 77599 215576 -45163 59478 1898 -22770
18649 205954 36030 -235446 159723 183461 95817 -15058 -97443 -65252 -169329 -266967 -492041
$$ packed form
18729A4786b57570H063c83245f3872l8765M5404j84421F477e5133j96627F7306
18717C0460c08926C25525c72051C8401a76572k2514L5333B37660b23073d1291
18706A1906a37349E1033a15993j39799H1211f4560q4190m7060A08831d48j35404
18695a35852N6608E58475b3118H019h8365b93l30666e9745B66865A5071b2917
18683B3080a97207Q7184A41510a28185A24687b05649P8070j8808B0691f0678J7814
18672d2864A2753b05408R8404l473r4871f5384o6614o2856C32805E1580k3678
18661B7902Q3151h8525l11048C2614b72391G7599J37977d5163E9478A898b2770
18649B05954C6030b35446A59723K3738q7644a5058q2385L2191j04077r7638k25074
$$ plain form
18638 -492041 97393 372195 15268 19046 133582 -93981 -238282 -238311 -257162 -245381 -112709
18626 87543 -184708 -269490 -63260 -221178 161794 117565 -121807 90839 -178223 -109517 -337829
18615 -337829 -285955 -489697 26502 -364776 -9940 220043 17199 110329 -146052 -60902 -101734
18604 -101734 -246151 123581 195724 34876 161122 -183569 55895 -172791 -46079 -11163
18593 -83328 131545 232320 -212587 -117439 232426 -75383 43649 161978 159232 51058 319719
18582 319719 117411 54205 -94969 -2195 -190397 -228588 -78702 -247326 127042 -266348 107521
18570 -25175 -29022 -136838 9170 187593 -164317 3939 81900 -253820 -28316 -479878 -251913
18559 -251913 -899 258132 9447 -32913 14074 49623 -131709 -66104 -20659 101292 81520
$$ packed form
18638d92041I7393K74802A5268L778J14536i3981j44301k9j8851J1781a12709
18626H7543a84708q4782f3260j57918A61794m4229a21807I0839a78223O8706k28312
18615c37829N1874k03742B6502c64776i940B20043A7199R3130a46052f0902m0832
18604a01734j44417A23581P2143C4876J26246a83569E5895a72791d6079a1163
18593h3328A31545J00775b12587R5148B32426g5383D3649J18329k746E1058K68661
18582C19719A17411E4205i4969b195j88202l8191g8702j68624A27042b66348A07521
18570b5175l847j07816I170J78423a64317C939P7961b53820b8316m51562K27965
18559b51913h99B58132I447c2913A4074L5549a31709O5605b0659A01292j9772
$$ plain form
18548 81520 -250222 6626 -136511 -187153 56851 21087 -100096 -49922 -72488 -176759 325253
18536 174462 240006 -114733 -137789 23693 186452 -109224 -134349 -15188 -151712 -81435 -161441
18525 -161441 -58273 214565 -21131 -381356 -60262 -10609 -42119 -64997 39467 89037 19160
18513 -89623 -109727 58111 -87157 -105519 37407 2888 -349133 109 -55712 168765 47243 -4871
18500 -130367 32354 50436 97275 150162 -36297 221096 29945 -43249 -66985 -82963 -102186
18489 -102186 12869 -216541 93760 -216915 68653 258362 -125841 -196858 -144224 -94145 106968
18477 216024 -2128 177762 -201839 -95609 -305225 -107499 -207422 -338276 -37407 -233362
18467 -233362 368160 234410 -312608 -19152 -20671 -143980 41581 115828 -246096 -97930 -17981
$$ packed form
18548H1520b50222F626a36511n0642E6851B1087a00096d9922k2566j04271C25253
18536A74462O5544a14733k3056B3693J62759a09224k5125a5188j36524P0277q0006
18525a61441e8273B14565b1131l60225f0262a0609l1510k2878C9467M9570A9160
18513h9623k0104E8111h7157j8362C7407B888c49133A09e5712A68765D7243d871
18500a30367C2354J8082M6839N2887c6297B21096B9945d3249k3736j5978j9223
18489a02186A2869b16541I3760b16915F8653J89709a25841p1017N2634N0079A06968
18477B16024b128A77762b01839i5609k09616a07499r9923j30854c7407j95955
18467b33362C68160j33750c12608a9152j519j23309D1581P4247b46096i7930a7981
$$ plain form
18455 93109 119683 -114836 6070 86841 -21778 -187766 96894 75165 47264 -1159 38165 104268
18443 104268 32612 -12018 -287447 20686 -234245 11868 -148855 9561 -137937 200471 152750
18432 152750 -77960 16094 140790 61933 -176755 -188086 206354 271352 24926 194024 -177765
18420 -19264 89050 -210372 -137803 -107671 77103 -356034 -194119 201737 -84801 -190658 222017
18408 121235 122152 194294 -235054 63062 -231824 -84257 51092 -276739 192883 45873 -252954
18396 129342 -198132 56 916 -482879 432086 49207 16624 269677 93229 67857 -66087 -3511
18383 29773 -185073 -198036 -41923 117785 -161671 -8707 86665 -131 90311 -319110 75013
18371 -403179 132255 65508 31408 -9531 93179 -13067 -224319 -85971 50221 461727 159892
$$ packed form
18455I3109K6574a14836F070Q0771b1778j65988I6894k1729k7901a159C8165O6103
18443A04268C2612a2018k75429B0686b34245A1868a48855I561a37937B00471m7721
18432A52750g7960A6094J24696F1933a76755j1331B06354O4998B4926J69098a77765
18420a9264H9050b10372P2569L0132G7103c56034J61915B01737h4801j05857B22017
18408A21235R17P2142b35054F3062b31824h4257E1092b76739A92883D5873b52954
18396A29342a98132E6Q60d82879D32086D9207A6624K53053I3229k5372f6087c511
18383B9773a85073j2963d1923A17785a61671h707H6665a31I0311c19110G5013
18371d03179A32255F5508C1408i531I3179a3067k11252h5971E0221M11506A59892
$$ plain form
18359 37800 28489 154472 -4319 -272493 -250177 -226363 314246 131178 -42907 -425894 99045
18347 -129908 -68586 -82913 10326 -95509 64607 -87042 -4327 -71507 177121 -405476 -223554
18336 -223554 109521 -5331 61444 -6992 -400811 55240 -583899 197973 -299838 -734 -119102
18325 -119102 -191811 -165308 68410 22078 -153008 41467 88520 144405 -80132 127814 228296
18314 228296 -122872 -123709 -141491 -139852 219431 -240104 -7954 -58649 72351 -201082 -97705
18302 -77698 10506 4936 -437843 -144205 -337609 10747 -326098 -209138 -362031 -193628
18292 -193628 -129913 40360 136941 -244045 -346671 105397 119626 -248537 15516 120393
18282 120393 -554545 -174010 -101330 281148 1793 -322173 266236 6692 121908 -139536
$$ packed form
18359C7800r311J25983d319k68174K2316K3814C14246A31178d2907l82987I9045
18347a29908O1322j4327A0326i5509F4607h7042d327o7180A77121d05476J81922
18336b23554A09521e331F1444f992l93819E5240e83899A97973b99838g34j18368
18325a19102p2709K6503F8410B2078a53008D1467M7053N5885h0132A27814J00482
18314B28296a22872q37j7782J639B19431b40104g954n0695G2351b01082i7705
18302g7698A0506D936d37843a44205j93404A0747c26098J16960j52893J68403
18292a93628O3715D0360R6581b44045j02626A05397J4229b48537A5516J04877
18282A20393e54545a74010P2680B81148A793c22173B66236F692J15216a39536
$$ plain form
18271 -144986 -3680 -64618 -371605 -98430 -174421 16533 72213 7577 947 49148 17858 271693
18259 271693 138521 67402 -89401 233093 -128920 -242669 -113413 -259488 -190008 119576
18248 -308731 158242 190201 84038 -264615 207423 -110722 55476 220169 161065 -22443
18237 54131 42614 -22125 158473 -361854 -70370 166182 -45561 55252 -130177 -81836 29019
18225 -35817 -89815 -304973 43050 19891 30232 129155 -75521 -140273 -8633 -109883 -168775
18214 -168775 -27312 -39495 39501 -61239 -88765 -324345 28348 -379122 359659 94894 -157950
18202 -51886 23624 -304670 -140694 -110734 -93907 -138239 -85578 224639 -103730 -14772 -403845
18191 -403845 -144069 -279503 257124 -13481 -180676 -131392 9167 3798 -224344 104160 264613
$$ packed form
18271a44986c680o0938l06987i8430p5991A6533N5680G577I47M8201A7858K53835
18259B71693j33172F7402h9401B33093a28920j13749a13413j46075O9480A19576
18248c08731A58242L1959H4038b64615B07423a10722E5476J64693n9104b2443
18237E4131j1517b2125A58473c61854g0370A66182d5561E5252a30177M8341B9019
18225c5817n3998k15158D3050A9891J0341R8923g5521o4752h633j01250n8892
18214a68775b7312j2183C9501f1239k7526k35580B8348c79122C59659I4894a57950
18202e1886B3624c04670a40694K9960J6827m4332N2661B24639a03730a4772l89073
18191d03845a44069j35434B57124a3481j67195M9284I167C798b24344A04160J60453
$$ plain form
18180 264613 -276765 16413 116748 -8271 6155 -59292 -78384 74542 -41649 -53581 -308806
18169 -308806 -47964 -4626 -134731 65997 -257221 -182540 -146071 -70355 -60077 37205 24952
18158 24952 -39751 5755 -61810 -88711 200959 -24647 -89715 -2665 -147726 333617 237104
18147 237104 237251 89298 8699 187209 -142625 81203 119058 -104485 -82467 28786 -291200
18135 83212 -521605 216844 -161575 -107284 239487 -168619 -62721 294286 47072 -260929
18124 84490 -85867 -220859 -208580 -137922 255102 125868 86223 -225699 187087 -262778
18113 80757 -260688 -81666 -88572 -273630 58316 -272900 62165 424998 -65206 -70190 -152941
18102 -152941 -11179 -329358 -133862 -159233 -232402 -35903 -60913 -179697 47217 -248885 -147070
$$ packed form
18180B64613b76765A6413J00335h271F155e9292j9092G4542d1649j1932k55225
18169c08806d7964d626j30105F5997b57221P4681L6469g0355J0278C7205j2253
18158B4952c9751E755f1810k6901B00959b4647o5068b665j45061C33617r6513
18147B37104J47H9298H699J78510a42625H1203L7855a04485K2018B8786b91200
18135H3212e21605B16844a61575N4291B39487a68619f2721B94286D7072b60929
18124H4490h5867j34992J2279P0658B55102A25868l9645b25699A87087b62778
18113H0757b60688h1666o906j85058E8316b72900F2165L62833f5206m984q2751
18102a52941a1179l18179a33862k5371p3169c5903k5010j18784D7217b48885J01815
$$ plain form
18091 -147070 191555 123252 89990 47119 -224448 -72455 2835 -23004 -149454 -105026 -120075
18080 -120075 -79194 -260575 -190838 72341 -73440 -249050 -123995 -59549 -78086 229906 -187893
18068 41648 -194619 -1036 -153778 109 82221 129954 -279166 -313338 -38240 -9603 37089 -239105
18055 -253171 11895 75561 34737 -115591 182385 -15056 -122112 -340144 5038 -291369 -204175
18044 -204175 -47217 231806 -82869 -40789 19292 96008 251276 -117869 -89266 -31942 36495
18032 101966 56168 84104 79497 138761 -38044 -61201 -316530 100698 82770 -21324 11258
18020 -78077 54672 179199 35984 165298 -145664 -121766 327235 166044 -112294 -231399
18010 -231399 -30748 -54340 -35578 -14549 -89434 -118635 238876 6632 -3259 -16154 -296440
$$ packed form
18091a47070A91555o8303l3262m2871b24448g2455B835b3004j26450M4428j5049
18080a20075M0881j81381O9737G2341g3440j75610a23995e9549j8537B29906a87893
18068D1648a94619a036j52742A09Q2112M7733b79166l4172c8240i603C7089b39105
18055b53171A1895O3666C4737a15591A82385a5056j07056k18032E038b91369Q7194
18044b04175d7217B31806h2869d0789A9292P6716J55268a17869K8603c1942C6495
18032A01966m5798K7936m607N9264c8044k3157k55329A00698j7928b1324A1258
18020g8077E4672J24527C5984J29314a45664K3898C27235j61191a12294j19105
18010b31399c0748k3592J8762a4549p4885k9201B38876F632c259j2895k80286
$$ plain form
17999 -296440 -62232 -54514 -48119 55448 -107344 5431 -175770 81055 218977 -141712 -11110
17987 65499 -113575 -304823 82330 -47340 -160629 10692 371841 -318059 109524 -77860
17976 227946 44958 -249145 -41124 -201162 276156 189495 -22474 -193986 -80101 -154261 239587
17964 131469 -30978 328128 156444 48338 -194827 -322862 172185 30165 -65287 91210
17953 -30911 122293 42672 -98352 165949 -72648 -220896 -35473 42071 -429481 -41072 -60176
17942 -60176 414687 -32239 79441 -283871 -209211 118320 -110298 -68339 173741 257493 317198
17931 317198 158856 134188 -6723 -25458 365616 190034 102047 65670 178765 -202799 -287294
17920 -287294 388258 40972 -94243 -207167 -226986 7837 209553 167359 242329 -62795 -186951
$$ packed form
17999b96440f2232P718O395E5448a07344E431a75770H1055J37922a41712a1110
17987F5499a13575j91248H2330d7340j13289A0692L61149c18059A09524g7860
17976B27946D4958b49145d1124j60038B76156q6661b2474j71512h0101p4160B39587
17964A31469c0978C28128A56444D8338a94827j28035A72185C0165f5287I1210
17953c0911A22293D2672i8352A65949g2648j48248c5473D2071d29481d1072j9104
17942f0176D14687c2239G9441b83871P4660A18320a10298M1959A73741Q3752N9705
17931C17198j58342k4668f723j8735C65616j75582q7987l6377J13095b02799q4495
17920b87294C88258D0972i4243j12924j9819G837K01716m2194P4970f2795j24156
$$ plain form
17909 -186951 246579 48530 -133938 -43892 -156945 137537 67399 -88874 320225 -78191
17898 62333 -47845 344821 359641 -36830 88982 -179055 -160012 -285316 230390 114446 4557
17886 104296 91565 132252 -255085 -420937 -254345 62313 -78318 -130747 277306 162567
17876 162567 -41180 -91619 75491 97517 -3694 44556 349753 283787 150601 -256700 -61917
17864 118901 -230316 -289446 -278080 -201850 -81202 -168010 115768 124853 -127844 -129013 -35581
17852 -2660 125918 -91761 211439 -230984 -79744 178246 -93505 121324 -221293 201513
17841 97032 6733 59352 -29770 -66068 93045 -29465 46324 106546 52461 54582 237976 80306
17828 153602 38322 132811 171651 -341516 138456 -132340 -86992 -100689 39433 79247 -178459
$$ packed form
17909a86951B46579D8530a33938d3892j13053A37537F7399h8874C20225g8191
17898F2333d7845C44821J4820c6830H8982a79055J9043j25304B30390A14446D557
17886A04296j2731M0687b55085j65852J66592F2313g8318n2429B77306j14739
17876A62567d1180n0439G5491K2026c694D4556L05197o5966j33186b56700f1917
17864A18901b30316n9130J1366P6230h1202q6808A15768R085a27844j169c5581
17852b660A25918i1761B11439b30984g9744A78246i3505A21324b21293B01513
17841I7032F733N2619b9770l6298I3045b9465D6324O0222E2461K121J83394H0306
17828A53602C8322R4489L8840c41516A38456a32340M5348j3697C9433L9814a78459
$$ plain form
17816 84264 -57714 -50280 140548 -12658 135692 51457 -63536 10073 -92314 45267 159750
17805 159750 181918 148053 23696 -82398 -132200 -313545 -225130 237546 -305915 -194861 -189012
17794 -189012 -187724 317342 64503 -230083 -60436 -92912 -72987 56035 145974 108589 -101 -126699
17782 -126699 394897 96034 67707 186943 133057 -100200 158861 208632 -69971 228495
17771 -157015 21201 81808 -5057 -190284 77132 51306 100377 13657 -229085 -159135 54174
17759 37665 -51147 208111 -182312 -88291 44369 211418 345969 -69303 58945 -17941 9450
17747 75805 -188681 73427 -73803 243483 -173039 -113325 -139036 -127399 -447890 -7144 165967
17735 -139444 206465 -150437 -15302 -200321 3798 13526 138873 -96484 -166842 -241948 270731
$$ packed form
17816H4264e7714P434A40548a2658A35692E1457f3536A0073i2314D5267J14483
17805A59750K2168l3865B3696h2398m9802j81345Q8415B37546c05915J11054N849
17794a89012J288C17342F4503b30083f0436l2476J9925E6035Q9939l7385a01j26598
17782a26699C94897I6034k8327J19236n3886a00200A58861M9771f9971B28495
17771a57015B1201O0607e057j85227G7132k5826M9071A3657b29085O9950E4174
17759C7665e1147B08111a82312h8291D4369J67049J34551f9303E8945a7941I450
17747G5805a88681G3427g3803B43483a73039N9714k5711J1637l20491g144A65967
17735a39444B06465a50437a5302j85019C798R728J25347i6484p0358p5106B70731
$$ plain form
17723 -306290 -64134 12018 -15436 83341 308879 -204638 182730 -84314 -75080 -379639 -9028
17711 -43034 135586 -77790 -34826 175990 -157379 37682 -145548 -169000 245244 62898 -206198
17699 -203931 -295465 90680 2950 -88806 220530 50497 33012 66308 95 228454 228103 -69490
17686 29842 172739 -100271 -173529 -18334 -34444 226389 274465 -111836 -153172 133741 -45520
17674 -201850 109013 -326552 60 13532 -89669 198417 56557 -172254 203849 148789 140337
17663 140337 194839 84528 -273150 311153 51841 80995 103256 -91094 189181 405446 297280
17652 297280 -110476 100626 189613 34704 120485 86522 425882 17727 311449 -142974
17641 248337 258620 -380228 -306248 189054 -127850 276378 -333245 -190564 -244474 50712
$$ packed form
17723c06290f4134A2018a5436H3341K25538b04638A82730h4314R234l04559i028
17711d3034A35586g7790c4826A75990a57379C7682a45548k3452B45244F2898b06198
17699b03931r1534I0680B950h8806B20530E0497j7485L3296I5K28359l51f9490
17686B9842J42897a00271p3258a8334j6110B26389M8076a11836m1336A33741d5520
17674b01850A09013c26552F0J3472h9669A98417E6557a72254B03849n5060q452
17663A40337N4502H4528b73150C11153E1841K9154K2261i1094A89181K16265j08166
17652B97280a10476A00626Q8987C4704Q5781l3963L39360A7727K93722a42974
17641B48337J0283c80228P3980A89054a27850B76378c33245J42681n3910E0712
$$ plain form
17630 -263664 405284 16450 -201683 -311184 -273964 -118023 -307002 399434 97586 363153
17620 363153 482420 253905 325113 373221 -99286 -263100 234185 93012 -38513 -160993
17610 -160993 23536 122390 186386 142343 403750 -297535 -111070 320394 100483 206136
17600 206136 163841 105976 -32342 375699 -23887 -201796 -61409 166470 106535 279010 -48015
17588 -166710 -340085 -20067 171351 57403 146714 55325 -300723 98845 -120019 -38169 251831
17576 175718 200359 37486 -142768 -166354 100555 149756 110195 157464 -54494 -171446 223583
17564 37524 -29110 16844 230369 103153 70129 118721 -46729 134947 97048 -19809 63231
17552 1661 137220 -89204 130278 236917 8946 -76851 -25926 -74542 25867 55370 505551
$$ packed form
17630b63664D05284A6450b01683j09501L7220a18023j88979C99434I7586K65567
17620C63153J19267k28515P1208M8108i9286j63814B34185I3012c8513j22480
17610a60993B3536R8854O3996m4043K61407b97535a11070C20394A00483J05653
17600B06136m2295n7865c2342C75699b3887j77909f1409A66470n9935J72475d8015
17588a66710j73375b0067A71351E7403Q9311E5325c00723I8845a20019c8169B51831
17576A75718K4641C7486a42768k3586A00555M9201l9561M7269e4494j16952B23583
17564C7524b9110A6844K13525A03153l3024M8592d6729A34947l7899a9809F3231
17552A661J35559h9204A30278J06639H946g6851b5926m8616B5867K9503M50181
$$ plain form
17541 505551 51117 127991 34051 23995 262044 18308 151765 196312 -94219 -187723 -24646
17529 -59367 -60442 284785 309330 311826 13374 -2085 101008 -40689 -87008 131677 410391
17518 410391 -450538 286929 -75183 99679 70118 108897 -38428 182108 407019 119836
17507 138024 -23690 142189 -48757 291457 -18394 331972 54338 -46435 97256 206816 -297657
17495 -325977 204195 -97470 79422 299187 156977 249746 157538 62439 82217 109046 193758
17484 193758 112278 69784 79734 254949 75355 67017 382726 15009 133182 -19063 47062
17472 178465 -2566 15479 -231224 140918 99119 -229688 200729 -83411 159815 354532
17462 354532 239143 325673 -73278 393260 -105992 287531 213070 67745 91667 348541
$$ packed form
17541E05551E1117P6874C4051j0056K38049A8308J33457M4547i4219r3504b4646
17529e9367j075B84785K4545K496A3374b085A01008d0689m6319A31677K78714
17518D10391d50538B86929g5183I9679k9561L8779c8428A82108K24911A19836
17507A38024b3690A42189d8757B91457a8394C31972E4338d6435I7256J09560b97657
17495c25977B04195i7470G9422K19765j42210R2769r2208F2439J9778K6829Q4712
17484A93758q1480m2494R950J75215G5355q338L15709A5009J18173a9063D7062
17472A78465b566A5479b31224A40918m1799b29688B00729h3411A59815J94717
17462C54532j15389Q6530g3278C93260a05992B87531p4461F7745K3922K56874
$$ plain form
17452 348541 286073 408546 338338 202366 355959 180342 602076 297720 272299 255977
17442 255977 424778 -1577 248826 181754 377971 269364 351419 606769 171349 319411
17432 319411 245375 -235989 463391 -34541 129362 226533 -9216 48801 187466 46465 460298
17421 460298 396718 381909 698488 -277265 226749 338473 329372 603334 351478 176653
17411 176653 154593 -194799 -4214 46321 22557 138607 260086 233909 38693 -8601 -129711
17400 -129711 -200098 141499 215763 -27507 106387 100281 34098 180448 135782 112281 538025
17389 538025 180153 -37730 -724 -36979 -26790 290155 215690 52425 273012 113110 -13227
17377 -67526 -63385 316239 171937 -69678 140469 -103279 -166570 454936 461611 -290906 -74442
$$ packed form
17452C48541o2468J22473p0208j35972J53593j75617M21734B97720k5421j6322
17442B55977J68801a577B48826o7072J96217j08607Q2055K55350A71349J48062
17432C19411p4036b35989D63391c4541A29362R7171i216D8801J38665D6465M13833
17421D60298o3580j4809L16579b77265B26749J11724r101K73962k51856j74825
17411A76653k2060a94799d214D6321B2557J16050J21479k6177C8693h601j21110
17400a29711p0387A41499P4264b7507A06387o106C4098J46350m4666k3501M25744
17389E38025A80153c7730g24l6255J0189B90155p4465E2425K20587A13110a3227
17377f7526M141C16239j44302f9678A40469a03279o3291D54936O675b90906g4442
$$ plain form
17365 347404 189078 79632 149263 173389 88088 -57591 197709 168208 528811 -216956 497281
17353 -73398 338064 333703 310656 86057 15388 428221 -48258 129142 113152 22906 30591
17342 30591 93540 -169651 16939 69551 85556 195597 148953 177176 41046 38347 -93419
17330 -5833 -230270 -146714 77219 40983 154574 295007 61717 280275 136243 225367 265192
17319 265192 214200 202997 222423 -58701 116915 375945 64640 183595 84249 -60030 -41328
17308 -41328 -93903 202862 148327 223533 274542 143871 34123 279643 280241 297187 179444
17297 179444 -225455 119730 -380167 -70761 19134 91751 118540 -196234 -70489 -54396 240989
17285 43265 146616 -140087 -40676 -12153 236703 252026 13868 419738 66909 -22707 205548
$$ packed form
17365C47404j58326G9632O9631K4126q5301e7591A97709k9501L60603b16956D97281
17353g3398C38064m361k3047H6057A5388M12833d8258A29142j5990B2906P685
17342C0591O2949a69651A6939N2612J6005J10041m6644K8223D1046k699i3419
17330e833k24437Q3556G7219l6236J13591J40433F1717K18558A36243Q9124L9825
17319B65192n0992j1203J9426e8701A16915K59030F4640J18955H4249f0030J8702
17308d1328n2575B02862n4535P5206N1009j30671C4123K45520N98J6946j17743
17297A79444b25455A19730c80167g0761A9134P2617K6789a96234g0489J6093B40989
17285D3265J03351a40087d0676a2153B36703J5323A3868M05870F6909b2707B05548
$$ plain form
17273 318090 471468 24901 76559 129340 211018 -54105 428144 54280 216808 272217 -292762
17261 -41128 56026 225115 -67108 148340 207309 55337 40097 73445 224100 484432 26137
17249 -17298 168387 347495 305914 261750 314286 151082 292578 55626 196857 -13506 -188849
17238 -188849 209178 155142 -11248 289978 462189 -6030 338368 386520 169833 277296
17228 277296 117640 41836 -58677 312270 278839 22726 683486 39938 111975 134898 54035
17216 254002 -29545 24229 -123 207959 357222 386256 297839 219150 29913 165038 -188079
17204 375781 283582 -84480 102780 211808 131455 52512 46761 163512 412464 198500 407091
17193 407091 251503 337949 267530 107750 337523 120536 171539 107548 87442 378630
$$ packed form
17273C18090J53378B4901N1658N2781Q1678e4105D28144E4280J62528N5409b92762
17261d1128E6026J69089f7108A48340N8969E5337j5240L3348J50655K60332B6137
17249a7298A68387J79108m1581m4164N2536A51082J41496E5626J41231a3506j75343
17238a88849B09178n4036a1248B89978J72211f030C38368M8152A69833J07463
17228B77296A17640D1836e8677C12270l3431B2726O60760C9938P2037K2923E4035
17216B54002b9545B4229a23B07959J49263K9034q8417p8689B9913J35125a88079
17204C75781r2199h4480A02780J09028q0353E2512n751J16751K48952A98500K08591
17193D07091j55588Q6446p0419A07750K29773A20536N1003o3991k0106K91188
$$ plain form
17183 378630 227203 116196 249433 329416 38850 361345 391790 352266 70649 69986 223135
17172 223135 -89294 115815 181398 94239 -64155 -170095 -51719 301951 194908 179574 217876
17161 217876 -51783 165685 422207 174236 514556 -23241 105163 -219433 403717 490047
17151 490047 54603 430357 204522 250236 607830 275693 98760 121829 150336 -195305
17140 225711 87004 -3291 285516 211430 159790 187964 37289 412233 72874 254128 164576
17129 164576 446643 651562 684308 213614 638293 115939 219803 326779 308025 28720
17118 280039 501749 549239 699024 160048 109747 372176 209605 300877 248377 105163
17107 305340 301758 264293 176414 251431 446081 13713 458287 277907 153107 520370 232669
$$ packed form
17183C78630j51427j11007J33237P9983C8850L22495L0445l9524G0649o63J53149
17172B23135h9294A15815O5583q7159f4155j05940e1719C01951j07043j5334L8302
17161B17876e1783A65685K56522A74236L40320b3241A05163b19433D03717Q6330
17151D90047E4603L75754B04522M5714L57594B75693I8760K3069K8507a95305
17140B25711H7004c291B85516p4086n1640K8174C7289L74944G2874J81254q9552
17129A64576K82067K04919L2746B13614M24679A15939J03864J06976j8754B8720
17118B80039K21710M7490J49785A60048n0301K62429j62571R1272n2500A05163
17107C05340l582l7465q7879P5017J94650A3713M44574j80380j24800L67263B32669
$$ plain form
17095 441554 113351 160310 461957 137654 260731 30 420963 -7224 437316 272267 194753
17084 194753 185429 350133 421921 183112 438197 96918 586099 235879 364456 167735
17073 270385 196952 867362 483073 510399 330206 496908 348674 375425 640773 286366
17062 420680 573978 381262 306833 307136 444379 365943 825227 528352 338485 449947
17052 449947 398329 222048 351803 468109 580236 355304 281419 971307 493810 765756
17042 765756 165475 328681 502493 624707 147447 536417 607050 485301 538094 544730
17032 544730 262038 598392 396726 372013 306973 575192 592274 522209 248629 631116
17022 631116 467990 379061 635297 493658 432941 428449 85139 385589 624512 371044
$$ packed form
17095D41554A13351M6959L01647A37654J23077C0M20933g224D37316j65049p7514
17084A94753r324J64704P1788A83112K55085I6918M89181B35879J28577A67735
17073B70385p3433O70410l84289K7326j80193J66702j48234K6751K65348B86366
17062D20680J53298j92716p4429L03J37243p8436M59284k96875j89867J11462
17052D49947n1618j76281J29755J16306J12127k24932p3885O89888m77497K71946
17042G65756A65475J63206J73812J22214A47447L88970P0633j21749N2793O636
17032E44730B62038L36354k01666k4713o5040K68219J7082p0065B48629L82487
17022F31116j63126q8929K56236j41639o0717m492H5139L00450K38923k53468
$$ plain form
17012 371044 424370 534595 602261 564525 857903 393789 868844 789959 604295 526349
17002 526349 349617 527983 690298 746119 685876 779062 707477 661694 312821 728966
16992 728966 472618 689964 292580 203684 825199 668156 1057197 566461 308852 996321
16982 996321 566487 732209 307294 534069 442223 458799 575357 925549 787684 802823
16972 802823 759311 839938 825406 812785 1063409 761704 1078970 828324 790049 572569
16962 572569 754328 1016751 734297 670659 610662 723380 1030198 814839 850429 1033612
16952 1033612 645683 767033 698398 539915 477690 587645 1086042 1029593 885920 1006039
16942 1006039 1492772 799808 1173964 1177541 1223101 964536 1149231 1276100 1386515 1065676
$$ packed form
17012C71044N3326J10225O7666l7736K93378C93789M75055p8885j85664p7946
17002E26349j76732J78366J62315N5821o0243R3186p1585m5783C12821M16145
16992G28966k56348K17346B92580q8896O21515j57043L89041m90736k57609O87469
16982I96321m29834J65722C07294K26775r1846J6576J16558L50192j37865J5139
16972H02823m3512Q0627j4532j2621K50624l01705L17266k50646l8275k17480
16962E72569J81759K62423k82454o3638n9997J12718L06818k15359L5590J83183
16952A033612l87929J21350o8635j58483o2225J09955M98397n6449j43673J20119
16942A006039M86733o92964L74156L577M5560k58565J84695J26869J10415l20839
$$ plain form
16932 1065676 1058934 942343 1186023 1315610 1106215 749967 986602 1116820 951669 1174668
16922 1174668 921470 1099807 1347683 1022690 1189498 1192372 1360989 860407 1621422 1569368
16912 1569368 1394530 942316 966538 1578807 1254264 1566446 1371941 1239807 1739145 1387978
16902 1387978 1533205 1205634 1556533 1171295 1564398 1718824 1582755 1727261 1452802
16893 1452802 1441201 1763268 1546470 1766813 989827 1864805 1548918 1497746 1758001 1970388
16883 1970388 1786214 1556915 1912042 1709945 2034741 1951880 1955981 2128853 2013463 2179406
16873 2179406 2150260 1784373 2151548 2153047 1905622 2043141 2071783 2161981 2085574 1966265
16863 1966265 2580293 2299034 2266064 2432978 2265591 2239756 2649553 2480373 2751134 2785816
$$ packed form
16932A065676o742j16591K43680J29587k09395l56248K36635J30218j65151K22999
16922A174668k53198J78337K47876l24993J66808K874J68617n00582P61015n2054
16912A569368j74838m52214K4222O12269l24543L12182j94505j32134M99338l51167
16902A387978J45227l27571L50899l85238L93103J54426j36069J44506k74459
16893A452802j1601L22067k16798K20343p76986Q74978l15887n1172K60255K12387
16883A970388j84174k29299L55127k02097L24796q2861M101J72872j15390J65943
16873B179406k9146l65887L67175J499k47425J37519K8642R0198p6407j19309
16863A966265O14028k81259l2970J66914j67387k5835M09797j69180K70761L4682
$$ plain form
16853 2785816 2598089 2595804 2667832 2758310 2698137 2585622 3071100 3007373 3149870 3064823 3223914
16842 3223914 3002528 2999322 3442419 3107621 3266745 3298707 3486908 3644644 3520195 3759302
16832 3759302 3670202 3715670 3660360 3518984 3734550 3979729 4031240 4049130 4086920 4287997
16822 4287997 4559653 4181914 4290376 4598496 4622512 4505061 4583341 4959923 5184250 4899412
16812 4899412 5142342 5215023 5463333 5370079 5666197 6028918 5750502 6141154 6208431 6246868
16802 6246868 6268679 6349503 6621262 7103948 7049508 6907396 7192847 7297816 7829703 7721712
16792 7721712 8217360 8271595 8246940 8522040 8765365 9156428 9424170 9755799 9882741 10408137
16782 10408137 10344628 10887056 11356112 11549887 11735158 12252691 12478017 12799553 13575605
$$ packed form
16853B785816j87727k285P2028R0478o0173j12515M85478o3727J42497q5047J59091
16842C223914k21386l206M43097l34798J59124L1962J88201J57736j24449K39107
16832C759302q9100M5468n5310j41376K15566K45179N1511J7890L7790K01077
16822D287997K71656l77739J08462L08120K4016j17451P8280L76582K24327k84838
16812D899412K42930P2681K48310r3254K96118L62721k78416L90652O7277L8437
16802F246868K1811Q0824K71759M82686n4440j42112K85451J04969N31887j07991
16792G721712M95648N4235k4655K75100K43325L91063K67742L31629J26942N25396
16782A0408137o3509N42428M69056J93775J85271N17533K25326L21536P76052
$$ plain form
16773 13575605 13781441 14459440 14514969 15259346 15948568 16369624 16982298 17662259 18439475
16764 18439475 19016922 19810102 20245002 20884006 22217062 22959344 23853730 25065931 25866431
16755 25866431 27157706 28539240 29550859 30901310 32458223 33756574 35866193 37520670
16747 37520670 39582215 41326041 43819885 46139248 48538697 51513064 54734761 57737594
16739 57737594 61696756 64997296 68908038 73257233 78202150 83271446 88619207 94633874
16731 94633874 100919406 107917260 115037721 122527795 130819336 139068889 148110737 156789361
16723 156789361 165353618 174411788 182347004 189587915 196272374 201725214 206083395 208386953
16715 208386953 209662632 208879432 206550450 202480087 197316035 191265391 183347273 175574430
$$ packed form
16773A3575605K05836O77999N5529P44377O89222M21056O12674O79961P77216
16764A8439475N77447P93180M34900O39004J333056P42282Q94386J212201Q00500
16755B5866431J291275J381534J011619J350451J556913J298351K109619J654477
16747C7520670K061545J743826K493844K319363K399449K974367L221697L002833
16739E7737594L959162L300540L910742M349195M944917N069296N347761O014667
16731I4633874O285532O997854P120461P490074Q291541Q249553R041848Q678624
16723A56789361Q564257R058170P935216P240911O684459N452840M358181K303558
16715B08386953J275679p83200k328982m070363n164052o050644p918118p772843
$$ plain form
16707 175574430 166638392 158110541 149375785 140533912 132267995 123744854 115622847 108316595
16699 108316595 101474156 94816187 89251732 83196787 78040663 73091629 68973827 64524990
16691 64524990 60780445 57061782 53982666 51072992 48241175 45400416 43046451 40625521
16683 40625521 38854774 36521164 34785612 33335060 31924284 30081842 28595919 27251476
16675 27251476 26136748 25087986 23943146 22797129 21899903 20949953 20315252 19291752
16667 19291752 18643277 17999187 17378575 16563598 15830505 15667615 14724126 14548335 13937569
16658 13937569 13750569 12690374 12477656 12188550 11931280 11607550 11089261 10935692 10382544
16649 10382544 10301504 9600372 9406547 9165772 8911456 8780270 8398578 8233989 8127492
$$ packed form
16707A75574430q936038q527851q734756q841873q265917q523141q122007p306252
16699A08316595o842439o657969n564455o054945n156124m949034m117802m448837
16691F4524990l744545l718663l079116k909674k831817k840759k353965k420930
16683D0625521j770747k333610j735552j450552j410776j842442j485923j344443
16675B7251476j114728j048762j144840j146017q97226r49950o34701j023500
16667A9291752o48475o44090o20612q14977p33093j62890r43489j75791o10766
16658A3937569j87000j060195k12718k89106k57270l23730n18289j53569n53148
16649A0382544q1040p01132j93825k40775k54316j31186l81692j64589j06497
$$ plain form
16640 8127492 7887671 7456895 7065577 7640518 6962142 7372860 6631535 6523920 6330052
16631 6330052 6564988 6183277 6120198 5784294 5527205 5521571 5270613 5449449 5040703 5043769
16621 5043769 5023010 4811205 4361838 4746604 4218973 4492148 4182778 4387622 4212767 4383711
16611 4383711 3675792 3924532 3662541 3534001 3972377 3587773 3500823 3454015 3093648 2994471
16601 2994471 3358812 3019295 3061324 3134406 2882055 3167858 2742110 2957604 2941714 2802625
16591 2802625 2542920 2520112 2651088 2680457 2167641 2401026 2583146 2284026 2310886 2566013
16581 2566013 2338918 2129786 2248838 2315072 2400967 2168956 2556871 2203521 2004195 2020501
16571 2020501 2197484 1955448 2114458 2055406 2251178 2027787 1737748 1797862 1974107 1431738
$$ packed form
16640H127492k39821m30776l91318N74941o78376M10718p41325j07615j93868
16631F330052K34936l81711o3079l35904k57089n634k50958J78836m08746L066
16621E043769k0759k11805m49367L84766n27631K73175l09370K04844j74855J70944
16611D383711p07919K48740k61991j28540M38376l84604q6950m6808l60367r9177
16601B994471L64341l39517M2029P3082k52351K85803m25748K15494j5890j39089
16591B802625k59705k2808J30976K9369n12816K33385J82120k99120K6860K55127
16581B566013k27095k09132J19052O6234Q5895k32011L87915l53350j99326J6306
16571B020501J76983k42036J59010n9052J95772k23391k90039O0114J76245n42369
$$ plain form
16561 1431738 1612190 1852102 1874321 1459238 1716789 1548192 1903450 1355337 1541321 1745347
16551 1745347 1644024 1234334 1110286 1299029 1143220 1593199 1041095 1278496 1286430 1607117
16541 1607117 1222283 1154715 1276198 1423151 1388159 1349646 1393120 1159733 1259875 1020092
16531 1020092 1051496 1547426 1520912 841420 1305042 1265905 1153124 847614 624012 929869
16521 929869 1022970 1500126 1082254 1276848 801470 850075 801057 778244 899967 831947
16511 831947 1081534 842638 1073411 896910 1035042 1055094 980292 923496 906238 898974 877020
16500 877020 718435 717281 1250183 795573 711976 940434 1070295 862029 836188 748781
16490 748781 614944 745181 1011857 644521 894457 531310 866412 902582 778911 778145
$$ packed form
16561A431738J80452K39912K2219m15083K57551j68597L55258n48113J85984K04026
16551A745347j01323m09690j24048J88743j55809M49979n52104K37401P934L20687
16541A607117l84834o7568J21483J46953l4992l8513M3474k33387J00142k39783
16531A020092L1404M95930k6514o79492M63622l9137j12781l05510k23602L05857
16521I29869R3101M77156m17872J94594m75378M8605m9018k2813J21723o8020
16511H31947K49587k38896K30773j76501J38132K0052p4802n6796j7258p264k1954
16500H77020j58585j154N32902m54610q3597K28458J29861k08266k5841q7407
16490G48781j33837J30237K66676l67336K49936l63147L35102L6170j23671p66
$$ plain form
16480 778145 513051 503941 693553 870839 578786 702266 625002 690033 792962 552890
16470 552890 608850 795636 198064 586627 490204 512599 668774 580034 696842 389246
16460 389246 484530 551859 406787 721920 560583 679178 608147 579023 517619 286766
16450 286766 708250 542164 444302 774270 764428 767353 521010 368293 490652 356375
16440 356375 641663 730152 674625 522957 225518 411302 771213 747572 681842 562974
16430 562974 728036 587143 513527 708807 556270 476131 524012 586353 464996 487973
16420 487973 652496 492376 325353 480047 42520 381992 293835 141658 579605 358805
16410 358805 609495 235137 225660 533355 135721 302001 396683 361073 209926 463807
$$ packed form
16480G78145k65094r110J89612J77286k92053J23480p7264O5031J02929k40072
16470E52890N5960J86786A98064L88563r6423K2395J56175q8740J16808l07596
16460C89246R5284O7329j45072L15133j61337J18595p1031k9124o1404k30853
16450B86766M21484j66086r7862L29968r842K925k46343j52717J22359j34277
16440C56375K85288Q8489n5527j51668B25518J85784L59911k3641o5730j18868
16430E62974J65062j40893p3616J95280j52537q0139M7881O2341j21357K2977
16420D87973J64523j60120j67023J54694D2520L39472q8157A41658M37947k20800
16410C58805K50690B35137r477L07695A35721J66280R4682l5610j51147K53881
$$ plain form
16400 463807 96862 314982 140137 184648 493713 512843 588782 430631 344020 580245
16390 580245 221914 434542 251901 247914 527527 126683 237985 228675 485165 610354
16380 610354 474378 409816 204942 368166 485106 345580 177595 679639 177817 425960
16370 425960 475387 344646 619614 338684 366834 467520 309751 354340 79820 -74112
16359 367463 526418 397113 312426 294774 102608 378371 362627 431782 234655 282231
16349 282231 128076 199637 120873 573487 64801 467012 437972 501724 395989 300468 561453
16338 561453 191955 109710 68658 -16809 175679 53424 294126 182735 259771 415323
16328 415323 234317 305223 290212 522442 317185 249053 573091 -142858 365801 324820
$$ packed form
16400D63807I6862K18120A40137M4511L09065J9130P5939j58151q6611K36225
16390E80245B21914K12628j82641l987K79613A26683J11302r310K56490J25189
16380F10354j35976o4562k04874J63224J16940j39526j67985N02044A77817K48143
16370D25960M9427j30741K74968k80930K8150J00686j57769M4589G9820g4112
16359C67463J58955j29305q4687j7652A02608K75763j5744O9155j97127M7576
16349B82231A28076P1561p8764M52614F4801M02211k9040O3752j05735r5521K60985
16338E61453A91955q2245m1052a6809A75679E3424K40702j11391P7036J55552
16328D15323j81006P0906j5011K32230k05257o8132L24038a42858C65801m0981
$$ plain form
16318 324820 107347 151737 279238 305832 203182 368445 -54325 557013 284464 122012
16307 244681 72744 533557 222368 -144062 280748 284250 155887 6331 -54746 220239 93659
16295 -10119 419201 102496 100508 182695 57333 23306 7916 196783 304739 -11318 -173515
16284 -173515 162192 -111131 263967 378244 155684 -62119 368176 131330 230658 39752
16273 311196 12696 212004 189362 191308 -212537 37408 258883 114298 -14995 150465 96577
16262 96577 -56698 -88351 141377 -27583 327808 72518 -95786 145079 160433 242558 351337
16251 351337 -47328 88030 239812 415083 304450 274985 98885 46417 219439 -210661
16240 -40042 386567 -123148 -56271 430872 -76863 -263668 -72659 164901 224764 96661 180184
$$ packed form
16318C24820A07347M4390J27501K6594j02650J65263e4325E57013k72549A22012
16307B44681G2744M60813B22368a44062B80748L502j28363F331e4746B20239I3659
16295a0119D19201A02496j988Q2187E7333B3306G916J88867J07956a1318j62197
16284a73515A62192a11131B63967J14277A55684f2119C68176A31330R9328C9752
16273C11196A2696J99308k2642J946b12537C7408K21475A14298a4995A50465n3888
16262I6577e6698l1653A41377b7583C27808G2518i5786A45079J5354Q2125J08779
16251C51337d7328H8030J51782J75271j10633k9465I8885D6417J73022b10661
16240d0042C86567a23148e6271D30872g6863j86805g2659A64901N9863I6661Q3523
$$ plain form
16229 180184 514332 289356 82714 105360 279803 -47383 51266 -20778 317246 93360 -131022
16217 229892 184983 -59340 2917 298530 -24144 220078 92130 134731 32084 97947 233819
16206 233819 196935 -131871 98983 -112561 123908 472771 -118944 287715 38812 -7000
16195 528658 127918 65150 273689 -89267 133564 343456 -228658 403477 333078 32049
16184 176930 -192889 -138032 250526 -8504 151415 -43071 181253 66779 168267 201012 254429
16173 254429 -288842 404413 155084 125258 136762 -331335 -135089 153801 416467 436388
16163 436388 265397 41884 40371 398671 18385 -15621 -41587 -130303 -284269 -255007 89655
16151 196057 -39435 24124 -239309 -155704 189569 221895 204179 -72147 240054 -134133 -11044
$$ packed form
16229A80184L34148k24976H2714K2646J74443d7383E1266b0778C17246I3360a31022
16217B29892m4909e9340B917K95613b4144B20078I2130M2601C2084O5863J35872
16206B33819l6884a31871I8983a12561A23908L48863a18944B87715C8812g000
16195E28658A27918o2768K08539h9267A33564K09892b28658D03477p0399C2049
16184A76930a92889N4857B50526h504A51415d3071A81253F6779J01488L2745N3417
16173B54429b88842D04413A55084k9826J1504c31335a35089A53801K62666J9921
16163D36388j70991D1884j513L58300A8385a5621k5966q8716j53966K9262H9655
16151A96057c9435B4124b39309Q3605A89569L2326j7716g2147B40054a34133a1044
$$ plain form
16139 -128376 130966 -265140 19969 -137287 148155 220793 -144528 48209 -7971 131366
16128 -56744 -32456 -240733 -39616 -21318 -215521 -14570 -25320 -154748 -24582 -277607 -18248
16116 135256 -107299 78599 -142283 -336780 131883 66354 52845 -201880 210421 142303
16106 142303 -78678 -64360 157098 118370 294551 -131468 41573 76630 466740 -277794
16095 -112367 70989 -108209 -28610 50821 -41615 -28070 -231989 -37700 -131177 -60646 341005
16083 -256017 228700 -15048 -133350 -85670 -67337 51552 -147714 -24789 112182 -83359 116076
16071 -168206 53085 -148860 84190 64447 -70737 73985 26331 -86522 274638 165630 257061
16060 257061 115004 91225 -111912 176550 44188 -74085 62523 159557 -329019 133441
$$ packed form
16139a28376A30966b65140A9969a37287A48155P2638a44528D8209g971A31366
16128e6744K4288k08277c9616J8298j94203a4570j0750j29428b4582k53025a8248
16116A35256a07299G8599a42283j94497A31883o5529j3509b01880B10421o8118
16106A42303g8678J4318A57098l8728J76181a31468D1573L5057L90110b77794
16095a12367G0989a08209b8610E0821d1615J3545k03919c7700r3477f0646C41005
16083b56017B28700a5048j18302M7680J8333E1552a47714b4789A12182h3359A16076
16071a68206E3085a48860H4190j9743g0737G3985B6331h6522B74638j09008R1431
16060B57061A15004k3779a11912A76550D4188g4085F2523R7034c29019A33441
$$ plain form
16049 211227 226908 -79193 134536 -73296 -89224 -23831 309804 42205 -14984 -73570 51972
16037 52456 -84494 11995 266188 -69129 -440136 281175 -94882 -192275 -138988 -93434 43056
16025 -109102 -153204 -269981 32701 -365051 64640 56472 248043 -13512 -222365 80494 125446
16014 125446 -86666 -156666 179811 -157292 292522 -8657 6682 -272186 -228667 -141626 69245
16002 158678 359799 -24919 -85897 -55487 -47282 41392 3699 -334839 -210475 -252060 -325514
15991 -325514 -283976 -60003 -83832 -56674 107230 -198272 -198414 168874 -4799 175237 119610
15980 119610 7787 92193 72420 217634 116316 -123965 -26157 41503 -257255 35673 391540
15969 391540 -96508 65616 -249061 71910 -182271 -92924 327385 192136 250207 -76236 -252004
$$ packed form
16049B11227J5681g9193A34536g3296j5928b3831C09804D2205a4984n8586E1972
16037E2456h4494A1995K54193f9129l71007B81175i4882r7393N3287M5554D3056
16025a09102m4102j16777C2701c65051F4640q168J91571a3512k08853H0494M4952
16014A25446h6666p0000A79811a57292B92522h657F682b72186M3519Q7041F9245
16002A58678K01121b4919o0978L0410Q205D1392C699c34839J24364m1585p3454
15991c25514M1538f0003k3829K7158A07230a98272j42A68874d799A75237n5627
15980A19610G787Q4406j9773J45214j01318a23965b6157D1503b57255C5673L55867
15969C91540i6508F5616b49061G1910a82271Q9347C27385j35249N8071g6236j75768
$$ plain form
15958 -252004 64330 -17350 -240618 -252094 -4858 -137690 -10621 -329015 366407 -208644 -311167
15947 -311167 -124718 -276907 -201067 -199815 -182316 41610 -91645 -59545 -114254 -105877 45753
15935 -48803 -224772 183638 -145954 -234695 -169899 -179977 -65744 226019 -180693 -173008 99381
15923 -275718 26478 101160 -232141 -172493 -94083 -216560 -416848 109525 184672 -220880
15912 -86753 234993 50041 -283954 -458032 -56834 15208 66902 -142783 -246238 221738
15901 -21978 354189 -45856 -275529 262995 -218683 154127 -333925 189514 87845 -54382
15890 -113509 -76418 111233 38587 -128761 -4582 -281542 -135635 -60302 -107932 320456 -114450
15878 -103100 -48677 -113637 -113382 250046 126675 21331 -43401 -120928 168752 -96866 102166
$$ packed form
15958b52004F4330a7350k23268j1476d858j32832a0621l18394C66407b08644j02523
15947c11167a24718j52189P5840J252J7499D1610i1645L2100n4709Q377D5753
15935d8803j75969A83638a45954q8741O4796j0078f5744B26019a80693P685I9381
15923b75718B6478P4682b32141N9648P8410j22477k00288A09525P5147b20880
15912h6753B34993E0041b83954j74078e6834A5208N1694a42783j03455B21738
15901b1978C54189d5856k29673B62995b18683A54127c33925A89514H7845e4382
15890a13509L7091A11233C8587a28761d582k76960a35635f0302m7630C20456a14450
15878a03100d8677o4960K55B50046j23371B1331d3401p7527A68752i6866A02166
$$ plain form
15866 -103984 -338786 -599233 -16781 -62648 -184076 226197 122883 -109623 -195456 70985
15855 412153 205812 -376497 -229390 -147538 230660 -95984 -136488 113716 -52040 -48074 -352603
15844 -352603 -280208 197817 -66252 -99661 73428 -219489 -148169 201984 56114 -100038 225404
15832 -69104 -73172 -481832 -158634 -122166 -6237 32736 208057 -19977 -73113 -240614 233240
15820 130552 -309193 -333196 -171759 -34654 -184092 -56784 -31625 164047 22143 43444 60579
15809 60579 60517 -42191 381389 93325 14921 -147245 -38867 -5683 -143376 -212888 -52259 24124
15796 -230765 -56471 308456 100432 -148815 399593 171286 -144733 97501 -344260 249427
15785 -268 -66422 -290666 -170740 -41724 230250 59981 84464 133645 -209695 167331 -447528
$$ packed form
15866a03984k34802k60447a6781m5867j21428B26197j03314a09623q5833G0985
15855D12153B05812c76497J47107Q1852B30660i5984m0504A13716e2040L966l04529
15844c52603P2395A97817f6252l3409G3428b19489P1320B01984E6114a00038B25404
15832f9104m068m08660a58634L6468f237C2736J75321a9977n3136j67501B33240
15820A30552c09193k4003J61437c4654j49438e6784K5159A64047B2143K1301J7135
15809F0579o2d2191C81389I3325A4921a47245c8867e683j37693o9512e2259B4124
15796b30765e6471C08456A00432a48815C99593A71286a44733I7501c44260B49427
15785b68o6154k24244J19926d1724B30250E9981K4483M9181b09695A67331d47528
$$ plain form
15773 -93899 90212 88673 133922 -149799 147143 -167868 -18931 -119960 68330 -82583 -106735
15762 -106735 30190 -412675 -125682 -96451 -83818 -131239 157258 -390828 267083 73116
15751 28111 66451 -236319 -94959 47995 113468 -14912 76096 195867 429189 41978 76278
15740 76278 -72979 20554 -291627 55941 -48967 -122186 -73573 28979 -83408 135157 -72047
15728 -223377 -54973 -26037 184544 196407 73575 128890 -76394 87851 152901 276469 -133872
15716 -136086 -94214 -239622 -58595 -186889 51940 -84269 -265998 -258371 -113576 -155404 -83299
15705 -83299 -229938 492681 -86742 -90194 -54462 70966 -5336 29327 -87372 68459 -107998
15693 49539 -272479 7249 128310 -252501 -98269 -181481 -40880 -138401 212441 -357817 22037
$$ packed form
15773i3899I0212j539M5249a49799A47143a67868a8931j01029F8330h2583k4152
15762a06735C0190d12675a25682K9231J2633m7421A57258c90828B67083G3116
15751B8111L8340b36319i4959D7995O5473a4912G6096J19771K33322D1978L4300
15740G6278g2979B0554b91627E5941d8967p3219M8613B8979h3408A35157g2047
15728b23377e4973b6037A84544J1863G3575N5315g6394H7851O5050J23568a33872
15716a36086M1872j45408e8595j28294E1940h4269j81729P627a13576m1828P2105
15705h3299j46639D92681h6742l452L5732G0966e336B9327h7372F8459a07998
15693D9539b72479G249J21061b52501i8269q3212d0880r7521B12441c57817B2037
$$ plain form
15681 -153242 -235938 18150 -18248 130258 -160805 74203 -229588 18665 -309164 200469
15670 -284765 7003 -70138 -160928 55688 -153066 -236461 -23548 -322469 -49823 -123607 -101222
15659 -101222 -250079 -289112 127840 100575 207020 134439 281700 -41183 26565 -224483
15648 -113976 183524 50395 159699 -142458 159132 -77484 -206335 -144979 -367728 -129834
15637 217515 -326894 -38572 403116 -6547 64583 -11682 218524 -182128 -73040 37607 -8575
15625 226016 -236974 -141913 62234 -43351 -35744 60004 190542 -142922 147679 -284330 -173948
15614 -173948 -147745 153771 43754 -86983 -200368 11546 66029 -52268 -110915 2529 -212179
15602 -67097 -109561 -359633 -214414 -77442 -51519 63514 57392 110164 -74837 95065 31423
$$ packed form
15681a53242q2696A8150a8248A30258a60805G4203b29588A8665c09164B00469
15670b84765G003g0138r0790E5688a53066q3395b3548k98921d9823p3784K2385
15659a01222j48857l9033A27840k7265J06445p2581J47261d1183B6565b24483
15648a13976A83524E0395J09304a42458A59132g7484j28851O1356k22749a29834
15637B17515c26894c8572D03116f547F4583a1682B18524a82128g3040C7607h575
15625B26016b36974R5061F2234d3351P607F0004J30538a42922A47679b84330J10382
15614a73948K6203A53771D3754h6983j13385A1546N4483e2268n8647B529b12179
15602f7097m2464k50072J45219g7442K5923F3514o122N2772g4837I5065C1423
$$ plain form
15590 10382 24464 -396333 376141 -25931 170799 177836 122341 270109 201284 -54576 -48195
15579 -48195 202053 -246749 -107187 248486 -273625 -134611 -168497 -211828 18967 85993
15569 85993 50151 165325 182828 246675 -177461 -14335 -208842 128385 112327 -80272 326395
15557 7339 -10773 117066 -189260 -49807 12394 -77573 -243195 4076 -54969 -22678 -364853
15546 -364853 91637 163581 46480 138981 35139 102938 -166731 -276383 71056 234581 40426
15534 253727 -268016 42981 19946 -330416 -110896 -136598 -13611 51409 -189622 -334108
15524 -334108 126261 130858 96675 -35220 18723 -323437 250379 -78783 -179452 -355439 124707
15512 149484 181241 308477 -32903 -108151 -201619 -54972 -161910 234582 -72729 -144409 29225
$$ packed form
15590A0382J4082c96333C76141b5931A70799P037n5495J47768o8825e4576O381
15579d8195B02053b46749a07187B48486b73625a34611l3886m3331A8967O7026
15569H5993l5842J15174J7503O3847a77461a4335j94507A28385j6058h0272C26395
15557G339a0773A17066a89260d9807A2394g7573j65622D076e4969b2678l42175
15546c64853I1637P1944D6480R2501C5139O7799a66731j09652G1056J63525D0426
15534B53727b68016D2981A9946c30416a10896k5702a3611E1409a89622j44486
15524c34108A26261M597l4183c5220A8723c23437B50379g8783j00669j75987A24707
15512A49484L1757J27236c2903p5248r3468e4972j06938B34582g2729p1680B9225
$$ plain form
15500 146190 -165612 11220 -19668 -180125 -15581 -193453 72110 83083 -247450 -98280 -18391
15488 -302020 -191331 28703 195910 281295 60785 214735 619784 168101 188820 90236
15477 216133 -294923 41507 420102 120685 -174307 -40623 -215566 -127492 7287 216820
15467 216820 89311 -144758 -62342 -362180 -258361 -54799 9436 45410 375485 88651 195079
15456 195079 -17849 -235073 62678 -249186 253288 47269 76190 -18355 310549 -171994
15445 16712 102679 729 -128179 -209211 148682 -213226 178882 80114 39381 192662 -425816
15433 6296 222438 -180626 -29868 -88370 -364917 138086 111854 -136266 227210 -164498
15422 65523 -184572 279044 63808 190967 -153559 -70415 57022 -145120 228663 -44726
$$ packed form
15500A46190a65612A1220a9668j60457a5581j77872G2110J0973b47450i8280a8391
15488c02020J10689B8703J67207Q5385F0785J53950M05049A68101K0719I0236
15477B16133b94923D1507L78595A20685a74307d0623j74943Q8074G287K09533
15467B16820H9311a44758f2342k99838J03819e4799I436L5974L30075H8651J06428
15456A95079a7849k17224F2678b49186B53288D7269K8921a8355C10549a71994
15445A6712Q5967G29a28179q1032A48682b13226A78882H0114C9381J53281d25816
15433F296K16142a80626b9868n8502k76547A38086k6232a36266B27210a64498
15422F5523a84572B79044F3808J27159a53559g0415E7022a45120B28663d4726
$$ plain form
15411 -44675 83930 57102 71517 68214 215534 57975 22168 -200959 -129365 274279 -197595
15399 -141997 66495 -157032 15562 -3331 -334027 73073 223307 339534 127468 -271660
15388 -252948 142486 107905 164174 -163038 65801 -8273 169200 52356 -35468 -360097 228406
15376 -117543 -428304 180849 198226 100027 -318205 -164131 -300917 518305 -229424 129510
15365 463476 323865 -89177 113538 198648 -48070 -105636 -188706 373230 -221068 -194909 482200
15353 53340 79161 356376 5454 650233 -33735 195760 458750 301675 17198 86843 -128234
15341 -266127 -28787 196577 364788 -81399 -144274 179668 -343715 -211089 -253556 33296
15330 312201 47008 161618 317755 -124289 -226371 112154 15308 -196554 140089 -55259
$$ packed form
15411d4675H3930k6828J4415l303J47320E7975B2168b00959P1594B74279a97595
15399a41997F6495a57032A5562c331l30696G3073J50234J16227A27468b71660
15388b52948A42486l4581N6269a63038F5801h273A69200E2356c5468l24629B28406
15376a17543l10761A80849J7377r8199c18205J54074j36786E18305b29424A29510
15365D63476j39611h9177A13538Q5110d8070n7566q3070C73230b21068K6159D82200
15353E3340K5821K77215E454O44779c3735A95760K62990j57075A7198O9645a28234
15341b66127b8787A96577J68211h1399o2875A79668c43715J32626m2467C3296
15330C12201D7008J14610J56137a24289j02082A12154A5308a96554A40089e5259
$$ plain form
15319 -161335 82698 236481 143572 -97764 -170104 -84956 275588 -279589 272845 -176889
15308 304702 210836 27954 211171 -49077 -432314 117118 162578 -41303 240139 202328 507940
15297 507940 275741 36262 -145070 218951 -63214 -170460 133606 36837 -420333 -123587
15286 202093 -129521 234557 155199 -78054 315657 -99441 -68664 -108247 42614 85672 190365
15275 190365 66094 -7188 67606 21919 37048 213837 110901 -59842 -67181 -243884 170013
15263 125746 -133047 129105 115449 238584 -210619 -125479 -51809 77310 117485 -188875
15252 -267434 -138323 386044 259030 466034 568811 1293139 2624385 1832432 2056505
15243 2056505 1737805 928240 76908 463268 399839 -157645 63580 -167682 -57981 -45633
$$ packed form
15319a61335H2698J53783r2909i7764p2340h4956B75588b79589B72845a76889
15308C04702r3866B7954J83217d9077l83237A17118M5460d1303B40139l7811L05612
15297E07940k32199C6262a45070B18951f3214j07246A33606C6837d20333a23587
15286B02093a29521B34557p9358g8054C15657i9441L0777l9583D2614M3058J04693
15275A90365F6094g188F7606B1919J5129J76789j02936e9842p339j76703A70013
15263A25746a33047A29105j3656J23135b10619Q5140e1809G7310M0175a88875
15252b67434J29111C86044j27014K07004J02777P24328J331246p91953K24073
15243B056505l18700q09565G6908L86360o3429a57645F3580a67682e7981J2348
$$ plain form
15233 -45633 8439 30725 100865 -140225 37326 168548 470648 32751 172790 18506 -100241
15221 -100615 92943 162976 63274 92244 71200 178936 -197937 145713 201640 250134 -118857
15209 1141 -99346 20049 269854 99493 128584 -221985 161682 -104124 -266430 -229217 273132
15197 -47434 3661 149780 -131104 -125201 146725 266330 96385 88843 239649 34793 -67677
15185 -5474 -93602 -215354 -94335 54584 -39025 83719 72091 -126977 -49251 89328 25857
15173 -54455 -283808 348516 220257 198633 276034 286819 -173138 249873 202372 -12779 112391
15161 -38918 -20316 -15728 291857 259223 -68995 106361 292495 38068 -308634 -105855 13669
15149 582196 24862 206556 -155340 123054 175301 -34517 280687 256267 -98246 -39230 288209
$$ packed form
15233d5633H439K2286P0140a40225C7326J31222L02100C2751J40039A8506a00241
15221a00615I2943P0033F3274K8970k1044J07736a97937A45713N5927M8494a18857
15209A141i9346B0049K49805I9493K9091b21985A61682a04124j62306L7213B73132
15197d7434C661J46119a31104N903A46725J19605I6385p542J50806C4793f7677
15185e474q8128j21752i4335E4584c9025H3719j1628a26977d9251H9328B5857
15173e4455k29353C48516j28259k1624P7401J0785a73138B49873m7501a2779A12391
15161c8918J8602M588B91857l2634f8995A06361J86134C8068c08634a05855A3669
15149E82196B4862J81694a55340A23054N2247c4517B80687k4420i8246c9230B88209
$$ plain form
15137 -57982 194306 170930 186653 106453 374749 -193752 170518 205617 6838 288360 425496
15126 425496 -66494 129689 95271 339875 250117 34920 105216 202937 164461 103632 269764
15115 269764 451857 -186757 300834 124570 207272 -213133 -25678 22290 123606 71910
15105 71910 316150 69142 -23803 332395 384695 131750 268791 -217334 159519 -116461
15094 40625 287162 -109496 96752 312339 254944 -92567 258619 13846 252437 248586 353578
15083 353578 24969 259167 113509 207645 -10521 -79538 -58657 194953 240640 141378 197627
15072 197627 122550 175895 53021 455785 24252 -216117 280321 198219 -110447 40275 332186
15061 332186 20282 376373 288537 346024 376678 156871 15053 23819 360567 -107417 252946
$$ packed form
15137e7982A94306k3376J5723q0200K68296a93752A70518L5099F838K81522J37136
15126D25496f6494A29689l4418K44604q9758C4920P0296R7721l8476o0829J66132
15115B69764J82093a86757C00834A24570Q2702b13133b5678B2290J01316n1696
15105G1910K44240F9142b3803C32395N2300A31750J37041b17334A59519a16461
15094D0625K46537a09496I6752K15587n7395i2567B58619A3846K38591l851J04992
15083C53578B4969K34198A13509R4136a0521o9017K0881A94953M5687r9262N6249
15072A97627p5077N3345E3021M02764B4252b16117B80321q2102a10447D0275K91911
15061C32186B0282L56091q7836N7487L0654A56871A5053Q766L36748a07417B52946
$$ plain form
15049 -54816 117963 -236671 339889 244693 162897 -220516 105301 -14269 485292 76007
15038 116846 175617 258463 -64717 -114837 262173 162084 454189 400362 317727 432793 -378401
15026 210840 322396 446527 24655 291111 196595 316829 265559 232509 -233635 235915
15015 576015 -148836 260137 98926 329936 97415 17492 529117 146977 -7007 348847
15004 216715 231947 3749 368919 -1205 307264 438876 344456 31184 318595 457624 43857
14992 129993 150095 429975 -30846 274725 85379 86080 299930 205656 15057 558458 67980
14980 422501 62139 272286 259597 572577 104001 268340 -185603 445131 18990 134370
14970 134370 200776 122110 -25391 644753 200667 -28624 -80523 240851 298187 171322 325648
$$ packed form
15049e4816A17963b36671C39889r5196q1796b20516A05301a4269D85292G6007
15038A16846N8771Q2846f4717n0120B62173j00089K92105n3827q2635J15066c78401
15026B10840J11556J24131B4655K66456r4516J20234n1270l3050b33635B35915
15015E76015a48836B60137I8926K31010I7415A7492N11625A46977g007C48847
15004B16715J5232C749L65170a205C07264J31612r4420C1184K87411J39029D3857
14992A29993K0102K79880c0846B74725H5379P01K13850r4274A5057N43401F7980
14980D22501F2139K10147j2689L12980A04001J64339a85603D45131A8990J15380
14970A34370O6406p8666b5391F44753B00667b8624n1899B40851N7336j26865J54326
$$ plain form
14959 325648 159404 -62248 200908 100352 167476 294148 108900 266326 525225 418046
14949 418046 264093 -32188 368551 312802 377219 176825 182344 475494 331007 303480 269673
14938 269673 112986 456381 -203407 543988 87491 120072 295713 -80331 30493 430743
14928 430743 136084 199971 181238 298485 318644 95212 236902 328112 288221 315933 192041
14917 192041 159113 78946 103162 630100 14986 120471 477577 433273 239962 282847 92595
14905 189166 297609 73905 321413 316941 278132 193135 448641 176249 633069 337931
14895 337931 405083 -153422 321809 191165 -229797 6202 260380 306831 211601 129997 302258
14884 302258 99661 244346 450336 206289 333854 128103 -100149 256258 748669 365498
$$ packed form
14959C25648A59404f2248B00908A00352O7124J26672A08900J57426K58899j07179
14949D18046j53953c2188C68551n5749O4417A76825N519K93150j44487k7527l3807
14938B69673A12986L43395b03407E43988H7491L2581J75641h0331C0493M00250
14928D30743A36084O3887j8733J17247K0159I5212J41690R1210l9891K7712j23892
14917A92041l2928G8946K4216N26938A4986J05485L57106m4304j93311M2885I2595
14905A89166J08443G3905K47508m472l8809q4997K55506A76249M56820k95138
14895C37931O7152a53422C21809j30644b29797F202K54178M6451r5230q1604J72261
14884C02258I9661J44685K05990B06289J27565A28103a00149B56258M92411C65498
$$ plain form
14873 586798 107556 134626 204825 269043 230901 67184 564121 366753 196114 189292 -2219
14861 434164 732660 157172 200121 275497 637867 479972 345885 260319 272426 95729
14850 62731 388277 375332 633371 357923 496127 147013 471692 464217 378036 514070
14840 514070 342095 462361 121564 806503 218099 454256 571760 244464 104499 436124
14830 436124 299389 272197 361500 359356 175878 431684 203938 473882 392756 659506
14820 659506 289829 603034 498427 449691 969177 584715 313605 609467 402848 191861
14809 414379 550865 142889 215546 253440 667441 434816 642894 344526 675609 330695
14798 434285 680630 330242 455150 687067 702357 619684 407159 819496 170241 450365
$$ packed form
14873E86798A07556K7070P0199O4218l8142F7184M96937j97368j70639o822b219
14861D34164K98496A57172M2949P5376L62370j57895j34087q5566J2107I5729
14850F2731L25546j2945K58039k75448J38204A47013L24679p475q6181J36034
14840E14070j71975J20266A21564O84939B18099K36157J17504B44464A04499L31625
14830D36124j36735k7192Q9303k144A75878K55806B03938K69944q1126K66750
14820F59506B89829L13205j04607m8736N19486l84462k71110K95862k06619A91861
14809D14379J36486A42889P2657L7894M14001k32625K08078k98368L31083C30695
14798D34285K46345C30242J24908K31917J5290q2673k12525M12337A70241K80124
$$ plain form
14788 450365 887483 674874 468152 385073 674167 539378 296083 519508 308929 534627
14778 534627 440453 788847 680200 945416 399446 246111 406973 293768 541117 851272
14768 851272 546112 463593 633087 813900 421645 826488 330358 489924 689033 481884
14758 481884 380713 698421 183847 662211 691922 610146 552834 242121 422852 319643
14748 319643 613198 711824 889828 660462 819911 695519 402102 448522 1072570 464323
14737 664832 464031 815353 458947 554648 522126 806513 447889 319767 893118 1004279
14727 1004279 660599 837078 758247 791152 967455 582765 465730 490110 1046815 920121
14717 920121 1011082 892779 568936 589194 720112 786944 722616 668471 644910 1040308 812129
$$ packed form
14788D50365M37118k12609k06722q3079K89094j34789k43295K23425k10579K25698
14778E34627r4174L48394j08647K65216C99446j53335J60862j13205K47349L10155
14768H51272l05160q2519J69494J80813l92255M04843C30358J59566J99109k07149
14758D81884j01171L17708A83847M78364K9711q1776n7312B42121J80731j03209
14748C19643K93555R8626J78004k29366J59449j24392k93417M6420O24048D64323
14737F64832k00801L51322l56406R5701l2522K84387l58624j28122N73351J11161
14727A004279l43680J76479p8831L2905J76303l84690j17035K4380N56705j26694
14717I20121R0961j18303l23843K0258J30918O6832o4328n4145k3561L95398k28179
$$ plain form
14706 812129 714032 917326 620199 578735 702825 797756 615415 840002 798988 679846
14696 679846 712704 612466 679971 937160 596582 658919 849692 1142286 1231374 862877
14686 862877 452867 866060 834317 1112965 783960 956678 1009609 1007772 861413 1125576
14676 1125576 1072201 987193 915434 831728 928120 1064175 1051904 876363 946241 1085456 1017020
14665 1017020 1156648 1246716 772288 958611 1113006 932159 917676 1119249 846383 871479
14655 871479 1109143 1187094 735088 1036063 975135 810939 1108584 1142366 1166202 1185179
14645 1185179 1436936 1077084 1082012 1159275 1074199 1032619 846945 1105713 1056331 1269299
14635 1269299 1132264 1352550 1270581 1294996 1275424 1101573 1067632 1082324 1134464 1323465
$$ packed form
14706H12129r8097K03294k97127m1464J24090R4931j82341K24587m1014j19142
14696F79846L2858j00238O7505K57189l40578O2337J90773K92594Q9088l68497
14686H62877m10010M13193l1743K78648l29005J72718N2931j837j46359K64163
14676A125576n3375q5008p1759q3706R6392J36055j2271j75541O9878J39215o8436
14665A017020J39628R0068m74428J86323J54395j80847j4483K01573k72866K5096
14655H71479K37664P7951m52006L00975o0928j64196K97645L3782K3836J8977
14645A185179K51757l59852M928P7263q5076m1580j85674K58768m9382K12968
14635A269299j37035K20286q1969K4415j9572j73851l3941J4692N2140J89001
$$ plain form
14625 1323465 1370305 1247227 1264817 1333047 1027143 1203688 1448491 1498639 1194582 1250126
14615 1250126 1345932 1328912 1197073 1303363 1405907 1242344 1551067 1409894 1761413 1527450
14605 1527450 1343073 1390451 1622784 1551510 1464621 1371699 1592837 1378148 1492447 1817337
14595 1817337 1691396 1520514 1501825 1631627 1441562 1608865 1500328 1743883 1620244 1581438
14585 1581438 1689652 1573295 1953016 1815818 1848618 2077107 2021561 2024319 1660275 1803958
14575 1803958 2039348 1532822 1885811 1991249 1994163 1953448 1735104 2203666 1889357 2393407
14565 2393407 2042946 2363674 2318492 2360619 2534201 2775950 2385021 2906192 2763991 3189847
14555 3189847 3233465 3124457 3611112 3814395 4533919 5685951 7712744 11701520 19835598
$$ packed form
14625A323465M6840j23078J7590O8230l05904J76545K44803N0148l04057N5544
14615A250126R5806j7020j31839J06290J02544j63563L08723j41173L51519k33963
14605A527450j84377M7378K32333p1274q6889r2922K21138k14689J14299L24890
14595A817337j25941j70882j8689J29802j90065J67303j08537K43555j23639l8806
14585A581438J08214j16357L79721j37198L2800K28489n5546K758l64044J43683
14575A803958K35390n06526L52989J05438K914m0715k18344M68562l14309N04050
14565B393407l50461L20728m5182M2127J73582K41749l90929N21171j42201M25856
14555C189847M3618j09008M86655K03283P19524J152032K026793L988776Q134078
$$ plain form
14546 19835598 31921202 41033138 25186972 11954269 9204223 5245357 3057518 2382613
14538 2382613 2249260 2131745 1980852 2182149 1941449 2063400 2012188 1990387 1926587 2027807
14528 2027807 2273034 2163141 2174869 2465958 2158311 2310424 2244122 2374873 2323617 2280499
14518 2280499 2454795 2786968 2339972 2785996 2307737 2614742 2472090 2612138 2846506
14509 2846506 2693009 2740559 2682732 2847240 2839395 2753050 2504888 2813309 2811818 2852608 2566627
14498 2566627 3193570 3151583 2919220 2760036 3325929 3372817 2962489 3411118 3131402 3624115
14488 3624115 3137825 3304191 3460963 3513102 3436340 3585971 3442989 3431836 3737276 3884737
14478 3884737 3646584 3840550 3697485 3865161 3936102 4164576 3983775 3999962 4097387 4221554
$$ packed form
14546A9835598J2085604R111936j5846166A1954269k750046l958866k187839o74905
14538B382613j33353j17515j50893K01297k40700J21951n1212k1801o3800J01220
14528B027807K45227j09893J1728K91089l07647J52113o6302J30751n1256m3118
14518B280499J74296L32173m46996M46024m78259L07005j42652J40048K34368
14509B846506j53497M7550n7827J64508p845q6345k48162L08421j491M0790k85981
14498B566627O26943m1987k32363j59184N65893M6888m10328M48629k79716M92713
14488C624115m86290J66366J56772N2139p6762J49631j42982j1153L05440J47461
14478C884737k38153J93966j43065J67676P0941K28474j80801J6187R7425J24167
$$ plain form
14468 4221554 4199512 4108760 4286518 4161981 4205563 4342582 4205541 4420683 4453579 4700032
14458 4700032 4442870 4588996 4755722 4488503 5000544 4947809 4946118 4772730 5012358 5243147
14448 5243147 5328634 4946926 5406565 5151843 5768212 5477104 5695444 5566885 5824644 5932820
14438 5932820 5772539 5953524 6200699 6045535 6109531 6347272 6477364 6287922 6707574 6678366
14428 6678366 6427177 6698532 6724358 6887068 6962553 7003348 6889424 7291696 7270772 7505776
14418 7505776 7542559 7850677 7557217 7963790 8294236 8085325 8728107 8574471 8576406 9113622
14408 9113622 8394496 9128711 9249124 9255305 9537490 9419791 9831589 9963168 10198949 10059053
14398 10059053 10368830 10471937 10827017 10668968 10755143 11374931 11485296 11257145 11840413
$$ packed form
14468D221554k2042r0752J77758j24537M3582J37019j37041K15142L2896K46453
14458D700032k57162J46126J66726k67219N12041n2735j691j73388K39628K30789
14448E243147Q5487l81708M59639k54722O16369k91108K18340j28559K57759J08176
14438E932820j60281J80985K47175j55164O3996K37741J30092j89442M19652k9208
14428F678366k51189K71355K5826J62710P5485M0795j13924M02272k0924K35004
14418G505776L6783L08118k93460M06573L30446k08911O42782j53636J935N37216
14408I113622p19126P34215J20413O181K82185j17699M11798J31579K35781j39896
14398A0059053L09777J03107L55080j58049Q6175O19788J10365k28151N83268
$$ plain form
14389 11840413 11877079 12189727 12491080 12485606 12943774 12942017 13592654 13510551 13299956 13911415
14379 13911415 14037180 14618295 14628952 15306336 15402579 15196310 15547499 15864315 16665898 16676954
14369 16676954 16854343 17376045 17805915 18355074 18381338 18859108 19367983 19505842 19807154
14360 19807154 20323001 20804814 21527540 21772731 22120422 22748707 23526488 24452134 24378355
14351 24378355 25392115 25737110 26219433 27013912 27718511 28265076 28731791 30198554 30676571
14342 30676571 31165899 32454613 33497564 34042637 34980009 36219809 37204940 38271962 39458602
14333 39458602 40667504 41763065 42823626 44338691 45802119 47119092 48788501 50416772
14325 50416772 52042977 53916059 55993101 57604408 59524342 61955558 64210646 66744929
$$ packed form
14389A1840413L6666L12648L01353n474M58168j757O50637q2103k10595O11459
14379A3911415J25765N81115J0657O77384R6243k06269L51189L16816Q01583J1056
14369A6676954J77389N21702M29870N49159K6264M77770N08875J37859L01312
14360A9807154N15847M81813P22726K45191L47691O28285P77781R25646p3779
14351B4378355J013760L44995M82323P94479P04599N46565M66715J466763M78017
14342C0676571M89328J288714J042951N45073R37372J239800R85131J067022J186640
14333C9458602J208902J095561J060561J515065J463428J316973J669409J628271
14325E0416772J626205J873082K077042J611307J919934K431216K255088K534283
$$ plain form
14317 66744929 68993883 71706597 74244965 77256783 80396699 83402807 86887535 90431032
14309 90431032 94442692 98754324 102871426 107323222 112305755 117611880 122585888 128788476
14301 128788476 134943305 141867831 148427768 156231773 164398204 173164380 181544799 191355355
14293 191355355 201715214 212456703 224001838 235902426 248638513 261906793 275952762
14286 275952762 290732327 306293678 322377979 338763171 355318345 372351838 389269464
14279 389269464 405615183 421158461 436070418 449338151 460417027 469551862 475304619
14272 475304619 478150747 477270198 476250849 477011821 476522806 472996859 465822446 455652453
14264 455652453 443614031 430216466 415389825 399490009 382850933 366038916 349083196
$$ packed form
14317F6744929K248954K712714K538368L011818L139916L006108L484728L543497
14309I0431032M011660M311632M117102M451796M982533N306125M974008O202588
14301A28788476O154829O924526O559937P804005Q166431Q766176Q380419R810556
14293A91355355J0359859J0741489J1545135J1900588J2736087J3268280J4045969
14286B75952762J4779565J5561351J6084301J6385192J6555174J7033493J6917626
14279C89269464J6345719J5543278J4911957J3267733J1078876R134835N752757
14272D75304619K846128q80549j019349P60972m89015l525947p174413j0169993
14264D55652453j2038422j3397565j4826641j5899816j6639076j6812017j6955720
$$ plain form
14257 349083196 332318469 315878946 299919636 284586885 270718131 257407955 244169571
14250 244169571 231580163 219460691 208063625 197215050 187334804 177684031 169290827
14243 169290827 161091493 153253201 145937419 138887461 132405679 126578181 120929294 115593580
14235 115593580 110505184 105862711 101176646 97079410 93494975 89365622 85575941 82422147
14227 82422147 79332689 75916511 73237318 70413875 67593173 65563010 63010820 60785052
14219 60785052 59096479 56527074 54831078 53023784 51344201 50250592 48542429 47264293
14211 47264293 45438206 43903991 42395373 41818135 40711775 40146985 38285037 37076971
14203 37076971 36185912 34792487 34246527 33251776 33252360 31472131 30901610 29966252 29220626
$$ packed form
14257C49083196j6764727j6439523j5959310j5332751j3868754j3310176j3238384
14250B44169571j2589408j2119472j1397066j0848575r880246r650773q393204
14243A69290827q199334p838292p315782p049958o481782n827498n648887n335714
14235A15593580n088396m642473m686065m097236l584435m129353l789681l153794
14227H2422147l089458l416178k679193k823443k820702k030163k552190k225768
14219F0785052j688573k569405j695996j807294j679583j093609j708163j278136
14211D7264293j826087j534215j508618n77238j106360n64790j861948j208066
14203C7076971q91059j393425n45960r94751N84j780229n70521r35358p45626
$$ plain form
14194 29220626 28760905 27938799 27221792 26524504 25912038 25054590 24501907 24194814 23681540
14185 23681540 22905057 22687500 21779382 21628582 20847959 20066576 20002800 19586229 19388352
14176 19388352 18784637 18253701 17900479 17903278 17270107 16720259 16763570 16201964 15979211 15559868
14166 15559868 15002096 14929293 14669366 14350230 14257895 13948419 13741476 13427750 13278000 13105312
14156 13105312 12695959 12984875 12361171 12059241 11717785 11702579 11486102 11296485 11047518
14147 11047518 10846544 10814582 11218439 10391119 10346267 10060527 9862717 9844158 9637633 9849409
14137 9849409 9516543 9381236 9105133 9125943 8823281 8753165 8676220 8482988 8172515 8138053
14127 8138053 8259396 7977002 7857553 7797233 7860239 7475968 7400669 7401618 7264779 7399888
$$ packed form
14194B9220626m59721q22106p17007o97288o12466q57448n52683l07093n13274
14185B3681540p76483k17557r08118j50800p80623p81383o3776m16571j97877
14176A9388352o03715n30936l53222K799o33171n49848M3311n61606k22753m19343
14166A5559868n57772p2803k59927l19136r2335l09476k06943l13726j49750j72688
14156A3105312m09353K88916o23704l01930l41456j5206k16477j89617k48967
14147A1047518k00974l1962M03857q27320m4852k85740j97810j8559k06525K11776
14137I849409l32866j35307k76103K0810l02662p0116p6945j93232l10473l4462
14127H138053J21343k82394j19449o0320O3006l84271p5299R49j36839J35109
$$ plain form
14117 7399888 7155846 6914725 6920119 7146407 6446677 6731324 6543642 6481568 6600136 6474771
14107 6474771 6346488 6154357 6061783 6212550 5709848 6013516 5802226 5410210 5671369 5620673
14097 5620673 5731620 5499282 5427975 5678269 5490251 5190080 4989035 5079893 5245543 5282453
14087 5282453 5147999 4703011 5033466 4646906 5101355 4735413 4608899 4559131 4516864 4453188
14077 4453188 4674577 4308945 4091763 4670625 4219054 4306042 4279725 4108469 4121072 4033271
14067 4033271 3955454 3844046 4324088 3932346 3811948 3668841 3708177 3718861 4004540 3734423
14057 3734423 3693481 3743021 3438016 3473013 3368927 3554924 3549905 3427272 3632797 3205827
14047 3205827 3236139 3633125 3282443 3037061 3090069 3238327 3103891 3397665 3170431 2934189
$$ packed form
14117G399888k44042k41121N394K26288o99730K84647j87682o2074J18568j25365
14107F474771j28283j92131r2574J50767n02702L03668k11290l92016K61159n0696
14097E620673J10947k32338p1307K50294j88018l00171k01045R0858J65650L6910
14087E282453j34454m44988L30455l86560M54449l65942j26514m9768m2267o3676
14077D453188K21389l65632k17182N78862m51571Q6988k6317j71256J2603q7801
14067D033271p7817j11408M80042l91742j20398j43107L9336J0684K85679k70117
14057C734423m0942M9540l05005L4997j04086J85997n019j22633K05525m26970
14047C205827L0312L96986l50682k45382N3008J48258j34436K93774k27234k36242
$$ plain form
14037 2934189 2907433 3023809 2973007 3452870 3081661 2917003 2888295 2990035 2649075 3080890
14027 3080890 2749943 3065954 2715768 2694785 2581478 2446399 2459131 2520316 2700974 2408450
14017 2408450 2473281 2529614 2398354 2256327 2218517 2609189 2439526 2438049 2360205 2395483 2305315
14006 2305315 2396746 2119425 2325521 2151156 2145976 1941357 2138990 2087017 2210628 1970265
13996 1970265 2239819 2105333 2319488 2003560 2222840 2392052 3026610 4274788 7129633
13987 7129633 14452603 26893097 40293626 29371575 15079723 8348673 6419834 4783788
13979 4783788 4129359 3884547 3395732 3105055 2915760 2930118 2531622 2622102 2534005 2321794
13969 2321794 2565390 2602006 2521521 2242012 2464848 2300945 2066934 1926562 2308920 1945658
$$ packed form
14037B934189k6756J16376n0802M79863l71209j64658k8708J01740l40960M31815
14027C080890l30947L16011l50186k0983j13307j35079J2732O1185J80658k92524
14017B408450O4831N6333j31260j42027l7810L90672j69663j477p7844L5278r0168
14006B305315R1431k77321K06096j74365n180k04619J97633n1973J23611k40363
13996A970265K69554j34486K14155l15928K19280J69212O34558J248178K854845
13987G129633P322970J2440494J3400529j0922051j4291852o731050j928839j636046
13979D783788o54429k44812m88815k90677j89295J4358l98496R0480q8097k12211
13969B321794K43596L6616q0485k79509K22836j63903k34011j40372L82358l63262
$$ plain form
13959 1945658 1909179 2195973 2165887 2279583 1826261 2027520 1605854 1909342 1606984 1618901
13949 1618901 1800005 1706589 1755392 1805542 1913540 1779941 1875313 2119220 1595305 1468876
13939 1468876 1760708 1508042 1695299 1700378 1925962 1339899 1668732 1641823 1862214 1330261
13929 1330261 1952758 1556711 1474247 1373465 1581414 1646381 1355268 1253812 1457848 1522510
13919 1522510 1511196 1191263 1543601 1341202 1663876 1528591 1149143 1405247 1955061 1029960
13909 1029960 1430795 1494342 1309002 1220408 1233678 1291592 1390162 1481047 1137173 1153786 1530304
13898 1530304 1043449 1288094 1276913 1200341 1169248 1389084 1181127 907024 1494300 1117649
13888 1117649 1315615 1243426 1026135 1081137 1437174 1137699 1084458 859813 1375320 1166332
$$ packed form
13959A945658l6479K86794l0086J13696m53322K01259m21666L03488l02358J1917
13949A618901J81104r3416M8803N0150J07998j33599R5372K43907n23915j26429
13939A468876K91832k52666J87257N079K25584n86063L28833k6909K20391n31953
13929A330261O22497l96047q2464j00782K07949O4967k91113j01456K04036O4662
13919A522510j1314l19933L52338k02399L22674j35285l79448K56104N49814r25101
13909A029960M00835O3547j85340q8594J3270N7914R8570R0885l43874J6613L76518
13898A530304m86855K44645j1181p6572l1093K19836k07957k74103N87276l76651
13888A117649J97966p2189k17291N5002L56037k99475n3241k24645N15507k08988
$$ plain form
13878 1166332 886994 1319938 1089020 978936 1279655 988970 1308339 1001072 996484 1145469
13868 1145469 1121195 1022940 1057186 1305120 1254628 957001 1211155 1047434 1218610 1123120
13858 1123120 1122722 952984 1148304 966368 825154 1028976 1109769 997668 959702 906830
13848 906830 929139 882302 959836 1055012 1267029 975553 976710 1198249 638806 885066 911389
13837 911389 1055494 870390 1013397 726438 753134 536036 595680 714253 653290 696662
13827 696662 764531 829919 957774 817265 1099992 1145966 559234 1057159 960352 574668
13817 574668 678248 639919 840839 964042 875928 497523 1055942 697595 1065673 717378
13807 717378 668909 753116 510686 975306 665727 507241 794267 671965 926007 383605
$$ packed form
13878A166332k79338M32944k30918j10084L00719k90685L19369l07267m588J48985
13868A145469k4274r8255L4246K47934n0492k97627K54154j63721J71176r5490
13858A123120l98j69738J95320j81936j41214K03822Q0793j12101l7966n2872
13848I06830K2309m6837P7534R5176K12017k91476J157K21539n59443K46260K6323
13837I11389J44105j85104J43007k86959K6696k17098N9644J18573o0963M3372
13827F96662O7869O5388J27855j40509K82727M5974E59234M97925r6807l85684
13817E74668J03580l8329K00920J23203q8114l78405N58419l58347L68078l48295
13807G17378m8469Q4207k42430M64620l09579j58486K87026j22302K54042C83605
$$ plain form
13796 633258 825320 940378 932987 827921 674913 845962 749544 737705 384816 953001
13786 953001 813172 821822 827255 539661 823632 80516 615620 479895 970341 967532 420510
13774 444580 721875 534332 759389 791284 840879 712052 530881 609491 773613 952606
13764 952606 728408 883935 489640 973638 447145 690491 626771 451923 723971 983710
13754 983710 1102933 603639 515564 540502 413095 818575 617686 638119 469210 518039
13744 518039 548518 769458 502309 772855 592767 760460 797237 523292 686954 614609
13734 614609 482457 746160 428437 416347 657393 286609 676610 689650 625149 419044
13724 419044 413969 628780 500085 817959 757924 728831 467146 611631 501405 515462
$$ packed form
13796F33258J92062J15058p391j05066j53008J71049r6418j1839l52889N68185
13786I53001j39829Q650N433k87594K83971H0516N35104j35725M90446k809D20510
13774D44580K77295j87543K25057L1895M9595j28827j81171P8610J64122J78993
13764I52606k24198J55527l94295M83998D47145K43346o3720j74848K72048K59739
13754I83710J19223m99294q8075K4938j27407M05480k00889K0433j68909M8829
13744E18039L0479K20940k67149K70546j80088J67693L6777k73945J63662p2345
13734F14609j32152K63703l17723j2090K41046B86609L90001J3040o4501k06105
13724D19044n075K14811j28695L17874o0035k9093k61685J44485j10226J4057
$$ plain form
13714 515462 687742 545740 680019 533694 287407 650508 441349 711053 646115 406817
13704 406817 478491 387411 256252 616182 394119 402595 888613 284425 369474 234057
13694 234057 443289 341049 603792 381088 488580 398727 484398 477534 295070 674661
13684 674661 605244 519317 566258 367857 725261 451618 423381 160357 283581 284448 294469
13673 294469 511114 297614 407465 455690 929856 533909 691083 254030 464578 279203
13663 279203 245846 280312 674953 376469 457021 488425 402238 535794 221217 233005 189308
13652 189308 331483 187020 359272 542482 305549 812851 417625 285305 466062 519605
13642 519605 426499 200707 142653 330457 468418 441594 137346 527316 402584 346403
$$ packed form
13714E15462J72280j42002J34279j46325k46287L63101k09159K69704o4938k39298
13704D06817P1674r1080j31159L59930k22063Q476M86018B84425Q5049j35417
13694B34057K09232j02240K62743k22704J07492q9853Q5671o864j82464L79591
13684F74661o9417q5927M6941j98401L57404k73643k8237A60357J23224Q67J0021
13673B94469K16645k13500J09851M8225M74166l95947J57174B54030K10548j85375
13663B79203l3357L4466L94641k98484Q0552L1404q6187J33556B21217J1788m3697
13652A89308J42175j44463J72252J83210k36933N07302l95226j32320J80757N3543
13642E19605r3106B00707n8054J87804J37961k6824A37346L89970j24732n6181
$$ plain form
13632 346403 317351 458852 485059 230127 405111 291049 316135 254349 400503 305063
13622 305063 83012 498689 207078 456857 342739 320795 325020 325412 336572 463907 624959
13611 624959 204250 193057 66061 265335 309384 350129 428970 234514 632546 254012
13600 370235 79149 745539 449520 471856 275610 289035 394361 304603 335417 440999
13590 440999 333245 146425 479775 298514 245304 97779 307585 695712 577433 234820
13579 332972 229302 278245 387147 255405 430878 144423 338666 471920 215865 438835
13569 438835 294097 587487 668735 218215 204009 85190 285982 278314 113933 421033
13559 421033 362038 68678 434870 658606 269125 127417 67335 243539 180572 271434
$$ packed form
13632C46403k9052J41501K6207B30127J74984j14062K5086o1786J46154r5440
13622C05063H3012M15677B07078K49779j14118k1944M225L92J1160J27335J61052
13611F24959B04250j1193F6061J99274M4049M0745P8841j94456L98032B54012
13600C70235G9149O66390k96019K2336j96246J3425J05326q9758L0814J05582
13590D40999j07754A46425L33350j81261n3210I7779K09806L88127j18279B34820
13579C32972j03670M8943J08902j31742J75473A44423J94243J33254B15865K22970
13569D38835j44738K93390Q1248B18215j4206H5190K00792p668A13933L07100
13559D21033n8995F8678L66192K23736B69125A27417o0082J76204o2967R0862
$$ plain form
13549 271434 334362 311379 549780 360062 -33549 83690 75783 328227 382976 170692 344841
13538 344841 104711 424883 282840 210999 98946 244305 490100 142082 266296 -144499
13527 -47368 310699 316955 130152 494595 -844 336185 377020 259522 432654 305272 619417
13516 619417 51134 356900 407507 141335 -92666 609795 483681 454980 368799 224490
13506 224490 297434 23630 338832 510233 195953 334024 318669 164357 91128 311269
13496 311269 103552 122461 130452 277307 68596 484093 196261 139399 162780 143202 221683
13485 221683 311253 279397 180336 383125 203178 204573 209101 378541 -122538 543859 292037
13474 292037 -115269 397290 521002 -23358 236152 -20938 207182 -121519 185267 330170
$$ packed form
13549B71434O2928k2983K38401j89718c3549H3690p907K52444N4749A70692J74149
13538C44841A04711L20172j42043p1841I8946J45359K45795A42082J24214a44499
13527d7368C10699O256A30152L64443h44C36185M0835j17498J73132j27382L14145
13516F19417E1134L05766N0607A41335i2666F09795j26114k8701q6181j44309
13506B24490P2944B3630L15202J71401A95953J38071j5355j54312p3229K20141
13496C11269A03552J8909P991J46855F8596M15497A96261n6862K3381j9578P8481
13485B21683Q9570l1856r9061K02789j79947J395M528J69440a22538E43859k51822
13474B92037a15269C97290J23712b3358B36152b0938B07182a21519A85267J44903
$$ plain form
13464 330170 585545 556373 197094 163510 309315 42628 193433 264828 300094 311415 40212
13452 -95957 260801 185204 -205281 -68087 325167 190188 -73510 376465 359569 149685
13441 230419 189905 285641 167296 269088 243849 199876 157685 285145 370735 -118071 238395
13429 300068 233028 50255 -2293 514409 -92320 251218 228584 339797 23765 30435 13821
13417 588050 325676 -79829 410932 -8825 347505 316830 143376 47523 267590 309957 124579
13405 111899 -198878 395622 458683 175298 382713 199680 60870 212047 394082 341807
13395 341807 -21691 42274 -24784 421354 395721 408726 82335 179809 208007 -136366 7119
13383 329559 196822 58349 74177 97974 301098 255670 -110598 79503 292914 529845
$$ packed form
13464C30170K55375k9172A97094l3584J45805D2628J50805P1395L5266J1321D0212
13452i5957B60801p5597b05281f8087C25167j34979g3510C76465j6896A49685
13441B30419m0514R5736j18345J01792k5239m3973m2191J27460Q5590a18071B38395
13429C00068o7040E0255b293E14409i2320B51218k2634J11213B3765O670A3821
13417E88050k62374g9829D10932h825C47505l0675A43376D7523K20067M2367A24579
13405A11899a98878C95622O3061A75298K07415j83033F0870J51177J82035n2275
13395C41807b1691D2274b4784D21354k5633J3005H2335R7474K8198a36366G119
13383C29559j32737E8349J5828K3797K03124m5428a10598G9503K13411K36931
$$ plain form
13373 529845 148491 333147 116144 -41499 337573 62050 -44156 220069 451688 78786
13362 40570 -34206 294609 339945 233089 255917 88676 604452 293297 262865 -148812 -160778
13351 -160778 551274 172773 273220 699929 222597 203097 225550 158256 72790 76706 273469
13340 273469 174118 113241 100421 377436 -56821 181664 194677 254369 382225 206484 -33994
13328 128505 -71913 78131 -95061 40272 128389 121063 -54091 296417 39394 73139 200288
13317 200288 9574 163541 189449 120992 5848 246417 -200082 132311 -112039 -9503 135845
13305 354071 179198 298972 150893 22956 -15409 -123769 333241 -164954 471826 19728
13294 105470 182065 138959 -148206 222875 14473 335598 162689 -167540 447272 174437
$$ packed form
13373E29845A48491J84656A16144d1499C37573F2050d4156B20069K31619G8786
13362D0570c4206B94609M5336j06856K2828H8676N15776B93297l0432a48812j1966
13351a60778E51274A72773J00447M26709B22597j9500K2453o7294G2790L916J96763
13340B73469r9351o0877j2820K77015e6821A81664J3013N9692J27856j75741c3994
13328A28505g1913G8131i5061D0272Q8117p326e4091B96417C9394L3745J27149
13317B00288I574J53967K5908o8457E848K40569b00082A32311a12039i503A35845
13305C54071j74873J19774j48079B2956a5409j08360C33241a64954D71826A9728
13294A05470P6595m3106a48206B22875A4473L21125A62689a67540D47272A74437
$$ plain form
13283 18992 420031 -39435 382865 154503 -44737 283257 260098 184486 173666 -6775 139494
13271 -174479 201128 -31305 -12211 41741 17841 30526 -81697 254649 372772 231431 188568
13260 188568 -118607 267330 210140 125285 -162887 76073 147842 -198196 231447 -41342
13249 -444285 69379 -28839 439939 339933 -121608 -166136 249129 144353 -30572 -88103
13239 -88103 -67637 -22950 343437 141820 158381 -116890 412694 -193414 139069 66309
13228 -3788 54105 348776 -164108 65358 186350 -161758 181186 36364 45631 208957 177557
13217 177557 161516 -4160 235394 417989 103384 273053 138515 21228 146348 114944
13207 114944 377623 104580 -144721 -175965 403542 -192072 -168743 54656 330461 -26753
$$ packed form
13283A8992M01039c9435C82865A54503d4737B83257k3159p5612j0820f775A39494
13271a74479B01128c1305a2211D1741A7841J2685h1697B54649J18123j41341m2863
13260A88568a18607B67330n7190q4855a62887G6073P1769a98196B31447d1342
13249d44285F9379b8839D39939j00006a21608m4528B49129j04776c0572n7531
13239h8103K0466b2950C43437A41820J6561a16890D12694a93414A39069F6309
13228c788E4105K94671a64108F5358J20992a61758A81186C6364R267J63326l1400
13217A77557j6041d160B35394J82595A03384J69669j34538B1228J25120l1404
13207A14944K62679A04580a44721l1244D03542a92072K3329E4656K75805b6753
$$ plain form
13196 130899 166539 -15412 -181942 -19991 14376 30574 447728 128711 171862 416295 45605
13184 152390 269126 382879 129145 150750 140201 321656 -36511 -11523 13202 113538
13174 113538 402973 -29216 99972 149220 206786 232733 -25356 -177616 487948 -109303 168543
13162 -19291 104827 335353 35201 360980 5202 18956 57980 -120977 229160 511792 41458
13150 40243 171157 403798 392728 -25087 247073 -124957 33628 -28053 92978 145901 208687
13139 208687 -50323 30976 55611 149174 -192446 163965 404196 239582 8047 99619 -98539
13127 254326 207858 -4259 78949 86793 259618 155022 -377061 186235 -129620 -372130 230372
13115 148557 124981 52488 133122 85960 -364521 -68394 128137 -16006 153390 73095 155246
$$ packed form
13196A30899L5640a5412j66530a9991A4376J6198M17154A28711M3151K44433D5605
13184A52390J16736J13753A29145K1605j0549J81455c6511a1523A3202J00336
13174A13538K89435b9216I9972M9248N7566K5947b5356j52260D87948a09303A68543
13162a9291A04827K30526C5201L25779E202J3754L9024a20977B29160K82632D1458
13150D0243J30914K32641j1070b5087B47073a24957C3628b8053I2978N2923O2786
13139B08687e0323C0976K4635R3563a92446A63965K40231j64614H047R1572i8539
13127B54326m6468d259G8949P844J72825j04596c77061A86235a29620k42510B30372
13115A48557k3576E2488Q0634m7162c64521f8394A28137a6006A53390G3095Q2151
$$ plain form
13104 155246 -649 265515 -197808 80609 8334 79781 -29088 143308 -158205 -106311 117839
13092 34958 128727 329845 38905 113649 318692 164458 78556 -66443 -59746 94129 -31441
13080 214184 -3697 29800 153368 -78929 -29339 -87389 -15316 94349 -138388 60111 242563
13069 242563 -28127 76430 -205390 -52900 -171233 -78286 -100862 24859 -14520 -262929 73424
13057 -49587 -193269 53646 -35191 268086 170164 -207358 -47702 361020 -97261 210149 133288
13046 133288 199434 226039 206727 -26759 71169 102978 193357 14310 -243754 207739 14831
13034 188417 157440 115529 -133538 134312 11633 -83242 -178811 208653 353360 120753
13023 -204969 150371 211089 112164 265697 -316102 558749 295168 34047 -54416 -90920
$$ packed form
13104A55246f49B65515a97808H0609H334P1447b9088A43308a58205N1894A17839
13092C4958R3769K01118C8905P4744K05043j54234G8556f6443O697I4129c1441
13080B14184c697B9800J23568g8929b9339n8050a5316I4349a38388F0111J82452
13069B42563b8127G6430b05390e2900j18333g8286k2576B4859a4520k48409G3424
13057d9587j43682E3646c5191B68086r7922b07358d7702C61020i7261B10149p6861
13046A33288O6146K6605j9312b6759G1169L1809R0379A4310b43754B07739A4831
13034A88417l0977m1911a33538A34312A1633h3242r5569B08653J44707A20753
13023b04969A50371O0718r8925J53533c16102E58749k63581C4047e4416l6504
$$ plain form
13013 -90920 201779 247279 86537 403261 -32769 -67878 126820 -98906 130065 -64931 -90144
13002 -90144 95445 187122 -73670 94608 114908 224044 202837 153153 11989 179697 181398
12991 181398 523176 -55491 -83451 405789 -121235 -119894 7971 37932 39863 5351 -99136 154579
12978 326462 -31156 1251 -145651 227155 -107350 78698 44446 499134 153621 -11903 174539
12966 101479 169994 -354665 -289605 363348 74209 -31915 158100 231653 -23688 160386 349949
12955 349949 -167723 -106081 -19510 -253455 57574 249351 170699 -207 185493 -88427 -393548
12944 -393548 -246498 281173 115986 221785 246085 -3139 126965 38121 261968 403617
12934 403617 32688 329654 -110692 -179255 27679 122092 -1957 295456 225152 -123468 213970
$$ packed form
13013i0920B01779M5500H6537L16724c2769l5109A26820i8906A30065f4931k5213
13002i0144I5445R1677g3670I4608K0300J09136k1207m9684A1989J67708J701
12991A81398L41778e5491k7960D05789a21235J341G971K9961J931E351i9136A54579
12978C26462c1156A251a45651B27155a07350G8698l4252M54688A53621a1903A74539
12966A01479O8515c54665O5060C63348G4209c1915A58100P3553b3688A60386J89563
12955C49949a67723O1642a9510k33945E7574J91777p8652b07A85493h8427l05121
12944c93548J47050B81173A15986J05799K4300c139A26965C8121K23847J41649
12934D03617C2688K96966a10692o8563B7679R4413a957B95456p0304a23468B13970
$$ plain form
12922 266332 -222511 -98093 77871 -26297 9043 -133127 30339 160069 -27365 -139064 147265
12910 -13901 257001 79266 -336249 -39603 -162183 -241339 513030 -28700 230388 85157 -268390
12898 14168 -85562 -132068 180525 239500 186041 414509 -137351 35592 -33075 328267 -19406
12886 154543 147652 58682 -69385 101633 -87103 82696 32176 -117307 -101984 -285389 -111615
12874 -82698 163026 -58885 -116209 -216350 76046 -88273 66146 -100767 217611 -143540 -213362
12863 -213362 48241 118952 -152014 291234 230018 306537 -85797 -53923 -54056 88777 81368 6243
12850 -301255 179473 171059 -128091 69500 196382 174625 -351641 -141177 -114084 179126
12839 -147553 53795 3930 -82515 210680 26109 -266526 -158747 22828 54917 140037 -46037
$$ packed form
12922B66332b22511i8093G7871b6297I043a33127C0339J29730b7365j11699A47265
12910a3901B57001G9266c36249c9603j22580p9156E13030b8700B30388H5157b68390
12898A4168h5562m6506A80525N8975n3459K28468a37351C5592c3075C28267a9406
12886A54543o891E8682f9385A01633h7103H2696C2176a17307J5323j83405a11615
12874h2698A63026e8885n7324j00141G6046h8273F6146a00767B17611a43540o9822
12863b13362D8241P0711a52014B91234o1216P6519h5797L1874j33H8777p409F243
12850c01255A79473q414a28091F9500J26882k1757c51641a41177K7093A79126
12839a47553E3795C930h2515B10680B6109b66526J07779B2828L2089Q5120d6037
$$ plain form
12827 -266560 -134937 114154 283073 36907 214097 22588 51641 216197 109646 -141507
12816 -151807 160159 20052 -111889 235341 -155669 4544 180319 49583 63816 -124171
12805 2654 -37240 71058 198698 -119745 34771 122377 -85669 83293 -52516 57176 -29663
12793 -136191 -28664 97629 259090 74811 -69791 253129 -232353 206457 -287285 217053
12782 -21172 -237583 -9511 279523 364065 80072 -2685 68640 78216 -89504 237735 59 -288332
12769 -189432 70620 274665 113232 -42793 34403 48358 5526 109896 9020 -72262 -220766
12758 -220766 44716 -101717 -83843 244785 80424 -221141 -42563 -32580 132205 429281 -29528
12746 -30107 -221008 154104 -81431 157625 -128614 108400 443358 -49468 -454580 262081
$$ packed form
12827b66560J31623A14154J68919C6907J77190B2588K9053J64556j06551a41507
12816a51807A60159B0052a11889B35341a55669D544J75775D9583J4233a24171
12805B654c7240G1058J27640a19745C4771Q7606h5669H3293e2516E7176b9663
12793a36191b8664I7629J61461G4811f9791B53129b32353B06457b87285B17053
12782b1172k16411i511B79523Q4542H0072b685F8640R576h9504B37735E9b88332
12769a89432G0620K04045A13232d2793C4403J3955E526J04370I020g2262j48504
12758b20766D4716a01717J7874B44785H0424b21141d2563R983A32205K97076b9528
12746c0107j90901A54104h1431A57625a28614A08400L34958d9468m05112B62081
$$ plain form
12735 210524 -383875 -201175 142609 153355 2876 -138248 25187 26112 -369781 13101 41868
12724 41868 77542 19357 -319903 -2765 64562 13050 41225 -79466 14940 -237021 566699
12712 -60477 77653 -104462 88479 23940 31543 302392 142945 71232 -56803 367872 30352
12700 190409 -118859 146327 299394 136131 -12501 82618 407064 215899 5735 -20719
12689 -16988 -58393 -4919 257698 161089 -70258 -113425 -79551 104655 -149428 58086 -91554
12677 83987 -132286 162617 -114470 222073 -51106 20651 -85728 331454 -354001 120886
12666 111522 -100866 445656 148018 118285 393051 194371 139779 136176 183356 240119 7205
12654 97008 105408 -44113 119742 298415 -70100 -74296 419381 24503 -67250 41046 -103747
$$ packed form
12735B10524c83875J82700A42609J0746B876a38248B5187R25c69781A3101K8767
12724D1868L5674A9357c19903b765F4562A3050K8175g9466A4940b37021E66699
12712f0477G7653a04462H8479B3940P603K70849A42945G1232e6803C67872C0352
12700A90409a18859A46327J53067A36131a2501H2618L24446j91165E735b0719
12689a6988m1405d919B57698r6609g0258m3167L3874A04655a49428E8086i1554
12677H3987a32286A62617a14470B22073e1106B0651h5728C31454c54001A20886
12666A11522a00866D45656A48018k9733K74766A94371n4592l603M7180N6763G205
12654I7008Q400d4113A19742J78673g0100m196D19381B4503f7250D1046a03747
$$ plain form
12642 -175419 -108045 441531 275272 -162406 -56739 175328 113159 197493 82096 -133479
12631 245724 211200 525180 224994 -67623 106130 -338974 164222 -97333 -89158 182278
12620 319830 274538 -24494 55131 -49324 -168301 -77413 -105190 -76709 163002 -49374 -55116
12609 -55116 -16037 135528 89230 9683 -39667 228302 61635 93604 238198 -136968 341862
12597 57676 216025 -69288 227300 26061 227174 -64717 -25766 -69470 96992 90549 540487
12586 540487 40995 -3662 122887 -42967 -101611 -63243 -73307 -97594 -95339 -45111 288860
12574 -41648 28892 -469176 2815 -141551 -320044 27743 -174540 -57829 8151 -61954 145465
12562 -28850 57442 47118 -167537 -111309 242193 175510 -36307 54838 -214795 174723 374992
$$ packed form
12642a75419O7374D41531j66259a62406e6739A75328o2169Q4334H2096a33479
12631B45724l4524L13980B24994f7623A06130c38974A64222i7333Q175A82278
12620C19830m5292b4494E5131d9324j18977g7413k7777K8481A63002d9374n742
12609e5116a6037A35528m6298I683c9667B28302F1635L1969J44594a36968C41862
12597E7676J58349f9288B27300B6061K01113f4717b5766m3704I6992o443M49938
12586E40487D0995c662A22887d2967n8644L8368j0064k4287K255d5111B88860
12574d1648B8892d69176B815a41551j78493B7743a74540e7829H151f1954A45465
12562b8850E7442j0324a67537N6228B42193o6683c6307E4838b14795A74723K00269
$$ plain form
12551 374992 216939 14236 76788 -104759 -329671 149444 24334 460870 -341400 -23074
12540 -123894 -149717 335996 33190 72065 44319 304227 -71522 -284172 -184060 -259712 161742
12528 -39427 163643 -112007 -63817 -153937 11234 97547 250891 280429 -169602 13092 162085
12517 162085 150923 -187513 24586 -68468 -126364 162806 -91519 -95036 -237609 187573 242436
12506 242436 463939 -98807 27181 -138495 24917 255300 207379 112751 -331581 -154741
12495 74252 -61220 -13143 146084 110975 11278 -142724 -468727 42955 186382 286577 283825
12484 283825 243633 -33642 -166161 -42178 44396 181140 -174039 42718 218995 -194085
12473 -107252 212497 -2491 -93507 25454 294391 37732 197037 -88750 -72702 -115192 -164607
$$ packed form
12551C74992j58053A4236O2552a04759k24912A49444B4334M36536c41400b3074
12540a23894k5823C35996C3190L8875k7746K59908g1522k12650J00112p5652A61742
12528c9427A63643a12007M8190r0120A1234Q6313J53344K9538a69602A3092J48993
12517A62085j1162a87513B4586f8468n7896A62806i1519l517j42573A87573N4863
12506B42436K21503i8807B7181a38495B4917K30383m7921r4628c31581a54741
12495G4252f1220a3143A46084l5109A1278a42724l26003D2955J43427J00195k752
12484B83825m0192c3642j32519d2178D4396J36744a74039D2718J76277a94085
12473a07252B12497b491r1016B5454K68937C7732J59305h8750J6048m2490m9415
$$ plain form
12462 -164607 51169 -92690 -108907 135914 89072 -192843 -51724 -114576 108246 564314 82422
12450 -44569 -127128 145457 186834 77037 530493 71456 -232542 -71169 232713 114187 21531
12438 129139 47877 101981 71623 278000 239322 241622 -215765 43155 -283226 37636 -312059
12426 -44885 20610 -62310 509015 474579 -193472 269806 -263556 -66718 100938 -277650
12415 93301 -266088 -156303 -165012 164023 8254 277109 83346 98410 37581 -76293 51682
12403 -84150 184850 53063 27271 45214 -47462 33052 267750 -151803 147921 -6884 -24560
12392 -24560 151058 242212 102255 199314 307785 88883 265224 -230925 -28327 182062
12381 -102861 130323 -188384 6598 87478 -413437 -3283 89209 194503 153863 -28055 -95708
$$ packed form
12462a64607E1169i2690j6217A35914m6842a92843e1724o2852A08246M56068H2422
12450d4569q2559A45457M1377G7037M53456G1456b32542g1169B32713A14187B1531
12438A29139D7877N4104l0358K06377l8678K300b15765D3155b83226C7636c12059
12426d4885B0610f2310E09015l4436a93472B69806b63556f6718A00938b77650
12415I3301b66088J09785q709A64023H254K68855H3346J5064C7581g6293E1682
12403h4150A84850E3063k5792J7943d7462C3052K34698a51803A47921f884j7676
12392b4560A51058R1154A02255R7059J08471H8883J76341b30925b8327A82062
12381a02861A30323a88384F598Q0880d13437c283H9209J05294m0640b8055o7653
$$ plain form
12370 -95708 299759 -245075 -79707 -160984 -73749 -81526 -118547 -257312 38119 77142 183225
12359 183225 184243 -175668 -154120 -35957 -318946 166082 40572 -212651 -25945 -124488 -35053
12347 -20600 48624 85467 -72622 -120617 -212822 311390 61388 -127882 -63344 -146000 67323
12335 153782 -139399 -73740 -15195 -82941 309667 -140786 161956 -21293 -12906 -351826 120619
12323 -167818 -163396 -8191 191334 -29122 100273 -9665 -3353 -321669 -71489 -216406 -148227
12312 -148227 -189174 -91838 -229657 -127983 163657 117425 -275 200422 -223917 -177583 -162516
12301 -162516 113083 233829 -42782 -173860 -191470 -53085 129696 64698 291792 227425
12291 227425 -321765 272995 -48870 -156785 82421 53837 -35329 -22075 38312 72299 -219936
$$ packed form
12370i5708B99759b45075g9707q1277g3749p777l7021j38765C8119L9023J06083
12359A83225J018a75668K1548c5957k82989A66082D0572b12651b5945r8543c5053
12347b0600D8624L6843g2622m7995r2205C11390F1388a27882f3344q2656F7323
12335A53782a39399O5659a5195o7746C09667a40786A61956b1293Q387l38920A20619
12323a67818M422h191A91334b9122A00273i665c353l18316g1489j44917O8179
12312a48227m0947i1838j37819J01674A63657m6232b75B00422b23917M6334J5067
12301a62516A13083J20746d2782j31078j7610e3085A29696F4698K27094o4367
12291B27425c21765B72995d8870j07915H2421k8584c5329J3254C8312L3987b19936
$$ plain form
12279 227045 76344 -4594 40562 23543 230325 209809 49145 154025 441744 200447 -193732
12267 83161 239112 -112767 -150963 -243648 -148506 210020 182464 145659 -8527 -148097 -18996
12255 223275 216832 251927 317196 -67886 54272 295436 248922 168598 221391 86537 182009
12244 182009 273655 172198 212783 6238 -219728 61207 -14300 80672 245749 -196816 -153092
12233 -153092 95343 290063 -183423 -42413 66712 -91815 338016 267706 231616 84501 373733
12222 373733 198720 151812 416048 263431 49059 289203 248363 168863 116402 -71565 277348
12210 216208 93155 -65986 -95611 46931 -65113 290086 329480 -28005 -75473 75266 -337600
12198 333835 43884 299607 41190 103117 65126 21648 187648 2121 88845 362664 -231309
$$ packed form
12279B27045G6344d594D0562j7019K06782k0516D9145J04880K87719B00447a93732
12267H3161J55951a12767l8196r2685R5142B10020k7556l6805h527j39570a8996
12255B23275o443L5095O5269f7886E4272K41164m6514q0324N2793H6537R5472
12244A82009R1646j01457M0585F238b19728F1207a4300H0672J65077a96816M3724
12233a53092I5343J94720a83423d2413F6712i1815C38016p0310l6090H4501K89232
12222C73733j75013m6908K64236j52617D9059K40144m0840p9500n2461g1565B77348
12210B16208I3155f5986k9625D6931f5113B90086L9394b8005m7468G5266c37600
12198C33835D3884K55723D1190O1927l7991B1648J66000B121Q6724K73819b31309
$$ plain form
12186 399305 433781 224736 -138814 -266751 197552 48671 117608 88558 74616 -22681 476854
12174 -98585 188866 122364 23410 372954 138185 118350 45700 -179749 173826 50283 12328
12162 94305 -118206 204100 221445 105143 270988 251896 -228153 141446 -1906 -31784 -62260
12151 -62260 415929 -32062 47979 266258 -80838 104248 -214144 185532 82242 209550
12141 209550 -86588 -64873 107833 171519 7128 105837 -167964 27028 134680 -207463 80593
12129 -282655 31684 -5039 -30184 207221 106648 -33456 76797 318393 -263790 222078 93256
12117 -52860 -36857 5944 -182102 -207575 -261412 211074 -24222 -227575 -226062 107570 -48048
12105 228579 257103 -151528 218386 -23430 168898 38841 135276 -64145 193891 189892 -86390
$$ packed form
12186C99305L4476k09045a38814j27937A97552D8671O8937k9050j3942b2681D76854
12174i8585A88866o6502B3410L49544A38185j9835D5700a79749A73826E0283A2328
12162I4305a18206B04100J7345A05143J65845j9092b28153A41446a906k9878l0476
12151f2260D15929c2062D7979K18279h0838A04248b14144A85532H2242J27308
12141B09550h6588K1715A07833O3686G128R8709a67964B7028J07652b07463H0593
12129b82655C1684e039k5145B07221j00573c3456G6797K41596b63790B22078I3256
12117e2860J6003E944a82102k5473n3837B11074b4222k03353J513A07570d8048
12105B28579K8524a51528B18386b3430A68898C8841R6435f4145A93891l999h6390
$$ plain form
12093 -74612 -164130 91240 -3147 -254818 168853 64198 213199 -159529 220598 98507 169187
12082 169187 21743 194720 -118679 128294 -211415 47519 -56818 354931 35923 -9665 18813
12070 -252543 -402871 -235916 -158719 -388512 82888 -223826 135731 24687 -177739 145628
12059 285868 162476 510594 1096695 722187 -4014 -289349 352550 201916 -159901 118597
12048 204256 266653 73594 -167768 -583875 142282 -52695 -56271 -235005 -331495 -184064 252625
12036 -94184 329132 -341988 -166913 266453 162357 179027 -94645 -158464 -109909 243227
12025 -202226 -21482 -36497 -295617 8651 -229945 -450760 54596 12949 435096 -334222 -114219
12013 -313541 107179 35303 -252840 -382386 -171368 -99486 -458375 271810 114706 -25070
$$ packed form
12093g4612q9518I1240c147k51671A68853F4198J49001a59529B20598I8507P0680
12082A69187B1743J72977a18679A28294b11415D7519e6818C54931C5923i665A8813
12070b52543j50328J66955P7197k29793H2888b23826A35731B4687a77739A45628
12059B85868j23392L48118N86101l74508d014k85335C52550j50634a59901A18597
12048B04256O2397G3594a67768m16107A42282e2695l576j78734r6490J47431B52625
12036i4184C29132c41988a66913B66453j04096J6670i4645o3819M8555B43227
12025b02226b1482j5015k59120H651b29945k20815E4596A2949M22147c34222a14219
12013c13541A07179C5303b52840j29546a71368P1882l58889B71810A14706b5070
$$ plain form
12002 -194269 -11530 259284 -47373 -128951 232613 130277 -358728 -50564 34624 67479 -160156
11990 213614 -202042 45360 -258370 140934 279697 -19289 -267295 58718 -179947 166155
11979 149747 -25334 -34566 -171461 -1840 -205800 49996 -196370 236393 8168 62903 -239562
11967 -2927 -179995 -14552 -271287 151971 -48180 286976 -180290 -187495 -243074 -115247 -216024
11956 -216024 -240811 -173764 329990 207181 13224 -35088 -170294 20911 -92344 305250 -32920
11944 -351274 182769 235784 -30310 36039 -361496 121419 -87224 -156866 -45518 -27791 32249
11932 -86730 -128061 -13244 -12644 83409 -365185 -87939 -16570 -114659 18425 215685 -40942 96180
11919 159220 -83342 222627 97594 -282741 -179598 -339297 -148570 131203 -43760 44879
$$ packed form
12002a94269a1530B59284d7373q1578B32613j02336c58728e0564C4624L2855a60156
11990B13614b02042D5360b58370A40934J38763a9289k48006E8718a79947A66155
11979A49747b5334r232j36895a840k03960D9996a96370B36393H168N4735b39562
11967b927j77068a4552k56735A51971d8180B86976a80290p205n5579a15247j00777
11956b16024k4787O7047C29990j22809A3224c5088j35206B0911i2344C05250c2920
11944c51274A82769N3015c0310C6039c61496A21419h7224o9642d5518J7727C2249
11932h6730m1331a3244O00H3409c65185h7939a6570r8089A8425J97260d0942I6180
11919A59220h3342B22627I7594b82741J03143j59699a48570A31203d3760D4879
$$ plain form
11908 292402 389253 -282469 48760 75869 6858 113224 253707 -31212 2492 -8461 60467
11896 -213659 -11108 -496146 -79132 -109397 -48624 212558 176922 121400 136003 -122446 63518
11884 -302194 96625 96587 -78203 236451 39708 -1103 -273060 -279024 141502 136866 -181843 1820
11871 -108433 -133165 -67806 112309 -55581 -246374 -12002 -114658 -294793 334455 111275
11860 -34165 -412595 -256871 53835 64980 -65033 156979 45779 76943 181281 -128155 119138
11848 -367399 30974 45994 -195055 -265770 -243249 13107 186592 -373461 -57736 -155859 -184456
11837 -184456 -418286 -126388 -357390 57829 13381 57951 -101329 -316374 -334873 -100673
11826 536997 18628 14108 156511 -71557 16759 321667 -273078 -65443 154772 32627 -307312
$$ packed form
11908B92402R6851b82469D8760K7109F858J06366J40483c1212B492h461F0467
11896b13659a1108m85038g9132l0265d8624B12558l5636n5522J4603a22446F3518
11884c02194I6625l8g8203B36451C9708a103k71957n964A41502m636a81843A820
11871a08433k4732O5359A12309e5581j90793a2002j02656j80135C34455A11275
11860c4165l78430J55724E3835J1145f5033A56979D5779L1164J04338a28155A19138
11848c67399C0974J5020a95055p0715K2521A3107J73485c73461e7736r8123k8597
11837a84456k33830a26388k31002E7829A3381M4570a01329k15045j8499a00673
11826E36997A8628m520J42403g1557A6759L04908b73078f5443A54772C2627c07312
$$ plain form
11814 -34525 228035 -210011 -124876 8390 -62670 5424 -56228 -8946 -65521 -97956 -66256 -128318
11802 -128318 -159007 -343730 -394232 30758 180917 -151555 -13653 -77896 -31068 -255928 -129745
11791 -129745 -80828 -465498 361845 126157 -524650 -6525 -71859 -11014 294666 -43518 -114252
11780 -114252 422554 -208684 124660 -228268 331212 -229593 -48672 173668 177819 -235850
11769 -73382 37202 133523 -417091 209598 -250390 24658 23740 -130646 -206643 102739 -420490
11757 -258411 7169 346967 -102022 -99735 -38413 -368911 191753 -21364 195853 -118645 24064
11745 59071 -289976 355860 110852 98983 -261995 -293835 239758 -206353 -110896 144022
11734 122810 88105 109328 145651 49966 102990 -154355 -96197 130011 139531 196094 -4496
$$ packed form
11814c4525B28035b10011Q5135H390f2670E424e6228h946n6575l2435L1700o2062
11802a28318l0689j84723n0502C0758J50159a51555a3653o4243c1068k24860J26183
11791a29745M8917l84670C61845A26157e24650f525o5334a1014B94666d3518p0734
11780a14252D22554b08684A24660b28268C31212b29593d8672A73668M151b35850
11769g3382C7202R6321d17091B09598b50390B4658r18a30646p5997A02739d20490
11757b58411G169L39798a02022K287c8413l30498A91753b1364A95853a18645B4064
11745E9071b89976C55860A10852j1869b61995l1840B39758b06353R5457A44022
11734A22810l4705K1223L6323D9966N3024a54355N8158A30011R520N6563d496
$$ plain form
11722 232869 30507 -70702 -62621 171923 -383946 -224551 -33045 -59366 -10503 142261 460984
11711 460984 169483 -72743 -100000 -94668 91925 -149598 -218841 65369 52610 -68326 -110355
11700 -110355 127729 216787 -46374 88367 -83727 32009 -318781 72880 6334 13709 -335132
11688 -9229 -141312 -140852 -47166 -91893 -1323 36908 -2392 -156117 -155838 21620 43982 196134
11676 196134 -128115 -35963 -222103 179788 -192860 -123369 -92129 -18500 75267 61559 -55211
11664 38763 81274 -254472 34933 -42745 44699 52719 -101845 -99671 -11975 -250343 173098
11652 -126798 -21003 -150899 190432 316438 330889 -196376 198311 1696 -177231 -495723
11642 -495723 -148891 -54274 130572 393506 5921 187681 155442 23624 -15086 -148224 13484
$$ packed form
11722B32869C0507g0702Q081A71923c83946J59395c3045k6321a0503A42261L18723
11711D60984A69483g2743k7257N332I1925a49598o9243F5369j2759f8326m2029
11700a10355A27729Q9058d6374H8367h3727C2009c18781G2880F334P375c35132
11688i229j32083M60d7166m4727a323C6908b392j53725K79B1620K2362J52152
11676A96134a28115c5963j86140A79788a92860O9491L1240a8500G5267j3708e5211
11664C8763M2511b54472C4933d2745D4699Q020a01845K174a1975k38368A73098
11652a26798b1003j29896A90432J26006J4451a96376A98311A696a77231l18492
11642d95723a48891e4274A30572K62934E921J81760l2239B3624a5086j33138A3484
$$ plain form
11630 135158 -250023 -149360 -77919 -98038 -47541 -231440 269742 -141105 -217012 -392721
11620 -392721 56298 60845 -270585 156859 -319004 -650127 -42536 -114972 -10047 161604 476538
11609 476538 -20848 -78281 -164739 -250536 216270 306816 -203467 -206858 29584 120829 153498
11598 153498 171529 -48162 54538 58920 -227315 78662 52001 -483869 168613 58261 -72639
11586 92348 -231453 50263 154312 -426915 132670 -261656 -30324 225854 -323178 -177073
11576 -177073 209117 -169736 26723 435584 285626 45821 -87139 -143596 -88372 -145553 -74200
11565 -74200 21749 12530 56452 63964 -211875 -3824 123100 -215634 -300480 -74807 -108468 -56678
11553 -56678 -304639 -160021 -138650 93421 86510 167007 -120049 146946 62084 148397 -238410
$$ packed form
11630A35158b50023J00663P1441k0119d7541j83899B69742a41105p5907j75709
11620c92721E6298M547b70585A56859c19004l31123d2536p2436a0047A61604L14934
11609D76538b0848n7433q6458q5797B16270R0546b03467l391B9584R1245L2669
11598A53498J8031d8162E4538M382b27315G8662k6661d83869A68613E8261g2639
11586I2348b31453E0263J04049d26915A32670b61656c0324B25854c23178J46105
11576a77073B09117a69736B6723M08861j49958D5821h7139n6457N5224n7181P1353
11565g4200B1749r219M3922P512b11875c824A23100b15634q4846g4807l3661N1790
11553e6678k47961J44618K1371I3421o911Q0497a20049A46946F2084Q6313b38410
$$ plain form
11541 138478 -122785 -189759 -79877 35401 64386 430306 -76630 -295230 18401 172322 -123761
11529 148411 169499 387506 -20870 9848 -77880 -20650 227652 119923 -219812 46880 81292
11518 81292 27711 186287 -13971 394728 425430 -39948 247990 -101641 126291 39474 151196
11507 151196 88356 -23040 -119061 -61362 -34406 147709 217616 -23413 80724 -62822 129990
11495 -33658 147470 -138956 304562 358349 318501 295972 202950 -57737 -151103 85988 -155572
11483 -47155 -119355 67543 -243041 256032 -124776 462261 148040 -10430 297984 142994
11472 303934 238702 -39830 42134 116099 -16308 -21130 -7169 378451 -63695 -14252 13055 128782
11460 128782 120726 81857 69262 84643 302674 13957 -45113 203695 225841 27985 8960
$$ packed form
11541A38478a22785o6974g9877C5401K8985L65920g6630k18600A8401J53921a23761
11529A48411K1088K18007b0870I848g7880b0650B27652j07729b19812D6880L4412
11518H1292B7711J58576a3971C94728L0702c9948B47990a01641A26291C9474J11722
11507A51196o2840b3040r6021N7699K6956A47709O9907b3413H0724f2822A29990
11495c3658A47470a38956C04562N3787l9848k2529r3022e7737r3366H5988a55572
11483d7155p2200F7543b43041B56032a24776D62261A48040a0430B97984A42994
11472C03934o5232c9830D2134P3965a6308m822g169C78451f3695a4252A3055J15727
11460A28782q056l8869j2595J5381K18031A3957d5113B03695K2146B7985H960
$$ plain form
11448 -75995 90567 132238 66566 -13718 -326644 33523 156017 -65651 -235964 106537 267494
11437 267494 80963 323830 -41951 105959 -13356 -252725 -107656 5511 229202 -3329 -179979
11426 -179979 -17423 -341092 176132 -96719 178140 -318463 165876 155235 -60371 24343
11415 -116261 -133111 -122059 -215512 221734 -241935 226304 105807 -158487 23461 -81638
11404 -149860 -115180 131586 -63661 233334 -244022 134749 60713 373136 9660 -59397 47192
11392 -200636 250396 63186 13126 -349386 239367 206493 91909 -144917 43848 -72686 -108219
11381 -108219 -126131 3342 142569 36367 -110343 95244 280275 -62875 17411 157682 150885
11370 150885 -31189 304334 146796 -41634 155682 -49186 -252883 -36150 71266 -201514
$$ packed form
11448g5995I0567M1671o5672a3718l12926C3523J22494f5651j70313A06537J60957
11437B67494H0963K42867d1951A05959a3356k39369a07656E511K23691c329j76650
11426a79979a7423l23669A76132i6719A78140c18463A65876j0641f0371B4343
11415a16261j6850J1052r3453B21734b41935B26304A05807a58487B3461h1638
11404a49860L4680A31586f3661B33334b44022A34749F0713L12423I660e9397D7192
11392b00636B50396F3186A3126c49386B39367l2874I1909a44917D3848g2686l5533
11381a08219j7912C342J39227C6367a10343I5244J85031f2875A7411J40271o797
11370A50885c1189C04334A46796d1634A55682d9186k03697c6150G1266b01514
$$ plain form
11359 -78332 -179402 415 31656 -352181 -346209 240154 -143448 -191536 54422 120711 -7672 74471
11346 -173348 -250760 294297 248663 -27890 40270 245309 -89797 -99340 -26909 19556 122862
11335 122862 228104 81233 150233 101687 -459219 -274261 -244756 -268441 80532 -283617 -135771
11323 -69326 -34981 -59693 205601 46434 259586 83089 242854 -320267 81605 104967 -29811
11311 -121345 -224116 35755 -135157 602838 -305523 -225619 148732 -56435 -154002 44826
11300 -34004 34939 218653 -30091 -194146 -22941 -65114 -133919 140219 -599200 78693 121491
11289 121491 -130452 -35883 -188211 -37236 -106617 222227 -103862 -36969 -164421 6823 237392
11278 237392 -153502 -116006 -149177 172937 -196077 23455 -130540 -137746 -520530 41082 -100086
$$ packed form
11359g8332j01070D15L1241c52181N972B40154a43448m8088E4422O6289g672G4471
11346a73348p7412B94297m5634b7890D0270K05039h9797r543b6909A9556J03306
11335A22862J05242H1233O9000m8546d59219J84958K9505k3685H0532b83617a35771
11323f9326L4345k4712B05601D6434K13152H3089J59765c20267H1605K3362b9811
11311a21345j02771C5755a35157F02838c05523P9904A48732e6435r7567D4826
11300c4004C4939J83714c0091j64055b2941m2173o8805A40219e99200G8693M2798
11289A21491a30452c5883j52328c7236o9381B22227a03862c6969j27452F823K30569
11278B37392a53502L7496l3171A72937a96077B3455a30540p206l82784D1082a00086
$$ plain form
11266 42829 17756 -113181 -33719 -290267 -107916 -140131 -259196 -249332 215417 -332183 187844
11254 77933 20315 70290 302961 116245 -222630 -121399 210957 172096 393516 76595
11243 -64390 39683 8371 -160736 -417867 -400333 -75343 275752 -308879 185694 8837 -52247
11231 99130 -152290 -396706 148180 -113687 -135004 -5716 -235147 192340 163255 -146017
11220 -58629 -104903 46284 -130722 49528 -21398 -101445 186674 -154052 -88246 -210027 137036
11208 203399 -68700 142719 117699 -221587 -10350 -245307 70106 -75362 38811 -48419 -133618
11197 -133618 -140764 87842 -75496 25723 84918 182768 -27750 68722 315457 26888 122260
11186 122260 -191125 -183768 -90847 -139080 28658 7616 114818 -198743 -167855 -103087 -107750
$$ packed form
11266D2829A7756a13181c3719k56548a07916l2215j19065R864B15417c32183A87844
11254G7933B0315M9975K32671A16245b22630J01231B10957l8861K21420G6595
11243f4390C9683H371a60736k57131J7534g5343B75752c08879A85694H837e2247
11231I9130a52290k44416A48180a13687k1317e716k29431A92340k9085a46017
11220e8629m6274D6284a30722D9528b1398q0047A86674a54052O5806j21781A37036
11208B03399f8700A42719k5020b21587a0350k34957G0106g5362C8811d8419q5199
11197a33618p146H7842g5496B5723N9195R7850b7750F8722K46735B6888R5372
11186A22260a91125P357i0847m8233B8658G616J07202a98743L0888O4768m663
$$ plain form
11175 -107750 9486 -104605 -92974 -153449 -200435 81396 23265 -19261 168757 -72523 106438
11163 -514682 99581 -162072 30506 94760 -114683 20252 229423 61727 574809 231185
11152 45959 -163773 111170 -10855 -240578 17476 -111652 -78837 -383793 -130843 17152
11141 239935 266329 152571 -139851 -109701 17431 -59640 -9988 -136263 55738 329891 317171
11130 317171 -302874 375530 43043 297382 103821 160729 139872 -83709 155657 -396142
11119 -340790 287588 -261573 -13522 -593241 57898 27825 30299 -24102 160657 93537 -123897
11107 -141111 205564 19077 296531 250633 466321 -75833 -128004 -241689 346460 197134
11097 197134 -146938 270136 215141 515803 224131 -392569 203399 45324 397212 -84101
$$ packed form
11175a07750I486a04605J1631o0475m6986H1396B3265a9261A68757g2523A06438
11163e14682I9581a62072C0506O4254a14683B0252K09171F1727N13082B31185
11152D5959a63773A11170a0855k29723A7476a11652L2815l04956a30843A7152
11141B39935K6394j13758a39851L0150A7431e9640i988j26275E5738K74153j2720
11130C17171c02874C75530D3043K54339A03821N6908k0857h3709A55657c96142
11119c40790B87588b61573a3522n79719E7898B7825K474b4102A60657o7120a23897
11107a41111B05564A9077K77454m5898K15688g5833n2171j13685C46460j49326
11097A97134a46938B70136n4995L00662B24131c92569B03399D5324L51888h4101
$$ plain form
11086 -66809 622528 2146 317403 6178 446195 143205 222546 362277 -7460 116448 178791
11075 178791 320135 113341 -151478 327618 473205 211477 113853 627282 -21812 391087
11064 203876 141244 307735 151165 173596 -115729 290958 421482 129454 509845 401898
11054 401898 370220 295049 349343 502337 571389 454649 785837 486540 546319 403488
11044 403488 607714 717951 508005 487448 658494 619522 451824 934534 265800 754744
11034 754744 260609 219921 716874 612487 361290 1094522 567821 502362 557387 325901
11024 325901 419289 163311 489491 473510 335774 256873 901399 253900 546682 818239
11014 818239 375094 739796 442582 363543 103244 413259 171248 585684 563030 748958
$$ packed form
11086f6809F22528B146L15257F178M40017A43205P9341J39731g460A16448O2343
11075A78791J41344A13341a51478C27618J45587B11477r7624N13429b1812C91087
11064B03876o2632J66491A51165K2431a15729B90958J30524A29454L80391j07947
11054D01898l1678p5171N4294J52994O9052j16740L31188k99297N9779j42831
11044D03488K04226J10237k09946k0557J71046l8972j67698M82710B65800M88944
11034G54744B60609m0688M96953j04387k51197P33232n26701o5459N5025k31486
11024C25901R3388A63311L26180j5981j37736p8901O44526B53900K92782K71557
11014H18239C75094L64702k97214p9039A03244L10015A71248M14436k2654J85928
$$ plain form
11004 748958 378699 337921 852791 640395 555587 494094 666962 318484 687210 399518
10994 399518 506313 432255 566008 449821 656641 717082 773100 741163 448637 1088658
10984 1088658 519100 1029641 923734 924341 925326 1098881 1272959 1391610 1783460 2209264
10974 2209264 1980475 2038962 2329014 2703501 2062946 2204449 2052258 2216855 1174262
10965 1174262 1164130 874092 1099230 737246 986327 814391 1086148 1039677 787039 987388
10955 987388 922038 765988 632288 246988 414873 373231 500107 233977 417275 173878
10944 155536 177118 372566 292540 247725 34424 281937 154142 71163 279499 -32722 23613
10932 81364 -60199 8812 147144 147822 -26201 111908 326988 156548 -92610 335224 64224
$$ packed form
11004G48958l70259m0778N14870k12396q4808o1493J72868C18484L68726k87692
10994C99518J06795p4058J33753j16187K06820O0441N6018l1937k92526O40021
10984A088658E19100N10541j05907O07R85J73555J74078J18651L91850M25804
10974B209264k28789N8487K90052L74487o40555J41503j52191J64597j042593
10965A174262j0132k90038K25138l61984K49081j71936K71757m6471k52638K00349
10955I87388o5350j56050j33700B46988J67885m1642J26876B33977J83298A73878
10944A55536K1582J95448q0026m4815C4424K47513j27795G1163K08336c2722B3613
10932H1364f0199H812J38332O78b6201A11908K15080A56548i2610C35224F4224
$$ plain form
10920 -32101 189143 -13396 366069 -220393 50223 -259216 -301326 88233 -147082 -10365 30489
10908 126961 -108397 -301286 -242166 -84417 145094 -52133 -134111 -49658 299357 -139582
10897 -112582 -391420 -13555 -44423 87592 -191289 -176265 -71587 -3589 38328 -210048 87768
10885 181814 -39647 -406568 37378 -139126 136543 -55555 100384 51836 -131206 174527
10874 -36673 -282436 -46905 -32188 37774 202606 -18805 -36622 -25306 217448 -129503 -113118
10863 -113118 -87677 -223347 -251897 365895 18333 -280425 -200470 -20898 -36539 -212520 -16394
10851 99039 141414 9006 -240393 -262577 -111654 126340 -299216 -59842 -46501 -27928 -194234
10840 -194234 107697 393434 -12438 -334136 -79368 -139567 -443 218448 165847 117710 -155199
$$ packed form
10920c2101A89143a3396C66069b20393E0223b59216m2110H8233a47082a0365C0489
10908A26961a08397j92889N9120h4417A45094e2133q1978d9658B99357a39582
10897a12582k78838a3555l0868H7592a91289J5024g1587c589C8328b10048H7768
10885A81814c9647l66921C7378a39126A36543e5555A00384m8548a31206A74527
10874c6673k45763d6905J4717C7774J64832a8805j7817J1316B17448a29503J6385
10863a13118K5441j35670k8550C65895A8333b80425P9955b0898j5641j75981a6394
10851I9039M2375I006b40393k2184a11654A26340b99216e9842J3341J8573j66306
10840a94234A07697K85737a2438l21698g9368o0199d43B18448n2601m8137a55199
$$ plain form
10828 -110630 219784 -19064 -135360 263225 -114911 264675 -62804 24756 -56887 107567
10817 -71949 253184 -87643 84259 -225543 -331163 -121779 -358119 263317 -183712 -108721
10807 -108721 329827 -230974 -57769 -111002 -59356 -109432 -8083 -117954 344 122186 -227808
10795 -283751 -295674 140564 -307124 -123003 -208859 -15040 -95269 136870 -14256 -233751
10785 -233751 253375 62518 -206636 -30631 -102213 211028 -221637 -168792 -1943 -347 -156516
10774 -156516 -60613 59343 -117043 22106 136190 214716 -210394 109321 -179699 -115373
10764 -115373 118533 -127989 215757 -113049 79330 -188981 128093 120703 -80636 30245
10753 -24131 159411 -274474 -211856 -59958 -18019 -89032 -64840 39554 240179 -140754 19198
$$ packed form
10828a10630B19784a9064j16296B63225a14911B64675f2804B4756e6887A07567
10817g1949B53184h7643H4259b25543j05620a21779k36340B63317a83712P4991
10807a08721C29827b30974e7769n3233N1646n0076h083j09871C44J21842b27808
10795b83751j1923A40564c07124a23003q5856a5040q0229A36870a4256k19495
10785b33751B53375F2518b06636c0631p1582B11028b21637N2845a943c47j56169
10774a56516f0613E9343a17043B2106J14084P8526b10394A09321a79699O4326
10764a15373A18533a27989B15757a13049G9330a88981A28093p390h0636C0245
10753b4131A59411b74474O2618e9958a8019p1013K4192C9554K00625a40754A9198
$$ plain form
10741 15117 -91607 -141828 2397 -49630 272378 -251578 -107373 -43894 -40358 26595 -247659
10729 -101925 -254854 -267984 26910 -42156 -688497 240790 115250 -100396 -61573 -113558
10719 -113558 -174219 198 -283339 66044 -16120 78753 56463 -11551 84758 -21382 88670 -350225
10706 62567 -85177 62548 156296 -249686 113010 -6015 52729 -143002 77499 -219635 86690
10694 271611 9934 -357743 -153526 254147 -270804 -23857 -177585 -116940 -222930 90961
10683 -518079 -31855 -128447 -258855 73335 9131 148651 104585 63089 -62044 150566 -201120
10671 -210921 -30762 -411140 172520 -1128 -239518 163806 -188733 -166709 228646 51898
10660 -226701 -195606 -11345 451997 -230312 17416 -197423 -33327 -134790 53933 -2037 -188625
$$ packed form
10741A5117i1607n0221B397d9630B72378b51578a07373d3894L536B6595b47659
10729a01925j52929j3130B6910d2156o46341B40790A15250a00396L8823n1985
10719a13558o0661A98b83339F6044a6120G8753k2290a1551H4758b1382H8670c50225
10706F2567h5177F2548R3748b49686A13010f015E2729a43002G7499b19635H6690
10694B71611I934c57743a53526B54147b70804b3857j53728O0645j05990I0961
10683e18079c1855r6592j30408G3335I131J39520m4066m1496f2044A50566b01120
10671b10921c0762l80378A72520a128k38390A63806a88733K2024B28646E1898
10660b26701L1095a1345D51997b30312A7416a97423c3327j01463E3933b037j86588
$$ plain form
10649 -188625 -78288 138972 -218567 13073 -320888 -110370 170900 -202984 -108215 72380
10638 -181614 105694 -96533 -387919 -99949 37126 -7100 -319456 231422 393706 60741 62378
10627 62378 239976 44584 37101 -293777 -81732 5674 13684 21953 -67971 -126444 -137945 139433
10614 90649 -210153 -20980 22219 -42529 214342 -154964 270898 -297374 -290316 148160 277903
10603 277903 78545 -410598 -166585 -34786 -52976 -190452 -411700 -39707 -7598 -7566 -64415
10592 -64415 -133672 219680 -204062 -161558 -382012 -109492 -318502 -90925 53673 -96575 76644
10580 34670 129943 37632 -353005 -55709 -271613 375365 -100128 56861 -24862 7034 -25049
10568 -321800 164779 -205676 -264336 -213100 -110719 21613 -58449 -21809 -197225 -48925 -61480
$$ packed form
10649a88625g8288A38972b18567A3073c20888a10370A70900b02984R4769G2380
10638a81614A05694i6533k91386i9949C7126g100l12356B31422J62284F0741J637
10627F2378J77598D4584p483b93777h1732E674Q010Q269f7971n8473j1501A39433
10614I0649b10153b0980B2219d2529B14342a54964B70898b97374P058A48160J29743
10603B77903G8545d10598a66585c4786j8190j37476k21248c9707g598L2n6849
10592f4415o9257B19680b04062M2504k20454a09492k09010i0925E3673i6575G6644
10580C4670R5273C7632c53005e5709k15904C75365a00128E6861b4862G034b5049
10568c21800A64779b05676n8660N1236J02381B1613e8449b1809j75416d8925j2555
$$ plain form
10557 -61480 125920 236917 -79586 -190657 -111009 220195 202183 50801 440207 -249004
10546 20069 150993 -391648 -163328 -45273 -108800 -393291 -118616 69740 177228 187175 114796
10535 114796 -250291 226279 42630 -22656 -9155 -164728 311414 82077 38792 -250321 -203242
10524 -203242 182663 -305083 -320942 -167240 -121124 -50898 -177019 -59411 197462 -36097
10513 164838 43734 113304 -99004 -87674 -101104 -149067 15169 -56079 -117501 47732 -402858
10501 -214064 -228875 -224527 -223265 -26331 1309 -283216 50522 304993 -37770 -109647 -264512
10490 -264512 -30243 -299081 142387 91978 279859 -334243 92125 7152 -15734 116386 126743
10479 126743 316531 -17187 -141163 34252 -14696 -25689 -183585 31729 53373 -147921 240349
$$ packed form
10557f1480A25920J10997g9586j11071P9648B20195j8012E0801L89406b49004
10546B0069J30924c91648a63328d5273o3527k84491a18616F9740J07488R947p2379
10535A14796b50291B26279D2630b2656i155j55573C11414H2077C8792b50321M7079
10524b03242A82663c05083j5859J53702M6116e0898j26121e9411A97462c6097
10513A64838D3734O9570i9004J1330j3430m7963A5169e6079o1422D7732d02858
10501b14064j4811M348J262b6331A309b83216E0522K54471c7770p1877j54865
10490b64512c0243k68838A42387n0409J87881c34243I2125G152a5734A16386J0357
10479A26743J89788a7187j23976C4252a4696j0993j57896C1729K1644a47921B40349
$$ plain form
10467 -8885 118384 -164636 380089 -15004 -56524 158250 254094 -183267 -90060 -192888 -74085
10455 -29534 95791 -85817 -109441 -9317 27410 240459 68885 -117050 18435 -103110 -180874
10444 -180874 -101840 -355898 191746 25822 -36896 -143019 -294407 -160943 -364400 97305
10433 -236173 120099 -23621 76783 226479 -120061 -27485 -51933 -50678 117834 -249581 -272128
10422 -272128 188122 55866 254981 111113 -317064 -445277 10216 149616 -355258 202394
10411 -28173 10474 -19314 146554 251142 107543 198540 73761 -27713 -73761 -52327 -133691
10400 -133691 -60985 146516 -164798 291571 432659 251323 27039 -65042 -37713 30264
10389 14154 72410 325901 -139395 153962 136581 -57502 152912 27506 -138904 8467 258097
$$ packed form
10467h885A18384a64636C80089a5004m1520A58250R5844a83267i0060j02828g4085
10455b9534I5791h5817k3624i317B7410K13049F8885a17050A8435a03110p7764
10444a80874P9034k54058A91746B5822c6896j06123j51388J33464k03457I7305
10433b36173A20099b3621G6783J49696a20061b7485k4448J255A17834b49581k2547
10422b72128A88122E5866J99115A11113c17064j28213A0216J39400c55258B02394
10411b8173A0474a9314A46554J04588A07543R0997G3761b7713m6048K1434q1364
10400a33691f0985A46516a64798B91571J41088j81336B7039f5042K7329C0264
10389A4154N8256K53491a39395A53962j7381e7502A52912B7506a38904H467K49630
$$ plain form
10378 258097 229716 287153 -49777 -116692 202805 135338 326759 -90964 146251 385692 273398
10367 273398 476285 380129 625470 108132 -109761 520225 282252 278488 339287 135262
10356 186543 354381 -44752 263511 297133 507326 334123 539486 524001 106455 416914
10346 416914 -694 14063 -72423 285468 97547 291923 56543 360606 119071 295925 5728
10334 338974 70084 -188561 33815 112161 68663 -391840 354647 -136347 353330 -80314
10323 -31461 226368 19590 448317 -48143 28378 214295 368871 23825 -77427 -263468 -240187
10312 -240187 139454 287325 -157852 -281830 79052 -1892 -76661 54136 76339 207383 113558
10301 113558 131714 -255841 253167 281072 41987 -140616 -159739 -383390 -77148 -94062 -275097
$$ packed form
10378B58097k8381N7437d9777o6915B02805o7467J91421i0964A46251K39441j12294
10367B73398K02887r6156K45341A08132a09761E20225k37973l764O0799A35262
10356A86543J67838d4752B63511L3622K10193j73203K05363j5485A06455L10459
10346D16914f94A4063g2423B85468I7547J94376E6543L04063A19071J76854E728
10334C38974G0084a88561C3815P8346m3498c91840C54647a36347C53330h0314
10323c1461B26368A9590M28727d8143B8378J85917J54576B3825g7427j86041K3281
10312b40187A39454J47871a57852j23978G9052a892p4769E4136K2203J31044r3825
10301A13558J8156b55841B53167K7905D1987a40616j9123k23651g7148j6914j81035
$$ plain form
10290 -275097 -118582 -141958 -192591 -467748 -336293 277922 92208 230926 -297293 -52646
10279 -214958 136090 -107410 -231690 136707 12157 -17917 137676 88354 -297063 367541
10268 -275158 -116554 -30774 -143221 364443 -120191 -148095 442684 466317 62415 -74165
10257 83708 96860 294248 -16141 75405 -7510 -81626 225224 -271114 -42650 -161637 139678
10245 -201588 -248947 -38838 -59571 -144594 -150721 138315 19763 -9964 -41510 -315175 89861
10233 -59555 -196103 -119111 -83688 -253965 -24053 -160591 334738 -78154 -134106 -179198 -13740
10221 106061 -219823 -361604 -65813 -306058 -35948 351057 21183 349422 -7802 -21010 -106507
10210 -106507 247525 -369731 -85266 3768 -126089 23146 246720 -90779 -557038 -35276 41184
$$ packed form
10290b75097a18582k3376n0633k75157J31455B77922I2208J38718b97293e2646
10279b14958A36090a07410j24280A36707A2157a7917A37676m9322b97063C67541
10268b75158a16554c0774j12447C64443a20191k7904D42684K3633F2415g4165
10257H3708J3152J97388a6141G5405g510p4116B25224b71114d2650j18987A39678
10245b01588m7359c8838k0733q5023o127A38315A9763i964l1546k73665H9861
10233e9555j36548P6992L5423j70277b4053j36538C34738g8154n5952m5092a3740
10221A06061b19823j41781f5813k40245c5948C51057B1183L28239g802j3208q5497
10210a06507B47525c69731h5266C768a26089B3146K23574i0779m66259c5276D1184
$$ plain form
10198 -37445 287561 -152674 232318 -116372 152761 -156090 63753 -96685 -240755 117556
10187 350264 -213664 10750 105498 -361429 83351 114898 -278530 -409340 -142242 107989
10176 -5494 -104994 -310695 -36108 70033 202459 58648 7982 -37729 102324 -56335 -11632
10164 -489495 22247 -153026 -2539 -267558 273271 176005 -36641 38067 7227 55712 185351
10153 185351 -260043 -176916 116496 -366170 100526 -136537 134540 34967 22284 -171448
10142 -63181 -40884 114280 -111795 -4941 -141639 -36457 186430 50913 329441 26218 39043
10131 39043 -97730 178791 -424876 -195422 157843 -276742 -92381 -240952 -121755 -114317
10121 -114317 -130557 178695 154722 230615 -75895 -134271 -204651 -129893 -598818 -281801 -525027
$$ packed form
10198c7445B87561a52674B32318a16372A52761a56090F3753i6685j44070A17556
10187C50264b13664A0750R4748c61429H3351L1547b78530j30810a42242A07989
10176e494r9500k05701c6108G0033J32426E8648G982c7729A02324e6335a1632
10164d89495B2247a53026b539k65019B73271r7266c6641C8067G227M8485J29639
10153A85351b60043Q3127A16496c66170A00526a36537A34540C4967j2683a71448
10142f3181K2297A14280a11795d941j36698c6457A86430E0913K78528B6218J2825
10131C9043i7730A78791d24876a95422A57843b76742i2381j48571J19197P438
10121a14317j6240A78695k3973P5893g5895n8376p0380P4758m68925b81801k43226
$$ plain form
10110 -525027 -278503 -12129 45791 -143008 16193 20579 -29906 -182226 -117353 -31730 -334188
10099 -334188 -156460 -162976 138420 -3141 -134361 -17578 -154502 40035 113129 -173912 -142976
10088 -142976 59611 134192 -307935 -4648 125415 -28515 -19330 -127471 -244680 172652 56622
10076 -47937 -105371 -121563 -36087 504063 -18069 -283039 -201936 119106 1925 -393250 56827
10064 521428 -340545 104013 -41204 341015 -99736 -265809 196295 77911 322472 -210219
10053 -294828 55008 -178638 -27663 211179 164286 -109419 -121431 15485 -259153 24951 -209649
10041 -550864 -324703 -149521 112716 8480 -73625 -177724 -150623 342785 -122772 -168985
10031 -168985 -55431 -147166 176583 -180600 71553 -218818 387231 128347 20019 -77876
$$ packed form
10110e25027K46524a2129D5791a43008A6193M386b9906j52320O4873c1730l02458
10099c34188a56460o516A38420c141j31220a7578j36924D0035P3094a73912L0936
10088a42976E9611P4581c07935d648A25415b8515R185j08141j17209A72652E6622
10076d7937n7434j6192c6087E04063a8069k64970Q1103A19106A925c93250E6827
10064E21428c40545A04013d1204C41015i9736j66073A96295G7911K44561b10219
10053b94828E5008a78638b7663B11179m6893a09419j2012A5485b59153B4951b09649
10041e50864K26161a49521A12716H480g3625j04099K7101C42785a22772m6213
10031a68985e5431r1735A76583a80600G1553b18818C87231A28347B0019g7876
$$ plain form
10020 -205525 225800 -100373 -74008 -53112 -115473 44739 -155214 -123371 -18424 191323 -207107
10008 235671 -92124 -81229 -133381 179631 330028 -175883 73157 106758 -182380 -248824 -89287
9996 -461019 6994 219422 -464746 342583 -193936 -274829 70362 -268729 -236177 112371 73448
9985 73448 -26854 -109719 -34590 -165174 -235346 44244 -146443 17522 -126601 -474127 -40265
9973 -49604 -107463 -98979 -424937 -36068 16074 -201688 40142 218264 -304735 288348 60710
9961 -162633 -165610 -495510 -131279 -147749 -328423 -112340 33959 -271909 -138521 107095
9950 306155 310155 -122405 -105398 -162489 -132280 -219533 7054 100385 199028 -51804 -2881 -134143
9938 -134143 -240509 153638 -191287 -342521 101041 -66497 66787 -149090 -24720 120705
$$ packed form
10020b05525B25800a00373K6365K0896o2361D4739a55214L1843a8424A91323b07107
10008B35671i2124J0895n2152A79631J50397a75883G3157L3601a82380o6444h9287
9996d61019F994K12428d64746C42583a93936q0893G0362b68729L2552A12371l8923
9985G3448b6854q2865c4590j30584p0172D4244a46443A7522a26601l47526d0265
9973d9604n7859Q484l25958c6068A6074b01688D0142J78122c04735B88348F0710
9961a62633k977l29900a31279j6470j80674a12340C3959b71909J33388A07095
9950C06155M000a22405J7007n7091L0209q7253G054R3331R8643e1804b881j31262
9938a34143j06366A53638a91287j51234A01041f6497F6787a49090b4720A20705
$$ plain form
9927 102376 153905 45153 168205 7548 -175639 -153710 -184788 -196073 -34170 -235087 -47145
9915 52606 330666 51036 -31752 -230150 -88822 -116340 -1611 -324623 8555 -300532 37087
9903 -104561 414013 -148971 -76135 10474 -4494 -29010 102648 -269198 -148655 -387257 -153731
9891 -126635 -226336 39921 -290789 -58862 -13537 146041 129589 -44451 -141864 71357 94993
9880 94993 54275 305092 -299542 -150921 -17956 35623 131079 -103571 -156900 171644 -310119
9868 -332619 -137385 -282338 119544 -42029 38574 -99242 -35701 -14139 61803 -234206 -66238
9856 -55814 -156668 64887 -328511 6259 -104717 199824 -124893 -222274 46199 16885 -37193
9844 -269450 -243246 151342 -38881 -19858 83506 -70046 -83899 -146565 342478 -165891 -156683
$$ packed form
9927A02376N1529D5153J23052G548a75639K1929l1078j1285c4170k00917d7145
9915E2606K78060E1036c1752j98398h8822k7518a611l23012H555c00532C7087
9903a04561D14013a48971P2836A0474d494k4516A02648b69198J20543k38602a53731
9891a26635r9701C9921b90789e8862a3537A46041j6452d4451r7413G1357K3636
9880I4993m0718K50817b99542J48621a7956C5623R5456a03571n3329A71644c10119
9868c32619a37385j44953A19544d2029C8574i9242c5701a4139F1803b34206f6238
9856e5814j00854F4887c28511F259a04717A99824a24893r7381D6199A6885c7193
9844b69450K6204A51342c8881J9023H3506g0046j3853o2666C42478a65891R208
$$ plain form
9833 -156683 45534 -307095 119229 106851 194200 127430 -160092 -389723 -1620 -18365 -150665
9822 -150665 -86622 93281 194474 -236255 333129 -88553 148079 64544 31387 192393 -142892
9810 42018 -16219 -87195 -169236 -234966 -89337 64181 130063 56926 -15090 -20726 -455187 284637
9797 -181302 -344119 -200875 -249694 -225704 99035 -154185 -162442 -222308 -118497 26368 81862
9786 81862 -244353 8786 253522 38719 -58937 61286 -11423 -202158 52778 22450 104482
9775 104482 -75717 -1900 -87359 106723 58660 -150572 -481422 -206346 -29548 42018 -140176
9763 232236 -55153 1904 97656 -260744 -229658 -112445 -120554 9806 -230460 -361841 157707
9751 -61689 -187749 -119512 -184790 -89861 -107021 -174226 -195585 57463 -270680 -140861 -189659
$$ packed form
9833a56683D5534c07095A19229j2378Q7349o6770a60092k29631a620j6745j32300
9822a50665O4043I3281J01193b36255C33129h8553A48079F4544C1387J61006a42892
9810D2018a6219p0976q2041o5730h9337F4181O5882E6926a5090n636m34461B84637
9797a81302j62817J43244m8819K3990I9035a54185q257n9866J03811B6368N5494
9786H1862b44353H786K44736C8719e8937F1286a1423j90735E2778B2450Q2032
9775A04482g5717a900q5459A06723m8063a50572l30850b06346b9548D2018a40176
9763B32236e5153A904R5752b60744L1086a12445q109I806b30460j31381A57707
9751f1689j26060O8237o5278h9861j7160o7205k1359E7463b70680J29819m8798
$$ plain form
9740 -189659 -246482 -51977 -267098 -279860 175836 -15003 -227906 -8815 -208376 38743 -106036
9728 170556 129963 -194970 120927 397061 -263208 166356 211808 76495 -3930 303322 -153907
9716 -115953 -51872 78308 -249997 -370161 105250 15390 -276640 -260645 -75520 25338 -223086
9704 6842 -18855 -439483 177960 226742 72934 -296228 82909 161188 -66830 -459862 -226810
9692 117354 -63452 -42614 -83843 -129990 99627 -309291 -103154 111800 -367108 -55588 146336
9680 144262 -358788 -82393 -155844 149313 -124507 -76002 -171983 -219257 -130181 -191612 -195252
9669 -195252 65289 -88865 39655 -94335 -109059 289183 -196768 -160867 120849 -70278 5512
9657 -145191 181225 -135855 -10818 212537 -133882 -199124 126502 -522693 36093 -6740 -107558
$$ packed form
9740a89659n6823e1977k15121j2762A75836a5003k12903h815j99561C8743a06036
9728A70556m0593a94970A20927K76134b63208A66356M5452G6495c930C03322a53907
9716a15953e1872G8308b49997j20164A05250A5390b76640J5995g5520B5338b23086
9704F842a8855m20628A77960M8782G2934b96228H2909P8279f6830l93032b26810
9692A17354f3452K0838m1229m6147I9627c09291a03154A11800c67108e5588A46336
9680A44262c58788h2393p3451A49313a24507M8505r5981m7274Q9076o1431l640
9669a95252F5289h8865C9655i4335j4724B89183a96768L5901A20849g0278E512
9657a45191A81225a35855a0818B12537a33882o5242A26502e22693C6093f740j00818
$$ plain form
9646 -107558 -202256 307270 126349 -82749 229932 48599 358913 -114732 -503344 17636
9635 -84429 -84040 -236324 134375 -190561 295248 248634 -280841 15346 188536 -167749 -260356
9624 -260356 -186929 168069 -155075 -273979 -124214 -208732 -243291 59536 2343 -63307 -48530
9613 -48530 -159637 230490 40844 -130685 -543325 -52163 104813 -344605 42029 -186193
9602 232720 -211124 -146887 -111010 -128054 -382597 -217762 17499 -36087 -193716 -190359 -70436
9590 -116313 -6207 -31658 -46467 42327 151106 303361 -129606 -52362 -232561 65570 -39875
9578 -311370 -343222 58587 6904 88082 244640 -370947 -180786 -26896 51697 -122673 -254833
9567 -254833 -223230 -25786 -90577 -310010 -15702 -74522 -182356 207243 -147988 -316326 99274
$$ packed form
9646a07558r4698C07270A26349h2749B29932D8599L10314a14732l88612A7636
9635h4429L89j52284A34375a90561B95248m6614b80841A5346J73190a67749r2607
9624b60356P3427A68069a55075j18904a24214q4518l4559E9536B343f3307J4777
9613d8530j11107B30490D0844a30685m12640e2163A04813c44605D2029a86193
9602B32720b11124O4237L5877j7044k54543J64835A7499c6087j57629L357g0436
9590a16313f207k5451j4809D2327J08779J52255a29606e2362j80199F5570c9875
9578c11370l1852E8587F904Q1178J56558c70947a80786b6896E1697a22673j32160
9567b54833L1603b5786o4791k19433a5702n8820j07834B07243a47988j68338I9274
$$ plain form
9555 367107 100167 -92860 16518 -13052 -135088 209256 226794 -130678 -278089 -237081 -198518
9544 -198518 1450 -356201 199819 -160919 -321041 -329711 130146 -257749 -40877 -155822 -231038
9533 -231038 138118 -97525 21983 -652412 -84317 81129 -355035 63459 -394021 29249 -74327
9521 255380 80826 134957 -181468 -211874 73372 12044 -146346 258715 328858 120831 -344453
9509 -418210 -173242 145020 48959 -182202 336654 152008 -354659 -226078 -163659 148964
9498 -70361 -151960 -283397 -178893 -209794 167204 -143587 -23606 -5160 -67233 235632 239654
9487 239654 -179018 -79384 164327 147997 -1561 -130914 181882 -132571 127772 -328168
9476 149030 -137789 -156529 -298504 42205 -253855 -52808 31370 -52383 -237931 46418 72120
$$ packed form
9555C67107A00167i2860A6518a3052j22036B09256J7538a30678j47411M1008L8563
9544a98518A450c56201A99819a60919j60122q670A30146b57749d0877j14945p5216
9533b31038A38118i7525B1983f52412h4317H1129c55035F3459c94021B9249g4327
9521B55380H0826N4131a81468l0406G3372A2044a46346B58715P0143A20831c44453
9509d18210a73242A45020D8959a82202C36654A52008c54659J28581O2419A48964
9498g0361q1599j31437J04504l0901A67204a43587b3606e160o2073B35632M022
9487B39654a79018g9384A64327j6330a561j29353A81882a32571A27772c28168
9476A49030a37789j8740j41975D2205b53855e2808C1370e2383j85548D6418K5702
$$ plain form
9465 72120 110959 83285 55235 -300554 -33355 -128850 -66546 -320532 -9934 -42819 174136
9453 80836 136868 -99456 304822 -16270 -352211 -80319 63807 114995 256641 -150906 296989
9441 -268482 -178717 -205325 -389530 -55610 -44387 -120682 -420540 -95848 -393905 57455 246668
9430 246668 -10394 -293098 103464 135094 64692 276163 -196391 -15319 -47984 212335 -287352
9418 -107216 -160942 -29929 74882 -108 60352 192795 -174174 -51377 -163817 -181977 -15923
9406 149356 -176172 -36650 -35952 -75977 115887 28142 -199241 -104677 -233610 -148671 -24805
9394 -75529 61592 -77246 -55519 490721 90740 -169954 77149 134691 165392 -173702 47095
9382 -230707 78354 -222667 -59044 -184808 191665 -240808 -234632 117323 43022 -78784 -183663
$$ packed form
9465G2120L8839k7674k8050c00554c3355r5495O2304k53986i934l2885A74136
9453H0836N6032i9456C04822a6270l35941h0319F3807N1188J41646a50906B96989
9441b68482Q9765k6608j84205e5610J1223p6295k99858i5848k98057E7455J89213
9430B46668a0394k82704A03464L1630F4692K11471a96391a5319l2665B12335b87352
9418a07216n3726b9929G4882a08F0352J32443a74174e1377j12440j8160a5923
9406A49356a76172c6650O98m0025A15887B8142a99241R4564j28933Q4939b4805
9394g5529F1592g7246K1727D90721I0740a69954G7149N7542L0701a73702D7095
9382b30707G8354b22667e9044j25764A91665b40808O176A17323D3022g8784j04879
$$ plain form
9371 -183663 213611 315337 -193441 -29581 263168 -7850 -447823 301583 27927 179862
9361 179862 -2139 -221148 -112588 13468 92817 -19860 32603 -15021 -34695 29667 39525 63025
9349 63025 -166631 -190577 -191837 -39252 84509 14981 24354 -217087 -516548 -173446 36941
9337 -68828 -125573 -133886 -297174 -315252 31245 -326274 -263630 175450 107663 -3922 -340966
9326 -340966 177032 -89714 57814 -226184 -149647 -142226 -187382 128781 2210 106742 50936
9314 -226536 -318084 31531 -93780 -65692 -291178 -284114 -65206 -378256 -122399 1916 81227
9303 81227 -77731 158833 -14052 -152530 -24835 23813 -376462 -209014 -106239 -98974 -86230
9292 -86230 -126895 -73706 258032 351104 -228503 -81493 -208062 -165588 5388 25740 -193368
$$ packed form
9371a83663B13611J01726a93441b9581B63168g850m39973C01583B7927J51935
9361A79862b139k19009J08560A3468P9349a9860C2603a5021j9674B9667R858K3500
9349F3025a66631k3946j260c9252H4509A4981R373b17087k99461a73446C6941
9337f8828n6745q313j63288j8078C1245c26274O2644A75450o7787c922l37044
9326c40966A77032h9714E7814b26184P6537P421m5156A28781B210J04532E0936
9314b26536r1548C1531i3780K8088k25486P064f5206l13050a22399A916P9311
9303H1227g7731A58833a4052j38478b4835B3813c76462J67448J02775P265J2744
9292h6230m0665N3189B58032R3072b28503h1493j26569M2474E388K0352a93368
$$ plain form
9280 179141 -137868 172739 -70221 135553 -134322 74201 -419400 -149904 -131089 4188 210999
9269 210999 -95988 -323038 45357 -115932 -310303 -46008 -361812 -162041 -176912 57565 -289896
9257 242300 -79372 -205241 -13725 -3725 -266100 155500 390903 -11242 443847 -191124 -124463
9246 -124463 148263 -234158 179693 -180698 -386032 -93825 -3719 -75824 -398263 -5730 248773
9234 230566 86888 -327665 -63413 -384319 -7207 181061 35774 -224773 -222610 99221 -54926
9222 10342 48503 152422 -93454 251970 -260165 -56720 38583 50555 -211991 296851 -119021
9210 -421036 -103614 -19529 -234856 134340 -123767 -61138 134333 259733 -315400 -54016
9199 66312 314474 14903 -4883 -181548 140317 185388 179253 237790 -131943 -315941 107208
$$ packed form
9280A79141a37868A72739g0221A35553a34322G4201d19400a49904J8815D188K06811
9269B10999i5988k27050D5357a15932j94371d6008l15804a62041j4871E7565b89896
9257B42300g9372j25869a3725c725k62375A55500K35403a1242D43847a91124O6661
9246a24463A48263b34158A79693a80698k05334i3825c719p2105l22439e730B48773
9234B30566H6888c27665f3413l20906g207A81061C5774b24773K163I9221e4926
9222A0342L8161J03919i3454B51970b60165e6720C8583J1972b11991B96851a19021
9210d21036a03614a9529k15327A34340a23767f1138A34333J25400c15400e4016
9199F6312K48162A4903d883j76665A40317M5071o135N8537a31943j83998A07208
$$ plain form
9187 254291 -218654 -277122 5404 160318 -483313 -163716 211278 -74040 -19304 26960 -179830
9175 -93784 -319867 15393 -63623 -233987 -327536 171066 21388 30832 -64393 -98412 432333
9163 -96129 206338 -161702 -47720 -114360 -51327 277110 -105827 -1742 -285307 148674 -157633
9151 118439 -77500 186340 -229165 -63662 -195010 -80435 -71475 -164432 -161786 171821 -132373
9139 321189 -77600 11391 252488 44396 -213635 -238318 142673 -181787 -377435 -137628
9128 -3653 -222606 305032 -218251 -11091 -189704 -340884 148624 -200599 164098 -96124
9117 -187180 6260 -22652 -327158 -151724 -63456 -111036 101262 75886 -226956 -155372 28790
9105 131630 -101214 367616 -208506 244570 -280194 -107329 -220051 -92009 16736 293387
$$ packed form
9187B54291b18654n8468E404J54914d83313a63716B11278g4040a9304B6960a79830
9175i3784k26083A5393f3623j70364r3549A71066B1388R444f4393l4019D32333
9163i6129B06338a61702d7720o6640e1327B77110a05827a742k83565A48674a57633
9151A18439g7500A86340b29165f3662j31348h0435Q960r2957K646A71821a32373
9139C21189g7600A1391K41097D4396b13635k4683A42673a81787j95648a37628
9128c653k18953C05032b18251a1091j78613j51180A48624b00599A64098i6124
9117a87180F260b2652l04506a51724f3456m7580A01262k5376b26956P1584B8790
9105A31630a01214C67616b08506B44570b80194a07329j12722i2009A6736K76651
$$ plain form
9095 293387 -70007 -109864 -181421 53050 45552 -285964 -108256 377706 -238814 -92057 -163678
9084 -163678 -181967 -91000 -120710 -317825 -262363 -287980 -270660 157173 89006 165550 -138765
9072 -126621 -105155 -23568 -74840 140194 -239255 14954 -1499 128089 -172684 -117309 -133011
9061 -133011 -38217 -550771 306329 50196 -78336 76304 -240982 193921 -376811 119042
9050 105299 -278275 -176904 -303951 -34261 190979 -85662 -874 -40663 -132533 -102475 -248263
9039 -248263 -298196 47092 132542 -279303 -96094 -30209 -160588 43733 -52384 10003 29824
9028 29824 -348920 59173 -284712 -98887 -167548 -16308 87691 -54952 78553 -183963 -31861
9016 182618 -140376 16589 85794 459876 32857 40203 -149102 -209711 -156918 -267731 -177445
$$ packed form
9095B93387g0007l9857p1557E3050p498b85964a08256C77706b38814i2057p1621
9084a63678j8289R0967k9710j97115N5462k5617J7320A57173o8167P6544a38765
9072a26621K1466b3568n1272A40194b39255A4954a499A28089a72684N5375j5702
9061a33011c8217n12554C06329E0196g8336G6304b40982A93921c76811A19042
9050A05299b78275J01371j27047c4261A90979h5662h74l9789r1870L0058j45788
9039b48263m9933D7092Q5450b79303i6094c0209j30379D3733e2384A0003J9821
9028B9824c48920E9173b84712i8887o8661a6308H7691e4952G8553a83963c1861
9016A82618a40376A6589O9205L74082C2857P346a49102o0609N2793j10813R0286
$$ plain form
9005 -177445 -110319 12420 -323537 -44594 229467 -233521 122565 -18145 -186289 -300872
8995 -300872 243088 -121259 109887 133743 24874 249574 250847 -38888 116284 -169834 -75024
8983 -20214 7314 -31650 71416 150846 18882 455083 290621 66808 16214 -132377 182437
8971 110456 -149089 -189293 -13727 -39158 4412 -205462 -429154 152075 -89772 90533 -335155
8959 50480 78904 -126622 -228876 140116 -150442 -125522 -148264 36238 -38527 -138520 60743
8947 -23661 -169340 -55055 191711 287072 -273574 -18209 15481 -118470 -161621 -312992 -323719
8936 -323719 -184522 -153021 33102 2505 29174 -101214 66857 20421 -151495 24527 502322
8925 502322 571397 1040273 2835526 7134764 9414426 2040226 635831 516707 497522
$$ packed form
9005a77445O7126A2420c23537d4594B29467b33521A22565a8145j68144j14583
8995c00872B43088a21259A09887K3856B4874K24700J273c8888A16284a69834g5024
8983b0214G314c1650G1416P9430A8882M36201j64462F6808A6214a32377A82437
8971A10456a49089m0204a3727k5431D412b05462k23692A52075h9772I0533c35155
8959E0480K8424a26622j02254A40116a50442K4920k2742C6238c8527r9993F0743
8947b3661j45679e5055A91711R5361b73574a8209A5481a18470m3151j51371j0727
8936c23719J39197L1501C3102B505K6669a01214F6857B0421a51495B4527M77795
8925E02322O9075M68876J795253M299238K279662B040226F35831j19124j9185
$$ plain form
8916 497522 136950 -13055 129107 -283792 140218 -43062 -71510 175476 153903 43451 169235
8905 169235 -90978 -46874 -111975 -46737 275480 29430 85597 7328 -25893 -196126 -135405
8894 -135405 -60928 -10032 -217900 14937 -119424 -26327 -170542 -407431 -240124 -10814 41922
8882 -214704 -50809 258551 62949 148285 -9413 -414303 31641 -63390 23632 -187907 27859
8870 -168748 -13115 -30364 221579 212936 104056 -345112 -229675 126191 -311318 -57974 -12358
$$ packed form
8916D97522A36950a3055A29107b83792A40218d3062k8448A75476k1573D3451J25784
8905A69235i0978M4104o5101d6737B75480B9430N6167G328b5893j70233O0721
8894a35405f0928a0032k07868A4937a19424b6327j44215k36889J67307a0814D1922
8882b14704e0809B58551F2949Q5336i413m04890C1641f3390B3632a87907B7859
8870a68748a3115j7249B21579q643A04056c45112J15437A26191c11318e7974a2358
$$ [...]
##END NTUPLES=NMR SPECTRUM
##END=
