
##TITLE=UV1213_M4_1332-1205_7185334_0YXdvWmy2V
##JCAMPDX= 6.0         $$ Bruker NMR JCAMP-DX V2.0
##DATA TYPE= NMR SPECTRUM
##DATA CLASS= NTUPLES
##ORIGIN= BRUKER
##OWNER= Administrator
$$ 1.72 TOPSPIN		Version 2.1
$$ 2012-12-06 00:45:39.144 -0500  Administrator@X
$$ Compression mode = diff/dup
##.OBSERVE FREQUENCY= 400.02188249412
##.OBSERVE NUCLEUS= ^1H
##.ACQUISITION MODE= SIMULTANEOUS (DQD)
##.ACQUISITION SCHEME= undefined
##.AVERAGES= 64
##.DIGITISER RES= 22
##SPECTROMETER/DATA SYSTEM= spect
##.PULSE SEQUENCE= noesygpps1d.comp
##.SOLVENT NAME= COFFEE_meoh
##.SHIFT REFERENCE= INTERNAL, COFFEE_meoh, 1, 14.96094
##AUDIT TRAIL= $$ (NUMBER, WHEN, WHO, WHERE, PROCESS, VERSION, WHAT)
$$ ##TITLE= Audit trail, TOPSPIN		Version 2.1
$$ ##JCAMPDX= 5.01
$$ ##ORIGIN= Bruker BioSpin GmbH
$$ ##OWNER= Administrator
$$ $$ E:\/data/COFFEE/nmr/UV1213_M4_1332-1205_7185334_0YXdvWmy2V/12/pdata/1/auditp.txt
$$ ##AUDIT TRAIL=  $$ (NUMBER, WHEN, WHO, WHERE, PROCESS, VERSION, WHAT)
(   1,<2012-12-06 00:45:33.159 -0500>,<Administrator>,<X>,<go>,<TOPSPIN 2.1>,
      <created by zg
	started at 2012-12-06 00:34:02.637 -0500,
	POWCHK enabled, PULCHK disabled,
       configuration hash MD5:
       86 BA 57 50 F2 9D 5C 9B 26 00 A9 28 5F 66 2E 89
       data hash MD5: 64K
       9F 85 48 4D 6C E0 7C 9E 6A 95 0A CF F1 54 B0 21>)
(   2,<2012-12-06 00:45:36.222 -0500>,<Administrator>,<X>,<proc1d>,<TOPSPIN 2.1>,
      <Start of raw data processing
       efp LB = 0.3 FT_mod = 6 PKNL = 1 PHC0 = 0 PHC1 = 0 SI = 128K 
       data hash MD5: 128K
       E9 3C 4C AD 7F 1B 22 08 13 D0 22 EB FD 42 C0 B5>)
(   3,<2012-12-06 00:45:37.300 -0500>,<Administrator>,<X>,<proc1d>,<TOPSPIN 2.1>,
      <pk PHC0 = -78.51929 PHC1 = 0 
       data hash MD5: 128K
       0C D1 E3 2A AD 4E 60 D5 33 86 5C 17 45 BA AA B6>)
(   4,<2012-12-06 00:45:38.097 -0500>,<Administrator>,<X>,<proc1d>,<TOPSPIN 2.1>,
      <abs ABSG = 1 
       data hash MD5: 128K
       30 6E 5F B6 BA D4 05 6F 5B CF 28 B1 77 47 21 B5>)
(   5,<2012-12-06 00:45:38.300 -0500>,<Administrator>,<X>,<proc1d>,<TOPSPIN 2.1>,
      <abs ABSG = 2 
       data hash MD5: 128K
       85 22 27 EF 6C 8D EC 26 2D 73 55 03 C6 C0 FE 16>)
(   6,<2012-12-06 00:45:38.472 -0500>,<Administrator>,<X>,<proc1d>,<TOPSPIN 2.1>,
      <abs ABSG = 3 
       data hash MD5: 128K
       2A B2 A6 2D 4F DE A6 52 56 21 68 C6 24 73 18 4F>)
(   7,<2012-12-06 00:45:38.628 -0500>,<Administrator>,<X>,<proc1d>,<TOPSPIN 2.1>,
      <abs ABSG = 4 
       data hash MD5: 128K
       87 9F 24 8D 86 51 3C B0 38 33 F5 23 88 00 28 B7>)
(   8,<2012-12-06 00:45:38.800 -0500>,<Administrator>,<X>,<proc1d>,<TOPSPIN 2.1>,
      <abs ABSG = 5 
       data hash MD5: 128K
       3F D7 44 F7 DD 0F 72 E8 34 1D 5F F9 22 DE C8 8D>)
$$ ##END=
$$ 
$$ $$ hash MD5
$$ $$ A7 99 46 F5 BA 27 62 3B CF 37 8E 15 7A A0 E3 97
##$RELAX= 
##$RELAX= 
##$RELAX= 
##$RELAX= 
##$RELAX= 
##$RELAX= 
##$RELAX= 
##$RELAX= 
$$ Bruker specific parameters
$$ --------------------------
##$DU= <E:\>
##$EXPNO= 12
$$ [...]
##$TP07= 0
##$TPNAME0= <>
##$TPNAME1= <>
##$TPNAME2= <>
##$TPNAME3= <>
##$TPNAME4= <>
##$TPNAME5= <>
##$TPNAME6= <>
##$TPNAME7= <>
##$TPOAL= (0..7)
0.5 0.5 0.5 0.5 0.5 0.5 0.5 0.5
##$TPOFFS= (0..7)
0 0 0 0 0 0 0 0
##$TUNHIN= 0
##$TUNHOUT= 0
##$TUNXOUT= 0
##$USERA1= <user>
##$USERA2= <user>
##$USERA3= <user>
##$USERA4= <user>
##$USERA5= <user>
##$V9= 5
##$VALIST= <valist>
##$VCLIST= <CCCCCCCCCCCCCCC>
##$VD= 0
##$VDLIST= <DDDDDDDDDDDDDDD>
##$VPLIST= <PPPPPPPPPPPPPPP>
##$VTLIST= <TTTTTTTTTTTTTTT>
##$WBST= 1024
##$WBSW= 4
##$XGAIN= (0..3)
0 0 0 0
##$XL= 0
##$YL= 0
##$YMAX_a= 5456058
##$YMIN_a= -11004898
##$ZGOPTNS= <>
##$ZL1= 120
##$ZL2= 120
##$ZL3= 120
##$ZL4= 120
##$ABSF1= 14.96094
##$ABSF2= -5.597241
##$ABSG= 5
##$ABSL= 3
##$ALPHA= 0
##$AQORDER= 0
##$ASSFAC= 0
##$ASSFACI= 0
##$ASSFACX= 0
##$ASSWID= 0
##$AUNMP= <proc_prof1d_extract.lims>
##$AXLEFT= 0
##$AXNAME= <>
##$AXNUC= <1H>
##$AXRIGHT= 0
##$AXTYPE= 0
##$AXUNIT= <>
##$AZFE= 0.1
##$AZFW= 0.1
##$BCFW= 0
##$BC_mod= 0
##$BYTORDP= 0
##$COROFFS= 0
##$CY= 15
##$DATMOD= 1
##$DC= 0
##$DFILT= <>
##$DTYPP= 0
##$F1P= 0
##$F2P= 0
##$FCOR= 0.5
##$FTSIZE= 131072
##$FT_mod= 6
##$GAMMA= 0
##$GB= 0
##$INTBC= 1
##$INTSCL= 1
##$ISEN= 128
##$LB= 0.3
##$LEV0= 0
##$LPBIN= 0
##$MAXI= 10000
##$MC2= 0
##$MEAN= 0
##$ME_mod= 0
##$MI= 0
##$NCOEF= 0
##$NC_proc= -2
##$NLEV= 6
##$NOISF1= 0
##$NOISF2= 0
##$NSP= 0
##$NTH_PI= 0
##$NZP= 0
##$OFFSET= 14.96094
##$PC= 1
##$PHC0= -78.51929
##$PHC1= 0
##$PH_mod= 1
##$PKNL= yes
##$PPARMOD= 0
##$PPDIAG= 0
##$PPIPTYP= 0
##$PPMPNUM= 2147483647
##$PPRESOL= 1
##$PSCAL= 4
##$PSIGN= 0
##$PYNMP= <proc.py>
##$REVERSE= no
##$SF= 400.020009660262
##$SI= 131072
##$SIGF1= 0
##$SIGF2= 0
##$SINO= 400
##$SIOLD= 131072
##$SPECTYP= <>
##$SREGLST= <1H.CDCl3>
##$SSB= 0
##$STSI= 131072
##$STSR= 0
##$SW_p= 8223.68421052631
##$SYMM= 0
##$S_DEV= 0
##$TDeff= 65536
##$TDoff= 0
##$TI= <>
##$TILT= no
##$TM1= 0
##$TM2= 0
##$TOPLEV= 0
##$USERP1= <user>
##$USERP2= <user>
##$USERP3= <user>
##$USERP4= <user>
##$USERP5= <user>
##$WDW= 1
##$XDIM= 131072
##$YMAX_p= 350334125
##$YMIN_p= -11898
##$CURPLOT= <Network HP LaserJet P1505>
##$CURPRIN= <$Network HP LaserJet P1505>
##$DFORMAT= <normdp>
##$LAYOUT= <+/1D_H.xwp>
##$LFORMAT= <normlp>
##$PFORMAT= <normpl>
##$SURQMSG= 1
$$ End of Bruker specific parameters
$$ ---------------------------------
##NTUPLES= NMR SPECTRUM
##VAR_NAME=  FREQUENCY,     SPECTRUM/REAL,   SPECTRUM/IMAG
##SYMBOL=    X,             R,               I
##VAR_TYPE=  INDEPENDENT,   DEPENDENT,       DEPENDENT
##VAR_FORM=  AFFN,          ASDF,            ASDF
##VAR_DIM=   131072,        131072,          131072
##UNITS=     HZ,            ARBITRARY UNITS, ARBITRARY UNITS
##FACTOR=    0.0627417313425164, 1,          1
##FIRST=     8223.62146879497, 2218,         -49198
##LAST=      0,             3666,            -48878
##MIN=       0,             -11898,          0
##MAX=       8223.62146879497, 350334125,    0
$$ Real data points
##PAGE= N=1
##DATA TABLE= (X++(R..R)), XYDATA
$$ [...]
65262 125984 126923 127189 126612 126676 128453 131084 132938 133548 133570 133379 132759 131916 131791 133005 135072 137035 138490
65245 138490 139631 140607 141260 141364 140794 139550 137882 136315 135181 134187 132785 130993 129486 128720 128355 127731
65229 127731 126653 125458 124549 124142 124253 124578 124549 123866 122884 122185 121878 121624 121199 120601 119729 118445 116956 115655
65211 115655 114587 113586 112914 113119 114059 114742 114467 113585 112782 112176 111644 111571 112583 114694 117139 118908 119189
65194 119189 117734 115355 113683 113787 115121 116351 116968 117455 118052 118210 117422 115983 114693 114219 114853 116448
65178 116448 118450 120341 122067 123667 124635 124292 122899 121692 121557 122142 122587 122579 122311 121913 121451 121126 120934
65161 120934 120339 118810 116710 115214 115253 116702 118629 120154 121027 121558 122125 122908 124046 125759 127999 130188
65145 130188 131782 133095 135112 138362 142427 146663 150876 155086 159177 163226 167738 173004 178515 183488
65131 183488 187784 191842 195866 199624 202962 206043 209012 211816 214482 217204 220036 222757 225112 227086
65117 227086 228876 230655 232281 233109 232345 229889 226678 223855 221627 219262 216087 212063 207452 202503 197675
65102 197675 193661 190668 187908 184167 178966 172977 167327 162631 158720 155096 151525 148154 145194 142658
65088 142658 140469 138600 136942 135163 132980 130570 128532 127392 127294 128091 129475 130975 132113 132713 132876
65073 132876 132604 131733 130388 129233 128909 129309 129745 129849 130023 130839 132249 133676 134774 135784 137002 138179
65057 138179 138770 138664 138274 137847 137083 135774 134487 134099 134696 135467 135815 136052 136655 137259 136956 135485 133609
65040 133609 132181 131297 130481 129366 127941 126505 125664 126078 127727 129533 130144 129138 127196 125237 123776
65025 123776 123002 122802 122590 121700 120318 119452 119612 120045 119841 119295 119398 120321 121301 121920 122515 123155 123171 122188 120953
65006 120953 120589 121444 123125 125214 127447 129493 131124 132504 133965 135661 137692 140257 143244 145967 147753
64991 147753 148668 149259 149764 150019 150029 150169 150793 151986 153632 155432 156969 158081 159088 160391 162017 163944
64975 163944 166489 169809 173147 175270 175735 175149 174146 172743 170859 168784 166732 164430 161576 158429 155510
64960 155510 152974 150608 148291 146102 144095 142237 140618 139517 139210 139720 140667 141380 141295 140267 138512 136366
64944 136366 134290 132840 132187 131775 130934 129829 129243 129346 129301 128392 126926 125637 124736 124140 124212 125485 127705
64927 127705 129809 131017 131492 131782 131970 131625 130371 128348 126205 124739 124451 125291 126715 127928 128223 127400
64911 127400 125979 124771 124114 123701 123277 123174 123864 125275 126929 128669 130774 133334 135920 138073 139892
64896 139892 141948 144694 148100 151797 155573 159634 164365 169805 175548 181233 186970 193096 199632 206244
64882 206244 212669 218970 225312 231692 237957 243927 249307 253477 255590 255165 252712 249528 246573 243598
64868 243598 239693 234541 228692 222640 216432 210480 205923 203420 202011 200081 197286 194708 193149 192165
64854 192165 190999 189548 187884 185564 182170 178159 174444 171298 168277 165125 162087 159266 156340 153178
64840 153178 150208 147835 145863 143937 142250 141258 140881 140547 140083 139949 140350 140649 140134 139005 138064 137645 137410
64823 137410 137104 136940 137160 137772 138825 140382 142007 142885 142872 142956 144192 146480 148878 150809 152432 154016
64807 154016 155618 157348 159444 161963 164777 167938 171693 176067 180670 184879 188001 189479 189371 188541 187906
64792 187906 187478 186558 184783 182503 180149 177845 175772 174279 173417 172847 172410 172283 172390 172235 171678 171343 171806
64775 171806 172783 173528 173701 173471 173194 173405 174695 177058 179655 181718 183398 185256 187304 189244 191349 194308
64759 194308 198256 202683 207345 212582 218562 224832 230796 236204 241004 245200 249112 253335 258217 263610
64745 263610 269247 274922 280171 284248 286796 288254 289307 290162 290511 289938 288084 284669 279658 273269 265698
64730 265698 257071 247868 239119 231789 226046 221327 217118 213522 211152 210489 211232 212279 212569 212023 211466
64715 211466 211562 212228 213178 214632 217131 220908 225702 230970 236061 240485 244345 248303 252784 257314 260874
64700 260874 262703 262587 260679 257389 253175 248074 241686 233987 225879 218474 212074 206346 201178 196713
64686 196713 192759 188925 185286 182174 179308 175992 172335 169433 167970 167450 167255 167730 169495 172204 174758
64671 174758 176535 177806 179145 181031 183862 187806 192574 197732 203098 208475 213235 216697 218847 220066
64657 220066 220215 218649 215308 211262 207842 205550 204038 202723 201123 198941 196323 194027 192917 193104 193697
64642 193697 193586 192597 191780 192418 194771 198021 201452 205229 209703 214416 218519 222085 226316 232222 239602
64627 239602 247558 255495 263206 270347 276409 281145 284645 286946 287837 287073 284584 280418 274652 267405 258978
64612 258978 249992 241349 233807 227420 221520 215422 209154 203389 198773 195436 193128 191590 190666 190133 189601
64597 189601 188711 187396 185776 183823 181404 178831 177057 176886 178020 179319 180068 180661 181946 184291 187462
64582 187462 191124 195176 199744 205013 210917 217016 222959 229087 236169 244454 253500 263112 273727 285326
64568 285326 296579 305969 313531 320589 327787 334222 338732 341167 341912 340795 337216 331129 323249 314272
64554 314272 304430 293925 283401 273631 264882 256933 249703 243547 238725 234814 231058 227309 224246 222497
64540 222497 221885 221784 221903 222330 222985 223475 223492 223086 222532 222106 221862 221369 219861 217033 213611 210729 208764
64523 208764 207143 205184 202682 199754 196715 194171 192568 191499 190055 188146 186795 186687 187076 186828 186102
64508 186102 186141 187511 189324 190312 190133 189477 189387 190599 193038 195627 197007 196876 196553 197945 201901 207633
64492 207633 213510 218270 221671 224368 227265 230780 234501 237564 239449 240432 241248 242401 243864 245352 246642
64477 246642 247639 248392 249229 250578 252407 253995 254562 253989 252633 250671 248122 245437 243418 242351 241743 241095
64461 241095 240467 240070 239912 240297 242073 245697 250312 254388 257135 258790 259698 259816 259153 258057 256900 255838
64445 255838 255021 254687 254997 256071 258160 261370 265224 268997 272571 276563 281593 287901 295765 305611 317429
64430 317429 330604 344795 360601 378955 400166 424052 450798 481196 516064 555807 600552
64419 600552 650449 705808 767064 834445 907494 985077 1066049 1149679 1235014 1319977 1401559
64408 1401559 1477064 1544942 1604376 1654394 1693653 1720927 1735571 1737396 1726233 1701917 1664975
64397 1664975 1617204 1561116 1498463 1429517 1354051 1272894 1188235 1102541 1017603 934698 855232
64386 855232 780789 712521 650712 595108 545636 502599 466036 435111 408536 385674 366833
64375 366833 352305 341409 332732 325039 317637 310206 302832 296136 290828 286877 283385 279388 274608 269373
64361 269373 264018 258483 252410 245622 238563 232106 226751 222210 218011 214267 211399 209313 207461 205749
64347 205749 204731 204689 205105 205436 205936 207230 209335 211576 213291 214239 214435 214014 213222 212191 210739 208682
64331 208682 206327 204349 203135 202504 202087 201727 201433 201186 200943 200724 200609 200706 201137 201963 203154 204674 206551
64314 206551 208708 210799 212472 213825 215391 217533 219941 221827 222580 222208 221166 219718 217483 213763 208499
64299 208499 202742 197868 194288 191211 187719 183750 179857 176359 173164 170274 168004 166526 165571 164823 164395
64284 164395 164595 165288 165802 165596 164863 164362 164766 166274 168626 171297 173713 175608 177282 179344 182128 185497
64268 185497 189283 193646 198726 204030 208489 211298 212547 213004 213385 213946 214602 215170 215473 215432 215253 215411 216272
64251 216272 217682 219003 219492 218606 216187 212713 209298 206891 205242 203128 199958 196767 195045 194853 194821
64236 194821 193997 192932 192740 193772 195613 197936 200763 204129 207888 211834 215826 219996 224934 231309 239102
64221 239102 247534 255964 264397 272866 280913 288251 295414 303015 310649 317295 322584 326902 330351 332460
64207 332460 332953 332002 329605 325491 319873 313528 306802 299295 290911 282462 274662 267137 259141 250823 243071
64192 243071 236431 230880 226500 223551 221794 220347 218560 216730 215789 216430 218602 221688 225082 228603 232400
64177 232400 236496 240592 244277 247185 248865 248834 246896 243180 237800 230848 222903 215111 208367 202641 197411
64162 197411 192460 187918 183790 179890 176134 172619 169518 167109 165594 164631 163443 161811 160630 160970 162838
64147 162838 165334 167746 169874 171576 172754 173822 175480 177903 180653 183404 186164 188749 190697 191896
64133 191896 192731 193408 193674 193457 193186 193071 192505 190728 187865 184943 182949 182090 181840 181508 180862 180328 180496
64116 180496 181494 183049 185076 187802 191217 194801 198025 200851 203583 206500 209781 213544 217742 222138
64102 222138 226451 230401 233682 236150 237981 239346 240073 240076 240011 240897 242989 245595 248054 250271 252152 253256
64086 253256 253394 252892 251853 249794 246451 242280 237602 231918 224857 217260 210452 204776 199753 195405 192363
64071 192363 190631 189243 187450 185518 184040 183116 182608 182644 183374 184495 185432 185865 185865 185675 185593 185902 186685 187697
64053 187697 188536 189000 189300 189913 191060 192244 192574 191849 191092 191635 193669 196093 197791 198706 199561 200899 202646
64036 202646 204427 206040 207571 209111 210480 211357 211688 211771 211858 211939 212088 212655 213810 215149 216151 216868 217730
64019 217730 218857 220024 221251 222849 224836 226775 228325 229604 230875 232192 233407 234163 233875 232145 229412
64004 229412 226803 225160 224380 223818 222953 221554 219569 217184 214822 212869 211479 210697 210531 210866 211565 212774
63988 212774 214835 217695 220658 222961 224522 226011 228268 231696 236069 240817 245534 250164 254715 259005
63974 259005 262967 266908 271101 275316 279266 283439 288759 295312 302021 307920 313266 319073 325956 333832
63960 333832 342421 351656 361702 372854 385273 398741 412924 428030 444940 464527 487113 512757
63948 512757 541703 574403 611444 653739 702422 758308 821752 893271 973877 1064451 1165134
63937 1165134 1275652 1395785 1524993 1661822 1804252 1950494 2099076 2248286 2395890
63928 2395890 2539172 2674852 2799233 2908975 3001776 3075960 3129648 3160917 3168782 3153622 3116578
63917 3116578 3058844 2981470 2885488 2772269 2644111 2504389 2356819 2204641 2050797 1898533
63907 1898533 1751069 1610576 1477956 1353732 1238601 1133042 1037005 950396 873480 806420
63897 806420 748597 698733 655587 618302 586150 558233 533576 511551 492130 475537 461562
63886 461562 449348 438025 427409 417887 409788 403113 397681 393166 389055 385008 381314 378698 377647
63873 377647 378128 379901 382756 386448 390836 396222 403300 412639 424386 438362 454183 471318 489418
63860 489418 508655 529476 552074 576390 602442 630163 658917 687829 716687 746004 775944
63849 775944 805692 834095 860486 884586 906124 924967 941294 955162 966068 973200 975983 974212
63837 974212 967978 957698 943893 926695 905904 881822 855595 828288 800002 770390 739773 709114
63825 709114 679066 649670 620980 593393 567177 542104 517772 494030 471022 449042 428408
63814 428408 409255 391414 374690 359213 345230 332642 321126 310729 301877 294641 288381 282367
63802 282367 276451 270879 265766 261110 257051 253647 250385 246420 241494 236386 232243 229585 228071 226995
63788 226995 225751 223989 221729 219382 217332 215373 212860 209662 206612 204590 203331 201661 198978 196007
63774 196007 193879 192868 192360 191815 191260 190865 190442 189676 188733 188334 189044 190536 191838 192316 192190 191946 191638
63757 191638 191128 190694 190857 191679 192744 193764 194604 194800 193829 192010 190379 189355 188322 186953 186064 186428
63741 186428 187509 188306 188950 190341 192502 194484 195928 197614 200180 203212 205989 208372 210563 212621 214640
63726 214640 216893 219405 221866 224318 227374 231364 235719 239710 243362 247114 250976 254639 258117 261593
63712 261593 264736 266828 267643 267674 267342 266455 264666 262141 259462 257002 254634 252111 249600 247660 246576
63697 246576 245829 244534 242527 240738 240299 241448 243516 245751 247850 249804 251650 253486 255461 257617 259745
63682 259745 261492 262622 263286 264009 265265 267031 268927 270753 272613 274471 276038 277320 278812 280812 282924
63667 282924 284790 286995 290517 295305 299994 303207 304652 304881 304512 303973 303502 302959 301792 299521 296151
63652 296151 291926 286945 281348 275754 271071 267674 264937 261797 257873 253959 251320 250434 250573 250659 250411
63637 250411 250492 251690 254203 257631 261323 264708 267680 270792 274783 279716 284846 289557 294202 299728 306543
63622 306543 314099 321651 329210 337551 347334 358389 369976 381650 393716 406855 421590 438230
63610 438230 456995 477847 500430 524523 550373 578127 607056 635976 664448 692912 721374
63599 721374 748547 772636 792417 807235 816590 820507 820000 816409 810351 801817 791136 779113 766229
63586 766229 752417 737768 722762 707488 691163 672967 653092 632640 612731 594044 576986
63575 576986 561782 548353 536452 526099 517729 511799 508328 506892 507023 508498 511172 514672 518477
63562 518477 522370 526621 531622 537503 544274 552069 560955 570626 580699 591257 602773 615506 629393
63549 629393 644582 661659 681142 703091 727403 754247 784030 817085 853431 892365 931948
63538 931948 969165 1000915 1024859 1039443 1043839 1038503 1025566 1008090 988764 969334 950826 933702
63526 933702 917804 902603 887586 872172 855412 836323 814649 790959 765920 739831 712943
63515 712943 685809 659050 633089 608356 585461 564771 545953 528317 511697 496720 484069
63504 484069 473596 464339 455422 446830 439201 433023 428232 424536 421681 419145 416026 411784 406999 402839
63490 402839 399718 396958 393876 390661 387882 385664 383793 382280 381250 380469 379579 378869 379278 381418 384895
63475 384895 388809 392615 396245 399614 402361 404101 404734 404412 403350 401646 399237 395971 391816 386982 381785
63460 381785 376441 371153 366325 362405 359328 356393 353047 349674 347198 345878 344971 343791 342684 342543 343677
63445 343677 345625 347921 350561 353814 358070 363895 371671 381081 391526 403257 417539 435289 456019
63432 456019 478649 503035 530080 560424 593528 627941 661786 692809 718529 737011 747758
63421 747758 751998 752258 751568 752617 757138 765865 778904 796094 817157 841712 869194 898713 929020
63408 929020 958720 986402 1010533 1029447 1041877 1047552 1047118 1041483 1031396 1017583 1000988 982712
63396 982712 963710 944419 924505 903123 879724 854607 828447 801487 773634 745353 717798
63385 717798 691817 667371 644339 623399 605430 590302 577044 565351 556157 550273 547015 544873
63373 544873 543315 543199 545249 548896 553141 558080 564765 573633 583886 594703 606378 619756 635021
63360 635021 651690 669560 688978 710235 733285 758202 785333 814817 846269 879036 912340
63349 912340 945058 975838 1003667 1027948 1047912 1062481 1071035 1073861 1071509 1064219 1052477 1037695
63337 1037695 1021629 1005164 988129 970123 950992 930551 908432 884349 858295 830567 801915
63326 801915 773523 746363 720648 696311 673924 654597 638960 626754 617443 610738 606515 604775
63314 604775 605650 608588 611242 610009 602414 588743 571080 551359 530830 510689 492144 475809 461646
63301 461646 449480 439092 429891 421171 412750 404917 397698 390696 383680 376807 370085 363165 355995 349267
63287 349267 343839 339926 337109 334825 332484 329351 324905 319472 314296 310713 309167 308900 308583 307345 305323
63272 305323 303272 301714 300521 299193 297286 294611 291339 288030 285305 283334 281809 280477 279413 278613
63258 278613 277688 276266 274548 273159 272567 272838 273748 274843 275593 275885 276232 277073 277952 277949 276947 275923 275750
63241 275750 276290 276977 277811 279208 281167 283239 285263 287518 290082 292520 294462 296071 297718 299522 301492
63226 301492 303814 306616 309667 312706 315962 319919 324580 329422 334095 338680 343083 346746 349426 351866
63212 351866 355011 358661 361554 362993 363785 365176 367187 368570 368283 366527 364220 361909 359534 356995 354498
63197 354498 352271 350315 348657 347649 347735 348966 351081 354036 358129 363480 369749 376642 384369 393157 402510
63182 402510 411563 420198 429315 439760 451431 463662 476029 488305 499990 510482 519750 528337
63170 528337 536657 544601 551905 558498 564329 569181 572942 575838 578079 579304 578606 575200 569001 560558
63156 560558 550482 538953 525740 510725 494321 477324 460394 443855 427996 413324 400332
63145 400332 389072 379174 370278 362313 355352 349355 344225 340005 336799 334437 332427 330435 328705 327798
63131 327798 327924 328746 329830 331042 332436 334009 335748 337726 339943 342224 344498 347019 350090 353648 357369
63116 357369 361117 365078 369529 374678 380609 387051 393308 398760 403531 408415 414060 420417 426995 433432
63102 433432 439791 446467 453826 461791 469853 477694 485618 494005 502512 510311 517070 523211 529155 534912
63088 534912 540446 545751 550275 552968 553438 552568 551404 549847 547002 542458 536569 529659 521685 512676 502966
63073 502966 492947 483047 473949 466327 460260 455260 450893 447018 443463 440021 436916 434832 434310 435326
63059 435326 437528 440471 443609 446480 449127 452017 455480 459575 464584 471083 479200 488197 497167 505889
63045 505889 514740 524033 533869 544395 555716 567577 579494 591250 603010 614922 626819 638357
63033 638357 649282 659547 669311 678832 688162 696915 704421 710214 714296 716876 717931 717127 714173 709191
63019 709191 702603 694765 685859 676149 666110 656124 646314 636884 628452 621703 616777 613326 611148 610526
63005 610526 611980 615981 622791 632160 643219 655121 667906 682302 698544 715806 733012 749806
62993 749806 766508 783524 801036 818894 836478 852988 868163 882392 895882 908150 918747
62982 918747 927986 936282 943016 946667 946057 941003 931955 919579 904715 888062 869660 848986 825715
62969 825715 800155 773027 745206 717749 691695 667605 645453 624958 605849 587922 571194
62958 571194 555936 542233 529647 517771 506958 497811 489957 482087 473486 464799 456843 449284 441118
62945 441118 432059 422775 413990 405895 398344 390987 383254 374749 365868 357691 351096 346149 342348 339139
62931 339139 336113 333021 329858 326836 324146 321724 319273 316484 313349 310288 307895 306355 305230 303944
62917 303944 302426 301107 300372 300228 300465 300866 301245 301485 301677 302077 302852 303881 304813 305284 305240 305185 306024 308424
62899 308424 312326 317194 322615 328390 334201 339690 345000 350861 357884 365999 374704 383494 391744 398555
62885 398555 403260 406091 407957 409464 410386 410100 408267 405019 400760 395897 390608 384749 378132 370911 363551
62870 363551 356433 349769 343893 339155 335284 331250 326261 320741 315875 312222 309216 306074 302712 299589
62856 299589 297014 294967 293341 292062 291041 290225 289644 289192 288504 287308 285837 284651 284050 283877 283910 284151
62840 284151 284588 284862 284454 283224 281645 280419 279857 279690 279482 279189 279199 279821 280883 281955 282830 283623 284488
62823 284488 285374 286087 286393 286147 285530 285197 285901 287736 289884 291311 291699 291553 291420 291290 290877 290301 290241 291333
62805 291333 293553 296204 298404 299575 299756 299638 300131 301563 303355 304739 305766 307230 309590 312421 315099
62790 315099 317577 320124 322717 325197 327811 331060 335052 339474 344215 349582 355835 362948 370957 380238
62776 380238 391218 403987 418188 433066 447682 461500 474819 488252 501666 514033 524446
62765 524446 532788 539220 543579 545704 545951 544808 542225 537752 531187 522702 512538 501041 488868 476649
62751 476649 464448 452014 439537 427632 416490 405580 394469 383566 373672 365016 357086 349371
62739 349371 341949 335277 329556 324456 319520 314761 310694 307722 305667 304090 302912 302402 302576 302940 303006
62724 303006 302848 303003 303895 305398 306882 307696 307790 307922 309151 311975 316057 320738 325708 331130 337289 344276
62708 344276 352020 360590 370440 382182 395960 411192 427163 443876 462007 482058 503882 527198
62696 527198 552170 579188 608279 638995 670782 703200 735840 768298 800215 831164 860455
62685 860455 887206 910618 930072 944968 954585 958220 955509 946663 932354 913199 889365 860970
62673 860970 829004 795486 762205 729401 696159 662151 628509 596789 567574 540484 515187
62662 515187 491795 470383 450782 433009 417379 403890 391890 380705 370281 360841 352264 344303
62650 344303 337246 331625 327235 323111 318771 314836 311977 309779 307229 304036 300774 297878 295311 293288
62636 293288 292547 293399 294964 295883 295658 294939 294616 294970 295649 296109 295977 295249 294236 293266 292364 291311 290010
62619 290010 288677 287594 286758 285850 284548 282839 280994 279364 278273 278031 278768 280129 281321 281734 281427 280872
62603 280872 280359 279987 280085 281116 282996 284978 286562 288163 290517 293711 297309 301303 306304 312635 319724
62588 319724 326709 333311 339747 346023 351771 356754 361042 364537 366736 367328 366811 366040 365115 363157 359400
62573 359400 354204 348664 343455 338376 332933 326957 320627 314275 308347 303264 299093 295462 291917 288291
62559 288291 284710 281447 278805 276892 275413 273943 272522 271660 271512 271373 270352 268359 266113 264373 263548
62544 263548 263884 265445 267736 269791 270943 271408 271973 273203 275048 277062 278891 280576 282409 284476 286402
62529 286402 287720 288429 289058 290271 292572 296323 301651 308210 315275 322271 329185 336430 344472 353664 364225
62514 364225 376227 389631 404410 420520 437716 455568 473765 492325 511357 530681 549810
62503 549810 568302 585993 602820 618416 631939 642397 649179 652252 651944 648770 643525 637182 630341
62490 630341 622896 614550 605590 596862 589084 582656 578184 576658 578799 584491 593102 604081 617037 631533
62476 631533 647234 664153 682385 701522 720487 737945 752857 764709 773391 778794 780488 777917
62464 777917 770953 760061 745811 728443 708018 684730 658907 630982 601714 572160 543187 515204
62452 515204 488654 464372 442991 424259 407482 392507 379657 368819 359313 350826 343783 338461
62440 338461 334284 330466 326956 324234 322398 320963 319484 317977 316677 315695 315027 314683 314673 314853 314804 313924
62424 313924 311855 308948 306196 304548 304228 304646 304794 303802 301479 298562 296259 295270 295264 295374 295050 294290 293289
62407 293289 292200 291233 290683 290760 291387 292204 292782 292939 292915 293111 293692 294572 295731 297196 298740 300016 301193
62390 301193 302975 305710 308860 311776 314603 317924 321809 325850 329889 334083 338314 342295 346292 351071
62376 351071 357006 363911 371854 381347 392370 403978 415464 427355 440644 455487 471322 487961
62364 487961 505857 525495 547222 571564 598991 629441 662721 699384 740455 786063 835087
62353 835087 886462 940141 996242 1053764 1110858 1166000 1218162 1265862 1306855 1339066 1361463
62342 1361463 1373855 1376333 1369356 1354089 1332047 1304236 1270924 1232373 1189476 1143501 1095532 1046611
62330 1046611 998297 952433 910067 870925 834264 800007 768654 740327 714460 690478 668280
62319 668280 647908 629105 611518 595022 579526 564589 549562 534113 518462 503125 488569
62308 488569 475032 462552 451133 440918 432078 424483 417682 411402 405883 401442 397813 394294 390642
62295 390642 387483 385628 385143 385349 385567 385570 385383 385057 384893 385583 387642 390770 394126 397366 400991 405452 410294
62278 410294 414658 418473 422608 427786 433783 439884 445708 451342 457026 463081 470054 478626 489312 502320
62264 502320 517541 534617 553303 573998 597735 625417 657198 692808 732166 775342 822101
62253 822101 871995 924779 980242 1037598 1095472 1152551 1207695 1259241 1304774 1341969 1369404
62242 1369404 1386250 1391718 1385525 1368825 1343963 1312977 1276626 1234979 1188548 1138449 1085742 1031239
62230 1031239 976102 922193 871317 824197 780574 740263 703693 671146 641960 615038 590055
62219 590055 567659 548408 532025 517811 505307 494214 484039 474369 465347 457451 450781 444891
62207 444891 439328 434055 429288 425230 422058 419887 418570 417675 416826 415976 415288 414930 415099 416045 417851 420309
62191 420309 423273 427100 432420 439341 447137 454953 462746 471273 481159 492170 503471 514367 524650
62178 524650 534482 544287 554682 566073 578093 589699 600130 609733 619682 631029 644261 659703
62166 659703 677956 699694 725171 754185 786454 821896 860455 901722 944714 987962 1029643
62155 1029643 1067654 1099714 1123839 1139098 1145971 1145741 1139379 1127076 1108856 1085338 1057587 1026329
62143 1026329 991747 954197 914832 875260 836678 799663 764707 732604 704072 679147 657169
62132 657169 637440 619869 604984 593326 584802 578677 574262 571517 570829 572248 575218 579167 584132
62119 584132 590625 599047 609381 621195 633663 645771 656956 667651 678902 691279 704205 716314
62107 716314 726165 732607 734842 732612 726467 717850 708781 701134 695682 691571 686886 679966 670336 658555
62093 658555 645500 631986 618822 606881 596924 589391 584435 582214 583016 586930 593364 601277 610197
62080 610197 620867 634510 651517 671131 692304 714422 737279 760884 785469 811243 838001
62069 838001 865332 893321 922490 952889 983788 1014583 1045434 1076617 1107874 1139017 1170595
62058 1170595 1203124 1235818 1266792 1294370 1317593 1335580 1347256 1351893 1349482 1340586 1326183 1307451
62046 1307451 1285023 1258464 1227128 1191537 1153287 1113636 1072932 1031516 990324 950293 911873
62035 911873 875436 841458 809900 780062 751536 724808 700533 678783 659449 642729 628616
62024 628616 616436 605558 596099 588272 581445 574604 567468 560396 553448 546276 538794 531208 523532 515831
62010 515831 508862 503598 500067 497336 494780 492569 490864 489392 488220 488189 489988 493263 497122 501140 505425
61995 505425 509996 514596 518942 522736 525549 527005 527033 525764 523305 519780 515400 510283 504336 497478 489851
61980 489851 481679 473111 464347 455698 447379 439411 431859 424978 418966 413815 409504 406091 403440 401135
61966 401135 398904 396871 395242 394048 393407 393579 394398 395029 394881 394527 395135 397134 399982 403212 407004 411570
61950 411570 416651 422051 428234 435856 444819 454216 463294 472270 482172 493979 507938 523596 540469
61937 540469 558590 578383 600081 623407 647812 672784 697864 722532 746261 768631 789281
61926 789281 807810 823847 837218 848015 856443 862572 866214 867041 864896 859927 852390 842452 830399
61913 830399 817072 803949 792618 784078 778443 775242 774108 775364 779869 788196 800002 814377 830597
61900 830597 848054 865463 880804 892492 900275 904552 905038 900742 891259 877519 861081 842987 823520
61887 823520 802693 780672 757887 735025 712830 691737 671760 652807 634900 618009 601947
61876 601947 586698 572539 559543 547201 535065 523579 513730 505907 499696 494836 491661 490296 490158
61863 490158 490854 493058 497814 505201 514424 525081 537541 552015 568011 585118 603744 624644 648073
61850 648073 673838 701947 732694 766142 801876 839322 878025 917492 956878 994959 1030423
61839 1030423 1062303 1090164 1113768 1132514 1145345 1151345 1150442 1143499 1131878 1117068 1100617 1084117
61827 1084117 1068989 1056185 1046115 1038982 1035291 1035909 1041461 1051693 1065510 1081457 1097914 1113007
61815 1113007 1124851 1132090 1133922 1129563 1118115 1099231 1073594 1042541 1007448 969635 930411 890754
61803 890754 851156 812075 774334 738766 705780 675626 648719 625111 603893 583811 564444
61792 564444 546287 529793 515018 502174 491667 483312 476146 469384 462982 456987 451024 445002 439704
61779 439704 435913 433253 430594 427404 424023 420767 417575 414614 412411 411022 409649 407513 404743 402053
61765 402053 399891 398326 397522 397708 398675 399751 400500 401227 402661 405193 408558 412151 415592 419024 422886
61750 422886 427399 432218 436569 439696 441267 441520 441177 441111 441936 443752 446299 449275 452472 455689 458662
61735 458662 461165 463135 464709 466213 468111 470821 474446 478712 483155 487341 491014 494214 497362 501077
61721 501077 505685 510968 516418 521674 526571 530968 534763 538060 541031 543598 545448 546424 546615 546020 544373
61706 544373 541538 537808 533555 528682 522786 515853 508483 501321 494493 487765 481117 474941 469650 465285
61692 465285 461626 458583 456265 454616 453203 451583 449740 447847 445737 443018 439818 436915 434813 433080
61678 433080 431012 428701 426894 425926 425353 424727 424164 423941 423921 423682 423072 422380 422121 422672 423878 424911 424850 423622
61660 423622 422140 421346 421402 422000 423037 424611 426596 428725 430957 433353 435764 438137 441010 445052 450020
61645 450020 454868 459136 463638 469366 476218 483381 490509 497807 505077 511545 516755 521009 524612 527192
61631 527192 528163 527486 525609 522954 519847 516662 513558 510229 506375 502338 498777 495749 492642 489213 486175
61616 486175 484434 483957 483676 482393 479681 476066 472456 469241 465920 461825 457114 452600 448533 444124 438628
61601 438628 432408 426393 420892 415473 409764 403707 397149 389873 382158 374790 368354 362961 358723 355959
61587 355959 354683 354312 354168 353955 353515 352460 350400 347404 343990 340731 337910 335378 332669 329498 326262
61572 326262 323777 322363 321483 320457 319213 318063 316996 315593 313551 311035 308536 306561 305425 305172 305599
61557 305599 306297 306628 305966 304331 302697 302122 302514 302777 302299 301667 301565 301732 301602 301383 301618 302028 301763 300820
61539 300820 300294 300976 302375 303517 304224 305195 307113 310038 313473 316768 319554 321915 324046 325765 326591
61524 326591 326352 325435 324367 323373 322443 321550 320643 319644 318562 317378 315770 313288 309989 306629 303930 301837
61508 301837 299740 297321 294960 293339 292821 293123 293533 293487 293045 292708 292727 292759 292337 291480 290688 290345 290248 289725 288223
61489 288223 285945 283842 282786 282738 282973 283069 283303 283960 284774 285334 285601 285612 285046 283758 282503 282369 283426 284590
61471 284590 285011 284939 284910 284756 284037 283043 282598 282953 283513 283727 283670 283557 283243 282581 281895 281645 281729 281533 280710 279640
61451 279640 279095 279596 281015 282619 283504 283249 282255 281356 281147 281766 283155 285179 287473 289542 291202 292694
61435 292694 294220 295597 296625 297641 299454 302693 307313 312638 317728 321752 324283 325451 325938 326780 328837
61420 328837 332066 335363 337483 338255 338612 339370 340427 341375 342356 343797 345640 347442 349107 350907 352711
61405 352711 353781 353554 352246 350367 347965 344647 340297 335502 331230 328156 326278 325128 324224 323254 321948
61390 321948 320164 318299 317226 317500 318761 320254 321696 323170 324370 324617 323772 322588 321895 321777 321818 321806
61374 321806 321956 322557 323615 324772 325569 325938 326389 327425 328864 330109 331063 332259 334003 335959 337845 339921
61358 339921 342383 344689 346137 346913 348050 350351 353705 357437 361094 364896 369593 375773 383232 391207
61344 391207 399345 408081 417796 428033 437988 447459 456780 466055 475062 483780 492325 500230 506441 510274
61330 510274 511985 512216 511319 509473 506991 504096 500684 496743 492784 489385 486344 482809 478350 473556 469327
61315 469327 465854 462594 459124 455665 452716 450492 448878 447756 447141 447080 447640 448946 450999 453449 455837
61300 455837 458118 460756 464222 468563 473523 478820 484145 489066 493204 496344 498179 498099 495573 490841 485003
61285 485003 479249 474036 469097 464165 459527 455687 452653 449958 447528 446132 446478 448157 450089 452042
61271 452042 455028 459975 466604 473961 481527 489330 497405 505768 514648 524119 533636 542496 550689 558783
61257 558783 567002 575052 582927 591296 600791 611348 622560 634334 646761 659454 671398 681528
61245 681528 689288 694596 697433 697701 695493 691328 685827 679217 671366 662386 652842 643273 633815 624544
61231 624544 615880 608312 601901 596391 591654 587648 584131 580787 577615 574877 572758 571384 570942 571357 571933
61216 571933 571840 570948 569787 568686 567399 565593 563281 560707 558210 556269 555288 555195 555555 556039 556428 556263 555128
61199 555128 553418 552223 552235 553245 554921 557456 561116 565739 571271 578370 587837 599609 612927 627381
61185 627381 643245 660651 678868 696595 712846 727469 740902 753425 764653 773912 781206 787546
61173 787546 794079 801060 807928 814195 819844 824864 828811 831097 831560 830545 828397 825037 820085 813307
61159 813307 804812 794820 783470 771028 758084 745240 732580 719739 706564 693517 681336 670463
61147 670463 660920 652616 645683 640485 637293 635905 635669 635985 636649 637599 638479 638630 637341 633980 628250 620691
61131 620691 612626 605069 597803 590071 582029 574876 569577 566159 564354 564284 566226 570246 576287 584164 593300
61116 593300 603009 613267 624758 638008 653012 669821 688687 709291 730571 751835 773412 795665
61104 795665 818026 839658 860504 880867 900391 918258 934169 948387 961035 972080 981797 990434
61092 990434 997413 1001498 1001879 998646 992289 983220 971717 957855 941565 923208 903948 884960 866326
61079 866326 847238 827303 807157 787789 769727 752869 736660 720479 704342 689241 676394
61068 676394 666168 658045 651474 646224 642040 638590 635836 633968 632953 632563 632841 634022 635977 638256
61054 638256 640757 643967 648475 654606 662466 671863 682142 692519 702673 712769 723155 734440 747621
61041 747621 763432 781565 801119 821815 844251 869026 896236 925792 957589 991294 1026557
61030 1026557 1063478 1102417 1143440 1186567 1232377 1281592 1334119 1389332 1447265 1508646 1573678
61019 1573678 1641694 1712229 1785612 1862416 1943323 2029812 2124183 2228675 2345425 2477344 2628012
61008 2628012 2800514 2997505 3222774 3481934 3782115 4133293 4550834 5055217 5668430
60999 5668430 6411582 7304797 8364825 9600612 11015537 12618450 14429382 16467288
60991 16467288 18729716 21183444 23762958 26356126 28781779 30803271 32208648 32917314
60983 32917314 33027270 32761105 32358593 31995926 31758277 31632455 31496284 31132668 30302987
60974 30302987 28856302 26801555 24294693 21562736 18824275 16244318 13922860 11902256
60966 11902256 10183508 8744591 7553589 6574759 5772077 5113271 4571950 4126080 3755870
60957 3755870 3444004 3176856 2944466 2739730 2557936 2396073 2251559 2121720 2004507
60948 2004507 1898860 1803915 1718506 1641744 1573160 1511644 1454924 1400792 1348432 1297957 1249177
60937 1249177 1201494 1154731 1109349 1065904 1024640 985589 948806 914464 882716 853255 825199
60926 825199 797911 771842 747975 726377 705958 685804 666105 647551 630522 615141 601458
60915 601458 589147 577598 566707 556995 548601 540800 532993 525592 519355 514328 510047 506408 503771
60902 503771 502438 502458 503654 505505 507280 508641 509821 511098 512543 514437 517191 520472 523082 524240 524371
60887 524371 524168 523556 522179 520170 517662 514147 509178 503162 496679 489602 481809 474103 467242 460494 452508
60872 452508 443447 434892 427625 420816 413661 406560 400269 394943 390565 387357 385127 382982 380381 377935
60858 377935 376619 376673 377779 379734 382327 384966 387119 388999 391319 394459 398193 402077 405871 409702 414017
60843 414017 419166 424933 430714 436252 441745 447050 451293 453683 454356 454047 453246 452090 450762 449431 447986
60828 447986 446359 445019 444528 444547 443870 441783 438995 436813 435549 434168 431551 427694 423517 419763 416460
60813 416460 413282 409890 405828 400596 394269 387760 381991 376929 371802 366166 360315 354758 349830 345865
60799 345865 343177 341608 340448 339101 337565 336107 334728 333222 331531 329793 328181 326865 326031 325726 325763
60784 325763 325860 325916 326151 327043 329004 331917 335105 338007 340800 343977 347360 350026 351493 352554 354620 358388
60768 358388 363431 368974 374739 380970 387807 394831 401329 406972 412030 416876 421538 425946 430304 434778
60754 434778 438981 442272 444525 446197 447625 448716 449336 449575 449547 449374 449437 450185 451525 452784 453410 453338 452638
60737 452638 451222 448998 445858 441512 435918 429909 424698 420497 416341 411591 406857 403064 400346 398480
60723 398480 397734 398509 400593 403486 407128 411572 416336 420861 425420 430866 437593 445437 454437 464940
60709 464940 476962 490059 503909 518514 533906 550221 567967 587575 608689 630506 652795
60698 652795 675883 699641 723194 745779 767136 786839 804003 818057 829147 837264 841514 840859
60686 840859 835258 825524 812367 796122 777279 756641 734868 712288 689288 666543 644620 623580
60674 623580 603210 583607 565285 548641 533529 519503 506369 494180 482752 471610 460583
60663 460583 450141 440804 432434 424411 416372 408451 400967 394193 388340 383475 379502 376416 374417 373498
60649 373498 373161 372932 372947 373619 374914 376433 378047 379877 381750 383273 384453 385649 386910 387922 388626 389264
60633 389264 389754 389729 389324 389222 389682 390180 390328 390566 391596 393748 397129 401635 406310 409541 410676 410884 411638
60616 411638 412769 412914 411527 409492 407811 406642 405707 404815 403727 402143 400092 397885 395541 392796 389786
60601 389786 387113 384937 382627 379762 376915 374865 373397 371597 369199 366928 365419 364383 363154 361622
60587 361622 360243 359371 358931 358630 358175 357400 356548 356387 357653 360267 363410 366434 369341 372273 375105 377932
60571 377932 381561 386958 394423 403732 414823 427639 441477 455338 469174 484092 500950 519149
60559 519149 537121 553507 567475 578366 585644 589160 589094 585747 579653 571715 562939 554088 545819 539011
60545 539011 534622 533276 535102 539904 547370 557292 569761 584968 602679 622056 642156 662366 682189
60532 682189 700774 716932 729480 737494 740506 738752 733074 724398 713468 701155 688712 677422
60520 677422 668121 661080 656004 652014 648180 644473 641795 640703 640581 640555 640792 642196 645117 649149 654141
60505 654141 660634 669197 679972 693066 708900 727966 750687 777700 809895 847929 891973 942005
60493 942005 998021 1059718 1126231 1196268 1268250 1340037 1408683 1470656 1522391 1560860 1583942
60482 1583942 1590437 1579686 1551285 1505365 1443269 1367999 1284109 1196978 1111426 1030297 954381
60471 954381 883966 820225 764651 717439 677146 642081 611523 585443 563505 544653 527515
60460 527515 511153 495612 481705 470024 460279 451822 444528 438619 433742 428959 423818 418904 415030
60447 415030 412227 409752 406899 403659 400765 398997 398276 397566 396017 393927 392130 390764 389401 388212 388049
60432 388049 389127 390425 390736 389744 387886 385788 384086 383126 382458 381197 379158 377043 375263 373316 370799
60417 370799 368265 366475 365357 364307 363056 361704 360377 359413 359406 360476 361940 363189 364337 365465 365942
60402 365942 365329 364345 364000 364243 364457 364841 366096 368027 369690 370907 372414 374386 376038 377038 378200 380229
60386 380229 382673 384658 385887 386373 385972 384870 383966 384034 384810 385479 385745 385912 386215 386682 387462 388810 390717
60369 390717 392864 394872 396480 397718 399064 401042 403403 405091 405449 405151 405449 406766 408510 410050 411278
60354 411278 412227 412853 413412 414552 416616 419035 420818 421658 422313 423770 426189 428889 431389 434138 437942
60339 437942 442798 447698 451598 454260 456041 457256 457998 458274 457971 456776 454459 451285 447969 445190 443205
60324 443205 441876 440947 440302 439941 439749 439491 439235 439665 441602 445218 450007 455461 461334 467244 472685 477845
60308 477845 483910 492036 502221 513665 526012 539801 555818 574436 595520 618543 642716 667179
60296 667179 690974 712565 729636 739880 742134 736602 724144 705768 682725 656689 629666 603833
60284 603833 581148 562555 547485 534593 523120 513243 505122 498127 491208 483772 476037 468845 463121
60271 463121 459047 455628 451463 446214 440964 436942 434326 432477 430827 429087 427053 424826 422981 421934
60257 421934 421282 420292 418951 417921 417466 417045 416155 415055 414398 414463 414953 415250 414718 413151 411193 410018 410290
60240 410290 411592 413054 414248 415211 415953 416440 416954 417978 419683 421834 424165 426515 428614 430171 431329
60225 431329 432681 434645 437091 439700 442338 444817 446657 447572 448024 448836 450243 451745 452895 453851 454986
60210 454986 456406 458113 460298 463046 465886 468104 469563 470938 472977 475700 478443 480532 481805 482637
60196 482637 483669 485523 488504 492329 496106 498815 500063 500408 500745 501274 501232 499815 497215 494558 492846
60181 492846 492142 491735 490831 489041 486488 483626 480899 478477 476376 474748 473805 473425 473158 472783 472588 472815
60165 472815 473019 472374 470619 468439 466794 466067 465891 465700 465328 465180 465813 467390 469584 472049 474783 477909
60149 477909 481334 484842 488314 491542 494041 495576 496802 498803 501834 504975 507305 508942 510637 512789
60135 512789 515403 518695 523136 528883 535567 542590 549242 554623 558005 559406 559476 558691 557026 554472 551394
60120 551394 548065 544293 539948 535679 532573 531136 530982 531594 532932 535081 537662 540040 542095 544405 547508
60105 547508 551181 554683 557574 559988 562038 563287 563046 561083 557819 553882 549678 545390 541146 537086
60091 537086 533483 530824 529585 529758 530747 531925 533199 534867 537061 539584 542326 545475 549091 552603 555039
60076 555039 555873 555510 554804 554129 553011 550659 546790 541930 537001 532657 528964 525588 522207 518727 515205
60061 515205 511762 508623 505996 503692 500993 497238 492527 487571 482790 477919 472641 467251 462351 458141
60047 458141 454334 450666 447177 444099 441789 440712 441141 442797 444998 447180 449130 450859 452528 454469
60033 454469 456877 459444 461575 463066 464308 465766 467489 469183 470493 471116 470864 469724 467738 464851 461121
60018 461121 456955 452758 448317 442984 436612 429912 423718 418265 413407 409085 405246 401622 398046 394848
60004 394848 392637 391792 392342 394053 396359 398514 400212 401945 404405 407713 411508 415513 419539 423159 425981
59989 425981 428302 430990 434549 438686 442835 446720 450187 452900 454564 455363 455955 456999 458676 460486 461533
59974 461533 461184 459603 457569 455738 454184 452565 450492 447704 444204 440410 437077 434860 433895 433789 433971
59959 433971 434117 434303 434718 435223 435421 435335 435738 437341 439692 441421 441767 441448 441718 442921 444404 445588 446571
59942 446571 447663 448898 450214 451691 453223 454235 454155 453091 451651 450147 448423 446460 444576 442747 440363
59927 440363 437163 434015 432103 431533 431384 431067 430820 430882 430999 431089 431632 432836 434010 434404 434281 434518 435413 436484
59909 436484 437279 437794 438201 438689 439599 441226 443506 446213 449325 452821 456262 459097 461327 463438 465757
59894 465757 468342 471369 475066 479206 483218 486876 490422 494005 497552 501250 505540 510417 515228 519384
59880 519384 522775 525385 527061 527978 528798 529958 531215 532225 533130 534156 535029 535315 535064 534577 533712 531895
59864 531895 528794 524611 519782 514793 510246 506720 504446 503268 502924 503157 503570 503728 503586 503734 505024 507866
59848 507866 511930 516614 521828 528141 536034 545217 554989 565113 575883 587290 598563 608653 616815
59835 616815 622601 625766 626553 625821 624601 623639 623405 624068 625028 624687 621160 613360 601490 586840 571287
59820 571287 556556 543409 531528 520357 509885 500419 491898 483807 475746 467858 460844 455605 452505
59807 452505 450662 448333 444565 440322 437442 436452 435900 433976 430412 426560 423882 422604 421788 420453 418514
59792 418514 416642 415392 414685 414092 413258 411924 409874 407214 404599 402862 402368 402761 403239 403029 401859 400078
59776 400078 398135 395930 393052 389738 387041 385644 384952 383928 382491 381513 381547 382162 382524 382164 381161 380072
59760 380072 379750 380796 383020 385662 388160 390495 392865 395392 398104 400857 403274 405140 406838 409078
59746 409078 412194 416031 420362 424940 429168 432348 434412 435944 437360 438547 439489 440603 442101 443498
59732 443498 444251 444541 444856 445052 444387 442491 439887 437444 435648 434448 433539 432661 431831 431342 431391 431635 431288
59715 431288 429835 427564 425296 423644 422676 422250 422384 423133 424349 425831 427649 429988 432647 435116 437297
59700 437297 439795 443132 446893 450019 451895 452910 454061 456219 459544 463326 466530 468889 471203 474165
59686 474165 477082 478434 477651 475681 473731 472154 470898 470251 470467 471067 471220 470713 470012 469410 468596 467159
59670 467159 465110 462823 460693 458928 457466 456002 454264 452277 450234 448136 445845 443506 441627 440573
59656 440573 440111 439702 439149 438805 439154 440353 442205 444433 446876 449455 452068 454539 456610 458016 458636 458539
59640 458539 457838 456558 454758 452719 450811 449145 447535 445846 444143 442351 440072 437076 433922 431798
59626 431798 431594 433222 435764 438113 439558 440071 440255 440875 442237 443911 445047 445026 443875 442110 440200 438199
59610 438199 435928 433350 430611 427778 424863 422146 420164 419203 419058 419435 420307 421634 423045 424080 424599
59595 424599 424647 424143 423090 421934 421268 421151 421032 420419 419398 418462 418064 418309 418901 419360 419377 418882 417782 415951
59577 415951 413622 411364 409385 407290 404894 402798 401551 400674 399336 397665 396426 395516 393935 391508 389559
59562 389559 389254 390063 390510 389974 389070 388642 389012 390029 391356 392785 394516 396924 399863 402562 404536 406207
59546 406207 408253 410718 413261 415941 419173 423121 427703 433168 440043 448437 457824 467729 478352 490392
59532 490392 504290 519485 534083 545421 551398 551556 546932 539113 529722 520464 512931 507984 505555
59519 505555 505213 506737 510025 514727 520215 525834 531030 535286 538145 539384 539126 537707 535354 531947 527158
59504 527158 520881 513550 505941 498610 491535 484336 476901 469686 463267 457671 452437 447414 443144 440123
59490 440123 437951 435704 433131 430967 430024 430356 431461 432889 434458 436203 438360 441186 444595 448213 451926
59475 451926 456080 460933 466173 471251 475983 480593 485329 490190 494780 498244 499657 498801 496474 493846
59461 493846 491684 490293 489820 490257 491402 493206 495990 500028 505144 511104 518190 526894 537105 548107
59447 548107 559402 571126 583530 596454 609447 622047 633637 643199 649591 652124 650781 645895
59435 645895 637884 627434 615727 604052 592993 582289 571735 561881 553411 546057 538817 531305 524321
59422 524321 518981 515837 515051 516750 520752 526420 533308 541673 552009 564470 579103 596129 615443
59409 615443 636274 657906 680167 702267 721462 734056 738048 734269 725013 712481 698724 685955
59397 685955 675903 669020 664735 662239 660577 658133 652558 641560 624050 600984 575168 549884 527201
59384 527201 507467 490276 475559 463650 454615 447918 442744 438545 435304 433274 432427 432196 431917 431399
59370 431399 430851 430402 430040 429949 430396 431128 431404 430924 430413 430865 432399 434259 435778 436947 438058 439278 440749
59353 440749 442807 445790 449758 454668 460756 468449 477796 488228 499097 510335 522370 535423 549172
59340 549172 563083 576930 590880 605214 619969 634650 648315 660139 670008 678344 685323 690557
59328 690557 693617 694466 693204 689794 684351 677404 669455 660492 650309 639181 627776 616505 605409
59315 605409 594665 584838 576493 569761 564322 559665 555420 551666 548865 547333 546883 547175 548218 550207
59301 550207 553036 556389 560316 565324 571813 579727 588872 599351 611583 625951 642412 660296 678476
59288 678476 695771 711042 722837 729242 728529 720094 704870 685151 664017 644285 627372 613210
59276 613210 601476 592470 586416 582583 580016 578909 580319 584523 590582 597670 605864 615279 625273 635183
59262 635183 645245 656038 667238 677568 685867 691768 695402 696871 696147 693214 688134 680959 671704
59249 671704 660612 648554 636868 626313 616328 605826 594806 584620 576447 570095 564654 559898
59237 559898 556488 554980 555093 555900 556446 556303 555875 556181 558037 561322 565078 568330 570721 572414 573513 573709
59221 573709 572531 569899 566246 561996 557099 551278 544522 537106 529286 521379 513979 507574 501899 496109
59207 496109 489754 483254 477350 472423 468428 465036 461706 458031 454345 451663 450704 451060 451530 451121 449722
59192 449722 448093 447331 448081 450059 452454 454786 457215 460112 463727 468211 473507 479105 484350 489174 494084
59177 494084 499315 504422 508854 512528 515682 518648 521956 526086 530887 535746 540609 546156 552605 559025
59163 559025 564539 569666 575755 583455 592412 602072 611897 621051 628830 635512 642015 648577 654438 658869
59149 658869 661775 663061 662200 658940 653920 648023 641414 633752 625114 616188 607578 599348 591338 583557
59135 583557 576116 569036 562342 556198 550750 545930 541657 538203 536097 535517 536063 537328 539505 543110 548177
59120 548177 554115 560416 567219 574994 583890 593556 603470 613365 623403 633957 645126 656468 667386
59107 667386 677763 688014 698509 709091 719148 727964 735149 740966 746122 750929 754874 757468 759253
59094 759253 761175 762954 763056 760606 756556 752423 748619 744738 740793 737175 733626 729232 723567 717113
59080 717113 710470 703710 696633 689054 680610 670822 659757 648315 637455 627199 616721 605490 594102
59067 594102 583848 575465 568512 562090 555944 550511 546011 541993 537974 534113 530952 528717 527086 525487
59053 525487 523497 521177 519090 517664 516495 514761 512391 510165 508373 506239 503229 500215 498451 497984
59039 497984 498047 498594 500233 502774 505126 506862 508777 511442 514221 516365 518263 520834 524251 528061 532208
59024 532208 537065 542688 548886 556046 565032 575952 587569 598420 608196 617635 627312 636990 646058
59011 646058 654072 660715 665706 669076 671264 672576 672709 671259 668607 665848 663767 662374 661578 661793 663494
58996 663494 666530 670300 674379 678667 683129 687750 692512 696979 700086 700861 699390 696700 693690 690479
58982 690479 686758 682339 677208 671336 664569 656662 647517 637611 628081 620060 613930 609493 606762 606155
58968 606155 607837 611227 615416 619850 624550 629850 636041 643077 650512 657833 664898 671922 679018 685867
58954 685867 691855 696376 698996 699477 697731 693744 687590 679561 670149 659784 648745 637475 626817
58941 626817 617618 610152 604158 599361 595669 592891 590582 588248 585528 582118 577779 572529 566788 561211
58927 561211 556360 552400 549003 545628 542018 538359 534905 531599 528266 525017 522142 519670 517333 515038
58913 515038 513180 512356 512821 514231 515895 517318 518538 519930 521864 524724 529085 535424 543528 552570 561937
58898 561937 571655 581919 592735 604264 616886 630389 643525 655099 665297 675365 686146 697556
58886 697556 709455 722365 737148 754352 773927 795172 816888 837883 857415 874944 889684
58875 889684 900868 908376 912617 913795 911746 906484 898368 887590 874033 857944 840365 822595 805341
58862 805341 788607 772228 756373 741530 728045 715639 703554 691351 679346 667959 656787
58851 656787 644816 631551 617563 603897 591262 579824 569378 559553 550134 541355 533749 527658
58839 527658 522942 519085 515408 511408 507142 503176 499921 497258 495043 493501 492584 491332 488765 485297
58825 485297 482390 480712 479394 477396 474796 472341 470426 469068 468390 468476 469010 469591 470241 471231 472553 473991
58809 473991 475587 477574 479837 481836 483203 484209 485456 487189 489032 490398 491085 491386 491695 492144 492654
58794 492654 493056 493054 492362 491181 490312 490379 490979 491000 489863 488195 487280 488083 490749 494750 499421 504513 510180
58777 510180 516308 522134 526907 530825 534825 539431 544077 547603 549076 548186 545277 541139 536531 531798
58763 531798 527041 522464 518240 514216 510207 506508 503601 501319 498893 496068 493753 493246 494987 498226
58749 498226 501765 504896 507788 511069 515032 519347 523582 527727 531960 536168 540193 544439 549739 556498
58735 556498 564225 571920 578757 584570 589968 595934 603022 611007 619386 627883 636258 644132 651501 658972
58721 658972 666904 674637 681266 686854 692206 697720 703314 709270 716179 724030 732202 740411 748906 757585
58707 757585 765734 772759 778515 782780 785088 785160 782869 777781 769567 758906 746994 733950 718628 700411
58693 700411 680347 660111 640604 622027 604549 588291 573185 559406 547515 537741 529523 522122
58681 522122 515235 508751 502448 496342 490843 486165 481941 477742 473610 469854 466765 464750 464272 465385
58667 465385 467722 471054 475368 480327 485359 490600 497084 505560 515491 525481 534255 541120 546004 549287
58653 549287 551122 550917 548113 543478 538799 535103 531985 528842 525800 523113 520602 518240 516439 515242
58639 515242 513987 512227 510195 507911 504783 500787 497200 495341 495168 495785 496704 497977 499664 501846 504596
58624 504596 507377 509080 509277 508848 508808 509249 510050 511800 515104 519577 524417 529517 535255 541656 548521 555906
58608 555906 563781 571679 579267 586597 593106 597246 598161 597081 595967 595239 593931 591559 588543 585013 580575
58593 580575 575387 570406 566316 562977 560030 557384 555047 553161 552285 553093 555701 559696 564691 570384 576328
58578 576328 582242 588457 595537 603490 611767 619862 627534 634653 641275 647701 654207 660996 668628 677958
58564 677958 689293 702150 716212 731848 749210 767520 785930 804398 823014 841166 858187
58553 858187 874163 889100 901825 910825 915855 917847 917534 915047 910532 904211 896063 886266 875687
58540 875687 865098 854218 842354 829592 816528 803171 789149 774772 760879 747755 735001
58529 735001 722334 709726 697106 684772 673833 665264 658768 653418 649140 646543 645577 645464 645857 646981
58515 646981 648649 650162 651280 652399 653745 655224 657032 659549 662581 665546 668416 671656 675261 678653
58501 678653 681542 684048 685967 686733 686257 685110 683760 682155 680121 677635 674777 671833 669270 667158 664942
58486 664942 662253 659430 656759 653843 650619 648314 648372 650813 654678 659644 666058 673721 681847 690119 698749
58471 698749 707630 716320 724618 732213 738126 741554 742967 743278 742340 739449 735035 730457 726293 722119 717874
58456 717874 714158 711168 708599 706619 705799 706086 707001 708729 711794 715758 719491 722677 725765 728491 729857
58441 729857 729639 728582 726997 724581 721741 719624 718495 717435 716051 715245 715849 717633 720087 723139 726749
58426 726749 730726 735251 740643 746495 751996 757256 763360 770980 779886 789711 800009 809590 817064 822239
58412 822239 825876 828074 828160 826228 823434 820505 817227 813675 810618 808343 806186 803620 800838 798071 795284
58397 795284 792666 790542 788777 787196 786294 786462 786874 786472 785678 785688 786462 787058 787536 788624 789698 789234 787276
58380 787276 785375 783944 781919 779343 777972 778657 780277 782053 784850 789230 794146 798731 803722 810019
58366 810019 817241 824746 832748 841539 850837 860586 871252 882737 894274 905809 918076 930929 943144
58353 943144 954310 965278 976300 986414 995121 1002907 1009664 1014575 1018169 1022432 1028082 1033695 1038399
58340 1038399 1043434 1050007 1057520 1065103 1073170 1082365 1092580 1104030 1117598 1133066 1148621 1163145
58328 1163145 1177417 1192182 1206742 1220418 1233682 1246863 1259372 1271123 1282975 1294909 1305577
58317 1305577 1314568 1323256 1332503 1341492 1349753 1358374 1368099 1378139 1387897 1397984 1408604 1418992 1429377
58304 1429377 1441327 1455233 1469722 1484473 1501030 1519671 1538197 1555340 1572742 1591983 1612153
58293 1612153 1632040 1652216 1673209 1694069 1714492 1735857 1758479 1780442 1801079 1822818 1847454
58282 1847454 1873319 1898537 1924420 1952998 1983569 2014438 2046021 2079604 2114903 2151224 2189142
58271 2189142 2228853 2268926 2308870 2350764 2396148 2443590 2491559 2541258 2594247 2649704 2706602
58260 2706602 2766172 2829653 2895947 2964072 3035456 3111167 3189335 3267959 3347794 3429889 3512929
58249 3512929 3595772 3679952 3766989 3856065 3947074 4042882 4145558 4253513 4365460 4483936
58239 4483936 4611577 4747325 4889931 5041874 5206003 5381505 5567024 5764586 5976671
58230 5976671 6202731 6442438 6698935 6975125 7270521 7585606 7925195 8293514 8690612
58221 8690612 9118054 9583218 10093028 10648651 11251754 11910622 12634339 13426788 14293209
58212 14293209 15247345 16305396 17479019 18782271 20240356 21884524 23745393 25860667
58204 25860667 28283879 31077496 34305476 38044105 42395235 47481189 53437654 60425425
58196 60425425 68639802 78289418 89563299 102618104 117574292 134501337 153414679
58189 153414679 174294425 197061030 221454968 246889871 272384601 296556850 317611422
58182 317611422 333420328 341898957 341654034 332539758 315758258 293486072 268282746
58175 268282746 242529156 218035725 195898283 176576481 160036714 145836575 133227406
58168 133227406 121407466 109846894 98440268 87391802 76995621 67496715 59047135
58161 59047135 51691052 45372685 39984355 35415312 31557677 28294825 25514741 23132198
58153 23132198 21083895 19310401 17758267 16392465 15190439 14126566 13173492 12313475
58145 12313475 11536215 10828628 10176803 9574364 9019155 8504628 8023203 7574834 7163495
58136 7163495 6787667 6441831 6124379 5836214 5573950 5331808 5108024 4902461 4709983
58127 4709983 4523064 4339494 4161618 3989843 3822844 3662381 3511831 3371021 3237647
58118 3237647 3112386 2997528 2891915 2792138 2697538 2609487 2527120 2448268 2373312 2303817 2238572
58107 2238572 2175056 2113501 2055640 2000867 1947446 1895937 1847566 1800832 1753647 1707272 1664164
58096 1664164 1623518 1582859 1542521 1504493 1468293 1432120 1396884 1364948 1335957 1307896 1281216
58085 1281216 1257867 1237081 1216123 1194577 1174023 1154180 1133329 1112104 1092911 1075745 1058213
58074 1058213 1039600 1021433 1004034 985897 966673 947695 929410 911075 892977 876298 860899
58063 860899 845831 831696 819792 809319 798249 786585 775904 766002 755072 743115 732103 722573
58051 722573 712945 702532 692487 683312 673903 663657 653430 643987 635319 627625 621136 615022 608286
58038 608286 601511 595865 590829 584974 578484 572612 567069 560408 552725 545462 538627 530803 521957 513706
58024 513706 506551 499227 491178 483404 476464 469760 463145 457233 451786 445742 439159 433241 428230 423229
58010 423229 418249 414387 411725 409107 406314 404375 403359 401938 399708 397860 396913 395725 393594 391588
57996 391588 390853 391074 391355 391359 390981 390188 389678 390408 392026 393026 392897 392840 394008 396278 399067 401982 404267
57979 404267 404959 404123 402881 401938 401162 400675 400975 401679 401508 399989 398064 396677 395810 395146 394555 393728 392445
57962 392445 391347 391319 391971 391958 390870 389542 388302 386296 382874 378448 373568 368243 362535 356869 351519
57947 351519 346592 342555 339805 337798 335656 333529 332256 331812 331365 330768 330706 331430 332751 335242 339867 346265
57931 346265 352835 358856 365184 372593 380712 388877 396768 403958 410031 415367 420681 425664 429318 431620
57917 431620 433489 434949 434817 432420 428241 422660 415497 407089 398454 389981 381264 372394 364046 356109
57903 356109 347790 339355 332091 326077 319622 311616 302970 295052 288060 281711 276193 271616 267579 263975
57889 263975 261216 259163 256958 254372 252174 250761 249677 248947 249430 251215 253112 254456 256101 258777 261775
57874 261775 264175 266154 268080 269406 269505 268744 267777 266541 264758 262667 260539 258225 255883 254268 253612
57859 253612 253042 251808 250308 249241 248617 248302 248746 250392 253025 256323 260397 265342 270932 277125 284080
57844 284080 291406 298386 305177 312532 319915 325373 328043 329410 331146 332935 333488 332484 330278 326704
57830 326704 321584 315782 310473 305764 301038 296175 291548 287259 283281 279897 277288 275171 273454 272624
57816 272624 272801 273132 272919 272663 273191 274432 275882 277590 279733 281819 283296 284460 285745 286514 285542 282512
57800 282512 278219 273535 268785 263989 259094 254108 249352 245264 241775 238468 235580 233957 233526 232768 230462
57785 230462 227181 224252 222030 220064 218261 216859 215713 214609 213966 214371 215649 217115 218504 220107 222266
57770 222266 225223 229053 233366 237568 241735 246497 251700 256083 258851 260583 261936 262506 261869 260606 259163
57755 259163 256609 251927 245789 239696 233951 227868 221501 215681 210579 205753 201512 198827 197728 197021
57741 197021 195832 194422 193332 192669 192408 192544 192761 192695 192657 193360 194831 196241 196848 196539 195595 194570 194244
57724 194244 194929 195887 196184 195982 196172 196916 197508 197669 197948 198660 199357 199645 199629 199193 197639 194611 190852 187519
57706 187519 185067 183148 181249 179112 176800 174702 173345 172997 173480 174305 174826 174374 172682 170314 168419
57691 168419 167858 168641 170130 171636 172801 173622 174220 174636 174913 175367 176555 178928 182593 187365 192870 198828
57675 198828 205663 214721 227373 243906 263812 286981 313801 344098 377059 412494 451081 492646
57663 492646 534795 573578 604599 623211 625269 609456 578655 538084 492334 444767 398703 357363
57651 357363 322388 293406 269317 249412 233259 220295 209799 201037 193491 187188 182461 179094
57639 179094 176204 173345 171088 169926 169286 168486 167971 168527 169702 170225 169818 169441 169685 170056 170029 169826 169738 169490
57621 169490 168744 167752 167056 166767 166377 165233 163223 161040 159614 159151 159085 159041 159284 159943 160533 160785 161238 162316
57603 162316 163427 163773 163458 162872 161597 159032 155742 152995 151101 149288 147089 144771 142395 139545 136278
57588 136278 133409 131557 130492 129550 128150 125980 123310 121087 120056 119902 119798 119538 119328 118798 117262 114900
57572 114900 112604 110623 108391 105828 103716 102470 101405 99702 97439 95312 93907 93486 93907 94543 94767
57557 94767 94635 94662 94941 95078 94913 94615 94130 93331 92754 93317 95102 97153 98678 99746 100617 101166 101222 100900
57539 100900 100305 99484 98818 98883 99721 100735 101358 101338 100460 98731 96839 95590 94747 93144 90162 86410 82852
57522 82852 80022 78192 77517 77735 78410 79654 81898 84797 87236 88726 90003 91943 94610 97715 101220
57507 101220 105059 108871 112442 115856 118950 121214 122517 123324 123910 124036 123654 123247 123098 122860 122225 121404
57491 121404 120596 119574 118167 116599 115088 113659 112543 112083 112019 111610 110753 110136 109963 109454 108127 106704
57475 106704 106085 106195 106462 106727 106886 106378 104877 103038 101692 100681 99233 97179 95069 93324 91990 91161
57459 91161 91011 91412 91978 92446 92746 92893 93017 93202 93150 92433 91334 90887 91679 93106 94191 94576 94339 93495
57441 93495 92319 91581 91735 92286 92542 92476 92268 91595 90272 89105 89046 89738 89925 89267 88762 89266 90496 91745
57423 91745 92776 93646 94231 94380 94187 93794 93164 92266 91294 90633 90718 91851 93792 95590 96253 95719 94890 94638
57405 94638 95128 96184 97800 99854 101591 101959 100643 98528 96922 96376 96450 96533 96581 96932 97655 98424 98922 99161
57387 99161 99459 100321 102204 105054 108139 110676 112521 113949 114884 114926 114159 113374 113290 113920 114784 115340 115147 114183
57369 114183 113187 113153 114139 115054 114952 114123 113527 113559 113830 113857 113455 112629 111538 110611 110331 110811 111685 112423 112747
57350 112747 112838 113120 113732 114338 114683 115123 116159 117538 118432 118538 118410 118567 118888 119167 119650 120586 121698 122560
57332 122560 123206 123972 124966 126019 126899 127354 127165 126498 125954 126039 126704 127553 128248 128619 128690 128744 129133 129904 130858
57313 130858 131989 133441 135026 136276 137118 137992 139103 140070 140526 140707 141165 142271 144128 146511 148737 150039
57297 150039 150334 150293 150526 151107 151923 152874 153621 153741 153394 153241 153522 153753 153491 152763 151546 149590 147059 144574
57279 144574 142285 139613 136288 132813 129490 125847 121693 117973 115819 115264 115485 115725 115420 114172 112372
57264 112372 111241 111449 112185 112358 112181 112744 114447 116791 119429 122487 125941 129430 132723 135862 138862
57249 138862 141630 144002 145710 146702 147635 149395 151830 153849 155224 157208 160525 163820 165390 165679 166587
57234 166587 168738 170937 172196 172868 173584 174358 175116 176163 177704 179583 181745 184366 187417 190722 194462
57219 194462 198971 203931 208487 212317 216002 220174 224857 229807 234978 240434 246161 252101 258113 263927
57205 263927 269409 274779 280311 286067 292224 299308 307600 316624 325729 334935 344648 354817 364989 374982
57191 374982 384987 395260 406197 418328 431658 445440 459295 474083 490835 509206 527911
57180 527911 546363 564923 583841 603087 623050 644200 665922 686796 706314 725334 744656
57169 744656 764034 783016 801845 821042 840629 860215 879508 898519 917535 936978 956990
57158 956990 977232 997377 1017478 1037410 1056407 1073917 1090543 1107266 1123972 1139725 1154320
57147 1154320 1168593 1183277 1198597 1214958 1232869 1251985 1271282 1290434 1310101 1330715 1352077
57136 1352077 1374497 1399200 1426901 1456783 1487513 1518728 1551098 1585408 1622015 1660758 1701104
57125 1701104 1742797 1786503 1833398 1884122 1938680 1997372 2061108 2130800 2207178 2291267 2384175
57114 2384175 2486212 2597005 2716730 2846605 2988114 3142556 3311525 3497042 3701046
57105 3701046 3925716 4174772 4453992 4770420 5131847 5547259 6027063 6582622 7226078
57096 7226078 7970495 8829096 9813650 10933242 12193266 13593958 15129595 16789978 18564131
57087 18564131 20447248 22453448 24628159 27040163 29739926 32705202 35819972 38909908
57079 38909908 41805539 44382367 46557797 48266986 49448065 50045609 50022899 49372420 48119764
57070 48119764 46320045 44049767 41399574 38470515 35370865 32209920 29089283 26094903
57062 26094903 23291873 20722412 18407209 16349548 14540366 12962573 11594250 10411159
57054 10411159 9388679 8503311 7733961 7062750 6474909 5957955 5501059 5095090 4732884
57045 4732884 4409134 4119719 3860897 3628949 3420421 3232293 3061669 2905621 2761863
57036 2761863 2629401 2507842 2396110 2292548 2196375 2108352 2029793 1961517 1904028 1858130
57026 1858130 1825200 1807224 1806248 1822700 1854198 1897153 1949956 2013803 2090549 2181001 2284388
57015 2284388 2395522 2499767 2573112 2591892 2545196 2438835 2289303 2115673 1935251 1761775
57005 1761775 1603878 1464809 1344346 1241108 1153491 1079647 1017454 964565 918680 878275
56995 878275 842953 812568 786196 762506 740831 721130 703186 686669 671788 658948 647895
56984 647895 638116 629995 624447 621257 618743 615252 610031 602525 591910 577986 561726 544383 526603
56971 526603 508846 491991 476921 463882 452819 444076 438276 435569 435340 436698 439189 443125 449172
56958 449172 457505 467473 478197 489166 499836 508900 514531 515258 510286 499397 483332 464219 444778
56945 444778 426772 410562 396051 383513 373537 366760 363613 363837 366407 370682 377508 388277 402855
56932 402855 419370 436195 453090 469973 485556 497889 505537 507516 502786 490829 472605 450254
56920 450254 425845 400831 376436 353874 333955 316833 302217 289720 279036 269970 262398 256122
56908 256122 250816 246108 241706 237541 233895 231227 229696 228997 228916 229793 231969 235004 238047 240965 244545
56893 244545 249468 255643 262671 270369 278572 287024 295884 305967 317947 331439 344974 356664 364794
56880 364794 368296 367161 362269 354590 344682 333086 320873 309426 299876 293005 289506 289970 294655 303520
56866 303520 316505 333619 354796 379847 408595 440970 476842 515590 555690 594738 630000
56855 630000 658967 679365 689056 686587 672253 648572 619531 589151 560418 535138 514543 499900
56843 499900 492395 492529 500004 514412 535774 564177 599302 640726 688327 741826 800009 860818
56831 860818 921771 979427 1028472 1062424 1076078 1067439 1037709 990327 930396 864159 797830 736268
56819 736268 682379 637415 601638 575003 557474 548820 548362 555303 569296 590357 618180 651833
56807 651833 690023 731250 773493 813887 848613 873082 882821 875226 850816 812617 764524 710616
56795 710616 655376 603089 556365 515880 481842 454960 435596 422842 415259 412174 413660 419617
56783 419617 429553 443120 460155 480058 501322 521625 538273 548869 551994 547193 534299 513182
56771 513182 484506 450400 413923 377925 344511 314990 289670 267848 248592 231522 216562
56760 216562 203268 191104 180371 172057 166455 162405 158341 153759 149270 145502 142443 139792 137455
56747 137455 135423 133516 131566 129792 128652 128263 128107 127427 125893 123875 122131 121177 120847 120526 119937 119513
56731 119513 119721 120205 120081 119099 117900 116968 115972 114507 112897 111653 110626 109397 108285 108164 109287 110917
56715 110917 112180 112792 112914 112836 112922 113455 114403 115595 116991 118477 119549 119728 119199 118547 117940 117073 115815
56698 115815 114349 112726 110943 109458 108912 109228 109631 109693 109731 110022 110319 110371 110214 109699 108459 106773 105777 106227
56680 106227 107510 108380 108313 107674 106979 106575 106793 107765 109095 110122 110520 110440 110135 109705 109239 109002 109353 110319
56662 110319 111292 111439 110683 109994 110346 111709 113554 115959 119374 123462 127188 130236 133445 137539 142237
56647 142237 146873 151082 154505 156671 157779 158852 160494 162114 162988 163423 164100 164830 164928 164520 164595 165710
56631 165710 167326 168497 168763 168338 167802 167693 168130 168804 169357 169631 169549 169073 168361 167615 166726 165490 164167 163282
56613 163282 162761 162014 161048 160660 161183 161878 162102 162207 162575 162613 161674 160330 159675 159749 159672 159076 158332 157499 156162
56594 156162 154439 153159 152715 152482 151726 150585 149757 149587 149786 149822 149380 148563 147753 147302 147404 148167 149544 151123
56576 151123 152382 153320 154494 156242 158277 160225 162021 163481 164163 164185 164596 166301 169078 172291 176077
56561 176077 181033 187096 193587 200147 206837 213485 219695 225362 230451 234365 236357 236542 235800 234702 233300
56546 233300 231940 231417 231988 232908 233276 232802 231522 229279 225936 221896 218044 215163 213405 212215 210830
56531 210830 208926 206708 204360 201848 199351 197318 195635 193346 189842 185972 183236 182084 181615 180782 179238
56516 179238 177211 175208 173725 172692 171367 169394 167668 167432 168724 170476 171927 173099 173990 174302 174041
56501 174041 173592 173105 172543 172340 173112 174578 175643 175741 175331 174916 174435 173840 173419 173170 172589 171510 170504 170131
56483 170131 170453 171473 173249 175105 175597 173957 171109 168752 167878 168537 170280 172222 173288 173231 173088 173918
56467 173918 175374 176231 176053 175590 175578 175956 176404 177012 178016 179283 180515 181846 183873 186988 190866 194775
56451 194775 198285 201427 204162 206091 206986 207359 208098 209526 211085 211982 211946 211372 210921 210926 211102 210938 210487 210496
56433 210496 211531 213181 214385 214327 212840 210366 207898 206520 206440 206747 206528 205849 205110 204033 202140 199877
56417 199877 198255 197516 197097 196819 197091 197861 198388 198318 198185 198510 199181 199940 200771 201572 202140 202707 203772 205125
56399 205125 205827 205497 204935 205036 205728 206349 206455 205854 204495 202944 202480 204076 207406 211165 214197 216198
56383 216198 217713 219680 222660 226309 229765 232435 234100 234569 234010 233475 234212 236243 238381 239749 240504
56368 240504 241004 241194 241143 241215 241334 240905 239882 239087 239024 239222 239232 239399 240036 240690 240942 241220 242041 243060 243572
56349 243572 243458 243015 242437 242092 242700 244380 246007 246315 245357 244252 243888 244498 246073 248423 251080 253772
56333 253772 256800 260455 264364 267948 271180 274358 277418 280028 282065 283609 284778 285937 287638 289914
56319 289914 292122 293853 295471 297297 298923 299941 300655 301295 301134 299366 296494 293935 292470 291900 292026
56304 292026 293051 294990 297338 299441 300829 301367 301442 301810 302828 304117 305303 306628 308400 310311 311845
56289 311845 312904 313560 313699 313518 313787 314933 316390 317531 318697 320461 322465 323986 325170 326725 328719
56274 328719 330769 333112 336345 340228 343813 346720 349355 351976 354599 357786 362334 367942 373178 377189
56260 377189 380610 384515 389181 394308 399779 405747 412299 419379 426903 434966 444159 455385 468903 483778
56246 483778 498920 514499 531622 550731 571118 592039 613515 635797 658681 681649 704201
56235 704201 725822 745970 764249 780420 794252 805554 814139 819486 820785 817787 811340 802600 791992
56222 791992 779444 765225 749897 733767 717145 700875 685741 671477 657109 642238 627328
56211 627328 612973 599636 587878 577928 569057 560264 551586 543954 537751 532354 527164 522278 517974
56198 517974 514267 511089 508329 505626 502805 500477 499544 500093 501436 503139 505213 507360 508983 510096 511386
56183 511386 513101 514626 515390 515562 515665 516069 517010 518551 520418 522354 524560 527248 529935 531952 533552
56168 533552 535738 538986 542941 547278 551981 556765 561195 565491 570378 576012 581920 588088 595168 603396
56154 603396 612232 621286 630724 640551 650416 660444 671421 683765 697165 711518 727427 745360
56142 745360 765207 787147 812250 841637 875667 914395 958301 1008081 1064230 1127384 1198767
56131 1198767 1279809 1371192 1472152 1580375 1692609 1805587 1916205 2020704 2114630 2194742
56121 2194742 2260855 2315090 2359715 2396478 2427205 2453157 2473471 2485554 2487462 2479166 2461642 2436116
56109 2436116 2404349 2368136 2327668 2281048 2225725 2159793 2082253 1993636 1896897 1796649 1697013
56098 1697013 1600954 1511464 1431616 1362778 1304044 1254123 1212706 1179555 1153557 1133518 1118775
56087 1118775 1108299 1100328 1093856 1089607 1088646 1090706 1094550 1099283 1104601 1110426 1116913 1124278 1132215 1140130
56073 1140130 1148208 1157358 1167734 1178261 1188104 1197731 1208022 1219227 1231274 1244219 1257902 1271967
56061 1271967 1286682 1302944 1321050 1340241 1359744 1379473 1399546 1420072 1441555 1464464 1488309
56050 1488309 1512225 1536424 1561669 1587316 1611592 1634052 1656116 1678825 1701829 1725037 1749337
56039 1749337 1774984 1801053 1827273 1854672 1883676 1913413 1943801 1976358 2011860 2049037 2086774
56028 2086774 2125829 2167121 2210117 2254359 2300921 2350815 2403264 2456980 2511896 2568512 2626896
56017 2626896 2687442 2751167 2818165 2887286 2958338 3032947 3112202 3195258 3281370 3371320 3465603
56006 3465603 3563313 3664309 3770407 3882872 4000698 4122926 4250635 4385101 4526231 4674628
55996 4674628 4832969 5003303 5184912 5376700 5579683 5795506 6024791 6268774 6530088
55987 6530088 6810092 7108026 7424797 7764830 8132223 8528215 8954772 9417405 9921893
55978 9921893 10471628 11070985 11727749 12449240 13239960 14106612 15061783 16119485 17291828
55969 17291828 18594667 20052671 21695063 23552110 25662063 28077807 30862077 34082425
55961 34082425 37818917 42173964 47270708 53250670 60283432 68573026 78340703 89794058
55953 89794058 103102767 118379719 135667787 154955396 176214462 199387302 224268284
55946 224268284 250341930 276680268 301899420 324124414 341054021 350334125 350250966
55939 350250966 340390212 321827860 296756418 267828952 237563984 207971110 180405058
55932 180405058 155607677 133861552 115150833 99270054 85900240 74682597 65275436
55925 65275436 57373515 50707638 45050469 40222143 36080467 32506555 29402852 26695642
55917 26695642 24327440 22246526 20407388 18775739 17325189 16030577 14869263 13825607
55909 13825607 12888177 12044090 11280327 10588008 9960582 9389644 8866685 8386932 7947314
55900 7947314 7542356 7165942 6815406 6490100 6187502 5904360 5640195 5395983 5170482
55891 5170482 4961102 4767200 4589334 4426437 4276954 4141856 4023448 3921894 3835629 3764357
55881 3764357 3708956 3669136 3643752 3632607 3635301 3648744 3667978 3688619 3706076 3713095 3700741 3662039
55869 3662039 3593535 3494760 3368766 3222576 3064569 2901235 2737570 2579186 2431358 2296398
55859 2296398 2174019 2063923 1966011 1878712 1799547 1727458 1662779 1605094 1552951 1505488 1462427
55848 1462427 1422506 1383644 1344829 1306528 1269383 1233821 1200567 1170034 1141399 1113656 1087196
55837 1087196 1062942 1040419 1018354 996828 977094 959339 942332 925275 908443 892017 875865
55826 875865 860601 847240 835481 823614 810477 796447 782367 768633 755460 742934 730599
55815 730599 717906 705135 692984 681325 669450 657563 646942 638424 631603 625703 620454 616000
55803 616000 612568 610220 608446 606327 603735 601854 601680 602490 602842 602640 603043 604588 606667 608733 610861
55788 610861 613052 615025 616699 617971 618139 616504 613465 609981 605967 600198 591778 580757 567413 551986
55774 551986 535266 518549 502857 488828 477204 468549 462557 458456 455888 454645 453820 452232 449454
55761 449454 445467 439673 431553 422057 412989 404987 397392 390082 383906 379015 374200 368448 362016 355431
55747 355431 348586 341484 334890 329434 324759 320184 315632 311350 307245 303108 299124 295744 293264 291725
55733 291725 290893 290203 289095 287496 285654 283590 281184 278672 276459 274454 272141 269239 265741 261533 256708
55718 256708 252065 248476 245810 243279 240769 238954 238140 237925 238106 238956 240525 242511 244999 248370 252338
55703 252338 255941 258663 260610 261374 259825 255531 249531 243188 236919 230500 223930 217566 211912 207502
55689 207502 204452 202039 199419 196849 195334 194898 194284 192779 191345 191317 192728 194484 195550 195435 194290
55674 194290 192992 192514 192660 192116 190203 187757 185645 183327 179885 175863 172895 171740 171593 171342 170632 169632
55658 169632 168481 167331 166588 166771 168131 170433 173167 176072 179389 183345 187470 190842 193023 194408 195627
55643 195627 197092 199084 201664 204301 206114 206734 206473 205579 203895 201429 198626 195771 192629 188946 184731
55628 184731 179852 173983 167368 161065 155992 152126 148984 146375 144324 142690 141344 140361 139726 139169 138501
55613 138501 137729 136742 135419 134188 133740 133899 133559 132190 130610 129692 129020 127591 125348 123147 121578 120583
55597 120583 120028 119904 120012 120055 120000 119937 119671 118909 117769 116770 116349 116557 117044 117173 116462 115172 114189 114055 114382
55578 114382 114456 114021 113249 112381 111745 111747 112402 113195 113787 114523 115923 118009 120492 123184 125807 127776 128693 128800
55560 128800 128555 128043 127158 126038 124837 123340 121283 118812 116282 113826 111462 109343 107534 105832 104153
55545 104153 102834 102230 102256 102563 102818 102612 101659 100381 99675 99659 99299 97854 96051 95111 95162 95493 95845 96472
55527 96472 97122 97029 95972 94547 93295 92222 91280 90653 90382 90176 89772 89195 88649 88321 88228 88045 87368 86327
55509 86327 85562 85270 84840 83865 82902 82534 82350 81760 81301 81909 83210 83806 83289 82701 82792 83085 83118 83468 84721
55490 84721 86284 87145 87277 87425 87800 87836 87250 86666 86975 88409 90467 92503 94149 95178 95320 94517 93333
55473 93333 92632 92650 92724 92266 91543 91077 90653 89675 88229 86998 86110 84938 83291 82000 81876 82628 83304 83420
55455 83420 83177 82833 82400 81884 81452 81247 81207 81084 80630 79828 79017 78665 78942 79616 80380 81217 82342 83784 85009
55436 85009 85133 83775 81741 80440 80431 80899 80881 80545 80750 81646 82503 82863 83111 83715 84493 84958 84990 84849 84800 85018
55416 85018 85666 86819 88387 90267 92471 94948 97324 98927 99170 98050 96289 94808 93957 93351 92478 91171
55400 91171 89461 87448 85568 84485 84224 83848 82566 80839 79769 79699 80128 80750 81666 82620 83020 82933 83182
55383 83182 84120 85141 85836 86808 88625 90556 91215 90236 88555 87135 86102 85281 84935 85545 87072 88795
55367 88795 89891 90021 89361 88271 87115 86260 85845 85444 84325 82367 80502 79825 80380 81195 81451 81141 80579
55350 80579 79802 78730 77582 76781 76476 76392 76129 75571 75022 74916 75368 76141 77109 78496 80436 82476 83856
55333 83856 84223 83814 83048 82219 81477 80748 79745 78358 76947 75957 75355 74842 74468 74588 75248 76036 76551 76671
55315 76671 76474 76316 76853 78406 80289 81398 81546 81647 82395 83347 83596 82876 81670 80647 80293 80751 81626
55298 81626 82187 82066 81609 81325 81190 80797 80056 79447 79545 80414 81515 82196 82292 82198 82325 82710 83241 84028 85199
55279 85199 86516 87526 88032 88160 88140 88361 89365 91295 93475 95020 95773 96153 96213 95511 93894 91810 89733
55262 89733 87791 86063 84747 83890 83368 83129 83052 82683 81747 80832 80828 81666 82434 82814 83488 84776 85871 86003
55244 86003 85542 85220 84869 83841 82319 81332 81495 82390 83226 83693 84029 84565 85313 85909 85971 85499 84801 84101 83475
55225 83475 83157 83481 84365 85166 85224 84340 82739 80933 79666 79555 80590 82211 83893 85423 86715 87802
55209 87802 88884 89907 90191 89119 87147 85445 84541 84004 83471 83128 83107 83302 83965 85558 87709 89223 89524
55192 89524 89217 88917 88495 87872 87448 87123 86035 84082 82623 82697 83497 83706 83486 83860 84812 85419 85490 85736 86481
55173 86481 87362 88285 89564 91093 92343 93169 93805 94135 93861 93341 93364 94038 94722 95040 95165 95143 94814 94489 94807
55154 94807 95728 96445 96502 96322 96479 97084 97964 98785 98901 97842 96121 94852 94383 93985 93121 92249 91964 92037 91802
55135 91802 91076 90193 89420 88720 88005 87378 87182 87768 89009 90132 90366 89757 89027 88696 88658 88584 88351 88111 88235
55116 88235 89041 90214 90733 89896 88258 87093 87069 87976 89431 91083 92277 92395 91675 91000 90811 90859 91004 91475
55098 91475 92235 92896 93473 94457 95930 97375 98635 100217 102249 103838 104078 103115 101738 100395 99144 98122
55082 98122 97528 97334 97429 97812 98354 98658 98452 97911 97352 96869 96438 96117 95948 95940 96246 97032 98037 98635 98462 97635
55062 97635 96401 95030 94078 94077 94769 95250 95094 94780 94792 94973 95099 95377 95923 96312 96177 95745 95285 94559 93440
55043 93440 92627 93087 94924 97285 99121 99750 99103 97922 97325 97621 97854 97037 95446 94101 93376 92914 92633
55026 92633 92898 93687 94422 94819 95239 96008 96930 97741 98542 99405 99906 99472 98095 96466 95434 95429 96335 97742
55008 97742 99276 100677 101674 102050 101957 101954 102454 103227 103674 103579 103359 103555 104272 105148 105778 106094 106363 106841 107449 107847
54988 107847 107748 107086 105962 104662 103655 103280 103400 103629 103930 104625 105727 106649 106863 106563 106420 106849 107753 108798
54970 108798 109684 110212 110265 109721 108442 106604 104982 104482 105228 106435 107343 107875 108209 108172 107565 106808 106734 107699
54952 107699 109186 110297 110508 110064 109760 110241 111382 112433 112861 112864 113020 113706 114897 116265 117344 117862 117980
54935 117980 117929 117451 116148 114454 113539 113904 114637 114553 113613 112731 112657 113605 115554 118187 120761 122757 124618
54918 124618 127252 130875 134873 138802 142954 147778 153162 158505 163277 167405 171122 174344 176235 175789
54904 175789 173041 169252 165562 161933 157845 153449 149211 144840 139597 133701 128510 125071 123148 121911
54890 121911 120923 120099 119266 118245 117162 116368 116151 116610 117598 118691 119471 119919 120393 121270 122819 125254 128486
54873 128486 131934 135097 138307 142395 147537 153020 158289 163558 168992 173835 176963 178049 177692 176458
54859 176458 174240 170659 165797 160351 155055 150093 145185 140271 135852 132396 129641 126923 124118 121748
54845 121748 120051 118514 116598 114488 112780 111706 111053 110661 110553 110641 110608 110162 109202 107761 106021 104444
54829 104444 103706 104334 106291 108931 111374 113105 114224 115118 115908 116317 115990 114849 113202 111658 110828 110837 111134
54812 111134 111061 110601 110296 110392 110473 110160 109789 109992 110821 111666 112054 112108 112139 112141 111918 111493 111104 110855 110685 110664 110989
54791 110989 111527 111685 111049 110013 109389 109496 109998 110573 111235 111891 112198 112163 112407 113370 114593 115322 115577 116063
54773 116063 117138 118416 119397 120004 120466 121124 122456 124823 127993 131269 134292 137496 141620 146970 153241
54758 153241 159840 166290 172441 178341 183745 187887 190001 190000 188340 185346 181135 176135 171090 166360 161745
54743 161745 157184 153135 149880 146956 143757 140417 137585 135545 134062 133043 132757 133209 133671 133191 131540
54728 131540 129470 127990 127509 127738 128333 129373 131080 133362 135938 138820 142248 146202 150364 154667 159414
54713 159414 164653 169759 173929 176894 178922 180326 181107 180794 178491 173509 166344 158729 152311 147445 143606
54698 143606 140600 138703 137755 136894 135450 133606 131881 130417 129090 127997 127360 127087 126813 126314 125595 124602
54682 124602 123215 121622 120399 120011 120364 120991 121541 121923 122115 122069 121789 121312 120587 119611 118745 118609 119446 120667
54664 120667 121263 120672 119156 117387 115897 114968 114815 115608 117200 118950 120022 120031 119411 119004 119269 119990 120719
54647 120719 121270 121722 122223 122934 123912 124797 124901 123985 122780 122317 122749 123269 123178 122588 121963 121459 121023 120728 120642
54628 120642 120568 120295 120000 120031 120351 120580 120587 120614 120693 120431 119708 119240 119847 121191 121915 121282 120158 119920 120793 121847
54608 121847 122427 122773 123209 123471 123241 122774 122534 122576 122709 122892 122992 122506 121148 119579 118952 119722 121365 123212
54590 123212 125050 126829 128295 129106 129110 128449 127567 127020 126944 126819 126103 124992 124123 123715 123592 123888 125025 126853
54572 126853 128513 129439 129917 130428 130999 131525 132136 132817 133164 132994 132837 133295 134278 135367 136561 138044 139386
54555 139386 139754 138999 138001 137676 137975 138124 137660 137038 137160 138384 140129 141545 142479 143457 144737 145820 146172
54538 146172 146035 146199 147171 148877 150980 153124 154975 156333 157169 157439 157099 156540 156691 158192 160546 162446
54522 162446 162961 162149 160680 159243 158206 157446 156493 155208 154174 153992 154279 154015 152966 152023 151830 151757 150877
54505 150877 149504 148957 149856 151369 152319 152404 152043 151535 150907 150362 150286 150779 151489 152007 152188 152081 151838 151710 151846
54486 151846 152032 151969 151854 152266 153307 154365 155058 155886 157370 158994 159806 159955 160741 162992 166057 168777 170845
54469 170845 172794 175029 177283 178920 179525 179405 179529 180661 182479 183970 184804 185687 187132 188618 189481 190007
54453 190007 190834 191697 191733 190945 190433 190950 191984 192620 192666 192443 191902 190579 188375 185848 183643 181877 180320
54436 180320 178948 178047 177673 177252 175960 173570 170768 168584 167570 167549 167949 168314 168553 168767 168855 168422 167308
54419 167308 166046 165408 165457 165542 165363 165561 166851 168935 170735 171517 171395 170881 170366 169964 169476 168542 167198 166227
54401 166227 166480 167791 168959 168992 168050 166990 166323 165960 165826 166223 167420 169150 170827 172229 173721 175698
54385 175698 178049 180310 182125 183273 183453 182465 180601 178424 176118 173485 170662 168320 166881 165968 164980
54370 164980 163903 163188 163084 163459 164122 164995 166085 167515 169428 171668 173746 175265 176174 176497 176205 175535
54354 175535 174944 174419 173334 171430 169494 168438 168097 167618 166708 165742 164793 163402 161437 159451 158002 157129
54338 157129 156590 156085 155139 153364 151110 149418 148990 149506 150116 150316 150203 150139 150362 150798 151172 151337 151367 151164
54320 151164 150332 148910 147908 148395 150058 151381 151367 150499 149864 150008 150923 152420 154022 154944 154782 154046 153681
54303 153681 154186 155425 156915 158091 158588 158583 158592 158671 158248 157066 155844 155503 155965 156304 155893 154885 153662 152417
54285 152417 151407 151029 151356 151888 151994 151449 150405 149088 147774 146860 146603 146740 146672 146204 145880 146380 147673
54268 147673 149073 150063 150653 150890 150531 149526 148429 147821 147563 147160 146673 146632 147063 147330 147181 147293 148355 150071
54250 150071 151528 152229 152315 152043 151583 151236 151275 151464 151114 149820 147978 146429 145698 145676 145934 146137 146142 145876 145367
54231 145367 144927 145045 145906 147133 148163 148730 148775 148149 146828 145357 144535 144523 144647 144335 143839 143769 144174 144465
54213 144465 144111 143060 141519 139684 137849 136591 136500 137555 138876 139388 138885 138220 138289 139089 140035 140875 141775
54196 141775 142649 143065 142979 142990 143587 144510 145148 145278 145099 144742 144061 142929 141551 140447 140046 140190 140196 139628 138840
54177 138840 138446 138461 138458 138432 138806 139549 140086 140293 140863 142256 143877 144860 145149 145250 145317 145148 144787 144538 144535 144803
54157 144803 145526 146712 147746 147879 147088 145966 144858 143727 142759 142326 142147 141228 139087 136607 135093 134770
54141 134770 134726 134276 133876 134462 136182 138055 138896 138381 137184 136244 136040 136501 137318 138212 138956 139313 139163 138752
54123 138752 138723 139569 140962 141914 141836 141149 140562 140149 139657 139333 139641 140326 140642 140575 140904 141822 142525 142648 143126
54104 143126 144829 147121 148700 149297 149555 149662 149217 148274 147434 146883 146240 145489 145145 145321 145419 145033 144404 143750
54086 143750 142902 142029 141947 143087 144680 145674 146115 146932 148524 150212 151164 151322 151230 151304 151544 151770 151877 151779 151324
54067 151324 150453 149449 148845 148912 149393 149878 150305 150894 151734 152710 153736 154770 155640 156165 156474 156946 157791 158969
54049 158969 160503 162558 165093 167656 169643 170692 170925 170950 171557 173084 175141 177122 178871 180542 182111
54034 182111 183599 185664 189226 194277 199691 204503 208817 213138 217397 221170 224439 227514 230437 233056
54020 233056 235515 238095 240627 242655 244191 245714 247256 248068 247541 246044 244433 243015 241455 239566 237648
54005 237648 235923 234018 231294 227559 223241 219000 215337 212476 210385 208872 207787 207100 206688 206148 205175
53990 205175 204083 203559 203740 203879 203203 201761 200066 198177 195745 192963 190873 190441 191597 193445 195217
53975 195217 196813 198588 200842 203551 206497 209616 213229 217816 223563 230271 237712 245879 254749 263904
53961 263904 272459 279330 283531 284382 281721 276066 268556 260463 252546 244827 237194 230131 224504 220516
53947 220516 217358 214325 211894 211049 211676 212358 211937 210733 209903 210091 211112 212610 214517 216959 220035 223646
53931 223646 227317 230372 232591 234602 237251 240625 243964 246538 248325 249812 251478 253590 256180 258975
53917 258975 261544 263765 266127 269386 273909 279471 285563 291691 297391 302364 306805 311415 316690 322147
53903 322147 326620 329427 331032 332330 333582 334406 334672 334854 335297 335576 334938 333216 330866 328174 324830 320459
53887 320459 315282 309970 304968 300222 295479 290553 285277 279558 273681 268382 264313 261478 259363 257525
53873 257525 255816 254061 251852 248884 245365 241891 238929 236509 234390 232431 230693 229149 227457 225289
53859 225289 222925 221134 220216 219463 217993 215914 214092 212850 211530 209490 206952 204578 202727 201466 200847
53844 200847 200718 200545 199862 198750 197535 196313 195105 194190 193796 193679 193380 192743 191866 190834 189910 189665 190323
53827 190323 191208 191455 191058 190580 190036 188922 187382 186422 186686 187725 188782 189626 190252 190436 190181 190085 190648 191556
53809 191556 192269 193085 194916 198028 201668 205054 208292 212016 216535 221681 227338 233616 240436 247328 254018
53794 254018 261042 269299 278901 288833 297955 305913 312689 317686 319948 319266 316499 312653 308152 303126
53780 303126 297908 292946 288434 284300 280413 276654 272928 269250 265691 262272 259055 256228 253838 251475
53766 251475 248572 245014 241108 237021 232715 228438 224799 222125 220153 218508 217108 215909 214670 213224
53752 213224 211698 210273 209024 208151 207968 208381 208674 208084 206452 204243 202246 201315 201856 203345 204740 205670
53736 205670 206763 208590 210805 212812 214787 217435 220944 224742 228164 230876 232796 234001 234687 234839 234102
53721 234102 232275 229820 227517 225739 224424 223525 223033 222573 221539 219735 217598 215761 214662 214562 215529
53706 215529 217210 218909 220129 220993 221956 223163 224225 224739 224932 225523 226780 228075 228747 229206 230542 233036
53690 233036 235719 237587 238614 239275 239780 240287 241251 242818 244248 244635 244007 243123 242442 241968 241916 242719 244293
53673 244293 245931 247017 247376 246932 245630 243824 242242 241369 241196 241590 242437 243334 243665 243213 242376 241582 240791
53656 240791 239717 238234 236387 234281 232129 230222 228769 227876 227648 228016 228534 228694 228515 228476 228865 229515 230189
53639 230189 230867 231539 232108 232646 233467 234717 236078 237014 237191 236680 235947 235593 235915 236740 237874 239478 241652
53622 241652 243868 245446 246510 247891 250033 252607 255240 257944 260626 262869 264575 266231 268148 270040
53608 270040 271771 273900 276894 280286 283323 286011 288742 291240 292811 293560 294425 295787 296839 296717 295652
53593 295652 294570 293951 293597 293227 292795 292269 291509 290500 289504 288837 288496 288051 286995 285307 283613 282532 281861
53576 281861 280726 278697 276487 275206 275064 275216 274865 274104 273452 272995 272381 271532 270901 270935 271588 272482 273302 273902
53558 273902 274255 274515 274965 275688 276423 276993 277720 279124 281228 283440 285197 286460 287639 289315 292075 296192
53542 296192 301209 306118 310296 314090 318256 323000 327944 332924 338294 344278 350510 356633 363070 370772
53528 370772 380193 390938 402407 414336 426530 438614 450492 462825 476481 491573 507440 523572
53516 523572 540048 556994 574169 591371 608871 627065 645942 665182 684541 703860 722971
53505 722971 741907 760992 780343 799525 818098 836301 854675 873162 891188 908664 926260
53494 926260 944437 962749 980538 997934 1015684 1034030 1052238 1069312 1084995 1099867 1114533
53483 1114533 1128911 1142460 1154986 1166906 1178541 1189455 1198824 1206388 1212650 1218122 1222667 1225618
53471 1225618 1226284 1224322 1219886 1213595 1206144 1197789 1188260 1177139 1164219 1149527 1133259 1115758 1097381
53458 1097381 1078372 1058936 1039334 1019634 999442 978264 956215 934138 912863 892613 873187
53447 873187 854457 836513 819538 803720 789148 775637 762819 750610 739521 730324 723322 718017
53435 718017 713569 709626 706675 705468 706154 708221 711327 715826 722203 730331 739673 750034 761643 774679
53421 774679 789165 805235 822987 842103 862157 883357 906341 931093 956663 982323 1008513
53410 1008513 1036283 1066222 1098345 1132604 1168895 1206627 1244871 1283155 1321987 1362510 1405676
53399 1405676 1451625 1499728 1549176 1599519 1650615 1702297 1754282 1806278 1857834 1908247 1957086
53388 1957086 2004762 2052053 2098935 2144365 2187315 2227477 2264779 2298822 2329127 2355535 2378011
53377 2378011 2396512 2411315 2422911 2431173 2435120 2433981 2428020 2417801 2403173 2383639 2359261 2330287
53365 2330287 2296217 2256215 2210505 2160556 2107788 2052892 1996504 1939638 1882988 1826470 1769995
53354 1769995 1714249 1660167 1607945 1557141 1507582 1459651 1413605 1368996 1324989 1281103 1237552
53343 1237552 1194943 1153756 1114188 1076440 1040970 1008225 978130 950043 923398 898320 875481
53332 875481 855327 837584 821588 807060 794324 783649 774603 766343 758528 751606 746163 742344 740019
53319 740019 739075 739244 739959 740807 742038 744328 748173 753712 760906 769495 778979 789069 800127 812703
53305 812703 826638 841085 855529 870474 887011 905931 927292 950461 974462 998558 1022771
53294 1022771 1047768 1074148 1101905 1130455 1158975 1186727 1213344 1238877 1263333 1286161 1306486
53283 1306486 1323857 1338430 1350377 1359526 1365810 1369663 1371617 1371691 1369523 1364950 1358128 1349184 1338094
53270 1338094 1324992 1310277 1294266 1276870 1257734 1236636 1213668 1189060 1162944 1135331 1106306
53259 1106306 1076221 1045621 1014992 984613 954584 924868 895216 865308 835212 805692 777771
53248 777771 751842 727380 703615 680301 657556 635190 612674 589825 567089 544966 523550
53237 523550 502967 483862 466858 451692 437440 423675 410956 400015 390917 383168 376214 369605
53225 369605 363017 356476 350323 344740 339432 333995 328358 322738 317319 312184 307272 302257 296782 291086
53211 291086 286109 282627 280466 278838 277199 275481 273738 271975 270211 268381 266311 264031 261860 259919
53197 259919 257881 255582 253474 251894 250211 247543 244235 241751 240865 240712 240030 238745 237795 237749 238182 238355
53181 238355 238015 237408 236775 236052 235063 233819 232437 230829 228808 226618 224972 224202 223697 222655 221187 220106
53165 220106 219765 219790 219996 220757 222114 223139 222807 221214 219424 218217 217446 216602 215642 215060 215238 215932 216476
53148 216476 216490 216172 215787 215135 213898 212391 211530 211940 213364 214992 216075 216225 215515 214436 213520 212871 212308
53131 212308 211886 211885 212232 212439 212281 212084 212124 212226 212239 212440 212989 213353 212823 211486 210211 209727 210076 210893 211835
53112 211835 212598 212872 212424 211208 209388 207353 205641 204614 204140 203670 202648 200894 198710 196649 195134
53097 195134 194271 194056 194568 195715 196862 197145 196271 194730 193104 191493 189786 188133 186875 186225 186251 186960
53081 186960 188120 189218 189871 190199 190548 191039 191571 192084 192536 192768 192679 192419 192179 191904 191461 190952 190593 190369
53063 190369 190087 189674 189183 188589 187885 187343 187374 188106 189266 190506 191612 192485 193095 193478 193611 193340 192653 191947
53045 191947 191802 192393 193262 193708 193361 192454 191622 191364 191616 191936 192091 192190 192142 191384 189522 187004 184803 183525
53027 183525 183167 183495 184200 184769 184776 184392 184179 184223 183894 182661 180839 179262 178463 178323 178345 178101 177606 177409 178097
53008 178097 179541 180884 181425 181364 181406 181822 182221 182149 181593 180871 180293 180018 179990 179875 179256 178118 177034 176667 177101
52989 177101 177863 178563 179187 179650 179516 178587 177575 177590 178844 180348 181111 181150 181048 180988 180810 180728 181237 182260 182954
52970 182954 182632 181478 180158 179103 178414 178136 178296 178897 180132 182376 185653 189257 192266 194322 195638
52955 195638 196419 196734 196882 197265 197681 197287 195675 193575 191978 190788 188996 186170 183103 180740 179053 177384
52939 177384 175504 173752 172413 171542 171335 172051 173385 174417 174469 173755 172964 172480 172190 171836 171326 170876 170981
52922 170981 171993 173582 174824 175068 174497 173677 172905 172306 172223 172968 174237 175282 175679 175614 175399 175098 174688 174236
52904 174236 173806 173446 173394 174001 175289 176789 177918 178376 178068 176910 174946 172587 170549 169549 169946 171504
52888 171504 173402 174764 175369 175796 176738 178295 180005 181411 182304 182472 181528 179314 176448 174151 173293 173599
52872 173599 174022 173953 173813 174307 175360 176211 176498 176786 177808 179498 181145 182349 183440 184849 186385 187444
52856 187444 187817 187996 188603 189816 191488 193481 195466 196580 195922 193608 190885 188914 187764 186883 186142 185802
52840 185802 185677 184980 183213 180806 178728 177632 177428 177426 176864 175574 174190 173532 173802 174585 175525 176630 177938
52823 177938 179293 180524 181552 182244 182532 182669 182938 183056 182355 180759 179081 178136 178050 178686 180142 182285 184282
52806 184282 185347 185766 186545 188116 189949 191422 192441 193088 193232 192730 191636 189928 187359 183880 180038
52791 180038 176685 174274 172512 170685 168307 165590 163252 161798 161066 160585 160233 160215 160549 160942 161216 161480
52775 161480 161808 162072 162285 162764 163790 165289 167015 168750 170173 170894 170891 170662 170642 170670 170428 170208 170783 172422
52757 172422 174395 175593 175475 174346 172928 171793 171088 170661 170389 170356 170697 171333 171951 172255 172207 172137 172613 173993
52739 173993 175955 177643 178499 178768 179030 179405 179537 179197 178539 177878 177621 178358 180499 183675 186823 189064 190228
52722 190228 190566 190377 190046 189947 189973 189534 188305 186615 184839 182901 180795 179119 178387 178087 177191 175521 173854
52705 173854 172659 171464 169773 167896 166422 165356 164309 163222 162378 161859 161519 161453 162014 163255 164699 165870
52689 165870 166831 167955 169294 170415 170948 171094 171477 172494 173977 175492 176807 177994 179182 180316 181064
52674 181064 180948 179825 178342 177603 178072 179052 179551 179413 179164 179040 178839 178640 178893 179601 180121 180092 179988 180427
52656 180427 181419 182713 184333 186322 188392 190390 192666 195388 197858 199292 200008 201033 202582 203710 203580
52641 203580 202303 200351 197892 195134 192752 191338 190613 189625 187681 184886 181925 179591 178432 178580 179844
52626 179844 181880 184251 186456 188198 189675 191338 193289 195097 196231 196435 195672 194063 191965 189898 188221
52611 188221 187083 186624 186852 187302 187269 186607 185887 185495 185000 183833 182285 181313 181516 182724 184462 186345 188022
52594 188022 189197 189881 190290 190436 190130 189476 189050 189372 190436 191905 193500 194956 195785 195532 194319 192884
52578 192884 191979 191817 192125 192536 192836 192983 193106 193488 194351 195579 196745 197520 198028 198703 199791 201041 201857
52561 201857 201735 200621 198907 197107 195513 194151 193064 192469 192529 193052 193636 194109 194655 195439 196272 196786 196850
52544 196850 196709 196697 196927 197273 197658 198279 199453 201181 202922 203900 203689 202479 200855 199405 198492 198176 198193
52527 198193 198091 197503 196393 195036 193849 193171 193102 193478 194046 194660 195279 195770 195917 195737 195722 196503 198206 200273
52509 200273 202096 203703 205576 207833 209948 211513 212881 214631 216537 217666 217568 216853 216362 216185 215836 215001
52493 215001 213766 212435 211524 211598 212504 213000 211816 209104 206260 204273 202880 201483 200260 199895 200663 202193
52477 202193 203948 205582 207053 208629 210664 213112 215451 217251 218597 219734 220600 221052 221353 222002 223115
52462 223115 224312 225264 226061 226961 227997 228932 229504 229635 229396 228827 227855 226498 225043 223754 222442 220668
52446 220668 218418 216177 214182 212076 209635 207369 205817 204614 202966 200938 199510 199241 199596 199894 200268
52431 200268 201182 202423 203177 202978 202134 201207 200458 199827 199201 198592 198178 198149 198491 198972 199463 200081 200870 201555 201934
52412 201934 202409 203764 206366 209842 213523 216896 219653 221782 223873 226913 231382 236748 242150 247364
52398 247364 252646 257811 262026 264596 265506 264936 262684 258475 252692 246474 241032 236972 234171 232124 230399
52383 230399 228864 227568 226519 225710 225308 225516 226157 226584 226280 225474 225019 225640 227342 229462 231343 233003
52367 233003 235109 238147 241688 244743 246770 247979 248665 248800 248434 247950 247496 246560 244587 241788 238970 236824
52351 236824 235730 235943 237414 239537 241586 243295 244673 245491 245539 245254 245497 246655 248368 250089 251481 252426
52335 252426 253203 254529 256854 259676 262230 264732 268133 272588 277176 281368 285858 291410 297739 304125
52321 304125 310504 317193 324010 330440 336413 342294 348243 354113 359802 365255 370207 374299 377387 379534
52307 379534 381021 382601 385251 389213 393598 397444 400845 404524 408575 412295 415154 417364 419474 421881
52293 421881 424727 427859 430866 433427 435611 437617 439420 440882 441902 442160 441138 438909 436573 435222
52279 435222 434723 434233 433746 434205 436044 438513 440742 442733 444865 447004 448633 449590 450240 451180 453020 456140
52263 456140 460247 464378 467844 471121 475422 481228 487505 492613 495918 498275 500940 504346 508193 512357
52249 512357 517063 522188 527119 531592 536055 540742 544973 548026 550301 552853 555982 559032 561477 563394
52235 563394 564852 565589 565579 565344 565450 566098 567321 569165 571504 574150 577204 580821 584515 587307 588817 589737
52219 589737 590959 592711 594828 597375 600528 604155 607995 612046 616500 621369 626434 631373 635795 639404
52205 639404 642366 645340 648949 653362 658447 664015 669629 674526 678146 680702 682984 685516 688045 689864
52191 689864 690636 690891 691593 693134 695010 696639 698214 700261 702622 704447 705183 704970 704008 702160 699379 696050
52175 696050 692668 689577 687012 684823 682077 677697 671783 665651 660289 655505 651008 647454 645606 645079
52161 645079 644807 644432 644423 645038 646011 647171 648647 650423 652219 653848 655234 656145 656411 656311 656216 655930 654995 653636
52143 653636 652805 653127 654319 655783 657272 658776 660129 660963 660870 659572 657271 654823 653169 652462 652124 651848
52127 651848 652108 653528 656175 659787 664359 670165 677356 685880 695718 706864 719058 731702 744191
52114 744191 756322 768306 780320 792045 802760 811901 819407 825462 830170 833648 836140 837730 838129
52101 838129 837136 835198 833177 831674 830983 831599 834087 838270 843020 847198 850568 853566 856489 859179 861340
52086 861340 862803 863485 863275 862018 859625 856254 852289 847979 843182 837773 832300 827802 824787 822671 820522
52071 820522 818140 816079 814759 813982 813385 813026 813270 814279 815835 817660 819641 821613 823131 823797 823732 823416
52055 823416 822943 821831 819791 817398 815604 814727 814288 813716 812793 811471 809705 807604 805363 802910 799919
52040 799919 796336 792611 789205 786092 782904 779459 776045 773338 771981 771982 772570 773018 773589 775158 777833 780638
52024 780638 782864 785060 788060 791562 794528 796718 798862 801260 803092 803527 802882 802230 802264 802974 804100 805405
52008 805405 806577 807272 807200 806012 803235 798639 792462 784932 775719 764298 750840 736254 721234 705730
51994 705730 689550 673036 656636 640190 623230 606043 589865 575752 563658 552923 543396 535606
51982 535606 529789 525155 520416 514958 509264 504148 499661 494908 488914 481561 473609 465915 458837 452331
51968 452331 446300 440639 435160 429859 425362 422758 422733 424901 428270 432424 438025 445936 455919 466454
51954 466454 475939 483866 490680 496704 501511 504456 505514 505397 504855 503949 502028 498493 493717 489208 486642
51939 486642 486652 488648 491870 496357 502754 511430 522081 534084 546813 559544 571393 581685 590256
51926 590256 597119 601776 603089 600024 592516 581510 568172 553198 536927 519887 502938 486836
51914 486836 471873 457966 444987 432938 422009 412594 405065 399389 395006 391250 387848 384961 382947
51901 382947 382255 383388 386626 391663 397774 404444 411700 419690 428096 436178 443331 449281 453614 455425
51887 455425 453869 449096 442291 434673 426732 418628 410938 404527 399850 396895 395852 397213 401035 406563
51873 406563 412962 420137 428537 438360 449241 460540 471686 482396 492792 503163 513385 522771
51861 522771 530725 537345 543098 548157 552432 556094 559617 563233 566568 568773 568793 565798 559731 551329 541214
51846 541214 529187 514991 499606 484967 472131 460406 448659 436926 426249 417367 410236 404591
51834 404591 400214 396562 392737 388213 383336 378870 375276 372703 371441 371845 373700 376025 377871 379120
51820 379120 380219 381269 381861 381790 381445 381236 381082 380759 380413 380316 380451 380804 381818 383947 386921 390039 393193
51803 393193 396879 401068 404774 407054 407842 407403 405515 401842 396812 391446 386388 381606 377102 373302 370515
51788 370515 368328 365890 362737 359155 355766 352903 350445 348113 345810 343701 342140 341518 341945 342948 343722
51773 343722 343930 344023 344488 345048 345115 344918 345536 347689 351041 354855 358829 362986 367287 371834 377153 383817
51757 383817 391885 400877 409944 417829 423165 425336 424800 422129 417169 409735 400795 392058 384420 377620
51743 377620 371474 366535 363162 360774 358699 357312 357634 360039 363970 368909 375069 383005 392885 404302
51729 404302 416557 428928 440775 451522 460603 467619 472667 476457 479859 483267 486450 488936 490288
51716 490288 490024 487632 482977 476632 469590 462651 456210 450548 445955 442340 438932 434715 429315 423339
51702 423339 417905 413936 411861 411700 413218 416056 419777 423739 426953 428428 428000 426742 426220 427210 429251
51687 429251 431495 433719 436300 439300 441783 442252 439730 434521 427992 421617 416126 411384 407012 403143
51673 403143 400592 400227 402161 405692 410134 415509 422239 430347 439352 448972 459418 470666 481793 491453
51659 491453 498897 504167 507354 508049 505624 499739 490515 478559 465023 451398 438921 428180 419356
51646 419356 412668 408406 406630 406997 408775 410851 411865 410702 407025 401240 393908 385327 375704 365547
51632 365547 355695 346976 339846 334266 329800 325903 322257 318903 315995 313515 311341 309532 308349 307887
51618 307887 307833 307733 307450 307248 307452 308134 309079 309957 310504 310637 310430 310000 309438 308875 308440 308113 307747 307416 307578
51599 307578 308642 310455 312506 314653 317349 321066 325811 331281 337155 343072 348742 354413 360892 368591
51585 368591 376670 383593 388535 391872 394386 396535 398683 401497 405624 411087 417386 424131 431472 439991
51571 439991 450349 462941 477650 493985 511520 530075 549404 568969 588318 607499 626739
51560 626739 645843 664406 682727 702113 724085 749513 778604 811231 846896 884485 922356
51549 922356 958529 990552 1015511 1030822 1035221 1028879 1012709 987973 956404 919961 879990 836984
51537 836984 791562 745437 700872 659275 620826 585597 554475 528507 507510 489852 473823
51526 473823 459029 446263 436160 428343 421893 416306 411688 408134 405303 402614 399659 396315 392626
51513 392626 388711 384719 380831 377316 374416 372016 369536 366500 363108 359877 356810 353488 350025 347251
51499 347251 345528 344009 341696 338852 336632 335520 334901 334173 333519 333342 333521 333655 333696 333976 334830 336378 338483
51482 338483 340660 342211 342706 342271 341328 340190 339014 338005 337406 337290 337407 337243 336289 334425 332071 329824
51466 329824 327837 325614 322544 318688 315053 312876 312440 312620 311957 310263 308786 308630 309585 310901 312592
51451 312592 315206 318660 322268 325867 330002 334891 340102 345557 351963 359801 368585 377667 387149 397403
51437 397403 408272 419358 430625 441897 452022 459350 463155 464126 463577 462588 461688 460638 458389 453712
51423 453712 446174 436378 425383 414141 403356 393520 384980 378052 372893 369160 366116 363410 361487
51410 361487 360886 361412 362411 363603 365095 366791 368448 370260 372769 376042 379392 382071 383970 385568 387441
51395 387441 389789 392196 393979 395073 396353 398659 401760 404879 408098 412527 419087 427793 438371 450904
51381 450904 465686 483024 503454 527646 555841 587777 623351 662780 705923 752074 800675
51370 800675 851493 903429 953632 998478 1035289 1062777 1080313 1087490 1084280 1070995 1048115 1016557
51358 1016557 978027 934553 887617 838105 787137 736605 688728 645182 606505 572139 541102
51347 541102 512891 487725 465854 446924 430368 416090 404256 394448 385527 376466 366995 357459
51335 357459 348433 340508 333994 328614 323759 319201 315233 312050 309361 306843 304643 303075 302124 301575 301441
51320 301441 301804 302325 302391 301942 301781 302787 304936 307353 309209 310355 311113 311784 312532 313491 314619 315393 315056
51303 315056 313477 311658 311064 312370 315002 317884 320352 322255 323477 323710 322655 320251 316777 312908 309538
51288 309538 307135 305209 302792 299653 296773 295346 295556 296616 297768 298796 299668 300277 300781 301760 303699
51273 303699 306449 309439 312236 314683 316712 318332 319746 321202 322766 324473 326649 329721 333638 337718
51259 337718 341272 344217 346830 348947 349666 348058 344154 339059 334016 329493 325234 320990 316845 312897
51245 312897 309086 305494 302500 300377 298970 297997 297457 297467 297884 298387 298813 299145 299300 299265 299322 299782 300517 301055
51227 301055 301109 300773 300217 299519 298789 298218 297995 298318 299342 300876 302314 303282 304198 305756 307962 310187 312109
51210 312109 313977 315864 317332 318094 318436 318685 318869 319296 320871 324171 328527 332666 336083 339194 342290
51195 342290 345057 347224 349026 350662 351723 351560 350148 348280 346844 346039 345337 344197 342713 341505 341015
51180 341015 341074 341203 341100 340720 340073 339235 338498 338219 338423 338659 338310 337119 335523 334483 334784 336341 338231
51163 338231 339582 340265 340634 340849 340850 340911 341660 343223 344618 344453 342314 339119 336023 333278 330520 327812 325752
51146 325752 324413 322936 320656 318142 316423 315487 314385 312771 311398 310801 310338 309110 307309 305993 305878
51131 305878 306871 308517 310286 311653 312512 313494 315345 317999 320712 323042 325197 327424 329615 331632 333524
51116 333524 335234 336559 337654 339164 341552 344629 348005 351593 355324 358757 361556 364203 367557 371619
51102 371619 375250 377411 378267 378724 379169 379102 377998 376003 373651 371169 368407 365282 362044 359105 356806
51087 356806 355344 354671 354409 354081 353554 353189 353424 354266 355259 355942 356304 356815 358003 359897 361914 363431 364474
51070 364474 365698 367649 370203 372794 375025 376993 379161 382020 385724 390000 394486 399170 404285 409754
51056 409754 415099 420096 425193 430898 436879 442084 445765 448144 450115 452613 456342 461748 468892 477366
51042 477366 486476 495624 504483 512842 520405 526861 532175 536653 540614 544077 546899 549081 550631 551095
51028 551095 549439 544575 535929 523677 508754 492677 476969 462453 449251 437476 427620 420110
51016 420110 414847 411426 409519 408800 408879 409723 411915 415967 421403 426904 431409 434864 437993 441642 446266
51001 446266 451682 457215 462276 466868 471436 476354 481710 487342 492798 497419 500889 503684 506650 510223
50987 510223 514320 518879 524076 530053 536894 544883 554341 565158 576839 589139 602193 615897 629555
50974 629555 642402 654080 664264 672122 676589 677197 674386 669032 661871 653427 644387 635815 628794 623761
50960 623761 620419 618488 618374 620784 625870 633132 642062 652357 663502 674818 686148 698072 711095
50947 711095 725064 739698 755237 772105 790237 809288 829278 850520 873046 896616 921248
50936 921248 947068 973348 998093 1018809 1033660 1041994 1044313 1041998 1036694 1029533 1020925 1011060 1000243
50923 1000243 988474 975089 959382 941515 922303 902084 880371 856908 832660 809159 787072
50912 787072 765888 745104 725206 707183 691386 677208 663832 651047 639319 629197 620613 612689
50900 612689 604345 595246 586096 577904 571071 565310 560224 555586 551097 546326 541141 535972 531410 527655
50886 527655 524545 522018 520270 519370 518966 518526 517773 516756 515547 514128 512662 511644 511563 512516 514291 516694
50870 516694 519507 522221 524277 525753 527474 530212 533999 538366 542965 547699 552528 557638 563689 571396
50856 571396 580748 590943 601211 611556 622621 635021 648930 664264 681093 699765 720513 743023
50844 743023 766628 790941 816094 842301 869598 898170 928457 960382 992747 1023915 1053095
50833 1053095 1080626 1107124 1132842 1157769 1181783 1204652 1226395 1247874 1270543 1295300 1321829
50822 1321829 1349330 1377703 1407775 1440440 1475721 1512630 1549849 1586478 1621964 1655298 1684664
50811 1684664 1708176 1724748 1733877 1734947 1727398 1711544 1688553 1659562 1625313 1586680 1544941 1501356
50799 1501356 1457074 1413555 1372438 1334618 1300035 1268666 1241162 1218153 1199477 1184590 1173230
50788 1173230 1165220 1160143 1157812 1158654 1162933 1169878 1178130 1186736 1195074 1202214 1207266 1210317 1212215 1213343
50774 1213343 1213255 1211494 1207992 1202515 1194497 1183735 1170593 1155134 1136676 1114718 1089904 1063484 1036107
50761 1036107 1007608 977803 947047 916141 886126 858060 832484 809045 786958 766010 746870
50750 746870 730393 716868 706005 697296 690168 684052 678729 674665 672730 673435 676564 681584 688285 696829
50736 696829 707286 719369 732691 747120 762716 779420 796930 814901 833228 852146 872078
50725 872078 893233 915219 937113 958130 978265 998123 1018079 1037755 1056383 1073439 1088667
50714 1088667 1101689 1112043 1119708 1125304 1129556 1132863 1135611 1138590 1142649 1148112 1155124 1164484 1177410
50701 1177410 1194119 1213337 1233684 1255065 1277998 1301991 1325473 1347319 1367493 1385917 1401454
50690 1401454 1412634 1419090 1421819 1422249 1421426 1419947 1418257 1416877 1416412 1417340 1419749 1423428 1428214 1434146 1441299
50675 1441299 1449803 1460084 1472841 1488636 1507758 1530551 1557553 1589039 1624599 1663292 1703993
50664 1703993 1745508 1786621 1826292 1863686 1898097 1929233 1957662 1984455 2010107 2034186 2056290
50653 2056290 2076836 2096453 2114964 2131505 2145388 2156481 2165117 2172225 2179281 2187485 2197113 2208196
50641 2208196 2221590 2238597 2259646 2284172 2311813 2342766 2376658 2411911 2446820 2480633 2512972
50630 2512972 2542727 2568321 2588886 2604528 2615554 2622040 2624195 2622468 2616973 2606982 2591057 2567391
50618 2567391 2534183 2490484 2437409 2378549 2318829 2262778 2213654 2173564 2143596 2123627 2112385
50607 2112385 2107974 2108263 2110830 2112987 2112253 2106748 2095000 2075726 2048197 2012701 1970173 1921389 1866900
50594 1866900 1807744 1745735 1682876 1620802 1560784 1503711 1449768 1398603 1350249 1305582 1265505
50583 1265505 1230034 1198661 1171408 1148892 1131405 1118461 1109347 1103642 1101095 1101428 1104609 1110995 1120892
50570 1120892 1133963 1149229 1165516 1181821 1197356 1211588 1224316 1235613 1245590 1254232 1261635 1268458
50558 1268458 1275959 1285388 1297417 1312377 1330919 1354017 1382171 1415008 1451948 1492987 1538436 1588037
50546 1588037 1640709 1695155 1750391 1805654 1860118 1913011 1964088 2013971 2063965 2115498 2169772
50535 2169772 2227933 2291209 2360427 2435400 2515297 2599691 2688853 2782987 2881825 2985317 3094124
50524 3094124 3208873 3329155 3453641 3580752 3708756 3835623 3959403 4078398 4190296
50515 4190296 4291385 4377397 4445101 4492538 4518043 4520093 4498349 4453984 4388643 4303738 4201259
50504 4201259 4084806 3959285 3829660 3700218 3574777 3457246 3351728 3261763 3189233 3134260
50494 3134260 3096514 3076247 3073343 3085547 3108508 3137572 3168673 3197347 3218089 3225558 3216057 3187493
50482 3187493 3138805 3070397 2984848 2886256 2778661 2665280 2548872 2432031 2316948 2205174
50472 2205174 2097712 1995152 1897883 1806420 1721424 1643153 1571070 1504247 1442093 1384575 1331930
50461 1331930 1284336 1241539 1202580 1166267 1132349 1101935 1076259 1055183 1037373 1021751 1008170
50450 1008170 996659 986670 977390 968478 960234 953242 948011 944767 943338 943227 943903 945099 946929 949819
50436 949819 954231 960335 967957 976868 987063 998746 1012220 1027804 1045611 1065244 1086011 1107681
50424 1107681 1130849 1156304 1184324 1214905 1248367 1285120 1324968 1367272 1411954 1459797 1511580
50413 1511580 1567387 1627092 1691013 1759530 1832247 1908104 1986317 2066655 2148602 2230678 2310924
50402 2310924 2387888 2460745 2528586 2590033 2643651 2688319 2722892 2745776 2755285 2750379 2730788 2696540
50390 2696540 2647961 2586357 2514368 2435285 2352143 2267616 2184480 2105687 2033769 1970330 1916150
50379 1916150 1871709 1837491 1813750 1799964 1794613 1795633 1801053 1809022 1817339 1823409 1824893 1820200 1808212
50366 1808212 1787870 1758405 1719913 1673454 1620735 1563898 1505277 1446722 1388995 1332162 1276687
50355 1276687 1223800 1174583 1129041 1086427 1046349 1009221 975580 945316 917738 892273 868862
50344 868862 847734 829004 812558 798174 785602 774557 764739 755824 747376 738935 730354 722023 714523
50331 714523 708045 702317 697043 692152 687542 682843 677715 672251 666946 662278 658417 655315 652984 651631
50317 651631 651524 652698 654885 657849 661702 666728 672898 679744 686752 693843 701430 710017 719555 729136
50303 729136 737629 744950 752362 761020 770438 779062 786242 792844 799816 807023 813939 820669 827653 834869
50289 834869 842083 849513 857578 866205 874972 883697 892262 900119 906623 911767 915886 918807 920111 920298
50275 920298 920929 923383 927977 934190 940792 945436 945176 938373 925977 910576 894544 879298 865615
50262 865615 853713 843148 833278 823899 815144 807037 799666 793589 789412 786923 785185 783548 782081 780950
50248 780950 779959 778971 778267 778144 778477 779033 779925 781373 783215 785018 786572 787958 789222 790321 791269 792033
50232 792033 792299 791697 790187 787970 785039 781206 776585 771651 766726 761749 756608 751295 745626 739281 732426
50217 732426 725901 720479 716251 713005 710759 709549 709077 709155 710236 712981 717625 724330 733801 746650 762281
50202 762281 779381 797713 818560 843051 870828 900715 931933 964046 996354 1028065 1058733
50191 1058733 1087917 1114772 1138551 1159266 1177291 1192657 1205332 1215885 1225000 1232249 1236040 1234889
50179 1234889 1228173 1215623 1196806 1171559 1140621 1105528 1068064 1029927 992591 957221 924782
50168 924782 896190 872087 852455 836810 824866 816655 811842 809330 807782 806257 804057 800377 794709
50155 794709 787487 779782 772235 764719 757324 751134 747490 746529 747016 747741 748565 749746 750709 750183 747500 743163
50139 743163 737943 731950 724926 717058 709110 701912 696013 691690 689004 687850 688070 689416 691381 693392
50125 693392 695331 697531 700013 702116 703268 703783 704405 705278 705932 706200 706598 707716 709631 712016 714554 717210
50109 717210 720333 724405 729451 734865 740143 745526 751488 757887 764349 771281 779607 789373 799536 809464
50095 809464 819810 831380 843894 856686 870105 885399 903464 924490 948683 976461 1007945
50084 1007945 1043039 1082261 1126791 1177226 1232708 1291605 1352632 1414889 1477148 1537768 1595357
50073 1595357 1649126 1698641 1743706 1784677 1822478 1857816 1890307 1918449 1940423 1954793 1960523
50062 1960523 1956663 1942313 1917031 1881175 1835756 1781959 1721010 1654586 1585105 1515198 1446792
50051 1446792 1380887 1318212 1259767 1206513 1158802 1116362 1078721 1045518 1016658 992336 972684
50040 972684 957135 944442 933623 924495 916904 909965 902887 896238 891342 888374 886029 883325 880801
50027 880801 879456 879329 879743 880240 880553 880187 878856 876966 874980 872530 868763 863348 856580 848829 840538
50012 840538 832473 825133 817960 809808 800233 789796 779126 768278 756980 744982 732184 718984
50000 718984 706507 695967 687763 681593 677295 674996 674664 676218 680050 686604 695307 704593 713216 721015
49986 721015 728306 735132 741294 746530 750470 752913 754262 755166 755647 755172 753690 751905 750362 748944 747550
49971 747550 746559 746366 747216 749918 755922 766040 779588 795464 813710 835440 861534 891857 925500
49958 925500 961261 998108 1035478 1072959 1109549 1143707 1174504 1202388 1228465 1253465 1277675
49947 1277675 1301334 1324459 1346549 1366823 1384297 1397235 1403071 1399651 1386399 1363888 1332759 1293792
49935 1293792 1248699 1199996 1149939 1099961 1050935 1003447 957919 914868 874870 837874 802945
49924 802945 769411 738065 710488 687258 667488 650099 634783 621660 610718 601887 595143 590248
49912 590248 586759 584436 583259 582949 582930 582938 583310 584511 586714 589947 594244 599488 605457 612178 619900 628633
49896 628633 638104 648306 659643 672193 685143 697253 707634 715909 721924 725728 727655 728024 726802
49883 726802 723747 718804 712067 703448 692671 679710 665032 649378 633395 617452 601616 585791
49871 585791 570063 555056 541796 531020 522654 516124 511081 507590 505578 504533 504005 504122 505268 507437
49857 507437 510375 514269 519700 526790 534877 543300 552071 561546 571863 583069 595316 608411 621474
49844 621474 633637 644909 655753 665895 674147 679526 682018 682151 680412 677334 673581 669364 663953
49831 663953 656319 646320 634966 623492 612538 602331 593297 586017 580675 576946 574474 573101 572491
49818 572491 572121 572072 573420 577208 583158 590068 597395 605672 615304 625803 636604 647859 659736 671459
49804 671459 681699 689673 695366 699006 700911 701566 701293 699898 697044 692728 687014 679670 670638 660530
49790 660530 649964 638661 625986 612290 598952 587048 576725 567937 561008 556112 552784 550308
49778 550308 548163 545906 543100 539721 536326 533556 531648 530549 530187 530516 531617 533893 537879 543727 551063
49763 551063 559376 568248 577271 586186 595151 604407 613576 621758 628455 633917 638466 641968 644157 644861
49749 644861 643621 639663 632838 624147 614809 605048 594379 582899 571699 561934 553967 547518 542297
49736 542297 538257 535397 533542 532352 531558 531196 531559 532892 535152 538001 540976 543740 546370 549322 552866
49721 552866 556615 559925 562840 566294 571297 578163 586619 596226 606491 616956 627523 638506 649910
49708 649910 660734 669289 674321 675743 674404 671362 667327 662558 657049 650847 644236 637670 631538 625924
49694 625924 620623 615491 610713 606491 602456 597798 592225 586460 581485 577595 574624 572699 572131 572804 574423
49679 574423 577243 581742 587495 593357 599094 606028 615557 627661 641294 655505 669489 682139 692460
49666 692460 700289 705960 709561 711217 711813 712559 713783 714853 715389 715813 716549 717400 717995 718167 717279 713681
49650 713681 705627 692785 676461 658400 639764 621315 604024 588978 576731 567009 559124 552544
49638 552544 547077 542772 539752 538023 537263 536941 536787 537076 538162 539821 541283 541931 541702 540765 539038 536216
49622 536216 532170 527289 522413 518294 514967 511820 508517 505634 503980 503431 503040 502241 501349 500713 500155 499638
49606 499638 499868 501540 504315 507155 509565 511935 514710 517755 520666 523285 525659 527624 528659 528310 526835
49591 526835 525364 525110 526294 528082 529596 530644 531322 531499 531184 530988 531610 532922 534092 534551 534404 533993
49575 533993 533655 534052 536159 540482 546448 552863 558968 564947 571481 578931 586978 595075 603095 611287 619518
49560 619518 626953 632852 637454 641624 645597 648456 648965 646641 641913 635525 628066 620054 612255 605652
49546 605652 600937 598011 596200 594982 594266 593912 593473 592767 592357 592914 594178 595097 595032 594432 594246 595134 597352
49529 597352 600900 605474 610613 616263 623010 631454 641487 652470 663993 676048 688475 700650 712014
49516 712014 722649 733039 743316 753043 761760 769429 776168 781895 786645 791052 796036 801892 808032
49503 808032 813647 818234 821293 822030 819738 814181 805353 793238 778297 761899 745640 730287 715852
49490 715852 702591 691224 682038 674406 667598 661682 657266 654580 653207 652555 652241 652042 651808 651533 651347
49475 651347 651398 651786 652552 653612 654620 655092 654763 653819 652729 651927 651772 652673 654893 658079 661309 663906 666041
49458 666041 668191 670188 671388 671746 672010 672543 672612 671332 668850 665948 662811 658897 653933 648358 642686
49443 642686 637028 631390 625944 620811 615996 611694 608306 605967 604360 603129 602175 601437 600822 600585 601454
49428 601454 604036 608318 613991 621047 629737 640076 651659 664043 677216 691703 708158 726652
49416 726652 746384 766218 785276 802480 815590 821641 819062 809231 795585 781449 768915 759138
49404 759138 752686 749559 749547 752776 759510 769314 780931 793222 805862 818921 832148 845026 857265
49391 857265 868868 879748 889496 897480 903108 906125 906795 905694 903276 899759 895409 890559 885188 878899
49377 878899 871611 863994 856832 850233 843918 838148 833831 831710 831887 834080 837864 842572 847600 852930
49363 852930 858871 865087 870454 874133 876144 876500 874462 869434 862168 854220 846401 838530 830615 823339
49349 823339 817085 811210 804720 797414 790136 784181 780504 779111 779110 779637 780731 782859 785658 787852 788573
49334 788573 788150 787266 786015 784169 781800 778970 775279 770367 764636 758873 753369 748002 743086 739382 737153
49319 737153 735734 734306 732816 731879 731956 732785 733582 733734 733276 732633 732071 731676 731818 733115 735680 738810 741705
49302 741705 744149 746188 747615 748341 748916 750010 751529 752860 753936 755447 758021 761728 766425 771887 777451
49287 777451 782115 785446 788091 791093 794926 799344 803913 808381 812642 816556 819910 822667 825341 828956
49273 828956 834269 841074 848486 855849 863117 870467 878020 885995 894733 904354 914582 924977 935132
49260 935132 944675 953446 961706 969817 977634 984619 990682 996639 1003610 1012220 1022559 1034675 1048797
49247 1048797 1065083 1083234 1102294 1120876 1137673 1151689 1161755 1166051 1162689 1150974 1131877 1107233
49235 1107233 1078906 1048742 1018685 990366 964668 941975 922676 907140 895297 886567 880264 876005
49223 876005 873718 873322 874333 875866 877237 878636 880981 884922 890008 894866 898135 899284 898767 897509 896170
49208 896170 894909 893779 893097 893200 894102 895755 898474 902615 907956 913955 920574 928230 936799 945344 953167
49193 953167 960505 967787 974750 980786 985644 989139 990574 989381 986237 982753 979918 977529 975307 973830
49179 973830 973914 975629 978556 982715 988685 996948 1007734 1021471 1038708 1059350 1082526 1107642 1135216
49166 1135216 1166101 1199944 1234710 1267419 1294787 1313486 1321031 1317219 1304507 1286535 1266354 1246014
49154 1246014 1227038 1210517 1196778 1185433 1175780 1167044 1158627 1150552 1143425 1137551 1132385 1127254 1122248
49141 1122248 1117783 1113621 1109213 1104894 1101820 1100547 1100421 1100613 1101034 1101958 1103449 1105679 1109258 1114651 1121534
49126 1121534 1129165 1137210 1145925 1155677 1166566 1178333 1190503 1202763 1215323 1228708 1243169 1258606
49114 1258606 1275099 1293154 1313271 1335657 1360455 1387941 1418445 1452539 1491481 1536983 1590185
49103 1590185 1650998 1718311 1790250 1864089 1936608 2005117 2068085 2124948 2175747 2220467 2257257
49092 2257257 2280794 2283942 2262723 2219812 2162568 2097939 2029541 1958436 1885024 1810109 1735529
49081 1735529 1664403 1600130 1544716 1498320 1460413 1430664 1408487 1392388 1380330 1370671 1362593 1355931
49069 1355931 1350754 1346886 1343607 1339981 1335629 1331057 1327081 1324049 1321675 1319564 1317807 1317035 1317884 1320421
49055 1320421 1324165 1328658 1333805 1339706 1346428 1354038 1362536 1371551 1380443 1388912 1397246 1405698 1413938 1421535
49041 1421535 1428704 1436133 1444227 1452981 1462477 1472975 1484473 1496683 1509654 1524008 1540264 1558095
49029 1558095 1576552 1595036 1613809 1633412 1653669 1673443 1691424 1706893 1719585 1729237 1735809 1740042
49017 1740042 1743194 1746120 1749063 1752298 1756256 1760866 1765632 1770751 1777387 1786132 1795830 1804777 1812730 1820880
49003 1820880 1830114 1840182 1850533 1861060 1871678 1881755 1890405 1897100 1901955 1905537 1908428 1910724 1912082
48990 1912082 1912449 1912476 1912837 1913381 1913423 1912709 1911569 1910160 1908203 1905609 1902929 1900990 1900276 1900737 1901958 1903492
48974 1903492 1905234 1907458 1910347 1913619 1916822 1919790 1922626 1925437 1928368 1931582 1934797 1937148 1937979 1937631
48960 1937631 1936977 1936444 1936025 1936025 1937096 1939510 1943025 1947500 1953171 1960303 1969089 1979938 1993301 2009061 2026567
48945 2026567 2045418 2065859 2088245 2112498 2138266 2165414 2194181 2224938 2257701 2291795 2326195
48934 2326195 2360456 2395039 2430486 2466656 2503183 2540312 2578680 2618481 2659425 2701268 2743774
48923 2743774 2786398 2828771 2871378 2915103 2960178 3006165 3052700 3099522 3145998 3191588 3236602
48912 3236602 3281422 3324947 3364973 3400451 3432489 3462842 3492334 3521070 3549095 3576215 3601893
48901 3601893 3625926 3648631 3670009 3689394 3706334 3721090 3733843 3744259 3752399 3759201 3765300 3769946
48889 3769946 3771817 3770374 3765745 3757896 3746740 3732716 3716509 3698503 3679011 3658502 3636917 3613248
48877 3613248 3586657 3557569 3526858 3494321 3459003 3420774 3380507 3338687 3294850 3248601 3200322
48866 3200322 3150539 3099357 3046991 2994384 2942862 2893431 2846649 2802842 2762104 2724228 2688901
48855 2688901 2655970 2625499 2597649 2572535 2550121 2530293 2513049 2498408 2486026 2475246 2465768
48844 2465768 2458055 2452737 2449860 2449114 2450573 2454730 2461786 2471335 2482824 2495990 2510759 2527010 2544563
48831 2544563 2563179 2582530 2602280 2622262 2642525 2663217 2684557 2706788 2730004 2753950 2778027
48820 2778027 2801567 2824268 2846609 2869692 2894265 2919807 2944972 2968985 2992204 3015319 3038676
48809 3038676 3062676 3088055 3115088 3142922 3170346 3197023 3223407 3249723 3275675 3301088 3326276
48798 3326276 3351752 3377992 3405347 3433742 3462504 3490880 3518726 3546388 3574068 3601666 3628958
48787 3628958 3655379 3679734 3700674 3717456 3729901 3737868 3741376 3741016 3737422 3730227 3718250 3700864
48775 3700864 3678579 3652090 3621435 3586418 3547267 3504462 3458385 3409613 3359160 3307920 3256069
48764 3256069 3203423 3150195 3096984 3044159 2991603 2939113 2886813 2835193 2784941 2736719 2690885
48753 2690885 2647407 2606083 2566861 2529915 2495565 2464123 2435679 2409944 2386469 2365146 2346338
48742 2346338 2330389 2317150 2306052 2296448 2287703 2279270 2271117 2264057 2259259 2257250 2257607 2259623 2262927
48729 2262927 2267205 2271732 2275694 2278874 2281512 2283471 2284120 2283295 2281829 2280711 2280169 2280060 2280775 2282971 2286580
48714 2286580 2290900 2295727 2301587 2308622 2316094 2323458 2331281 2340497 2351167 2362571 2374140 2385717 2397209
48701 2397209 2408683 2420674 2433762 2447818 2462212 2476754 2492015 2508630 2526655 2545595 2564762
48690 2564762 2583670 2602468 2621919 2642559 2663994 2685435 2706759 2728336 2749660 2768885 2784227
48679 2784227 2795477 2803738 2809974 2814283 2816520 2817047 2816563 2815343 2812861 2808153 2800389 2789096 2774069 2755382
48665 2755382 2733447 2708852 2682118 2653837 2624943 2596451 2568819 2541884 2515435 2489353 2463018
48654 2463018 2435205 2405092 2373057 2340105 2306821 2273267 2239519 2205821 2172556 2140584 2111257
48643 2111257 2085390 2062402 2041083 2020994 2002418 1985197 1968621 1952485 1937233 1922709 1907601
48632 1907601 1890708 1872250 1853494 1835558 1818982 1804003 1790534 1778023 1765790 1753516 1741160
48621 1741160 1728576 1715513 1701995 1688428 1675301 1662904 1651329 1640658 1631093 1622898 1616279 1611479
48609 1611479 1609011 1609453 1612738 1617917 1624016 1630893 1638831 1647448 1655695 1662929 1669269 1674774 1678970 1681598
48595 1681598 1683320 1685111 1687230 1689239 1690877 1692440 1694234 1695935 1696643 1695508 1692283 1687156 1680076 1670551
48581 1670551 1658447 1644790 1631196 1618503 1606512 1595114 1584983 1576734 1569992 1563906 1558306 1553719
48569 1553719 1550385 1547927 1546127 1545508 1546734 1549671 1553382 1557084 1560816 1564962 1569313 1573003 1575445 1576870
48555 1576870 1577532 1576670 1572841 1565373 1555015 1543019 1529974 1515829 1500776 1485703 1471757 1459518
48543 1459518 1448546 1437723 1426156 1413751 1400795 1387145 1372146 1355380 1337098 1317904 1298371
48532 1298371 1279147 1261087 1244955 1231166 1219938 1211483 1205814 1202540 1201128 1201371 1203481 1207726 1214034
48519 1214034 1221887 1230457 1238706 1245270 1248462 1246933 1240689 1231224 1220376 1209249 1198533 1189405 1183318
48506 1183318 1180944 1181983 1186137 1193659 1204766 1219135 1236274 1255888 1277518 1300244 1323106 1345521
48494 1345521 1366884 1385944 1400823 1409651 1411252 1405757 1394825 1380908 1365972 1351085 1337112 1325062
48482 1325062 1315214 1306509 1297568 1288196 1279232 1270991 1262570 1252937 1242218 1231491 1221569 1212381 1203518
48469 1203518 1194941 1186899 1179382 1172128 1165212 1159128 1154039 1149364 1144612 1140322 1137490 1136242 1135796 1135817 1137023
48454 1137023 1140114 1144760 1150127 1155863 1162005 1168157 1173337 1176604 1177523 1176154 1172864 1168108 1162195 1155333
48440 1155333 1148017 1141063 1135098 1130196 1126148 1122794 1119833 1116597 1112330 1106609 1099368 1090826 1081632 1072845
48426 1072845 1065341 1059220 1053981 1049144 1044561 1040209 1035985 1031813 1027913 1024883 1023254 1022790 1022376 1020992
48412 1020992 1018718 1016489 1014962 1014059 1013569 1013556 1014036 1014780 1015635 1016627 1017580 1018186 1018663 1019769 1021781 1023980 1025503
48395 1025503 1026236 1026407 1025775 1023797 1020251 1015167 1008435 1000091 990785 981298 971612 961028 949350 937487
48381 937487 926681 917371 909043 901048 893347 886361 880263 874673 869221 864164 860105 857184 854855 852421
48367 852421 849509 846123 842635 839690 837691 836452 835704 835711 836831 838637 840220 841285 842164 842814 842728 841982
48351 841982 841338 841081 840709 840061 839713 839787 839482 838452 837614 837733 838094 837524 835969 834084 831944 829306 826651
48334 826651 824802 823669 822340 820289 817707 814802 811586 808239 805020 801897 798822 796180 794394 793360
48320 793360 792808 792881 793752 795011 796107 797122 798422 799754 800323 799553 797270 793413 788223 782470 776929 771829
48304 771829 767151 763008 759272 755380 751144 747319 744688 743056 741733 740607 740137 740728 742625 745869 749856
48289 749856 753578 756806 760316 764568 769179 774320 781308 790764 801344 811510 821454 831918 842142
48276 842142 850515 856449 860147 861407 860360 858716 858618 860708 864639 870734 879615 890919 903991 919136
48262 919136 936781 956439 978097 1003373 1033418 1066983 1102631 1141486 1185500 1234690 1288915
48251 1288915 1350887 1424242 1510210 1609834 1728090 1871970 2046077 2254949 2508812 2822170
48241 2822170 3207420 3674156 4231881 4886131 5634166 6474410 7419785 8489277 9681906
48232 9681906 10966965 12295849 13596713 14739198 15525524 15760201 15356983 14385588 13023426
48223 13023426 11471328 9899342 8428885 7128343 6018377 5091409 4331599 3719676
48215 3719676 3230049 2835447 2515482 2256518 2045504 1869569 1720600 1594984 1488719
48206 1488719 1396568 1315506 1245035 1183838 1129260 1080147 1037189 1000114 966982 936448 908505
48195 908505 882807 858334 834960 813488 793973 775584 758164 742349 728121 714817 702599
48184 702599 692445 684548 678102 672714 668714 666015 663958 662399 661745 661721 661159 659102 655184 649019 640296
48169 640296 629610 618250 607090 596383 586443 577597 569646 562304 556042 551515 548328 545418 542499
48156 542499 540045 537973 535553 532726 530319 528799 527820 527153 526994 527057 526421 524750 522858 521668 521293 521393
48140 521393 521754 522195 522549 522970 523685 524324 524185 523304 522516 522243 522028 521548 521299 521795 522755 523601 524299 525269 526803
48121 526803 528896 531289 533502 535144 536330 537415 538312 538664 538751 539487 541245 543357 545189 547012 549389
48106 549389 552225 555037 557732 560513 563334 565982 568547 571347 574482 577807 581245 584801 588383 591790
48092 591790 594846 597391 599427 601380 603977 607555 611677 615643 619217 622667 626250 629909 633383 636471
48078 636471 639249 642018 644878 647376 648917 649629 650494 652439 655591 659548 663997 668792 673763 678830 684201
48063 684201 690200 697026 704830 713749 723583 733600 742922 751009 757560 762170 764465 764554 763080 760766
48049 760766 758050 755100 751968 748586 744626 739448 732381 723329 713136 703111 694111 686183 678975 672099
48035 672099 665082 657463 649280 641167 633654 626634 619761 613029 606569 600142 593391 586521 580206 574775
48021 574775 569902 565131 560277 555187 549647 543847 538621 534712 531876 529094 525725 522123 518994 516437
48007 516437 513937 511151 508360 506046 504350 503102 502202 501668 501373 501007 500394 499748 499551 500208 501705 503527
47991 503527 505042 506173 507544 509681 512229 514339 515798 517236 519106 520988 522238 522983 523994 525737
47977 525737 527923 529929 531321 532019 532215 532236 532379 532759 533326 533811 533728 532744 531277 530407 530902 532459 534156
47960 534156 535351 535850 535500 534286 532729 531569 530882 529966 528246 525898 523440 521136 519050 517264 515713
47945 515713 514102 512254 510278 508116 505341 501859 498408 495741 493481 490537 486725 483246 481230 480418
47931 480418 479721 478632 477469 476502 475498 474190 472684 471229 469915 468701 467501 466113 464300 462033 459476
47916 459476 456688 453698 450955 449248 448839 448905 448221 446287 443562 440804 438558 437104 436348 435724 434634 433106
47900 433106 431679 430523 429123 427089 424913 423551 423435 424228 425452 426976 428889 431180 433677 436164 438480
47885 438480 440566 442451 444198 445831 447342 448697 449867 450952 452238 453941 455828 457345 458245 458880 459687
47870 459687 460617 461338 461861 462615 463894 465427 466537 466602 465474 463688 462194 461637 461880 462339 462693 463039 463497
47853 463497 464107 465055 466495 468011 468727 468291 467420 467089 467391 467605 467223 466466 465819 465527 465726 466687 468538 470882
47835 470882 473009 474509 475562 476612 477936 479614 481744 484427 487497 490411 492540 493591 493708 493291 492786
47820 492786 492541 492704 493292 494458 496551 499670 503267 506616 509806 513914 519933 527761 536599 546187 557297
47805 557297 570986 587593 606473 626507 646908 667726 689547 712452 735341 756543 775060
47794 775060 790832 803807 813309 818530 819237 815608 807755 795916 780886 763701 744886 724538 703148
47781 703148 681807 661337 641629 622248 603446 586261 571727 560247 551626 545369 540906 537810
47769 537810 535945 535329 535877 537359 539575 542356 545463 548719 552337 556883 562653 569173 575471 580830 585189
47754 585189 588926 592467 596092 599829 603366 606288 608635 611177 614815 619603 624593 628750 631824 634141
47740 634141 635860 636880 637422 638117 639188 639876 639105 636642 633249 629747 626313 622752 618993 614957 610166
47725 610166 604026 596663 589205 582915 578021 573586 568540 562688 556653 551011 545756 540555 535243 529961
47711 529961 524965 520461 516442 512527 508108 502936 497536 492773 488959 485513 481588 476876 471844 467391
47697 467391 464347 463059 463231 464095 464823 464824 463889 462340 461002 460668 461345 462187 462362 461866 461366 461395 461977 462904
47679 462904 464096 465584 467337 469196 470994 472735 474702 477252 480358 483470 486000 487946 489821 491969
47665 491969 494137 495792 496703 497124 497542 498306 499410 500543 501419 502055 502586 502794 502081 500177 497788 496213
47649 496213 496160 497110 497926 497940 497304 496477 495756 495353 495570 496621 498396 500682 503511 507098 511498 516615 522490
47632 522490 529252 536751 544628 552927 562351 573667 587147 602827 621010 642109 666153 692855
47620 692855 722060 753752 787662 823229 859963 897443 934918 971329 1005821 1037840 1066492
47609 1066492 1090234 1107592 1118029 1121867 1119507 1110993 1096256 1075531 1049544 1019379 986087 950313
47597 950313 912487 873464 834637 797128 761028 725836 691637 659460 630438 604907 582397
47586 582397 562225 543937 527359 512430 498940 486472 474743 464049 455053 447934 441856 435590
47574 435590 428627 421505 415074 409693 405242 401640 399008 397308 396112 394921 393636 392530 391770 391173 390569
47559 390569 390239 390757 392338 394431 396087 396698 396392 395787 395499 395822 396719 397962 399296 400633 402146 404134
47543 404134 406822 410239 414199 418244 421790 424713 427823 432280 438294 444689 450076 454111 457274 459860
47529 459860 461954 464174 467463 471859 476253 479744 482579 485316 487774 489563 491118 493247 495804 497661
47515 497661 498036 497105 495330 492963 490401 488204 486302 483780 479886 474818 469141 462984 456370 449852 444124
47500 444124 439146 434323 429428 424740 420291 415698 410921 406565 403076 400087 397014 394002 391796 390778
47486 390778 390532 390398 390135 389903 389855 389971 390258 390957 392395 394625 397266 399822 402144 404435 406787 408902
47470 408902 410408 411245 411556 411361 410702 410064 410218 411453 413215 414716 415654 416121 416090 415471 414581 414092 414310 414830
47452 414830 415081 415046 415256 416244 418131 420594 423103 425362 427688 430880 435522 441539 448486 456112 464455
47437 464455 473673 484012 495851 509442 524668 541254 559084 578016 597507 616856 635774 654308
47425 654308 672111 688257 701980 713156 721738 727098 728515 726221 721429 715105 707093 696700 683935
47412 683935 669765 655215 640607 625917 611489 597959 585587 574156 563657 554600 547363 541634
47400 541634 536845 532872 529823 527439 525266 523349 522141 521694 521498 521288 521404 522102 522987 523463 523421 523203 523243
47383 523243 523992 525761 528221 530406 531647 532202 532584 532652 531983 530836 529949 529368 528255 526089 523431 521107
47367 521107 519088 516571 512898 508014 502275 496211 490385 485072 479986 474575 468652 462517 456449 450364
47353 450364 444217 438457 433669 429719 425693 420946 415905 411451 407681 403817 399348 394690 390517 386968
47339 386968 383861 381219 379077 377079 374909 373004 372176 372453 372944 373005 372928 373124 373171 372351 370888 370015 370666
47322 370666 372542 374641 376368 377770 378864 379232 378522 377130 375964 375453 375039 373810 371476 368465 365273
47307 365273 362107 359203 357091 356194 356319 356778 356924 356407 355032 352773 350079 347902 347040 347431 348251 348704
47291 348704 348592 348209 348005 348409 349603 351192 352367 352771 352955 353634 354726 355707 356726 358513 361084 363391
47275 363391 364737 365798 367616 370147 372588 374721 377000 379471 381511 382782 383576 384050 383849 382961 382264
47260 382264 382635 383789 384572 384305 383408 382728 382588 382632 382433 382096 382159 382888 383830 384289 384094 383683 383515 383806 384793
47241 384793 386756 389593 392732 395726 398666 401767 404834 407446 409538 411473 413560 415747 417842 419923
47227 419923 422427 425731 429679 433714 437653 442047 447443 453413 458827 463118 466860 470972 475813 481155
47213 481155 486542 491388 495155 497883 500285 503029 506118 509184 512039 514612 516684 518236 519900 522578
47199 522578 526506 530917 534547 536288 535563 532464 527587 521560 514784 507642 500684 494344 488696 483816
47185 483816 480106 477871 476792 476279 476256 477108 478896 481140 483497 486209 489686 493991 498955 504543 510822
47170 510822 517667 524676 531388 537507 542943 547675 551608 554721 557312 559813 562131 563453 563049 561121
47156 561121 558537 555873 553113 550106 546760 542809 537984 532586 527377 522625 517769 512337 506733 501615
47142 501615 496969 492455 488480 486071 485527 485835 485853 485628 486071 487564 489454 490960 492074 493337 495035 496912
47126 496912 498498 499470 499738 499468 498981 498358 497115 494553 490555 485905 481677 478382 475698 472856 469260
47111 469260 464962 460666 457167 454699 452896 451322 449837 448462 447204 446048 444825 443067 440426 437344
47097 437344 434839 433342 432172 430487 428306 426102 423841 421082 417836 414708 412235 410642 410088 410528 411292
47082 411292 411457 410785 409788 408829 407673 406052 404104 402028 399867 397855 396444 395620 394666 393085 391402 390547
47066 390547 390656 390894 390349 388733 386404 384047 382290 381262 380462 379262 377568 375849 374613 374022 373933 374181
47050 374181 374811 376057 378013 380290 382271 383735 385018 386480 388128 389894 391871 394012 395973 397639
47036 397639 399472 401874 404467 406510 407891 409129 410505 411823 413043 414492 416240 417810 418878 419749
47022 419749 420749 421540 421615 421202 421003 421111 420815 419745 418659 418697 420102 422047 423505 423922 423196 421639 420095
47005 420095 419573 420352 421668 422596 422985 423226 423360 423017 422197 421457 421175 421156 421215 421638 422619 423660 424081 423954 424013
46986 424013 424738 426038 427807 430180 433060 435884 438182 440083 442082 444577 447849 452101 457106 462010
46972 462010 465942 468802 471224 473800 476702 479929 483459 487049 490304 493153 495854 498294 499692 499489
46958 499489 498266 497174 496487 495380 493305 490950 489433 489013 489128 489397 489911 490538 490698 490140 489443 489316 489684
46941 489684 489937 489952 490352 491660 493650 495715 497513 498942 499741 499750 499516 500123 502022 504386 505994 506563 506793
46924 506793 507229 507658 507697 507423 507083 506524 505300 503241 500666 498193 496448 495746 495781 495835 495496 494942 494322 493216
46906 493216 491173 488514 486073 484314 483252 483142 484581 487741 492007 496656 501485 506598 511957 517412
46892 517412 522937 528578 534365 540353 546530 552547 557827 562069 565407 568049 570098 571872 573988 576845
46878 576845 580209 583471 586099 587773 588483 588694 589029 589593 589932 589871 589924 590575 591601 592554 593513 594819 596429
46861 596429 598127 600142 602889 606167 609296 612119 615291 619352 623957 628273 631752 634301 635985 636920
46847 636920 637430 638060 639345 641405 643705 645353 645880 645679 645492 645579 645639 645437 645125 644920 644806 644728 644793 645089 645463
46828 645463 645649 645634 645827 646816 648839 651395 653534 654806 655854 657814 661167 665386 669715 673983 678540
46813 678540 683626 689009 694138 698523 701996 704718 707016 709275 711872 714928 718012 720401 721865 723035
46799 723035 724703 726888 728911 730286 731119 731637 731743 731273 730472 729958 730249 731313 732525 733168 733146 733149 733929 735517
46781 735517 737354 739094 740916 743058 745399 747658 749773 751953 754517 757756 761773 766385 771264 776149
46767 776149 780894 785449 790041 795193 801235 807860 814509 821175 828425 836597 845386 854300 863084 871557
46753 871557 879421 886618 893635 901125 909257 917631 925731 933324 940446 947126 953186 958392 962874 967139
46739 967139 971370 974798 976198 975101 972252 968877 965793 963283 961389 960074 959341 959350 960250 961824 963552
46724 963552 965104 966554 968130 970032 972429 975200 977681 979201 979938 980714 981756 982277 981548 979758 977382
46709 977382 974292 970041 964576 958081 950513 941908 932851 923949 915040 905529 895371 884997 874383
46696 874383 862966 850644 838212 826568 815910 805912 796293 786975 778011 769498 761360 753162 744518
46683 744518 735788 728039 722105 717833 714268 710314 705300 699354 693444 688660 685204 682237 678825 674756
46669 674756 670309 665661 660851 656127 651916 648428 645454 642556 639399 635979 632644 629846 627803 626418
46655 626418 625472 624681 623559 621516 618308 614354 610471 607299 604958 603090 601201 599110 597153 595839 595242
46640 595242 594855 594189 593436 593395 594699 597141 599827 602112 604409 607900 613319 620118 626991 633097 638620
46625 638620 644246 650295 656282 661173 664193 665609 666583 668021 669799 671267 672139 672434 671989 670799 669622
46610 669622 669265 669235 668019 665088 661765 659615 658729 658214 657725 657698 658452 659824 661479 662979 663767 663758 663699 664287
46592 664287 665061 664975 663940 662985 662817 663057 663138 663247 663916 665208 666718 668005 668629 668153 666536 664407 662625
46575 662625 661679 661609 662216 663103 663718 663688 663055 662150 661366 661068 661387 661996 662410 662603 662994 663681 664204 664403 665018
46556 665018 666921 669999 673279 676027 678264 680353 682589 685159 688092 691171 694175 697167 700280 703408
46542 703408 706506 710027 714470 719494 724143 728173 732636 738809 746886 756033 765381 774589 783691 792914
46528 792914 802649 813300 825009 837635 850922 864605 878495 892592 907058 921924 936944 951842
46516 951842 966541 980937 994592 1006960 1017916 1027798 1036876 1044917 1051371 1055874 1058580 1060091 1061079
46503 1061079 1061850 1062223 1061903 1060938 1059664 1058224 1056286 1053423 1049706 1045804 1042413 1039609 1036806 1033337 1029037
46488 1029037 1024194 1019071 1013652 1007843 1001688 995221 988207 980247 971152 961126 950564 939724 928562
46475 928562 916861 904547 891929 879554 867764 856491 845571 835159 825693 817497 810549 804658
46463 804658 799785 796162 794120 793714 794519 795940 797848 800758 805251 811346 818587 826433 834263 841262 846984
46448 846984 852051 857678 864147 870218 874488 876957 878735 880471 881727 881877 880954 879317 877045 874109 870818
46433 870818 867544 864109 859868 854471 848201 841464 834279 826532 818595 811402 805788 801761 798405 794582
46419 794582 789866 784891 780735 777999 776528 775931 776068 777010 778775 781354 784774 788915 793366 797710 801953
46404 801953 806518 811819 817953 824664 831515 838247 845092 852559 860653 868630 875888 882807 890151 897750
46390 897750 904448 909411 912788 914980 916036 916149 915958 915686 914507 911497 906861 901531 895943 890070 884442
46375 884442 880053 877108 874783 872539 870925 870591 871199 871928 872689 874242 877343 882238 888830 896906 906227
46360 906227 916750 928718 942238 956939 972383 988751 1006717 1026587 1047844 1069664 1091648
46349 1091648 1113901 1136514 1159071 1180715 1200682 1218779 1235247 1250096 1262691 1272149 1278081 1280791
46337 1280791 1280726 1277881 1271889 1262660 1250838 1237439 1223063 1207661 1191163 1174061 1157065 1140455
46325 1140455 1124253 1108973 1095514 1084059 1073681 1063496 1053829 1045745 1039774 1035687 1033303 1032778 1034005
46312 1034005 1036364 1039359 1043073 1047749 1053321 1059647 1066908 1075336 1084676 1094296 1103830 1113485 1123723 1134853
46298 1134853 1146890 1159524 1172164 1184278 1195847 1207333 1219047 1230666 1241574 1251510 1260601 1268841
46286 1268841 1275875 1281466 1285768 1288854 1290180 1288974 1285084 1279108 1271668 1262917 1252868 1241858 1230493
46273 1230493 1219347 1208815 1199021 1189681 1180327 1170907 1161947 1153930 1146737 1140032 1133950 1129037 1125552
46260 1125552 1123182 1121458 1120163 1119378 1119426 1120811 1123906 1128552 1134110 1139876 1145344 1150252 1154715 1159211 1163961
46245 1163961 1168269 1170995 1171920 1172243 1173391 1175587 1177905 1179451 1180080 1180093 1179724 1178994 1177820 1176274 1174924 1174733
46229 1174733 1176149 1178312 1179755 1180101 1180579 1182463 1185404 1187883 1189060 1189457 1189819 1190081 1189856 1189430 1189591 1190673
46213 1190673 1192222 1193640 1194808 1196031 1197637 1199713 1202067 1204470 1207034 1210206 1214177 1218459 1222371 1225781
46199 1225781 1229020 1232234 1235296 1238321 1241616 1245092 1248269 1251085 1254059 1257434 1260703 1263410 1265817 1268273
46185 1268273 1270462 1271957 1273221 1275289 1278574 1282577 1286647 1290452 1293832 1296855 1300044 1303966 1308533 1313189
$$ [...]
##END NTUPLES=NMR SPECTRUM
##END=
