
##TITLE=UV1214_M5_1296-1170_5_7229414_toPqwDcDj9
##JCAMPDX= 6.0         $$ Bruker NMR JCAMP-DX V2.0
##DATA TYPE= NMR SPECTRUM
##DATA CLASS= NTUPLES
##ORIGIN= BRUKER
##OWNER= Administrator
$$ 1.72 TOPSPIN		Version 2.1
$$ 2013-01-18 03:05:38.729 -0500  Administrator@X
$$ Compression mode = diff/dup
##.OBSERVE FREQUENCY= 400.02188249412
##.OBSERVE NUCLEUS= ^1H
##.ACQUISITION MODE= SIMULTANEOUS (DQD)
##.ACQUISITION SCHEME= undefined
##.AVERAGES= 8
##.DIGITISER RES= 22
##SPECTROMETER/DATA SYSTEM= spect
##.PULSE SEQUENCE= zg30
##.SOLVENT NAME= COFFEE_meoh
##.SHIFT REFERENCE= INTERNAL, COFFEE_meoh, 1, 14.98509
##AUDIT TRAIL= $$ (NUMBER, WHEN, WHO, WHERE, PROCESS, VERSION, WHAT)
$$ ##TITLE= Audit trail, TOPSPIN		Version 2.1
$$ ##JCAMPDX= 5.01
$$ ##ORIGIN= Bruker BioSpin GmbH
$$ ##OWNER= Administrator
$$ $$ E:\/data/COFFEE/nmr/UV1214_M5_1296-1170_5_7229414_toPqwDcDj9/20/pdata/1/auditp.txt
$$ ##AUDIT TRAIL=  $$ (NUMBER, WHEN, WHO, WHERE, PROCESS, VERSION, WHAT)
(   1,<2013-01-18 03:05:30.588 -0500>,<Administrator>,<X>,<go>,<TOPSPIN 2.1>,
      <created by zg
	started at 2013-01-18 03:04:24.525 -0500,
	POWCHK enabled, PULCHK disabled,
       configuration hash MD5:
       86 BA 57 50 F2 9D 5C 9B 26 00 A9 28 5F 66 2E 89
       data hash MD5: 64K
       35 6B 28 E9 FC 9B A2 D9 22 CC FB AA E2 8B F0 75>)
(   2,<2013-01-18 03:05:33.744 -0500>,<Administrator>,<X>,<proc1d>,<TOPSPIN 2.1>,
      <Start of raw data processing
       efp LB = 0 FT_mod = 6 PKNL = 1 PHC0 = 0 PHC1 = 0 SI = 32K 
       data hash MD5: 32K
       0F 4C CB E9 DD 87 A4 43 C5 11 72 28 A2 35 9F 37>)
(   3,<2013-01-18 03:05:34.197 -0500>,<Administrator>,<X>,<proc1d>,<TOPSPIN 2.1>,
      <pk PHC0 = 98.22876 PHC1 = 0 
       data hash MD5: 32K
       6F 0C E7 D6 87 85 94 EF CC 71 A0 17 FC 64 8A E2>)
(   4,<2013-01-18 03:05:34.416 -0500>,<Administrator>,<X>,<proc1d>,<TOPSPIN 2.1>,
      <abs ABSG = 1 
       data hash MD5: 32K
       6D 4B 5A BE B2 F9 53 1A E9 85 2B 45 87 F2 A4 49>)
(   5,<2013-01-18 03:05:34.572 -0500>,<Administrator>,<X>,<proc1d>,<TOPSPIN 2.1>,
      <abs ABSG = 2 
       data hash MD5: 32K
       8F AF C3 DF 03 32 BB 1D 73 13 1D E8 BA 8A 99 29>)
(   6,<2013-01-18 03:05:34.713 -0500>,<Administrator>,<X>,<proc1d>,<TOPSPIN 2.1>,
      <abs ABSG = 3 
       data hash MD5: 32K
       7F 48 2D 25 0F 77 B9 B3 E1 D0 C7 4D DA A8 4B FB>)
(   7,<2013-01-18 03:05:34.854 -0500>,<Administrator>,<X>,<proc1d>,<TOPSPIN 2.1>,
      <abs ABSG = 4 
       data hash MD5: 32K
       21 A7 F4 A1 AD 5F C1 95 4A 12 16 93 07 40 1A 54>)
(   8,<2013-01-18 03:05:35.010 -0500>,<Administrator>,<X>,<proc1d>,<TOPSPIN 2.1>,
      <abs ABSG = 5 
       data hash MD5: 32K
       49 FA 9B 9A DF 2C FC C9 27 19 6D B5 BF 6C B6 F6>)
$$ ##END=
$$ 
$$ $$ hash MD5
$$ $$ 10 39 61 75 5B B8 1C 77 1C 12 8C D2 86 E5 F8 24
##$RELAX= 
##$RELAX= 
##$RELAX= 
##$RELAX= 
##$RELAX= 
##$RELAX= 
##$RELAX= 
$$ Bruker specific parameters
$$ --------------------------
##$DU= <E:\>
##$EXPNO= 20
$$ [...]
##$TP= (0..7)
150 150 150 150 150 150 150 150
##$TP07= 0
##$TPNAME0= <>
##$TPNAME1= <>
##$TPNAME2= <>
##$TPNAME3= <>
##$TPNAME4= <>
##$TPNAME5= <>
##$TPNAME6= <>
##$TPNAME7= <>
##$TPOAL= (0..7)
0.5 0.5 0.5 0.5 0.5 0.5 0.5 0.5
##$TPOFFS= (0..7)
0 0 0 0 0 0 0 0
##$TUNHIN= 0
##$TUNHOUT= 0
##$TUNXOUT= 0
##$USERA1= <user>
##$USERA2= <user>
##$USERA3= <user>
##$USERA4= <user>
##$USERA5= <user>
##$V9= 5
##$VALIST= <valist>
##$VCLIST= <CCCCCCCCCCCCCCC>
##$VD= 0
##$VDLIST= <DDDDDDDDDDDDDDD>
##$VPLIST= <PPPPPPPPPPPPPPP>
##$VTLIST= <TTTTTTTTTTTTTTT>
##$WBST= 1024
##$WBSW= 4
##$XGAIN= (0..3)
0 0 0 0
##$XL= 0
##$YL= 0
##$YMAX_a= 671788
##$YMIN_a= -571207
##$ZGOPTNS= <>
##$ZL1= 120
##$ZL2= 120
##$ZL3= 120
##$ZL4= 120
##$ABSF1= 14.98509
##$ABSF2= -5.573092
##$ABSG= 5
##$ABSL= 3
##$ALPHA= 0
##$AQORDER= 0
##$ASSFAC= 0
##$ASSFACI= 0
##$ASSFACX= 0
##$ASSWID= 0
##$AUNMP= <proc_prof1d_extract_pilot.lims>
##$AXLEFT= 0
##$AXNAME= <>
##$AXNUC= <1H>
##$AXRIGHT= 0
##$AXTYPE= 0
##$AXUNIT= <>
##$AZFE= 0.1
##$AZFW= 0.1
##$BCFW= 0
##$BC_mod= 0
##$BYTORDP= 0
##$COROFFS= 0
##$CY= 15
##$DATMOD= 1
##$DC= 0
##$DFILT= <>
##$DTYPP= 0
##$F1P= 0
##$F2P= 0
##$FCOR= 0.5
##$FTSIZE= 32768
##$FT_mod= 6
##$GAMMA= 0
##$GB= 0
##$INTBC= 1
##$INTSCL= 1
##$ISEN= 128
##$LB= 0
##$LEV0= 0
##$LPBIN= 0
##$MAXI= 10000
##$MC2= 0
##$MEAN= 0
##$ME_mod= 0
##$MI= 0
##$NCOEF= 0
##$NC_proc= -8
##$NLEV= 6
##$NOISF1= 0
##$NOISF2= 0
##$NSP= 0
##$NTH_PI= 0
##$NZP= 0
##$OFFSET= 14.98509
##$PC= 1
##$PHC0= 98.22876
##$PHC1= 0
##$PH_mod= 1
##$PKNL= yes
##$PPARMOD= 0
##$PPDIAG= 0
##$PPIPTYP= 0
##$PPMPNUM= 2147483647
##$PPRESOL= 1
##$PSCAL= 4
##$PSIGN= 0
##$PYNMP= <proc.py>
##$REVERSE= no
##$SF= 400.02
##$SI= 32768
##$SIGF1= 0
##$SIGF2= 0
##$SINO= 400
##$SIOLD= 32768
##$SPECTYP= <>
##$SREGLST= <1H.CDCl3>
##$SSB= 0
##$STSI= 32768
##$STSR= 0
##$SW_p= 8223.68421052631
##$SYMM= 0
##$S_DEV= 0
##$TDeff= 65536
##$TDoff= 0
##$TI= <>
##$TILT= no
##$TM1= 0
##$TM2= 0
##$TOPLEV= 0
##$USERP1= <user>
##$USERP2= <user>
##$USERP3= <user>
##$USERP4= <user>
##$USERP5= <user>
##$WDW= 1
##$XDIM= 32768
##$YMAX_p= 470527954
##$YMIN_p= -788338
##$CURPLOT= <Network HP LaserJet P1505>
##$CURPRIN= <$Network HP LaserJet P1505>
##$DFORMAT= <normdp>
##$LAYOUT= <+/1D_H.xwp>
##$LFORMAT= <normlp>
##$PFORMAT= <normpl>
##$SURQMSG= 1
$$ End of Bruker specific parameters
$$ ---------------------------------
##NTUPLES= NMR SPECTRUM
##VAR_NAME=  FREQUENCY,     SPECTRUM/REAL,   SPECTRUM/IMAG
##SYMBOL=    X,             R,               I
##VAR_TYPE=  INDEPENDENT,   DEPENDENT,       DEPENDENT
##VAR_FORM=  AFFN,          ASDF,            ASDF
##VAR_DIM=   32768,         32768,           32768
##UNITS=     HZ,            ARBITRARY UNITS, ARBITRARY UNITS
##FACTOR=    0.250966925370066, 1,           1
##FIRST=     8223.43324360094, -141271,      -166414
##LAST=      0,             -13265,          38293
##MIN=       0,             -788338,         0
##MAX=       8223.43324360094, 470527954,    0
$$ Real data points
##PAGE= N=1
##DATA TABLE= (X++(R..R)), XYDATA
$$ [...]
19532a16696q0923F372c03099J15033e7779I8205b15204A72004b39225b0368q0577
$$ -116696 -197619 6372 -303099 -188066 -57779 98205 -215204 172004 -239225 -20368 -100945
19521a00945B90482a54356E4193f8646Q994A99548a10277j52942A8659b14870
$$ -100945 290482 -154356 54193 -68646 -59652 199548 -110277 -263219 18659 -214870
19510F3829J33949b69473D73471j51687b85178F6949c03061b8999B72588a2588
$$ 63829 197778 -269473 473471 321784 -285178 66949 -303061 -28999 272588 -12588
19499a16322j1833k21308e2510A18238l1839a75461I636h0142A30294b7475k33515
$$ -116322 -128155 -349463 -52510 118238 86399 -175461 9636 -80142 130294 -27475 -260990
19488b60990a10686n9606e3950r7883j00851I68a88377N6060A67569g1203J9439
$$ -260990 -110686 -170292 -53950 -151833 -252684 968 -188377 -132317 167569 -71203 -51764
19477e1764j20320e7314j82856A71774c62469a43388P0267j90658B63814c8202
$$ -51764 -172084 -57314 -240170 171774 -362469 -143388 -73121 -263779 263814 -38202
19466a93685A82291d2840j53241d6453a5603C05483a47140k3169p1603A11337
$$ -193685 182291 -42840 -196081 -46453 -15603 305483 -147140 -170309 -241912 111337
19455a15049J783j28323e8424A21598g489C767K81751L1128a43857k53542A70778
$$ -115049 -113266 -241589 -58424 121598 -7489 3767 285518 316646 -143857 -397399 170778
19443a49699B45257a31815C8756A7896a64804O3363k80164c8106A21023M5530
$$ -149699 245257 -131815 38756 17896 -164804 -101441 -381605 -38106 121023 166553
19433A66553c65419A07972P2781b46269j02988M1930E9092i7431C6199O9261b90158
$$ 166553 -365419 107972 180753 -246269 -349257 -307327 59092 -97431 36199 105460 -290158
19421A52173l8646J70506b79479f8948A71772E1433K35290C2978e0302A60294
$$ 152173 113527 284033 -279479 -68948 171772 51433 286723 32978 -50302 160294
19410a15565k10932d5652n1737I7488J08775c62152a81004L5663J0789A09915
$$ -115565 -326497 -45652 -97389 97488 206263 -362152 -181004 -145341 -134552 109915
19399C47266H4893g6118o29175B72147c12794a38951r5713J0955p8414a21637
$$ 347266 84893 -76118 -705293 272147 -312794 -138951 -234664 -223709 -302123 -121637
19388I1375a76755L7235j0507d0595o6606N2843K2346F6674J97050p0574K7778
$$ 91375 -176755 -139520 -150027 -40595 -107201 -54358 -32012 66674 263724 193150 220928
19377B20928q7870J03682b23671c9368G0885c15406m4784a18280m2644B1491i0007
$$ 220928 133058 236740 -223671 -39368 70885 -315406 -360190 -118280 -160924 21491 -90007
19365b05898p6441h1212o4250j58228J13509A63829a61246C3304P8438a05912
$$ -205898 -282339 -81212 -145462 -303690 -190181 163829 -161246 33304 111742 -105912
19354A03172a69354k34126e5922E144J1070c9265B9663a83406e9763G7000c34394
$$ 103172 -169354 -403480 -55922 5144 16214 -39265 29663 -183406 -59763 77000 -334394
19342a89778B78207F1111J4362L2851c17437I4131a9490k09947R5993m28076a20989
$$ -189778 278207 61111 75473 108324 -317437 94131 -19490 -229437 -133444 -561520 -120989
19330i0151o3672D6904a5203B2232b02649B66061f2223A57439o7720D3305g0936
$$ -90151 -153823 46904 -15203 22232 -202649 266061 -62223 157439 89719 43305 -70936
19318a0667k70567F527J78952a12839H4532C7470a62892m3133B17213e4708k38997
$$ -10667 -281234 6527 185479 -112839 84532 37470 -162892 -206025 217213 -54708 -293705
19307b93705G531a2507j51916E5768c42766h0430j33993i199k84487D5362J27145
$$ -293705 7531 -12507 -164423 55768 -342766 -80430 -214423 -9199 -293686 45362 172507
19296A72507d10302C0075J33168E850J87714c35575J0675J49286B14784a75202
$$ 172507 -410302 30075 163243 5850 193564 -335575 -324900 -175614 214784 -175202
19285a51589G6056h5400H423R2660a29397j08208B8823a2481j61789A56531h6495
$$ -151589 76056 -85400 8423 101083 -129397 -237605 28823 -12481 -174270 156531 -86495
19273b45309f5609p2618c996C17869j29528B9735a99026c7969n5555c1588k53668
$$ -245309 -65609 -138227 -3996 317869 188341 29735 -199026 -37969 -93524 -31588 -285256
19262b85256P4299A77576b02191D7272O4380b28333Q3162I4061L6681b77911J15693
$$ -285256 -210957 177576 -202191 47272 111652 -228333 -145171 94061 130742 -277911 -162218
19251a62218B7220A652i1236M0593j21294n981g6751l92744A37487J8110a30745
$$ -162218 27220 1652 -91236 -50643 -171937 -177918 -76751 -469495 137487 155597 -130745
19239B84551h500H9627l9727c96461A35705c21482a09501p1589f5326j4936n6393
$$ 284551 -8500 89627 49900 -396461 135705 -321482 -109501 -181090 -65326 -80262 -136655
19228a36655B13400a57665N8384j14442Q0416L82E5663f2950r7379E9529a37872
$$ -136655 213400 -157665 -99281 -213723 -133307 -132925 55663 -62950 -160329 59529 -137872
19216a48416j15707b1338r0241M3110k20433G7675i6519j60054j13752C3165b70270
$$ -148416 -264123 -21338 -111579 -68469 -288902 77675 -96519 -256573 -370325 33165 -270270
19204A57003e51133a65841A77333d04225B3841J2270J6551a30476p5770A01452
$$ 157003 -551133 -165841 177333 -404225 23841 36111 52662 -130476 -206246 101452
19193A31351P4972B9609b96479C06625a15803r5121E401K04604c8546k35668c1849
$$ 131351 206323 29609 -296479 306625 -115803 -210924 5401 210005 -38546 -274214 -31849
19181a62012C339h6451k2233L0000A88445a91724d16A8832d7335k4474j363k84297
$$ -162012 3339 -86451 -108684 -78684 188445 -191724 -416 18832 -47335 -71809 -73172 -357469
19169c57469B87468B4988P6681h134l14997A6905b10489R4168j14054a05748k25824
$$ -357469 287468 24988 101669 -8134 -323131 16905 -210489 -116321 -230375 -105748 -331572
19158c31572K8175R8957a5547j78091d0796A1297c3415l6922L0148E984c0581
$$ -331572 -303397 -204440 -15547 -193638 -40796 11297 -33415 -70337 -40189 5984 -30581
19146d42887a48739p3840A46440j450a17749k7041j92534J52464a7468I7314K6899
$$ -442887 -148739 -222579 146440 144990 -117749 -144790 -337324 -184860 -17468 97314 124213
19135A24213b14562B4359J58478a28294D5784c13758A64588c52333J70548g840
$$ 124213 -214562 24359 182837 -128294 45784 -313758 164588 -352333 -181785 -7840
19124h6764j76167A8202c1875l2316C840O1589a06233H85c07953c9076D2765b29592
$$ -86764 -262931 18202 -31875 -64191 3840 65429 -106233 885 -307953 -39076 42765 -229592
19111f6440j39437E6795K7453k5759e9619j63022B8276a45600B1366b18009B9892
$$ -66440 -205877 56795 84248 58489 -59619 -222641 28276 -145600 21366 -218009 29892
19099C36526G874b5044A6155J24498k6767a04122A26184d7918a2967j11209a3866
$$ 336526 7874 -25044 16155 140653 113886 -104122 126184 -47918 -12967 -124176 -13866
19087c24647A52583a00252B36449I4639c92251A9994L1571b55436F904b03646
$$ -324647 152583 -100252 236449 94639 -392251 19994 51565 -255436 6904 -203646
19076a49332I1344c54980A08932e7944a7430j10335J2800c4892B1275J8525j9736
$$ -149332 91344 -354980 108932 -57944 -17430 -127765 -114965 -34892 21275 39800 20064
19065B0064a28231A77216P2059D1385c5609b501j88475D6440B35f6414A32732
$$ 20064 -128231 177216 249275 41385 -35609 -2501 -190976 46440 235 -66414 132732
19053A63599b62254I4702a81451h2491A60708a76910O0118H6793A414b83239O1955
$$ 163599 -262254 94702 -181451 -82491 160708 -176910 -116792 86793 1414 -283239 -221284
19042b21284j50697J47745d5978m5295j36843k33970A02371c98629m7537A41259
$$ -221284 -371981 -224236 -45978 -91273 -228116 -462086 102371 -398629 -446166 141259
19031A37853a7442C01849I5340K00344E196O2136a13179c3410k7426a5599j80016
$$ 137853 -17442 301849 95340 295684 5196 67332 -113179 -33410 -60836 -15599 -195615
19020a95615B65235A6833c11781i4293k95426a3221k96845a7790B74779F3532
$$ -195615 265235 16833 -311781 -94293 -389719 -13221 -310066 -17790 274779 63532
19009c15345A70280D5477J3214P7611J61824i4546C7867q848i7550n1848O7433
$$ -315345 170280 45477 58691 136302 298126 -94546 37867 29019 -97550 -149398 -81965
18998h1965A06735A6395a23453j24551i304l51915h9532M2609j75784p2694J12863
$$ -81965 106735 16395 -123453 -248004 -9304 -361219 -89532 -46923 -222707 -295401 -182538
18987a82538A06915a58558c6229A24208A4241J04568h5426l9011k4849B88190
$$ -182538 106915 -158558 -36229 124208 14241 118809 -85426 -124437 -149286 288190
18976A8963J58417b4279A77223a64764N2615H6578c7965j80195B40527c4326j05303
$$ 18963 177380 -24279 177223 -164764 -112149 86578 -37965 -218160 240527 -34326 -139629
18965a39629C45159a55720M1434E4331b1491A14749a6003D8794b23314A95409
$$ -139629 345159 -155720 -114286 54331 -21491 114749 -16003 48794 -223314 195409
18954a971j80071B3873K12774c0971G3150C4422c44167i4521A33128M3885A6550
$$ -1971 -182042 23873 236647 -30971 73150 34422 -344167 -94521 133128 177013 16550
18942a12859j31583J15358C15322e5409m4766m0679d5508k9063A68029c25053
$$ -112859 -244442 -129084 315322 -55409 -100175 -140854 -45508 -74571 168029 -325053
18931i3836k102d3414A41842b9836p559f278j46884B21892b68185F0899N510b01097
$$ -93836 -95938 -43414 141842 -29836 -37395 -6278 -153162 221892 -268185 60899 66409 -201097
18918B2460b76446A55506E8466a2613n5305j03525B00237r4685R694J09616a72877
$$ 22460 -276446 155506 58466 -12613 -67918 -171443 200237 105552 115246 224862 -172877
18906a16749n8149E0263b22334J06849A81443C1850d2646p0941k19161A37453
$$ -116749 -174898 50263 -222334 -115485 181443 31850 -42646 -113587 -332748 137453
18895I2128a34415c5468p5435f839A82391p5380h5941q9418A16072a14745q9683
$$ 92128 -134415 -35468 -110903 -6839 182391 107011 -85941 -175359 116072 -114745 -204428
18884b04428A59702d3007n00960a87336c6089A99605f4232B24872b24072k70104
$$ -204428 159702 -43007 -543967 -187336 -36089 199605 -64232 224872 -224072 -494176
18874d94176J34360a16696m9743A49887J13390d5156j50877j95821r7412E7259
$$ -494176 -359816 -116696 -166439 149887 263277 -45156 -196033 -391854 -489266 57259
18863a66531A24212a999j1214C5706J24070a48527A62935a81349q4279a01643
$$ -166531 124212 -1999 -13213 35706 159776 -148527 162935 -181349 -265628 -101643
18852b51629a15889A77412a48503N134A63444a13914C27044a20814P235K9959
$$ -251629 -115889 177412 -148503 -143369 163444 -113914 327044 -120814 -113579 -83620
18842h3620r9818k4953B19047a38007M8153D6967h065p2403j19173o4109a07921
$$ -83620 -183438 -208391 219047 -138007 -89854 46967 -8065 -80468 -199641 -263750 -107921
18830e5947K364k30121e790D767J3326i9888J0828A26282A3474a26392l27664
$$ -55947 -53583 -283704 -5790 4767 18093 -99888 -89060 126282 13474 -126392 -454056
18819d54056F7175K30291g55D44875D2732J8363a83161E7097j3529d9512D0059
$$ -454056 67175 297466 -755 444875 42732 61095 -183161 57097 43568 -49512 40059
18807F7531l3345J57671m9987e2724A66200G8291J42821d61153B2692R3796l4933
$$ 67531 34186 191857 141870 -52724 166200 78291 221112 -461153 22692 116488 81555
18796H1555a03808A74756n6287b43469B53986b64547a18710N691A61264a02217
$$ 81555 -103808 174756 118469 -243469 253986 -264547 -118710 -113019 161264 -102217
18785a36184A19517b16381O2888j9752C9909a55718l4364C14880C8658n493O5003
$$ -136184 119517 -216381 -153493 -173245 39909 -155718 -190082 314880 38658 33165 98168
18774I8168a39121p4866D2131a94713C10075a52848o1725A7047b3809B27286a17312
$$ 98168 -139121 -213987 42131 -194713 310075 -152848 -214573 17047 -23809 227286 -117312
18762e5252B8529J33943b41340B58661j10810a61740A39247a05144L7191j64669
$$ -55252 28529 162472 -241340 258661 147851 -161740 139247 -105144 -67953 -232622
18752b32622n5596A06029l2810i8708M7384k22922e4743A06407a24590d0904l6230
$$ -232622 -288218 106029 73219 -98708 -51324 -274246 -54743 106407 -124590 -40904 -77134
18741g7134j54182c4428E5454c03212F561a64050j60863a54963b6734k63718R6513
$$ -77134 -231316 -34428 55454 -303212 6561 -164050 -324913 -154963 -26734 -290452 -193939
18730a93939A63523b92561J30455M8398d1963E6829a0384B54269g605D8855c5437
$$ -193939 163523 -292561 -162106 -113708 -41963 56829 -10384 254269 -7605 48855 -35437
18718A18446a64048K1509I5663a4694k40433M6138F4445P7830B2963a57268L1781
$$ 118446 -164048 -142539 95663 -14694 -255127 -208989 64445 142275 22963 -157268 -125487
18707a25487e7399k51399e5489B9423Q1715a77657K7006a9632l18850A95094a94495
$$ -125487 -57399 -308798 -55489 29423 111138 -177657 -150651 -19632 -338482 195094 -194495
18695b14814A53580f5993j6392m6799C6219b33643A89856I272b50139j91947A8720
$$ -214814 153580 -65993 -82385 -129184 36219 -233643 189856 9272 -250139 -442086 18720
18683C4870c20397C6246c01919e4748F2256c60563A54491F7679a44400p7177L282
$$ 34870 -320397 36246 -301919 -54748 62256 -360563 154491 67679 -144400 -221577 -218295
18672b18295C08600G6959a58551B13795D0829K34539I0273b25434E2863b32173
$$ -218295 308600 76959 -158551 213795 40829 275368 90273 -225434 52863 -232173
18661D22026G3459a12503B63315b64996K5536h6460A28365e9668j99367D9777
$$ 422026 73459 -112503 263315 -264996 -239460 -86460 128365 -59668 -259035 49777
18650A25740i6100l1356F1565a17192H0943a3005k72954d3576B17358c86202c3239
$$ 125740 -96100 -127456 61565 -117192 80943 -13005 -285959 -43576 217358 -386202 -33239
18638H051P3654h7783E770a91783j83025h9207k9918e7844A11418m3189k2070
$$ 8051 81705 -87783 5770 -191783 -374808 -89207 -119125 -57844 111418 68229 46159
18627D6159j0268J75956a1186k47766b0427C3159b77222C9447a0829a844j0305
$$ 46159 35891 211847 -11186 -258952 -20427 33159 -277222 39447 -10829 -1844 -12149
18616a2149k19614P1173C00823D186N4501a07420B8499c21226B71091j21458n7797
$$ -12149 -231763 -160590 300823 4186 58687 -107420 28499 -321226 271091 149633 91836
18605I1836G503a2263k00161d1362j58448A42951N2729r3731D3958N4799b64769
$$ 91836 7503 -12263 -212424 -41362 -199810 142951 195680 101949 43958 98757 -264769
18593E9644c49377a38243f1498I496c0163B21061a78725c6375r870j06460p207
$$ 59644 -349377 -138243 -61498 9496 -30163 221061 -178725 -36375 -46245 -152705 -159912
18582a59912P1075E3319J84080j18141b64715h6810B49385a46687r6765c6102
$$ -159912 -88837 53319 237399 119258 -264715 -86810 249385 -146687 -243452 -36102
18571a9413k049j96365a03393j44612r6144A62800a12150j64452h6834B5459l437
$$ -19413 -21462 -217827 -103393 -248005 -344149 162800 -112150 -276602 -86834 25459 22022
18560B2022K03142D6122b56237A14404b62578c783r7235B34924a01674j62693
$$ 22022 225164 46122 -256237 114404 -262578 -3783 -101018 234924 -101674 -264367
18550b64367Q8760H8776c42688a53622B69994j00298k986G0087e31663H940e8796
$$ -264367 -175607 88776 -342688 -153622 269994 169696 166710 70087 -531663 8940 -58796
18538B0682b33384i1129q5445M483o6558O9635E8206d7202j55498j54536A59528
$$ 20682 -233384 -91129 -176574 -172091 -238649 -169014 58206 -47202 -202700 -357236 159528
18526a21576e2128D62823c29647A9102a42286A33105m5412b01907E2581g2732
$$ -121576 -52128 462823 -329647 19102 -142286 133105 87693 -201907 52581 -72732
18515b5507o3704A65398g0057A43599i2386D5887L26763D5957b27816n5550C3300
$$ -25507 -89211 165398 -70057 143599 -92386 45887 372650 45957 -227816 -283366 33300
18503f6004j55824J09227A33069b12260F5310P267a10455K3819C20981b39483
$$ -66004 -221828 -112601 133069 -212260 65310 72577 -110455 -86636 320981 -239483
18492I5780h5958l78889A4386b89551a38023f3072C15046e9221j1941j18009B38129
$$ 95780 -85958 -464847 14386 -289551 -138023 -63072 315046 -59221 -71162 -189171 238129
18480f7280a5790j88697B06901o9879i8892j27944c0262q1358j01791m9164a20555
$$ -67280 -15790 -204487 206901 137022 -98892 -226836 -30262 -111620 -213411 -262575 -120555
18468a30108F9514a58103k8112B68611c86566M3127a36593j3596N6168l7769B65365
$$ -130108 69514 -158103 -186215 268611 -386566 -343439 -136593 -150189 -94021 -131790 265365
18456i4848l14348a21564k56781a37050I5323b13510M0210B4893M01590i6143
$$ -94848 -409196 -121564 -378345 -137050 95323 -213510 -173300 24893 426483 -96143
18445b06666G299b14096n3771d3214C95a14609B17752K16675C632K03626D3314
$$ -206666 7299 -214096 -267867 -43214 395 -114609 217752 434427 3632 207258 43314
18433c0708G8262J79812E455K85063b96098g2720j58628D876M08412a89333L6174
$$ -30708 78262 258074 5455 290518 -296098 -72720 -231348 4876 413288 -189333 -153159
18422a53159B02843a37569B20162O1478g0806A11768J1296c16798J19572I2523
$$ -153159 202843 -137569 220162 281640 -70806 111768 123064 -316798 -197226 92523
18411B823i1675C8765J33056j6323O636l6146e6586j66683A16313g5031F5085
$$ 2823 -91675 38765 171821 155498 162134 125988 -56586 -223269 116313 -75031 65085
18399b59602c7299o284B71231b43678i9789d1265j297H7630L2301J91869a61725
$$ -259602 -37299 -43583 271231 -243678 -99789 -41265 -42562 87630 119931 311800 -161725
18387a32978E9476J9063c53372B31338R395D4928b53094J22949q4232j2652F3605
$$ -132978 59476 78539 -353372 231338 240733 44928 -253094 -130145 -214377 -227029 63605
18375a09207k2239A06986C447K8870b01565C65676A30375b19108c7455A07708
$$ -109207 -131446 106986 3447 32317 -201565 365676 130375 -219108 -37455 107708
18364C28203f0582j10427A5168b6574a2353m0160B5956J6550J03952d7647A76526
$$ 328203 -60582 -171009 15168 -26574 -12353 -52513 25956 42506 146458 -47647 176526
18352c24287J50048c8354F2832J7989h4459F4533N0124b5398j67321J8554f8810
$$ -324287 -174239 -38354 62832 80821 -84459 64533 114657 -25398 -192719 -174165 -68810
18340D5322e2504J0478I9789A4916b54397D8867J97416G9601k6416a51948A23245
$$ 45322 -52504 -42026 99789 14916 -254397 48867 246283 79601 53185 -151948 123245
18328A74820C6580K69358a72805e3430r8608B366a91579H4075a90770D50463H2979
$$ 174820 36580 305938 -172805 -53430 -152038 2366 -191579 84075 -190770 450463 82979
18316B11145a16194B89422j13260a4759A93561B8674a98935k3145A40362a13086
$$ 211145 -116194 289422 176162 -14759 193561 28674 -198935 -222080 140362 -113086
18305a04078C32914b63465B03951c3237R966D7053J32230N572f5633c2258j5211
$$ -104078 332914 -263465 203951 -33237 -23271 47053 179283 184855 -65633 -32258 -47469
18294d7469P05j86194H1367e6882j0883k18574B5040e3350m2976A20168i8112
$$ -47469 -46764 -232958 81367 -56882 -67765 -286339 25040 -53350 -96326 120168 -98112
18282d70209C16290j01712b9871B08596Q6273b30971O0234N2217N277m2088B1808
$$ -470209 316290 214578 -29871 208596 294869 -230971 -170737 -118520 -113243 -155331 21808
18270D3580c88746j17736D2135K60807a07181F4111a24108A39421n597J3223o1539
$$ 43580 -388746 -506482 42135 302942 -107181 64111 -124108 139421 133824 147047 85508
18259H5508g4863j5481k98484f7633I309J15458b1330r6176m20726J27888f3319
$$ 85508 -74863 -90344 -388828 -67633 9309 124767 -21330 -117506 -538232 -410344 -63319
18247A85175a14187j7116A00501L46813a72702A8815f0565q7744j56101J32843
$$ 185175 -114187 -131303 100501 447314 -172702 18815 -60565 -148309 -304410 -171567
18237a71567B45252F0355J46934b60337D62208a66572J5121k06842a48551r1764
$$ -171567 245252 60355 207289 -260337 462208 -166572 -151451 -358293 -148551 -240315
18227b40315e0149k88280A08826K62482b23684f2568j6518j0779A70507C4424
$$ -240315 -50149 -338429 108826 371308 -223684 -62568 -79086 -89865 170507 34424
18216a19454e4392p7959A32020G242M5185a11783m2510K0640B9049R8109j3589
$$ -119454 -54392 -132351 132020 7242 52427 -111783 -154293 -133653 29049 127158 113569
18205A13569a05285B45590i7656M8682J8770m3653l9955j23899d9764i27A91846
$$ 113569 -105285 245590 -97656 -48974 -30204 -73857 -113812 -237711 -49764 -927 191846
18193A38322c30452P037k4587f1590k08837b7608o2979A77465b35044a6399r1646
$$ 138322 -330452 -323415 -348002 -61590 -270427 -27608 -90587 177465 -235044 -16399 -108045
18182a08045b3894A13842J305a16400j5461B13309i8309m2264N8227E9764b23456
$$ -108045 -23894 113842 115147 -116400 -131861 213309 -98309 -140573 -82346 59764 -223456
18170a05117B12488a55923j17531N5351A99812a79487A32959h8697A70388c49402
$$ -105117 212488 -155923 -273454 -218103 199812 -179487 132959 -88697 170388 -349402
18159B16374i8866a0256k96061J32257A04648I350b66763P7987R3953d1947k25468
$$ 216374 -98866 -10256 -306317 -174060 104648 9350 -266763 -188776 -94823 -41947 -267415
18148b67415d9627m3063B05667d91769a76675C74119a97076g5513A91342e4719
$$ -267415 -49627 -92690 205667 -491769 -176675 374119 -197076 -75513 191342 -54719
18137B78579A6001N5884R8906c8042q4535B32608i3373p4729A66071M5637o7219
$$ 278579 16001 71885 170791 -38042 -122577 232608 -93373 -168102 166071 211708 144489
18126A44489a36400A89792J72746a69196g027D1843J18283e3245h380A0717b92244
$$ 144489 -136400 189792 362538 -169196 -7027 41843 160126 -53245 -8380 10717 -292244
18114a28845A1341a39116A5923b91087a12787A5389h4570C44081a50302B66986
$$ -128845 11341 -139116 15923 -291087 -112787 15389 -84570 344081 -150302 266986
18103b08598q1166K4070P8473G6397d40912d4892B34100O9925h5276B28312a04413
$$ -208598 -289764 -265694 -187221 76397 -440912 -44892 234100 304025 -85276 228312 -104413
18091G1266B185d6599k6317B99439j38020D3617J32642f6946A15279b10071j72534
$$ 71266 2185 -46599 -72916 299439 161419 43617 176259 -66946 115279 -210071 -382605
18080c82605B47826F0048e7252J7656F5767b51670Q9626m1114A12723l3397b15121
$$ -382605 247826 60048 -57252 -39596 65767 -251670 -162044 -203158 112723 79326 -215121
18068A64622p3497a07742B21022a99307d4776A14004c0174q5482d1846k77131
$$ 164622 91125 -107742 221022 -199307 -44776 114004 -30174 -115656 -41846 -318977
18058c18977B29227C6677A1791a17093d3283o6187J0542k02404f773k75653l762
$$ -318977 229227 36677 11791 -117093 -43283 -109470 -98928 -301332 -6773 -282426 -286188
18047b86188B23627c71j09388D8710J99636i3109B54850D2313b44460f1614A00898
$$ -286188 223627 -371 -109759 48710 248346 -93109 254850 42313 -244460 -61614 100898
18035c80044C8978f3850q8404j52578J23086A61522b44805B05034H3374B0663
$$ -380044 38978 -63850 -152254 -304832 -181746 161522 -244805 205034 83374 20663
18024a81464N2701C82007A01391j587a82614F1308i3521j5144E0355i7641A14460
$$ -181464 -128763 382007 101391 99804 -182614 61308 -93521 -108665 50355 -97641 114460
18012A06870b58604A48997e4964j18878c6105j46087B94463h6316B6974h7489
$$ 106870 -258604 148997 -54964 -173842 -36105 -182192 294463 -86316 26974 -87489
18001a07158q7270o2717a10589E3165i8124c6808k79825i7623m7111j12227h9146
$$ -107158 -194428 -257145 -110589 53165 -98124 -36808 -316633 -97623 -144734 -256961 -89146
17989i8710q8698B91360B9665a81187f5861B4722L8431J7022a31613r1249L3540
$$ -98710 -187408 291360 29665 -181187 -65861 24722 63153 80175 -131613 -222862 -189322
17978a89322N0651B0992g6441H8020O4163I737c6592j63691g0977A10604b34369
$$ -189322 -138671 20992 -76441 88020 152183 9737 -36592 -200283 -70977 110604 -234369
17966A97686g2886A45993E1447b08774B88032F1754d9664G1151J56150b53078
$$ 197686 -72886 145993 51447 -208774 288032 61754 -49664 71151 227301 -253078
17955D6147a62694D8351L09358b37972d7217G6686h1193k38407d8415j75144B45
$$ 46147 -162694 48351 357709 -237972 -47217 76686 -81193 -319600 -48415 -223559 245
17943B1879K55242n5548a5666j14964r6569J03693j09813e3393J2622A58496b32509
$$ 21879 277121 221573 -15666 -130630 -227199 -123506 -233319 -53393 -40771 158496 -232509
17931a87279j4774A86716G7900l3093J86813C4741J76008a66302A9966K69751
$$ -187279 -202053 186716 77900 44807 231620 34741 210749 -166302 19966 289717
17921B89717E784a20617j21367B22660b01813A62924D8051g2759A43924h5904
$$ 289717 5784 -120617 -241984 222660 -201813 162924 48051 -72759 143924 -85904
17910C9974a73914K4546c126r4222E7084K15326m8038G99a44881b9090H7683a11647
$$ 39974 -173914 -149368 -3126 -97348 57084 272410 224372 799 -144881 -29090 87683 -111647
17897E6405a18894G0126g2489k64247A04574b0045B98388B9012L5615j4707M1733
$$ 56405 -118894 70126 -72489 -336736 104574 -20045 298388 29012 64627 49920 91653
17886I1653b3567B3789c40792a11352J8523l2809K1180c2611D6468J34922J74566
$$ 91653 -23567 23789 -340792 -111352 -92829 -125638 -104458 -32611 46468 181390 355956
17875C55956G4484k1061g5781n6114A32503A874L74514e5182A43886d04894A55397
$$ 355956 74484 53423 -75781 -131895 132503 1874 376388 -55182 143886 -404894 155397
17863b73026B2148a33549j689e6227B0123O104K1797a54821E7532L3860a18785
$$ -273026 22148 -133549 -135238 -56227 20123 26227 48024 -154821 57532 91392 -118785
17851d0064m25708a17232p2862d7993l1249o9592K753A34592a21027e9571C1026
$$ -40064 -465772 -117232 -190094 -47993 -79242 -148834 -146081 134592 -121027 -59571 31026
17839A12769d1614B49628a84461f1260j2126j47601D2624M8021K19979A2970a51565
$$ 112769 -41614 249628 -184461 -61260 -73386 -220987 42624 90645 310624 12970 -151565
17827H8751a35698B50948q8998O0120c50937A08479J40477c7134C30961F6592
$$ 88751 -135698 250948 161950 222070 -350937 108479 248956 -37134 330961 66592
17816b01363A55684L0668H626c0210A70663b0681j04204r2221D5155R2342A3674
$$ -201363 155684 186352 8626 -30210 170663 -20681 -124885 -217106 45155 137497 13674
17804A94132E1060g8493A58110b42922f5351D149c02929a02921j28482j19582
$$ 194132 51060 -78493 158110 -242922 -65351 4149 -302929 -102921 -231403 -350985
17794c50985a44956K720F5235e8262H09b35021A98155J26195a17568d7168B74822
$$ -350985 -144956 -142236 65235 -58262 809 -235021 198155 324350 -117568 -47168 274822
17782g2672A72630b7936k62957A51972a29183b4203j91872C64471A37833L52987
$$ -72672 172630 -27936 -290893 151972 -129183 -24203 -216075 364471 137833 490820
17772D90820A2916O3232a08866B32621c35814i7186n1174n6796b5510A36701G870
$$ 490820 12916 76148 -108866 232621 -335814 -97186 -148360 -205156 -25510 136701 7870
17760i0060A07092c9307J7375k2562A3729g7865k62826J65952j45487a23236c2467
$$ -90060 107092 -39307 -21932 -44494 13729 -77865 -340691 -174739 -320226 -123236 -32467
17748a94899D8315d3942D4555K28035b06390G6007L38664a3733G0927A3934J3263
$$ -194899 48315 -43942 44555 272590 -206390 76007 414671 -13733 70927 13934 27197
17737B7197N11100b98080L4895d0312r1681e3711q5803E2839J08784a80780B57737
$$ 27197 538297 -298080 -263185 -40312 -131993 -53711 -139514 52839 161623 -180780 257737
17725c3026k8054j836B13294O6997F2603J5531J28723K6228B1430J9060N2075
$$ -33026 -61080 -62916 213294 280291 62603 78134 206857 233085 21430 40490 92565
17714I2565l6533J09889c3286m8565d484l2229D375h9744F6308e998k92839A56020
$$ 92565 56032 165921 -33286 -81851 -4484 -36713 4375 -89744 66308 -5998 -298837 156020
17701A67238C9552a77098G1525h9177G1388a14958K6228j05780D02405j87767
$$ 167238 39552 -177098 71525 -89177 71388 -114958 -88730 -194510 402405 214638
17691B14638j05447A2776c7722A63389L6134D5647J94473F6011h5772m4200A3650
$$ 214638 109191 12776 -37722 163389 199523 45647 240120 66011 -85772 -129972 13650
17679B56337c12996A06860c50297i351l21915D3536f5316A28742g1674o3565O3069
$$ 256337 -312996 106860 -350297 -9351 -331266 43536 -65316 128742 -71674 -135239 -72170
17668g2170n5183E500g8097A0695K02284J30947H722K07512f1838N408r6082A73353
$$ -72170 -127353 5500 -78097 10695 212979 343926 8722 216234 -61838 -56430 -152512 173353
17655a85161g3756A73874R2864d9444H370h7039k46103b0246A0876P1691J24972
$$ -185161 -73756 173874 266738 -49444 8370 -87039 -333142 -20246 10876 82567 207539
17644B07539L4783r7179m6404J02175a94899e3776b3889C52183n292r7867c30463
$$ 207539 242322 145143 98739 200914 -194899 -53776 -23889 352183 346891 249024 -330463
17632b31063B25860q0951d9747H7166R206k6430M7463A4134M2611J14160P3594
$$ -231063 225860 144909 -49747 87166 96372 69942 117405 14134 56745 170905 244499
17621B44499o8346B8566h4498B18714a43275e5101F0251J343J75014a25055A01407
$$ 244499 176153 28566 -84498 218714 -143275 -55101 60251 61594 236608 -125055 101407
17609A54907M6035d2371R867B60756c0780j33694O4801b6319B05075P6089a7527
$$ 154907 200942 -42371 -32504 260756 -30780 -164474 -99673 -26319 205075 281164 -17527
17597B69982C628K4904c2289r3603C3623J07365a21198m8596B36003a15247j35115
$$ 269982 3628 28532 -32289 -125892 33623 140988 -121198 -169794 236003 -115247 -250362
17586b50362C00262A37035J53546a17949c3962C7951J58907q2261J24136a47764
$$ -250362 300262 137035 290581 -117949 -33962 37951 196858 114597 238733 -147764
17575f7531J8275G1273j1231J66660M1325C451a31253M2365B66024G9734a49111
$$ -67531 -49256 71273 60042 226702 268027 3451 -131253 -88888 266024 79734 -149111
17563f9386A39010h852j40233A37814i8814D3751b84385H347J24219Q3703G1546
$$ -69386 139010 -8852 -149085 137814 -98814 43751 -284385 8347 132566 216269 71546
17551B38700K0405f3968F5035P701J69728b29704A9645K88217A27981h1417A24392
$$ 238700 259105 -63968 65035 72736 242464 -229704 19645 307862 127981 -81417 124392
17539B08118J05710j07597n4088b24826c1385o791r3693A97938e804D44711d1759
$$ 208118 313828 206231 152143 -224826 -31385 -38176 -131869 197938 -5804 444711 -41759
17527H3797J67308c6817H2399K94427j49890i287H7004f883A41940i6667D05982
$$ 83797 251105 -36817 82399 376826 226936 -9287 87004 -6883 141940 -96667 405982
17515c5617j85071G9825O3915J74570B8911L28227j21652J3661c8830B86218C9679
$$ -35617 -220688 79825 143740 318310 28911 357138 235486 249147 -38830 286218 39679
17503e7693E9746f900C95250a31721d2651A11591a46069B07563a34911J3775B81085
$$ -57693 59746 -6900 395250 -131721 -42651 111591 -146069 207563 -134911 -121136 281085
17491D49793d6j43232B27587b08216B20644o2615F8617i0736A30258J59940A14578
$$ 449793 -46 -143278 227587 -208216 220644 158029 68617 -90736 130258 290198 114578
17479H0330b35851A73716J20874N3187j50882m3385L57715c38613A9888K27420
$$ 80330 -235851 173716 294590 347777 196895 153510 511225 -338613 19888 247308
17469B47308b53359A93593l3355l3760K13678A13752b78634D280J8093K75609
$$ 247308 -253359 193593 160238 126478 340156 113752 -278634 4280 22373 297982
17459B97982L2731J6046j15633c0373A78535B3512J81479o0433M72972B46004
$$ 297982 330713 346759 231126 -30373 178535 23512 204991 144558 617530 246004
17448a41271C01652q1522L56831A64817K1628M2448G9834M91693l7A26952J75915
$$ -141271 301652 220130 576961 164817 186445 228893 79834 571527 571490 126952 302867
17437C02867H2753J19625J19889R6633i0786D28442a8929B19097K17810k04484
$$ 302867 82753 202378 322267 418900 -90786 428442 -18929 219097 436907 232423
17427B32423q7691J8909Q3808r4618K95882A37465c0712D15911A20445J25749
$$ 232423 144732 163641 247449 152831 448713 137465 -30712 415911 120445 246194
17417B46194e0973D42023N65j61508K92277a12408C63568A1408M52226J67257
$$ 246194 -50973 442023 442588 281080 573357 -112408 363568 11408 463634 630891
17407F30891k28599D6929a37629f3271A37982b7934A25053b403B25156H4062J31750
$$ 630891 402292 46929 -137629 -63271 137982 -27934 125053 -2403 225156 84062 215812
17396B15812r7383J63813n2815E3467b93974C49599J07106A68096G4163B1460
$$ 215812 118429 282242 229427 53467 -293974 349599 456705 168096 74163 21460
17385C54273a15028H4660Q9957b55653N1714D07867j26638a19104B83744K40086
$$ 354273 -115028 84660 174617 -255653 -203939 407867 281229 -119104 283744 523830
17375E23830B30308i84C23773Q6726j26507A34957K56946A67991R9772c3270C41857
$$ 523830 230308 -984 323773 410499 283992 134957 391903 167991 267763 -33270 341857
17363B06632C6551J19005a13510A82923J52152c2892C0604O5437b45629C38575
$$ 206632 36551 155556 -113510 182923 335075 -32892 30604 96041 -245629 338575
17352a3209A11106Q2456K88300a6681o5828E7459L65441b74365B26414r3469a41344
$$ -13209 111106 193562 481862 -16681 -82509 57459 422900 -274365 226414 132945 -141344
17340B23361F7954M9271a18439H1525Q8901F8569M7081K66725b04711D23487b5771
$$ 223361 67954 117225 -118439 81525 170426 68569 115650 382375 -204711 423487 -25771
17328a37332H7835b13096C4182f5019B95227c813A20953J38218a2772F1190N57692
$$ -137332 87835 -213096 34182 -65019 295227 -3813 120953 259171 -12772 61190 618882
17317F18882G0502g0906FK42074J12574A58190L99763I3595J71938E8968K1959
$$ 618882 70502 -70906 6 242080 354654 158190 557953 93595 265533 58968 80927
17306H0927J82028j11580K4132a9599B86797c1387n0870B66233j14532L14608
$$ 80927 262955 151375 175507 -19599 286797 -31387 -82257 266233 151701 466309
17296D66309j89056l5010G4287L58257H4181L07947A59275j8428K22971o5947
$$ 466309 277253 242243 74287 432544 84181 392128 159275 140847 363818 297871
17286B97871a48121N0758C23608o2833D7703e9611C1155e0373A49138J45774J40763
$$ 297871 -148121 -97363 323608 260775 47703 -59611 31155 -50373 149138 294912 435675
17275D35675j93017K58160J50325i0336D53168k11732E8627N08047k41871R9495
$$ 435675 242658 500818 651143 -90336 453168 241436 58627 566674 324803 424298
17265D24298j51071J02633B1669Q045a03418B2349J12817M0066p2082J35531N6204
$$ 424298 273227 375860 21669 29714 -103418 22349 135166 175232 103150 238681 294885
17254B94885I7652L15039A9526K14370o7025M89782B98620p9020J73536j64455
$$ 294885 97652 412691 19526 233896 166871 656653 298620 219600 393136 228681
17244B28681L34094d6938B60516H8266J58251j4376a181A66119J90041A17172
$$ 228681 562775 -46938 260516 88266 246517 232141 -1181 166119 356160 117172
17233e1100E28815B26436j6408H6515Q8319N5216j11354b3053E5909K14662J93556
$$ -51100 528815 226436 210028 86515 174834 230050 118696 -23053 55909 270571 464127
17222D64127D4666O6925a49439j2794B27342F4959J94593b8508B56797l2090J75120
$$ 464127 44666 111591 -149439 -162233 227342 64959 259552 -28508 256797 224707 399827
17211C99827r9385A758J12841J79654j8391o673j12669J79113K56885k16680j44837
$$ 399827 300442 1758 114599 294253 275862 269189 156520 335633 592518 375838 231001
17200B31001L9718C0637K39046m0085R7556n752o3720d9862C16338K96244k91163
$$ 231001 270719 30637 269683 229598 327154 321402 257682 -49862 316338 612582 321419
17189C21419J16886I9741M48129A84964G7318f2518A17558L84634A09478K08720
$$ 321419 438305 99741 547870 184964 77318 -62518 117558 502192 109478 318198
17179C18198K56305k35471a17783D20908A06549J67394L94739k86139J09486A74872
$$ 318198 574503 339032 -117783 420908 106549 273943 668682 382543 492029 174872
17168D91871j80565k1297M56696A13173L90752A70004J40343j27068N336N4762
$$ 491871 311306 290009 746705 113173 503925 170004 310347 183279 188615 243377
17158B43377j02365J49132b2031C64610K0846N7580K46606l20023j62548K46168
$$ 243377 141012 290144 -22031 364610 385456 443036 689642 369619 207071 453239
17148D53239A35751K50719A83428K32738f1707B91104J86707j97906R9809j10292
$$ 453239 135751 386470 183428 416166 -61707 291104 477811 279905 379714 269422
17138B69422J24288R0055A90120J59476L29874r5565j63339L05250j67209B70072
$$ 269422 393710 483765 190120 349596 679470 583905 420566 725816 558607 270072
17127B21037J97947A67683K5332O2966L45363k85984M11547l20099J16015p1490
$$ 221037 418984 167683 193015 255981 601344 315360 726907 406808 522823 451333
17117D51333o7024j19985J54403A68431N6652L97025m4353j62010C7947N88088
$$ 451333 384309 264324 418727 168431 225083 622108 577755 415745 37947 626035
17107F26035k13413O3101A44663k6408M32157j11935A24499L74587p7550J34661
$$ 626035 412622 475723 144663 118255 550412 438477 124499 499086 421536 556197
17097E56197o5898p668A71386J85120k9819K38418j11274J36523k2779Q5942j90022
$$ 556197 490299 482631 171386 356506 326687 565105 453831 590354 567575 653517 463495
17086D63495r8766A54594J84673M74249C75812R6923A55989N09321k55616J32364
$$ 463495 364729 154594 339267 813516 375812 472735 155989 665310 409694 542058
17076E42058B50078R6583j65305N65939e1976F02497A98531N59792k92765n0117
$$ 542058 250078 346661 181356 747295 -51976 602497 198531 758323 465558 415441
17066D15441L7784J1056J52554j68257J42187j38432J67434j72147J43009J08617
$$ 415441 453225 464281 616835 448578 590765 452333 619767 447620 590629 699246
17056F99246j48638k49309N24155C52424j54370L60902K21423k16327Q5715L08
$$ 699246 550608 301299 825454 352424 198054 558956 780379 564052 649767 650075
17046F50075j67553K35038J35878k95362J14124J13488k85379J50223j92831k4304
$$ 650075 482522 717560 853438 558076 672200 785688 500309 650532 457701 433397
17036D33397K60227j95092K38956k87221K35029k29440J40512Q8551K4476q3715
$$ 433397 693624 498532 737488 450267 685296 455856 596368 684919 709395 625680
17026F25680j50224L37095k80J3553j90922k1605j3470j73246M67086j90700j21423
$$ 625680 475456 812551 812271 825824 634902 613297 599827 426581 893667 702967 581544
17015E81544J37211M5376k41763N0699J72112J09638M3240k17320K35628m27202
$$ 581544 718755 764131 522368 573067 745179 854817 898057 680737 916365 489163
17005D89163N42855l59663L01242l34495J76928R5291k6031k65414K60358q7545
$$ 489163 1032018 672355 973597 639102 816030 911321 885290 619876 880234 792689
16995G92689n6706J73551j8409J02254j75796k79007L32694j08690N8296J49323
$$ 792689 735983 909534 891125 993379 817583 538576 871270 762580 820876 970199
16985I70199j57644J89769J37827m43720L52190j66976O5587j914J69773J82405
$$ 970199 812555 1002324 1140151 696431 1048621 881645 947232 945318 1115091 1297496
16975A297496n85166K34494M6187k410K82515j27913j11842k04739n4006M08422
$$ 1297496 712330 946824 993011 990601 1273116 1145203 1033361 828622 774616 1183038
16965A183038j71682J31688Q8108M7560l51972n9382O9787q8822m809P4209K47559
$$ 1183038 1011356 1143044 1231152 1278712 926740 867358 937145 848323 843514 917723 1165282
16954A165282o4689M16626l24936P8835k65718L42682l49698j8819K89234q0570
$$ 1165282 1100593 1517219 1192283 1271118 1005400 1348082 998384 979565 1268799 1188229
16944A188229L58671k06076K3830J37944O0431k84702O7074q0481j32012K69372
$$ 1188229 1546900 1340824 1364654 1502598 1563029 1278327 1345401 1264920 1132908 1402280
16934A402280l15833M09583N1836l87255J32674j13592K98301J75666l30347L21579
$$ 1402280 1086447 1496030 1547866 1160611 1293285 1179693 1477994 1653660 1323313 1644892
16924A644892r8064r7002M8085n6195p6764K76440L0171k33820m3415J82981q5737
$$ 1644892 1546828 1449826 1497911 1441716 1364952 1641392 1671563 1437743 1394328 1577309 1491572
16913A491572O2186j59260L16516J85494J02387m20290N61358j30673m5254j99603
$$ 1491572 1553758 1394498 1711014 1896508 1998895 1578605 2139963 2009290 1964036 1764433
16903A764433J47655j998O7943o1486m82996N29347k3436n6462J97118j06467
$$ 1764433 1912088 1910090 1978033 1916547 1433551 1962898 1939462 1883000 2080118 1973651
16893A973651K5238l9706J94151j56287n9951K25855P0771k634K04910R2805l80423
$$ 1973651 1998889 1959183 2153334 1997047 1937096 2162951 2233722 2231088 2435998 2528803 2148380
16882B148380Q7514k05274M80599j81944Q6051K11287o1760j96394K45330r8802
$$ 2148380 2235894 2030620 2511219 2329275 2415326 2626613 2564853 2368459 2613789 2514987
16872B514987J90520n03408M89479R8691j08298p3147L29302o4465p061J92998
$$ 2514987 2705507 2202099 2691578 2790269 2681971 2608824 2938126 2873661 2866600 3059598
16862C059598l81807M86915l015k77731J51733M7153J08118J39560J91748j25912
$$ 3059598 2677791 3164706 3161691 2883960 3035693 3082846 3190964 3330524 3522272 3396360
16852C396360J81289o6854l34097J12246K47868J79753j01328o7774J91942l283
$$ 3396360 3577649 3510795 3176698 3288944 3536812 3716565 3615237 3547463 3739405 3736122
16842C736122M21032J46043o96166Q23818k75522P8796J14248R6332M209J52170
$$ 3736122 4157154 4303197 3607031 4430849 4155327 4234123 4348371 4444703 4448912 4601082
16832D601082K91127q2711n1779j5122M55051j62068P9622K54550n7354j43190
$$ 4601082 4892209 4809498 4757719 4742597 5197648 5035580 5115202 5369752 5312398 5169208
16822E169208L01913O9924K4820N65551l33040L13987Q9408K20607M6865K27175
$$ 5169208 5471121 5541045 5565865 6131416 5798376 6112363 6201771 6422378 6469243 6696418
16812F696418K7776l7935K80085L55346j27708N8853q2962L74597o5863J95092
$$ 6696418 6724194 6686259 6966344 7321690 7193982 7252835 7169873 7544470 7478607 7673699
16802G673699N92003J30738L26230P0784l0141O96021J03383J59933K44188j58265
$$ 7673699 8265702 8396440 8722670 8793454 8763313 9459334 9562717 9722650 9966838 9808573
16792I808573M70925K13322K22373K24295O78165K8339L20776L53226K24237J21820
$$ 9808573 10279498 10492820 10715193 10939488 11617653 11645992 11966768 12319994 12544231 12666051
16782A2666051N43866O35944J46341N33609M52118K88749N45209L51999M01339
$$ 12666051 13209917 13845861 13992202 14525811 14977929 15266678 15811887 16163886 16565225
16773A6565225Q34898M92973M13225P09204Q60771L86523P54931P22835N06061
$$ 16565225 17400123 17893096 18306321 19015525 19876296 20262819 21017750 21740585 22246646
16764B2246646P01037J328399O74923J158952N36513J120075J239437J133083
$$ 22246646 22947683 24276082 24951005 26109957 26646470 27766545 29005982 30139065
16756C0139065J195687J311440J421416J402308J658430J527017J711767J847731
$$ 30139065 31334752 32646192 34067608 35469916 37128346 38655363 40367130 42214861
16748D2214861J863627K333594J740240K679325K135051K868798K967536L046525
$$ 42214861 44078488 46412082 48152322 50831647 52966698 55835496 58803032 61849557
16740F1849557L053844L364452L583640M062680M109073M366581M169021N217483
$$ 61849557 64903401 68267853 71851493 75914173 80023246 84389827 88558848 93776331
16732I3776331N030532N558862N659214N548119N983877O473852N879819O791191
$$ 93776331 98806863 104365725 110024939 115573058 121556935 128030787 133910606 140701797
16724A40701797O085401O270511O104411N869913N059708M424601L998693K817869
$$ 140701797 146787198 153057709 159162120 165032033 170091741 174516342 178515035 181332904
16716A81332904J922467J107273J04704j077670k127882k729537l662242m705374
$$ 181332904 183255371 184362644 184467348 183389678 181261796 178532259 174870017 170164643
16708A70164643m893774n913125n588818o451786o930561o409178o882697n931378
$$ 170164643 165270869 159357744 153768926 147317140 140386579 133977401 127094704 121163326
16700A21163326o459125n802612o028494n254822n567834m953322m359666n053225
$$ 121163326 114704201 108901589 102873095 97618273 92050439 87097117 82737451 77684226
16692G7684226l793033m050346l343107l699990l263010k793106l103266k558070
$$ 77684226 73891193 69840847 66497740 62797750 59534740 56741634 53638368 51080298
16684E1080298k733792k204560k017730j719073k477134j191828k328234j334260
$$ 51080298 48346506 46141946 44124216 42405143 39928009 38736181 36407947 35073687
16676C5073687j573763j197979j372897j455634j000097j086408j048306j040781
$$ 35073687 33499924 32301945 30929048 29473414 28473317 27386909 26338603 25297822
16668B5297822j361618m08466r43243o86638r91593n59703p04215m83268r81088
$$ 25297822 23936204 23527738 22584495 21897857 20906264 20346561 19642346 19159078 18177990
16659A8177990j41701q86989n33998o06285p60925l80052k26661o81579k19707
$$ 18177990 18036289 17149300 16615302 16009017 15248092 14868040 14641379 13959800 13740093
16650A3740093m16511k70070n15500m07317j25944n71387q4755m27219m97331
$$ 13740093 13323582 13053512 12538012 12130695 12004751 11433364 11348609 10921390 10424059
16641A0424059j48941K623n74927j55777n46562J6473l36155l46323O9282l50703
$$ 10424059 10275118 10277741 9702814 9547037 9000475 9016948 8680793 8334470 8403752 8053049
16631H053049j56501O18755p88546m71856j30303J41103l99228O3223j28107p148
$$ 8053049 7896548 8515303 7726757 7254901 7124598 7265701 6866473 6929696 6801589 6794441
16621F794441n03020j0297j81533J34708l90793N8702l71849O2917m49567J74487
$$ 6794441 6291421 6281124 6099591 6234299 5843506 5902208 5530359 5593276 5143709 5318196
16611E318196l09755L00412k09864l26524J64221m96090j23328L01213l8945l91190
$$ 5318196 5008441 5308853 5098989 4772465 4936686 4440596 4317268 4618481 4579536 4188346
16601D188346l8537K04874p1642m38455p3423k06061K69186J92848l64942K0019
$$ 4188346 4149809 4354683 4283041 3844586 3771163 3565102 3834288 4027136 3662194 3682213
16591C682213l6214O3144l00189O8034K5458j23047K97956k96791p2165k10277
$$ 3682213 3645999 3709143 3408954 3476988 3502446 3379399 3677355 3380564 3308399 3098122
16581C098122L9004O4550l45570J94899m37809K48902K96181j95450o8231k90405
$$ 3098122 3137126 3201676 2856106 3051005 2613196 2862098 3158279 2962829 2894598 2604193
16571B604193k26603K78629J088J48934l67962J53982j69556M2801j37263l8010
$$ 2604193 2377590 2656219 2657307 2806241 2438279 2592261 2422705 2465506 2328243 2290233
16561B290233J29823k93655J84215j93408N22298m95601q6325K23809k47850l21742
$$ 2290233 2420056 2126401 2310616 2117208 2639506 2143905 2057580 2281389 2033539 1711797
16551A711797m7743J78525k1145L20292k36885q4835J10734K9840j95700j03718
$$ 1711797 1664054 1842579 1821434 2141726 1904841 1820006 1930740 1960580 1764880 1661162
16541A661162K4449R4729j45879j88653K80282P3888k84387K76115n2831J41986
$$ 1661162 1685611 1780340 1634461 1445808 1726090 1799978 1515591 1791706 1738875 1880861
16531A880861m09437K132L82050n51314Q0574J13593j81152K93853k5712k36218
$$ 1880861 1471424 1473556 1855606 1304292 1384866 1498459 1317307 1611160 1585448 1349230
16521A349230J65446l25815K70850m39717N511K12468J9578O6916j4538r3932
$$ 1349230 1514676 1188861 1459711 1019994 1025505 1237973 1257551 1324467 1309929 1215997
16511A215997k86215L86615r2491p9677j18944N32152l34130J67842k27097M8295
$$ 1215997 929782 1316397 1223906 1144229 1025285 1557437 1223307 1391149 1164052 1212347
16501A212347r9278j14509J84030k84289K47192l04056L59948k74738j74308R8287
$$ 1212347 1113069 998560 1182590 898301 1145493 841437 1201385 926647 752339 850626
16491H50626O8001j38050k03714K10733P7092J3854J22156k33510l55531J59746
$$ 850626 918627 780577 576863 787596 864688 878542 1000698 767188 411657 571403
16481E71403K59076p9848M868K61998r7072n7079M88888l85969l88834l3126J37436
$$ 571403 830479 750631 755499 1017497 920425 863346 1352234 966265 577431 544305 681741
16470F81741J95093j46990J90936j57685m2974j51960J62903J0083o3969J71068
$$ 681741 876834 729844 920780 763095 720121 568161 731064 741147 677178 848246
16460H48246o5537o1738K88655j53330Q2078l93579j28278O17463m72400J05524
$$ 848246 782709 720971 1009626 856296 938374 544795 416517 1033980 561580 667104
16450F67104l8880n5157J16219k96058L6207L00428J28165j2944l34143K59665
$$ 667104 628224 573067 689286 393228 429435 729863 858028 845084 510941 770606
16440G70606C27481M3951M17451j97381o9747j9079K35434q159j26809P8516K399
$$ 770606 327481 371432 788883 591502 521755 502676 738110 729951 603142 681658 684057
16429F84057n2807l02007J28442p791K82537o2597j838k84471L883J85809m6493
$$ 684057 631250 329243 457685 449894 732431 669834 667996 383525 387408 573217 526724
16418E26724M38988l28577B61340L24605K32587j64122P737m5821k36792O9978
$$ 526724 965712 637135 261340 585945 818532 654410 662147 616326 379534 449512
16408D49512J21929p2636J1481p6152L12819k14954k64128J09142J25757A40173
$$ 449512 571441 498805 510286 434134 746953 531999 267871 377013 502770 140173
16397D71614M79292l69373j02443R6104j70233j65088K80779q6504j27383K10905
$$ 471614 950906 581533 479090 575194 404961 239873 520652 434148 306765 517670
16387E17670j89580J29546A70127L30792P4944F7674k1034M00054r3961M23386
$$ 517670 328090 457636 170127 500919 575863 67674 46640 446694 352733 776119
16377G76119B16802L65522A17993K98187R1495J47606q8494q7008O0108A34043
$$ 776119 216802 582324 117993 416180 507675 655281 566787 479779 539887 134043
16366B96164L4072r7891Q874J27391Q4973i9583B0412J3849K48033m9748k2886
$$ 296164 330236 232345 241219 368610 453583 -99583 20412 34261 282294 232546 209660
16355B09660J31462A28053L42639k06778r6911L86008A63715C1143J53485K90808
$$ 209660 341122 128053 470692 263914 167003 553011 163715 31143 184628 475436
16345D75436A66560p9908J23191E5004K80023J9824Q426l1300K30126A42361K83743
$$ 475436 166560 86652 209843 55004 335027 354851 363277 331977 562103 142361 426104
16334D26104B09311o0621M23988k02490q8128M0344J151i6539C11108A17117K38449
$$ 426104 209311 148690 572678 370188 282060 322404 323555 -96539 311108 117117 355566
16323C55566R9015j58422J69913K9404A70434J38049j29221E9768p161M07180
$$ 355566 454581 296159 466072 495476 170434 308483 179262 59768 52607 459787
16313D59787G36M29248A53790O0670J23642O8036A90205K48931j21903I7122K46
$$ 459787 736 429984 153790 214460 338102 406138 190205 439136 317233 97122 97368
16302I7368J22924J61191e9245A68808q1760K02010j33351i9655d8104F7363a66281
$$ 97368 220292 381483 -59245 168808 87048 289058 155707 -99655 -48104 67363 -166281
16290A52980j5951N8469p6242K32992j9535q9922K07507o6758M930a3617B64174
$$ 152980 137029 195498 119256 352248 332713 242791 450298 383540 388470 -13617 264174
16278C31268K7888j53928J2954A865e6345B47131b53722A89412K03591G8759J43526
$$ 331268 359156 205228 218182 1865 -56345 247131 -253722 189412 393003 78759 222285
16267B22285G5408L46312j97124D5880J04134j2272d5721B99931b27822G6675
$$ 222285 75408 421720 224596 45880 150014 137742 -45721 299931 -227822 76675
16256B42663a96957C31983J8860h8710b6375C3265J38432J08034L5915r8293J23245
$$ 242663 -196957 331983 350843 -88710 -26375 33265 171697 279731 315646 217353 340598
16245C40598j4450c4538D97454b9276l98868F4199J41760l1999L6332J47223b2884
$$ 340598 326148 -34538 497454 -29276 -428144 64199 205959 173960 210292 357515 -22884
16233C0381P7457J4222a42324a6465B57145C4513M68019D5082a5150A86049a5750
$$ 30381 107838 122060 -142324 -16465 257145 34513 502532 45082 -15150 186049 -15750
16221D2246L6319K17145c2701O656j58045C71049o7913h1084p8244c061D42802
$$ 42246 78565 295710 -32701 -26045 -184090 371049 303136 -81084 -159328 -3061 442802
16209A27324b872B80508a01080E4557a45400A5530e5911j2025B21310f4642l23852
$$ 127324 -2872 280508 -101080 54557 -145400 15530 -55911 -67936 221310 -64642 -388494
16198c88494A87565p6594n2774M5755d6200b2753k4818j13136P8855E8352b12108
$$ -388494 187565 110971 58197 103952 -46200 -22753 -47571 -160707 -81852 58352 -212108
16186a62693B7926a13749B36372A14386K75303g1273A34110D0479a9970B50172
$$ -162693 27926 -113749 236372 114386 389689 -71273 134110 40479 -19970 250172
16175A40313L8477J19899A23820a046j03804D7983P7813J96712A8022c46872f5640
$$ 140313 178790 298689 123820 -1046 -104850 47983 125796 322508 18022 -346872 -65640
16163c8028j7889A32499n8623B4329L97296H4450K32459g9665C04414e2494p9647
$$ -38028 -55917 132499 73876 24329 421625 84450 316909 -79665 304414 -52494 -132141
16152a32141I0873J2073m6152c28755B63709Q2065D4035c6007n2666C8987a21152
$$ -132141 90873 102946 56794 -328755 263709 345774 44035 -36007 -88673 38987 -121152
16140B03785c6140o9921j76433J21895B54266A21808D7247g2085A02823e0752
$$ 203785 -36140 -106061 -282494 -160599 254266 121808 47247 -72085 102823 -50752
16129a55755k041A47764J16513A29731o4581b72538A96519A0596d3357B104e0409
$$ -155755 -157796 147764 264277 129731 65150 -272538 196519 10596 -43357 2104 -50409
16117g9685A09870h9182i906H2616B3569J2280b32785E2607G903L61677A15684
$$ -79685 109870 -89182 -9906 82616 23569 35849 -232785 52607 7903 369580 115684
16105a626F3385K3958Q2652J0092R19J1852q2332B5910a10978H9376a27387A54637
$$ -1626 63385 87343 169995 180087 181006 192858 110526 25910 -110978 89376 -127387 154637
16092a65165m6207c209B0748d0263A0186e8621E5229K07850b95487G4179b3166
$$ -165165 -211372 -3209 20748 -40263 10186 -58621 55229 263079 -295487 74179 -23166
16080a3067p8034k68473B73249A03031c8258D685a1101A88537c3947B0340b06134
$$ -13067 -91101 -359574 273249 103031 -38258 4685 -11101 188537 -33947 20340 -206134
16068G7906L89973B06544d1454j32435d9155B40159o6158q0585L282a0132H5871
$$ 77906 467879 206544 -41454 -173889 -49155 240159 174001 93416 96698 -10132 85871
16056a96670g3940p1490I388b84847e0876p419j05122J1485B8151O2159b45281
$$ -196670 -73940 -145430 9388 -284847 -50876 -58295 -163417 -151932 28151 90310 -245281
16044A33592k4582A5050a43887j46125A8510M2864c53377a34010d9892B05854
$$ 133592 109010 15050 -143887 -290012 18510 61374 -353377 -134010 -49892 205854
16033i5867A70684A0h6991A39509g1632D5691c4504A89210B4986L6470c68028
$$ -95867 170684 10 -86991 139509 -71632 45691 -34504 189210 24986 61456 -368028
16021B04609b0024C4267j6127b01176E3729J82041o2578a76332M1388O1257B8559
$$ 204609 -20024 34267 18140 -201176 53729 235770 173192 -176332 -134944 -73687 28559
16009A7281b90789J07138k55A24648e31257K63410a0927C7223K27283A7623b28777
$$ 17281 -290789 -183651 -183906 124648 -531257 -267847 -10927 37223 264506 17623 -228777
15997b6496m9389p202A45612M6908c2154a5038H4788O2294a01020j2844A12403
$$ -26496 -75885 -83087 145612 192520 -32154 -15038 84788 147082 -101020 -113864 112403
15985B130a60896P4854E50723C2125M62895Q1552B28192o6763p2795I265M76550
$$ 2130 -160896 -86042 550723 32125 495020 576572 228192 161429 88634 9265 485815
15974D85815A24430a2958e719q1793D387J82812H2065e6376C09999a33756l87371
$$ 485815 124430 -12958 -5719 -87512 4387 187199 82065 -56376 309999 -133756 -521127
15963e21127A45034b1672C6348b82007A74683D9510g8043E6369g1173A94975g769
$$ -521127 145034 -21672 36348 -282007 174683 49510 -78043 56369 -71173 194975 -7769
15951C22083a71720K0329a4266A65531M4965b50875J18629J9498j17613C00036
$$ 322083 -171720 -151391 -14266 165531 210496 -250875 -132246 -112748 -230361 300036
15940b54653d2096D1364j2040b53571h9311J9691j89874G3642J6472a23165D3443
$$ -254653 -42096 41364 29324 -253571 -89311 -69620 -259494 73642 90114 -123165 43443
15928E9432J89299H9961h4328F590c7633n4094B43481D6071c7737H9839Q8395
$$ 59432 248731 89961 -84328 6590 -37633 -91727 243481 46071 -37737 89839 178234
15917A78234A8041h9983j39424K9411A01074a55059q2534B20886b21366O7823
$$ 178234 18041 -89983 -229407 -199996 101074 -155059 -237593 220886 -221366 -153543
15907a53543n418P3993j58579D8587b00563M4209c7760D13111I5106h4228c8857
$$ -153543 -158961 -84968 -243547 48587 -200563 -156354 -37760 413111 95106 -84228 -38857
15895b79086B52559b041A66933F9710e9922F4733b11907F2437N1804a13577A13563
$$ -279086 252559 -2041 166933 69710 -59922 64733 -211907 62437 114241 -113577 113563
15883c69203A45189g158j25161L9339B00219a59660C33682j45733b56289I8482
$$ -369203 145189 -7158 -132319 -92980 200219 -159660 333682 187949 -256289 98482
15872a70704k18054i9022A88664J38593j59853a0847m3954c920A4399N8815R2947
$$ -170704 -388758 -99022 188664 327257 167404 -10847 -54801 -3920 14399 73214 166161
15861A66161K2007B3957a21574J4475A12009A6182L9756c4904B88605F1941M8967
$$ 166161 188168 23957 -121574 -107099 112009 16182 55938 -34904 288605 61941 110908
15850A10908b40381g5940k8866a8115A01256J14130C6512i0638M3785C8615c2947
$$ 110908 -240381 -75940 -104806 -18115 101256 215386 36512 -90638 -46853 38615 -32947
15838A55358K3518n2643K05579a72632q9736e7947H7983b14105k91923A35203
$$ 155358 178876 126233 331812 -172632 -262368 -57947 87983 -214105 -506028 135203
15827a38757q5768P0496A73139h6449B58447b57862A99165h2207c440k02518e9867
$$ -138757 -224525 -154029 173139 -86449 258447 -257862 199165 -82207 -3440 -205958 -59867
15815e8152I7323a47817c917j46623C47244A1936c0328m5012J1812F6952j4682
$$ -58152 97323 -147817 -3917 -150540 347244 11936 -30328 -75340 -63528 66952 52270
15804E2270c49602a19791B76846r9149c61087A97989f2092I9377e72907A26012
$$ 52270 -349602 -119791 276846 177697 -361087 197989 -62092 99377 -572907 126012
15793f6109A06847A3314h4343j68232f4899A02068c71117A8496j799b9572k92011
$$ -66109 106847 13314 -84343 -252575 -64899 102068 -371117 18496 16697 -29572 -321583
15782c21583J03192I2888b36604j40101C22536B1475d9559k8974F7999F553a78842
$$ -321583 -218391 92888 -236604 -376705 322536 21475 -49559 -78533 67999 6553 -178842
15770B3865L8211b58184o0825N7257C06259b73464A6667c15616B39000i9657A71203
$$ 23865 62076 -258184 -319009 -261752 306259 -273464 16667 -315616 239000 -99657 171203
15758B90586b50989e3921K6818D11436A90724K23264A76874G1463C0771a89803
$$ 290586 -250989 -53921 -27103 411436 190724 413988 176874 71463 30771 -189803
15747I042K10192C0559d9004B45905o3955J46652o9085j02323i0917d2093j28174
$$ 9042 219234 30559 -49004 245905 181950 328602 259517 157194 -90917 -42093 -170267
15736a70267j54453R6443I7721e2257j75735A45672P3522h5722E0652a07796A3643
$$ -170267 -324720 -228277 97721 -52257 -227992 145672 219194 -85722 50652 -107796 13643
15724A1679a91646j70926O9510B28775A07275c19054e4640B1778a0035j13375
$$ 11679 -191646 -362572 -293062 228775 107275 -319054 -54640 21778 -10035 -123410
15714a23410B2563e2745l13029J13010A4951K35700a66022e1292k13750A42493
$$ -123410 22563 -52745 -365774 -252764 14951 250651 -166022 -51292 -265042 142493
15703A5694J12156j2600M1766D7225J22474a18821J9567D0202m215K07098q4959
$$ 15694 127850 115250 157016 47225 169699 -118821 -99254 40202 35987 243085 158126
15692A58126K18538a88970K9296a6836A61322n5925N6008e3251A39562n156b41103
$$ 158126 376664 -188970 -159674 -16836 161322 105397 161405 -53251 139562 134406 -241103
15680a72679b4584D891J45211n0658J06089b63932A00681b76908P2544A05657
$$ -172679 -24584 4891 150102 99444 205533 -263932 100681 -276908 -204364 105657
15669B04174H7465C968i8961B93152j34212M9950d5001A35790a66611m646K53
$$ 204174 87465 3968 -98961 293152 158940 208890 -45001 135790 -166611 -171257 -171004
15658a71004P5100k02103J7466A7823d95625B83982f6782A2709Q0641c2718A085
$$ -171004 -95904 -298007 -280541 17823 -495625 283982 -66782 12709 93350 -32718 1085
15646B2694J7640e6521G9543M5743a7030l82455Q3508K3541g5516I5904L6751
$$ 22694 40334 -56521 79543 125286 -17030 -399485 -315977 -292436 -75516 95904 132655
15635A32655a7617j2675k09516A44930B2520L12542c31070I4353c81214B3601
$$ 132655 -17617 -30292 -239808 144930 22520 335062 -331070 94353 -381214 23601
15624I6745a11135k866B33108C5669e8358n0193C5094b01603B35857L0182E5236
$$ 96745 -111135 -114001 233108 35669 -58358 -108551 35094 -201603 235857 266039 55236
15612C11835b78279A53416n7530b40057A22035m538N9048k0206d3663j8701j07358
$$ 311835 -278279 153416 95886 -240057 122035 117497 176545 156339 -43663 -62364 -169722
15601a69722d2267j90621k696Q1926a2194j92714K1131c1502r910m8626G4209
$$ -169722 -42267 -232888 -235584 -153658 -12194 -204908 -183777 -31502 -41412 -90038 74209
15589c78823i0474p3378B85099j04787b00629Q5416H9182l6564M3798a17431M480
$$ -378823 -90474 -163852 285099 180312 -200629 -115213 89182 52618 96416 -117431 -112951
15578a12951B70532a57484g5678n6747r1562D4963l783a03677p7623B9622J1285
$$ -112951 270532 -157484 -75678 -132425 -223987 44963 41180 -103677 -181300 29622 40907
15567D0907i6776j1432D3856b47628e4939B58127r7427D2983i991A02062J78172
$$ 40907 -96776 -108208 43856 -247628 -54939 258127 160700 42983 -9991 102062 280234
15556B80234D2211e4742B09160b77183E6938R8684N5763d3712G0203e2753j10370
$$ 280234 42211 -54742 209160 -277183 56938 155622 211385 -43712 70203 -52753 -163123
15545a63123N0035n1676f5141j2146A09691a36462I074a92353R1183q9067C86947
$$ -163123 -113088 -164764 -65141 -77287 109691 -136462 9074 -192353 -101170 -190237 386947
15533f8176j43331C549i2816j33255a2068C750a05320H0583b43276B7375h8508
$$ -68176 -211507 3549 -92816 -226071 -12068 3750 -105320 80583 -243276 27375 -88508
15521I814h4895A38198a00437j00342A003N1870h6571C68592F4890r832d28650
$$ 9814 -84895 138198 -100437 -200779 1003 52873 -86571 368592 64890 55058 -428650
15509e5011Q153q1468B55780b55347F153a51783c1722J1265A72764Q9942a25824
$$ -55011 -46858 -128326 255780 -255347 6153 -151783 -31722 -20457 172764 262706 -125824
15497B59772d19867f5320j67654A6424a71370A83646D3340c48591B06067d0706
$$ 259772 -419867 -65320 -232974 16424 -171370 183646 43340 -348591 206067 -40706
15486A26926j4460a46205j78441H7126K00145c5611j43256H1539J23465B5169
$$ 126926 112466 -146205 -324646 87126 287271 -35611 -178867 81539 205004 25169
15475A7642a6944B21884h4382G0661b40721A83822m0460H200K5980b65374d7390
$$ 17642 -16944 221884 -84382 70661 -240721 183822 143362 8200 34180 -265374 -47390
15463e531I0739C1782L5537c3429k42877A27176k4365J74789e5757k31444a01845
$$ -5531 90739 31782 67319 -33429 -276306 127176 102811 277600 -55757 -287201 -101845
15451H7513a95443A02100f6495A46566e8892o6028r483B09177a24351k7469q0351
$$ 87513 -195443 102100 -66495 146566 -58892 -124920 -134403 209177 -124351 -151820 -232171
15440b32171B48813D1574a86244r8465J27149I0829a39299F6997c6233k43360
$$ -232171 248813 41574 -186244 -284709 -157560 90829 -139299 66997 -36233 -279593
15430b79593C7238c31668A7512d09625C33832B9834a24491A8659J89819E8223
$$ -279593 37238 -331668 17512 -409625 333832 29834 -124491 18659 208478 58223
15419a849B94552b80413A07342a84796B40382L8574a94365e9611A31926l3611
$$ -1849 294552 -280413 107342 -184796 240382 278956 -194365 -59611 131926 98315
15409I8315a344B7478c73713B1289d0753n7044p790k87332A85141b56217h9731
$$ 98315 -1344 27478 -373713 21289 -40753 -97797 -105587 -392919 185141 -256217 -89731
15397A00829b1002j42959j45135N5290I0054R3261J97456g9412A08128D7187M6760
$$ 100829 -21002 -163961 -309096 -253806 90054 183315 380771 -79412 108128 47187 93947
15386I3947C2008R280K52902B1374K17973J43428a36822q1621m767h5388A98561
$$ 93947 32008 41288 294190 21374 239347 382775 -136822 -218443 -223210 -85388 198561
15374g4956A04738M1412a82438d6028B7267b64905A55263n7914a89820I46a66899
$$ -74956 104738 146150 -182438 -46028 27267 -264905 155263 97349 -189820 946 -166899
15362a57381k04685C81087A5157J8461K2614K0823A8361a4983j89396b5633j1227
$$ -157381 -362066 381087 15157 33618 56232 77055 18361 -14983 -204379 -25633 -36860
15351c6860A10573J19211a16391B90860a28221j26961A00292C641K1545J42790
$$ -36860 110573 229784 -116391 290860 -128221 -255182 100292 3641 25186 167976
15341A67976O7949a43625m39534A5848a98680B18836J36592A42694a70871J1380
$$ 167976 235925 -143625 -583159 15848 -198680 218836 355428 142694 -170871 -159491
15331a59491A49599b4374k28025C85203A48371h2623C9533J55690i2949j89038
$$ -159491 149599 -24374 -252399 385203 148371 -82623 39533 195223 -92949 -281987
15321b81987a14993M9874B52259c6618n0264J4849r6658K856e1835b4561B0450
$$ -281987 -114993 -65119 252259 -36618 -86882 -72033 -168691 -165835 -51835 -24561 20450
15309F280b24696A89511N961b6990r6139j15218C32811b51026a4830k2852B37976
$$ 6280 -224696 189511 195472 -26990 -123129 -238347 332811 -251026 -14830 -37682 237976
15297b01336A782P91027a05071l2503A72822e1633m8342A09295M9291e6560B12559
$$ -201336 1782 792809 -105071 -137574 172822 -51633 -99975 109295 158586 -56560 212559
15285h8997F4754a00329j02270j32270B09957a72627l4466C1777K14686b98562
$$ -88997 64754 -100329 -202599 -334869 209957 -172627 -207093 31777 246463 -298562
15274B73236A18374K69853A1847J2339c9305C90468a02242k84512d3446E26933
$$ 273236 118374 388227 11847 24186 -39305 390468 -102242 -386754 -43446 526933
15263c1114B85844j26943M04368B56437I9826Q0601e856A09978C9209J43055f1161
$$ -31114 285844 158901 563269 256437 99826 180427 -5856 109978 39209 182264 -61161
15251a9808A88970O54573J29060L41886j67248N1131K80035o92932C61655a91113
$$ -19808 188970 843543 972603 1314489 1147241 1198372 1478407 785475 361655 -191113
15240B1607N6122K08792J22185d0216r8506A91648L1139j0523c3518A94691J45669
$$ 21607 77729 286521 408706 -40216 -138722 191648 222787 212264 -33518 194691 340360
15229C40360Q0004A03805m2288Q6854C1454J65473a90248A16456e381A59007K61582
$$ 340360 420364 103805 61517 148371 31454 196927 -190248 116456 -5381 159007 420589
15218D20589k01215A1578K44447n1979J23922j25700r6449L7436j4132K59671
$$ 420589 219374 11578 256025 204046 327968 202268 105819 143255 129123 388794
15208C88794B1084J64917d17498C5507f5080H8225b9292B64484a35662A6693a8156
$$ 388794 21084 186001 -417498 35507 -65080 88225 -29292 264484 -135662 16693 -18156
15196c5484r749A18002i3581M1487j6722F2117a20728A51953k4202L8674P908
$$ -35484 -45233 118002 -93581 -52094 -68816 62117 -120728 151953 127751 166425 174333
15185A74333o1132K2298r490m0933K16663j27776D9484b67012B56805E2732f8095
$$ 174333 113201 135499 126009 85076 301739 173963 49484 -267012 256805 52732 -68095
15173A31548J42680E1715a89086G3072K75002d9556o7671a0039k2545B70667h7524
$$ 131548 274228 51715 -189086 73072 348074 -49556 -117227 -10039 -32584 270667 -87524
15161C28745D4062J39399q693b16658E1077b3553B962b46009A08292a12784C88596
$$ 328745 44062 183461 174768 -216658 51077 -23553 2962 -246009 108292 -112784 388596
15149A56803f498A41464a52522B8213R5499P8866D2401j1489b89522H8319k0401
$$ 156803 -6498 141464 -152522 28213 123712 202578 42401 30912 -289522 88319 67918
15138F7918J58408I3016b81397C88800A31483k7784B951a86709C46516J31584
$$ 67918 226326 93016 -281397 388800 131483 103699 2951 -186709 346516 478100
15128D78100a89690B02423a00159C5473O49873C5210M45658k07768a00745A36533
$$ 478100 -189690 202423 -100159 35473 685346 35210 480868 273100 -100745 136533
15117B61953n0944O0229H775P100J38148P4573B6096K30767h116C93803F4168
$$ 261953 211009 271238 8775 15875 154023 228596 26096 256863 -8116 393803 64168
15105H3119K58664j63943A3807R3576J09157f7540A84787m9296g4430B93831A13413
$$ 83119 341783 177840 13807 107383 216540 -67540 184787 135491 -74430 293831 113413
15093a34810M6174B7626g2743B64419J25401D2025J1667L3278O0723K89904j67144
$$ -134810 -88636 27626 -72743 264419 389820 42025 53692 86970 147693 437597 270453
15082B70453J58372j44240g689j9286C0168J40052A5856c946A10456J88729a87445
$$ 270453 428825 284585 -7689 -26975 30168 170220 15856 -3946 110456 299185 -187445
15070a11224j8363A64527r500J52801i5119B27591l0015J54293I5144L25732i0343
$$ -111224 -129587 164527 155027 307828 -95119 227591 197576 351869 95144 420876 -90343
15058F8072a03160A33318k4409j5166M6999a41375H1952J0129J19840r8928b37837
$$ 68072 -103160 133318 108909 93743 140742 -141375 81952 92081 211921 112993 -237837
15046A53969A5510N1649K78381A6823K19004g359E09170A65159J50118C2457a39522
$$ 153969 15510 67159 345540 16823 235827 -7359 509170 165159 315277 32457 -139522
15034A98168a30691F40041A46066L02753j98245A15918Q4339G8299K60739j1467
$$ 198168 -130691 640041 146066 448819 250574 115918 200257 78299 339038 327571
15024C27571D6902J12294L9949J18260K39508H6564J92628j28495j5396b13867
$$ 327571 46902 159196 199145 317405 556913 86564 279192 150697 135301 -213867
15013A04803P9892J70423e8300A04876K89351j60304o9401J04415a85984d054
$$ 104803 184695 355118 -58300 104876 394227 233923 164522 268937 -185984 -4054
15002C65852A82456B2897J90709B5541K66919F1385M37450B02278L92345F3065
$$ 365852 182456 22897 213606 25541 292460 61385 498835 202278 594623 63065
14991a2647l60595B70280G5346N2245K18039j14991R3577j10543O181M2217j20287
$$ -12647 -373242 270280 75346 127591 345630 230639 324216 213673 219854 262071 141784
14980A41784B0002a87175C00619J00379j61657o588J83758i1273D17369A09008
$$ 141784 20002 -187175 300619 400998 239341 232753 416511 -91273 417369 109008
14969F3475O5286Q0086K41004E9305N2718L32636m7024J85971B1924J26092K58839
$$ 63475 128761 208847 449851 59305 112023 444659 397635 583606 21924 148016 406855
14958D06855L2721J15116G9738J08595D5609L86496A32967J20911j25261J53644
$$ 406855 439576 554692 79738 188333 45609 432105 132967 253878 128617 282261
14948B82261D2026b5743A94777M52427A41148Q5536J46503A71081J5363N3347
$$ 282261 42026 -25743 194777 647204 141148 226684 373187 171081 186444 239791
14938B39791P1239Q0155p7782l2038R039Q0682J28963B34776o0255J79957K70697
$$ 239791 311030 391185 313403 281365 290404 371086 500049 234776 174521 354478 625175
14927F25175A32585K81428J58243B54666d1747C66407j15568A01541K73384r7300
$$ 625175 132585 414013 572256 254666 -41747 366407 250839 101541 374925 277625
14917B77625n84a5634B10352K24691k00398K1278J06106j63980L78583B44665
$$ 277625 277041 -15634 210352 435043 234645 255923 362029 198049 576632 244665
14906C54540o1191J53042B09610F9484K48015C8535M29244Q9930k04900j53847
$$ 354540 293349 446391 209610 69484 317499 38535 467779 557709 352809 198962
14896A98962K95433j02088o6403k2787K0436j3975A33980L76228o5356M1866m7367
$$ 198962 494395 392307 325904 303117 323553 309578 133980 510208 444852 486718 439351
14885D39351B3390M31185q9358C6625L14726j33534A5768K98045C7169N67542
$$ 439351 23390 454575 365217 36625 351351 217817 15768 313813 37169 604711
14875F04711C00894M07283o565j63446k24506J06083k5156F7834N22127B52079
$$ 604711 300894 708177 701612 538166 313660 419743 394587 67834 589961 252079
14864C93763l0731J2324N4263j16754I6788N35654B11099L20641M0714j40421
$$ 393763 363032 375356 429619 312865 96788 632442 211099 531740 572454 432033
14854D32033j75103P8967L46647C38057o0096J63426j39323M13815C13387l5570
$$ 432033 256930 335897 682544 338057 277961 441387 302064 715879 313387 277817
14844B77817L66109p4729k13209J20426J59047Q350A99116N24559j48035j87763
$$ 277817 643926 569197 355988 476414 635461 643811 199116 723675 575640 387877
14834C87877j28648M8897m1426K95421B59257J37944A76319N01365k13061A54067
$$ 387877 259229 308126 266700 562121 259257 397201 176319 677684 464623 154067
14823D94426A83064K21379Q0191q407K76934k63312m6349L4375q6393M45747F3450
$$ 494426 183064 404443 484634 476227 753161 489849 443500 477875 391482 837229 63450
14811F94275j02164o7591O1569j60522j20147J79163J3635K05849j40985l0436
$$ 694275 592111 524520 586089 425567 305420 484583 498218 704067 563082 532646
14801E32646j07938J0993q4589N13728D29437O9746K94228k78879J69965k05158
$$ 532646 424708 435701 351112 864840 429437 499183 793411 514532 684497 479339
14791D79339J97283j78921k44639L73431k79553M58271l1843q5349o6158K24624
$$ 479339 676622 497701 253062 626493 346940 805211 773368 688019 621861 846485
14781H46485l93912M01493l25826K25470j48573N8478k4106K15915j71381p664
$$ 846485 452573 854066 528240 753710 605137 663615 639509 855424 684043 676379
14771F76379q7728J47784q9127j3580j55926o0055j8031K98765k01245M05736
$$ 676379 588651 736435 647308 633728 477802 417747 399716 698481 497236 902972
14761I02972l28115K11878j30945K72831j93897k02824m4774M1301L78911k6781
$$ 902972 574857 786735 655790 928621 734724 531900 487126 528427 907338 880557
14751H80557j83188J7194j55928j60318J38767q502J3562A25624N80521P3591
$$ 880557 697369 714563 558635 398317 537084 528582 542144 125624 706145 779736
14741G79736N0328O8647A46319P94344l97893j5653J90588p8809B58771K97556
$$ 779736 830064 898711 146319 940663 542770 527117 717705 638896 258771 556327
14731E56327L19542l67848J84628N3364m7511R5618m7004J3568m4674J69291l31119
$$ 556327 875869 508021 692649 746013 698502 794120 747116 760684 716010 885301 554182
14720E54182N10892k21043J23981L3033j4995j45575q4314J2720j35313L00981
$$ 554182 1065074 844031 968012 1001045 986050 840475 756161 768881 633568 934549
14710I34549l10732M40659j34703j83307O5761q6074J06848J17536J04841m6870
$$ 934549 623817 1064476 929773 746466 812227 726153 833001 950537 1055378 1008508
14700A008508q6874J81929j72779j49090J17681n5336M29815l86848K49643k55357
$$ 1008508 921634 1103563 930784 781694 899375 844039 1273854 887006 1136649 881292
14690H81292K1471q7316K18025L64644E49978O19890K16966m30356L07418j77574
$$ 881292 902763 815447 1033472 1398116 549978 1169868 1386834 956478 1263896 1086322
14680A086322P9530r9648j3826k93930K19927l78389K63136J47011Q9052l7641
$$ 1086322 1165852 1066204 1052378 758448 978375 599986 863122 1010133 1099185 1061544
14670A061544J4420J16286p7676j61188O098p9209J53582L3343J80892J39206
$$ 1061544 1075964 1192250 1114574 953386 959484 880275 1033857 1067200 1248092 1387298
14660A387298l76937J60775K7574j63913J29493Q8013o5822j55188N8582K98058
$$ 1387298 1010361 1171136 1198710 1034797 1164290 1252303 1186481 1031293 1089875 1387933
14650A387933L0752j61796K3619R6112J68766l75665q2537M7661J14481o9826
$$ 1387933 1418685 1256889 1280508 1376620 1545386 1169721 1087184 1134845 1249326 1179500
14640A179500K49889l03294K084K83388l21626K45482j20825J6344R2223M1455
$$ 1179500 1429389 1126095 1128179 1411567 1089941 1335423 1214598 1230942 1323165 1364620
14630A364620j0609n7248K97786k08077M71090l21049r306k10414q5447L43381
$$ 1364620 1354011 1296763 1594549 1386472 1857562 1536513 1527207 1316793 1231346 1574727
14620A574727k85164K15789k0404J09506K72520l70273J35747l40233J43032q8338
$$ 1574727 1289563 1505352 1484948 1594454 1866974 1496701 1632448 1292215 1435247 1346909
14610A346909M92298k45378J0765q9775L48496k89243K98110m24223K45365j73868
$$ 1346909 1839207 1593829 1604594 1514819 1863315 1574072 1872182 1447959 1693324 1519456
14600A519456o0773K04422J18270M19387l59386P6474r3698L5090n7223O1823
$$ 1519456 1458683 1663105 1781375 2200762 1841376 1917850 1824152 1859242 1802019 1863842
14590A863842j07369K14395K5089O0402l2469k88435R3436K18577l69057K54016
$$ 1863842 1756473 1970868 1995957 2056359 2023890 1735455 1828891 2047468 1678411 1932427
14580A932427L92157j25874k51389P4685l7591J68356O6212K29280j34877J79418
$$ 1932427 2324584 2198710 1947321 2022006 1984415 2152771 2218983 2448263 2313386 2492804
14570B492804m64648R3649J17644L68992J05698l50515J56882N43208l34839j40904
$$ 2492804 2028156 2121805 2239449 2608441 2714139 2363624 2520506 3063714 2728875 2587971
14560B587971K8480O25215j53942J14554K82732j5131l2611L14634M76849N80652
$$ 2587971 2616451 3241666 3087724 3202278 3485010 3469879 3437268 3751902 4228751 4809403
14550D809403J101305J999354L651784P321403J5949639J4934039k3688772A2180684
$$ 4809403 5910708 7910062 11561846 18883249 34832888 49766927 26078155 12180684
14541E693327k416359m07270q05485m012j06949Q2671J25126k12460K33390J53796
$$ 5693327 3276968 2869698 2064213 2060201 1953252 2035923 2161049 1948589 2181979 2335775
14531B335775k78602J92882R6432l9841k8102M3896K55016j26280J34489n3226
$$ 2335775 2057173 2250055 2346487 2306646 2278544 2322440 2577456 2451176 2585665 2532439
14521B532439J21782j50191q0584k3634P077K26974K62219j71281k01794M34761
$$ 2532439 2654221 2504030 2423446 2399812 2406889 2633863 2896082 2724801 2523007 2957768
14511B957768o2051j25810L4874J09000O51279n32340j87506K85388k26285J80703
$$ 2957768 2895717 2769907 2804781 2913781 3565060 3032720 2845214 3130602 2904317 3085020
14501C085020J48852K00835q1753K23414k65741J96367J84923k8122j71050K65246
$$ 3085020 3233872 3434707 3352954 3576368 3310627 3506994 3691917 3663795 3492745 3757991
14491C757991p056J5955k19302k13409L27559M6640K79291k36143R6006K71103
$$ 3757991 3750935 3766890 3547588 3334179 3661738 3708378 3987669 3751526 3847532 4118635
14481D118635K77385m37366J45096k01925L91693P8037j52398j52788L21949J88826
$$ 4118635 4396020 3958654 4103750 3901825 4293518 4371555 4219157 4066369 4388318 4577144
14471D577144j03703k11507K70323K40897R5758l9852J88362O7943n68195K47657
$$ 4577144 4473441 4261934 4532257 4773154 4868912 4829060 5017422 5085365 4517170 4764827
14461D764827J40058J82680N66819o18120K08423O5871K05064j33886J82512k50194
$$ 4764827 4904885 5087565 5654384 5036264 5244687 5310558 5515622 5381736 5564248 5314054
14451E314054K97933k8289k52626N39333n58529L68907K42570K41338n6250K44792
$$ 5314054 5611987 5583698 5331072 5870405 5311876 5680783 5923353 6164691 6108441 6353233
14441F353233l59643L08941K51930J70225k73182R3142K24326K68951M1145J52354
$$ 6353233 5993590 6302531 6554461 6724686 6451504 6544646 6768972 7037923 7079068 7231422
14431G231422o14513M71140J15157J03385K12502j84985L36302L59233l24800
$$ 7231422 6616909 7088049 7203206 7306591 7519093 7334108 7670410 8029643 7704843
14422G704843L00895J76614q5522M70730j27922m0295M86385m37928O03311k63927
$$ 7704843 8005738 8182352 8096830 8567560 8439638 8399343 8885728 8447800 9051111 8787184
14412H787184O3749M20005P8743O4635K69864J63017J46159J56403o8031M51868
$$ 8787184 8850933 9270938 9349681 9414316 9684180 9847197 9993356 10149759 10081728 10533596
14402A0533596K896j2696L02238K23470L18593L11944J21872K74234M2510J44204
$$ 10533596 10536492 10523796 10826034 11049504 11368097 11680041 11801913 12076147 12118657 12262861
14392A2262861j06312O35864M764K66250L85703j49247O11009L05082K30864J02981
$$ 12262861 12156549 12792413 12797177 13063427 13449130 13299883 13910892 14215974 14446838 14549819
14382A4549819L64133K26250K570M49646J57026K23768P80675J73877K21676L89213
$$ 14549819 14913952 15140202 15142772 15592418 15749444 15973212 16753887 16927764 17149440 17538653
14372A7538653M05939L89807R1511M04123Q23424l9788M38737N17881M24507J23358
$$ 17538653 17944592 18334399 18425910 18830033 19653457 19613669 20052406 20570287 20994794 21118152
14362B1118152O70391P20921J54426M63066R57286O05620M32342M42131O97073
$$ 21118152 21788543 22509464 22663890 23126956 24084242 24689862 25122204 25564335 26261408
14353B6261408M83520Q19888M57830P92885K09282J062954Q13474J070856P47972
$$ 26261408 26744928 27564816 28022646 28815531 29024813 30087767 30901241 31972097 32720069
14344C2720069M49663J121523Q41617J020003O27066J351086Q73742Q25838J641624
$$ 32720069 33169732 34291255 35132872 36152875 36779941 38131027 39004769 39830607 41472231
14335D1472231Q45790J245650J487527J434771J213903J549404J898525J435892
$$ 41472231 42318021 43563671 45051198 46485969 47699872 49249276 51147801 52583693
14327E2583693J793709J552324K191819J427391K335650J975434K202651K445568
$$ 52583693 54377402 55929726 58121545 59548936 61884586 63860020 66062671 68508239
14319F8508239K275538K910529K817909K549903K957598L310918L223762L595024
$$ 68508239 70783777 73694306 76512215 79062118 82019716 85330634 88554396 92149420
14311I2149420L803853L990019L886114M625636M517711M871064N354303N130861
$$ 92149420 95953273 99943292 103829406 108455042 112972753 117843817 123198120 128328981
14303A28328981N884361O078257O460671O940645P204636P571818Q358536Q872099
$$ 128328981 134213342 140291599 146752270 153692915 160897551 168469369 176827905 185700004
14295A85700004Q839818R185741J0443869J0506883J1329293J2070466J2282187
$$ 185700004 194539822 203725563 214169432 224676315 236005608 248076074 260358261
14288B60358261J2983817J3680253J3763155J4690246J4530774J5208029J5022129
$$ 260358261 273342078 287022331 300785486 315475732 330006506 345214535 360236664
14281C60236664J5402931J5107897J4738644J4485850J2957790J2330764J0323554
$$ 360236664 375639595 390747492 405486136 419971986 432929776 445260540 455584094
14274D55584094P063724L816027K213638N76443P29067N44961o765758k833293
$$ 455584094 462647818 466463845 468677483 469253926 469982993 470527954 463762196 460928903
14266D60928903m379016q109265j0284674j1924710j3031939j4356178j5551752
$$ 460928903 456549887 448440622 438155948 426231238 413199299 398843121 383291369
14259C83291369j5806154j6446179j5680398j5469449j4753907j4558750j4287979
$$ 383291369 367485215 351039036 335358638 319889189 305135282 290576532 276288553
14252B76288553j3620553j2911543j2555478j1106712j1230323j0655011j0150432
$$ 276288553 262668000 249756457 237200979 226094267 214863944 204208933 194058501
14245A94058501r319735q387334q443290p744913p485706p230765o396184o176393
$$ 194058501 184738766 176351432 167908142 160163229 152677523 145446758 139050574 132874181
14237A32874181n353423n456104n350407n324539m371882m379997l279055m100677
$$ 132874181 127520758 122064654 116714247 111389708 107017826 102637829 99358774 95258097
14229I5258097l725393l970828l216615l347711k638248k671923k984351k572926
$$ 95258097 91532704 87561876 84345261 80997550 78359302 75687379 72703028 70130102
14221G0130102j960461k378422k271103k198056k244118j787801j808854j261273
$$ 70130102 68169641 65791219 63520116 61322060 59077942 57290141 55481287 54220014
14213E4220014j698967j727589j858668j242904j464273j118061r92013j247398
$$ 54220014 52521047 50793458 48934790 47691886 46227613 45109552 44117539 42870141
14205D2870141j272335j180450j529411m97974r10102j230134j008154r38205
$$ 42870141 41597806 40417356 38887945 38389971 37479869 36249735 35241581 34303376
14197C4303376m80053j248886o69178l70723p60947r59751j157879m72682p85820
$$ 34303376 33823323 32574437 31905259 31534536 30773589 29813838 28655959 28183277 27397457
14188B7397457n65904o57632o97310l81222n02722n13925o13570p55612l10655
$$ 27397457 26831553 26173921 25476611 25095389 24592667 24078742 23465172 22709560 22398905
14179B2398905j26764p12695k59768n85511n70768j82984o57108l27910j83526
$$ 22398905 22272141 21559446 21299678 20714167 20143399 19960415 19303307 18975397 18791871
14170A8791871o80721l07403m54233j76755M5437m34306m89282m33250N523m31968
$$ 18791871 18111150 17803747 17349514 17172759 17218196 16783890 16294608 15861358 15866881 15434913
14160A5434913l5737l73503k72473l62902j50454j51764j37459l98254l2525n91776
$$ 15434913 15399176 15025673 14753200 14390298 14239844 14088080 13950621 13552367 13519842 12928066
14150A2928066j15545k67049m0698n0518k34666k60641l23785j4630j10611k86066
$$ 12928066 12812521 12545472 12504774 12454256 12219590 11958949 11635164 11620534 11509923 11223857
14140A1223857o23954L05472k98020J73746l26695o761n31958J12199j76911J0567
$$ 11223857 10599903 10905375 10607355 10781101 10454406 10447645 9915687 10027886 9850975 9861542
14130I861542k99049k66151J1416m72021K90197l41227J54656l69292j27932O1
$$ 9861542 9562493 9296342 9307758 8835737 9125934 8784707 8939363 8570071 8442139 8442200
14120H442200o0002J4979m31801N2964q4242k60906j23252K99776o4181j08446
$$ 8442200 8382198 8397177 7965376 8018340 7934098 7673192 7549940 7849716 7785535 7677089
14110G677089m57849o4715Q9941k89732k08032J68213P6006n94815j66780L71057
$$ 7677089 7219240 7154525 7244466 6954734 6746702 6914915 6990921 6396106 6229326 6600383
14100F600383l36287m5437q1456J90189r001j38805n0822k38416j42167K39950
$$ 6600383 6264096 6218659 6137203 6327392 6318391 6179586 6128764 5890348 5748181 5988131
14090E988131q9482q5892r9115N594m68607Q5601O9649K90467k96340J034k55679
$$ 5988131 5898649 5812757 5713642 5719236 5250629 5336230 5405879 5696346 5400006 5401040 5145361
14079E145361l32104K56973K18432m42229j82840J23488K02395l17793J12102
$$ 5145361 4813257 5070230 5288662 4846433 4663593 4787081 4989476 4671683 4783785
14070D783785q6866j18938P9186k36700M44516l24598j09365j33262j59384M53052
$$ 4783785 4696919 4577981 4657167 4420467 4864983 4540385 4431020 4297758 4138374 4591426
14060D591426m22336L63107l09628j26548k91506O24604l43273k67622l3984l2173
$$ 4591426 4169090 4532197 4222569 4096021 3804515 4429119 4085846 3818224 3784240 3752067
14050C752067K55786m50426J09893J41312j81473k52589N8984L05446j3701k44811
$$ 3752067 4007853 3557427 3667320 3808632 3627159 3374570 3433554 3739000 3725299 3480488
14040C480488k41564K47654j77308k01956n9352j21195N04678k75648j33473K79239
$$ 3480488 3238924 3486578 3309270 3107314 3047962 2926767 3431445 3155797 3022324 3301563
14030C301563j04129j12603J90605k31100j77734K67765P6490k20417j15965J08724
$$ 3301563 3197434 3084831 3275436 3044336 2866602 3134367 3210857 2990440 2874475 2983199
14020B983199j82780K52348m80884K15200j90238J523J56144r8892q2654K50700
$$ 2983199 2800419 3052767 2571883 2787083 2596845 2598368 2754512 2655620 2572966 2823666
14010B823666n14058P1093P9052J35888k42522J28917j84970l7144j13300J63739
$$ 2823666 2309608 2380701 2459753 2595641 2353119 2482036 2297066 2259922 2146622 2310361
14000B310361m15252N02683m1205j44611l53750J37369Q6007K08167L10938P3666
$$ 2310361 1895109 2397792 2356587 2211976 1858226 1995595 2081602 2289769 2600707 2674373
13990B674373K13409J253683K231225O081427J4370377K2494059j9493791j2931561
$$ 2674373 2887782 4141465 6372690 12454117 26824494 49318553 29824762 16893201
13982A6893201p004587l181859j378699j180620k61324k97791m48453K82046o28672
$$ 16893201 9888614 6706755 5328056 4147436 3886112 3588321 3139868 3421914 2793242
13973B793242N1167K22032j78593j16052k38137j09826K13499k15596j81164j10014
$$ 2793242 2844409 3066441 2887848 2771796 2533659 2423833 2637332 2421736 2240572 2130558
13963B130558M22853r1922o7224R3199o63896M87410k92240N2838K92170k61117
$$ 2130558 2553411 2461489 2394265 2487464 1823568 2310978 2018738 2071576 2363746 2102629
13953B102629j48701l5908K98078m0311j35259K7704Q8105l14467K38731J6676
$$ 2102629 1953928 1918020 2216098 2175787 2040528 2068232 2156337 1841870 2080601 2097277
13943B097277N5125n34476L60547O9861k78974P3007J3613M1653J64590j90494
$$ 2097277 2152402 1617926 1978473 2048334 1769360 1842367 1855980 1897633 2062223 1871729
13933A871729k42792J62860j0j9229n8288j85660J9309R4606k7175k95768K06178
$$ 1871729 1628937 1791797 1791787 1772558 1714270 1528610 1547919 1642525 1615350 1319582 1525760
13922A525760l60437P2961N25861o2381j78297J77933j83235j34943r56J78548
$$ 1525760 1165323 1238284 1764145 1701764 1523467 1701400 1518165 1383222 1382266 1560814
13912A560814k7280K7779J58768k96472n2753J43572R5015j06743J33175N6716
$$ 1560814 1533534 1561313 1720081 1423609 1370856 1514428 1609443 1502700 1635875 1692591
13902A692591j72507J26932k77051Q0352l5696J16666j92563p8615J91085m30518
$$ 1692591 1520084 1647016 1369965 1450317 1414621 1531287 1338724 1260109 1451194 1020676
13892A020676N88426k36655l12925K41129o7358K14574J78397k97653k89278K57832
$$ 1020676 1609102 1372447 1059522 1300651 1233293 1447867 1626264 1328611 1039333 1297165
13882A297165J03288p2399k44547j41635N76254m60264M70259j12745k05829o5684
$$ 1297165 1400453 1328054 1083507 941872 1518126 1057862 1528121 1415376 1209547 1143863
13872A143863J2698q1975J69996j39247L350K19905j27804k50648j08328K93038
$$ 1143863 1156561 1074586 1244582 1105335 1108685 1328590 1200786 950138 841810 1134848
13862A134848Q1005J6318J08989n18474M84334K3203Q9235m32763L41386k53776
$$ 1134848 1215853 1232171 1341160 822686 1307020 1330223 1419458 986695 1328081 1074305
13852A074305J8368j86505K80370L00780n35041K11092J05309L206J9292l31359
$$ 1074305 1092673 906168 1186538 1487318 952277 1163369 1268678 1271884 1291176 959817
13842I59817M3398M51143m66582K05041j25815l73206J30550L96824j23008K5358
$$ 959817 1003215 1454358 987776 1192817 1067002 693796 824346 1221170 1098162 1123520
13832A123520m3255l62646N63912l98510L9595r9196j20336o3826L26893k66840
$$ 1123520 1080265 717619 1281531 883021 922616 823420 703084 639258 966151 699311
13822F99311N32664l32039j00143N51944m69071J37261K53752n93311K79872j23194
$$ 699311 1231975 899936 799793 1351737 882666 1019927 1273679 680368 960240 837046
13812H37046j73924o8170K30079m1547N51640j97098J5030j79288J08980j61113
$$ 837046 663122 594952 825031 783484 1335124 1138026 1153056 973768 1082748 921635
13802I21635J15110j61405j02777J79704j11777L6243j19593J14980N5558R4462
$$ 921635 1036745 875340 772563 952267 840490 876733 757140 872120 927678 1022140
13792A022140l71434O9984N3198o6122K01010M8945J20023k07337J57796k25942
$$ 1022140 650706 720690 773888 707766 908776 957721 1077744 870407 1028203 802261
13782H02261k3631k49244O2562J19695J2319L94301m3486l62397O7668p556j69282
$$ 802261 778630 529386 591948 711643 723962 1118263 1074777 712380 780048 772492 603210
13771F03210m7401K56824j27576P0354L558Q3990B10572P83815l85100Q4291J49906
$$ 603210 555809 812633 685057 755411 758969 842959 210572 994387 609287 693578 843484
13760H43484R5456l399m39879K70836L51644n21320L37901k23411J94119l99094
$$ 843484 938940 935541 495662 766498 1118142 596822 934723 711312 905431 506337
13750E06337K19073r7593M2275K47996k37810N6018k47110J19263J42261p6206
$$ 506337 725410 627817 670092 918088 680278 736296 489186 608449 750710 674504
13740F74504J33079j20627K4286K29590k87025j86076k5540K80444l03456J29023
$$ 674504 807583 686956 711242 940832 653807 467731 442191 722635 419179 548202
13730E48202M9681r0038J72434q2534j74412M33596K1345k45245L18392B70029
$$ 548202 597883 507845 680279 597745 423333 856929 878274 633029 951421 270029
13719F66069m8118p8751q5171J41353J87918k31017J19706K13867j33524L9674
$$ 666069 617951 539200 454029 595382 783300 552283 671989 885856 752332 792006
13709G92006l27117K49927k16345q3926m1122K87352k34648J85959k43056K35893
$$ 792006 464889 714816 498471 414545 373423 660775 426127 612086 369030 604923
13699F04923A14325M18938j16839M44906l71254K6966l6033K38678m8936B97980
$$ 604923 114325 533263 416424 861330 490076 517042 481009 719687 670751 297980
13688G40033j96598A37031M17982K2466J66605l24288N3102K17195k43663J76620
$$ 740033 543435 137031 555013 577479 744084 419796 472898 690093 446430 623050
13678F23050j84464K36A60171K63922j57835M36995j44792J71918l18583j9703
$$ 623050 438586 438822 160171 424093 266258 703253 558461 730379 411796 392093
13668C92093K43931j93753K09026k12445J51777J331k00664P4088L7304m484l7147
$$ 392093 636024 442271 651297 438852 590629 591960 391296 465384 502688 498204 461057
13657D61057J32717n5632r121j07992j21727J17742J70643q4980j83280k1213
$$ 461057 593774 538142 529021 421029 299302 417044 587687 502707 319427 298214
13647B98214J68349J09694k88059K04666j9385H2338M32694o5193K0626K01541
$$ 298214 466563 576257 288198 492864 473479 82338 515032 449839 470465 672006
13637F72006B94092l593A31942K48150A87243L12696A93752L23033A32614L39123
$$ 672006 294092 290499 131942 380092 187243 499939 193752 516785 132614 471737
13627D71737L03047k72216k19054J62373J43213k90639K43636A98491M34903k08323
$$ 471737 774784 502568 283514 445887 589100 298461 542097 198491 633394 425071
13617D25071j60060D9436M47529K14549j71094j88675J95203j14310p9669j36634
$$ 425071 265011 49436 496965 711514 540420 351745 546948 432638 352969 216335
13607B16335p3549K44427k6435H6514K12677N9779K76347C04531M63641B48147
$$ 216335 142786 387213 360778 86514 299191 358970 635317 304531 768172 248147
13596B10702J93102j49610r142j2733n541J73675J28128k06062j04250K170J05944
$$ 210702 403804 254194 245052 232319 226778 400453 528581 322519 218269 220439 326383
13585C26383K91727A93435J98839K4766J63489j45151b63836A55792J26685H9933
$$ 326383 618110 193435 392274 417040 580529 435378 -263836 155792 282477 89933
13574E35254A60715J01272N40653k44250k55765l3241A23130J07973Q1738n2272
$$ 535254 160715 261987 802640 558390 302625 269384 123130 231103 312841 260569
13564B60569p2227J46710Q6862A75185J1208q241L62030J0692k40931F7676J41481
$$ 260569 188342 335052 421914 175185 186393 178152 540182 550874 309943 67676 209157
13553B09157o9672j636R1902K52867j6053o7996A20274J21854N76245j62524r1074
$$ 209157 139485 137849 229751 482618 466565 398569 120274 242128 818373 655849 564775
13542E64775A29045o2079J39360P9711J05757j2506p7179L38443j73169r9159
$$ 564775 129045 66966 206326 286037 391794 379288 302109 640552 467383 368224
13532C68224j64026p965L13201O9550j29268m7583K4715k08349K76852K6651n1615
$$ 368224 204198 196233 509434 578984 449716 402133 426848 218499 495351 522002 470387
13521D70387P145J037n9368D2569K60860b5221A90458J9593K80990k5913P4692
$$ 470387 477532 478569 419201 42569 303429 -25221 190458 210051 491041 465128 539820
13510E39820A49390J39775A16108M39328k50919q0625q7525K18423j04366m0866
$$ 539820 149390 289165 116108 555436 304517 223892 136367 354790 250424 209558
13500B09558J2897N4616L36580B27368K43688I9323J9678K7024J4050K95890B00747
$$ 209558 222455 277071 613651 227368 471056 99323 119001 146025 160075 455965 200747
13488E5326K51985A24900Q2702e3624C33311n3498n8933Q7260j06122Q5476J5202
$$ 55326 307311 124900 207602 -53624 333311 279813 220880 308140 202018 287494 302696
13477C02696R5043J2338A45009D8735N37834k54664k9275m7894L3112m5412J1042
$$ 302696 397739 410077 145009 48735 586569 331905 302630 254736 287848 242436 253478
13466B53478E912K60519A8705a11892C35138q645q6201j6737q3162J97224P6184
$$ 253478 5912 266431 18705 -111892 335138 326493 240292 223555 140393 337617 413801
13455D13801q9495I7225K08745Q4266A10825Q8215N1806j17262K61935r8333A48024
$$ 413801 324306 97225 305970 390236 110825 199040 250846 133584 395519 297186 148024
13443C00309j09816P3671K9594J27038J73589B18827a29305C65017J19058B7095
$$ 300309 190493 264164 293758 420796 594385 218827 -129305 365017 484075 27095
13432A34327J02364d2551m2545F9668J35210k1345K75018r6545L47115l49456
$$ 134327 236691 -42551 -85096 69668 204878 183533 458551 362006 709121 359665
13422C59665A2477h6569D85145p569j75953K7478j02867j08192L74137k03101
$$ 359665 12477 -86569 485145 477576 301623 329101 226234 118042 492179 289078
13412B89078J30042B08644E6990K78442J8047A58676a1415B29717O003N7206K85255
$$ 289078 419120 208644 56990 335432 353479 158676 -11415 229717 235720 292926 578181
13401E78181A40843J85881j34050B3779K38836p2380P6047K12338e6824A5438
$$ 578181 140843 326724 192674 23779 262615 190235 266282 478620 -56824 15438
13390G6442K50476G4781L84042o770H2712c92511A31793O9836p5426O1307k2565
$$ 76442 326918 74781 458823 452053 82712 -392511 131793 201629 126203 187510 164945
13379A64945J93024M49597C40459A14297L13415E5818J62276L1125A08479J00127
$$ 164945 357969 807566 340459 114297 427712 55818 218094 249219 108479 208606
13369B08606C0015K14874B3972M81272F1659M12729A02307O8212o3313A0847L05089
$$ 208606 30015 244889 23972 505244 61659 474388 102307 170519 107206 10847 315936
13358C15936j32866K07079b3669A52548K64465c62630G5058J71427L00591j87458
$$ 315936 183070 390149 -23669 152548 417013 -362630 75058 246485 547076 359618
13348C59618j18260J8481K87838j71935j67125J42429j22735B7793K40831J64377
$$ 359618 241358 259839 547677 375742 208617 351046 228311 27793 268624 433001
13338D33001B06154K33519D845L14591A56443n013L12076j99230H046O6265L41643
$$ 433001 206154 439673 4845 319436 156443 151430 463506 264276 8046 74311 415954
13327D15954j50589h5004B06043P4473J07524j34535L49205k06594a2195D65401
$$ 415954 265365 -85004 206043 280516 388040 253505 602710 396116 -12195 465401
13316D29204p8992o0856A36266n6490K6504Q403E366J18385M9856o0759h942F6349
$$ 429204 350212 289356 136266 79776 106280 114683 5366 123751 173607 112848 -8942 66349
13303G4554R0204O2225K52873j89110g3959j35240a4092B84832A08447q852B684
$$ 74554 164758 226983 479856 290746 -73959 -209199 -14092 284832 108447 99595 2684
13291B37990K84868I1476K35714A7578J9858J10227Q9078j12980P635O151K39807
$$ 237990 522858 91476 327190 17578 37436 147663 236741 123761 131396 137547 377354
13280C77354j01058a00936o6987A41402l3699M2088Q7713I531J1431J85119N9178
$$ 377354 276296 -100936 -167923 141402 107703 149791 237504 9531 20962 206081 265259
13269B65259A3740Q2128K37032A0393J15927n517Q7618a17164e4635j28702B76726
$$ 265259 13740 95868 332900 10393 126320 120803 208421 -117164 -54635 -183337 276726
13257b73267B13863D4655K32751p1173f1902A37701K38093j86652C860J35690
$$ -273267 213863 44655 277406 206233 -61902 137701 375794 189142 3860 139550
13247A39550J66629j28988a54966D03543i6152B34995H0758P3546G5292K52209
$$ 139550 306179 177191 -154966 403543 -96152 234995 80758 154304 75292 327501
13237C27501M532i4052C89218A73951J32947j52818a59799B96911d0502B0547
$$ 327501 332033 -94052 389218 173951 306898 154080 -159799 296911 -40502 20547
13226A94096i2808J0841K5525H0362J70439d1954B40263G0765L2928K63540c87307
$$ 194096 -92808 -81967 -56442 80362 250801 -41954 240263 70765 103693 367233 -387307
13214A72133c8812C52395q0858H2029O6451J20994o7177A1787L31985A557h673
$$ 172133 -38812 352395 271537 82029 148480 269474 202297 11787 343772 1557 -8673
13202b31689D2489a03828H8327Q3086a68671G2540L24291P499B9658P4647K3439
$$ -231689 42489 -103828 88327 171413 -168671 72540 396831 404330 29658 104305 127744
13191A27744a40434C57023G9276M60175A06835J924B5649L05556A46459B9272
$$ 127744 -140434 357023 79276 539451 106835 108759 25649 331205 146459 29272
13180a19871B67799a75842c6176A99473q0091c9997k2185B12721b93551a1790
$$ -119871 267799 -175842 -36176 199473 119382 -39997 -62182 212721 -293551 -11790
13169a17459A85948G3282f8296k94441D5438b54291B1506i4416F4944a1423k12379
$$ -117459 185948 73282 -68296 -362737 45438 -254291 21506 -94416 64944 -11423 -223802
13158b23802A88266K3464a2321n9109A49849o6045a23248G8092Q8634D4481k0488
$$ -223802 188266 211730 -12321 -71430 149849 83804 -123248 78092 166726 44481 23993
13147B3993J68653F5140b24409c2950C86203d5619j32367B41717j01141J72054
$$ 23993 192646 65140 -224409 -32950 386203 -45619 -177986 241717 140576 312630
13137C12630c3667B79961F4917e5676B17022j7198d2810C74469I8236D5295Q3242
$$ 312630 -33667 279961 64917 -55676 217022 199824 -42810 374469 98236 45295 128537
13126A28537Q1595a98898p3048A54002L4938G1980a04320A98926b74279d5021
$$ 128537 210132 -198898 -271946 154002 188940 71980 -104320 198926 -274279 -45021
13115A96405h0651J3965B71366H4710F401d9852F8407k2813m787K67333I8151
$$ 196405 -80651 -66686 271366 84710 6401 -49852 68407 45594 40807 308140 98151
13103D3536J51644C7040F424M27169a83279A39652A9584M7973a6636A35646Q9695
$$ 43536 195180 37040 6424 433593 -183279 139652 19584 67557 -16636 135646 225341
13092B25341r0902b08887A8115K23505q7703K41568c8844A86250f5725B26125
$$ 225341 134439 -208887 18115 241620 153917 395485 -38844 186250 -65725 226125
13081I1458J88781H0442A4308c4764B05522r9092C3175p45J34818C1816K12202
$$ 91458 280239 80442 14308 -34764 205522 106430 33175 32430 167248 31816 244018
13070B44018L10357a4432j55926A29902J66843R8625G3710g2140K0614E7311O1288
$$ 244018 554375 -14432 -170358 129902 296745 395370 73710 -72140 -51526 57311 118599
13059A18599c2967H8907J00194b01665g61m4720b86A53854J49857a21898B31098
$$ 118599 -32967 88907 189101 -201665 -761 -45481 -286 153854 303711 -121898 231098
13047D03722j78463K98230A0813P9952R4403Q997E8175J14211c2738B16677F3589
$$ 403722 225259 523489 10813 90765 185168 194165 58175 172386 -32738 216677 63589
13035e4224H0120k4518f3364I2717P9486J30314B4413b87189M0869B31292J33246
$$ -54224 80120 55602 -63364 92717 172203 302517 24413 -287189 -246320 231292 364538
13024C64538n6141j03853O7298d3702B52016Q1736e1098D33283E3599c7928B30457
$$ 364538 308397 204544 271842 -43702 252016 333752 -51098 433283 53599 -37928 230457
13012B06255F2418o102J35226D9094B2819L3303L92663a59481A96978J18616j26039
$$ 206255 62418 56316 191542 49094 22819 56122 448785 -159481 196978 315594 189555
13001A89555r358n0272o1311J37062l6831J34024a06667D8747K79715E2287L12790
$$ 189555 180197 129925 68614 205676 168845 302869 -106667 48747 328462 52287 365077
12990C65077A9204e0210M043A32006J08264R7777o8355H0968J86009A22504d9236
$$ 365077 19204 -50210 -46167 132006 240270 338047 269692 80968 266977 122504 -49236
12978h3972A12765N6101a73521H0773i7907c3816o0387j00508Q1589k3860B07272
$$ -83972 112765 168866 -173521 80773 -97907 -33816 -94203 -194711 -113122 -136982 207272
12966b2630q0915A77551J55642A53158K8814F8485A2958J39006A9994f5273k7093
$$ -22630 -103545 177551 333193 153158 181972 68485 12958 151964 19994 -65273 -92366
12955i2366B98921a29341b552k61129h9277c6326A1412R716L07059A17157F547
$$ -92366 298921 -129341 -2552 -263681 -89277 -36326 11412 21128 328187 117157 6547
12943D8104a57367A94659l6999j9051b35626d9132A47137L8224f4789B15066M9082
$$ 48104 -157367 194659 157660 138609 -235626 -49132 147137 185361 -64789 215066 264148
12932B64148a37319A76476o5228a83584a8438o8827A48069J06775r4546E9098
$$ 264148 -137319 176476 111248 -183584 -18438 -87265 148069 254844 160298 59098
12921F9856a127A9196b31155N4370F5439b0053j00228j64424A7581J81842a85235
$$ 69856 -1127 19196 -231155 -176785 65439 -20053 -120281 -284705 17581 199423 -185235
12909A28968b39623A7707a12665k25287b7275C15564A26833J15997P8456C8743
$$ 128968 -239623 17707 -112665 -337952 -27275 315564 126833 242830 321286 38743
12898A96076b26724A32472i7398q0779k6223C95472A73357b0653H1941N1761c8648
$$ 196076 -226724 132472 -97398 -178177 -204400 395472 173357 -20653 81941 133702 -38648
12886g1926A98641G5664J4398K32802L1621h4150j85536J00965E346e3564k91100
$$ -71926 198641 75664 90062 322864 354485 -84150 -269686 -168721 5346 -53564 -344664
12875c44664B84001j3779J26629A2280O6755K0272m6142a19531A20743a0198d311
$$ -344664 284001 270222 396851 12280 79035 99307 53165 -119531 120743 -10198 -4311
12863d5461I6968a1062q0114o2119A5738e6063H8642b69146f9081h606E6577a5738
$$ -45461 96968 -11062 -91176 -153295 15738 -56063 88642 -269146 -69081 -8606 56577 -15738
12850a14383B17978b57688B7747b29894D8813K68024b7182l4325I0284c4046k5850
$$ -114383 217978 -257688 27747 -229894 48813 316837 -27182 -61507 90284 -34046 -59896
12839e9896b9453l7009D32193A8922P899b05921C45144a99063B52415G9516J84372
$$ -59896 -29453 -66462 432193 18922 26821 -205921 345144 -199063 252415 79516 263888
12828B63888A18152g8605I2899J64946B4253b81077q7854A05804i9020b4374F623
$$ 263888 118152 -78605 92899 257845 24253 -281077 -368931 105804 -99020 -24374 6623
12816b40289B65825A18623i1868F4873p294N2336b5600C44344c51775O3128g53
$$ -240289 265825 118623 -91868 64873 57579 109915 -25600 344344 -351775 -288647 -753
12804F0943A5796K08787L2017f2233q171A78800n5316i3118P572A77474n6601
$$ 60943 15796 224583 256600 -62233 -70404 178800 123484 -93118 -85546 177474 120873
12793A20873n7801a33054N1840K6618B18677f3540B70777A27218b31738C41014
$$ 120873 63072 -133054 -81214 -54596 218677 -63540 270777 127218 -231738 341014
12782A88206b2918B57259i4125B79074E7557J38889b0381H6249b3978C77496A68741
$$ 188206 -22918 257259 -94125 279074 57557 196446 -20381 86249 -23978 377496 168741
12770a37251D00880G5673K14942A02217h192G0209J6542c9783N915q0008B09405
$$ -137251 400880 75673 290615 102217 -8192 70209 86751 -39783 -33868 -113876 209405
12758i724D00590a37799L3560f472A02345g9380A01031N1566J42896r1651A131
$$ -9724 400590 -137799 -104239 -6472 102345 -79380 101031 152597 295493 203842 1131
12746F1039h8798D3120J40815K539f9845A9506J94604a01380j45354E16196A35964
$$ 61039 -88798 43120 183935 186474 -69845 19506 214110 -101380 -246734 516196 135964
12734d7331A50329d29825D19491H319N4778a9879B5373K48973e29003B63804G9210
$$ -47331 150329 -429825 419491 8319 63097 -19879 25373 274346 -529003 263804 79210
12722B34878A10535k234m671m7328j2887J65016B6030a6804j16038p0610A06086
$$ 234878 110535 108301 103630 56302 43415 208431 26030 -16804 -132842 -203452 106086
12710D46216H9261K40797H8816A7707R5921L98534B50909j525J57217N5798r9176
$$ 446216 89261 330058 88816 17707 113628 512162 250909 249384 406601 462399 363223
12699C63223a70044A32315R5088A5299J99124k1477a58976D76054D0511F678b12812
$$ 363223 -170044 132315 227403 15299 214423 192946 -158976 476054 40511 6678 -212812
12687b35790k2904D38399c24287J18201A45359J09739a27418G7123J29048K729
$$ -235790 -258694 438399 -324287 -206086 145359 255098 -127418 77123 206171 208900
12677B08900p3943K78897J35823k70239j12458m5939d24875A25120K87518E7582
$$ 208900 134957 413854 549677 279438 166980 121041 -424875 125120 412638 57582
12666A89413a19326I6296J4282h3644o7908I4730g3042A13843C0423R9374a59270
$$ 189413 -119326 96296 110578 -83644 -151552 94730 -73042 113843 30423 129797 -159270
12654A69999P3960N9870C083M3178K09989A19973b8512l9688B72093d06543a5613
$$ 169999 243959 303829 3083 46261 256250 119973 -28512 -68200 272093 -406543 -15613
12642B70231b5898q0647l1252D6972J50719a25703b0501o8743D6009K02388a18520
$$ 270231 -25898 -106545 -137797 46972 197691 -125703 -20501 -89244 46009 248397 -118520
12630i7394A3686b29685B87431a89830C48420j69316B3057a3962A76888H0281
$$ -97394 13686 -229685 287431 -189830 348420 179104 23057 -13962 176888 80281
12619A63076R9521A30953A58R4912l6945N1635D3066j8891J9491J24662C7428
$$ 163076 262597 130953 158 95070 58125 109760 43066 24175 43666 168328 37428
12607c07711a0000m4661A22455a95472A53489J07264c5118C24156j14053n3020
$$ -307711 -10000 -54661 122455 -195472 153489 260753 -35118 324156 210103 157083
12597A57083C6894J67826L36665k55435b02553C67807A63677m3808A3764i9232
$$ 157083 36894 204720 541385 285950 -202553 367807 163677 119869 13764 -99232
12586B3961F035d2108A34728J77560h2816E9562J68242I788J24144a27619N817
$$ 23961 6035 -42108 134728 312288 -82816 59562 227804 9788 133932 -127619 -121802
12575a21802G0332n728J06805M9399a32515j76200f1252B024L6580b11888B66196
$$ -121802 70332 64604 171409 220808 -132515 -308715 -61252 2024 38604 -211888 266196
12563A5740K0004D796J32625H945J9829b07746D6741M8350C7380J39876g3860
$$ 15740 35744 4796 137421 8945 28774 -207746 46741 95091 37380 177256 -73860
12551C15439F1716j1189J21828J01622A16261j9647c2521B45010f9804K2340q486
$$ 315439 61716 50527 172355 273977 116261 96614 -32521 245010 -69804 -47464 -55950
12540e5950E7234N1324j3652C995J13799n4302K56662a35014N2730b4139q1053
$$ -55950 57234 108558 94906 3995 117794 63492 320154 -135014 -82284 -24139 -105192
12529a05192A69286A711Q4132i6552L6595D3288a06909d3385k83742A59424o5453
$$ -105192 169286 1711 85843 -96552 -59957 43288 -106909 -43385 -327127 159424 93971
12518I3971b56610A88036a20938A04155c44815B24175j05950a559j818H4928m0218
$$ 93971 -256610 188036 -120938 104155 -344815 224175 118225 -1559 -3377 84928 44710
12507D4710b95846E3795K0538e2518Q583D0987L5557J48239o6402a70232N5625
$$ 44710 -295846 53795 74333 -52518 -43935 40987 76544 224783 158381 -170232 -114607
12496a14607n5497D82671H7171a40625I8265b1916k17120a08983q1811m2814b7232
$$ -114607 -170104 482671 87171 -140625 98265 -21916 -239036 -108983 -190794 -233608 -27232
12484A43766a38912j01455g3175p2682p2719C25724A17667b9845C63223D0412
$$ 143766 -138912 -240367 -73175 -145857 -218576 325724 117667 -29845 363223 40412
12473c8755G2694J38532c42085A20790f6878p6948B52473i566H755J3890a95263
$$ -38755 72694 211226 -342085 120790 -66878 -143826 252473 -9566 8755 22645 -195263
12461h2788q9499r1386a01356e842k46702I9271A9517L2644j8939R9322c6417
$$ -82788 -172287 -263673 -101356 -5842 -252544 99271 19517 52161 33222 132544 -36417
12449b33187R4313A60950n2902O4480c699j796k19055h0147B07815a8354k28907
$$ -233187 -138874 160950 108048 172528 -3699 -5495 -224550 -80147 207815 -18354 -247261
12438b47261H4005c054B71251J42328A7412h1831o1492A1564b9176l59090A3134
$$ -247261 84005 -3054 271251 413579 17412 -81831 -143323 11564 -29176 -388266 13134
12426a18549B74753a69252A55446L7884a26107J599B75925a8171q966r3880l9750
$$ -118549 274753 -169252 155446 193330 -126107 -124508 275925 -18171 -27137 -121017 -160767
12415a60767N7200j13299A27486c4672k20398a00339L3482d518A93652g6997K2390
$$ -160767 -103567 -216866 127486 -34672 -255070 -100339 -66857 -4518 193652 -76997 -54607
12404e4607q6213A97263m3294b0586m5805F6036k9770n50j1574b24610A20335
$$ -54607 -140820 197263 153969 -20586 -66391 66036 36266 35716 24142 -224610 120335
12392a04099G3506J58764a71371a4925A89790a63627I7820P3222b32756f7529
$$ -104099 73506 232270 -171371 -14925 189790 -163627 97820 171042 -232756 -67529
12381B17248a67334A19479a07249G8218D984N9098e7408p6770I0239J06926b10732
$$ 217248 -167334 119479 -107249 78218 4984 64082 -57408 -134178 90239 197165 -210732
12369C13414b61596P8526B8737f5602C37830a60995A17985J0413M5883a14409
$$ 313414 -261596 -183070 28737 -65602 337830 -160995 117985 128398 174281 -114409
12358e7265j86506Q5110B8500f0982C1514a47113k6761C56064A58340J14378b33768
$$ -57265 -243771 -158661 28500 -60982 31514 -147113 -173874 356064 158340 272718 -233768
12346f7087k87259d8321n410G0108f4700A39767a08430m9823G2331L0889Q2219
$$ -67087 -354346 -48321 -53731 70108 -64700 139767 -108430 -158253 72331 103220 185439
12335A85439b94393R5190O3724D9599b36069I6312j3162a42484M0849j33687B36213
$$ 185439 -294393 -199203 -135479 49599 -236069 96312 83150 -142484 -101635 -235322 236213
12323b76488A01939g0465A0592m511N8575g6976F9845a11683c7787B67178H3900
$$ -276488 101939 -70465 10592 6081 64656 -76976 69845 -111683 -37787 267178 83900
12311C41849p2791b7705B8151b54312D566K39943a96699I455i5735a7248B8953
$$ 341849 269058 -27705 28151 -254312 4566 244509 -196699 9455 -95735 -17248 28953
12299B9485b19609k05399C42016E530a89533g2877A928a52692A08403J98055G7677
$$ 29485 -219609 -425008 342016 5530 -189533 -72877 1928 -152692 108403 306458 77677
12287b25553E0603J95482Q791M1585Q5699f3182C31760a63387B38395B1569K90732
$$ -225553 50603 246085 254876 296461 382160 -63182 331760 -163387 238395 21569 312301
12276C12301a68730A70935o4583c0299A66423j7365J56598r4424j4004i0161A21775
$$ 312301 -168730 170935 106352 -30299 166423 149058 305656 211232 197228 -90161 121775
12264B65476k9323i56A02046L5180o5648J31813g3544B72826H7791J83130A863
$$ 265476 236153 -956 102046 137226 71578 203391 -73544 272826 87791 270921 1863
12252D99L96397A61397Q1994c2388A71351c08729J24793K0666B48900b82214D90477
$$ 499 396896 161397 243391 -32388 171351 -308729 -183936 -163270 248900 -282214 490477
12240A55647o8550L3302m157b3142A39062M3561i1421J2544j35013D93830A75646
$$ 155647 87097 120399 116242 -23142 139062 182623 -91421 -78877 -213890 493830 175646
12228D97324B38509F3297j4752P8178P500J58899j38964a8844B31520J39204F4610
$$ 497324 238509 63297 48545 126723 134223 293122 154158 -18844 231520 370724 64610
12216C08630A17453K71924n3642m9323l009p4870J99591a05976B30349b86010
$$ 308630 117453 389377 335735 286412 283403 208533 408124 -105976 230349 -286010
12205A30485g7166C25774A13922L8280M9101n2365C3992K45979D1831N92332a07777
$$ 130485 -77166 325774 113922 152202 201303 148938 33992 279971 41831 634163 -107777
12193A83592K84859F3952i7261A1812M6244J78259J62837a6205B15838e0156C27238
$$ 183592 468451 63952 -97261 11812 58056 236315 399152 -16205 215838 -50156 327238
12181C18611a34214D13601A13608A4390M521g5790K7228m4843j80665A29439k6164
$$ 318611 -134214 413601 113608 14390 18911 -75790 -48562 -93405 -274070 129439 103275
12170A03275M31163r4119N8586e4192A5817M0385L71161r9290K380F1841a06129
$$ 103275 534438 440319 498905 -54192 15817 56202 427363 328073 330453 61841 -106129
12158D48019a10461G1757J43357j097n3451a48749c4912A98684h2997B13959a13771
$$ 448019 -110461 71757 215114 214017 160566 -148749 -34912 198684 -82997 213959 -113771
12146c2318A95734M6880h0615B83195G6843a13346m9678A08380a13078A64559
$$ -32318 195734 242614 -80615 283195 76843 -113346 -163024 108380 -113078 164559
12135f6607h028A66017A3110K50872B6351N0888j704b0524r6225A59624n8328
$$ -66607 -8028 166017 13110 263982 26351 77239 75535 -20524 -116749 159624 101296
12124A01296h6352B19151a24758d9824o5139e5912D02985A1513c2920M02l42418
$$ 101296 -86352 219151 -124758 -49824 -114963 -55912 402985 11513 -32920 -32518 -374936
12113c74936I8326f378j5514m1220F4092b3934r7032A09248D1957N0695G996Q0290
$$ -374936 98326 -6378 -21892 -63112 64092 -23934 -120966 109248 41957 92652 7996 88286
12101H8286b46534A19368i292H65J10421A4510J40671J87101a96696j68977C65849
$$ 88286 -246534 119368 -9292 865 111286 14510 155181 342282 -196696 -365673 365849
12089B91476A40229f6566A1867f45303d3948C61287C9592a69778I2989a74885
$$ 291476 140229 -66566 11867 -645303 -43948 361287 39592 -169778 92989 -174885
12078A81254m6087K46813N78825J540859A216149E60662D660J64275b14054f8608
$$ 181254 135167 381980 960805 2501664 1216149 560662 4660 168935 -214054 -68608
12067B11888c0449J3340A95259a2202k03178F7348b09584D3969J54391b102n8999
$$ 211888 -30449 -17109 195259 -12202 -215380 67348 -209584 43969 198360 -2102 -61101
12056f1101q8792b5599A08572J25108F0808J72721b08525g803j92860g9852A52089
$$ -61101 -149893 -25599 108572 233680 60808 233529 -208525 -7803 -200663 -79852 152089
12044A97317K60943a46326I1436K07193a46247A63981a41153B46736a17283D13034
$$ 197317 458260 -146326 91436 298629 -146247 163981 -141153 246736 -117283 413034
12033D0407c15276E5880J2501i7481a0488j7836B80299c19976h0025A05629a83460
$$ 40407 -315276 55880 68381 -97481 -10488 -28324 280299 -319976 -80025 105629 -183460
12021A32749a48660L0103l3918C64651A34959b2964r8934m1495e3309j94087A5135
$$ 132749 -148660 -118557 -152475 364651 134959 -22964 -121898 -163393 -53309 -247396 15135
12009c65031C6559a97735F7708K46738A51171o8650c05981H8219B4792J24905
$$ -365031 36559 -197735 67708 314446 151171 82521 -305981 88219 24792 149697
11999A49697B9346b94928L0565n2151O3100I6885C7527J08022b15745d4261A93386
$$ 149697 29346 -294928 -264363 -316514 -253414 96885 37527 145549 -215745 -44261 193386
11987b90675j49219E2317a56658o4882k0419B0341h7272n4789A14988m0242b58612
$$ -290675 -439894 52317 -156658 -221540 -241959 20341 -87272 -142061 114988 74746 -258612
11975I7467a09823b6741J2793A13166K11546a93639c3844B11580a36232A02055
$$ 97467 -109823 -26741 -13948 113166 324712 -193639 -33844 211580 -136232 102055
11964I5167i0976j21073A19510O7156a943l6411m5567L5619j5787G4144A5483
$$ 95167 -90976 -212049 119510 186666 -1943 -38354 -83921 -48302 -64089 74144 15483
11952D5833c89632f416A40842b66020E5659K07334A31133d0202D43566A63251
$$ 45833 -389632 -6416 140842 -266020 55659 262993 131133 -40202 443566 163251
11941c56938h1905J9019A11209a48768g724k22481L8867P9778j2385E0882a24701
$$ -356938 -81905 -62886 111209 -148768 -7724 -230205 -191338 -111560 -123945 50882 -124701
11929d1690r5981f5400C00622M2752j13680J52517b64923A94137b30723L2462
$$ -41690 -137671 -65400 300622 343374 229694 382211 -264923 194137 -230723 -198261
11919a98261D9372b7958O893j54001j92567A60332g42A52288J44073I9990a0569
$$ -198261 49372 -27958 -21065 -175066 -367633 160332 -742 152288 296361 99990 -10569
11907D43001a46357N2920j17651F6324J8627k9352J26664H5518a27525B07423
$$ 443001 -146357 -93437 -211088 66324 84951 55599 182263 85518 -127525 207423
11896g7795j41786D01409c9404A03622B9215P6767M3237b27896J07541o2755f5142
$$ -77795 -219581 401409 -39404 103622 29215 105982 149219 -227896 -120355 -183110 -65142
11884c3122k98093D7288A9517c08958c5516D3923K8196b53886D96346i1197o2056
$$ -33122 -331215 47288 19517 -308958 -35516 43923 72119 -253886 496346 -91197 -153253
11873a53253b3137j52330L8346A75977i2739F5601a84406A62335D7117a2590q0656
$$ -153253 -23137 -175467 -137121 175977 -92739 65601 -184406 162335 47117 -12590 -93246
11862i3246E2562g4868j2132L1358h884k95362f9246j7942M0686F7949b7305j50157
$$ -93246 52562 -74868 -87000 -55642 -8884 -304246 -69246 -87188 -46502 67949 -27305 -177462
11850a77462H6212K4102A6845c6C246a41644B06835j00523e8029l9052d1944D0768
$$ -177462 86212 110314 16845 -36 3246 -141644 206835 106312 -58029 -97081 -41944 40768
11837B9412b13154h9775A68682C5697a15286C6735f3239b9494k2549n5539c221
$$ 29412 -213154 -89775 168682 35697 -115286 36735 -63239 -29494 -52043 -107582 -3221
11825B8560J60259b30075h4386j87167a9419A10597l7447Q5255b08776L1912f8786
$$ 28560 188819 -230075 -84386 -271553 -19419 110597 73150 158405 -208776 -176864 -68786
11813H6990M1655i4463k15214a19959m3827F8478J18260J26193n8802J40226I0231
$$ 86990 128645 -94463 -309677 -119959 -163786 68478 186738 312931 254129 394355 90231
11801d2695r6889j84684F1987a41708j91659c6799A02555b9556l16654J46080
$$ -42695 -139584 -324268 61987 -141708 -333367 -36799 102555 -29556 -346210 -200130
11791b00130G7591F39a55545A35729J46737F2231c65808f1749F6707J249K0891
$$ -200130 77591 639 -155545 135729 282466 62231 -365808 -61749 66707 67956 88847
11780H8847O3582c39468I9017b76809k36439M410q6645B59263a21828K4647I7619
$$ 88847 152429 -339468 99017 -276809 -513248 -508838 -595483 259263 -121828 -97181 97619
11768e3493a8622l3163j82838k1846B05584J19937i0105A49921a2622A46436O4386
$$ -53493 -18622 -51785 -234623 -256469 205584 325521 -90105 149921 -12622 146436 210822
11757B10822A9690N1338N9910N2157b00570Q2066j00703i4612A42921B1334J71821
$$ 210822 19690 71028 130938 183095 -200570 -118504 -219207 -94612 142921 21334 193155
11746A93155a41018j18366A4164f4626I3331P9548a23719e5323k18705C76872
$$ 193155 -141018 -259384 14164 -64626 93331 172879 -123719 -55323 -274028 376872
11735b8712a490H5784b91061M3048E3467P8064K87958B056J46807b47043m1041
$$ -28712 -1490 85784 -291061 -248013 53467 131531 419489 2056 148863 -247043 -288084
11724b88084L1431A62961f6207A70910J7713o5801L33133j84237j35616O0869
$$ -288084 -256653 162961 -66207 170910 188623 122822 455955 271718 136102 196971
11714A96971b04106g343E7374R071a33770A91514g8719r2022r3477A31324O4403
$$ 196971 -204106 -7343 57374 66445 -133770 191514 -78719 -170741 -264218 131324 195727
11703A95727m1486J8040q5504b5804B45574k6229r4990Q7975h1841b260n0938
$$ 195727 154241 172281 86777 -25804 245574 219345 124355 212330 -81841 -2260 -53198
11692e3198F318e3492b1520C13396B6663d2602B60517E982K54215a41605a6289
$$ -53198 6318 -53492 -21520 313396 26663 -42602 260517 5982 260197 -141605 -16289
11680C18360C7632J14937L8848e2951r5935a1985l6599C85767A35728a9525f693
$$ 318360 37632 152569 191417 -52951 -148886 -11985 -48584 385767 135728 -19525 -6693
11668C89263b3260n12539g1133b5129E0273O7205h0867B36807C0183c00858A71963
$$ 389263 -23260 -535799 -71133 -25129 50273 117478 -80867 236807 30183 -300858 171963
11656B73488I8751f848A49068g7336L6119j20171B5721G290J53636b17552A70611
$$ 273488 98751 -6848 149068 -77336 -41217 -161388 25721 7290 160926 -217552 170611
11644i5506B96357A45256j7524a79321I9097a90219g6217k3481A68199K08636
$$ -95506 296357 145256 127732 -179321 99097 -190219 -76217 -99698 168199 376835
11634C76835E4645L9162N214c1315B63075b11831h0864B73465E6842O0573M8310
$$ 376835 54645 93807 99021 -31315 263075 -211831 -80864 273465 56842 117415 165725
11623A65725c80733F9391l64e5926A80202G9144J34784e039B14690a60980g052
$$ 165725 -380733 69391 69027 -55926 180202 79144 213928 -5039 214690 -160980 -7052
11611b93024c3314A01162c9303D0137J24810n5016J11040K3212e3905l3480c3501
$$ -293024 -33314 101162 -39303 40137 164947 109931 220971 244183 -53905 -87385 -33501
11599A76633G0867C2681O5863h7361A12257J23181a24501C7926g3635B05478c0593
$$ 176633 70867 32681 98544 -87361 112257 235438 -124501 37926 -73635 205478 -30593
11587D4757a00927F2768K46929d3153B25089a70181e1489O578A95465r3332j9339
$$ 44757 -100927 62768 309697 -43153 225089 -170181 -51489 -44911 195465 102133 82794
11576H2794O6178J07283b46169H3366J30930a89827C29986A63357J523g0206B613
$$ 82794 148972 256255 -246169 83366 214296 -189827 329986 163357 164880 -70206 2613
11564B83953I3015P7446J48791a05626E1363J71115b88430k6050B86586a34340
$$ 283953 93015 170461 319252 -105626 51363 222478 -288430 -314480 286586 -134340
11553a03311b7378j75391A59618J08725a7090A61259F105K44692c74676A26126
$$ -103311 -27378 -202769 159618 268343 -17090 161259 6105 250797 -374676 126126
11542C49255l8942e8212H1653a65417G501N2618N7409J83126b39944A47686P8140
$$ 349255 310313 -58212 81653 -165417 7501 60119 117528 300654 -239944 147686 225826
11531B25826q8125K0661J20007h0648c2727g623j97483G1475a50572E3932L67144
$$ 225826 137701 158362 278369 -80648 -32727 -7623 -205106 71475 -150572 53932 421076
11520D21076A07345O2284B1464M0529J03990a35721O6621k7316A38432g892A25288
$$ 421076 107345 169629 21464 61993 165983 -135721 -69100 -96416 138432 -7892 125288
11508D97329B30238H1065O6529J10857r1104k4069M2096f8156B20368H0816J46641
$$ 497329 230238 81065 147594 258451 167347 143278 185374 -68156 220368 80816 227457
11497B27457c7018A22909J48478g8252G880f9313A91496e0509E0031K94989I2450
$$ 227457 -37018 122909 271387 -78252 7880 -69313 191496 -50509 50031 345020 92450
11485B12173n6871K34768M6507o7901H1121J20026M8294p6347a32894r0587C52111
$$ 212173 155302 390070 436577 368676 81121 201147 249441 173094 -132894 -223481 352111
11473A77396f4342b1224B67799L3420K39833f7095D05494j45307j29206b32515
$$ 177396 -64342 -21224 267799 301219 541052 -67095 405494 260187 130981 -232515
11462B30359i1929o9226O0629r4377E1701l387J91038G9979Q4993b55344A58578
$$ 230359 -91929 -161155 -100526 -194903 51701 48314 239352 79979 164972 -255344 158578
11450H9410L0271e8167B11349n2656K6142N6957J87420j69498L475J9686A09751
$$ 89410 119681 -58167 211349 158693 184835 241792 429212 259714 263189 282875 109751
11438A63820P7271I0953j5611L689J74141b3702o3710k3556C6795J59537c04406
$$ 163820 241091 90953 75342 79031 253172 -23702 -87412 -110968 36795 196332 -304406
11426E8056J37594g8074A50969c7892k11867B79821a22395A47501f6195D26339
$$ 58056 195650 -78074 150969 -37892 -249759 279821 -122395 147501 -66195 426339
11415g2231I2611m592E201M07442A76550A0248f8721l50018I4773O4448J08213
$$ -72231 92611 88019 5201 412643 176550 10248 -68721 -418739 94773 159221 267434
11404B67434H944J9176a9333B78954r6960b69031M8313L4092a8129j13286C8219
$$ 267434 8944 28120 -19333 278954 181994 -269031 -220718 -186626 -18129 -131415 38219
11392C27710B3333i7162j5574B40638a35351e7368F6929a208m4000j64253A72900
$$ 327710 23333 -97162 -112736 240638 -135351 -57368 66929 -1208 -45208 -209461 172900
11380B48285A14169m6149J04546B9282J03224Q565l1680b7595A33960Q2810G9702
$$ 248285 114169 68020 172566 29282 132506 141071 109391 -27595 133960 216770 79702
11368b8062A9389O7143J08386c6325k69189B85507A5770f5004a9983B62267a09281
$$ -28062 19389 86532 194918 -36325 -305514 285507 15770 -65004 -19983 262267 -109281
11356b41268j34923a86718C710K0721a05549q3601E09673f0541b2765H466a37502
$$ -241268 -376191 -186718 3710 24431 -105549 -189150 509673 -60541 -22765 8466 -137502
11344d2381A50819a23916B23551d1809F2099b3888j141B057M8107a15932J4738
$$ -42381 150819 -123916 223551 -41809 62099 -23888 -25029 2057 50164 -115932 -101194
11333a01194B23592J45538A22842l9985a35370O1056j78625D7054f9205A15509
$$ -101194 223592 369130 122842 82857 -135370 -74314 -252939 47054 -69205 115509
11322c64924C03416E5429a17851L8415D3538J2775i0226D0748O7676a90987i3502
$$ -364924 303416 55429 -117851 -79436 43538 56313 -90226 40748 108424 -190987 -93502
11310d0114n0483j36572B92125a80716M347C1952c0303k66706B2110g1700j43573
$$ -40114 -90597 -227169 292125 -180716 -176369 31952 -30303 -297009 22110 -71700 -215273
11299b15273r9372b296B516K0163O9471J20719a12301M7659J5257A19661D5984
$$ -215273 -314645 -2296 2516 22679 92150 212869 -112301 -64642 -49385 119661 45984
11287b02678Q9341A52309b5968B41637r9269E7338e2571j71785m1784d4199G2851
$$ -202678 -113337 152309 -25968 241637 142368 57338 -52571 -224356 -266140 -44199 72851
11275a35047G7864a17322B91741f9270l14727B34333f6214q2882k73993a93741
$$ -135047 77864 -117322 291741 -69270 -383997 234333 -66214 -149096 -423089 -193741
11264a37048I0434d9026C25040b00783D15340b41035B16921l7924e9653o7449
$$ -137048 90434 -49026 325040 -200783 415340 -241035 216921 178997 -59653 -127102
11254a27102B84535b68012K1921R7161A4820a939B3623J3728c5011r9227k4446
$$ -127102 284535 -268012 -246091 -148930 14820 -1939 23623 37351 -35011 -134238 -158684
11243a58684k5505P4667d4691B5857a35890F9934J0088a1778A3544Q537a16349
$$ -158684 -184189 -109522 -44691 25857 -135890 69934 80022 -11778 13544 22081 -116349
11231b46935M8866j3268R1619B243L9596d9666A48817a02721e1338j68686f1196
$$ -246935 -198069 -211337 -119718 2243 41839 -49666 148817 -102721 -51338 -220024 -61196
11219a6575m8176J1609K4061j43911B28941a3698m6242j69560R1744P447k62889
$$ -16575 -64751 -53142 -29081 -172992 228941 -13698 -59940 -229500 -137756 -130309 -393198
11208c93198a49071j8730F1179j6692J13338b29976f1023l53223B9444c09604
$$ -393198 -149071 -167801 61179 44487 157825 -229976 -61023 -414246 29444 -309604
11197b81052J9533A30882b87153J0627A27265d4338A0292a60330A21809R7400
$$ -281052 -261519 130882 -287153 -276526 127265 -44338 10292 -160330 121809 219209
11187B19209H9943b00683b5952B69284a66195b4248p0436M1022k27140Q5335D1213
$$ 219209 89943 -200683 -25952 269284 -166195 -24248 -94684 -53662 -280802 -195467 41213
11175i8532A77715i431k13645O6415b0706n8561I7823D0864R0545a8547o4945
$$ -98532 177715 -9431 -223076 -156661 -20706 -79267 97823 40864 131409 -18547 -83492
11164h3492j33169F544e95301a90380A06144K47529h9335c0488n4110c3848k5041
$$ -83492 -216661 6544 -595301 -190380 106144 353673 -89335 -30488 -84598 -33848 -58889
11153e8889j32674A44143I038b30580A64361a17005H0904c34880a16056A77481
$$ -58889 -191563 144143 9038 -230580 164361 -117005 80904 -334880 -116056 177481
11142D02404a35618B057J03664c19994h7644A2329C796a16493G0637k9467M7777
$$ 402404 -135618 2057 105721 -319994 -87644 12329 3796 -116493 70637 41170 88947
11131H8947d5369r6265j79259B05583a20312A13813J28383H8469a56625C0517
$$ 88947 -45369 -141634 -320893 205583 -120312 113813 242196 88469 -156625 30517
11120a46921A09066b85761i6652C18830j35303p7183Q6950c8742E3291d5062B02388
$$ -146921 109066 -285761 -96652 318830 183527 106344 193294 -38742 53291 -45062 202388
11108H9640K62058A54111n7743J5917R7025k8987c1687A32987J38159E345J34467
$$ 89640 351698 154111 96368 112285 209310 180323 -31687 132987 271146 5345 139812
11097A39812b9102A0661Q3133a30111B1028K44506N3660j54375K14259o100L46338
$$ 139812 -29102 10661 93794 -130111 21028 265534 319194 164819 379078 372978 719316
11086G19316A92657D5004J39341M9443k7721j7298K30769p1439O2061K1398N5606
$$ 719316 192657 45004 184345 233788 206067 188769 419538 348099 410160 431558 487164
11075D87164k00225o9713J29305J49756p5391M35249C72407J14690j92180L05100
$$ 487164 286939 217226 346531 496287 420896 856145 372407 487097 294917 600017
11065F00017B07406J01024J2449L61493K937j2093l08578L67667B46364M09266
$$ 600017 207406 308430 320879 682372 685309 673216 364638 732305 246364 655630
11055F55630k67Q7723j01337j330M03446k28238l7396j54334L8403L16547r0120
$$ 655630 655363 743086 641749 640419 1043865 815627 778231 623897 662300 978847 888727
11044H88727p8592k85105l7869J01845k27536L41359K6744N8758o9299P439R3535
$$ 888727 810135 525030 487161 589006 361470 702829 729573 788331 719032 726471 820006
11033H20006k81855M14022o5974l81226O8824M3261L05356k47469J78620n5964
$$ 820006 538151 952173 886199 504973 573797 617058 922414 674945 853565 797601
11023G97601j89813M8397C16968J67559M8864M8015J18132j68258N2599Q9130
$$ 797601 607788 656185 316968 484527 533391 581406 699538 531280 583879 673009
11013F73009L40785l24856j41543K0253K17695o716B21258M16058L425K75052
$$ 673009 1013794 688938 547395 567648 785343 778627 221258 637316 640741 915793
11003I15793j005k09619R0736k55499N44414j08874D61916M49821D40746J43730
$$ 915793 914788 705169 795905 540406 1084820 975946 461916 911737 440746 584476
10993E84476L10920D36743M88863k59470J9949L96050l76712L83485j0358j70910
$$ 584476 895396 436743 925606 666136 686085 1082135 705423 1088908 1078550 907640
10983I07640J14470J26712J79565n65784N49485P1921J01613q0501M47297M30535
$$ 907640 1022110 1148822 1328387 762603 1312088 1384009 1485622 1405121 1852418 2282953
10973B282953l3587J87377L20807K67805k57796j48416m19588m5000m93773j45580
$$ 2282953 2249366 2436743 2757550 3025355 2767559 2619143 2199555 2154555 1660782 1515202
10963A515202J99883m3925K0025K18724l2417r970K58753l29191J7246j64201
$$ 1515202 1715085 1671160 1691185 1909909 1877492 1867522 2126275 1797084 1814330 1650129
10953A650129l45761j64421j84484J86003j4988k33037A75246Q8437J84608B18060
$$ 1650129 1304368 1139947 955463 1141466 1126478 893441 175246 263683 448291 218060
10942D31987J9558G3680c215F6174J54611D93K632K48855b46417B76500A376f9505
$$ 431987 451545 73680 -3215 66174 220785 493 3125 251980 -246417 276500 1376 -69505
10929g9120A31108N7655C5510e03H6955D227J19104Q999l051b83712A33065a68569
$$ -79120 131108 188763 35510 -503 86955 4227 123331 132330 129279 -283712 133065 -168569
10916A59645h4377H9396f682j04567k5738B16570J26461b55890B1710b40227g2061
$$ 159645 -84377 89396 -6682 -111249 -136987 216570 343031 -255890 21710 -240227 -72061
10904b40875D15091f6414D797K52518N9345q2845a75352A10801d6934l30012G1355
$$ -240875 415091 -66414 4797 257315 316660 233815 -175352 110801 -46934 -376946 71355
10892b12352R6293B94710o8901b2734j7762K072A20192m095b30919B36442a17885
$$ -212352 -116059 294710 225809 -22734 -40496 -38424 120192 116097 -230919 236442 -117885
10880d9677q2408D19924B7914b80831c7413r0003c4612j05522C31947b04233A41631
$$ -49677 -132085 419924 27914 -280831 -37413 -127416 -34612 -140134 331947 -204233 141631
10868f2821m41663b15517C02887c22357B7818a62169P8642A99320D2049K40095
$$ -62821 -504484 -215517 302887 -322357 27818 -162169 -83527 199320 42049 282144
10858B82144i8501j78159A46036M8759q8924A1399d62418B04055m0652d2795A49705
$$ 282144 -98501 -276660 146036 194795 105871 11399 -462418 204055 163403 -42795 149705
10846g4698B61533a8492n4972k16939D0644Q950J68278B9663j1800H505J29650
$$ -74698 261533 -18492 -73464 -290403 40644 49594 217872 29663 17863 8505 138155
10835A38155d41594A19518b81054d862A33445C8428J03892a3397A28414a00876
$$ 138155 -441594 119518 -281054 -4862 133445 38428 142320 -13397 128414 -100876
10824a43942b7584H0305L5405a29706l5152A62494n175B6472b20682D249a2216
$$ -143942 -27584 80305 115710 -129706 -164858 162494 157319 26472 -220682 4249 -12216
10812a54145M6199n5925A64019j5711h9077A48414c81760J60487A97627b02975
$$ -154145 -107946 -163871 164019 148308 -89077 148414 -381760 -221273 197627 -202975
10801B83389a57510g6446j31096h1245A92569O1732G0027a08010k28804Q0979
$$ 283389 -157510 -76446 -207542 -81245 192569 254301 70027 -108010 -336814 -255835
10791b55835B08830c92526a03991F1658b55285A22436a2454m51565e2294D649
$$ -255835 208830 -392526 -103991 61658 -255285 122436 -12454 -464019 -52294 4649
10780a16852A61454b51187A6173g6617D744c9605A25795a6262J542B11756G7824
$$ -116852 161454 -251187 16173 -76617 4744 -39605 125795 -16262 -14720 211756 77824
10768A09064b97889A2726e3223k37315h5332f316j83646A57630c75376i6117k57327
$$ 109064 -297889 12726 -53223 -290538 -85332 -6316 -189962 157630 -375376 -96117 -353444
10757c53444A92382I0482R0336o4441g1791C3621c84488D5647a28334B70322G7848
$$ -353444 192382 90482 180818 116377 -71791 33621 -384488 45647 -128334 270322 77848
10745a05277A85638g5996j99276H871a76779N0983l26811b2891j11225F3485L10326
$$ -105277 185638 -75996 -275272 8871 -176779 -125796 -452607 -22891 -134116 63485 373811
10734C73811j44763e3543B55664g7425A99103g9770B339c3744C31162b0865A77854
$$ 373811 229048 -53543 255664 -77425 199103 -79770 2339 -33744 331162 -20865 177854
10722c39182A58401D7814a91383d6255A19575P8558a28076e1882n0408A33531
$$ -339182 158401 47814 -191383 -46255 119575 198133 -128076 -51882 -102290 133531
10711b04528M1886a0168k62088A20564a7531j72201A34419N7705d4226k29854
$$ -204528 -162642 -10168 -272256 120564 -17531 -189732 134419 192124 -44226 -274080
10701b74080a102m9503a0088E4357b01836k0742C28569A56172a54911d8250A00235
$$ -274080 -1102 -50605 -10088 54357 -201836 -222578 328569 156172 -154911 -48250 100235
10689b97178H216a23831o6675H3398H388c46998b5704p8009m7213A97896p8542
$$ -297178 8216 -123831 -190506 83398 8388 -346998 -25704 -103713 -150926 197896 119354
10678A19354a64336P8064b8828q0109k42027a72871A25894a70782A90464M4627
$$ 119354 -164336 -86272 -28828 -108937 -350964 -172871 125894 -170782 190464 235091
10668B35091f873K339k29734k2963P2141B39519a70308A17674g9694A52540e6519
$$ 235091 -6873 -4534 -234268 -257231 -185090 239519 -170308 117674 -79694 152540 -56519
10656E4942b71847M2595L5193n0048B2882K26018C9900a60115K7608a0764j55450
$$ 54942 -271847 -229252 -194059 -244107 22882 248900 39900 -160115 -132507 -10764 -166214
10645a66214A01422a03760k05459A22603c92230r2713A45036l6213a68710A67521
$$ -166214 101422 -103760 -309219 122603 -392230 -484943 145036 108823 -168710 167521
10634c9817D5655i3566k37398a22148j41156b0425C3682L9502a35846A77925Q1966
$$ -39817 45655 -93566 -330964 -122148 -263304 -20425 33682 73184 -135846 177925 259891
10623B59891a12233A22394f0690o0434J7071o4853O5367F8966O6869P9503b1336
$$ 259891 -112233 122394 -60690 -121124 -104053 -168906 -103539 68966 135835 215338 -21336
10611i3214m53A0178L8110d062p6640L7533k4217C562a91144P7228A66207b8613
$$ -93214 -93667 10178 48288 -4062 -80702 -43169 -67386 3562 -191144 -113916 166207 -28613
10598a21667k48511B834M0803e51221E2219n46c65279D0309M9716c40724c9200
$$ -121667 -370178 2834 43637 -551221 52219 51673 -365279 40309 90025 -340724 -39200
10586A23374b17150L582A27173C1033b53642g1889A51223f8699j31337B6611c6705
$$ 123374 -217150 -213568 127173 31033 -253642 -71889 151223 -68699 -200036 26611 -36705
10574a71721h3849L2222a984A26995g1012A86273a95140f4539b8356H135N5914
$$ -171721 -83849 -51627 -1984 126995 -71012 186273 -195140 -64539 -28356 8135 64049
10563F4049f8280A07800L76842a6729H990L2542J04421F7157N9740b02126h3366
$$ 64049 -68280 107800 484642 -16729 8990 41532 145953 67157 126897 -202126 -83366
10551b05967N3304d336j59628H2029e3881A22246a95463A87234f6840l03598f2145
$$ -205967 -152663 -4336 -163964 82029 -53881 122246 -195463 187234 -66840 -370438 -62145
10539a97765E1760P0852b23878P6726C74042b23260A45257n8915B6089J08864
$$ -197765 51760 122612 -223878 -147152 374042 -223260 145257 86342 26089 134953
10529A34953e592j72536a266F2249c37909H7455e2660n3288K2943G3403b25122
$$ 134953 -5592 -178128 -1266 62249 -337909 87455 -52660 -105948 -83005 73403 -225122
10517b8664k26084A60151F9456C88O2714b45511B13647g1468H9659g6245J8338
$$ -28664 -254748 160151 69456 388 63102 -245511 213647 -71468 89659 -76245 -57907
10506e7907E4310d09117a39438N4849a4053C5835r767O0100d3734a9579l00777
$$ -57907 54310 -409117 -139438 -84589 -14053 35835 26068 86168 -43734 -19579 -320356
10495c20356B5064a61214b7155l2096C4948J77645b59724F3262A450h7231D38453
$$ -320356 25064 -161214 -27155 -59251 34948 212593 -259724 63262 1450 -87231 438453
10483B33517F4063J9614M76083k20803J16488A74323K41439h2064B04196e4928
$$ 233517 64063 83677 559760 338957 455445 174323 415762 -82064 204196 -54928
10472A30500o3405l1923K60258Q526a21717C6876a25376A14899e6401b6540j66011
$$ 130500 67095 35172 295430 303956 -121717 36876 -125376 114899 -56401 -26540 -192551
10461a92551k01267A2973J07074d3998A58097F9571J63889J2065r1987k5793B7047
$$ -192551 -393818 12973 120047 -43998 158097 69571 233460 245525 153538 127745 27047
10449b78148A70640E4625c67259R9131A60631n9731N8253h8324A11319K03068
$$ -278148 170640 54625 -367259 -268128 160631 100900 159153 -88324 111319 314387
10439C14387c5825l8915A49134c91630j21005h6523d1980p5272A57370Q511d0591
$$ 314387 -35825 -74740 149134 -391630 -512635 -86523 -41980 -117252 157370 165881 -40591
10427a5026A49139M3735c2657q1809a3514j16319A19487d6527N506B3654g0798
$$ -15026 149139 192874 -32657 -114466 -13514 -129833 119487 -46527 -41021 23654 -70798
10415A27494d0337A84655Q0451k4616B083a98846C6065a46201B680a67663L6695
$$ 127494 -40337 184655 265106 240490 2083 -198846 36065 -146201 2680 -167663 -130968
10404a30968m552l7641p4525B00231f7512b5516G4085m025D412N9324c40189g9942
$$ -130968 -135520 -173161 -247686 200231 -67512 -25516 74085 70060 4412 63736 -340189 -79942
10391C23199q849N0020b90870C09170a97017B00359c3489B88704m7771n4640B8285
$$ 323199 314350 364370 -290870 309170 -197017 200359 -33489 288704 240933 186293 28285
10379B72710m681l6624m6872J10406g3355B16306a756C24937M1726m1482A10072
$$ 272710 268029 231405 184533 294939 -73355 216306 -1756 324937 366663 325181 110072
10367C28312m1827L00152j94153A75052K0959L4866J39057j41997K22523B04820
$$ 328312 286485 586637 392484 175052 196011 230877 369934 227937 450460 204820
10356A19577b88160G7684a58309C63172l4660O02901l5880A61200N03168r8447
$$ 119577 -288160 77684 -158309 363172 328512 931413 895533 161200 664368 565921
10346E65921r1469k35574c5870H5047M33326A47850a7381k6002A77483P6566H0818
$$ 565921 474452 238878 -35870 85047 518373 147850 -17381 -43383 177483 254049 80818
10334h967I2053J21623n9002J02631e5349a2698A48160a26293K5042A16461K11540
$$ -8967 92053 213676 154674 257305 -55349 -12698 148160 -126293 -101251 116461 328001
10323C28001r5630p1065K76939k17155a31510A10092b3800F3265K74359A0862
$$ 328001 232371 161306 438245 221090 -131510 110092 -23800 63265 337624 10862
10312A77935F4511J6524f458D828b8747j13764D3112K55812B7093d0450k08004
$$ 177935 64511 81035 -6458 4828 -28747 -142511 43112 298924 27093 -40450 -248454
10301b48454h2718K3620q7355e1156A8667k117e3747l7853A58986J10087A4653
$$ -248454 -82718 -59098 -146453 -51156 18667 16550 -53747 -91600 158986 269073 14653
10289B19670C5263d2017B2157k071a10932A06275b01796B107d63322I7875L3804
$$ 219670 35263 -42017 22157 20086 -110932 106275 -201796 2107 -463322 97875 131679
10278A31679g0962p4071B0848Q6902b0889j60531f1117K4219F7807d7691A65597
$$ 131679 -70962 -145033 20848 107750 -20889 -181420 -61117 -36898 67807 -47691 165597
10266A05033P9302k2908b19576C57809I2412N3204L97789j14500q5494j51967
$$ 105033 184335 161427 -219576 357809 92412 145616 543405 428905 343411 191444
10256A91444k7010L07159J20862A74845p8283F156R9978D1315b27735D0646R0458
$$ 191444 164434 471593 592455 174845 96562 6156 106134 41315 -227735 40646 131104
10245A31104M0127E018M1933b03723q5860E254c02756F5869a46354A27439a07071
$$ 131104 171231 5018 46951 -203723 -289583 5254 -302756 65869 -146354 127439 -107071
10233D3746O1166D0669K13299A25433a81366G7042J66598B9003g7888l439k7207
$$ 43746 104912 40669 253968 125433 -181366 77042 243640 29003 -77888 -81327 -108534
10222a08534j6094A62694a0682k56316i4770b5167G4703Q9176a49922n3855f3701
$$ -108534 -124628 162694 -10682 -266998 -94770 -25167 74703 163879 -149922 -203777 -63701
10210a40056A24326c3061j89852M0559F8525d52393a13649B01880a73998a9786
$$ -140056 124326 -33061 -222913 -182354 68525 -452393 -113649 201880 -173998 -19786
10199c8800j2576m1910A14537B6609K97306D2557c30541M3155a12812C15873o4022
$$ -38800 -51376 -93286 114537 26609 323915 42557 -330541 -287386 -112812 315873 251851
10188B51851a42357A2129b73188J33313O7937L4680j08994p7144D7845b0275k33119
$$ 251851 -142357 12129 -273188 -139875 -71938 -37258 -146252 -223396 47845 -20275 -253394
10177b53394K9753k752i8926l1834j9058B44822c61161e1501j62477e220m52582
$$ -253394 -223641 -226393 -98926 -130760 -149818 244822 -361161 -51501 -213978 -5220 -457802
10166d57802B093h3382o0555J0450F070N0538J9972c05417D55781h931m2637k57940
$$ -457802 2093 -83382 -143937 -133487 6070 56608 76580 -305417 455781 -8931 -51568 -309508
10154c09508h7599O644j008b0271l02623c4597m545q1130B78079d82483B69547
$$ -309508 -87599 -80955 -81963 -20271 -322894 -34597 -39142 -120272 278079 -482483 269547
10142f95811B9707b78907O5154K0943H6216K46935a36912d5331A99370L6817q6010
$$ -695811 29707 -278907 -213753 -192810 86216 333151 -136912 -45331 199370 236187 150177
10131A50177F9407b99112A84518e6670K1122C5516N630c61483P9003k45119H2525
$$ 150177 69407 -299112 184518 -56670 -35548 35516 41146 -361483 -282480 -527599 82525
10119b04741A38620E5950Q8840b56280A48284E9333i0968B19105m1558b83119
$$ -204741 138620 55950 144790 -256280 148284 59333 -90968 219105 177547 -283119
10108e51458b01370a088n0201q397A59079D0865b52916j08001j43807c5225l22037
$$ -551458 -201370 -1088 -51289 -59686 159079 40865 -252916 -360917 -504724 -35225 -357262
10097c57262A61182k3122K7149a18447a7759J807A56956a29043E0415e7696A55752
$$ -357262 161182 138060 165209 -118447 -17759 -15952 156956 -129043 50415 -57696 155752
10085a75094k7921j48687A83736b50054N6518g4010r2590A28297b58895f3544
$$ -175094 -203015 -351702 183736 -250054 -193536 -74010 -166600 128297 -258895 -63544
10074b29159J9884d8218j3674j0299A28244a18038F637L20925a97338i6028B0451
$$ -229159 -209275 -48218 -61892 -72191 128244 -118038 6637 327562 -197338 -96028 20451
10062A00763f845k79197A99186F6464a20620k52382G6850a02270l1689j67952
$$ 100763 -6845 -286042 199186 66464 -120620 -373002 76850 -102270 -133959 -301911
10052c01911a12225K6321I8269C0659J47808f4911k2222A88795D4348c44525B99704
$$ -301911 -112225 -85904 98269 30659 178467 -64911 -87133 188795 44348 -344525 299704
10040D1897b01065N9047l2940A17683a30452L5725q0892E0059a44495C74722d42204
$$ 41897 -201065 -142018 -174958 117683 -130452 -94727 -175619 50059 -144495 374722 -442204
10028c300j27348k70886D0408J42644b03433K522A16759b6089M91q109r3764k16237
$$ -3300 -130648 -401534 40408 183052 -203433 -200911 116759 -26089 -25598 -33707 -127471 -343708
10016c43708e9902A23434b87440A67281b1382j68455A36295f8282K783A56703
$$ -343708 -59902 123434 -287440 167281 -21382 -189837 136295 -68282 -65499 156703
10005A51161b04145c471n3609j61988R3165k42062a82406C5188M7608J02996q3904
$$ 151161 -204145 -3471 -57080 -219068 -125903 -367965 -182406 35188 82796 185792 101888
9994A01888D5264b66237d4826j73364j5514N108j85522a98315j08689A40373h9068
$$ 101888 45264 -266237 -44826 -218190 -233704 -228596 -414118 -198315 -307004 140373 -89068
9982a80756M8959K8931C15133I6037J48186b76314a2213A23890m2934a42196j74366
$$ -180756 -131797 -102866 315133 96037 244223 -276314 -12213 123890 80956 -142196 -316562
9971c16562J34800j6941h7517A20524h1289B49046a18010k63670a25809f0877
$$ -316562 -181762 -198703 -87517 120524 -81289 249046 -118010 -381680 -125809 -60877
9960A14455a40130j8211B7120j0810b89221B48713h6820k39444p289A08850g3441
$$ 114455 -140130 -158341 27120 16310 -289221 248713 -86820 -326264 -333553 108850 -73441
9948H1645l7937i3300A11518a50572O9241C0918b76802A67129a95656O7016k63290
$$ 81645 43708 -93300 111518 -150572 -81331 30918 -276802 167129 -195656 -128640 -391930
9937c91930a07775B10855b53166g1131K2446k95660B04221b20172l0763h6415
$$ -391930 -107775 210855 -253166 -71131 -48685 -344345 204221 -220172 -250935 -86415
9926d279j78324k56949g522j94530B1654b34876l0961f2171j93607G339d8275
$$ -4279 -182603 -439552 -7522 -202052 21654 -234876 -265837 -62171 -255778 7339 -48275
9914A04553h975j45814B78535c53410J01774A67153o0976b95778B0879K56039
$$ 104553 -8975 -154789 278535 -353410 -251636 167153 106177 -295778 20879 276918
9904B76918R7868a04462c8816J5364k18016C2729c48922O5264h9736k4332j98286
$$ 276918 374786 -104462 -38816 -23452 -241468 32729 -348922 -283658 -89736 -114068 -312354
9893c12354D0795g3812F8641N8448b5055k3419F4772h4054j07389A07720a79918
$$ -312354 40795 -73812 68641 127089 -25055 -48474 64772 -84054 -191443 107720 -179918
9881G132e7576I4984b50722c0901G6635i3626L6337j51143R8892o8202O9367C51630
$$ 7132 -57576 94984 -250722 -30901 76635 -93626 -57289 -208432 -109540 -177742 -108375 351630
9868D0531c1267k13633h7692K5633A59231J03015c58461E187a46364A8621b31398
$$ 40531 -31267 -244900 -87692 -62059 159231 262246 -358461 5187 -146364 18621 -231398
9856D6822a16551k4113j75714f1762B1886c6157o5647n964A46796b51900Q3592
$$ 46822 -116551 -140664 -316378 -61762 21886 -36157 -101804 -107768 146796 -251900 -168308
9845a68308A49274a52558B5366K8737c8840B06714h5056q9553A5530b80072J08557
$$ -168308 149274 -152558 25366 54103 -38840 206714 -85056 -174609 15530 -280072 -171515
9834a71515M1405B8161i0301l8044H9642b72938B82399a13069b6725m8702l77851
$$ -171515 -130110 28161 -90301 -128345 89642 -272938 282399 -113069 -26725 -75427 -453278
9823d53278K01872F8783h2998o1854F8226R4579b86483g8390j80851a14931A2656
$$ -453278 -251406 68783 -82998 -144852 68226 162805 -286483 -78390 -259241 -114931 12656
9811E5063K20357b19634d1015C21460g0208c671A95697b16226C4994K39412f863
$$ 55063 275420 -219634 -41015 321460 -70208 -3671 195697 -216226 34994 274406 -6863
9799b55043B04627q0966b48051a7459j79989R1222K1878A24943a53567p228B20551
$$ -255043 204627 123661 -248051 -17459 -197448 -106226 -84348 124943 -153567 -160795 220551
9787D1883L11939a13421P150A67897a27190n3167j65081a61172O8062c8221B76230
$$ 41883 353822 -113421 -106271 167897 -127190 -180357 -345438 -161172 -93110 -38221 276230
9775b71232N9481p8350P4472Q5403k42891B18213b54757o33c2362l5740l7367
$$ -271232 -211751 -290101 -215629 -130226 -373117 218213 -254757 -255390 -32362 -68102 -105469
9764a05469q9918A06415N910b76776B5280b21987j608A56460b71005j86813A17738
$$ -105469 -195387 106415 112325 -276776 25280 -221987 -223595 156460 -271005 -457818 117738
9752c14511f9593A56721b19742f9331C1147d8017m49058A79684O7033a13640k11456
$$ -314511 -69593 156721 -219742 -69331 31147 -48017 -497075 179684 246717 -113640 -325096
9741c25096i0350j62854I6055b2408k6682H7849h6332G6746a20595j66131a11079
$$ -325096 -90350 -253204 96055 -22408 -49090 87849 -86332 76746 -120595 -286726 -111079
9729a78188A73693R2552b65490A62623c00202R2893i3414p9718A48777f575G4505
$$ -178188 173693 266245 -265490 162623 -300202 -207309 -93414 -173132 148777 -6575 74505
9717G5218a82920j71024i9633C99782j92065N0821a99048r6715J39483A82692
$$ 75218 -182920 -353944 -99633 399782 207717 258538 -199048 -295763 -156280 182692
9706a1959j05291q7328P1295j96770D9398a70028n8531F8118j553O6083b78155
$$ -11959 -117250 -204578 -133283 -330053 49398 -170028 -228559 68118 66565 132648 -278155
9694c48967a36503m4401j575B8979d7793I1316b69426J12937c1640A90393b24417
$$ -348967 -136503 -180904 -182479 28979 -47793 91316 -269426 -156489 -31640 190393 -224417
9682g6756C1J12020N2992a69396k00108g0822k93687A29042e3335k6557G0020
$$ -76756 31 112051 165043 -169396 -369504 -70822 -364509 129042 -53335 -79892 70020
9670b21400B94249a17404C0270b9473A65496a75203i934k78786b6717j15435b8461
$$ -221400 294249 -117404 30270 -29473 165496 -175203 -9934 -288720 -26717 -142152 -28461
9658G7151O9293f8477G0327E548b2075O395A02951K6384d42708h7275p5667p7874
$$ 77151 146444 -68477 70327 5548 -22075 -15680 102951 129335 -442708 -87275 -162942 -240816
9646b40816A98845a49373j63199E4911h5842b9747A2512b59989J28902j14352
$$ -240816 198845 -149373 -312572 54911 -85842 -29747 12512 -259989 -131087 -245439
9636b45439m4831d1946D4446e5711k69131C6394M2385J8776B0972H450b31104
$$ -245439 -290270 -41946 44446 -55711 -324842 36394 78779 97555 20972 8450 -231104
9624g4895k0786l5116A11181a25571A90979a83565C07968j10913P0201b30436
$$ -74895 -95681 -130797 111181 -125571 190979 -183565 307968 197055 267256 -230436
9613a01597G6557b64107b8445J2305B12676d0167k20485O1536N6450j08298L0954
$$ -101597 76557 -264107 -28445 -16140 212676 -40167 -260652 -199116 -142666 -250964 -220010
9602b20010I1537k061f7831k82032d7241o4399A43138D0663L7582A8812a10065
$$ -220010 91537 89476 -67831 -349863 -47241 -111640 143138 40663 78245 18812 -110065
9590c28491J38260q4227m9684B4114O9097m2626J59879a6078j85553E9213i4664
$$ -328491 -190231 -274458 -324142 24114 93211 50585 210464 -16078 -201631 59213 -94664
9578i7217j19357L3214E0669C083a19368o3076A10787J36936a18905j12803A51635
$$ -97217 -216574 -183360 50669 3083 -119368 -182444 110787 247723 -118905 -231708 151635
9566F1i7721A32728b19208i2881j21566e1568H8455a8026A72389g470C6599c38115
$$ 61 -97721 132728 -219208 -92881 -214447 -51568 88455 -18026 172389 -7470 36599 -338115
9553c37961A49470k8811J4542B839b62044J17539d3324k9416j78842J0987f2709
$$ -337961 149470 120659 135201 2839 -262044 -144505 -43324 -72740 -251582 -240595 -62709
9541a22486B60320f77544E4719a05050A61865B1336f7221B02223c27341J48030
$$ -122486 260320 -677544 54719 -105050 161865 21336 -67221 202223 -327341 -179311
9531a79311A33143B0212J2523c20914h910C2703a04655n0980B34128b00617J4699
$$ -179311 133143 20212 32735 -320914 -8910 32703 -104655 -155635 234128 -200617 -185918
9520a85918G7497j1134a09221q1421C04513a00033E6951h4047j8966j2376p1919
$$ -185918 77497 66363 -109221 -190642 304513 -100033 56951 -84047 -103013 -115389 -187308
9509a87308l10253F7175L0286b31362a14839j41622a22770j17796R6665H5988
$$ -187308 -497561 67175 97461 -231362 -114839 -256461 -122770 -240566 -143901 85988
9498b91813A42826a40246A08671a50752B33047i0117E7561O8406c86745A30369
$$ -291813 142826 -140246 108671 -150752 233047 -90117 57561 125967 -386745 130369
9487B01431d8851M512a1236j80436k81342J16532h0496N531j01487Q7666h680
$$ 201431 -48851 -44339 -11236 -191672 -473014 -356482 -80496 -74965 -176452 -88786 -8680
9475c98902a58928C5996d12711O4040a64802G1686b29952A40809C043J80603H8717
$$ -398902 -158928 35996 -412711 -348671 -164802 71686 -229952 140809 3043 183646 88717
9463g8792p9117k7015G4893b76413R7013A41449a76956A22492E9858d48245B5845
$$ -78792 -157909 -184924 74893 -276413 -179400 141449 -176956 122492 59858 -448245 25845
9451b23981m2149N154b6530j43017A53515c5802j16536d7419j13780A82223K56446
$$ -223981 -266130 -260976 -26530 -169547 153515 -35802 -152338 -47419 -161199 182223 438669
9440D38669a72499A23140k5415b51523g8777A14360D0042A4308P0621J6860C0892
$$ 438669 -172499 123140 97725 -251523 -78777 114360 40042 14308 84929 101789 30892
9428a22029A12512A1856c04915F4218J02701M4371a39477E2379R6584b24854a0971
$$ -122029 112512 11856 -304915 64218 166919 211290 -139477 52379 148963 -224854 -10971
9416D4170L3792c55264A48994a44474A39226f8398A86063E5995i3305j21512j39821
$$ 44170 77962 -355264 148994 -144474 139226 -68398 186063 55995 -93305 -214817 -354638
9405c54638a1258k0066B80274F8909d84971C10491A22043a54678K1260j05977
$$ -354638 -11258 -31324 280274 68909 -484971 310491 122043 -154678 -133418 -239395
9395b39395b5921j48178n8301M3038k68767c0871J2682C5127L4343L1295q674
$$ -239395 -25921 -174099 -232400 -189362 -458129 -30871 -18189 35127 69470 100765 92091
9384I2091g3001M197k57629h5386A62204L7828m9201m5937g7983f230k93281G8738
$$ 92091 -73001 -68804 -326433 -85386 162204 200032 150831 104894 -77983 -6230 -299511 78738
9371b7867j30392D6831N7740N6689n9348J18277E7579d7982e358l31433f3014
$$ -27867 -158259 46831 104571 161260 101912 220189 57579 -47982 -5358 -336791 -63014
9359b2881j70103N971b2297o226A17052a18685A8445P668M0481a10079A6236b57213
$$ -22881 -192984 -187013 -22297 -28523 117052 -118685 18445 26113 66594 -110079 16236 -257213
9346d9813C01128a54592C0898b87562A68992b33140R8278r66m2011G9417K34548
$$ -49813 301128 -154592 30898 -287562 168992 -233140 -134862 -135828 -177839 79417 313965
9335C13965c24654c3278k27416A94562b65500B0373b17364B74422d4160k4775
$$ 313965 -324654 -33278 -260694 194562 -265500 20373 -217364 274422 -44160 -68935
9325f8935e725A48780B186c96735A2081a42452F3926a3330l20608D2673b77729
$$ -68935 -5725 148780 2186 -396735 12081 -142452 63926 -13330 -333938 42673 -277729
9313B911a00272O447M2621n1639b3262D4856d67823c4881n080j78708I0538b57386
$$ 2911 -100272 -93825 -51204 -102843 -23262 44856 -467823 -34881 -39961 -218669 90538 -257386
9300A8588b45723K3050B90683i9023n06068a8372H0535b17135B3766a62949A3248
$$ 18588 -245723 -222673 290683 -99023 -605091 -18372 80535 -217135 23766 -162949 13248
9288a46533a1461o3827j25221P3683e0239D01770e6075k05756j31210i2795B16730
$$ -146533 -11461 -75288 -200509 -126826 -50239 401770 -56075 -261831 -393041 -92795 216730
9276a91599E3821d16087G4184a04106p9395d8550k38150a17777b1306j2777j2511
$$ -191599 53821 -416087 74184 -104106 -183501 -48550 -286700 -117777 -21306 -34083 -46594
9265d6594j14198l0738P785P5338A26502a42211l5723h4860l19750A35077a31946
$$ -46594 -160792 -191530 -183745 -108407 126502 -142211 -177934 -84860 -404610 135077 -131946
9253A04632a26363B14075H4727M1857d9786l26051A33238c47910a1296A94609
$$ 104632 -126363 214075 84727 126584 -49786 -375837 133238 -347910 -11296 194609
9242a36707f6237j40796B30470K00177b93571a43652j77524e8233A7879f7662
$$ -136707 -66237 -207033 230470 430647 -293571 -143652 -321176 -58233 17879 -67662
9231I2083e0725G881b5253j67287M9941d5303k90922H7335a13205F9002b71451
$$ 92083 -50725 7881 -25253 -192540 -142599 -45303 -336225 87335 -113205 69002 -271451
9219C11222d3390B24582a17359A7407e2525H9867a83298d1492n8667l5827H9422
$$ 311222 -43390 224582 -117359 17407 -52525 89867 -183298 -41492 -100159 -135986 89422
9207A2717a64266B12835C5531b06900f8366A17982a75659r139j24175E1364b4672
$$ 12717 -164266 212835 35531 -206900 -68366 117982 -175659 -184798 -308973 51364 -24672
9195a8624l04751E5432l099b0052B58196c8062A80193n4553e72452b80950d6423
$$ -18624 -323375 55432 52333 -20052 258196 -38062 180193 125640 -572452 -280950 -46423
9183B81435E0088J28988m543g4214B16058c60219a03643B679K21696n5387c3840
$$ 281435 50088 179076 174533 -74214 216058 -360219 -103643 2679 224375 168988 -33840
9171b4539C9455c76098A13844a68895j32193g5883A1260b3067j89960C5232c75649
$$ -24539 39455 -376098 113844 -168895 -301088 -75883 11260 -23067 -213027 35232 -375649
9159B10917a12690j17622G0522l2273b6628m4530B50592k1093e0989j06243b5804
$$ 210917 -112690 -230312 70522 38249 -26628 -71158 250592 229499 -50989 -157232 -25804
9147A79949h3034l2100c4507B85375b41064A308J01626a65312G4988e01467B5626
$$ 179949 -83034 -115134 -34507 285375 -241064 1308 102934 -165312 74988 -501467 25626
9135A09810R2062c9796j26402n226d855A0990a91214L3662G472a05172K9622I4920
$$ 109810 201872 -39796 -166198 -171424 -4855 10990 -191214 -157552 7472 -105172 -75550 94920
9122a25118k32311i8101f168j39230A22551L73852H1726a8398A62508i9544l5371
$$ -125118 -357429 -98101 -6168 -145398 122551 496403 81726 -18398 162508 -99544 -134915
9111a34915B8460d85670J59247i9936A7751M8046b03111A48559J93296j30925
$$ -134915 28460 -485670 -326423 -99936 17751 65797 -203111 148559 341855 210930
9101B10930h6225G0276g2392k11052A77059q8186a40930e5023k6229m4704p3397
$$ 210930 -86225 70276 -72392 -283444 177059 88873 -140930 -55023 -81252 -125956 -199353
9090a99353A22266i0863o6863a0404l45607J74611H7447d44266b20770A86188
$$ -199353 122266 -90863 -157726 -10404 -356011 -181400 87447 -444266 -220770 186188
9079a17677A69646F4571d0917m8347B17100b18074G5669c22794C6417a05899A40529
$$ -117677 169646 64571 -40917 -89264 217100 -218074 75669 -322794 36417 -105899 140529
9067E1007g0167m6106k6086m0664C40403j62382f6011A23081a43462l7456j2771
$$ 51007 -70167 -116273 -142359 -183023 340403 178021 -66011 123081 -143462 -180918 -193689
9056a93689L8869k07731a03714G8480A7982b14828C4520J82035A07876a61727
$$ -193689 -154820 -362551 -103714 78480 17982 -214828 34520 216555 107876 -161727
9045A15568A1119e6552K0938K412j25358F5965a23656m69350g9977k9020k69101
$$ 115568 11119 -56552 -35614 -33202 -158560 65965 -123656 -593006 -79977 -108997 -378098
9034c78098A15778b48090g8178D32434A24844d5501j57498b8971l55132a22367
$$ -378098 115778 -248090 -78178 432434 124844 -45501 -202999 -28971 -384103 -122367
9023a3214l2055m359H3510B53a50486p413e7066l13608A98616E9697a77921e9590
$$ -13214 -45269 -49628 83510 253 -150486 -157899 -57066 -370674 198616 59697 -177921 -59590
9010C3884g8417E65488g1757G2099a82417L132r421D225K4307a45751A99717i0586
$$ 33884 -78417 565488 -71757 72099 -182417 -179285 -188706 4225 28532 -145751 199717 -90586
8997A12733a65313g0407j77203J07204l5641j06720O296g1757C44595f01619F3422
$$ 112733 -165313 -70407 -247610 -140406 -176047 -282767 -276471 -71757 344595 -601619 63422
8985H0447e9036o5808A62781a1195B26792b04235E1083a12039A22396c8716b137
$$ 80447 -59036 -124844 162781 -11195 226792 -204235 51083 -112039 122396 -38716 -2137
8973A7715i0813A12530k2926a16427A07339h060j21820q3702B880N2996e88986
$$ 17715 -90813 112530 89604 -116427 107339 -8060 -129880 -213582 2880 55876 -588986
8961c95302A91453d4376A70603p1748a45958F0928j7715R4940b37210P1586l8808
$$ -395302 191453 -44376 170603 98855 -145958 60928 43213 138153 -237210 -165624 -204432
8950b04432m8575c6109o3181k8847j09550i0721m07193A28198Q6257h9146k48663
$$ -204432 -253007 -36109 -99290 -128137 -237687 -90721 -497914 128198 214455 -89146 -337809
8939c37809J37529r0993i6445C9246J20504K36545A88162F9190a66525k21257
$$ -337809 -200280 -291273 -96445 39246 159750 396295 188162 69190 -166525 -387782
8929c87782a16417J3506A53788M13813R4660J099277K311737N652804J2837778
$$ -387782 -116417 -102911 153788 567601 662261 1761538 4073275 9726079 22563857
8920B2563857G768565C203900H79962M7293l52494A86398B8951K1032K19298G1053
$$ 22563857 7768565 3203900 879962 927255 574761 186398 28951 49983 269281 71053
8909g3024E38291j4152k60837B4703h8308D4707A3758c80594A66504e8748A45256
$$ -73024 538291 524139 263302 24703 -88308 44707 13758 -380594 166504 -58748 145256
8897a02006j46909e3593j02286A74446b04848I1002J13084a32276C1601C662c92857
$$ -102006 -248915 -53593 -155879 174446 -204848 91002 204086 -132276 31601 3662 -392857
8885i4198j95844h1548A38055a49154r6677g0225B19867a56948A83219h6915A29322
$$ -94198 -290042 -81548 138055 -149154 -245831 -70225 219867 -156948 183219 -86915 129322
8873A32720J62202l6851e0973C90440d3165C8816c2837k88584f3893p1109j31550
$$ 132720 294922 258071 -50973 390440 -43165 38816 -32837 -321421 -63893 -135002 -266552
8862b66552I0300c7897j61638r0872h3220I7091L4288c38750A48984d1495m17234
$$ -266552 90300 -37897 -199535 -290407 -83220 97091 131379 -338750 148984 -41495 -458729
8851d58729A05625D2816J43377n1753a50605C7463c7703j4952A50707E4436h8925
$$ -458729 105625 42816 186193 134440 -150605 37463 -37703 -52655 150707 54436 -88925
$$ [...]
##END NTUPLES=NMR SPECTRUM
##END=
