
##TITLE=UV1214_M5_1296-1170_5_7229414_toPqwDcDj9
##JCAMPDX= 6.0         $$ Bruker NMR JCAMP-DX V2.0
##DATA TYPE= NMR SPECTRUM
##DATA CLASS= NTUPLES
##ORIGIN= BRUKER
##OWNER= Administrator
$$ 1.72 TOPSPIN		Version 2.1
$$ 2013-01-18 03:18:40.824 -0500  Administrator@X
$$ Compression mode = diff/dup
##.OBSERVE FREQUENCY= 400.02188249412
##.OBSERVE NUCLEUS= ^1H
##.ACQUISITION MODE= SIMULTANEOUS (DQD)
##.ACQUISITION SCHEME= undefined
##.AVERAGES= 64
##.DIGITISER RES= 22
##SPECTROMETER/DATA SYSTEM= spect
##.PULSE SEQUENCE= noesygpps1d.comp
##.SOLVENT NAME= COFFEE_meoh
##.SHIFT REFERENCE= INTERNAL, COFFEE_meoh, 1, 14.96109
##AUDIT TRAIL= $$ (NUMBER, WHEN, WHO, WHERE, PROCESS, VERSION, WHAT)
$$ ##TITLE= Audit trail, TOPSPIN		Version 2.1
$$ ##JCAMPDX= 5.01
$$ ##ORIGIN= Bruker BioSpin GmbH
$$ ##OWNER= Administrator
$$ $$ E:\/data/COFFEE/nmr/UV1214_M5_1296-1170_5_7229414_toPqwDcDj9/22/pdata/1/auditp.txt
$$ ##AUDIT TRAIL=  $$ (NUMBER, WHEN, WHO, WHERE, PROCESS, VERSION, WHAT)
(   1,<2013-01-18 03:18:35.152 -0500>,<Administrator>,<X>,<go>,<TOPSPIN 2.1>,
      <created by zg
	started at 2013-01-18 03:07:05.324 -0500,
	POWCHK enabled, PULCHK disabled,
       configuration hash MD5:
       86 BA 57 50 F2 9D 5C 9B 26 00 A9 28 5F 66 2E 89
       data hash MD5: 64K
       C1 25 13 CC 78 34 39 89 2E BE 5A 5E 29 EB B2 F2>)
(   2,<2013-01-18 03:18:38.183 -0500>,<Administrator>,<X>,<proc1d>,<TOPSPIN 2.1>,
      <Start of raw data processing
       efp LB = 0.3 FT_mod = 6 PKNL = 1 PHC0 = 0 PHC1 = 0 SI = 128K 
       data hash MD5: 128K
       1C 23 1D 12 0D 37 6E 35 4F F6 47 EF F4 66 48 5D>)
(   3,<2013-01-18 03:18:39.215 -0500>,<Administrator>,<X>,<proc1d>,<TOPSPIN 2.1>,
      <pk PHC0 = -79.90356 PHC1 = 0 
       data hash MD5: 128K
       BC 33 D7 06 BB 1F 92 0C EF 65 36 9E CC A9 80 CB>)
(   4,<2013-01-18 03:18:39.855 -0500>,<Administrator>,<X>,<proc1d>,<TOPSPIN 2.1>,
      <abs ABSG = 1 
       data hash MD5: 128K
       0B 6E 1D C8 A3 41 61 8E 72 64 B1 98 02 B2 EC 05>)
(   5,<2013-01-18 03:18:40.027 -0500>,<Administrator>,<X>,<proc1d>,<TOPSPIN 2.1>,
      <abs ABSG = 2 
       data hash MD5: 128K
       31 47 8D 44 38 BC 59 B1 C7 0C FD 52 EA B1 2A 69>)
(   6,<2013-01-18 03:18:40.183 -0500>,<Administrator>,<X>,<proc1d>,<TOPSPIN 2.1>,
      <abs ABSG = 3 
       data hash MD5: 128K
       9E 66 00 63 23 2C FD BA 74 C8 71 51 76 63 3C 6C>)
(   7,<2013-01-18 03:18:40.355 -0500>,<Administrator>,<X>,<proc1d>,<TOPSPIN 2.1>,
      <abs ABSG = 4 
       data hash MD5: 128K
       3F D9 14 D1 88 4A 62 77 36 9D 4D 9D 16 64 DF EE>)
(   8,<2013-01-18 03:18:40.512 -0500>,<Administrator>,<X>,<proc1d>,<TOPSPIN 2.1>,
      <abs ABSG = 5 
       data hash MD5: 128K
       1F 55 0B 33 CC B3 D7 4B 26 2F 57 10 74 3F FA 4B>)
$$ ##END=
$$ 
$$ $$ hash MD5
$$ $$ 5B CB 1C 47 D9 41 C8 90 B2 3D A2 2E 46 23 E8 6A
##$RELAX= 
##$RELAX= 
##$RELAX= 
##$RELAX= 
##$RELAX= 
##$RELAX= 
##$RELAX= 
##$RELAX= 
$$ Bruker specific parameters
$$ --------------------------
##$DU= <E:\>
##$EXPNO= 22
$$ [...]
##$TP07= 0
##$TPNAME0= <>
##$TPNAME1= <>
##$TPNAME2= <>
##$TPNAME3= <>
##$TPNAME4= <>
##$TPNAME5= <>
##$TPNAME6= <>
##$TPNAME7= <>
##$TPOAL= (0..7)
0.5 0.5 0.5 0.5 0.5 0.5 0.5 0.5
##$TPOFFS= (0..7)
0 0 0 0 0 0 0 0
##$TUNHIN= 0
##$TUNHOUT= 0
##$TUNXOUT= 0
##$USERA1= <user>
##$USERA2= <user>
##$USERA3= <user>
##$USERA4= <user>
##$USERA5= <user>
##$V9= 5
##$VALIST= <valist>
##$VCLIST= <CCCCCCCCCCCCCCC>
##$VD= 0
##$VDLIST= <DDDDDDDDDDDDDDD>
##$VPLIST= <PPPPPPPPPPPPPPP>
##$VTLIST= <TTTTTTTTTTTTTTT>
##$WBST= 1024
##$WBSW= 4
##$XGAIN= (0..3)
0 0 0 0
##$XL= 0
##$YL= 0
##$YMAX_a= 6315001
##$YMIN_a= -13575613
##$ZGOPTNS= <>
##$ZL1= 120
##$ZL2= 120
##$ZL3= 120
##$ZL4= 120
##$ABSF1= 14.96109
##$ABSF2= -5.597092
##$ABSG= 5
##$ABSL= 3
##$ALPHA= 0
##$AQORDER= 0
##$ASSFAC= 0
##$ASSFACI= 0
##$ASSFACX= 0
##$ASSWID= 0
##$AUNMP= <proc_prof1d_extract.lims>
##$AXLEFT= 0
##$AXNAME= <>
##$AXNUC= <1H>
##$AXRIGHT= 0
##$AXTYPE= 0
##$AXUNIT= <>
##$AZFE= 0.1
##$AZFW= 0.1
##$BCFW= 0
##$BC_mod= 0
##$BYTORDP= 0
##$COROFFS= 0
##$CY= 15
##$DATMOD= 1
##$DC= 0
##$DFILT= <>
##$DTYPP= 0
##$F1P= 0
##$F2P= 0
##$FCOR= 0.5
##$FTSIZE= 131072
##$FT_mod= 6
##$GAMMA= 0
##$GB= 0
##$INTBC= 1
##$INTSCL= 1
##$ISEN= 128
##$LB= 0.3
##$LEV0= 0
##$LPBIN= 0
##$MAXI= 10000
##$MC2= 0
##$MEAN= 0
##$ME_mod= 0
##$MI= 0
##$NCOEF= 0
##$NC_proc= -2
##$NLEV= 6
##$NOISF1= 0
##$NOISF2= 0
##$NSP= 0
##$NTH_PI= 0
##$NZP= 0
##$OFFSET= 14.96109
##$PC= 1
##$PHC0= -79.90356
##$PHC1= 0
##$PH_mod= 1
##$PKNL= yes
##$PPARMOD= 0
##$PPDIAG= 0
##$PPIPTYP= 0
##$PPMPNUM= 2147483647
##$PPRESOL= 1
##$PSCAL= 4
##$PSIGN= 0
##$PYNMP= <proc.py>
##$REVERSE= no
##$SF= 400.020009601932
##$SI= 131072
##$SIGF1= 0
##$SIGF2= 0
##$SINO= 400
##$SIOLD= 131072
##$SPECTYP= <>
##$SREGLST= <1H.CDCl3>
##$SSB= 0
##$STSI= 131072
##$STSR= 0
##$SW_p= 8223.68421052631
##$SYMM= 0
##$S_DEV= 0
##$TDeff= 65536
##$TDoff= 0
##$TI= <>
##$TILT= no
##$TM1= 0
##$TM2= 0
##$TOPLEV= 0
##$USERP1= <user>
##$USERP2= <user>
##$USERP3= <user>
##$USERP4= <user>
##$USERP5= <user>
##$WDW= 1
##$XDIM= 131072
##$YMAX_p= 433473991
##$YMIN_p= -11348
##$CURPLOT= <Network HP LaserJet P1505>
##$CURPRIN= <$Network HP LaserJet P1505>
##$DFORMAT= <normdp>
##$LAYOUT= <+/1D_H.xwp>
##$LFORMAT= <normlp>
##$PFORMAT= <normpl>
##$SURQMSG= 1
$$ End of Bruker specific parameters
$$ ---------------------------------
##NTUPLES= NMR SPECTRUM
##VAR_NAME=  FREQUENCY,     SPECTRUM/REAL,   SPECTRUM/IMAG
##SYMBOL=    X,             R,               I
##VAR_TYPE=  INDEPENDENT,   DEPENDENT,       DEPENDENT
##VAR_FORM=  AFFN,          ASDF,            ASDF
##VAR_DIM=   131072,        131072,          131072
##UNITS=     HZ,            ARBITRARY UNITS, ARBITRARY UNITS
##FACTOR=    0.0627417313425164, 1,          1
##FIRST=     8223.62146879497, 2648,         -67667
##LAST=      0,             5351,            -67201
##MIN=       0,             -11348,          0
##MAX=       8223.62146879497, 433473991,    0
$$ Real data points
##PAGE= N=1
##DATA TABLE= (X++(R..R)), XYDATA
$$ [...]
$$ plain form
63904 1402790 1308801 1225093 1150493 1084471 1026887 977420 935051 898245 865737 836875 811225
63893 811225 788323 767950 750010 733853 718260 702517 687003 672408 658972 646946 637151 630348
63881 630348 626449 624895 625463 628126 632525 638302 645703 655299 667407 682261 700360 721957 746512
63868 746512 773221 801739 831738 862233 892261 921986 952214 982850 1012651 1040439 1065734
63857 1065734 1088242 1107586 1123705 1136695 1146057 1150790 1150528 1146037 1138241 1127216 1112400 1093482
63845 1093482 1070855 1045363 1017684 987856 955584 921197 885984 851113 816556 781631 746312
63834 746312 711337 677283 644383 613118 584049 556971 531098 506348 483659 463734 446136
63823 446136 429931 414616 400098 386374 373664 362338 352317 342962 333900 325519 318341 312315
$$ packed form
63904A402790r3989q3708p4600o6022n7584m9467m2369l6806l2508k8862k5650
63893H11225k2902k0373j7940j6157j5593j5743j5514j4595j3436j2026r795o803
63881F30348l899j554N68K663M399N777P401R596J2108J4854J8099K1597K4555
63868G46512K6709K8518K9999L0495L0028K9725L0228L0636K9801K7788K5295
63857A065734K2508J9344J6119J2990R362M733k62m491p796j1025j4816j8918
63845A093482k2627k5492k7679k9828l2272l4387l5213l4871l4557l4925l5319
63834G46312l4975l4054l2900l1265k9069k7078k5873k4750k2689j9925j7598
63823D46136j6205j5315j4518j3724j2710j1326j0021r355r062q381p178o026
$$ plain form
63811 312315 307090 302538 298623 295106 291833 289010 286771 284706 282250 279376 276535 273996 271596 269103
63797 269103 266545 264129 261997 260048 257934 255324 252245 249113 246377 244268 242837 241989 241397 240593 239323
63782 239323 237683 235901 234144 232649 231776 231713 232199 232688 232782 232495 232096 231725 231176 230165 228828 227774 227532
63765 227532 228078 229031 230129 231266 232186 232413 231509 229416 226690 224382 223315 223312 223488 223446 223672 224411 224899 224429
63747 224429 223701 224164 226206 228878 231295 233373 235108 236193 236752 237614 239275 241120 242255 242722 243446 245194
63731 245194 247961 251131 253955 256043 257657 259416 261699 264593 268327 273198 278855 284205 288391 291548
63717 291548 294271 296771 298908 300656 302014 302721 302521 301623 300486 299208 297456 294924 291653 288052 284898
63702 284898 283124 283136 284349 285684 286594 287374 288543 290325 292818 296231 300562 305180 309103 311848 313854
$$ packed form
63811C12315n225m552l915l517l273k823k239k065k456k874k841k539k400k493
63797B69103k558k416k132j949k114k610l079l132k736k109j431q48n92q04j270
63782B39323j640j782j757j495q73o3M86M89R4k87l99l71n49j011j337j054k42
63765B27532N46R53J098J137R20K27r04k093k726k308j067lJ76m2K26P39M88m70
63747B24429p28M63K042K672K417K078J735J085N59Q62J661J845J135M67P24J748
63731B45194K767L170K824K088J614J759K283K894L734M871N657N350M186L157
63717B91548K723K500K137J748J358P07k00q98j137j278j752k532l271l601l154
63702B84898j774J2J213J335R10P80J169J782K493L413M331M618L923K745K006
$$ plain form
63687 313854 315953 318510 321231 323747 326091 328427 330459 331448 330937 329345 327664 326480 325350 323310 320140
63672 320140 316957 315269 315478 316610 317569 318265 319314 321056 323242 325425 327205 328172 328007 326688 324407
63657 324407 321347 317687 313629 309221 304359 299291 294849 291748 289765 287999 285877 283506 281177 279083
63643 279083 277530 276916 277279 278247 279564 281394 283958 287119 290477 293753 297066 300943 305920 311916 318157
63628 318157 324080 330143 337298 345710 354561 363248 372253 382578 394709 408454 423505 439780 457268
63615 457268 475818 495218 515458 536896 560093 585453 612983 642308 672710 703107 732298
63604 732298 759368 783599 803890 818757 827252 829667 827111 820792 811985 802090 792055 781994 771912
63591 771912 762342 753553 744400 732875 717901 699957 680064 658856 636681 613873 590817 568289
$$ packed form
63687C13854K099K557K721K516K344K336K032R89n11j592j681j184j130k040l170
63672C20140l183j688K09J132R59O96J049J742K186K183J780R67j65j319k281
63657C24407l060l660m058m408m862n068m442l101j983j766k122k371k329k094
63643B79083j553o14L63R68J317J830K564L161L358L276L313L877M977N996O241
63628C18157N923O063P155Q412Q851Q687R005J0325J2131J3745J5051J6275J7488
63615D57268J8550J9400K0240K1438K3197K5360K7530K9325L0402L0397K9191
63604G32298K7070K4231K0291J4867Q495K415k556o319q807r895j0035j0061j0082
63591G71912r570q789r153j1525j4974j7944j9893k1208k2175k2808k3056k2528
$$ plain form
63579 568289 547703 530274 515819 503072 491278 480858 472459 466222 462231 460876 462272 465812 470670
63566 470670 476306 482342 488595 495524 503961 513973 524483 534462 544035 554070 565253 578017 592829
63553 592829 609925 629031 649904 672989 699123 728778 761996 798693 838277 878667 916005
63542 916005 945821 964994 973062 971912 964155 951788 936376 919889 904567 891819 881646 873149
63530 873149 865128 856243 845272 831551 814851 794892 771518 745392 717804 689579 660745 631452
63518 631452 602574 575084 549371 525455 503295 482642 463229 445443 430151 417406 406003
63507 406003 394866 384357 375564 368718 363022 357767 352993 349052 345996 343414 340714 337679 334794 332701
63493 332701 331338 330080 328794 328069 328129 328251 327741 326881 326349 326308 326709 327984 330640 334423 338596 342819 347133
$$ packed form
63579E68289k0586j7429j4455j2747j1794j0420q399o237l991j355J396L540M858
63566D70670N636O036O253O929Q437J0012J0510R979R573J0035J1183J2764J4812
63553E92829J7096J9106K0873K3085K6134K9655L3218L6697L9584M0390L7338
63542I16005K9816J9173Q068j150p757j2367j5412j6487j5322j2748j0173q497
63530H73149q021q885j0971j3721j6700j9959k3374k6126k7588k8225k8834k9293
63518F31452k8878k7490k5713k3916k2160k0653j9413j7786j5292j2745j1403
63507D06003j1137j0509q793o846n696n255m774l941l056k582k700l035k885k093
63493C32701j363j258j286p25O0J22n10q60n32m1M01J275K656L783M173M223M314
$$ plain form
63476 347133 351272 354711 357388 359807 362352 364855 366882 368068 368165 367051 364756 361448 357468 353396 349794
63461 349794 346775 344083 341670 339805 338575 337756 337319 337538 338423 339653 341352 344280 348852 354526 360579
63446 360579 366926 373826 381474 390352 401224 414096 427927 442203 458180 477674 501095 527621
63434 527621 556724 588178 620628 651325 677643 698264 713082 722892 729401 734673 740177 746721
63422 746721 755255 767011 782756 802515 826188 853834 885100 918860 953555 987394 1018043 1042758
63410 1042758 1059435 1067581 1068255 1063313 1054718 1044092 1032447 1020213 1007548 994581 981343 967411
63398 967411 951626 932398 908743 881125 850976 819424 786971 754332 722711 692815 664335
63387 664335 636996 611503 588799 568872 551076 535212 521575 510261 501171 494382 489777 486678
$$ packed form
63476C47133M139L439K677K419K545K503K027J186R7j114k295l308l980m072l602
63461C49794l019k692k413j865j230q19m37K19Q85J230J699K928M572N674O053
63446C60579O347O900P648Q878J0872J2872J3831J4276J5977J9494K3421K6526
63434E27621K9103L1454L2450L0697K6318K0621J4818R810O509N272N504O544
63422G46721Q534J1756J5745J9759K3673K7646L1266L3760L4695L3839L0649K4715
63410A042758J6677Q146O74m942q595j0626j1645j2234j2665j2967j3238j3932
63398I67411j5785j9228k3655k7618l0149l1552l2453l2639l1621k9896k8480
63387F64335k7339k5493k2704j9927j7796j5864j3637j1314r090o789m605l099
$$ plain form
63375 486678 484654 484396 486844 491697 497782 504885 514143 526416 541210 557514 574936 593652 613854
63362 613854 635692 659427 685384 713907 745248 779135 814584 850550 886476 921648 954296
63351 954296 982129 1003706 1018579 1026459 1027362 1022590 1014388 1004278 992567 979736 967181 955923
63339 955923 945312 933599 919261 901418 879733 854626 827172 798255 768218 737672 708003
63328 708003 680497 655472 632920 613481 597934 586053 576865 570035 566128 565108 565067 562838 555844
63315 555844 543437 526883 508366 489832 472311 455966 440631 426323 413314 401775 391480
63304 391480 382044 373423 365889 359476 353797 348691 344593 341806 339717 337366 334679 332482 331224 330308
63290 330308 328839 326550 323742 320790 318033 315835 314389 313531 312907 312217 311324 310337 309659 309768 310810 312469
$$ packed form
63375D86678k024k58K448M853O085P103R258J2273J4794J6304J7422J8716K0202
63362F13854K1838K3735K5957K8523L1341L3887L5449L5966L5926L5172L2648
63351I54296K7833K1577J4873P880R03m772q202j0110j1711j2831j2555j1258
63339I55923j0611j1713j4338j7843k1685k5107k7454k8917l0037l0546k9669
63328G08003k7506k5025k2552j9439j5547j1881r188o830l907j020m1k229o994
63315E55844j2407j6554j8517j8534j7521j6345j5335j4308j3009j1539j0295
63304C91480r436q621p534o413n679n106m098k787k089k351k687k197j258r16
63290C30308j469k289k808k952k757k198j446q58o24o90q93r87o78J09J042J659
$$ plain form
63274 312469 314164 315350 315890 316305 317368 319179 320952 322088 323086 324824 327256 329542 331286 332941 335009
63259 335009 337535 340411 343449 346185 348337 350550 353868 358313 362765 366470 369889 373778 378311 383610
63245 383610 390276 398722 408497 418945 430076 442204 455205 468848 483525 499887 517932 537110
63233 537110 557251 578764 601865 626124 650906 675857 700893 726010 751239 776512 801413
63222 801413 825290 847780 869213 890374 911835 933561 955245 976905 998830 1020764 1041398
63211 1041398 1059050 1072788 1082529 1088153 1088969 1084185 1073529 1057368 1036457 1011634 983493 952411
63199 952411 919177 885497 853384 823981 797403 773680 753291 736685 723886 714856 709698 708170
63187 708170 709416 712622 717758 725381 735921 749280 764929 782130 800278 819174 838854 859139
$$ packed form
63274C12469J695J186N40M15J063J811J773J136R98J738K432K286J744J655K068
63259C35009K526K876L038K736K152K213L318M445M452L705L419L889M533N299
63245C83610O666Q446R775J0448J1131J2128J3001J3643J4677J6362J8045J9178
63233E37110K0141K1513K3101K4259K4782K4951K5036K5117K5229K5273K4901
63222H01413K3877K2490K1433K1161K1461K1726K1684K1660K1925K1934K0634
63211A041398J7652J3738R741N624Q16m784j0656j6161k0911k4823k8141l1082
63199I52411l3234l3680l2113k9403k6578k3723k0389j6606j2799r030n158j528
63187G08170J246L206N136P623J0540J3359J5649J7201J8148J8896J9680K0285
$$ plain form
63175 859139 879581 899826 919749 939289 958419 977208 995486 1012567 1027772 1041074 1052622
63164 1052622 1061756 1067282 1068707 1066334 1059968 1048543 1031451 1009365 983216 953216 919658 884035
63152 884035 848469 814342 782045 751700 723429 697234 673186 651473 631792 613185 595186
63141 595186 578721 565121 554417 545365 536948 529084 522034 515952 511098 507695 505261 502759 499698
63128 499698 496716 494780 494203 494664 495867 497813 500600 504206 508473 513239 518439 524010 529642 534737 538740
63113 538740 541501 543329 544893 547024 550227 554155 557868 560832 563364 565905 568331 570411 572434 574706
63099 574706 576687 577441 576929 576125 575702 575288 574360 573244 572646 572559 572253 571340 570312 569861 570079 570638 571514 573084
63081 573084 575466 578242 581114 584510 589135 595050 601638 608422 615415 622631 629826 636980 644567 652993
$$ packed form
63175H59139K0442K0245J9923J9540J9130J8789J8278J7081J5205J3302J1548
63164A052622R134N526J425k373o366j1425j7092k2086k6149l0000l3558l5623
63152H84035l5566l4127l2297l0345k8271k6195k4048k1713j9681j8607j7999
63141E95186j6465j3600j0704r052q417p864p050o082m854l403k434k502l061
63128D99698k982j936n77M61J203J946K787L606M267M766N200N571N632N095M003
63113E38740K761J828J564K131L203L928L713K964K532K541K426K080K023K272
63099E74706J981P54n12q04m23m14r28j116n98q7l06r13j028m51K18N59Q76J570
63081E73084K382K776K872L396M625N915O588O784O993P216P195P154P587Q426
$$ plain form
63067 652993 662116 671737 682304 694665 709307 726208 745320 766727 790335 815815 843062 872532
63055 872532 905044 941267 981359 1024916 1071272 1119992 1171079 1224706 1280755 1338660 1397575
63044 1397575 1456671 1515407 1573631 1631327 1688253 1743965 1798234 1851275 1903473 1955038 2005973
63033 2005973 2056177 2105417 2153179 2198494 2239794 2275090 2302609 2321281 2330380 2328841 2315363 2289281
63021 2289281 2251031 2201782 2143129 2077227 2006667 1933804 1860411 1788088 1718589 1653458 1593664
63010 1593664 1539878 1492842 1453182 1421074 1396355 1378835 1368402 1365011 1368649 1378955 1394860 1415039
62998 1415039 1438956 1466964 1499014 1533685 1568987 1603923 1638845 1674375 1710348 1745766 1779556
62987 1779556 1811325 1841439 1870325 1897649 1922237 1942582 1957228 1964866 1964652 1956387 1939972 1914852
$$ packed form
63067F52993R123R621J0567J2361J4642J6901J9112K1407K3608K5480K7247K9470
63055H72532L2512L6223M0092M3557M6356M8720N1087N3627N6049N7905N8915
63044A397575N9096N8736N8224N7696N6926N5712N4269N3041N2198N1565N0935
63033B005973N0204M9240M7762M5315M1300L5296K7519J8672R099j539j3478k6082
63021B289281l8250m9249n8653o5902p0560p2863p3393p2323o9499o5131n9794
63010A593664n3786m7036l9660l2108k4719j7520j0433l391L638J0306J5905K0179
62998A415039K3917K8008L2050L4671L5302L4936L4922L5530L5973L5418L3790
62987A779556L1769L0114K8886K7324K4588K0345J4646P638k14q265j6415k5120
$$ plain form
62975 1914852 1880656 1838275 1789507 1735567 1676825 1614152 1549370 1483917 1418104 1352459 1288860
62964 1288860 1229340 1174408 1123548 1076837 1034940 997775 964265 933393 904676 877656 851760
62953 851760 826815 803060 780598 759331 739327 720619 702674 684733 666795 649735 634363
62942 634363 620742 608426 596887 585733 574963 565102 556746 549957 544340 539541 535297 531273 527363
62929 527363 523964 521411 519304 516991 514630 513054 512520 512217 511202 509341 507177 505230 503660 502318 500979
62914 500979 499606 498282 496780 494506 491273 487821 485068 483014 480946 478583 476391 474800 473735 472958
62900 472958 472331 471628 470672 469786 469603 470239 471053 471407 471259 470910 470538 470213 470054 470144 470426 470757 471000 471139 471423
62881 471423 472147 473037 473275 472596 472079 473145 475847 478819 480837 481716 481633 480471 478300 475866 474002 472800
$$ packed form
62975A914852l4196m2381m8768n3940n8742o2673o4782o5453o5813o5645o3599
62964A288860n9520n4932n0860m6711m1897l7165l3510l0872k8717k7020k5896
62953H51760k4945k3755k2462k1267k0004j8708j7945j7941j7938j7060j5372
62942F34363j3621j2316j1539j1154j0770r861q356o789n617m799m244m024l910
62929E27363l399k553k107k313k361j576n34l03j015j861k164j947j570j342j339
62914E00979j373j324j502k274l233l452k753k054k068k363k192j591j065p77
62900D72958o27p03r56q86j83O36Q14L54j48l49l72l25j59R0K82L31K43J39K84
62881D71423P24Q90K38o79n17J066K702K972K018Q79q3j162k171k434j864j202
$$ plain form
62865 472800 471734 470423 468953 467615 466617 466016 465764 465786 465961 466027 465764 465442 465879 467625 470271 472872 474972
62848 474972 476801 478631 480456 482218 483785 484673 484335 482869 481001 479257 477584 475895 474482 473636 473233
62833 473233 472957 472725 472691 473007 473688 474536 475228 475654 476094 476820 477686 478464 479411 480998 483154 485309 487255 489501
62815 489501 492652 496838 501753 506849 511468 515340 519065 523592 529081 534723 539879 544922 550795 558102
62801 558102 566854 576622 586718 596607 606426 616831 628205 640444 653689 668811 686769 707849
62789 707849 731859 758832 789187 823316 861298 902944 948063 996864 1050253 1109522 1175560
62778 1175560 1248365 1327210 1410980 1498381 1588242 1679777 1772213 1864002 1952695 2035721 2111020
62767 2111020 2176791 2231044 2271752 2297317 2306797 2299961 2277388 2240359 2190441 2129273 2058748 1981056
$$ packed form
62865D72800j066j311j470j338r98o01k52K2J75O6k63l22M37J746K646K601K100
62848D74972J829J830J825J762J567Q88l38j466j868j744j673j689j413q46m03
62833D73233k76k32l4L16O81Q48O92M26M40P26Q66P78R47J587K156K155J946K246
62815D89501L151M186M915N096M619L872L725M527N489N642N156N043N873P307
62801E58102Q752R768J0096R889R819J0405J1374J2239J3245J5122J7958K1080
62789G07849K4010K6973L0355L4129L7982M1646M5119M8801N3389N9269O6038
62778A175560P2805P8845Q3770Q7401Q9861R1535R2436R1789Q8693Q3026P5299
62767B111020O5771N4253M0708K5565R480o836k2573l7029m9918o1168p0525p7692
$$ plain form
62755 1981056 1898306 1812172 1724026 1635253 1547314 1461644 1379510 1301797 1228889 1160901 1098043
62744 1098043 1040501 988019 939988 896065 856389 820983 789289 760579 734660 711834 692181
62733 692181 675194 660242 647238 636567 628241 621415 615118 609442 605493 603915 603914 604102 604013 604313 605736
62718 605736 608403 612142 616966 623134 630938 640494 651584 663934 677853 694313 714024 736751 761931
62705 761931 789650 820444 854491 891764 932867 978882 1030233 1086287 1146127 1209236 1275397
62694 1275397 1344541 1416762 1491821 1568434 1644464 1717808 1786620 1848735 1901743 1943838 1973941
62683 1973941 1990861 1993165 1980339 1953497 1914482 1864754 1805630 1739039 1667328 1592393 1515458
62672 1515458 1437703 1360724 1286204 1215243 1148170 1085124 1026726 973767 926095 882397 841592
$$ packed form
62755A981056q2750q6134q8146q8773q7939q5670q2134p7713p2908o7988o2858
62744A098043n7542n2482m8031m3923l9676l5406l1694k8710k5919k2826j9653
62733F92181j6987j4952j3004j0671q326o826o297n676l949j578jJ88q9L00J423
62718F05736K667L739M824O168P804R556J1090J2350J3919J6460J9711K2727K5180
62705G61931K7719L0794L4047L7273M1103M6015N1351N6054N9840O3109O6161
62694A275397O9144P2221P5059P6613P6030P3344O8812O2115N3008M2095L0103
62683A973941J6920K304j2826k6842l9015m9728n9124o6591p1711p4935p6935
62672A515458p7755p6979p4520p0961o7073o3046n8398n2959m7672m3698m0805
$$ plain form
62661 841592 804021 770633 741349 715049 690969 669217 649950 632936 617979 604868 592718
62650 592718 580340 567584 555577 545298 536608 528956 522164 516102 510380 504903 500159 496460 493460
62637 493460 490836 488798 487415 486059 484106 481734 479479 477434 475364 473226 471039 468626 466044 463947
62623 463947 463026 463225 463868 464354 464511 464622 465321 467138 469943 473158 476639 480832 485904 491358 496843 502716
62607 502716 509428 516927 525142 534550 545743 558808 573466 589446 606479 624548 644577 668301
62595 668301 696893 730073 766789 806150 847359 889553 932409 976281 1020965 1064712 1105079
62584 1105079 1140348 1169612 1192072 1207061 1214391 1213953 1205299 1188304 1163979 1134021 1099802 1062320
62572 1062320 1022651 981824 940515 899447 859639 821634 785023 749575 716414 687044 661432
$$ packed form
62661H41592l7571l3388k9284k6300k4080k1752j9267j7014j4957j3111j2150
62650E92718j2378j2756j2007j0279q690p652o792o062n722n477m744l699l000
62637D93460k624k038j383j356j953k372k255k045k070k138k187k413k582k097
62623D63947r21J99O43M86J57J11O99J817K805L215L481M193N072N454N485N873
62607E02716O712P499Q215R408J1193J3065J4658J5980J7033J8069K0029K3724
62595F68301K8592L3180L6716L9361M1209M2194M2856M3872M4684M3747M0367
62584A105079L5269K9264K2460J4989P330m38q654j6995k4325k9958l4219l7482
62572A062320l9669m0827m1309m1068l9808l8005l6611l5448l3161k9370k5612
$$ plain form
62561 661432 638103 616123 595999 578407 562960 548698 535256 523095 512785 504271 496806 489657
62549 489657 482924 477459 473790 471504 469910 468841 468338 467990 467202 465889 464380 462915 461724 461257 461661
62534 461661 462309 462526 462638 463678 466127 469563 473415 477578 482339 488227 495827 505294 516258 528621
62520 528621 543086 560303 579886 601143 624544 651509 682662 717126 753679 791898 831938
62509 831938 873895 917681 962951 1008669 1052998 1093894 1129749 1159534 1182634 1198674 1207419 1208865
62497 1208865 1203444 1191894 1174775 1152612 1126819 1099944 1074352 1050909 1029480 1010361 994472
62486 994472 982416 974174 969707 969107 972134 978313 987634 1000516 1016726 1034609 1051497 1064690 1072373
62473 1072373 1074271 1071519 1065420 1056108 1042590 1023891 999830 970955 938295 903123 866532 829209
$$ packed form
62561F61432k3329k1980k0124j7592j5447j4262j3442j2161j0310q514p465p149
62549D89657o733n465l669k286j594j069n03l48p88j313j509j465j191m67M04
62534D61661O48K17J12J040K449L436L852M163M761N888P600R467J0964J2363
62520E28621J4465J7217J9583K1257K3401K6965L1153L4464L6553L8219M0040
62509H31938M1957M3786M5270M5718M4329M0896L5855K9785K3100J6040Q745J446
62497A208865n421j1550j7119k2163k5793k6875k5592k3443k1429j9119j5889
62486I94472j2056q242m467o00L027O179R321J2882J6210J7883J6888J3193P683
62473A072373J898k752o099r312j3518j8699k4061k8875l2660l5172l6591l7323
$$ plain form
62461 829209 791886 755667 721460 689398 659411 632040 607994 587171 568918 553096 540042
62450 540042 529518 520626 512937 506874 502751 500126 498423 497583 497797 499059 501263 504351 508165 512450
62436 512450 517098 521973 526497 529881 531813 532475 531878 529657 525637 520133 513650 506686 499746 492982 485834
62421 485834 477728 469214 461716 455933 451055 445871 440082 434259 429020 424687 421344 418761 416439 414062
62407 414062 411822 410135 409144 408587 408071 407461 407036 407173 407786 408353 408698 409391 411001 413299 415668 418036 420776
62390 420776 423888 426981 430056 433676 438295 443836 449902 455963 461485 466434 471499 477303 483593 489843
62376 489843 496419 504308 513711 523797 533916 544240 555058 566233 577727 590001 603575 618649
62364 618649 635433 654425 676205 701348 730487 763960 801406 842302 886836 935545 988049
$$ packed form
62461H29209l7323l6219l4207l2062k9987k7371k4046k0823j8253j5822j3054
62450E40042j0524q892p689o063m123k625j703q40K14J262K204L088L814M285
62436E12450M648M875M524L384J932O62n97k221m020n504o483o964o940o764p148
62421D85834q106q514p498n783m878n184n789n823n239m333l343k583k322k377
62407D14062k240j687r91n57n16o10m25J37O13N67L45O93J610K298K369K368K740
62390D20776L112L093L075L620M619N541O066O061N522M949N065N804O290O250
62376D89843O576P889R403J0086J0119J0324J0818J1175J1494J2274J3574J5074
62364F18649J6784J8992K1780K5143K9139L3473L7446M0896M4534M8709N2504
$$ plain form
62353 988049 1042836 1098308 1153242 1206111 1254779 1297186 1331750 1357146 1372673 1379139 1378518 1372265
62341 1372265 1360581 1343502 1321740 1295961 1266122 1232254 1195315 1156647 1117122 1077396 1038560
62330 1038560 1001897 968222 937835 910771 886621 864516 843707 823976 805148 786554 767326
62319 767326 747027 725796 704219 683196 663524 645323 628137 611710 596237 581830 568274
62308 568274 555530 543925 533675 524699 517021 510771 505662 501134 497168 494240 492309 490673 489120
62295 489120 488305 488619 489571 490869 493197 497192 502336 507688 513103 519020 525585 532686 540293 548057 555191
62280 555191 561587 568503 577214 587429 597983 608651 620179 632802 646006 659812 675077 692136
62268 692136 710076 727888 745714 764470 784684 806167 828582 851955 876798 903958 934273
$$ packed form
62353I88049N4787N5472N4934N2869M8668M2407L4564K5396J5527O466o21o253
62341A372265j1684j7079k1762k5779k9839l3868l6939l8668l9525l9726l8836
62330A038560l6663l3675l0387k7064k4150k2105k0809j9731j8828j8594j9228
62319G67326k0299k1231k1577k1023j9672j8201j7186j6427j5473j4407j3556
62308E68274j2744j1605j0250q976p678o250n109m528l966k928j931j636j553
62295D89120q15L14R52J298K328L995N144N352N415N917O565P101P607P764P134
62280E55191O396O916Q711J0215J0554J0668J1528J2623J3204J3806J5265J7059
62268F92136J7940J7812J7826J8756K0214K1483K2415K3373K4843K7160L0315
$$ plain form
62257 934273 968223 1005871 1047115 1091798 1139516 1189391 1240019 1289598 1336191 1377969 1413240
62246 1413240 1440447 1458518 1467396 1468001 1461469 1448430 1428915 1402647 1369367 1329252 1283273 1232994
62234 1232994 1180007 1125744 1071745 1019522 969900 922831 878094 835955 797067 762077 731437
62223 731437 705219 682897 663587 646607 631543 617910 605324 594056 584725 577234 570598 564080
62211 564080 557899 552548 548057 544295 541426 539562 538461 537951 538177 539018 539783 539988 540076 541004 543457 547675
62195 547675 553420 559761 565541 570689 576544 584360 593926 604122 614238 624154 633833 643419 653480
62182 653480 664356 675567 686436 696934 707242 716828 724762 730787 735525 739928 745170 752712 763588
62169 763588 777654 794231 813475 836540 864462 897424 934936 976108 1019585 1063607 1106178
$$ packed form
62257I34273L3950L7648M1244M4683M7718M9875N0628M9579M6593M1778L5271
62246A413240K7207J8071Q878O05o532j3039j9515k6268l3280m0115m5979n0279
62234A232994n2987n4263n3999n2223m9622m7069m4737m2139l8888l4990l0640
62223G31437k6218k2322j9310j6980j5064j3633j2586j1268r331p491o636o518
62211E64080o181n351m491l762k869j864j101n10K26Q41P65K05Q8R28K453M218
62195E47675N745O341N780N148N855P816R566J0196J0116R916R679R586J0061
62182F53480J0876J1211J0869J0498J0308R586P934O025M738M403N242P542J0876
62169G63588J4066J6577J9244K3065K7922L2962L7512M1172M3477M4022M2571
$$ plain form
62158 1106178 1145089 1178226 1204382 1223584 1236312 1242804 1243517 1239573 1231825 1219823 1202575 1180183
62146 1180183 1153935 1124982 1093840 1061155 1028071 995637 964540 935528 909416 886549 866848
62135 866848 850426 837472 827345 818516 809807 801290 793775 787822 783515 780750 779337 778955 779209 779815
62121 779815 780796 782687 786354 792346 800412 809799 819665 828886 835886 839413 839594 837721 834935 831489 827295
62106 827295 822589 817739 812607 806392 798215 787944 776465 764982 754156 744287 736232 731310 729905
62093 729905 730846 732821 735846 740596 746806 753339 759688 766439 774204 782838 791780 800544 808838 816878
62079 816878 825708 836587 849906 865168 881985 900446 920464 941494 963164 985627 1008978 1032794
62067 1032794 1056585 1080442 1104988 1130874 1158394 1187352 1217140 1247018 1276175 1303360 1326762
$$ packed form
62158A106178L8911L3137K6156J9202J2728O492P13l944p748j2002j7248k2392
62146A180183k6248k8953l1142l2685l3084l2434l1097k9012k6112k2867j9701
62135H66848j6422j2954j0127q829q709q517p515n953m307k765j413l82K54O06
62121G79815R81J891L667N992Q066R387R866R221P000L527J81j873k786l446m194
62106H27295m706m850n132o215q177j0271j1479j1483j0826r869q055m922j405
62093G29905R41J975L025M750O210O533O349O751P765Q634Q942Q764Q294Q040
62079H16878Q830J0879J3319J5262J6817J8461K0018K1030K1670K2463K3351K3816
62067A032794K3791K3857K4546K5886K7520K8958K9788K9878K9157K7185K3402
$$ plain form
62056 1326762 1344676 1356267 1361463 1360539 1354301 1344255 1331760 1316988 1299238 1278110 1253713 1225903
62044 1225903 1194233 1158806 1120490 1080184 1038574 996762 956258 917923 881425 846116 811938
62033 811938 779203 748085 718824 692060 668468 648207 630886 615827 602244 589517 577558
62022 577558 566634 556688 547175 537705 528478 519817 511675 503892 496665 490442 485483 481736 479012 477128
62008 477128 476013 475813 476705 478560 480956 483624 486698 490489 495186 500797 507139 513765 520075 525562 529891
61993 529891 532854 534472 535074 534918 533735 530949 526383 520495 513843 506597 498649 490011 481034 472345 464520
61978 464520 457641 451308 445253 439817 435503 432181 429126 425839 422521 419780 418149 417855 418677 419968 421061
61963 421061 421689 421864 421520 420599 419464 418802 419032 420022 421422 423143 425459 428736 433029 437947 443126 448798
$$ packed form
62056A326762J7914J1591N196r24o238j0046j2495j4772j7750k1128k4397k7810
62044A225903l1670l5427l8316m0306m1610m1812m0504l8335l6498l5309l4178
62033H11938l2735l1118k9261k6764k3592k0261j7321j5059j3583j2727j1959
62022E77558j0924r946r513r470r227q661q142p783p227o223m959l747k724j884
62008D77128j115k00Q92J855K396K668L074L791M697N611O342O626O310N487M329
61993E29891K963J618O02j56j183k786m566n888o652p246p948q638q977q689p825
61978D64520o879o333o055n436m314l322l055l287l318k741j631k94Q22J291J093
61963D21061O28J75l44r21j135o62K30R90J400J721K316L277M293M918N179N672
$$ plain form
61947 448798 455502 463153 470965 478620 486982 497166 509341 522969 537753 553716 570698 588525
61935 588525 607367 627184 647017 665585 682489 698160 712841 726399 738946 750643 760820
61924 760820 768285 772762 775171 776226 775529 772513 767571 761766 755924 750539 746165 743414 742629 743863 747120
61909 747120 752561 760616 771719 785605 800949 816082 829979 842206 852160 859084 862772 863501 861126
61896 861126 854972 844884 831807 817022 801224 784594 767295 749607 731934 714902 699134 684740
61884 684740 671308 658470 646155 634266 622537 610832 599245 587889 576938 566834 557964 550147
61872 550147 542972 536669 532037 529366 528027 527353 527403 528624 531218 535201 540651 547580 555714 564650 574248
61857 574248 584929 597692 613513 632353 653018 674542 697510 723327 752330 783358 815172
$$ packed form
61947D48798O704P651P812P655Q362J0184J2175J3628J4784J5963J6982J7827
61935E88525J8842J9817J9833J8568J6904J5671J4681J3558J2547J1697J0177
61924G60820P465M477K409J055o97l016m942n805n842n385m374k751p85J234L257
61909G47120N441Q055J1103J3886J5344J5133J3897J2227R954O924L688P29k375
61896H61126o154j0088j3077j4785j5798j6630j7299j7688j7673j7032j5768j4394
61884F84740j3432j2838j2315j1889j1729j1705j1587j1356j0951j0104q870p817
61872E50147p175o303m632k671j339o74N0J221K594L983N450O929Q134Q936R598
61857E74248J0681J2763J5821J8840K0665K1524K2968K5817K9003L1028L1814
$$ plain form
61846 815172 847463 880199 912707 943832 972557 998080 1019571 1036129 1046987 1051848 1051223 1046220
61834 1046220 1037726 1026159 1012452 998711 987094 978321 972108 968703 969020 973409 981368 992293 1005368
61821 1005368 1018753 1030218 1038850 1044910 1047716 1045036 1035316 1019444 999528 976787 951358 923368
61809 923368 893337 862021 830493 799994 771236 744309 719528 697666 678936 662487 647411
61798 647411 633573 621035 609422 598491 588695 580576 574036 568644 564046 559672 554840 549635 545008
61785 545008 541401 538020 534059 529831 526008 522531 519213 516654 515490 515132 514318 512657 510733 508931 507169
61770 507169 505669 505003 505145 505144 504058 501893 499547 498075 497966 498973 500660 503010 506143 509526 512186 513900
61754 513900 515440 517260 518704 518993 518250 516910 514847 511901 508655 505791 503113 500135 497304 495632 495207
$$ packed form
61846H15172L2291L2736L2508L1125K8725K5523K1491J6558J0858M861o25n003
61834A046220q494j1567j3707j3741j1617q773o213l405L17M389P959J0925J3075
61821A005368J3385J1465Q632O060K806k680r720j5872j9916k2741k5429k7990
61809I23368l0031l1316l1528l0499k8758k6927k4781k1862j8730j6449j5076
61798F47411j3838j2538j1613j0931r796q119o540n392m598m374m832n205m627
61785E45008l607l381l961m228l823l477l318k559j164l58q14j661j924j802j762
61770E07169j500o66J42jj086k165k346j472j09J007J687K350L133L383K660J714
61754E13900J540J820J444K89p43j340k063k946l246k864k678k978k831j672m25
$$ plain form
61739 495207 494983 494109 492737 491450 490594 490343 490879 492144 493658 494813 495332 495473 495766 496496 497507 498757
61723 498757 500746 503875 507482 510350 512251 514166 516718 519291 521176 522672 524410 526286 527756 528544
61709 528544 528432 526973 524178 520911 517855 514623 510623 506219 502112 498122 493604 488779 484611 481451
61695 481451 478691 475737 472560 469250 465719 461946 458056 454089 449996 445722 441141 436209 431375 427377
61681 427377 424304 421404 418261 415468 413652 412441 411055 409303 407356 405219 403159 401933 401697 401359 400025
61666 400025 398469 398059 398746 399395 399694 400343 401489 402326 402400 402156 402034 402022 402261 403120 404438 405584 406494 407874
61648 407874 410172 413127 416453 420171 423993 427151 429225 430637 432055 433711 435400 436748 437358 437101 436266
61633 436266 435129 433527 431234 428386 424996 420527 414760 408744 403849 400029 396123 391886 388585 387243
$$ packed form
61739D95207k24q74j372j287q56k51N36J265J514J155N19J41K93P30J011J250
61723D98757J989L129L607K868J901J915K552K573J885J496J738J876J470P88
61709E28544j12j459k795l267l056l232m000m404m107l990m518m825m168l160
61695D81451k760k954l177l310l531l773l890l967m093m274m581m932m834l998
61681D27377l073k900l143k793j816j211j386j752j947k137k060j226k36l38j334
61666D00025j556m10O87O49K99O49J146Q37P4k44j22j2K39Q59J318J146R10J380
61648D07874K298K955L326L718L822L158K074J412J418J656J689J348O10k57q35
61633D36266j137j602k293k848l390m469n767o016m895l820l906m237l301j342
$$ plain form
61619 387243 387318 387603 387607 387537 387539 387556 387571 387512 387141 386310 385026 383123 380156 375884 370633 365075 359848 355420 352015
61600 352015 349479 347307 344897 341885 338454 335326 333070 331359 329345 326872 324670 323123 321633 319653
61586 319653 317545 315758 313968 311926 310408 310206 310698 310517 309262 307546 305772 304070 303073 303440 304689
61571 304689 305732 306481 307693 309316 310327 310385 310289 310534 310717 310747 311358 312810 314158 314517 314170 313822 313602 313489
61553 313489 313954 315371 317277 318898 320140 321522 323336 325231 326527 326795 326323 325969 326264 326838 327152 327575
61537 327575 329095 332116 336210 340827 345399 348909 350456 350433 350184 350285 350034 348856 347255 345958 344962 343912
61521 343912 342750 341569 340345 339130 337999 336644 334649 332363 330838 330666 331406 332223 332463 331643 329760
61506 329760 327732 326689 326677 326832 326896 327478 328615 329288 328896 328185 328121 328626 329038 329040 328611 327841 327309 327877 329508
$$ packed form
61619C87243P5K85Mp0KJ7J5n9l71q31j284j903k967m272n251n558n227m428l405
61600C52015k536k172k410l012l431l128k256j711k014k473k202j547j490j980
61586C19653k108j787j790k042j518k02M92j81j255j716j774j702r97L67J249
61571C04689J043P49J212J623J011N8r6K45J83L0O11J452J348L59l47l48k20j13
61553C13489M65J417J906J621J242J382J814J895J296K68m72l54K95N74L14M23
61537C27575J520L021M094M617M572L510J547k3k49J01k51j178j601j297r96j050
61521C43912j162j181j224j215j131j355j995k286j525j72P40Q17K40q20j883
61506C29760k028j043j2J55O4N82J137O73l92p11o4N05M12Km29p70n32N68J631
$$ plain form
61487 329508 330986 331394 331195 331306 331805 332208 332409 332691 333247 334202 335592 336950 337553 337510 337908 339344 341032
61470 341032 341949 342133 342210 342355 342512 343057 344317 345820 346798 347142 347257 347334 347422 347834 348781 349855 350493 350741 351017
61451 351017 351409 351783 352269 353038 353840 354349 354791 355658 356941 358132 358907 359386 359839 360524 361699 363480 365756
61434 365756 368431 371539 374920 378074 380642 382832 385115 387672 390241 392265 393129 392630 391396 390533 390757
61419 390757 392097 394274 396820 398892 399760 399668 399573 399897 400229 400362 400697 401236 401149 399890 398008 396235 394504
61402 394504 392506 390549 389062 387699 385748 383164 380586 378558 377213 376528 376396 376624 377116 377840 378510 378710
61386 378710 378475 378258 378231 378253 378566 379690 381328 382349 382308 382136 382807 384198 385832 387789 390090 392022 393091
61369 393091 393957 395533 397689 399785 401906 404570 407614 410385 412815 415486 418846 423022 428008 433284
$$ packed form
61487C29508J478M08j99J11M99M03K01K82N56R55J390J358O03m3L98J436J688
61470C41032R17J84P7J45J57N45J260J503R78L44J15P7Q8M12R47J074O38K48K76
61451C51017L92L74M86P69Q02N09M42Q67J283J191P75M79M53O85J175J781K276
61434C65756K675L108L381L154K568K190K283K557K569K024Q64m99j234q63K24
61419C90757J340K177K546K072Q68r2r5L24L32J33L35N39q7j259j882j773j731
61402C94504j998j957j487j363j951k584k578k028j345o85j32K28M92P24O70K00
61386C78710k35k17k7K2L13J124J638J021m1j72O71J391J634J957K301J932J069
61369C93091Q66J576K156K096K121K664L044K771K430K671L360M176M986N276
$$ plain form
61355 433284 437741 440924 444083 449060 456332 464923 473938 483221 492683 501995 510996 519555 526962 532340
61341 532340 535858 538848 542453 546581 550328 552998 554629 555877 557405 559087 559888 558831 556000 552312
61327 552312 548490 544606 540445 535991 531643 528114 525791 524062 521773 518660 515809 514333 514154 514588 515438
61312 515438 516915 519020 521821 525904 531785 539219 547766 557666 569372 582540 596208 609664 622315
61299 622315 633028 640624 645056 647344 648287 647852 645770 642020 636727 630152 622838 615358 608002 601034
61285 601034 594924 589767 584828 579341 573563 568455 564588 561968 560585 560312 560533 560766 561519 563655 566968
61270 566968 570257 572858 575230 577965 581127 584749 589091 594015 598867 603530 609028 616502 625817 635636
61256 635636 644709 652772 660216 667150 673015 677202 679935 682126 684195 685396 684666 681810 677475 672275
$$ packed form
61355D33284M457L183L159M977P272Q591R015R283R462R312R001Q559P407N378
61341E32340L518K990L605M128L747K670J631J248J528J682Q01j057k831l688
61327E52312l822l884m161m454m348l529k323j729k289l113k851j476j79M34Q50
61312E15438J477K105K801M083N881P434Q547R900J1706J3168J3668J3456J2651
61299F22315J0713P596M432K288R43m35k082l750n293o575p314p480p356o968
61285F01034o110n157m939n487n778n108l867k620j383k73K21K33P53K136L313
61270E66968L289K601K372K735L162L622M342M924M852M663N498P474R315R819
61256F35636R073Q063P444O934N865M187K733K191K069J201p30k856m335n200
$$ plain form
61242 672275 666495 660491 654757 649455 644288 638918 633323 627712 622353 617439 613016 609094 605910 603898
61228 603898 603272 603860 605374 607576 610155 612873 615976 620047 625289 631361 637950 644914 651767 657756 662730
61213 662730 667288 671816 676162 680559 685890 692356 698628 703157 705843 707872 710423 714138 719298 725842
61199 725842 733521 742468 753154 765603 779391 794666 812136 831556 851235 869675 886568 901527
61187 901527 913221 920935 925896 929802 932943 934927 936137 936995 936718 934443 930852 927034 922461 915802
61173 915802 907185 897777 887516 875260 861080 846534 832517 818557 804385 790524 777018 763142
61161 763142 748729 734432 720363 705928 691376 678116 666974 657389 648757 641387 635679 631539
61149 631539 629179 629370 632163 636128 639371 640694 639608 636080 630619 623940 616423 608502 601374 596246
$$ packed form
61242F72275n780o004n734n302n167n370n595n611n359m914m423l922l184k012
61228F03898o26N88J514K202K579K718L103M071N242O072O589O964O853N989M974
61213F62730M558M528M346M397N331O466O272M529K686K029K551L715N160O544
61199G25842P679Q947J0686J2449J3788J5275J7470J9420J9679J8440J6893J4959
61187I01527J1694P714M961L906L141J984J210Q58k77k275l591l818m573o659
61173I15802q617r408j0261j2256j4180j4546j4017j3960j4172j3861j3506j3876
61161G63142j4413j4297j4069j4435j4552j3260j1142r585q632p370n708m140
61149F31539k360J91K793L965L243J323j086l528n461o679p517p921p128n128
$$ plain form
61135 596246 592991 590648 589219 589631 591929 594981 598345 603047 609970 618743 628768 640210 653338 667967
61121 667967 684183 702626 723374 745406 767800 790749 814884 840279 866586 893429 920230
61110 920230 946259 971198 995073 1017593 1038323 1057526 1075831 1092881 1107305 1118182 1125450 1128720
61098 1128720 1127056 1120463 1110409 1098180 1083652 1066221 1046008 1023547 999262 973916 948755 924527
61086 924527 900997 877909 855740 835076 815928 798092 781521 766108 751851 739425 729727 722593
61074 722593 716860 711922 708273 706259 705425 705453 706661 709097 712124 715376 719220 723913 729291 735602 743545
61059 743545 753117 763538 774725 787662 802832 819458 836825 855193 874838 895405 916824 939822
61047 939822 964971 992210 1021630 1053422 1086773 1120340 1154329 1190458 1229174 1268707 1307761
$$ packed form
61135E96246l255k343j429M12K298L052L364M702O923Q773J0025J1442J3128J4629
61121F67967J6216J8443K0748K2032K2394K2949K4135K5395K6307K6843K6801
61110I20230K6029K4939K3875K2520K0730J9203J8305J7050J4424J0877P268L270
61098A128720j664o593j0054j2229j4528j7431k0213k2461k4285k5346k5161k4228
61086I24527k3530k3088k2169k0664j9148j7836j6571j5413j4257j2426r698p134
61074G22593n733m938l649k014q34K8J208K436L027L252L844M693N378O311P943
61059G43545R572J0421J1187J2937J5170J6626J7367J8368J9645K0567K1419K2998
61047I39822K5149K7239K9420L1792L3351L3567L3989L6129L8716L9533L9054
$$ plain form
61036 1307761 1347344 1388720 1431352 1474395 1518763 1565996 1616172 1668523 1723094 1780276 1839513
61025 1839513 1899963 1961810 2025821 2092421 2162296 2237005 2317952 2405685 2501181 2606617 2723897
61014 2723897 2853733 2997311 3157349 3336533 3537135 3764049 4026258 4333450 4693641
61005 4693641 5117108 5620548 6224124 6946254 7804565 8818705 10006336 11378268 12942494
60996 12942494 14701906 16617806 18553587 20268558 21511392 22161073 22295493 22128433
60988 22128433 21883545 21717872 21720737 21917745 22231812 22454729 22312178 21608301 20334341
60979 20334341 18651824 16782154 14905861 13130912 11509521 10060400 8782529 7666361
60971 7666361 6701949 5879232 5184617 4601452 4113593 3706579 3366424 3079776 2835472
$$ packed form
61036A307761L9583M1376M2632M3043M4368M7233N0176N2351N4571N7182N9237
61025A839513O0450O1847O4011O6600O9875P4709Q0947Q7733R5496J05436J17280
61014B723897J29836J43578J60038J79184K00602K26914K62209L07192L60191
61005D693641M23467N03440O03576P22130Q58311J014140J187631J371932J564226
60996A2942494J759412J915900J935781J714971J242834O49681J34420j67060
60988B2128433k44888j65673K865J97008L14067K22917j42551p03877j273960
60979B0334341j682517j869670j876293j774949j621391j449121j277871j116168
60971G666361r64412q22717o94615n83165m87859m07014l40155k86648k44304
$$ plain form
60962 2835472 2624842 2440948 2278581 2134450 2006227 1891641 1788970 1697662 1617519 1547630
60952 1547630 1486612 1433200 1385908 1342645 1301458 1261416 1222462 1184811 1148703 1114154 1080629
60941 1080629 1047592 1015536 985642 958138 931881 905993 880946 857438 835094 813170 791914
60930 791914 772323 754822 738918 723988 709893 696966 685757 676560 668940 661966 655094 648508
60918 648508 642549 637310 632943 629732 627530 625722 624117 623404 624297 626567 629288 631676 633386 634402 635099
60903 635099 636118 637776 639640 640918 641181 640636 639838 639114 638102 635957 632332 627949 623733 619556 614480
60888 614480 608164 601259 594289 586963 578959 570730 562987 555765 548438 540440 531729 522787 514389 507073
60874 507073 500610 494205 487388 480564 474580 469976 466686 464257 462293 460828 460188 460345 460676 460747 461064 462573
$$ packed form
60962B835472k10630j83894j62367j44131j28223j14586j02671r1308q0143o9889
60952A547630o1018n3412m7292m3263m1187m0042l8954l7651l6108l4549l3525
60941A080629l3037l2056k9894k7504k6257k5888k5047k3508k2344k1924k1256
60930G91914j9591j7501j5904j4930j4095j2927j1209r197p620o974o872o586
60918F48508n959n239m367l211k202j808j605p13Q93K270K721K388J710J016O97
60903F35099J019J658J864J278K63n45p98p24j012k145l625m383m216m177n076
60888F14480o316o905o970p326q004q229p743p222p327p998q711q942q398p316
60874E07073o463o405o817o824n984m604l290k429j964j465o40J57L31P1L17J509
$$ plain form
60858 462573 465522 469239 472878 475871 477938 479338 481023 483772 487149 490025 492234 494880 498747 503205
60844 503205 507127 510345 513592 517298 520954 523549 524355 523288 520752 517300 513490 509933 507040 504570
60830 504570 501809 498532 495404 493066 491279 489463 487592 485883 483998 481365 478026 474416 470560 466373
60816 466373 462471 459597 457329 454423 450568 446728 443486 440055 435426 429707 423856 418704 414548 411183
60802 411183 407992 404544 401269 398929 397287 395083 391633 387725 384488 382048 379797 377456 375294 373610
60788 373610 372509 372014 372122 372838 374246 376289 378491 380276 381593 382851 384266 385795 387618 390067 392998
60773 392998 395840 398374 400872 403453 405955 408602 411978 416046 419838 422533 424289 425682 426817 427389
60759 427389 427216 426353 424980 423389 421842 420308 418589 416688 414713 412613 410512 409126 409140 410195 411203
$$ packed form
60858D62573K949L717L639K993K067J400J685K749L377K876K209K646L867M458
60844E03205L922L218L247L706L656K595Q06j067k536l452l810l557k893k470
60830E04570k761l277l128k338j787j816j871j709j885k633l339l610l856m187
60816D66373l902k874k268k906l855l840l242l431m629n719n851n152m156l365
60802D11183l191l448l275k340j642k204l450l908l237k440k251k341k162j684
60788C73610j101m95J08P16J408K043K202J785J317J258J415J529J823K449K931
60773C92998K842K534K498K581K502K647L376M068L792K695J756J393J135N72
60759D27389j73q63j373j591j547j534j719j901j975k100k101j386J4J055J008
$$ plain form
60744 411203 411616 411632 411183 409705 407096 404005 400836 397261 393012 388353 383470 378224 372864 368194 364528
60729 364528 361236 357775 354427 351578 349045 346681 344874 343811 342925 341776 340890 340967 341774 342566 343175 343895
60713 343895 344614 344929 345003 345561 346986 348994 351247 353855 357087 360842 364552 367649 370110 372469 375113
60698 375113 377771 379955 381702 383458 385441 387706 390627 394482 398566 401601 403213 404200 405188 405944 406355
60683 406355 407110 408725 410543 411396 410884 409570 408419 408357 409779 411949 413327 412962 411284 409340 407778 406749
60667 406749 406082 405124 403011 399603 395685 392002 388700 385918 384053 382991 381933 380561 379596 379597 380041 380294
60651 380294 380733 382018 383933 385894 388033 390776 393738 396007 397281 397844 397596 396021 393067 389368 385618
60636 385618 382240 379581 377833 376842 376363 376304 376431 376237 375604 375111 375157 375210 374617 373751 373567 374306 375377 376318
$$ packed form
60744D11203M13J6m49j478k609l091l169l575m249m659m883n246n360m670l666
60729C64528l292l461l348k849k533k364j807j063q86j149q86P7Q07P92O09P20
60713C43895P19L15P4N58J425K008K253K608L232L755L710L097K461K359K644
60698C75113K658K184J747J756J983K265K921L855M084L035J612R87R88P56M11
60683D06355P55J615J818Q53n12j314j151o2J422K170J378l65j678j944j562j029
60667D06749o67r58k113l408l918l683l302k782j865j062j058j372r65JM44K53
60651C80294M39J285J915J961K139K743K962K269J274N63k48j575k954l699l750
60636C85618l378k659j748r91m79n9J27j94o33m93M6N3n93q66j84P39J071R41
$$ plain form
60618 376318 377133 377842 378437 379179 380275 381295 381567 381123 380660 380554 380436 379792 378543 377051 375912 375645 376207
60601 376207 376891 377101 377095 377626 379019 380989 383112 385095 386803 388483 390772 394042 397862 401466 404496 406895
60585 406895 408448 408988 408840 408492 408001 407164 406119 405298 404990 405396 406901 409763 413700 418207 423148 428653
60569 428653 434754 441591 449654 459217 469826 480931 492685 505377 518260 529741 538784 545470 550142
60556 550142 552664 552709 550281 545810 540070 534055 528600 524060 520580 518444 517858 518613 520428 523491 528212
60541 528212 534623 542453 551588 561959 573285 585540 599507 616064 634863 654350 673136 690659
60529 690659 706350 718937 727185 730990 731282 728910 724018 716614 707462 697993 689180 680788 672255 664109
60515 664109 657797 653948 651574 649439 647551 646682 647006 648008 649466 651786 655498 661027 668847 679343
$$ packed form
60618C76318Q15P09N95P42J096J020K72m44m63j06j18o44j249j492j139k67N62
60601C76207O84K10oN31J393J970K123J983J708J680K289L270L820L604L030K399
60585D06895J553N40j48l48m91q37j045q21l08M06J505K862L937M507M941N505
60569D28653O101O837Q063R563J0609J1105J1754J2692J2883J1481R043O686M672
60556E50142K522M5k428m471n740o015n455m540l480k136n86P55J815L063M721
60541E28212O411P830R135J0371J1326J2255J3967J6557J8799J9487J8786J7523
60529F90659J5691J2587Q248L805K92k372m892p404r152r469q813q392q533q146
60515F64109o312l849k374k135j888q69L24J002J458K320L712N529P820J0496
$$ plain form
60501 679343 692713 709420 730431 756489 787462 822946 863035 907696 955738 1005343 1055426
60490 1055426 1105561 1154627 1200489 1241056 1274782 1300031 1314975 1318465 1310320 1290590 1259413 1218032
60478 1218032 1169170 1115789 1059959 1003297 947793 895359 846793 801868 760387 722703 689190
60467 689190 659681 633631 610606 590409 572697 556768 542035 528721 517658 509063 501823 494465
60455 494465 486728 479697 474353 470453 466953 463123 458962 454771 450639 446381 441905 437509 433711 430760
60441 430760 428520 426848 425778 425160 424488 423407 422149 421123 420267 419235 418056 417236 417237 418139 419728 421623
60425 421623 423359 424615 425312 425392 424780 423756 423010 422922 423081 422924 422618 422845 423927 425675 427963 430810 433869
60408 433869 436350 437713 438133 438192 438303 438535 438839 439293 440073 441138 442123 442851 443806 445594 447956 450015 451717
$$ packed form
60501F79343J3370J6707K1011K6058L0973L5484M0089M4661M8042M9605N0083
60490A055426N0135M9066M5862M0567L3726K5249J4944L490q145j9730l1177m1381
60478A218032m8862n3381n5830n6662n5504n2434m8566m4925m1481l7684l3513
60467F89190k9509k6050k3025k0197j7712j5929j4733j3314j1063q595p240p358
60455D94465p737p031n344l900l500l830m161m191m132m258m476m396l798k951
60441D30760k240j672j070o18o72j081j258j026q56j032j179q20JR02J589J895
60425D21623J736J256O97Q0o12j024p46q8J59j57l06K27J082J748K288K847L059
60408D33869K481J363M20N9J11K32L04M54P80J065R85P28R55J788K362K059J702
$$ plain form
60391 451717 454207 458299 463279 467891 471875 475752 479546 482734 485229 487495 489695 491515 492905 494276
60377 494276 495846 497341 498531 499604 500916 502770 505473 509194 513639 518111 521930 524711 526447 527596
60363 527596 528917 530947 533795 537519 542141 547048 551041 553671 556111 560030 565978 573486 582274 592466
60349 592466 603832 615665 627343 638320 647667 654396 658224 659376 657777 653156 645899 637064 627551
60336 627551 617853 608526 600130 592643 585694 579413 574394 570675 567377 563560 558972 553890 548708 543765
60322 543765 539179 534879 531144 528847 528557 529622 530844 532042 534231 538241 543900 550704 558691 568418
60308 568418 580429 594772 610676 626805 642212 656950 671419 685472 698611 710482 720355 726548
60296 726548 727446 723070 714773 703500 689214 672051 653121 633992 616084 600475 587548 576759
$$ packed form
60391D51717K490M092M980M612L984L877L794L188K495K266K200J820J390J371
60377D94276J570J495J190J073J312J854K703L721M445M472L819K781J736J149
60363E27596J321K030K848L724M622M907L993K630K440L919N948P508Q788J0192
60349E92466J1366J1833J1678J0977R347O729L828J152j599m621p257q835r513
60336F27551r698r327q396p487o949o281n019l719l298l817m588n082n182m943
60322E43765m586m300l735k297k90J065J222J198K189M010N659O804P987R727
60308E68418J2011J4343J5904J6129J5407J4738J4469J4053J3139J1871R873O193
60296G26548Q98m376q297j1273j4286j7163j8930j9129j7908j5609j2927j0789
$$ plain form
60284 576759 567462 559798 554059 549460 544660 539395 534500 530290 526084 521481 516951 512855 508927 505106
60270 505106 501880 499446 497418 495626 494262 492959 490881 488143 486005 485127 484704 483978 483490 483956 484889 485376
60254 485376 485494 485910 486605 487058 487329 487967 488921 489449 489197 488760 489062 490503 492690 494678 495547 495001 493507
60237 493507 491858 490734 490496 490984 491538 491701 491966 493285 495843 498853 501649 504246 506666 508500 509582
60222 509582 510503 512028 514397 517487 521154 525128 529060 533006 537453 542597 548010 553264 558473 564000
60208 564000 569998 576413 583027 589378 595098 600417 605891 611595 617093 622153 626835 630897 633874 635829
60194 635829 637247 638115 637930 636724 635114 633177 630307 626556 622996 620235 617539 614106 610289 606832 603719
60179 603719 600573 597582 595192 593391 591990 591191 591176 591504 591506 590961 589955 588474 586596 584665 582897 581224
$$ packed form
60284E76759r297p664n739m599m800n265m895m210m206m603m530m096l928l821
60270E05106l226k434k028j792j364j303k078k738k138q78m23p26m88M66R33M87
60254D85376J18M16O95M53K71O38R54N28k52m37L02J441K187J988Q69n46j494
60237D93507j649j124k38M88N54J63K65J319K558L010K796K597K420J834J082
60222E09582R21J525K369L090L667L974L932L946M447N144N413N254N209N527
60208E64000N998O415O614O351N720N319N474N704N498N060M682M062K977J955
60194F35829J418Q68j85j206j610j937k870l751l560k761k696l433l817l457l113
60179F03719l146k991k390j801j401p99j5L28Kn45j006j481j878j931j768j673
$$ plain form
60163 581224 579769 578919 578637 578402 578194 578714 580129 581402 581537 580798 580068 579712 579805 580735 582641 584751 586173
60146 586173 587014 587944 589063 589980 590720 591755 593357 595556 598582 602757 608147 614681 622240 630159 637251
60131 637251 643037 648546 655078 662421 669002 673598 676222 677490 677831 677401 676264 674625 673047 672288 672661
60116 672661 673872 675623 677850 680133 681575 681825 681641 681776 681872 681131 679569 677731 675500 672117 667310 661727
60100 661727 656244 651404 647407 644085 640915 637534 634219 631603 630063 629662 630381 632018 634103 636287 638603
60085 638603 641095 643547 645861 648248 650692 652645 653702 654132 654255 653711 651884 648747 644805 640377 635298
60070 635298 629098 621366 612366 603413 595979 590117 584420 577825 570731 563993 557778 552019 547081 543160
60056 543160 539701 536220 533054 530587 528454 526368 525015 525187 526608 528542 530930 533916 536953 539552
$$ packed form
60163E81224j455q50k82k35k08N20J415J273J35p39p30l56R3R30J906K110J422
60146E86173Q41R30J119R17P40J035J602K199L026M175N390O534P559P919P092
60131F37251N786N509O532P343O581M596K624J268L41m30j137j639j578p59L73
60116F72661J211J751K227K283J442K50j84J35R6p41j562j838k231l383m807n583
60100F61727n483m840l997l322l170l381l315k616j540m01P19J637K085K184K316
60085F38603K492K452K314K387K444J953J057M30J23n44j827l137l942m428n079
60070F35298o200p732r000q953p434n862n697o595p094o738o215n759m938l921
60056E43160l459l481l166k467k133k086j353J72J421J934K388K986L037K599
$$ plain form
60042 539552 542351 546183 550488 553987 556662 559692 563493 567090 569477 570415 569804 567429 563705 559751 556439
60027 556439 553971 552333 551250 549683 546374 541175 535082 528857 522399 515589 508785 502153 495305 488042
60013 488042 480876 474441 468891 464140 460246 457248 454985 453281 451996 450899 449788 448768 448051 447543 447006
59998 447006 446538 446457 446777 447272 447975 449203 451088 453464 456117 458784 461139 463140 465213 467666 470170 472246
59982 472246 473932 475502 476830 477604 477806 477390 475921 473258 470294 468183 467026 466103 465154 464581 464519 464621
59966 464621 464808 465458 466763 468525 470649 473252 476361 479972 484210 488855 493042 496170 498736 501429 503725
59951 503725 504521 503960 503343 503166 502471 500443 497492 494287 490828 487147 483998 481934 480227 477563 473653
59936 473653 469571 466565 464955 464144 463461 462892 462979 463981 465402 466621 467839 469998 473779 479061 485307
$$ packed form
60042E39552K799L832M305L499K675L030L801L597K387R38o11k375l724l954l312
60027E56439k468j638j083j567l309n199o093o225o458o810o804o632o848p263
60013D88042p166o435n550m751l894k998k263j704j285j097j111j020p17n08n37
59998D47006m68q1L20M95P03J228J885K376K653K667K355K001K073K453K504K076
59982D72246J686J570J328P74K02m16j469k663k964k111j157r23r49n73o2J02
59966D64621J87O50J305J762K124K603L109L611M238M645M187L128K566K693K296
59951E03725P96n61o17j77o95k028k951l205l459l681l149k064j707k664l910
59936D73653m082l006j610q11o83n69Q7J002J421J219J218K159L781N282O246
$$ plain form
59921 485307 492075 499059 505853 511761 515872 517625 517502 516792 516433 516390 516449 516982 518507 521037 524484 529079
59905 529079 534678 540187 544615 548347 552409 556742 560172 561986 562641 562932 563357 564363 566354 569241 572523
59890 572523 575853 579104 582058 584669 587463 591022 595232 599667 604509 610363 617323 624894 632593 639979
59876 639979 646378 651364 655240 658289 659954 659686 658166 656562 654901 652399 649212 646464 644409 641867
59862 641867 637893 633021 628521 625206 623157 621844 620382 618374 616534 615804 616050 616517 617371 619608 623515
59847 623515 628358 633633 639426 645391 650562 654430 657173 658730 658811 658074 658081 659639 662121 664587 666481 667015
59831 667015 665199 661048 655788 650460 645273 640509 636749 633728 630238 625775 621182 617036 612607 607194
59817 607194 601411 596260 591796 587548 583405 579274 574607 569127 563421 558067 552822 547417 542467 538782
$$ packed form
59921D85307O768O984O794N908M111J753j23p10l59m3N9N33J525K530L447M595
59905E29079N599N509M428L732M062M333L430J814O55K91M25J006J991K887L282
59890E72523L330L251K954K611K794L559M210M435M842N854O960P571P699P386
59876F39979O399M986L876L049J665k68j520j604j661k502l187k748k055k542
59862F41867l974m872m500l315k049j313j462k008j840p30K46M67Q54K237L907
59847F23515M843N275N793N965N171L868K743J557Q1p37PJ558K482K466J894N34
59831F67015j816m151n260n328n187m764l760l021l490m463m593m146m429n413
59817F07194n783n151m464m248m143m131m667n480n706n354n245n405m950l685
$$ plain form
59803 538782 536264 534274 532669 531717 531307 530910 530195 529236 528276 527508 526837 525767 523944 521861 520457 519985
59787 519985 519955 520141 520776 521610 521818 521213 520672 520963 521969 523373 525171 527073 528336 528755 529041 529763 530711
59770 530711 531638 532734 533931 534737 535300 536684 539501 543125 546768 550371 553904 556898 559402 562379 566369
59755 566369 570735 575041 580066 586465 593429 599901 606353 614078 623235 632694 641470 649372 656657 663897
59741 663897 671749 680038 687552 693462 698308 702747 706105 707331 706851 706211 706098 705861 704833 703117 701091
59726 701091 699016 697135 695434 693372 690516 687281 684455 682210 680193 678272 676474 674425 671647 668289
59712 668289 664834 661220 656984 652253 647906 644666 642548 641191 640308 639793 639700 640125 640895 641540 641755 641634
59696 641634 641407 641288 641750 643312 645719 647826 648681 648327 647294 645917 644440 643102 641663 639464 636416
$$ packed form
59803E38782k518j990j605r52m10l97p15r59r60p68o71j070j823k083j404m72
59787E19985l0J86O35Q34K08o05n41K91J006J404J798J902J263M19K86P22R48
59770E30711R27J096J197Q06N63J384K817L624L643L603L533K994K504K977L990
59755E66369M366M306N025O399O964O472O452P725R157R459Q776P902P285P240
59741F63897P852Q289P514N910M846M439L358J226m80o40j13k37j028j716k026
59726G01091k075j881j701k062k856l235k826k245k017j921j798k049k778l358
59712F68289l455l614m236m731m347l240k118j357q83n15r3M25P70O45K15j21
59696F41634k27j19M62J562K407K107Q55l54j033j377j477j338j439k199l048
$$ plain form
59681 636416 633297 630602 627851 624549 621041 617713 614108 609661 604672 599740 594802 589590 584482 579996
59667 579996 575943 571979 568558 566318 564895 563326 561445 559910 559031 558499 558226 558511 559343 560270 561084 562042
59651 562042 563351 564989 566963 569233 571300 572420 572312 571352 570013 568362 566150 563218 559813 556463 553407
59636 553407 550335 547101 544468 543417 543814 544579 545235 546223 547415 547487 545425 541744 537562 533327 529182 525698
59620 525698 523314 521579 519724 517463 514674 511038 506738 502806 500040 498179 496808 496236 496697 497550 498273
59605 498273 499527 502181 505849 509385 512249 514431 515691 515998 516213 517242 518856 520249 521278 522230 523003
59590 523003 523582 524736 527021 529606 531287 532232 533434 534859 535500 535038 534066 532733 530471 527193 523643
59575 523643 520433 517717 515805 515068 515155 515168 514678 513876 512850 511539 510298 509627 509454 509462 509864 510990 512374
$$ packed form
59681F36416l119k695k751l302l508l328l605m447m989m932m938n212n108m486
59667E79996m053l964l421k240j423j569j881j535q79n32k73K85Q32R27Q14R58
59651E62042J309J638J974K270K067J120j08r60j339j651k212k932l405l350l056
59636E53407l072l234k633j051L97P65O56R88J192P2k062l681m182m235m145l484
59620E25698k384j735j855k261k789l636m300l932k766j861j371n72M61Q53P23
59605D98273J254K654L668L536K864K182J260L07K15J029J614J393J029R52P73
59590E23003N79J154K285K585J681R45J202J425O41m62r72j333k262l278l550
59575E23643l210k716j912p37Q7J3m90q02j026j311j241o71j73QM02J126J384
$$ plain form
59558 512374 513206 513463 513635 513591 512820 511620 510934 510996 511263 511625 512632 514470 516816 519816 524131 529820 536172
59541 536172 542938 550798 560312 571362 584148 599906 619589 641670 661612 674158 676921 672086
59529 672086 664336 657027 650886 646034 643502 643835 645678 647307 648719 650749 652870 653553 652395 650253 647464
59514 647464 643484 638197 632024 624739 615667 605231 594982 585874 577740 570464 564307 558891 553263 547356
59500 547356 542223 538525 535901 534023 533025 532544 531549 529681 527760 526549 525907 525558 525714 526473 527399 528142
59484 528142 528856 529809 531201 533479 537012 541426 545982 550650 555952 561902 568075 574632 582006 589507 595561
59469 595561 599635 602702 605464 607373 607977 608079 608829 610447 612466 614552 616669 619155 622967 629077 637237
59454 637237 646041 654515 662889 671591 680374 688825 696850 704182 710193 714645 717886 719822 719388 715634
$$ packed form
59558E12374Q32K57J72m4p71j200o86O2K67L62J007J838K346L000M315N689O352
59541E36172O766P860R514J1050J2786J5758J9683K2081J9942J2546K763m835
59529F72086p750p309o141m852k532L33J843J629J412K030K121O83j158k142k789
59514F47464l980n287o173p285r072j0436j0249r108q134p276o157n416n628n907
59500E47356n133l698k624j878r98m81r95j868j921j211o42l49J56P59R26P43
59484E28142P14R53J392K278L533M414M556M668N302N950O173O557P374P501O054
59469E95561M074L067K762J909O04J02P50J618K019K086K117K486L812O110Q160
59454F37237Q804Q474Q374Q702Q783Q451Q025P332O011M452L241J936m34l754
$$ plain form
59440 715634 708858 700303 691206 682449 674550 667542 661186 655512 650848 647294 644643 642817 641873 641599 641807
59425 641807 643070 646520 652753 661421 671974 684256 698354 714357 732329 752095 773127 795015
59413 795015 817948 842487 869036 897285 925008 947074 957369 953357 938321 918268 897657 879020
59401 879020 864725 856501 854029 856317 863690 875557 886572 888565 877586 856963 832757 808631
59389 808631 786014 766302 750358 737134 724845 713064 702534 693684 686408 680663 676375 673331
59377 673331 671671 671750 673013 673896 673388 671819 669758 667272 664746 663253 663352 664459 665993 668173 671204 674781
59361 674781 678938 684275 690712 697180 703230 709888 718229 728108 738975 750854 763862 777832 793080
59348 793080 810437 829736 849329 867906 885786 903679 921189 937333 951513 963168 971420 975936
$$ packed form
59440G15634o776q555r097q757p899p008o356n674m664l554k651j826r44k74K08
59425F41807J263L450O233Q668J0553J2282J4098J6003J7972J9766K1032K1888
59413G95015K2933K4539K6549K8249K7723K2066J0295m012j5036k0053k0611j8637
59401H79020j4295q224k472K288P373J1867J1015J993j0979k0623k4206k4126
59389H08631k2617j9712j5944j3224j2289j1781j0530q850p276n745m288l044
59377F73331j660P9J263Q83n08j569k061k486k526j493R9J107J534K180L031L577
59361F74781M157N337O437O468O050O658Q341R879J0867J1879J3008J3970J5248
59348G93080J7357J9299J9593J8577J7880J7893J7510J6144J4180J1655Q252M516
$$ plain form
59336 975936 977316 975915 971166 962658 950927 936567 919659 900759 881271 862040 842677 823048
59324 823048 804227 787047 770917 755166 740463 727745 716645 706167 696105 686744 677918 669448
59312 669448 661845 655504 649851 644240 639144 635591 633983 634208 636272 640124 645496 652506 661726 673119
59298 673119 685659 698270 709890 718203 720000 714077 702713 689298 675546 661903 649170 638186
59286 638186 628879 621098 615565 612706 611369 610133 609258 610070 613046 617748 624044 632063 641411 651656
59272 651656 663249 676878 692205 708069 723514 737916 750756 762114 772727 782708 790926 796452
59260 796452 799776 801679 801836 799574 795196 789404 782234 773680 764610 755913 747465 739097 731848 726983
59246 726983 724350 722860 722025 722054 723109 725503 729895 736237 743166 749418 755068 760506 765267 768947 772093
$$ packed form
59336I75936J380j401m749q508j1731j4360j6908j8900j9488j9231j9363j9629
59324H23048j8821j7180j6130j5751j4703j2718j1100j0478j0062r361q826q470
59312F69448p603o341n653n611n096l553j608K25K064L852N372P010R220J1393
59298F73119J2540J2611J1620Q313J797n923j1364j3415j3752j3643j2733j0984
59286F38186r307p781n533k859j337j236q75Q12K976M702O296Q019R348J0245
59272F51656J1593J3629J5327J5864J5445J4402J2840J1358J0613R981Q218N526
59260G96452L324J903J57k262m378n792p170q554r070q697q448q368p249m865
59246G26983k633j490q35K9J055K394M392O342O929O252N650N438M761L680L146
$$ plain form
59231 772093 774825 775804 774131 771144 768495 765332 759371 750116 739085 727324 714704 701500 688732
59218 688732 676818 665418 654638 645066 636682 629002 622120 616348 611184 605974 601299 598267 596629
59205 596629 595038 592938 590823 588900 586984 585604 585698 587162 589030 591040 593680 596760 599386 601458 603855
59190 603855 606987 610318 613486 616798 620449 624195 627927 631804 635896 640410 645864 652172 658030 662238
59176 662238 665147 667710 669785 670764 671339 673008 676062 679597 683311 687747 692857 697866 702574 707308 711522
59161 711522 713941 714267 713365 711569 708118 702562 695469 687493 678848 669958 661507 653512 645294 636625 628094
59146 628094 620246 613103 606508 600147 593392 585960 578567 572124 566597 561520 557110 553785 551041 548087
59132 548087 545266 543567 542989 542703 542595 543305 544886 546807 549198 552840 557953 564165 571447 579838 588518
$$ packed form
59231G72093K732R79j673k987k649l163n961r255j1031j1761j2620j3204j2768
59218F88732j1914j1400j0780r572q384p680o882n772n164n210m675l032j638
59205E96629j591k100k115j923j916j380R4J464J868K010K640L080K626K072K397
59190F03855L132L331L168L312L651L746L732L877M092M514N454O308N858M208
59176F62238K909K563K075R79N75J669L054L535L714M436N110N009M708M734M214
59161G11522K419L26r02j796l451n556p093p976q645q890q451p995q218q669q531
59146F28094p848p143o595o361o755p432p393o443n527n077m410l325k744k954
59132E48087k821j699n78k86j08P10J581J921K391L642N113O212P282Q391Q680
$$ plain form
59117 588518 596481 604043 612402 621929 632145 643029 654835 666850 677938 688212 698603 708876
59105 708876 717673 724527 730200 734982 738274 740022 740926 740954 739245 735822 731955 728464 725033 721482 718382
59090 718382 716061 714286 713187 713220 713916 713950 712748 710906 708870 706401 703394 699958 695577 689521 682219
59075 682219 674916 667912 660503 652693 645452 639115 633040 627124 622184 618427 614959 611208 607636 604732
59061 604732 602390 600468 598789 596626 593433 590010 587555 585737 583260 580190 577911 576679 575160 572710
59047 572710 570318 568847 568015 567524 567573 567807 567377 566474 566262 566936 567447 567475 567990 569465 571263 573178 575878
59030 575878 579367 582792 586236 590886 596996 603590 610725 620060 632447 646858 662329 678872 695644
59017 695644 710419 721972 731029 737790 740704 739138 735199 731183 726875 721094 714345 708139 702887 698294
$$ packed form
59117E88518P963P562Q359R527J0216J0884J1806J2015J1088J0274J0391J0273
59105G08876Q797O854N673M782L292J748R04K8j709l423l867l491l431l551l100
59090G18382k321j775j099L3O96L4j202j842k036k469l007l436m381o056p302
59075F82219p303p004p409p810p241o337o075n916m940l757l468l751l572k904
59061F04732k342j922j679k163l193l423k455j818k477l070k279j232j519k450
59047E72710k392j471q32m91M9K34m30r03k12O74N11K8N15J475J798J915K700
59030E75878L489L425L444M650O110O594P135R335J2387J4411J5471J6543J6772
59017F95644J4775J1553R057O761K914j566l939m016m308n781o749o206n252m593
$$ plain form
59003 698294 694822 693135 692944 693867 696613 701863 708613 714963 720020 724022 727303 730157 733065 736083 738511
58988 738511 739867 740466 740473 739334 736881 734050 731735 729797 727861 726157 724983 724311 724520 726426 730125 734984
58972 734984 741190 749788 760544 771405 781061 790543 801225 812702 823835 834583 845417 856043
58960 856043 865986 875500 884724 892776 898608 901900 902310 898982 891711 881524 869248 854653 837868
58947 837868 820345 803377 786886 770655 755470 741899 729219 716844 705753 697290 691530 687783
58935 687783 685609 684297 682584 680074 677879 676834 676299 675665 675539 676164 676192 674545 672250 670817 669958 668450
58919 668450 666198 663828 661239 658153 655283 653474 652407 651479 651086 651743 652934 654214 656460 660576 665985
58904 665985 671921 679208 689122 701383 714898 729574 745604 761809 776644 790433 804795 820173
$$ packed form
59003F98294l472j687j91R23K746N250O750O350N057M002L281K854K908L018K428
58988G38511J356N99Pj139k453k831k315j938j936j704j174o72K09J906L699M859
58972G34984O206Q598J0756J0861R656R482J0682J1477J1133J0748J0834J0626
58960H56043R943R514R224Q052N832L292M10l328p271j0187j2276j4595j6785
58947H37868j7523j6968j6491j6231j5185j3571j2680j2375j1091q463n760l747
58935F87783k174j312j713k510k195j045n35o34j26O25K8j647k295j433q59j508
58919F68450k252k370k589l086k870j809j067r28l93O57J191J280K246M116N409
58904F65985N936P287R914J2261J3515J4676J6030J6205J4835J3789J4362J5378
$$ plain form
58892 820173 835553 850397 865328 881111 898262 917400 938697 961081 982965 1003403 1021707
58881 1021707 1036714 1047605 1054858 1059284 1060742 1058873 1054196 1047188 1037095 1023078 1005978 987617
58869 987617 969029 950694 933803 919630 908001 897763 888465 880350 873076 865666 857543 848687 839206
58856 839206 829572 820627 812454 803916 794286 784507 775837 768163 760738 753672 747390 741434 735036 728161
58842 728161 720832 712327 702204 691306 680608 670055 659647 650476 643271 637002 630413 623884 618321
58829 618321 613374 608459 604430 602397 601771 601264 601007 601898 603764 606013 609214 614057 619504 624004 627826
58814 627826 632158 636609 639751 641640 643525 645433 646227 645935 645869 646409 646603 645998 645105 643956 641914 639017
58798 639017 636014 633028 629584 625733 621749 617008 610792 603995 598487 594857 592180 589800 587906 586597
$$ packed form
58892H20173J5380J4844J4931J5783J7151J9138K1297K2384K1884K0438J8304
58881A021707J5007J0891P253M426J458j869m677p008j0093j4017j7100j8361
58869I87617j8588j8335j6891j4173j1629j0238r298q115p274p410q123q856r481
58856H39206r634q945q173q538r630r779q670p674p425p066o282n956o398o875
58842G28161p329q505j0123j0898j0698j0553j0408r171p205o269o589o529n563
58829F18321m947m915m029k033o26n07k57Q91J866K249L201M843N447M500L822
58814F27826M332M451L142J889J885J908P94k92o6N40J94o05q93j149k042k897
58798F39017l003k986l444l851l984m741o216o797n508l630k677k380j894j309
$$ plain form
58784 586597 585845 586135 587824 590207 592509 595258 599213 603594 606973 609332 611557 613457 614108 613657 612919
58769 612919 611552 608505 603991 599249 594675 589978 585713 582738 580484 577733 574876 573409 573498 574100 575259
58754 575259 578038 582099 585526 587363 588467 589582 590393 590784 591369 592458 593902 596067 599528 603911 608447
58739 608447 613481 619890 627270 634382 641110 648234 655552 662114 668137 674762 682075 689262 696537 704824
58725 704824 713515 720684 725742 730006 734486 739018 743710 749342 755936 762685 769552 777344 786096 794900
58711 794900 803296 811123 817149 819734 818926 816108 811642 804644 795013 783718 771017 756256 739450
58698 739450 721249 701560 680191 658688 639315 622268 606129 590987 578610 569393 561670 554488
58686 554488 548593 544101 539600 534418 529601 525810 522188 518159 514492 511786 509595 507743 506882 507182 508053
$$ packed form
58784E86597p52K90J689K383K302K749L955M381L379K359K225J900O51m51p38
58769F12919j367l047m514m742m574m697m265k975k254k751k857j467Q9O02J159
58754E75259K779M061L427J837J104J115Q11L91N85J089J444K165L461M383M536
58739F08447N034O409P380P112O728P124P318O562O023O625P313P187P275Q287
58725G04824Q691P169N058M264M480M532M692N632O594O749O867P792Q752Q804
58711G94900Q396P827O026K585q08k818m466o998r631j1295j2701j4761j6806
58698G39450j8201j9689k1369k1503j9373j7047j6139j5142j2377r217p723p182
58686E54488n895m492m501n182m817l791l622m029l667k706k191j852q61L00Q71
$$ plain form
58671 508053 509620 512842 517788 523432 529526 536964 546063 556257 567752 581610 597713 614278 629521
58658 629521 642158 650396 652657 649644 643786 636432 627469 617572 608341 599910 590844 580893 571646 563994
58644 563994 557264 551372 547489 545866 545147 544463 544205 544356 544364 545072 548309 553868 559266 563210 566896 571162
58628 571162 574901 577224 578809 579981 579750 577844 575606 573824 571773 569375 568166 568992 570753 572548 575201
58613 575201 579601 585251 591295 597263 602191 604921 605894 606707 607540 607178 605912 605783 607252 608241 607372 605617
58597 605617 603895 601630 598729 596400 594921 593109 591081 590948 593589 597376 601288 606533 613716 621216
58583 621216 628109 636015 646230 657368 667716 677650 687937 697767 706304 714141 721629 727858 732942
58570 732942 739143 748065 758804 770481 784368 801710 821553 842652 865563 891024 918062 945330
$$ packed form
58671E08053J567L222M946N644O094P438R099J0194J1495J3858J6103J6565J5243
58658F29521J2637Q238K261l013n858p354q963r897r231q431r066r951r247p652
58644E63994o730n892l883j623p19o84k58J51QP08L237N559N398L944L686M266
58628E71162L739K323J585J172k31j906k238j782k051k398j209Q26J761J795K653
58613E75201M400N650O044N968M928K730R73Q13Q33l62j266j29J469R89q69j755
58597F05617j722k265k901k329j479j812k028j33K641L787L912N245P183P500
58583F21216O893P906J0215J1138J0348R934J0287R830Q537P837P488O229N084
58570G32942O201Q922J0739J1677J3887J7342J9843K1099K2911K5461K7038K7268
$$ plain form
58558 945330 972512 998816 1022020 1040537 1054616 1064216 1067993 1065951 1060755 1054649 1047271 1038142 1028860
58545 1028860 1020800 1012865 1003640 993725 983866 972792 959085 943387 926763 908724 888869 868684
58533 868684 849726 831733 814383 799118 787280 778115 770435 764505 760608 757639 754877 753238 753108
58520 753108 752981 751917 751166 751445 750909 747909 743667 740026 736606 732287 727584 723367 719151 714686 711304
58505 711304 709702 708385 706276 704687 704592 704284 702057 699115 697372 696446 695199 694234 694377 694632 694080 693929
58489 693929 695327 697081 697987 699443 703264 708775 714573 721380 730705 742392 755739 771174 788491
58476 788491 805337 819741 832336 843932 853091 858297 860267 859769 855612 847441 838111 830428 823698
58463 823698 816132 808324 801592 795324 789143 785453 786566 791265 797203 804656 814830 826536 837668
$$ packed form
58558I45330K7182K6304K3204J8517J4079R600L777k042n196o106p378r129r282
58545A028860q060p935r225r915r859j1074j3707j5698j6624j8039j9855k0185
58533H68684j8958j7993j7350j5265j1838r165p680n930l897k969k762j639j30
58520G53108j27j064p51K79n36l000m242l641l420m319m703m217m216m465l382
58505G11304j602j317k109j589r5l08k227k942j743r26j247r65J43K55n52j51
58489F93929J398J754R06J456L821N511N798O807R325J1687J3347J5435J7317
58476G88491J6846J4404J2595J1596R159N206J970m98m157q171r330p683o730
58463H23698p566p808o732o268o181l690J113M699N938P453J0174J1706J1132
$$ plain form
58450 837668 848032 857683 864579 867042 866557 865042 861540 854808 846853 840387 834875 828635 822834 819715
58436 819715 818715 817960 817812 819409 821475 822196 822600 824700 828072 831584 836401 843690 851393 857081 862108
58421 862108 869106 877227 883626 887678 889910 888879 883363 875851 869632 864042 856628 848185 841272 835425
58407 835425 828305 820313 813737 808528 803034 797713 794221 792170 790592 790948 794702 799650 802870 805563
58393 805563 810750 817929 824379 829925 835895 841080 843564 844965 848162 852197 854065 854049 854699 856098 856891
58378 856891 858356 862584 868098 872080 875361 880364 886001 889846 893551 900556 909909 917958 924789 933334
58364 933334 943431 952493 961006 971633 983764 994491 1004014 1014668 1025730 1034685 1042386 1051290 1059898
58351 1059898 1064800 1066978 1070146 1074225 1076627 1078593 1083664 1090938 1096508 1100730 1107477 1116989 1126220 1135562
$$ packed form
58450H37668J0364R651O896K463m85j515l502o732p955o466n512o240n801l119
58436H19715j000p55j48J597K066P21M04K100L372L512M817P289P703N688N027
58421H62108O998Q121O399M052K232j031n516p512o219n590p414q443o913n847
58407H35425p120p992o576n209n494n321l492k051j578L56L754M948L220K693
58393H05563N187P179O450N546N970N185K484J401L197M035J868j6O50J399P93
58378H56891J465M228N514L982L281N003N637L845L705P005R353Q049O831Q545
58364I33334J0097R062Q513J0627J2131J0727R523J0654J1062Q955P701Q904Q608
58351A059898M902K178L168M079K402J966N071P274N570M222O747R512R231R342
$$ plain form
58337 1135562 1148388 1164391 1180071 1195337 1212921 1231779 1248002 1261864 1277085 1293493 1307301
58326 1307301 1318200 1329150 1339574 1345983 1349100 1353245 1358958 1363330 1367011 1373396 1381413 1386856 1390496
58313 1390496 1397007 1406343 1414359 1421546 1432594 1447350 1460966 1473181 1488616 1507492 1525021 1540613
58301 1540613 1558697 1579603 1598628 1615047 1633119 1653255 1671246 1687218 1706130 1728298 1748696
58290 1748696 1766765 1787495 1811663 1834600 1855806 1880063 1907803 1934330 1959724 1989184 2022266
58279 2022266 2052509 2079363 2109500 2144492 2178479 2210211 2245872 2287312 2328931 2369135 2413454
58268 2413454 2463261 2512842 2560773 2612770 2670119 2726967 2782183 2842055 2908064 2974047 3038501
58257 3038501 3107140 3180115 3249827 3314991 3383515 3457810 3531030 3601826 3678598 3764702 3853778
$$ packed form
58337A135562J2826J6003J5680J5266J7584J8858J6223J3862J5221J6408J3808
58326A307301J0899J0950J0424O409L117M145N713M372L681O385Q017N443L640
58313A390496O511R336Q016P187J1048J4756J3616J2215J5435J8876J7529J5592
58301A540613J8084K0906J9025J6419J8072K0136J7991J5972J8912K2168K0398
58290A748696J8069K0730K4168K2937K1206K4257K7740K6527K5394K9460L3082
58279B022266L0243K6854L0137L4992L3987L1732L5661M1440M1619M0204M4319
58268B413454M9807M9581M7931N1997N7349N6848N5216N9872O6009O5983O4454
58257C038501O8639P2975O9712O5164O8524P4295P3220P0796P6772Q6104Q9076
$$ plain form
58246 3853778 3944168 4043188 4152432 4264036 4376447 4498282 4631504 4767041 4902546 5047815
58236 5047815 5206901 5372139 5541865 5725931 5927151 6135986 6350587 6582813 6837039
58227 6837039 7103190 7378732 7676621 8002938 8348394 8711145 9105544 9538727 10002121
58218 10002121 10496470 11040642 11644861 12301162 13011864 13800153 14680471 15648046 16711415
58209 16711415 17904584 19253449 20764562 22463545 24409046 26652024 29220939 32166928
58201 32166928 35582071 39552845 44142437 49442555 55594321 62741250 71032781 80715761
58193 80715761 92168948 105832857 122198420 141889973 165622733 193996162 227401722
58186 227401722 265981248 308987386 353442115 393471760 421887625 433473991 427384962
$$ packed form
58246C853778R0390R9020J09244J11604J12411J21835J33222J35537J35505J45269
58236E047815J59086J65238J69726J84066K01220K08835K14601K32226K54226
58227F837039K66151K75542K97889L26317L45456L62751L94399M33183M63394
58218A0002121M94349N44172O04219O56301P10702P88289Q80318R67575J063369
58209A6711415J193169J348865J511113J698983J945501K242978K568915K945989
58201C2166928L415143L970774M589592N300118O151766P146929Q291531R682980
58193H0715761J1453187J3663909J6365563J9691553K3732760K8373429L3405560
58186B27401722L8579526M3006138M4454729M0029645K8415865J1586366o089029
$$ plain form
58179 427384962 406783388 376546285 341224129 304294453 268170485 234296499 203330436
58172 203330436 175506203 150919159 129548401 111205373 95603199 82448494 71431240
58165 71431240 62203339 54441361 47903563 42394714 37721114 33717726 30278878 27323218
58157 27323218 24757225 22500672 20514514 18772184 17228536 15841533 14597646 13490100
58149 13490100 12494567 11588199 10770059 10040929 9383066 8779281 8232076 7744982 7303833
58140 7303833 6894477 6520627 6186436 5878576 5582995 5303448 5046948 4806251 4572928
58131 4572928 4353138 4154306 3969399 3789492 3619269 3465513 3322399 3182442 3050552
58122 3050552 2933394 2825631 2720003 2620617 2533290 2452613 2371264 2292890 2223554 2159258 2093678
$$ packed form
58179D27384962k0601574l0237103l5322156l6929676l6123968l3873986l0966063
58172B03330436k7824233k4587044k1370758j8343028j5602174j3154705j1017254
58165G1431240r227901p761978o537798n508849m673600m003388l438848k955660
58157B7323218k565993k256553j986158j742330j543648j387003j243887j107546
58149A3490100r95533r06368q18140p29130o57863o03785n47205m87094m41149
58140G303833m09356l73850l34191l07860k95581k79547k56500k40697k33323
58131D572928k19790j98832j84907j79907j70223j53756j43114j39957j31890
58122C050552j17158j07763j05628r9386q7327q0677q1349p8374o9336o4296o5580
$$ plain form
58111 2093678 2029853 1972927 1919360 1864180 1810996 1764314 1719641 1671457 1623516 1581276 1541493
58100 1541493 1499048 1456882 1419527 1383854 1345741 1309141 1279122 1252366 1223569 1194842 1169949
58089 1169949 1145809 1118691 1092665 1072954 1056766 1039257 1022568 1010205 998401 981998 963517
58078 963517 947672 932132 912416 891022 873013 857064 839213 821093 806210 792339 775774
58067 775774 759094 746761 736860 724992 712566 703484 696203 686848 676910 670390 666215 660542 653619
58054 653619 647602 640750 630516 619355 610900 603482 593832 583848 577136 572162 565530 558786 555108 552286
58040 552286 545973 537285 530347 524781 517292 508461 501427 495905 489700 484004 481050 478625 472928 464848
58026 464848 457662 450831 441958 432574 425926 421123 415412 410042 407849 407185 404391 400361 398544 398292 396356
$$ packed form
58111B093678o3825n6926n3567n5180n3184m6682m4673m8184m7941m2240l9783
58100A541493m2445m2166l7355l5673l8113l6600l0019k6756k8797k8727k4893
58089A169949k4140k7118k6026j9711j6188j7509j6689j2363j1804j6403j8481
58078I63517j5845j5540j9716k1394j8009j5949j7851j8120j4883j3871j6565
58067G75774j6680j2333r901j1868j2426r082p281r355r938o520m175n673o923
58054F53619o017o852j0234j1161q455p418r650r984o712m974o632o744l678k822
58040E52286o313q688o938n566p489q831p034n522o205n696k954k425n697q080
58026D64848p186o831q873r384o648m803n711n370k193o64k794m030j817k52j936
$$ plain form
58011 396356 393262 391998 391859 389755 386351 384876 385027 383984 382347 383117 385676 386639 385956 386505 388340 388886
57995 388886 388225 388644 389430 387462 382631 377607 372765 366405 359493 354988 352738 349944 346345 344106 343005
57980 343005 340615 336974 334273 332260 328754 324447 322339 322470 321869 319703 317981 317204 315873 314284 314373
57965 314373 315667 315689 314461 314462 316102 317392 318065 319931 323054 325536 327040 328701 329757 328333 325323 323436
57949 323436 322547 320132 316129 313096 311571 309584 307017 306298 308385 311925 316603 323438 331613 338919 345617
57934 345617 354104 364540 374586 383581 393027 402753 410485 415512 418961 420303 417550 411261 404324 397339
57920 397339 388185 376593 365124 354977 344815 334491 325996 319757 313797 307564 302996 300769 299051
57907 299051 297000 296110 297067 298621 300502 304072 309019 312757 314305 315684 318361 321310 323634 326106 329009
$$ packed form
58011C96356l094j264j39k104l404j475J51j043j637P70K559R63o83N49J835N46
57995C88886o61M19P86j968m831n024m842o360o912m505k250k794l599k239j101
57980C43005k390l641k701k013l506m307k108J31o01k166j722p77j331j589Q9
57965C14373J294K2j228JJ640J290O73J866L123K482J504J661J056j424l010j887
57949C23436q89k415m003l033j525j987k567p19K087L540M678O835Q175P306O698
57934C45617Q487J0436J0046Q995R446R726P732N027L449J342k753o289o937o985
57920C97339r154j1592j1469j0147j0162j0324q495o239n960o233m568k227j718
57907B99051k051q90R57J554J881L570M947L738J548J379K677K949K324K472K903
$$ plain form
57892 329009 331280 332858 335186 338554 341624 344269 348036 353092 357574 360614 363124 364990 364587 361888
57878 361888 359044 357008 354478 350892 347350 343780 338382 330978 323864 318259 312833 306817 301595 298026
57864 298026 295104 292476 291532 292747 294592 296193 298462 301692 304845 308274 314131 322762 331466 338187
57850 338187 343780 349365 354221 357811 361268 365274 368705 370776 372318 373750 374098 373156 372261 371764 370165
57835 370165 366923 363693 361618 359813 357641 355956 354873 352910 349706 347046 345793 344304 341420 338482
57821 338482 336804 335508 333573 331764 330820 329834 328054 326284 324972 322830 318763 313307 306977 299345 290961
57806 290961 283810 278416 272787 265683 258589 252926 247767 242159 237372 234785 233562 232441 231959 232939 234520
57791 234520 235605 236648 238199 239339 239332 239330 240748 243419 246816 251425 257339 263229 268350 273915 280896 288150
$$ packed form
57892C29009K271J578K328L368L070K645L767N056M482L040K510J866m03k699
57878C61888k844k036k530l586l542l570n398p404p114n605n426o016n222l569
57864B98026k922k628r44J215J845J601K269L230L153L429N857Q631Q704O721
57850C38187N593N585M856L590L457M006L431K071J542J432L48r42q95m97j599
57835C70165l242l230k075j805k172j685j083j963l204k660j253j489k884k938
57821C38482j678j296j935j809r44r86j780j770j312k142m067n456o330p632q384
57806B90961p151n394n629p104p094n663n159n608m787k587j223j121m82R80J581
57791B34520J085J043J551J140pkJ418K671L397M609N914N890N121N565O981P254
$$ plain form
57775 288150 294401 300323 306880 313180 317869 321223 324203 326819 329014 331596 334572 336089 334811 332000
57761 332000 329554 327435 324724 321719 319065 316065 311725 306450 301007 294985 287885 280682 274645 269646
57747 269646 265087 261417 259293 258234 257473 257059 256989 256551 255736 255879 257556 259298 259799 259967 261312 263760
57731 263760 266518 269607 272961 275530 276941 278631 281691 284969 286998 288293 289993 291670 292441 292963 294361
57716 294361 296337 298141 300210 302957 305200 305782 305656 306370 307485 307441 306045 304148 301742 298361 294598
57701 294598 291345 288247 284637 281196 278911 277162 274678 271690 269328 267518 265240 262307 259343 256508
57687 256508 253722 251460 249998 248616 246945 246143 247363 250034 253158 257284 263606 272248 283124 297406
57673 297406 316309 339429 366141 397689 435986 481295 533062 591868 657795 726693 789728
$$ packed form
57775B88150O251N922O557O300M689L354K980K616K195K582K976J517j278k811
57761C32000k446k119k711l005k654l000m340n275n443o022p100p203o037m999
57747B69646m559l670k124j059p61m14p0m38q15J43J677J742N01J68J345K448
57731B63760K758L089L354K569J411J690L060L278K029J295J700J677P71N22J398
57716B94361J976J804K069K747K243N82j26P14J115m4j396j897k406l381l763
57701B94598l253l098l610l441k285j749k484k988k362j810k278k933k964k835
57687B56508k786k262j462j382j671q02J220K671L124M126O322Q642J0876J4282
57673B97406J8903K3120K6712L1548L8297M5309N1767N8806O5927O8898O3035
$$ plain form
57662 789728 836624 858963 852578 819850 769439 711391 652038 594126 539995 491984 450436 414004
57650 414004 382064 354948 332207 312666 296042 282649 271754 262081 253689 247497 243160 239284
57638 239284 235529 232654 230656 228703 226892 226242 226812 227393 227165 226341 225253 224103 223404 223398 223396 222845 222495 223096
57620 223096 223669 222703 220397 217997 215634 212679 209687 207866 206880 205220 202693 200705 200130 200571 201561 202830
57604 202830 203608 203379 203136 204144 205739 206093 204913 203585 202885 202424 202138 202406 202713 202069 200712 199694 198870
57587 198870 197095 194274 191446 188981 186515 184433 183418 182730 181051 178958 178364 179477 180527 180700 181033
57572 181033 182016 182539 181844 180526 179018 176986 174779 173582 173487 173174 172052 171001 170476 169755 168683 168310
57556 168310 169019 169762 169991 170694 172603 174909 176669 178158 179969 182021 184205 186841 189758 192062 193466
$$ packed form
57662G89728M6896K2339o385l2728n0411n8048n9353n7912n4131m8011m1548l6432
57650D14004l1940k7116k2741j9541j6624j3393j0895r673q392o192m337l876
57638B39284l755k875j998j953j811o50N70N81k28q24j088j150o99okn51l50O01
57620B23096N73r66k306k400k363k955k992j821r86j660k527j988n75M41R90J269
57604B02830P78k29k43J008J595L54j180j328p00m61k86K68L07o44j357j018q24
57587A98870j775k821k828k465k466k082j015o88j679k093n94J113J050J73L33
57572A81033R83N23o95j318j508k032k207j197r5l13j122j051n25p21j072l73
57556A68310P09P43K29P03J909K306J760J489J811K052K184K636K917K304J404
$$ plain form
57541 193466 194834 196994 200044 204110 209415 215164 219694 222276 223696 224742 225407 225827 226561 227572 228306
57526 228306 229123 231173 234437 237404 239135 240186 241040 241227 240618 240057 239964 239706 239007 238564 238617 238309 237160
57509 237160 235810 234602 232891 230559 228765 228249 228156 227481 226500 225848 225253 224121 222495 220637 218495 216253
57493 216253 214574 213774 213563 213884 214988 216428 217232 217416 218029 219335 220350 220587 220759 221193 221202 220739 221055 222771
57475 222771 224710 225662 225952 226286 226422 226115 226156 227262 228911 230389 232060 234599 237789 241035 244202 247118
57459 247118 249155 250202 251253 253185 255668 257954 259924 261754 263485 265523 268577 272467 276009 278745
57445 278745 281680 285611 289792 293026 295111 296553 297876 299776 302788 306152 308275 308970 309899 312092 314576
57430 314576 316412 318494 322016 326458 330475 333636 336055 337455 338019 339199 342178 346251 349917 352762
$$ packed form
57541A93466J368K160L050M066N305N749M530K582J420J046O65M20P34J011P34
57526B28306Q17K050L264K967J731J051Q54J87o09n61r3k58o99m43N3l08j149
57509B37160j350j208j711k332j794n16r3o75r81o52n95j132j626j858k142k242
57493B16253j679q00k11L21J104J440Q04J84O13J306J015K37J72M34Rm63L16J716
57475B22771J939R52K90L34J36l07M1J106J649J478J671K539L190L246L167K916
57459B47118K037J047J051J932K483K286J970J830J731K038L054L890L542K736
57445B78745K935L931M181L234K085J442J323J900L012L364K123O95R29K193K484
57430C14576J836K082L522M442M017L161K419J400N64J180K979M073L666K845
$$ plain form
57416 352762 355143 357024 358491 360585 364138 368401 372111 375304 378834 382777 386665 390712 395330 399802
57402 399802 402868 404535 406136 408660 411948 415503 419211 423276 427927 433119 438295 442921 447426 452849
57388 452849 459259 465468 470677 475292 479654 483347 486569 490769 496775 503451 509402 514850 520581 526213
57374 526213 531067 535795 541477 547781 553561 558773 564255 570052 575474 580554 586057 592203 598578 605142
57360 605142 612202 619542 626564 633167 639704 646384 653373 660947 668724 675486 680760 685911 692517 700267
57346 700267 707685 714372 721211 728700 736410 743935 751320 758640 766052 774018 782652 791221 799147 806998
57332 806998 815564 824476 832806 840557 848566 857351 867014 877711 889101 899831 908819 916664 924760
57319 924760 933441 942183 951131 961031 971891 982999 994143 1005634 1017256 1028381 1039120 1050279
$$ packed form
57416C52762K381J881J467K094L553M263L710L193L530L943L888M047M618M472
57402C99802L066J667J601K524L288L555L708M065M651N192N176M626M505N423
57388D52849O410O209N209M615M362L693L222M200O006O676N951N448N731N632
57374E26213M854M728N682O304N780N212N482N797N422N080N503O146O375O564
57360F05142P060P340P022O603O537O680O989P574P777O762N274N151O606P750
57346G00267P418O687O839P489P710P525P385P320P412P966Q634Q569P926P851
57332H06998Q566Q912Q330P751Q009Q785R663J0697J1390J0730Q988P845Q096
57319I24760Q681Q742Q948R900J0860J1108J1144J1491J1622J1125J0739J1159
$$ plain form
57307 1050279 1062162 1074356 1086683 1099443 1112672 1125916 1138757 1151095 1163078 1175201 1188032
57296 1188032 1201387 1214369 1226799 1239761 1254034 1268894 1283355 1297610 1312108 1326222 1339196
57285 1339196 1351639 1364579 1377734 1390203 1402202 1414493 1426627 1437526 1447496 1458005 1469680
57274 1469680 1482129 1495530 1510614 1527027 1543370 1559115 1575072 1591834 1609189 1627222 1646626
57263 1646626 1667561 1689392 1711815 1735177 1759530 1784453 1809885 1836051 1862433 1887938 1912261
57252 1912261 1936065 1959776 1983154 2006103 2028940 2051854 2075004 2098952 2123978 2149182 2173449
57241 2173449 2197128 2221481 2246691 2271778 2296448 2321528 2347402 2373453 2399449 2426214 2454450
57230 2454450 2483774 2513212 2541826 2568888 2594456 2619838 2646521 2674545 2702805 2730704 2758389
$$ packed form
57307A050279J1883J2194J2327J2760J3229J3244J2841J2338J1983J2123J2831
57296A188032J3355J2982J2430J2962J4273J4860J4461J4255J4498J4114J2974
57285A339196J2443J2940J3155J2469J1999J2291J2134J0899R970J0509J1675
57274A469680J2449J3401J5084J6413J6343J5745J5957J6762J7355J8033J9404
57263A646626K0935K1831K2423K3362K4353K4923K5432K6166K6382K5505K4323
57252A912261K3804K3711K3378K2949K2837K2914K3150K3948K5026K5204K4267
57241B173449K3679K4353K5210K5087K4670K5080K5874K6051K5996K6765K8236
57230B454450K9324K9438K8614K7062K5568K5382K6683K8024K8260K7899K7685
$$ plain form
57219 2758389 2785588 2811624 2836646 2861634 2887101 2912961 2939552 2967422 2996048 3024226 3051875
57208 3051875 3080087 3109254 3138589 3167709 3197236 3227435 3257779 3288306 3319957 3352879 3385738
57197 3385738 3417460 3448561 3479972 3511527 3542311 3571731 3599568 3625700 3650339 3674039 3697145
57186 3697145 3719655 3741593 3762824 3782624 3800398 3816827 3833302 3850282 3867244 3884140 3901603
57175 3901603 3919634 3937441 3954777 3972162 3989539 4006067 4021584 4036986 4052774 4068461 4083799
57164 4083799 4099273 4114919 4129925 4144039 4158199 4173115 4188321 4203213 4217954 4232637 4246554
57153 4246554 4259096 4270691 4282238 4294130 4306137 4317566 4327318 4334493 4339165 4341896 4342609 4340849 4336960
57140 4336960 4331749 4325085 4316224 4305679 4295258 4285942 4277127 4268333 4260249 4253606 4248385 4244758 4243530
$$ packed form
57219B758389K7199K6036K5022K4988K5467K5860K6591K7870K8626K8178K7649
57208C051875K8212K9167K9335K9120K9527L0199L0344L0527L1651L2922L2859
57197C385738L1722L1101L1411L1555L0784K9420K7837K6132K4639K3700K3106
57186C697145K2510K1938K1231J9800J7774J6429J6475J6980J6962J6896J7463
57175C901603J8031J7807J7336J7385J7377J6528J5517J5402J5788J5687J5338
57164D083799J5474J5646J5006J4114J4160J4916J5206J4892J4741J4683J3917
57153D246554J2542J1595J1547J1892J2007J1429R752P175M672K731P13j760l889
57140D336960n211o664q861j0545j0421r316q815q794q084o643n221l627j228
$$ plain form
57127 4243530 4245043 4248706 4254082 4261276 4269809 4278365 4286257 4294130 4302926 4313347 4326628 4344546 4368318
57114 4368318 4398826 4438223 4489756 4555492 4635641 4730628 4842415 4973573 5127030 5307787
57104 5307787 5523643 5783807 6098506 6480781 6947278 7517011 8211416 9056557 10083733
57095 10083733 11327335 12823795 14612490 16734111 19225352 22114915 25422483 29155805
57087 29155805 33305410 37843891 42730454 47910267 53305621 58813327 64317936 69703173
57079 69703173 74837166 79539782 83572494 86677520 88647706 89382790 88902929 87321997
57071 87321997 84802051 81510975 77596979 73183415 68378901 63293056 58047552 52775635
57063 52775635 47610454 42669545 38043669 33792877 29948053 26515687 23484174 20829477
$$ packed form
57127D243530J513L663N376P194Q533Q556P892P873Q796J0421J3281J7918K3772
57114D368318L0508L9397N1533O5736Q0149R4987J11787J31158J53457J80757
57104E307787K15856K60164L14699L82275M66497N69733O94405Q45141J027176
57095A0083733J243602J496460J788695K121621K491241K889563L307568L733322
57087B9155805M149605M538481M886563N179813N395354N507706N504609N385237
57079F9703173N133993M702616M032712L105026J970186P35084m79861j580932
57071H7321997k519946l291076l913996m413564m804514n085845n245504n271917
57063E2775635n165181m940909m625876m250792l844824l432366l031513k654697
$$ plain form
57055 20829477 18518974 16514713 14777291 13269137 11955942 10807410 9798478 8909564
57047 8909564 8124772 7430073 6813501 6265829 5779586 5347661 4963495 4621844 4318208
57038 4318208 4048052 3807527 3594333 3406827 3242761 3099827 2976835 2873306 2788395 2721209
57028 2721209 2671787 2640952 2629329 2636029 2655713 2675127 2674693 2637699 2560012 2450868 2325053
57017 2325053 2195076 2068747 1950050 1840271 1739290 1647027 1563690 1488988 1422066 1362227
57007 1362227 1308977 1261484 1218850 1180720 1146773 1115845 1086466 1058096 1030989 1005131 980242
56996 980242 956480 934146 912904 892302 872944 856148 842565 831912 823821 818134 814659 813642
56984 813642 816239 823535 835109 849039 862734 873048 876507 871071 857666 839082 817633 794805
$$ packed form
57055B0829477k310503k004261j737422j508154j313195j148532j008932q88914
57047H909564p84792o94699o16572n47672m86243m31925l84166l41651l03636
57038D318208k70156k40525k13194j87506j64066j42934j22992j03529q4911o7186
57028B721209m9422l0835j1623O700J9684J9414m34l6994p7687j09144j25815
57017B325053j29977j26329j18697j09779j00981r2263q3337p4702o6922n9839
57007A362227n3250m7493m2634l8130l3947l0928k9379k8370k7107k5858k4889
56996I80242k3762k2334k1242k0602j9358j6796j3583j0653q091n687l475j017
56984H13642K597P296J1574J3930J3695J0314L459n436j3405j8584k1449k2828
$$ plain form
56972 794805 772357 752132 734725 719553 706211 694775 685078 677009 671417 669464 671050 675004 680878
56959 680878 689582 702319 719932 742894 770300 798393 821233 833640 833435 821408 800327 773970
56947 773970 745860 718186 692033 668228 647320 629149 613451 600754 591860 586768 584999 586720
56935 586720 592565 602655 616835 635669 660135 690228 724346 759313 789991 809758 813500 800788
56923 800788 775551 742823 706573 669755 634463 601591 571397 544512 521533 501885 484328
56912 484328 468524 454982 443587 433434 424141 416105 409398 403520 398346 394260 391303 389098 387536
56899 387536 386610 385840 384918 384693 386302 389571 393465 397845 403466 410533 418786 428913 442367 459677
56885 459677 480240 503517 528570 552162 569151 575701 571395 558329 539588 518705 498746 480961
$$ packed form
56972G94805k2448k0225j7407j5172j3342j1436r697q069n592j953J586L954N874
56959F80878Q704J2737J7613K2962K7406K8093K2840J2407k05j2027k1081k6357
56947G73970k8110k7674k6153k3805k0908j8171j5698j2697q894n092j769J721
56935E86720N845J0090J4180J8834K4466L0093L4118L4967L0678J9767L742j2712
56923H00788k5237l2728l6250l6818l5292l2872l0194k6885k2979j9648j7557
56912D84328j5804j3542j1395j0153r293q036o707n878n174m086k957k205j562
56899C87536r26p70r22k25J609L269L894M380N621P067Q253J0127J3454J7310
56885D59677K0563K3277K5053K3592J6989O550m306j3066j8741k0883j9959j7785
$$ plain form
56873 480961 465149 451617 441728 436380 435235 437839 444422 455410 471309 493340 522996 560767
56861 560767 606413 660487 723937 795380 869457 937956 991791 1022848 1026802 1005735 967238 920094
56849 920094 870918 823984 781979 745960 715847 691865 674910 665523 663760 670328 686638 713523
56837 713523 751186 800646 863894 942325 1036031 1143884 1261302 1376551 1471412 1528458 1539096
56826 1539096 1505991 1439888 1354498 1261853 1169620 1081673 1000598 928690 866918 814797 772130
56815 772130 739811 718576 708259 708751 720520 743736 778126 824120 882784 953765 1033515 1114826
56803 1114826 1186613 1235177 1249447 1227343 1176392 1107744 1030614 951634 875866 806233 743483
56792 743483 688236 641888 604726 575010 551288 534060 524052 520577 523108 532847 551112 577478
$$ packed form
56873D80961j5812j3532r889n348j145K604O583J0988J5899K2031K9656L7771
56861E60767M5646N4074O3450P1443P4077O8499N3835L1057L954k1067l8497m7144
56849I20094m9176m6934m2005l6019l0113k3982j6955r387j763O568J6310K6885
56837G13523L7663M9460O3248P8431R3706J07853J17418J15249R4861N7046J0638
56826A539096l3105o6103q5390r2645r2233q7947q1075p1908o1772n2121m2667
56815G72130l2319k1235j0317M92J1769K3216L4390M5994N8664P0981P9750Q1311
56803A114826P1787M8564J4270k2104n0951o8648p7130p8980p5768o9633o2750
56792G43483n5247m6348l7162k9716k3722j7228j0008l475K531R739J8265K6366
$$ plain form
56780 577478 610886 650713 694410 735045 763585 773862 764672 738422 699592 653715 605694 558501
56768 558501 513888 473455 438009 406812 378859 354314 333634 316086 300410 286330 274250
56757 274250 264021 255128 247483 241022 235142 229566 224987 221799 218951 215233 210979 207336 204541 202170
56743 202170 200379 199527 199019 197810 195850 193949 192497 191256 190116 189220 188607 188316 188435 188601 188168 187305
56727 187305 187022 187541 187821 187408 187457 188865 190656 191462 191491 191700 192086 192230 192604 193781 195146 195915 196690 198480
56709 198480 200842 202581 203728 205195 206890 207842 207998 208365 209354 210255 210360 209668 208613 207943 208462 210023
56693 210023 211310 211501 211436 212123 212990 213003 212716 213541 215431 216941 217379 217377 217417 217298 217113 217431 218292 219040 219259
56674 219259 219057 218520 217770 217422 218102 219541 220859 221520 221467 220717 219540 218576 218138 217881 217689 218047 218879 219023
$$ packed form
56780E77478L3408L9827M3697M0635K8540J0277r190k6250l8830m5877m8021m7193
56768E58501m4613m0433l5446l1197k7953k4545k0680j7548j5676j4080j2080
56757B74250j0229q893p645o461n880n576m579l188k848l718m254l643k795k371
56743B02170j791q52n08j209j960j901j452j241j140q96o13k91J19J66m33q63
56727A87305k83N19K80m13M9J408J791Q06K9K09L86J44L74J177J365P69P75J790
56709A98480K362J739J147J467J695R52J56L67R89R01J05o92j055o70N19J561
56693B10023J287J91o5O87Q67J3k87Q25J890J510M38kM0j19j85L18Q61P48K19
56674B19259k02n37p50l48O80J439J318O61n3p50j177r64m38k57j92L58Q32J44
$$ plain form
56656 219023 217821 216207 215128 213940 211657 208773 206331 204045 200936 197119 193300 189162 184035 178704
56642 178704 174769 172480 170839 169663 169922 172071 175545 179806 184515 188792 191806 194043 196671 199703
56628 199703 202027 203097 203315 202933 201888 200607 199620 198475 196330 193549 191447 190521 190113 189657 189058 188039
56612 188039 186409 184862 184298 184440 184280 183674 183341 183534 183911 184439 185204 185679 185453 185272 185995 186925 186703 185513
56594 185513 184856 185399 186609 188212 190290 192051 192313 191319 190487 190274 189876 189022 188437 188387 188354 188380 189134 190464
56576 190464 191359 191668 192389 193963 195687 197056 198321 199430 199850 199831 200532 202532 205341 208650 212795 217723
56560 217723 222709 227448 232380 237722 243123 248337 253208 257114 259641 261681 264540 268033 270805 272407
56546 272407 273534 274283 273875 272341 270845 269949 269006 267686 266668 266373 266211 265489 263944 261207 257048 252462
$$ packed form
56656B19023j202j614j079j188k283k884k442k286l109l817l819m138n127n331
56642A78704l935k289j641j176K59K149L474M261M709M277L014K237K628L032
56628A99703K324J070K18l82j045j281r87j145k145k781k102r26m08m56n99j019
56612A88039j630j547n64J42j60o06l33J93L77N28P65M75k26j81P23R30k22j190
56594A85513o57N43J210J603K078J761K62r94q32k13l98q54n85n0l3K6P54J330
56576A90464Q95L09P21J574J724J369J265J109M20j9P01K000K809L309M145M928
56560B17723M986M739M932N342N401N214M871L906K527K040K859L493K772J602
56546B72407J127P49m08j534j496q96r43j320j018k95j62p22j545k737m159m586
$$ plain form
56530 252462 249173 247634 246573 244816 242455 240037 237771 235849 234491 233438 232264 231170 230532 229872 228441
56515 228441 226611 225396 224783 223900 222632 221601 220754 219484 217993 216957 216059 214589 213336 213885 215906
56500 215906 217145 216448 214914 213704 212647 211622 211478 212690 214449 215805 216597 216889 216724 216697 217498 218718
56484 218718 219336 219446 220082 221385 222465 223027 223484 223571 222663 221484 221567 222880 223900 224115 224397 224806 224310 223061
56466 223061 222684 223713 224877 225439 226071 226824 226558 225231 224522 225154 225687 224992 223961 223653 223685 223575 223902 224936
56448 224936 225686 225402 224636 223995 223390 223136 224078 225934 227283 227887 229104 231289 232866 232880 232412 232484 232644 232650
56430 232650 233400 234931 235555 234411 232973 232672 232925 232856 233057 234030 234659 233936 232722 232299 232580 233065 234046 235528
56412 235528 236435 236213 235836 236027 236057 235365 234692 234373 233342 231203 229535 229619 230563 231177 231961 233635 235320 235995
$$ packed form
56530B52462l289j539j061j757k361k418k266j922j358j053j174j094o38o60j431
56515B28441j830j215o13q83j268j031q47j270j491j036q98j470j253N49K021
56500B15906J239o97j534j210j057j025j44J212J759J356P92K92j65k7Q01J220
56484B18718O18J10O36J303J080N62M57Q7r08j179Q3J313J020K15K82M09m96j249
56466B23061l77J029J164N62O32P53k66j327p09O32N33o95j031l08L2j10L27J034
56448B24936P50k84p66o41o05k54R42J856J349O04J217K185J577J4m68P2J60O
56430B32650P50J531O24j144j438l01K53o9K01R73O29p23j214m23K81M85R81J482
56412B35528R07k22l77J91L0o92o73l19j031k139j668Q4R44O14P84J674J685O75
$$ plain form
56394 235995 236384 237829 240479 243937 248205 252634 255542 256390 256916 258690 261095 263043 264939 267356 269482
56379 269482 270608 271566 272989 273753 272926 271696 271475 271585 270728 269373 268795 268989 269337 270054 271228 271735 270919
56362 270919 270092 270682 272202 273688 275656 278707 281584 282660 282272 281762 281359 280805 280790 281901 283223 283747
56346 283747 284034 284861 285531 285285 285104 286267 288328 290221 292060 294079 295303 295124 294854 295716 296698 296406 295678
56329 295678 296244 298049 300018 302278 305479 309024 312069 315193 319105 322778 324903 326126 327884 330108
56315 330108 331924 333451 335029 335933 335763 335825 337235 339036 340122 341515 344631 348855 353006 357586 363260
56300 363260 368685 372419 375515 379717 384481 388337 391710 395699 399515 402072 404834 410036 417090 423656
56286 423656 429394 435769 442986 449950 456606 463628 470538 476652 483050 491060 499787 507735 515836 526121
$$ packed form
56394B35995L89J445K650L458M268M429K908Q48N26J774K405J948J896K417K126
56379B69482J126R58J423P64q27j230k21J10q57j355n78J94L48P17J174N07q16
56362B70919q27N90J520J486J968L051K877J076l88n10m03n54j5J111J322N24
56346B83747K87Q27O70k46j81J163K061J893J839K019J224j79k70Q62R82k92p28
56329B95678N66J805J969K260L201L545L045L124L912L673K125J223J758K224
56315C30108J816J527J578R04j70O2J410J801J086J393L116M224M151M580N674
56300C63260N425L734L096M202M764L856L373L989L816K557K762N202P054O566
56286D23656N738O375P217O964O656P022O910O114O398Q010Q727P948Q101J0285
$$ plain form
56272 526121 538423 551180 564447 579231 594898 610332 626766 646299 668363 690780 713652
56261 713652 739073 767593 798144 831054 868113 910017 956580 1008953 1068814 1135897 1209163
56250 1209163 1289711 1379597 1478503 1584563 1697706 1818952 1947006 2078798 2212791 2348433
56240 2348433 2482847 2611412 2731262 2840914 2936957 3014698 3071980 3109097 3125239 3118503 3089329
56229 3089329 3040609 2974463 2892150 2796858 2693065 2583050 2467319 2348362 2230453 2115634
56219 2115634 2003201 1893262 1787655 1687393 1592483 1504166 1423861 1349970 1279304 1211730
56209 1211730 1149892 1094357 1042839 994483 951043 913144 878933 847163 818381 792503 768369
56198 768369 746201 727399 711560 696762 682890 671493 662266 653137 643927 636405 630614 624698 618518
$$ packed form
56272E26121J2302J2757J3267J4784J5667J5434J6434J9533K2064K2417K2872
56261G13652K5421K8520L0551L2910L7059M1904M6563N2373N9861O7083P3266
56250A209163Q0548Q9886R8906J06060J13143J21246J28054J31792J33993J35642
56240B348433J34414J28565J19850J09652R6043P7741N7282L7117J6142o736k9174
56229C089329m8720o6146q2313r5292j03793j10015j15731j18957j17909j14819
56219B115634j12433j09939j05607j00262r4910q8317q0305p3891p0666o7574
56209A211730o1838n5535n1518m8356m3440l7899l4211l1770k8782k5878k4134
56198G68369k2168j8802j5839j4798j3872j1397r227r129r210p522n791n916o180
$$ plain form
56185 618518 613747 610183 605832 600926 597948 597193 596165 593923 592143 591380 590199 588676 588769 590492 591623
56170 591623 591971 593931 598024 601996 605278 610211 617579 624981 631032 637387 645228 653440 661668 671617
56156 671617 683840 696604 709199 723189 739283 756269 774038 794353 817811 843391 871765
56145 871765 905567 945733 991164 1042570 1102835 1172937 1251395 1338206 1435092 1540943 1650914
56134 1650914 1760574 1866822 1964612 2048090 2116516 2174767 2226924 2273589 2315816 2355953 2392716
56123 2392716 2420398 2435080 2437679 2429914 2412226 2387133 2359306 2329868 2294625 2249424 2192998 2123797
56111 2123797 2039667 1942830 1840331 1737621 1636200 1538626 1450086 1372867 1304574 1243891 1192850
56100 1192850 1151463 1115827 1083956 1058081 1038837 1022802 1008330 998111 993152 989852 985955 983806
$$ packed form
56185F18518m771l564m351m906k978p55j028k242j780p63j181j523R3J723J131
56170E91623L48J960M093L972L282M933P368P402O051O355P841Q212Q228R949
56156F71617J2223J2764J2595J3990J6094J6986J7769K0315K3458K5580K8374
56145H71765L3802M0166M5431N1406O0265P0102P8458Q6811R6886J05851J09971
56134A650914J09660J06248R7790Q3478O8426N8251N2157M6665M2227M0137L6763
56123B392716K7682J4682K599p765j7688k5093k7827k9438l5243m5201n6426o9201
56111B123797q4130r6837j02499j02710j01421r7574q8540p7219o8293o0683n1041
56100A192850m1387l5636l1871k5875j9244j6035j4472j0219m959l300l897k149
$$ plain form
56088 983806 984746 985945 985938 987657 992705 998220 1002730 1009380 1019804 1030432 1038579 1046734 1057193 1067985
56074 1067985 1077879 1089783 1105173 1120609 1133772 1147601 1164492 1181835 1197339 1213286 1231492
56063 1231492 1249483 1265729 1283106 1303095 1322108 1337659 1352534 1368866 1384055 1396725 1410517
56052 1410517 1427505 1444069 1457864 1472525 1490685 1508877 1524511 1541396 1562931 1586060 1607515
56041 1607515 1629786 1655399 1681481 1705629 1730998 1760098 1789924 1818663 1850531 1888205 1927228
56030 1927228 1963839 2001417 2043201 2085840 2126502 2169080 2216673 2265144 2310877 2357649 2409006
56019 2409006 2461365 2511683 2564256 2622729 2683225 2742773 2806324 2877761 2952422 3026548 3105448
56008 3105448 3193842 3286936 3379926 3477380 3584042 3695428 3807036 3923752 4050439 4182675
$$ packed form
56088I83806R40J199pJ719N048N515M510O650J0424J0628Q147Q155J0459J0792
56074A067985R894J1904J5390J5436J3163J3829J6891J7343J5504J5947J8206
56063A231492J7991J6246J7377J9989J9013J5551J4875J6332J5189J2670J3792
56052A410517J6988J6564J3795J4661J8160J8192J5634J6885K1535K3129K1455
56041A607515K2271K5613K6082K4148K5369K9100K9826K8739L1868L7674L9023
56030A927228L6611L7578M1784M2639M0662M2578M7593M8471M5733M6772N1357
56019B409006N2359N0318N2573N8473O0496N9548O3551P1437P4661P4126P8900
56008C105448Q8394R3094R2990R7454J06662J11386J11608J16716J26687J32236
$$ plain form
55998 4182675 4316699 4458655 4613558 4775228 4937958 5107724 5290827 5482535 5678735
55989 5678735 5887386 6115995 6359503 6613352 6886181 7186015 7506914 7843640 8206109
55980 8206109 8604337 9033472 9489877 9987016 10538306 11140106 11790110 12505914 13305775
55971 13305775 14188962 15156827 16235162 17453499 18822975 20360269 22112900 24134746
55963 24134746 26460437 29134414 32241292 35875675 40108902 45020541 50733980 57388637
55955 57388637 65123912 74147908 84793108 97467557 112614222 130775202 152603950
55948 152603950 178705553 209513930 245286665 285684905 328541198 368771937 399206905
55941 399206905 413638979 409933756 390665008 361079864 326449681 290644233 256023054
$$ packed form
55998D182675J34024J41956J54903J61670J62730J69766J83103J91708J96200
55989E678735K08651K28609K43508K53849K72829K99834L20899L36726L62469
55980H206109L98228M29135M56405M97139N51290O01800O50004P15804P99861
55971A3305775Q83187R67865J078335J218337J369476J537294J752631K021846
55963B4134746K325691K673977L106878L634383M233227M911639N713439O654657
55955E7388637P735275R023996J0645200J2674449J5146665J8160980K1828748
55948A52603950K6101603L0808377L5772735M0398240M2856293M0230739L0434968
55941C99206905J4432074l705223j9268748k9585144l4630183l5805448l4621179
$$ plain form
55934 256023054 223808344 194473035 168123084 144780672 124429111 106930991 92032731
55927 92032731 79448540 68888295 60038254 52592263 46308284 41000612 36495160 32633487
55919 32633487 29305098 26434203 23942230 21753750 19825109 18132872 16641648 15310589
55911 15310589 14120540 13065888 12127103 11276606 10503687 9809103 9181860 8604085 8072276
55902 8072276 7591944 7156787 6753172 6379430 6041308 5733581 5444640 5174352 4929599
55893 4929599 4706627 4494836 4293841 4110444 3942550 3781920 3629386 3492097 3368629
55884 3368629 3251266 3140292 3042057 2955033 2870797 2786828 2706274 2627489 2545777 2463477 2387004
55873 2387004 2315754 2244269 2172891 2105959 2042087 1976539 1910848 1850205 1793802 1737409 1682857
$$ packed form
55934B56023054l2214710k9335309k6349951k3342412k0351561j7498120j4898260
55927I2032731j2584191j0560245q850041p445991o283979n307672m505452l861673
55919C2633487l328389k870895k491973k188480j928641j692237j491224j331059
55911A5310589j190049j054652r38785q50497p72919o94584o27243n77775n31809
55902H072276m80332m35157m03615l73742l38122l07727k88941k70288k44753
55893D929599k22972k11791k00995j83397j67894j60630j52534j37289j23468
55884C368629j17363j10974r8235q7024q4236q3969q0554p8785q1712q2300p6473
55873B387004p1250p1485p1378o6932o3872o5548o5691o0643n6403n6393n4552
$$ plain form
55862 1682857 1635252 1593211 1551320 1509763 1472228 1436903 1399036 1360170 1325585 1294735 1263250
55851 1263250 1232103 1205691 1182816 1158525 1133022 1109971 1087954 1062621 1035574 1012146 991729
55840 991729 969115 944251 922004 903143 884066 864781 848835 835746 821475 806062 793156
55829 793156 782394 769822 755591 743838 735134 726227 717029 710668 706623 700757 692274 684101 676434
55816 676434 666457 654506 644161 636114 627968 619872 614297 610541 605682 600693 599425 601707 603720 605088
55802 605088 609307 617036 625188 632914 642375 653102 661497 666503 670195 672377 670188 663532 655414 646459
55788 646459 634554 620374 607839 598502 590604 583894 579870 576769 570051 558932 547401 537988 529734
55775 529734 523128 521570 526388 535214 546790 562849 583508 604621 620978 628948 625925 611495 589888
$$ packed form
55862A682857m7605m2041m1891m1557l7535l5325l7867l8866l4585l0850l1485
55851A263250l1147k6412k2875k4291k5503k3051k2017k5333k7047k3428k0417
55840I91729k2614k4864k2247j8861j9077j9285j5946j3089j4271j5413j2906
55829G93156j0762j2572j4231j1753q704q907r198o361m045n866q483q173p667
55816F76434r977j1951j0345q047q146q096n575l756m859m989j268K282K013J368
55802F05088M219P729Q152P726R461J0727Q395N006L692K182k189o656q118q955
55788F46459j1905j4180j2535r337p898o710m024l101o718j1119j1531r413q254
55775E29734o606j558M818Q826J1576J6059K0659K1113J6357P970l023j4430k1607
$$ plain form
55762 589888 567316 546133 524929 503903 485642 470558 456396 442764 431601 422642 413063 402396
55750 402396 393230 386188 378619 369254 359897 351562 343119 334728 328455 324494 320781 317233 316217 317817
55736 317817 318714 316925 313814 310506 306267 301479 298270 296936 295371 292910 291017 289416 285648 279515
55722 279515 274023 270781 268335 265998 265220 265979 265976 264911 265625 269526 274671 279810 286309 294401 301429 305731
55706 305731 308653 310958 310867 307666 303779 301140 298629 294929 290756 286374 280167 271720 263417 257010 251466
55691 251466 245910 241704 239609 237825 234900 232047 230711 230435 230828 232918 236721 240146 242226 244863 249492
55676 249492 254585 258375 261515 264961 267584 268055 267081 265836 264043 261325 258561 256366 254039 251409 249753
55661 249753 249641 249946 250201 251668 254818 258119 260662 263547 267316 270507 272295 274109 276959 279589 280940
$$ packed form
55762E89888k2572k1183k1204k1026j8261j5084j4162j3632j1163q959r579j0667
55750D02396r166p042p569r365r357q335q443q391o273l961l713l548j016J600
55736C17817Q97j789l111l308m239m788l209j334j565k461j893j601l768o133
55722B79515n492l242k446k337p78P59lj065P14L901N145N139O499Q092P028M302
55706C05731K922K305r1l201l887k639k511l700m173m382o207q447q303o407n544
55691B51466n556m206k095j784k925k853j336k76L93K090L803L425K080K637M629
55676B49492N093L790L140L446K623M71r74j245j793k718k764k195k327k630j656
55661B49753j12L05K55J467L150L301K543K885L769L191J788J814K850K630J351
$$ plain form
55646 280940 281997 283376 283470 280972 277047 273040 268074 260917 252306 243572 234816 226147 218764 213001 207241
55631 207241 200556 194565 190863 188518 186003 183700 182468 181466 179492 177073 175312 173988 172520 171401
55617 171401 171037 170470 168878 167026 165832 164873 163625 162657 162273 161565 160143 159113 158976 158339 156231 153896
55601 153896 152697 151975 150648 149217 148489 147949 147050 146543 146843 146712 145267 143655 143030 142560 141248 140064
55585 140064 140253 141130 141635 142621 145284 148527 150218 150270 150442 151744 153804 156186 158683 160891 162877 165541
55569 165541 169151 172483 174624 176532 179431 182795 185313 186832 187894 188309 187634 186269 184824 183206 181297
55554 181297 179567 178058 175933 172957 170153 168134 166219 164178 163128 163506 163841 162888 161421 160536 159881
55539 159881 158936 158398 158694 158829 158317 158553 160517 162796 163771 164126 165180 166319 166316 165765 165878 165987 164542 161727
$$ packed form
55646B80940J057J379R4k498l925m007m966p157q611q734q756q669p383n763n760
55631B07241o685n991l702k345k515k303j232j002j974k419j761j324j468j119
55617A71401l64n67j592j852j194r59j248r68l84p08j422j030j37o37k108k335
55601A53896j199p22j327j431p28n40q99n07L00j31j445j612o25m70j312j184
55585A40064J89Q77N05R86K663L243J691N2J72J302K060K382K497K208J986K664
55569A65541L610L332K141J908K899L364K518J519J062M15o75j365j445j618j909
55554A81297j730j509k125k976k804k019j915k041j050L78L35r53j467q85o55
55539A59881r45n38K96J35n12K36J964K279R75L55J054J139ln51J13J09j445k815
$$ plain form
55521 161727 158989 156715 154270 151534 148614 144884 140054 135267 131551 128288 124811 122108 120959 119778
55507 119778 116574 111993 108136 105368 102634 100056 98730 98488 98154 97591 97464 97533 97300 97748 100238 104091
55491 104091 107402 109850 112557 115531 117439 117895 117900 118020 117916 117632 117638 117645 117004 116118 115945 116359 116518 116472 116818
55472 116818 117147 116583 115509 115082 115314 115296 114966 114906 114792 113840 112506 111928 111908 111319 110321 110299 111592 113100 114157
55453 114157 115076 115795 115722 115073 114772 114878 114588 113919 113822 114530 115168 115214 115024 114808 114294 113483 112644 111692 110606
55434 110606 110109 110707 111518 111444 111014 111552 112969 114102 114881 116246 118046 118959 118603 118009 117836 117801 118064 119455
55416 119455 122005 124808 127633 131202 135492 139244 141596 142904 143590 143444 142498 141389 140389 139016 136932
55401 136932 134384 131638 128864 126538 125018 123793 122159 120400 119237 118378 116918 115026 113855 113813 114243
$$ packed form
55521A61727k738k274k445k736k920l730m830m787l716l263l477k703j149j181
55507A19778l204m581l857k768k734k578j326k42l34n63j27O9k33M48K490L853
55491A04091L311K448K707K974J908M56NJ20j04k84OPo41q86j73M14J59m6L46
55472A16818L29n64j074m27K32j8l30o0j14r52j334n78k0n89r98k2J293J508J057
55453A14157R19P19p3o49l01J06k90o69r7P08O38M6j90k16n14q11q39r52j086
55434A10606m97N98Q11p4m30N38J417J133P79J365J800R13l56n94j73l5K63J391
55416A19455K550K803K825L569M290L752K352J308O86j46r46j109j000j373k084
55401A36932k548k746k774k326j520j225j634j759j163q59j460j892j171m2M30
$$ plain form
55386 114243 114783 115701 116888 117802 118481 119367 120154 120106 119455 119156 119239 118820 117782 116995 116676 115985 114550 113125
55368 113125 112395 112262 112506 113028 113298 112730 111754 111437 111937 112453 112672 113055 113617 113708 113160 112460 111712 110641 109656
55349 109656 109572 110150 110187 109275 108129 107068 105557 103597 102218 102108 102852 103919 105325 106942 108178 108760
55333 108760 109056 109388 109721 110047 110293 110043 109208 108714 109411 110671 111287 111360 111866 112626 112361 110769 108963 107750
55315 107750 106958 106565 106901 107642 108082 108513 109784 111434 111934 111011 110033 109777 109549 108896 108434 108422 108158 107419
55297 107419 106978 107119 107088 106606 106416 106769 106851 106313 105931 106153 106496 106904 108100 109933 111076 111100 111216 112109 112724
55278 112724 112203 111348 111026 110724 109968 109700 110744 112199 112825 112984 113675 114551 114414 113095 111499 110249 109412
55261 109412 109064 109144 109180 109051 109458 110835 112394 113120 113098 113052 113137 113067 112857 112676 112456 112346 112939 114350 115647
$$ packed form
55386A14243N40R18J187R14O79Q86P87m8o51k99Q3m19j038p87l19o91j435j425
55368A13125p30j33K44N22K70n68r76l17N00N16K19L83N62R1n48p00p48j071r85
55349A09656q4N78L7r12j146j061j511j960j379j10P44J067J406J617J236N82
55333A08760K96L32L33L26K46k50q35m94O97J260O16P3N06P60k65j592j806j213
55315A07750p92l93L36P41M40M31J271J650N00r23r78k56k28o53m62j2k64p39
55297A07419m41J41l1m82j90L53Q2n38l82K22L43M08J196J833J143K4J16Q93O15
55278A12724n21q55l22l02p56k68J044J455O26J59O91Q76j37j319j596j250q37
55261A09412l48Q0L6j29M07J377J559P26k2m6Q5p0k10j81k20j10N93J411J297
$$ plain form
55242 115647 115899 115254 114332 113256 112019 111210 111509 112794 114355 115600 116154 115824 114967 114351 114221 114046 113504
55225 113504 112947 112502 111630 110134 108786 108303 108425 108568 108619 108476 107693 106296 105237 105297 106128 107002 107838 108825
55207 108825 109755 110413 111080 112014 112962 113687 114389 115115 115448 115205 114777 114340 113513 112283 111435 111531 112261 113252 114577
55188 114577 115926 116358 115625 114807 114827 115209 115167 115003 115409 116104 116202 115508 114602 114026 113979 114374 114701 114424 113912 114254
55168 114254 115700 117167 117737 117710 117635 117417 117099 117391 118531 119560 119694 119463 119622 119892 119796 119728 120072 120187 119481
55149 119481 118674 118727 119257 119321 119081 119346 119995 120238 120048 120028 120132 119744 118891 118204 117831 117357 116691 116108 115551 114723
55129 114723 113706 112832 112223 112021 112652 114148 115698 116575 116935 117100 116801 116014 115683 116512 117751 118328 118549
55112 118549 119367 120577 121180 121148 121394 122178 122866 123168 123311 123087 121962 120279 119192 119257 120027 121062 122422
$$ packed form
55242A15647K52o45r22j076j237q09K99J285J561J245N54l30q57o16j30j75n42
55225A13504n57m45q72j496j348m83J22J43N1j43p83j397j059O0Q31Q74Q36R87
55207A08825R30O58O67R34R48P25P02P26L33k43m28m37q27j230q48R6P30R91J325
55188A14577J349M32p33q18K0L82m2j64M06O95R8o94r06n76m7L95L27k77n12L42
55168A14254J446J467N70k7p5k18l18K92J140J029J34k31J59K70r6o8L44J15p06
55149A19481q07N3N30O4k40K65O49K43j90k0J04l88q53o87l73m74o66n83n57q28
55129A14723j017q74o09k02O31J496J550Q77L60J65k99p87l31Q29J239N77K21
55112A18549Q18J210O03l2K46P84O88L02J43k24j125j683j087O5P70J035J360
$$ plain form
55095 122422 124088 125745 127177 128195 128381 127733 127289 128118 129855 131194 131655 131819 131959 131718 131232 131377 132518
55078 132518 133874 134475 134083 133017 131769 130906 130706 130727 130289 129395 128652 128388 128535 129199 130535 132046 132822
55061 132822 132660 132303 132439 132973 133303 132883 131553 129843 128780 128925 129706 130167 130076 129794 129423 128798 128048 127455
55043 127455 126963 126390 125826 125239 124159 122517 121276 121302 122024 122184 121592 121152 121438 122288 123522 124940 125813
55026 125813 125470 124333 123343 122538 121298 119802 118930 118770 118535 118078 118175 119054 119907 120283 120788 121964 123473
55009 123473 124856 126105 126987 126780 125291 123379 121973 121253 121126 121733 122955 124173 125063 126023 127407 128966
54993 128966 130443 132027 133691 134775 134882 134647 134960 135774 136284 136042 135350 134692 134277 134128 134285 134800 135549
54976 135549 136099 135902 134891 133767 133429 134191 135670 137188 137970 137399 135729 134341 134612 136550 138984 140890
$$ packed form
55095A22422J666J657J432J018J86o48m44Q29J737J339M61J64J40k41m86J45J141
55078A32518J356O01l92j066j248q63k00K1m38q94p43k64J47O64J336J511P76
55061A32822j62l57J36N34L30m20j330j710j063J45P81M61r1k82l71o25p50n93
55043A27455m92n73n64n87j080j642j241K6P22J60n92m40K86Q50J234J418Q73
55026A25813l43j137r90q05j240j496q72j60k35m57R7Q79Q53L76N05J176J509
55009A23473J383J249Q82k07j489j912j406p20j27O07J222J218Q90R60J384J559
54993A28966J477J584J664J084J07k35L13Q14N10k42o92o58m15j49J57N15P49
54976A35549N50j97j011j124l38P62J479J518P82n71j670j388K71J938K434J906
$$ plain form
54960 140890 141937 142031 141235 140147 139508 139311 138974 138459 138482 139435 140818 141959 142721 143270 143695 144035 144314 144434
54942 144434 144451 144837 145916 147091 147271 146088 144173 142347 141146 140981 141928 143361 144581 145819 147871 150849
54926 150849 154234 158110 163165 169160 174567 178369 181464 185672 191882 199511 207084 212903 215806 215858 214039
54911 214039 211023 206778 201460 195887 190723 185798 180688 175459 170417 165631 161109 157023 153450 150304
54897 150304 147785 146411 146290 146837 147484 148173 148907 149396 149515 149625 150052 150689 151454 152699 154809 157829 161791
54880 161791 166946 173244 179965 186302 192131 197848 203687 209445 214615 218559 220684 220661 218461 214293 208779
54865 208779 202995 197772 192967 187864 182268 176675 171436 166436 161669 157453 153898 150796 148223 146604
54851 146604 145978 145773 145560 145475 145606 145578 145013 143948 142597 141106 139723 138691 137880 136956 135929 134996 133897
$$ packed form
54960A40890J047R4p96j088o39j97l37n15K3R53J383J141P62N49M25L40K79J20
54942A44434J7L86J079J175J80j183j915j826j201j65R47J433J220J238K052K978
54926A50849L385L876N055N995N407L802L095M208O210P629P573N819K903N2j819
54911B14039l016m245n318n573n164m925n110n229n042m786m522m086l573l146
54897A50304k519j374j21N47O47O89P34M89J19J10M27O37P65J245K110L020L962
54880A61791N155O298O721O337N829N717N839N758N170L944K125k3k200m168n514
54865B08779n784n223m805n103n596n593n239n000m767m216l555l102k573j619
54851A46604o26k05k13q5J31k8n65j065j351j491j383j032q11r24j027r33j099
$$ plain form
54834 133897 132230 130392 129334 129212 129190 128806 128606 129051 129786 130404 131069 131827 132163 131774 131011 130065 128632 126960
54816 126960 126189 126774 127514 127183 126368 126534 127873 129351 130521 131950 133895 135767 137104 138145 139163 140025
54800 140025 140638 141198 141748 142049 142117 142388 143057 143675 143706 143209 142702 142532 142635 142839 143190 143837 144740 145650 146503
54781 146503 147603 149212 151078 152670 153813 154779 155912 157529 160032 163537 167464 171108 174696 179191
54767 179191 184963 191335 197656 204036 210662 217043 222437 226442 228768 229041 227349 224413 220698 215848
54753 215848 209610 202724 196209 190149 183979 177748 172314 168286 165382 162901 160463 158231 156624 155780
54739 155780 155236 154401 153426 153123 153866 155136 156471 158200 160696 163515 165996 168287 171016 174246 177593
54724 177593 181177 185550 190690 195873 200680 205446 210433 215064 218264 219241 217769 214108 208915 203014
$$ packed form
54834A33897j667j838j058j22k2l84k00M45P35O18O65P58L36l89p63r46j433j672
54816A26960p71N85P40l31q15J66J339J478J170J429J945J872J337J041J018Q62
54800A40025O13N60N50L01O8K71O69O18L1m97n07j70J03K04L51O47R03R10Q53
54781A46503J100J609J866J592J143R66J133J617K503L505L927L644L588M495
54767A79191N772O372O321O380O626O381N394M005K326K73j692k936l715m850
54753B15848o238o886o515o060o170o231n434m028k904k481k438k232j607q44
54739A55780n44q35r75l03P43J270J335J729K496K819K481K291K729L230L347
54724A77593L584M373N140N183M807M766M987M631L200R77j472l661n193n901
$$ plain form
54710 203014 196950 190810 184538 178330 172626 167785 163843 160597 157921 155890 154525 153490 152268 150672
54696 150672 149021 147801 147293 147503 148231 149160 149999 150485 150265 149098 147440 146359 146378 146717 146329 145348 144699
54679 144699 144569 144330 143945 144200 145219 145903 145425 144348 143583 143136 142612 142213 142353 142789 142942 142712 142362 141977
54661 141977 141628 141590 141766 141398 140118 138856 138857 140040 141139 141295 140769 140174 139757 139509 139425 139500 139768 140289 140901
54642 140901 141178 140945 140534 140262 140026 139826 140193 141498 143143 144020 143678 142612 141567 140967 140835 140880 140768 140515
54624 140515 140351 140215 139876 139702 140499 142211 143634 144005 144047 144619 145124 144330 142282 140249 139037 138370 137819
54607 137819 137334 136900 136532 136635 137608 139100 140297 140925 141375 141965 142732 143818 145290 146611 146957 146095 144447
54590 144447 142530 140886 140267 141016 142375 143175 143171 143042 143233 143563 143852 144113 144170 143890 143770 144509 146031 147622
$$ packed form
54710B03014o064o140o272o208n704m841l942l246k676k031j365j035j222j596
54696A50672j651j220n08K10P28R29Q39M86k20j167j658j081J9L39l88r81o49
54679A44699j30k39l85K55J019O84m78j077p65m47n24l99J40M36J53k30l50l85
54661A41977l49l8J76l68j280j262JJ183J099J56n26n95m17k48q4P5K68N21O12
54642A40901K77k33m11k72k36k00L67J305J645Q77l42j066j045o00j32M5j12k53
54624A40515j64j36l39j74P97J712J423L71M2N72N05p94k048k033j212o67n51
54607A37819m85m34l68J03R73J492J197O28M50N90P67J086J472J321L46q62j648
54590A44447j917j644o19P49J359Q00mj29J91L30K89K61N7k80j20P39J522J591
$$ plain form
54572 147622 148915 149838 149773 147923 144733 141917 140734 140986 141939 143272 144767 145933 146496 146699 146731 146442 145905
54555 145905 145638 145906 146355 146624 146748 146720 146320 145772 145914 147238 149239 151145 152797 154438 156080 157561 158845
54538 158845 159809 160084 159521 158570 157842 157487 157257 156940 156461 155814 155133 154629 154225 153549 152488 151521 151291 152007
54520 152007 153345 154709 155438 155091 153716 151794 149912 148580 148187 148706 149520 149967 150072 150358 150969 151445 151383
54503 151383 150822 149933 148869 148022 147937 148779 150195 151752 153079 153651 153076 151705 150367 149402 148546 147852 147929
54486 147929 148952 150142 150724 150852 151120 151629 152081 152401 152769 153237 153748 154325 154974 155622 156374 157535 159090
54469 159090 160498 161293 161630 161933 162382 163068 164273 166129 168152 169528 169797 169043 167583 165765 163958 162468
54453 162468 161438 160904 160821 160957 160979 160715 160151 159202 157838 156478 155788 155916 156288 156377 156317 156522 157072 157777 158519
$$ packed form
54572A47622J293R23o5j850l190k816j183K52R53J333J495J166N63K03L2k89n37
54555A45905k67K68M49K69J24k8m00n48J42J324K001J906J652J641J642J481J284
54538A58845R64K75n63r51p28l55k30l17m79o47o81n04m04o76j061r67k30P16
54520A52007J338J364P29l47j375j922j882j332l93N19Q14M47J05K86O11M76o2
54503A51383n61q89j064q47q5Q42J416J557J327N72n75j371j338r65q56o94P7
54486A47929J023J190N82J28K68N09M52L20L68M68N11N77O49O48P52J161J555
54469A59090J408P95L37L03M49O86J205J856K023J376K69p54j460j818j807j490
54453A62468j030n34q3J36K2k64n64r49j364j360o90J28L72Q9o0K05N50P05P42
$$ plain form
54434 158519 159170 159407 158986 158106 157279 156910 157127 157801 158663 159559 160733 162495 164515 165815 165764 164819 163980 163721
54416 163721 163748 163574 163027 162289 161759 161804 162397 162990 162943 162156 161246 161112 162199 164071 165724 166462 166461 166455 167062 168515
54396 168515 170688 173001 174585 175069 175054 175354 175974 176436 176807 177529 178240 177855 176107 174137 173093 172926 173084
54379 173084 173592 174662 175817 176315 176197 176224 176830 177724 178456 178909 179290 180025 181584 184075 187084 190149 193279
54362 193279 196776 200719 204832 208605 211416 212877 213378 213901 214908 215756 215559 214212 212070 209101 205129
54347 205129 200733 197019 194393 192188 189701 187049 184784 183110 181828 180697 179561 178317 177045 176079
54333 176079 175673 175652 175573 175217 174790 174617 174764 175029 175184 175091 174639 173775 172658 171601 170792 170242 170111 170685 171766
54314 171766 172426 171894 170546 169526 169464 170126 171153 172415 173518 173781 173146 172553 172861 173820 174514 174488 173984 173387
$$ packed form
54434A58519O51K37m21q80q27l69K17O74Q62Q96J174J762K020J300n1r45q39k59
54416A63721K7j74n47p38n30M5N93N93m7p87r10j34J087J872J653P38joO07J453
54396A68515K173K313J584M84j5L00O20M62L71P22P11l85j748j970j044j67J58
54379A73084N08J070J155M98j18K7O06Q94P32M53L81P35J559K491L009L065L130
54362A93279L497L943M113L773K811J461N01N23J007Q48j97j347k142k969l972
54347B05129m396l714k626k205k487k652k265j674j282j131j136j244j272r66
54333A76079m06k1p9l56m27j73J47K65J55r3m52q64j117j057q09n50j31N74J081
54314A71766O60n32j348j020o2O62J027J262J103K63o35n93L08R59O94k6n04n97
$$ plain form
54296 173387 172916 172707 172743 172816 172803 172828 172858 172425 171204 169681 168809 168960 169589 169927 169757 169413 169303 169567 170158 171076
54276 171076 172351 173764 174793 175135 175128 175339 175871 176478 177287 178766 180860 182786 183924 184423 184633 184518 183993
54259 183993 183357 182941 182714 182621 182909 183674 184470 184853 184995 185260 185510 185368 184913 184534 184314 184088 183896 183836 183633
54240 183633 182941 181977 181250 180762 180093 179347 179293 180340 181816 182625 182348 181473 180781 180704 181169 181838 182454 182979 183475
54221 183475 183962 184427 184788 184839 184417 183684 182902 181927 180357 178389 176952 176534 176344 175245 173233 171352 170292
54204 170292 169750 169217 168778 168895 169739 170955 171905 172188 172045 172138 172667 172953 172258 170872 169855 169793 170301 170792
54186 170792 171232 171994 173369 175373 177658 179464 180051 179489 178828 179202 180816 182972 184942 186642 188368 190019
54170 190019 190803 189915 187475 184516 181993 180062 178502 177431 177176 177625 178201 178479 178518 178568 178747 179017 179218
$$ packed form
54296A73387m71k09L6P3j3K5L0m33j221j523q72J51O29L38j70l44j10K64N91R18
54276A71076J275J413J029L42pK11N32O07Q09J479K094J926J138M99K10j15n25
54259A83993o36m16k27r3K88P65P96L83J42K65K50j42m55l79k20k26j92o0k03
54240A83633o92r64p27m88o69p46n4J047J476Q09k77q75o92p7M65O69O16N25M96
54221A83475M87M65L61N1m22p33p82r75j570j968j437m18j90j099k012j881j060
54204A70292n42n33m39J17Q44J216R50K83j43R3N29K86o95j386j017o2N08M91
54186A70792M40P62J375K004K285J806N87n62o61L74J614K156J970J700J726J651
54170A90019P84q88k440k959k523j931j560j071k55M49N76K78L9N0J79K70K01
$$ plain form
54153 179218 179054 178256 176802 174952 173114 171736 171196 171552 172518 173758 175067 176201 176843 176993 177117 177614
54137 177614 178322 178831 179018 178975 178713 178347 178338 178983 179829 180093 179675 179276 179559 180623 182243 184087 185598 186205
54119 186205 185913 185374 185201 185471 186027 186930 188353 190185 191935 193089 193595 194043 195185 197115 199100 200408
54103 200408 201155 202068 203674 206050 209138 212784 216579 220214 224055 228902 235094 242172 249299 255555 259847
54088 259847 261175 259286 254748 248322 240752 233217 227191 223293 220646 217919 214816 212164 210742 210569
54074 210569 211284 212686 214706 217129 219621 221980 224248 226626 229332 232485 235981 239360 241872 242864 242271
54059 242271 240684 238838 237047 235158 232958 230417 227635 224776 222121 219978 218507 217728 217764 218894 221204
54044 221204 224250 227310 230055 232862 236322 240515 245046 249727 254796 260236 265357 269573 273368 277817
$$ packed form
54153A79218j64p98j454j850j838j378n40L56R66J240J309J134O42J50J24M97
54137A77614P08N09J87m3k62l66rO45Q46K64m18l99K83J064J620J844J511O07
54119A86205k92n39j73K70N56R03J423J832J750J154N06M48J142J930J985J308
54103B00408P47R13J606K376L088L646L795L635L841M847O192P078P127O256M292
54088B59847J328j889m538o426p570p535o026l898k647k727l103k652j422j73
54074B10569P15J402K020K423K492K359K268K378K706L153L496L379K512R92n93
54059B42271j587j846j791j889k200k541k782k859k655k143j471p79L6J130K310
54044B21204L046L060K745K807L460M193M531M681N069N440N121M216L795M449
$$ plain form
54030 277817 283132 288305 292338 295259 297675 299899 301898 303701 305400 307039 308762 310726 312541 313284
54016 313284 312519 310962 309599 308399 306500 303436 299603 295530 291202 286233 280423 274175 268475 264230
54002 264230 261357 258768 255575 252049 249065 246949 245342 243840 242170 239999 237215 234350 232129 230586
53988 230586 229154 227602 226373 225868 225881 225843 225366 224433 223362 222592 222361 222623 223333 224513 225838 226558 226179
53971 226179 224893 223060 220757 218424 217328 218523 221503 224662 227040 229009 231459 235024 239986 246172
53957 246172 252885 259581 266621 274835 284474 295248 307160 320379 334142 346504 355414 359686 359189
53944 359189 354854 348473 341675 335013 328507 322707 318348 315214 312528 310412 309766 310610 311785 312630 313694
53929 313694 315333 316842 317666 318479 320239 322963 326135 329586 333304 337047 340780 344907 349506 354080 358580
$$ packed form
54030B77817N315N173M033K921K416K224J999J803J699J639J723J964J815P43
54016C13284p65j557j363j200j899l064l833m073m328m969n810o248n700m245
54002B64230k873k589l193l526k984k116j607j502j670k171k784k865k221j543
53988B30586j432j552j229n05J3l8m77r33j071p70k31K62P10J180J325P20l79
53971B26179j286j833k303k333j096J195K980L159K378J969K450L565M962O186
53957B46172O713O696P040Q214R639J0774J1912J3219J3763J2362Q910M272m97
53944C59189m335o381o798o662o506n800m359l134k686k116o46Q44J175Q45J064
53929C13694J639J509Q24Q13J760K724L172L451L718L743L733M127M599M574M500
$$ plain form
53914 358580 363845 370330 377204 383541 389585 395879 401811 406159 408682 410092 410752 410437 409238 407706 406089
53899 406089 404181 401976 399747 397414 394437 390415 385405 379727 373834 368122 362419 355924 348171 339855
53885 339855 332102 325194 318603 312083 306049 300923 296760 293464 290773 288036 284552 280290 275926 272165
53871 272165 269305 267272 265657 263834 261448 258715 255980 253214 250313 247561 245269 243260 241232 239379
53857 239379 238064 237129 236165 235236 234658 234217 233379 232188 231254 230880 230869 231149 231794 232358 232007 230532 228662 227193
53839 227193 226391 226283 226772 227257 226898 225648 224458 224131 224492 224976 225390 225703 225657 225166 224663 224564 224710 224857 225307
53820 225307 226465 228054 229489 230932 233229 236608 240012 242121 242747 242906 243623 245012 246582 248193 250374
53805 250374 253627 257666 261621 265011 268242 272084 276875 282330 287920 293212 297996 302320 306333 309896
$$ packed form
53914C58580N265O485O874O337O044O294N932M348K523J410O60l15j199j532j617
53899D06089j908k205k229k333k977m022n010n678n893n712n703o495p753q316
53885C39855p753o908o591o520o034n126m163l296k691k737l484m262m364l761
53871B72165k860k033j615j823k386k733k735k766k901k752k292k009k028j853
53857B39379j315r35r64r29n78m41q38j191r34l74j1K80O45N64l51j475j870j469
53839B27193q02j08M89M85l59j250j190l27L61M84M14L13m6m91n03r9J46J47M50
53820B25307J158J589J435J443K297L379L404K109O26J59P17J389J570J611K181
53805B50374L253M039L955L390L231L842M791N455N590N292M784M324M013L563
$$ plain form
53791 309896 312469 313746 314400 315704 318107 320470 321234 320235 318795 317947 317232 315617 312967 309888 306523
53776 306523 302401 297483 292528 288166 284304 280638 277075 273361 269083 264541 260940 258992 257839 256082
53762 256082 253464 250791 248506 246315 244083 242178 240769 239509 238134 236793 235609 234420 233173 232133
53748 232133 231521 231314 231494 232051 232660 232847 232645 232664 233323 234434 235691 237071 238485 239493 239731 239382 238913
53731 238913 238602 238557 238925 239796 241060 242588 244340 246123 247506 248250 248648 249200 250115 251296 252569 253680
53715 253680 254355 254704 255402 257097 259736 262751 265776 268765 271549 273767 275416 277037 279126 281613 284141
53700 284141 286591 288993 291130 292742 294150 296262 299667 303963 308209 311853 314921 317432 319116 319828
53686 319828 319926 319973 320253 320685 321089 321323 321275 320926 320415 319943 319625 319481 319481 319552 319580 319416 318888 317894 316626 315548
$$ packed form
53791C09896K573J277O54J304K403K363P64r99j440q48p15j615k650l079l365
53776C06523m122m918m955m362l862l666l563l714m278m542l601j948j153j757
53762B56082k618k673k285k191k232j905j409j260j375j341j184j189j247j040
53748B32133o12k07J80N57O09J87k02J9O59J111J257J380J414J008K38l49m69
53731B38913l11m5L68Q71J264J528J752J783J383P44L98N52R15J181J273J111
53715B53680O75L49O98J695K639L015L025K989K784K218J649J621K089K487K528
53700B84141K450K402K137J612J408K112L405M296M246L644L068K511J684P12
53686C19828R8M7K80M32M04K34m8l49n11m72l18j44%P1K8j64n28r94j268j078
$$ plain form
53666 315548 314853 314057 312539 310507 308918 308251 307911 307175 306307 306197 307150 308561 309733 310527 311135 311595 311767
53649 311767 311668 311658 312144 312987 313399 312816 311857 311918 313637 316252 318680 320652 322384 323738 324438 324811 325588 327061
53631 327061 328976 331039 333008 334491 335389 336481 338903 342988 348102 353574 359169 364726 370065 375406
53617 375406 381260 387681 394108 400081 405572 410482 414480 417605 420497 423625 426715 429257 431245 433086
53603 433086 435097 437346 439683 441692 442917 443398 443687 444145 444541 444543 444270 444077 444117 444368 444804 445294 445618 445839
53585 445839 446286 446838 446649 445107 442846 441181 440524 439850 437946 434828 431647 429376 427913 426515 424768
53570 424768 422870 421098 419495 418223 417706 418004 418363 417988 417070 416482 416518 416649 416574 416722 417424 418241 418639 418836
53552 418836 419480 420756 422237 423359 423659 422861 421272 419931 419863 421158 423113 425185 427444 430135 433249
$$ packed form
53666C15548o95p96j518k032j589o67l40p36q68j10R53J411J172P94O08M60J72
53649C11767r9j0M86Q43M12n83r59O1J719K615K428J972J732J354P00L73P77J473
53631C27061J915K063J969J483Q98J092K422M085N114N472N595N557N339N341
53617C75406N854O421O427N973N491M910L998L125K892L128L090K542J988J841
53603D33086K011K249K337K009J225M81K89M58L96Kk73j93M0K51M36M90L24K21
53585D45839M47N52j89j542k261j665o57o74j904l118l181k271j463j398j747
53570D24768j898j772j603j272n17K98L59l75r18n88L6J31p5J48P02Q17L98J97
53552D18836O44J276J481J122L00p98j589j341o8J295J955K072K259K691L114
$$ plain form
53537 433249 436639 440248 444023 447754 451231 454608 458533 463810 470810 479214 488382 497890 507582 517272
53523 517272 526769 536314 546670 558567 572146 587019 602635 618493 634273 650019 666178 683318
53511 683318 701795 721631 742503 763903 785506 807482 830229 853817 877887 902058 926092
53500 926092 949633 972176 993524 1014042 1034323 1054786 1075605 1096730 1117795 1138229 1157589
53489 1157589 1175713 1192754 1209355 1226604 1245198 1264586 1283470 1301219 1318243 1334952 1351164
53478 1351164 1366866 1382715 1399110 1415292 1430029 1442867 1454070 1463680 1471357 1477080 1481280 1484126
53466 1484126 1485079 1483332 1478508 1470938 1461386 1450448 1438214 1424717 1410592 1396756 1383263 1369132
53454 1369132 1353624 1337059 1319916 1301872 1282540 1262589 1243101 1224125 1204882 1185347 1166538
$$ packed form
53537D33249L390L609L775L731L477L377L925N277P000Q404R168R508R692R690
53523E17272R497R545J0356J1897J3579J4873J5616J5858J5780J5746J6159J7140
53511F83318J8477J9836K0872K1400K1603K1976K2747K3588K4070K4171K4034
53500I26092K3541K2543K1348K0518K0281K0463K0819K1125K1065K0434J9360
53489A157589J8124J7041J6601J7249J8594J9388J8884J7749J7024J6709J6212
53478A351164J5702J5849J6395J6182J4737J2838J1203R610P677N723M200K846
53466A484126R53j747m824p570r552j0938j2234j3497j4125j3836j3493j4131
53454A369132j5508j6565j7143j8044j9332j9951j9488j8976j9243j9535j8809
$$ plain form
53443 1166538 1149050 1132282 1115551 1099217 1084172 1070785 1058947 1048815 1040933 1035606 1032441 1030499
53431 1030499 1028890 1027384 1026528 1026985 1028781 1031393 1034511 1038364 1043340 1049658 1057474 1066876 1077678 1089577
53417 1089577 1102703 1117629 1134704 1153644 1173898 1195043 1216757 1238916 1262020 1287103 1314764
53406 1314764 1344436 1374955 1405689 1436856 1469034 1502778 1538650 1577154 1618496 1662590 1709239
53395 1709239 1758094 1808454 1859521 1911008 1963342 2017063 2072093 2127705 2183124 2237958 2292082
53384 2292082 2345286 2397215 2447526 2495863 2541714 2584532 2624175 2661006 2695394 2727172 2755772
53373 2755772 2780735 2801867 2818955 2831634 2839584 2842655 2840710 2833447 2820361 2800813 2774322 2741131
53361 2741131 2702540 2660379 2615979 2569736 2521628 2471858 2420906 2369318 2317739 2266965 2217643
$$ packed form
53443A166538j7488j6768j6731j6334j5045j3387j1838j0132p882n327l165j942
53431A030499j609j506q56M57J796K612L118L853M976O318P816R402J0802J1899
53417A089577J3126J4926J7075J8940K0254K1145K1714K2159K3104K5083K7661
53406A314764K9672L0519L0734L1167L2178L3744L5872L8504M1342M4094M6649
53395A709239M8855N0360N1067N1487N2334N3721N5030N5612N5419N4834N4124
53384B292082N3204N1929N0311M8337M5851M2818L9643L6831L4388L1778K8600
53373B755772K4963K1132J7088J2679P950L071j945p263j3086j9548k6491l3191
53361B741131l8591m2161m4400m6243m8108m9770n0952n1588n1579n0774m9322
$$ plain form
53350 2217643 2169916 2123582 2078625 2035396 1994204 1954783 1916297 1877838 1838934 1799634 1760277
53339 1760277 1721335 1683484 1647514 1613923 1582635 1553303 1525860 1500528 1477348 1456006 1436327
53328 1436327 1418680 1403615 1391104 1380274 1369831 1358645 1346072 1332018 1316898 1301433 1286379
53317 1286379 1272297 1259451 1247744 1236810 1226333 1216501 1208070 1201828 1197858 1195457 1193818 1192741 1192560
53304 1192560 1193483 1195312 1197898 1201635 1207246 1215111 1225022 1236540 1249407 1263549 1278975 1295912 1314866
53291 1314866 1336228 1359677 1384183 1408774 1433202 1457747 1482440 1506725 1529843 1551243 1570531
53280 1570531 1587351 1601633 1613846 1624634 1634109 1641642 1646423 1648103 1646926 1643315 1637425 1629037 1617961
53267 1617961 1604530 1589472 1573091 1554792 1533768 1510073 1484699 1458643 1432315 1405805 1379139
$$ packed form
53350B217643m7727m6334m4957m3229m1192l9421l8486l8459l8904l9300l9357
53339A760277l8942l7851l5970l3591l1288k9332k7443k5332k3180k1342j9679
53328A436327j7647j5065j2511j0830j0443j1186j2573j4054j5120j5465j5054
53317A286379j4082j2846j1707j0934j0477r832q431o242l970k401j639j077j81
53304A192560R23J829K586L737N611P865R911J1518J2867J4142J5426J6937J8954
53291A314866K1362K3449K4506K4591K4428K4545K4693K4285K3118K1400J9288
53280A570531J6820J4282J2213J0788R475P533M781J680j177l611n890q388j1076
53267A617961j3431j5058j6381j8299k1024k3695k5374k6056k6328k6510k6666
$$ plain form
53256 1379139 1352012 1323767 1294169 1264016 1234626 1206681 1179822 1153355 1127128 1101646 1077419
53245 1077419 1054272 1031365 1007937 983995 960200 937205 915291 894439 874338 854400 834282
53234 834282 814517 796208 779873 765006 750961 737839 726166 716063 707109 698687 690120 680769
53222 680769 670511 659940 649651 639416 628483 616570 604115 591540 578692 565180 551006
53211 551006 536712 523023 510452 499184 489222 480458 472526 464801 456887 449025 441613 434437 426854
53198 426854 418756 410682 402860 394918 386859 379450 373063 366898 360183 353534 348126 343916 339667 334612
53184 334612 329150 323953 319319 315436 312447 310038 307633 305093 302686 300397 297948 295476 293402 291584
53170 291584 289427 286983 285105 284303 284186 284259 284407 284265 283104 280917 278843 277816 277425 276696 275436 274097
$$ packed form
53256A379139k7127k8245k9598l0153k9390k7945k6859k6467k6227k5482k4227
53245A077419k3147k2907k3428k3942k3795k2995k1914k0852k0101j9938k0118
53234H34282j9765j8309j6335j4867j4045j3122j1673j0103q954q422q567r351
53222F80769j0258j0571j0289j0235j0933j1913j2455j2575j2848j3512j4174
53211E51006j4294j3689j2571j1268r962q764p932p725p914p862p412p176p583
53198D26854q098q074p822p942q059p409o387o165o715o649n408m210m249n055
53184C34612n462n197m634l883k989k409k405k540k407k289k449k472k074j818
53170B91584k157k444j878q02j17P3J48j42j161k187k074j027l91p29j260j339
$$ plain form
53154 274097 272866 271629 270473 269482 268303 266659 265072 264378 264562 264687 264004 262664 261330 260516 260326 260541
53138 260541 260954 261745 263303 265437 267196 267932 268195 269013 270510 271869 272580 272932 273210 273108 272348 271425 271308
53121 271308 272508 274672 277056 279180 280986 282413 283058 282570 281363 280492 280568 281134 281399 281192 280740 279973 278717
53104 278717 277364 276507 275944 274807 272863 270936 269765 269069 268175 267065 266299 266256 266909 268098 269534 270746
53088 270746 271449 271820 272060 271832 270629 268562 266306 264262 262344 260660 259781 259993 260757 261351 261721 262208 262690
53071 262690 262632 261941 261131 260470 259554 258086 256563 255649 255164 254381 253262 252725 253475 255036 256283 256611 256274
53054 256274 255811 255514 255391 255366 255408 255643 256322 257555 259115 260612 261852 262895 263763 264240 264069 263310 262418 261882
53036 261882 261762 261660 261202 260476 259879 259644 259716 260067 260862 262167 263659 264777 265125 264641 263513 262045 260599
$$ packed form
53154B74097j231j237j156r91j179j644j587o94J84J25o83j340j334q14j90K15
53138B60541M13P91J558K134J759P36K63Q18J497J359P11L52K78j02p60r23j17
53121B71308J200K164K384K124J806J427O45m88j207q71P6N66K65k07m52p67j256
53104B78717j353q57n63j137j944j927j171o96q94j110p66m3O53J189J436J212
53088B70746P03L71K40k28j203k067k256k044j918j684q79K12P64N94L70M87M82
53071B62690n8o91q10o61r16j468j523r14m85p83j119n37P50J561J247L28l37
53054B56274m63k97j23k5M2K35O79J233J560J497J240J043Q68M77j71p59q92n36
53036B61882j20j02m58p26n97k35P2L51P95J305J492J118L48m84j128j468j446
$$ plain form
53019 260599 259541 259215 259910 261760 264610 267962 271102 273404 274707 275423 276051 276504 276181 274875 273249 272071
53003 272071 271265 270290 269185 268512 268241 267536 265990 264426 263965 264722 265861 266578 266580 265957 265197 265123 266277 268300
52985 268300 270278 271656 272572 273450 274611 276091 277487 278145 277962 277820 278719 280502 281981 282415 282318 282657 283786
52968 283786 285463 287455 289633 291629 292892 293225 293070 293109 293629 294287 294495 293949 292758 291162 289309 287314
52952 287314 285313 283356 281446 279755 278576 277924 277478 277068 276854 276793 276348 275237 274083 273665 273780 273582 272942
52935 272942 272623 272993 273403 273225 272799 272839 273400 273954 274093 273658 272493 270690 268866 267694 267169 266780 266288 265952
52917 265952 266055 266623 267554 268646 269505 269823 269782 269828 270062 270182 270020 269700 269221 268353 267117 265953 265157 264517
52899 264517 263781 263142 262939 263144 263507 263994 264726 265620 266527 267648 269396 271776 274248 276243 277536 278093 277945
$$ packed form
53019B60599j058l26O95J850K850L352L140K302J303P16O28M53l23j306j626j178
53003B72071q06r75j105o73k71p05j546j564m61P57J139P17Ko23p60p4J154K023
52985B68300J978J378R16Q78J161J480J396O58j83j42Q99J783J479M34r7L39J129
52968B83786J677J992K178J996J263L33j55L9N20O58K08n46j191j596j853j995
52952B87314k001j957j910j691j179o52m46m10k14o1m45j111j154m18J15j98o40
52935B72942l19L70M10j78m26M0N61N54J39m35j165j803j824j172n25l89m92l36
52917B65952J03N68R31J092Q59L18m1M6K34J20j62l20m79q68j236j164p96o40
52899B64517p36o39k03K05L63M87P32Q94R07J121J748K380K472J995J293N57j48
$$ plain form
52882 277945 277339 276733 276392 276190 275960 275753 275611 275337 274750 273982 273236 272426 271379 270368 270094 271003 272783 274658
52864 274658 276159 277524 279315 281645 283871 285234 285691 285792 285731 284965 283044 280444 278080 276206 274247
52849 274247 271636 268401 264975 261823 259311 257530 256185 254971 254093 254048 254824 255651 255665 254569 252642 250519
52833 250519 249047 248804 249496 250148 250179 250010 250401 251491 252739 253519 253486 252635 251368 250322 249858 249790 249862 250268
52815 250268 251447 253494 255967 258198 259724 260666 261832 264028 266989 269328 269915 269025 267677 266202 264080
52800 264080 261096 257982 255707 254520 253870 252995 251525 249735 248358 247931 248307 248889 249285 249499 249592 249462 249051
52783 249051 248594 248575 249431 251092 252764 253441 252910 251998 251529 251341 250745 249707 248913 248760 248956 249230 249763 250643
52765 250643 251365 251329 250518 249339 248014 246516 244978 243805 243303 243423 243971 244989 246751 249242 251750 253293
$$ packed form
52882B77945o06o06l41k02k30k07j42k74n87p68p46q10j047j011k74R09J780J875
52864B74658J501J365J791K330K226J363M57J01o1p66j921k600k364j874j959
52849B74247k611l235l426l152k512j781j345j214q78m5P76Q27J4j096j927k123
52833B50519j472k43O92O52L1j69L91J090J248P80l3q51j267j046m64o8P2M06
52815B50268J179K047K473K231J526R42J166K196K961K339N87q90j348j475k122
52800B64080k984l114k275j187o50q75j470j790j377m27L76N82L96K14R3j30m11
52783B49051m57j9Q56J661J672O77n31r12m69j88n96j038p94j53J96K74N33Q80
52765B50643P22l6q11j179j325j498j538j173n02J20N48J018J762K491K508J543
$$ plain form
52749 253293 253616 253571 254236 255849 257858 259786 261589 263297 264862 266448 268481 271177 274278 277285 279703
52734 279703 281090 281309 280837 280511 280792 281551 282545 283691 284709 285045 284415 283107 281491 279550 277212 274840
52718 274840 273031 272054 271730 271715 271645 271231 270475 269731 269331 269239 269186 268951 268422 267641 266944 266810 267314 267992 268428 268724
52698 268724 269115 269512 269829 270448 271754 273326 274189 273971 273327 273074 273338 273778 274265 274934 275707 276156 275911 275074
52680 275074 274154 273620 273545 273605 273392 272724 271753 270892 270595 271061 272032 272993 273657 274152 274632 274915 274739 274304 274236 274896
52660 274896 275903 276498 276344 275811 275548 275857 276583 277538 278831 280679 282995 285340 287270 288571 289119 288763
52644 288763 287531 285850 284348 283378 282801 282281 281696 281219 280959 280675 280053 279312 279283 280651 283226 286226 289181
52627 289181 292205 295335 298026 299552 299699 298833 297385 295512 293174 290415 287536 285068 283527 283122 283640
$$ packed form
52749B53293L23m5O65J613K009J928J803J708J565J586K033K696L101L007K418
52734B79703J387K19m72l26K81P59R94J146J018L36o30j308j616j941k338k372
52718B74840j809r77l24j5p0m14p56p44m00r2n3k35n29p81o97j34N04O78M36K96
52698B68724L91L97L17O19J306J572Q63k18o44k53K64M40M87O69P73M49k45q37
52680B75074r20n34p5O0k13o68r71q61k97M66R71R61O64M95M80K83j76m35o8O60
52660B74896J007N95j54n33k63L09P26R55J293J848K316K345J930J301N48l56
52644B88763j232j681j502r70n77n20n85m77k60k84o22p41k9J368K575L000K955
52627B89181L024L130K691J526J47q66j448j873k338k759k879k468j541m05N18
$$ plain form
52612 283640 284530 285055 284622 283311 282003 281569 281883 282014 281476 280804 280672 280943 281059 281020 281382 282406 283730 284923
52594 284923 285887 286595 286866 286656 286343 286456 287203 288365 289598 290704 291634 292365 292800 292784 292216 291188 290086
52577 290086 289525 289984 291289 292581 293017 292544 291761 291080 290356 289386 288319 287346 286327 285109 283964 283335 283257
52560 283257 283326 283168 282710 282101 281594 281371 281296 281008 280494 280333 280962 281957 282528 282618 282923 283803 284743 285103 284903 284614
52540 284614 284559 284857 285620 286801 287957 288559 288533 288278 288230 288528 289055 289556 289742 289486 289042 288888 289224 289668 289629
52521 289629 289064 288707 289319 290764 292101 292689 292868 293340 294201 295018 295685 296643 298204 300096 301848 303284 304470
52504 304470 305472 306363 307109 307235 305964 303114 299669 297013 295574 294552 292993 290841 288842 287679 287408
52489 287408 287656 288135 288852 289840 290818 291308 291092 290379 289523 288810 288642 289517 291449 293553 294775 295074 295448 296615
$$ packed form
52612B83640Q90N25m33j311j308m34L14J31n38o72j32K71J16l9L62J024J324J193
52594B84923R64P08K71k10l13J13P47J162J233J106R30P31M35j6n68j028j102
52577B90086n61M59J305J292M36m73p83o81p24r70j067r73j019j218j145o29p8
52560B83257O9j58m58o09n07k23p5k88n14j61O29R95N71R0L05Q80R40L60k00k89
52540B84614n5K98P63J181J156O02k6k55m8K98N27N01J86k56m44j54L36M44l9
52521B89629n65l57O12J445J337N88J79M72Q61Q17O67R58J561J892J752J436J186
52504C04470J002Q91P46J26j271k850l445k656j439j022j559k152j999j163k71
52489B87408K48M79P17R88R78M90k16p13q56p13j68Q75J932K104J222K99L74J167
$$ plain form
52471 296615 298108 299003 299202 299459 300307 301521 302716 303978 305615 307640 309895 312386 315060 317391 318642
52456 318642 318642 317840 316498 314240 310728 306456 302487 299457 297199 295307 293723 292687 292354 292641 293321 294131
52440 294131 294866 295429 295724 295486 294363 292322 289882 287851 286758 286541 286721 286865 286905 287097 287719 288812 290140
52423 290140 291332 292047 292153 291866 291689 292148 293545 295929 299161 302825 306257 308980 311307 314289 318820
52408 318820 324783 331285 337744 344605 352824 362750 373568 383737 391662 396050 396145 392136 385282 377222
52394 377222 368967 360674 352387 344666 338329 333763 330650 328234 325755 322899 320058 318040 317288 317491 318108
52379 318108 319126 320924 323499 326257 328756 331292 334475 338366 342365 345982 349491 353623 358643 363888
52365 363888 368268 371149 372604 372981 372486 371276 369713 368315 367489 367383 367886 368679 369415 370000 370637 371510 372547
$$ packed form
52471B96615J493Q95J99K57Q48J214J195J262J637K025K255K491K674K331J251
52456C18642%q02j342k258l512m272l969l030k258j892j584j036l33K87O80Q10
52440B94131P35N63K95k38j123k041k440k031j093k17J80J44M0J92O22J093J328
52423B90140J192P15J06k87j77M59J397K384L232L664L432K723K327K982M531
52408C18820N963O502O459O861Q219R926J0818J0169P925M388R5m009o854q060
52394C77222q255q293q287p721o337m566l113k416k479k856k841k018p52K03O17
52379C18108J018J798K575K758K499K536L183L891L999L617L509M132N020N245
52365C63888M380K881J455L77m95j210j563j398q26j06N03P93P36N85O37Q73J037
$$ plain form
52348 372547 373575 374573 375646 376859 378238 379865 381871 384481 388077 393007 399138 405815 412439 418917
52334 418917 425392 431840 438282 445222 453471 463501 475133 487719 500489 512998 525613 539402
52322 539402 555129 572446 590389 608470 626851 645594 664339 682758 700872 718866 736978
52311 736978 755578 774862 794450 813695 832471 851181 870030 888810 907401 925773 943431
52300 943431 959609 974363 988659 1002921 1016110 1026877 1035016 1041111 1045229 1046859 1045933 1043143 1039262
52287 1039262 1034748 1029947 1025043 1019785 1013798 1007247 1000752 994664 988969 983946 980351 978674 978634 979669
52273 979669 981641 984859 989629 995987 1003692 1012291 1021307 1030422 1039518 1048649 1058142 1068608 1080465 1093402
52259 1093402 1106555 1119299 1131775 1144680 1158737 1174165 1190325 1205911 1219887 1232235 1243505
$$ packed form
52348C72547J028R98J073J213J379J627K006K610L596M930O131O677O624O478
52334D18917O475O448O442O940Q249J0030J1632J2586J2770J2509J2615J3789
52322E39402J5727J7317J7943J8081J8381J8743J8745J8419J8114J7994J8112
52311G36978J8600J9284J9588J9245J8776J8710J8849J8780J8591J8372J7658
52300I43431J6178J4754J4296J4262J3189J0767Q139O095M118J630r26k790l881
52287A039262m514m801m904n258n987o551o495o088n695n023l595j677m0J035
52273I79669J972L218M770O358P705Q599R016R115R096R131R493J0466J1857J2937
52259A093402J3153J2744J2476J2905J4057J5428J6160J5586J3976J2348J1270
$$ plain form
52248 1243505 1253676 1261944 1267640 1270813 1271690 1270095 1265870 1259597 1252427 1245183 1237850 1229893 1220875 1210810
52234 1210810 1200098 1189178 1178222 1167218 1156262 1145587 1135301 1125353 1115785 1106781 1098383 1090461
52222 1090461 1083132 1076923 1072220 1068685 1065490 1062142 1058994 1056935 1056588 1057737 1059585 1061700 1064532 1068674
52208 1068674 1073745 1078501 1082178 1085189 1088260 1091435 1094403 1097425 1101244 1106180 1111840 1117734 1123774 1130073
52194 1130073 1136601 1143177 1149594 1155665 1161179 1165840 1169273 1171311 1172292 1172698 1172274 1169975 1165224 1158840 1152117
52179 1152117 1145273 1137519 1128568 1119281 1110694 1103166 1096720 1091540 1087607 1084330 1081002 1077449 1073974 1070998
52165 1070998 1069032 1068572 1069590 1071377 1073261 1075293 1077916 1081186 1084690 1087933 1090462 1091916 1092433 1092871 1094173
52150 1094173 1096506 1099305 1101937 1104034 1105462 1106499 1107869 1109982 1112281 1113863 1114622 1115105 1115333 1114605 1112741
$$ packed form
52248A243505J0171Q268N696L173Q77j595m225o273p170p244p333p957r018j0065
52234A210810j0712j0920j0956j1004j0956j0675j0286r948r568r004q398p922
52222A090461p329o209m703l535l195l348l148k059l47J149J848K115K832M142
52208A068674N071M756L677L011L071L175K968L022L819M936N660N894O040O299
52194A130073O528O576O417O071N514M661L433K038R81M06m24k299m751o384o723
52179A152117o844p754q951r287q587p528o446n180l933l277l328l553l475k976
52165A070998j966m60J018J787J884K032K623L270L504L243K529J454N17M38J302
52150A094173K333K799K632K097J428J037J370K113K299J582P59M83K28p28j864
$$ plain form
52135 1112741 1110766 1109967 1110823 1113149 1116745 1121518 1127496 1135199 1145489 1158576 1173622 1189903 1207898
52122 1207898 1228529 1251681 1276275 1301629 1327777 1354447 1380663 1405741 1430036 1454277 1478595
$$ packed form
52135A112741j975p99Q56K326L596M773N978P703J0290J3087J5046J6281J7995
52122A207898K0631K3152K4594K5354K6148K6670K6216K5078K4295K4241K4318
$$ [...]
##END NTUPLES=NMR SPECTRUM
##END=
