
##TITLE=UV1214_M5_1296-1170_5_7229414_toPqwDcDj9
##JCAMPDX= 6.0         $$ Bruker NMR JCAMP-DX V2.0
##DATA TYPE= NMR SPECTRUM
##DATA CLASS= NTUPLES
##ORIGIN= BRUKER
##OWNER= Administrator
$$ 1.72 TOPSPIN		Version 2.1
$$ 2013-01-23 21:29:32.381 -0500  Administrator@X
$$ Compression mode = diff/dup
##.OBSERVE FREQUENCY= 400.02188249412
##.OBSERVE NUCLEUS= ^1H
##.ACQUISITION MODE= SIMULTANEOUS (DQD)
##.ACQUISITION SCHEME= undefined
##.AVERAGES= 8
##.DIGITISER RES= 22
##SPECTROMETER/DATA SYSTEM= spect
##.PULSE SEQUENCE= zg30
##.SOLVENT NAME= COFFEE_meoh
##.SHIFT REFERENCE= INTERNAL, COFFEE_meoh, 1, 14.98509
##AUDIT TRAIL= $$ (NUMBER, WHEN, WHO, WHERE, PROCESS, VERSION, WHAT)
$$ ##TITLE= Audit trail, TOPSPIN		Version 2.1
$$ ##JCAMPDX= 5.01
$$ ##ORIGIN= Bruker BioSpin GmbH
$$ ##OWNER= Administrator
$$ $$ E:\/data/COFFEE/nmr/UV1214_M5_1296-1170_5_7229414_toPqwDcDj9/30/pdata/1/auditp.txt
$$ ##AUDIT TRAIL=  $$ (NUMBER, WHEN, WHO, WHERE, PROCESS, VERSION, WHAT)
(   1,<2013-01-23 21:29:24.537 -0500>,<Administrator>,<X>,<go>,<TOPSPIN 2.1>,
      <created by zg
	started at 2013-01-23 21:28:18.537 -0500,
	POWCHK enabled, PULCHK disabled,
       configuration hash MD5:
       86 BA 57 50 F2 9D 5C 9B 26 00 A9 28 5F 66 2E 89
       data hash MD5: 64K
       3E D6 CE EA 75 10 7F 94 DB CA 85 A9 66 95 1B A2>)
(   2,<2013-01-23 21:29:27.490 -0500>,<Administrator>,<X>,<proc1d>,<TOPSPIN 2.1>,
      <Start of raw data processing
       efp LB = 0 FT_mod = 6 PKNL = 1 PHC0 = 0 PHC1 = 0 SI = 32K 
       data hash MD5: 32K
       83 62 5F E2 80 58 8F 99 F7 92 80 61 C0 3B AD 87>)
(   3,<2013-01-23 21:29:27.943 -0500>,<Administrator>,<X>,<proc1d>,<TOPSPIN 2.1>,
      <pk PHC0 = 101.6895 PHC1 = 0 
       data hash MD5: 32K
       19 E2 E7 78 37 6D E2 76 E3 E6 78 CA FD AF 1F 3E>)
(   4,<2013-01-23 21:29:28.177 -0500>,<Administrator>,<X>,<proc1d>,<TOPSPIN 2.1>,
      <abs ABSG = 1 
       data hash MD5: 32K
       B7 9B BF B2 60 52 F0 5A C3 FF 64 D0 D6 49 B7 DC>)
(   5,<2013-01-23 21:29:28.318 -0500>,<Administrator>,<X>,<proc1d>,<TOPSPIN 2.1>,
      <abs ABSG = 2 
       data hash MD5: 32K
       CA D2 E1 66 6A 69 34 2E CE 2E E7 C6 6C F0 C0 3F>)
(   6,<2013-01-23 21:29:28.459 -0500>,<Administrator>,<X>,<proc1d>,<TOPSPIN 2.1>,
      <abs ABSG = 3 
       data hash MD5: 32K
       96 22 13 5E 53 A4 BA AE 52 42 78 E1 CF C4 34 98>)
(   7,<2013-01-23 21:29:28.599 -0500>,<Administrator>,<X>,<proc1d>,<TOPSPIN 2.1>,
      <abs ABSG = 4 
       data hash MD5: 32K
       BA 1C 31 27 02 55 1C 23 39 00 B5 2C F9 C2 B4 62>)
(   8,<2013-01-23 21:29:28.756 -0500>,<Administrator>,<X>,<proc1d>,<TOPSPIN 2.1>,
      <abs ABSG = 5 
       data hash MD5: 32K
       B5 84 0A 03 E3 4D 52 42 3D 14 1C D2 72 7D C4 F6>)
$$ ##END=
$$ 
$$ $$ hash MD5
$$ $$ C9 28 68 11 37 3F 91 AD E2 69 A1 DF ED B5 42 AB
##$RELAX= 
##$RELAX= 
##$RELAX= 
##$RELAX= 
##$RELAX= 
##$RELAX= 
##$RELAX= 
$$ Bruker specific parameters
$$ --------------------------
##$DU= <E:\>
##$EXPNO= 30
$$ [...]
##$TP= (0..7)
150 150 150 150 150 150 150 150
##$TP07= 0
##$TPNAME0= <>
##$TPNAME1= <>
##$TPNAME2= <>
##$TPNAME3= <>
##$TPNAME4= <>
##$TPNAME5= <>
##$TPNAME6= <>
##$TPNAME7= <>
##$TPOAL= (0..7)
0.5 0.5 0.5 0.5 0.5 0.5 0.5 0.5
##$TPOFFS= (0..7)
0 0 0 0 0 0 0 0
##$TUNHIN= 0
##$TUNHOUT= 0
##$TUNXOUT= 0
##$USERA1= <user>
##$USERA2= <user>
##$USERA3= <user>
##$USERA4= <user>
##$USERA5= <user>
##$V9= 5
##$VALIST= <valist>
##$VCLIST= <CCCCCCCCCCCCCCC>
##$VD= 0
##$VDLIST= <DDDDDDDDDDDDDDD>
##$VPLIST= <PPPPPPPPPPPPPPP>
##$VTLIST= <TTTTTTTTTTTTTTT>
##$WBST= 1024
##$WBSW= 4
##$XGAIN= (0..3)
0 0 0 0
##$XL= 0
##$YL= 0
##$YMAX_a= 630081
##$YMIN_a= -539426
##$ZGOPTNS= <>
##$ZL1= 120
##$ZL2= 120
##$ZL3= 120
##$ZL4= 120
##$ABSF1= 14.98509
##$ABSF2= -5.573092
##$ABSG= 5
##$ABSL= 3
##$ALPHA= 0
##$AQORDER= 0
##$ASSFAC= 0
##$ASSFACI= 0
##$ASSFACX= 0
##$ASSWID= 0
##$AUNMP= <proc_prof1d_extract_pilot.lims>
##$AXLEFT= 0
##$AXNAME= <>
##$AXNUC= <1H>
##$AXRIGHT= 0
##$AXTYPE= 0
##$AXUNIT= <>
##$AZFE= 0.1
##$AZFW= 0.1
##$BCFW= 0
##$BC_mod= 0
##$BYTORDP= 0
##$COROFFS= 0
##$CY= 15
##$DATMOD= 1
##$DC= 0
##$DFILT= <>
##$DTYPP= 0
##$F1P= 0
##$F2P= 0
##$FCOR= 0.5
##$FTSIZE= 32768
##$FT_mod= 6
##$GAMMA= 0
##$GB= 0
##$INTBC= 1
##$INTSCL= 1
##$ISEN= 128
##$LB= 0
##$LEV0= 0
##$LPBIN= 0
##$MAXI= 10000
##$MC2= 0
##$MEAN= 0
##$ME_mod= 0
##$MI= 0
##$NCOEF= 0
##$NC_proc= -8
##$NLEV= 6
##$NOISF1= 0
##$NOISF2= 0
##$NSP= 0
##$NTH_PI= 0
##$NZP= 0
##$OFFSET= 14.98509
##$PC= 1
##$PHC0= 101.6895
##$PHC1= 0
##$PH_mod= 1
##$PKNL= yes
##$PPARMOD= 0
##$PPDIAG= 0
##$PPIPTYP= 0
##$PPMPNUM= 2147483647
##$PPRESOL= 1
##$PSCAL= 4
##$PSIGN= 0
##$PYNMP= <proc.py>
##$REVERSE= no
##$SF= 400.02
##$SI= 32768
##$SIGF1= 0
##$SIGF2= 0
##$SINO= 400
##$SIOLD= 32768
##$SPECTYP= <>
##$SREGLST= <1H.CDCl3>
##$SSB= 0
##$STSI= 32768
##$STSR= 0
##$SW_p= 8223.68421052631
##$SYMM= 0
##$S_DEV= 0
##$TDeff= 65536
##$TDoff= 0
##$TI= <>
##$TILT= no
##$TM1= 0
##$TM2= 0
##$TOPLEV= 0
##$USERP1= <user>
##$USERP2= <user>
##$USERP3= <user>
##$USERP4= <user>
##$USERP5= <user>
##$WDW= 1
##$XDIM= 32768
##$YMAX_p= 478778681
##$YMIN_p= -829669
##$CURPLOT= <Network HP LaserJet P1505>
##$CURPRIN= <$Network HP LaserJet P1505>
##$DFORMAT= <normdp>
##$LAYOUT= <+/1D_H.xwp>
##$LFORMAT= <normlp>
##$PFORMAT= <normpl>
##$SURQMSG= 1
$$ End of Bruker specific parameters
$$ ---------------------------------
##NTUPLES= NMR SPECTRUM
##VAR_NAME=  FREQUENCY,     SPECTRUM/REAL,   SPECTRUM/IMAG
##SYMBOL=    X,             R,               I
##VAR_TYPE=  INDEPENDENT,   DEPENDENT,       DEPENDENT
##VAR_FORM=  AFFN,          ASDF,            ASDF
##VAR_DIM=   32768,         32768,           32768
##UNITS=     HZ,            ARBITRARY UNITS, ARBITRARY UNITS
##FACTOR=    0.250966925370066, 1,           1
##FIRST=     8223.43324360094, -101601,      -217794
##LAST=      0,             -113820,         41908
##MIN=       0,             -829669,         0
##MAX=       8223.43324360094, 478778681,    0
$$ Real data points
##PAGE= N=1
##DATA TABLE= (X++(R..R)), XYDATA
$$ [...]
$$ plain form
19553 -335738 46206 335233 189402 -187204 -412606 -189443 42393 -386271 51458 -12115
19542 -370852 29202 311396 -200766 -117217 -321108 -217243 -135595 -51215 -408367 -88769
19531 -177776 159136 -59729 26379 -101512 40806 -167703 -58607 157059 -30571 -228651
19521 -228651 -223457 17904 55898 242127 286599 34796 -113374 -275898 -241156 337370 106588
19509 123267 173762 194137 7184 -269873 -25548 -163199 -219434 39595 -465037 423048 -124477
19497 349013 -251857 12337 24190 -74931 262255 -184119 74092 14196 -17873 132420 24224
19485 311848 49578 126825 -204454 -44529 -54352 -6259 -181559 -188150 -171613 -23316 -322418
19474 -322418 -94531 -14308 175826 -135439 -201901 262226 101224 18134 325387 -89699
$$ packed form
19553c35738D6206K89027j45831a87204k25402a89443D2393c86271E1458a2115
19542c70852B9202K82194b00766Q3549k03891J03865Q1648e1215l57152h8769
19531a77776A59136e9729B6379a01512D0806a67703e8607A57059c0571j98080
19521b28651N194A7904L7994J86229M4472C4796a13374j62524L4742C37370A06588
19509A23267N0495K0375G184b69873b5548j37651n6235C9595d65037D23048a24477
19497C49013b51857A2337J1853g4931B62255a84119G4092A4196a7873A32420B4224
19485C11848D9578P7247b04454d4529r823f259j75300o591J6537b3316k99102
19474c22418i4531a4308A75826a35439o6462B62226A01224A8134L07253h9699
$$ plain form
19463 44308 170195 -75110 -39158 -273655 -100396 153051 -157206 -285486 -56711 111571
19452 95256 -17181 -14738 43056 148475 -256631 185534 1795 -58360 -314228 -343625 -9469
19440 363635 -23921 -253186 56485 -40051 -150814 180926 -321965 229613 -51136 -283282
19430 -283282 -254918 -281764 -255309 13597 -126339 52826 113267 -209587 -268000 215688 95885
19418 -18662 -48351 108959 -547508 44303 18389 -121134 -213335 120681 20193 -262353 25863
19406 -84902 -67287 -262228 -176871 36801 110102 109874 48115 -457789 87507 -46726 -384716
19395 -384716 -272582 25144 -116682 -9556 -83776 130300 -139038 71001 139372 -228056 -22923
19383 91941 181950 -273883 -393748 -76888 -12772 -15736 169109 -134056 59845 43229 -55548
$$ packed form
19463D4308J25887g5110L5952k34497a00396A53051a57206j28280e6711A11571
19452I5256a7181K443D3056J05419b56631A85534A795e8360k55868k9397i469
19440C63635b3921k29265E6485d0051j10763A80926c21965B29613e1136k32146
19430b83282K8364k6846K6455A3597a26339E2826O0441b09587n8413B15688I5885
19418a8662k9689A08959e47508D4303A8389a21134r2201A20681B0193b62353B5863
19406h4902J7615j94941Q5357C6801P3301k28D8115d57789H7507d6726l37990
19395c84716J12134B5144a16682i556p4220A30300a39038G1001O8371b28056b2923
19383I1941R0009b73883j19865g6888a2772k964A69109a34056E9845j6616e5548
$$ plain form
19371 -175373 319608 -286159 -213653 176123 52420 -255854 -45601 -268710 45675 36502 -20448
19359 37585 -72445 107856 -262810 186357 -14163 17320 -394835 6360 -199937 -213812 -18530
19347 -132731 -222070 -429443 57385 37870 -259661 -20520 56993 -102594 212979 -349408
19336 -9662 -245535 -2855 -157274 66242 21331 -142480 89450 51767 -88906 122534 -38590
19324 -43234 -277198 158657 -335634 292606 78740 138388 -129433 -15126 227795 191668
19314 191668 65194 -440596 -27719 -383248 -66726 -274975 -1174 205833 -468588 -178968
19303 332130 -147661 50062 -132979 -13297 211439 113271 279440 244947 246086 191953 -365190
19291 -605628 141867 -239251 -95509 -90091 46735 210358 72313 -168258 72000 -54641 -309
$$ packed form
19371a75373C19608b86159P2506A76123E2420b55854d5601k23109D5675r173b0448
19359C7585g2445A07856b62810A86357a4163A7320c94835F360a99937j3875a8530
19347a32731q9339k07373E7385j9515b59661b0520E6993a02594B12979c49408
19336i662k35873b855j54419F6242B1331a42480H9450l7683h8906A22534c8590
19324d3234k33964A58657c35634B92606G8740N9648a29433a5126B27795l6127
19314A91668F5194d40596b7719l55529f6726k08249a174B05833d68588a78968
19303C32130a47661E0062a32979a3297B11439r8168J66169l4493J139n4133c65190
19291f05628A41867b39251i5509N418D6735J63623G2313a68258G2000e4641c09
$$ plain form
19279 37651 -157806 36562 -7165 -195294 -79819 52300 90703 -169740 -260444 -253067 -38936
19267 115861 19419 -67124 2086 -195126 -3929 -78666 -173917 -30399 239115 -45339 -177299
19256 -177299 -173041 97144 -383253 -145491 -153661 -159561 71319 58004 -513494 -143903 428144
19244 -270950 -125926 -430829 -108306 -137091 -22450 132461 -142096 -55810 258804 -503051
19233 63451 -230434 -142759 120285 157777 -150352 44650 -195944 89626 43605 -425845 92474
19221 182096 -84522 31492 227277 132269 321129 -52127 113650 70248 -247109 248554
19210 -177113 56223 241696 -154940 3204 -175030 103658 -132909 69188 -565901 -140698
19199 -336366 -189657 147099 250794 -151539 8486 437726 -175952 13304 28149 -455226
$$ packed form
19279C7651a57806C6562g165j88129g9819E2300L8403a69740r0704P377c8936
19267A15861A9419f7124B086a95126c929p4737r5251c0399B39115d5339j31960
19256a77299M258I7144c83253a45491q170n900G1319j3315e13494a43903D28144
19244b70950a25926l04903a08306k8785b2450A32461a42096e5810B58804e03051
19233F3451b30434Q7675A20285L7492a50352D4650a95944H9626D3605d25845I2474
19221A82096h4522C1492J95785r5008J88860e2127A13650m3402b47109B48554
19210a77113E6223J85473a54940C204a75030A03658a32909F9188e65901a40698
19199c36366J46709A47099J03695a51539H486M29240a75952A3304J4845d55226
$$ plain form
19188 -186126 44626 -49184 -398781 -46561 -18740 -144733 -296908 -304994 36300 131869 -150367
19176 36629 -21847 -77648 -52681 -195019 -107782 -129153 -502582 54980 -232166 -202352 -109829
19165 -109829 -363909 196108 -22347 148172 -33539 53461 -364366 -36599 89755 -51028 120680
19153 2566 34048 -119725 -81652 -282011 116480 -11114 -54486 -103817 74811 -184273 -76950
19141 -244488 -141528 -177452 951 -87288 -8064 50908 136313 -28091 -71844 -77083 -79732 -522432
19129 -522432 -5108 -405457 -272674 234644 45364 -246483 -124802 -183 237217 -654512 472237
19117 17976 -113666 133623 6018 1115 103665 -22998 -200727 62489 95481 -212785 28469
19105 112821 -428396 -290422 63900 -34214 43233 -8316 222681 -6520 -369626 -85506 -145283
$$ packed form
19188a86126D4626d9184l49597d6561a8740j25993j52175q086C6300R5569a50367
19176C6629b1847n5801K4967j42338Q7237k1371l73429E4980b32166K9814R2523
19165a09829k54080A96108b2347A48172c3539E3461c64366c6599H9755e1028A20680
19153B566L1482a19725L8073k00359A16480a1114m3372m9331G4811a84273g6950
19141b44488J02960l5924I51h7288h064E0908Q5405b8091m3753n239k649m42700
19129e22432e108m00349J32783B34644D5364b46483J21681a83B37217f54512D72237
19117A7976a13666A33623F018A115J02550b2998j77729F2489L2992b12785B8469
19105A12821d28396J37974F3900c4214D3233h316B22681f520l63106h5506n9777
$$ plain form
19094 -145283 321544 214708 -159273 -326524 -180614 499545 -233723 177322 -148068 82149
19083 -441076 -209194 34029 -32688 -209084 73057 69259 104360 -345285 37485 168557 -69781
19071 147331 -19398 250805 -85815 44621 -73821 -51106 192762 -162240 120024 -68593 -405081
19060 -405081 58533 194770 124722 -285931 -104206 44223 144644 -28306 18879 -103970
19049 -20044 -149753 29272 -116483 119037 267153 -103520 -50358 -105641 -139053 -152052 82164
19037 -178442 -221356 -70632 -371132 1700 125131 -261263 -46352 304227 -122959 188101
19026 133894 -118473 18624 -183833 -66168 162309 -72552 227948 63083 306915 -130333
19015 -68372 39970 -101880 157937 41054 -95645 43308 62735 -154170 248563 -235225 -258706
$$ packed form
19094a45283C21544j06836a59273j67251J45910D99545b33723A77322a48068H2149
19083d41076b09194C4029c2688j76396G3057l798L5101c45285C7485J31072f9781
19071A47331a9398B50805h5815D4621g3821K2715A92762a62240A20024f8593l36488
19060d05081E8533J36237p0048b85931a04206D4223J00421b8306A8879a03970
19049b0044j29709B9272a16483A19037J48116a03520e0358n5283l3412j2999H2164
19037a78442m2914g0632l00500A700J23431b61263d6352C04227a22959A88101
19026A33894a18473A8624a83833f6168A62309g2552B27948F3083K43832a30333
19015f8372C9970a01880A57937D1054i5645D3308J9427a54170B48563b35225k3481
$$ plain form
19004 -258706 203724 56569 94565 -197104 -267529 -196864 -325994 -761 -100513 67918 -103395
18992 -308317 44067 -351165 -181674 -226316 -77984 -260219 128179 145324 -305617 98502
18981 -113320 87016 -337928 -185793 106161 -530159 87129 18554 -119517 111519 -179532
18970 -90151 -84661 69306 237028 -222147 -64567 -51740 -118693 -42174 164159 -129743 226963
18958 -48903 -387749 225 163774 514 -260965 204605 86418 207704 159116 -20179 -208897
18947 -208897 -6294 218236 -68759 -887 -256178 -19656 56588 -133390 -99492 -146120 -57227
18935 -139192 -46974 -296090 -77206 -195969 -276204 -96722 71716 -82654 -3305 -56589 121796
18923 193062 110140 -330966 -213546 -211754 -66133 197295 192768 -170803 -125680 -229590 83372
$$ packed form
19004b58706B03724E6569L7996a97104p0425P0665j29130g61r9752F7918a03395
18992c08317D4067c51165J69491m4642g7984j82235A28179J7145c05617I8502
18981a13320H7016c37928J52135A06161e30159H7129A8554a19517A11519a79532
18970i0151N490F9306J67722b22147f4567J2827o6953d2174A64159a29743B26963
18958d8903l38846B25J63549E14b60965B04605H6418J21286m8588b0179j88718
18947b08897f294B18236f8759h87k55291a9656E6588a33390L3898m6628e7227
18935a39192d6974k49116g7206j18763q0235i6722G1716h2654c305n3284A21796
18923A93062q2922c30966J17420J792f6133A97295m527a70803M5123j03910H3372
$$ plain form
18911 -85778 131483 32093 16927 -31115 -433845 -346632 -260196 2606 329006 -250570 -135173
18900 -135173 -110262 28995 140450 -360959 -125772 174016 261987 -326216 -389402 -188583
18889 275323 -172888 -44388 4391 -472885 -4341 19468 64801 81176 -43929 -28634 -200312
18878 -200312 14531 -103037 31806 -238747 -12178 246374 -83309 -5775 368166 -88911 -370818
18867 -370818 -461230 -316290 -103396 -190684 121932 -198291 -99863 -250977 107640 -423944
18856 -367203 26720 19613 -304680 -91074 274226 134798 110475 -382204 -180638 -41366 -34019
18845 -34019 -70055 -157878 -115361 7537 -4649 -145429 16903 -9651 74857 -191780 293351 23497
18832 57015 -358627 -88809 -207337 -134417 -475729 -157283 -143820 -133081 -107307 268263 217063
$$ packed form
18911h5778A31483C2093j5166c1115m02730Q7213Q6436B606L26400b50570J15397
18900a35173K4911B8995J11455c60959a25772A74016Q7971c26216o3186a88583
18889B75323a72888d4388D391d72885d341A9468M5333J6375d3929J5295j71678
18878b00312A4531a03037C1806b38747a2178B46374h3309e775C68166h8911k81907
18867c70818r0412J44940a03396q7288A21932a98291R8428j51114A07640d23944
18856c67203B6720p107c04680i1074B74226A34798k4323c82204a80638d1366P347
18845c4019l6036q7823M2517G537d649j40780A6903i651G4857a91780B93351B3497
18832E7015c58627h8809j18528P2920l41312a57283J3463J0739K5774B68263n1200
$$ plain form
18821 217063 30225 -16125 72435 -7903 49508 -180428 266143 -75656 -43506 -146194 188039
18809 -137096 297671 -47856 -469208 128618 -278708 -88829 281500 -72813 128178 72013
18799 72013 194756 -348195 -87984 -24418 77967 -220380 -271766 202878 -138633 46717 132075
18788 132075 5219 65426 118354 7924 -174936 -150682 219668 -247437 -377202 -85953 -105454
18777 -105454 126767 -119905 401904 -396277 140545 23921 -117795 -134840 328073 -91169
18766 118759 -130802 -7865 -85574 -35445 -102594 -294243 -119616 208638 -305704 130123
18755 -29753 -145382 -133114 52904 -114602 -237834 -309185 -134258 -258501 -229551 9365 -45647
18743 56643 213783 -297701 348379 -58048 250433 98185 129894 -231481 -245208 38146 50799
$$ packed form
18821B17063C0225a6125G2435g903D9508a80428B66143g5656L2150j02688A88039
18809a37096B97671d7856m21352A28618b78708h8829B81500g2813A28178n6165
18799G2013J22743c48195h7984b4418G7967b20380n1386B02878a38633D6717Q5358
18788A32075E219O0207N2928G924a74936K4254B19668b47437j29765h5953j9501
18777a05454A26767a19905D01904c96277A40545B3921a17795j7045C28073i1169
18766A18759a30802g865p7709c5445o7149j91649a19616B08638c05704A30123
18755b9753j15629J2268E2904a14602j23232p1351a34258j24243K8950I365d5647
18743E6643J57140b97701C48379e8048B50433I8185L1709b31481j3727C8146J2653
$$ plain form
18732 50799 -157287 -266465 -534802 326514 190070 -68433 -577266 11086 204232 121082
18722 121082 70897 -374765 10174 -107952 122199 -210288 -60707 100866 -60934 -102885
18712 -102885 -452318 257657 2902 -20534 -345772 317721 -56444 -413491 -345630 -286343 -152151
18701 -152151 -277063 303933 -44614 -144380 -93823 -166961 -212605 -33832 -62894 48826 -20406
18689 -81909 93060 -585916 32361 118291 -326529 -131722 56227 99817 -172218 -115133 -93031
18678 -93031 49141 23704 445386 226455 -396144 51467 139412 -450830 10109 -829669 -127485
18666 -136767 241983 26953 24556 -108637 -303537 272985 -28385 -408399 -137684 -43016
18655 -296535 40657 -102148 -217452 71087 2654 155308 65072 353358 15430 -284399 153012
$$ packed form
18732E0799a57287j09178k68337C26514j36444f8433n08833A1086J93146q3150
18722A21082n0185c74765A0174a07952A22199b10288f0707A00866f0934m1951
18712a02885l49433B57657B902b0534l25238C17721e6444l57047O7861N9287J34192
18701a52151j24912C03933d4614r9766N0557p3138m5644c3832k9062D8826b0406
18689h1909I3060e85916C2361Q5930c26529a31722E6227M3590a72218N7085K2102
18678i3031D9141B3704M21682k18931c96144E1467Q7945d50830A0109h29669a27485
18666a36767B41983B6953k397a08637j94900B72985b8385l80014a37684d3016
18655b96535D0657a02148j15304G1087B654J52654F5072K88286A5430b84399A53012
$$ plain form
18643 -237865 -253151 -260892 -229299 -161952 -33137 -257343 76485 -87189 108937 -38380 105757
18631 -97362 -55352 -385335 -154568 -64060 -51940 -288912 32643 94608 -417673 54433 -42652
18619 -287889 -33568 269651 -114179 -181277 -25824 -21559 207596 -224275 393851 279674
18609 279674 -68862 213735 -162794 -98162 -180841 15811 -181174 18051 195891 129478 -45594
18597 -91430 36824 -491424 23095 -273102 -309679 -26423 33386 -89209 -236897 153856 -224375
18585 -2332 7822 73973 -58220 148815 182441 -83956 -243112 -263386 -182007 -160089 -139854 31568
18572 -339248 110349 -152217 -124988 -158871 -377278 38355 37729 -18780 -96985 -138932 -339509
18561 -339509 -119127 -85721 109536 -273826 34343 -151877 -35772 -199028 133319 11054
$$ packed form
18643b37865j5286p741L1593O7347c3137k24206G6485h7189A08937c8380A05757
18631i7362M2010l29983a54568f4060J2120k36972C2643O1965d17673E4433d2652
18619b87889c3568B69651a14179o7098b5824M265B07596b24275C93851j14177
18609B79674f8862B13735a62794O4632q2679A5811a81174A8051J77840o6413d5594
18597i1430C6824d91424B3095b73102l6577b6423C3386h9209j47688A53856b24375
18585b332G822O6151e8220A48815L3626h3956j59156k0274Q1379K1918K0235C1568
18572c39248A10349a52217K7229l3883k18407C8355o26a8780p8205m1947k00577
18561c39509a19127L3406A09536b73826C4343a51877c5772j63256A33319A1054
$$ plain form
18550 160306 -56530 -147523 40519 120050 105376 -209496 187906 -208135 -303261 62271 22034
18538 -20556 -3907 -309186 -20378 97673 -162849 -251385 25394 419141 122195 -59923 68624
18526 48288 65955 170873 185335 -222402 -104004 70284 -89248 -83121 265799 117683 114786
18515 114786 -90171 -96754 -25798 -118308 -68594 -94617 -296685 -398111 -321407 -58628 55168
18503 -64518 -376943 -204510 -175658 44575 -91001 -91332 -126402 -186047 -262229 -109026 -112834 -121329
18491 -121329 -30778 136308 2919 -21550 16143 118075 9340 342321 123821 -332535 51278
18479 -142049 141747 -109621 -242296 305694 336836 158995 75057 142478 -257402 -169594
18469 -169594 -153825 -427407 95009 104141 231981 -105798 -63394 140656 -165208 -334925
$$ packed form
18550A60306e6530r0993D0519P9531j4674b09496A87906b08135r5126F2271B2034
18538b0556c907l05279b0378I7673a62849q8536B5394L93747A22195e9923F8624
18526D8288J7667J04918J4462b22402a04004G0284h9248O127B65799A17683k897
18515A14786i0171o583b5798r2510M9714k6023k02068j01426P6704e8628E5168
18503f4518l12425J72433K8852D4575i1001l31l5070n9645p6182a09026l808q495
18491a21329c0778A36308B919b1550A6143J01932I340L32981A23821c32535E1278
18479a42049A41747a09621j32675C05694L1142A58995G5057O7421b57402Q7808
18469a69594J5769k73582I5009R132J27840a05798M2404A40656a65208j69717
$$ plain form
18459 -334925 -57993 -235309 -201260 121461 -60157 -133957 118433 72562 -410358 -192716
18448 87165 -152643 -156291 -238636 193252 -324882 -10712 42959 -52021 -171795 87764 199543
18437 199543 78313 -119606 120071 102005 198064 -67905 -186096 -12768 -290256 -61954 -239390
18426 -239390 -104759 -299209 -32098 -242179 -11417 -7516 110398 90276 -68010 -72961 33011
18414 -51141 45948 114550 -286558 244596 99130 -102148 -53234 225880 172622 251717 117458
18402 379986 -329899 247826 -62990 2777 -321275 -191575 -35103 -206668 -88766 76621 95081
18391 95081 88051 -25739 132235 117474 22279 27000 -57662 -120674 -211327 -99191 -20949 278735
18378 128105 262408 123084 -167846 -104424 119127 -10230 -310397 -82654 120801 132542
$$ packed form
18459c34925e7993j77316L4049A21461f0157p3800A18433m5871d10358a92716
18448H7165a52643l648q2345A93252c24882a0712D2959e2021j19774H7764J11779
18437A99543G8313a19606A20071j8066R6059f7905j18191a2768k77488f1954j77436
18426b39390a04759j94450c2098k10081a1417L901A10398k0122f8010m951C3011
18414e1141D5948O8602b86558B44596I9130a02148M8914B25880n3258P9095A17458
18402C79986c29899B47826f2990B777c21275J29700c5103j71565h8766G6621J8460
18391I5081p030b5739A32235j4761B2279M721e7662o3012r0653i9191b0949B78735
18378A28105J34303A23084a67846O3422A19127a0230l00167h2654A20801J1741
$$ plain form
18368 132542 193147 -85786 -88516 114182 -99016 -166795 -458123 -322506 -92200 -11574 53975
18356 178771 -65022 -179234 134200 234451 -199201 25945 -79177 -102333 71526 9002 -336916
18344 -60937 -169891 -164119 -59361 -127074 291844 -82084 -153755 185236 -49395 -173009 252116
18332 -47006 -359328 -215517 53483 -116037 18472 58671 -115134 -203047 100735 -101222
18321 -31351 -246171 18796 88010 28012 144397 -210239 76513 -186151 51512 -384889 72282
18309 227203 -92539 -175788 -229223 -174227 -301281 78943 -194126 20007 324895 -33513 -166996
18298 -166996 175097 -385335 115272 39755 196399 -99258 -140861 -138172 -2424 31013 -81881
18286 -71450 27162 324048 203381 -67978 240695 -123671 -89592 -287239 -97008 224965
$$ packed form
18368A32542O0605h5786k730A14182i9016o7779k91328J35617i2200a1574E3975
18356A78771f5022j14212A34200J00251a99201B5945g9177k3156G1526I002c36916
18344f0937j08954N772e9361o7713B91844h2084p1671A85236d9395j23614B52116
18332d7006l12322J43811E3483a16037A8472M0199a15134q7913A00735a01222
18321c1351k14820A8796O9214B8012J16385b10239G6513a86151E1512c84889G2282
18309B27203i2539q3249n3435N4996j27054G8943a94126B0007L04888c3513j33483
18298a66996A75097c85335A15272C9755J56644i9258m1603K689b424C1013h1881
18286g1450B7162K96886j20667f7978B40695a23671L4079j97647i7008B24965
$$ plain form
18275 -26334 -246910 148691 -75047 -127108 -218764 -116016 -110458 -96737 -82101 128899 -23460
18263 -36147 -24598 -15705 -26396 -93314 77557 -378194 -142519 -382046 -208626 -263318 -34701
18251 -33077 370928 4126 145278 224211 -331205 131350 11889 -62262 -175220 -211470 68413
18239 85196 65637 15639 -204484 -115978 251091 -52100 -203283 148101 -175586 -82907 197477
18227 155508 -43227 -38747 136257 50344 102563 -55651 -197557 -133408 -323578 -184065 59425
18215 -65464 264649 68738 -31817 94509 83852 -213401 -109969 -40733 115591 -101938 -230449
18204 -230449 -45615 181853 42199 23270 136614 -648152 -73648 331725 188452 341947
18194 341947 92801 -86904 -407246 155728 -321795 -194027 -53925 -250417 235716 -385535
$$ packed form
18275b6334k20576A48691g5047n2061r1656J02748N558J3721J4636A28899b3460
18263c6147J1549Q893j0691o6918G7557c78194a42519k39527J73420n4692c4701
18251c3077C70928D126J41152P8933c31205A31350A1889f2262j12958l6250F8413
18239H5196j9559A5639b04484Q8506B51091e2100j51183A48101a75586h2907A97477
18227A55508d3227M480A36257E0344N2219e5651j41906O4149j90170J39513E9425
18215f5464B64649F8738c1817I4509j0657b13401J03432d0733A15591a01938j28511
18204b30449d5615A81853D2199j8929J13344f48152g3648C31725j43273J53495
18194C41947I2801h6904l20342A55728c21795J27768e3925j96492B35716c85535
$$ plain form
18183 -167618 -304526 -197939 -119137 142847 -228320 253839 -114874 -82362 27871 -153954
18172 280482 -351661 220019 60354 -300152 71006 -98256 -300465 -147652 -170469 -58072
18161 279932 52598 -193629 -256906 -44839 -8263 242042 -118001 -262594 326345 117506
18150 -16411 -217517 26487 -226667 -196129 -139102 222789 239618 -337792 179488 216724 31701
18138 -31732 -64457 35973 -413984 45270 82891 -161623 -103334 -390058 -239347 -98919 82602
18126 -178342 -14712 154764 72085 -72429 -158224 -92119 4933 -205987 136345 -323357 210204
18114 -108564 149646 192264 167824 138934 221847 -1739 -131131 11746 -162913 62611 -168138
18102 -193549 -97299 -365544 -5424 199527 188515 150987 213160 184483 -174739 -229900 -5095
$$ packed form
18183a67618j36908J06587P8802A42847b28320B53839a14874L2512B7871a53954
18172B80482c51661B20019F0354c00152G1006i8256k02209a47652k2817e8072
18161B79932E2598a93629o3277d4839h263B42042a18001j44593C26345A17506
18150a6411k01106B6487b26667L0538N7027B22789J6829c37792A79488L7236C1701
18138c1732l2725C5973d13984D5270L7621a61623N8289k86724J50711i8919H2602
18126a78342a4712A54764G2085g2429q5795O6105D933b05987A36345c23357B10204
18114a08564A49646M2618k4440k8890Q2913a739j29392A1746a62913F2611a68138
18102a93549R6250k68245e424A99527j1012l7528O2173k8677a74739n5161e095
$$ plain form
18090 523681 -57209 1500 15132 -4244 -80348 127538 -261721 -234629 -173974 -178475 55836 -537337
18077 217873 87188 227156 110053 -195001 -44600 166922 -503565 156135 -103873 -412650
18067 -412650 -237035 74246 -315632 -178126 -27477 28927 54024 -78806 6389 220317 184881
18056 184881 276949 -126423 124583 -131069 104969 -335018 -43407 8270 118055 202279
18046 202279 -290852 -223768 60439 -178668 -242896 -195199 159786 -226715 -356654 -64901
18035 270998 -274087 -85845 -83497 83906 -382298 64157 224648 -200404 194702 104687 150501
18024 150501 33077 166249 -89376 179534 -60002 -185976 -103689 -239320 66018 -406710
18013 40399 -346692 -80656 100904 175540 -115712 -121154 -102862 54898 58111 -28650 155378
$$ packed form
18090E23681e7209A500J3632d244p6104A27538b61721K7092O0655m501E5836e37337
18077B17873H7188J39968A10053a95001d4600A66922e03565A56135a03873l08777
18067d12650J75615G4246c15632J37506b7477B8927K5097g8806F389K13928l5436
18056A84881R2068a26423A24583a31069A04969c35018d3407H270J09785Q4224
18046B02279b90852O7084F0439a78668o4228M7697A59786b26715j29939f4901
18035B70998b74087h5845K348H3906c82298F4157J60491b00404A94702r0015M5814
18024A50501C3077J33172h9376A79534f0002j25974Q2287j35631F6018d06710
18013D0399c46692h0656A00904P4636a15712n442J8292E4898L213b8650A55378
$$ plain form
18001 -65877 129234 271947 231324 -212817 -85540 99227 -78050 50835 -95215 -73726 -240435
17990 -240435 -19750 -354304 144653 17136 -90896 -236965 -157727 44006 149459 -192422
17979 90045 223083 -137303 100422 185954 60381 -151652 -11124 53576 -231414 -321462 208985
17967 16749 64831 98004 -304702 17838 -90649 -27711 -254009 -81787 271492 351269 -75047
17955 14826 305293 -7384 48561 -148458 84951 -90923 96195 -147666 -204923 -185327 -164259
17944 -164259 -181929 152758 -52211 177115 -20946 -46185 73649 -47055 -190801 -24616 226280
17932 -30601 -134273 221238 140290 229492 -5589 -406500 112244 -279673 -240281 -56771 4976
17920 -283690 137778 35981 -316166 20413 31295 50887 -258287 -16274 156213 130857 152252
$$ packed form
18001f5877A29234J42713m0623b12817h5540I9227g8050E0835i5215K1489j66709
17990b40435a9750l34554A44653A7136i0896j46069P9238D4006J05453a92422
17979I0045J33038a37303A00422Q5532F0381a51652a1124E3576b31414r0048B08985
17967A6749M8082L3173c04702A7838i0649b7711k26298h1787B71492P9777g5047
17955A4826K90467g384D8561a48458H4951i0923I6195a47666n7257J9596K1068
17944a64259j7670A52758e2211A77115b0946k5239G3649d7055j43746b4616B26280
17932c0601j03672B21238q0948Q9202e589m00911A12244b79673L9392e6771D976
17920b83690A37778C5981c16166B0413J0882J9592b58287a6274A56213k5356K1395
$$ plain form
17909 152252 22882 10400 -43342 93624 65415 284597 31272 74765 -82904 -342111 -21647
17897 86107 250855 -291220 -40508 362242 -194860 323442 -94754 -108688 94376 -336664
17886 -243974 37468 212957 155787 -437464 -19012 -31837 134779 -4300 -138522 -308029 -244757
17875 -244757 74596 176453 51332 73475 105809 -178724 -259906 -29502 303191 108143 29232
17863 219303 47944 215169 -105507 61014 333823 -263538 -195855 -347583 -374222 -169885
17852 158593 -22259 -97361 154395 -61571 101467 -229852 220425 -207449 -139133 247177
17841 283540 57688 -580 -133985 -44170 -235875 122667 151140 -127278 -17973 -38426 -160499
17830 -160499 9336 -169315 -8201 190940 -143549 -78001 -45035 144552 -84869 -217897 -249178
$$ packed form
17909A52252B2882A0400d3342I3624k8209K19182C1272M3493h2904k59207b1647
17897H6107J64748b91220d0508C62242a94860C23442i4754j3934I4376c36664
17886b43974C7468J75489n7170d37464a9012j2825A34779d300j34222j69507O3272
17875b44757G4596J01857E1332K2143L2334a78724q1182b9502C03191A08143B9232
17863B19303D7944J67225a05507F1014K72809b63538O7683j51728k6639a69885
17852A58593b2259p5102A54395f1571A01467b29852B20425b07449O8316B47177
17841B83540E7688e80j33405d4170j91705A22667K8473a27278a7973k0453j22073
17830a60499I336a69315h201A90940a43549O5548L2966A44552h4869j33028l1281
$$ plain form
17819 -249178 400079 331233 112381 -189546 -101097 34818 -75334 -90429 -125240 231038 -116634
17807 190150 178341 63034 -33014 187684 4531 -220280 -44975 -63832 -73417 115510 121452
17796 121452 -185408 -314132 -40257 -105968 -42278 -31870 80631 15979 305706 -37542 7526
17784 -339937 195462 -141279 4233 -212780 64646 -44646 157322 72228 -118774 -49955 -5528
17772 94640 -211286 -33105 365186 -4315 118923 -399117 -261873 -325233 274995 -161794
17761 -44113 -252483 -147226 -32940 -56182 -317700 214676 -379006 410206 -159923 142795
17750 -131400 -37772 60238 -173920 97372 -150182 85120 -64698 138293 362362 -65846 -213955
17739 -213955 -114810 -194412 -38019 -63569 41662 -43667 93726 -148814 44379 233189 292463
$$ packed form
17819b49178D00079o8846A12381a89546Q8449C4818g5334j5095l4811B31038a16634
17807A90150j1809F3034c3014A87684D531b20280d4975j8857r585A15510N942
17796A21452a85408j28724d0257o5711d2278J0408H0631A5979K89727c7542G526
17784c39937A95462a41279D233b12780F4646d4646A57322G2228a18774d9955e528
17772I4640b11286c3105C65186d315A18923c99117J37244o3360B74995a61794
17761d4113k08370J05257c2940k3242k61518B14676c79006D10206a59923A42795
17750a31400c7772F0238a73920I7372a50182H5120f4698A38293K24069f5846j48109
17739b13955R9145p9602c8019k5550D1662d3667I3726a48814D4379J88810N9274
$$ plain form
17728 292463 179777 -302442 125320 -24231 -316607 -197628 -157028 -258337 6582 -78337
17717 107497 -80792 -1038 96672 -101327 70639 223573 59958 -113909 385613 -60736 128245
17705 142643 -68359 137789 -13938 -41750 -120857 -59403 -177658 96827 168480 -64400 121398
17693 -89728 -126546 -42702 194448 199843 139737 171729 159382 -170781 -28727 -3492 -252736
17682 -252736 -60465 -209028 249291 217214 -267851 -137207 -82246 32061 -147221 18102
17671 117741 -80529 -80861 136035 301108 121228 55970 106989 -135222 -191547 -165589 306687
17659 -5759 -174640 152622 407482 61475 132105 -31149 -183794 -333848 -66188 66899 93935
17648 93935 -121858 60570 119672 122927 -274012 -3551 -453896 111753 113786 -205126 277345
$$ packed form
17728B92463j12686c02442A25320b4231k92376J18979M0600j01309F582g8337
17717A07497h0792a038I6672a01327G0639J52934E9958a13909C85613f0736A28245
17705A42643f8359A37789a3938k7812p9107e9403j18255I6827P1653f4400A21398
17693h9728l6818d2702A94448N395o0106L1992j2347a70781b8727c492k49244
17682b52736f0465j48563B49291l2077b67851J30644N4961C2061a47221A8102
17671A17741h0529l32A36035J65073A21228E5970N1019a35222n6325K5958C06687
17659e759j68881A52622K54860F1475P0630c1149j52645j50054f6188F6899K7036
17648I3935a21858F0570N9102L255b74012c551m50345A11753K033b05126B77345
$$ plain form
17636 -28380 45144 142282 145016 -80414 238972 -525252 170095 203853 27624 -181449 146597
17624 -207404 -38647 -19109 -88987 -170726 252655 236395 35888 262445 128060 128247 -117796
17612 18988 -207708 243023 -222440 320233 -167573 -199591 183445 37680 54496 195211
17602 195211 -104835 224267 -294976 27465 -37834 223986 -283114 42867 3453 -115482
17591 366913 67974 83412 39945 -176755 -38490 347257 137294 15395 -164510 -77141 -5576
17579 -59755 -181144 -204761 -136098 -99153 -47966 -139388 -151738 -80593 36824 -116514 -280080
17568 -280080 -377027 16491 29956 -83308 -170322 158499 -358848 124425 172017 139262 -51002
17556 311889 372546 13044 -207259 -240489 84045 339586 -79636 -241703 -7341 136279 -259505
$$ packed form
17636b8380D5144R7138K734h0414B38972e25252A70095L3758B7624a81449A46597
17624b07404c8647a9109o9878q1739B52655j6260C5888K26557A28060J87a17796
17612A8988b07708B43023b22440C20233a67573l2018A83445C7680J6816J40715
17602A95211a04835B24267b94976B7465c7834B23986b83114D2867C453a15482
17591C66913F7974J5438C9945a76755c8490C47257A37294A5395a64510g7141e576
17579e9755j21389k3617O8663L6945d7966r1422j2350P1145C6824a16514j63566
17568b80080r6947A6491J3465h3308q7014A58499c58848A24425M7592l2755e1002
17556C11889O0657A3044b07259l3230H4045K55541g9636j62067g341A36279b59505
$$ plain form
17544 46478 -50867 109802 310459 173659 281263 -386013 -27189 -216637 199472 -68027
17533 5260 -25426 -121849 -8697 -108101 -226463 -314411 -194626 264226 51664 -155048 348455
17521 213149 -14937 -119795 188730 119775 -159958 191046 149638 -13798 10794 426946
17511 426946 292437 -175112 154768 81728 -212488 -50640 254078 -5770 59472 104386 43724
17499 188757 253004 256368 120612 336233 86135 -124709 313702 4048 245553 -102963 426
17487 -140686 47139 -129115 -111454 -5709 110533 -23258 195526 164276 -60 20379 40400 375493
17475 375493 -121524 2686 -127157 -173651 316291 11450 385287 106403 -1852 184070 275396
17464 275396 -29104 53299 -158942 47132 318480 160249 -19734 27225 244078 -63143 331493
$$ packed form
17544D6478e0867A09802K00657j36800J07604c86013b7189j89448A99472f8027
17533E260b5426r6423h697r9404j18362q7948J19785B64226E1664a55048C48455
17521B13149a4937j04858A88730o8955a59958A91046m1408a3798A0794M16152
17511D26946j34509a75112A54768p3040b12488e0640B54078e770E9472M4914D3724
17499A88757O4247L364A20612K15621H6135a24709C13702D048K41505a02963D26
17487a40686D7139a29115J7661e709A10533b3258A95526l1250f0B0379K0021L35093
17475C75493a21524B686a27157m6494C16291A1450L73837A06403a852A84070R1326
17464B75396b9104E3299a58942D7132K71348j58231a9734B7225K16853f3143C31493
$$ plain form
17452 128582 323503 -139113 570975 -181367 329859 468024 175933 -215487 18593 233032
17442 233032 150297 373383 119212 196870 383862 309814 312171 64101 154648 49262 369747
17431 369747 111688 44967 242647 295028 198532 483043 -33268 -150087 621708 226386
17420 -316504 489077 331468 -69836 62032 508639 291755 418513 367011 310881 197893
17410 197893 111072 262176 -83036 176959 -7448 115679 -4391 19271 167197 110942 374040
17399 374040 159300 150950 -262246 180124 30175 330941 84308 514236 88256 328846
17389 328846 113178 128805 62284 268302 283946 272941 295594 463479 -126286 -217772 -32076
17377 -16034 3199 310446 -12633 294479 39956 45878 237372 -45625 238912 6879 -13497
$$ packed form
17452A28582J94921a39113E70975a81367C29859J38165A75933b15487A8593K14439
17442B33032q2735K23086A19212P7658J86992p4048K357F4101R0547D9262L20485
17431C69747A11688D4967J97680N2381r6496K84511c3268j16819F21708B26386
17420c16504D89077j57609f9836F2032M46607k16884J26758n1502n6130j12988
17410A97893q6821J51104h3036A76959g448A15679d391A9271J47926n6255K63098
17399C74040A59300q350b62246A80124C0175L00766H4308M29928H8256K40590
17389C28846A13178J5627F2284K06018J5644j1005K2653J67885a26286r1486c2076
17377a6034C199L07247a2633B94479C9956N922J91494d5625B38912F879a3497
$$ plain form
17365 161819 375428 184651 158423 -222042 70863 -212208 33505 121913 -83045 -256987
17355 -256987 429197 -131934 -116639 58684 32674 6618 213467 505241 109807 -40503 -49080
17344 -49080 306734 297449 134692 -237189 -9650 118088 255044 106880 -59552 237178 165002
17333 165002 146527 101434 80036 -40789 -37974 268519 130180 -212178 137007 -70163 61863
17321 -49732 138402 293305 273416 114968 51038 461213 273135 -94546 -96884 -71664 378278
17309 34817 -158832 643292 -97286 459473 382757 -6174 302830 275060 87941 126272 -78410
17297 326586 268956 467148 151440 -26868 377247 374546 -185838 136804 88707 -179954
17286 360977 -53068 312245 55705 229935 105794 317677 350262 -53873 34439 274078
$$ packed form
17365A61819K13609A84651k6228b22042G0863b12208C3505Q8408h3045j73942
17355b56987D29197a31934J5295E8684k6010F618K06849K91774A09807d0503q577
17344d9080C06734r285A34692b37189i650A18088J36956A06880e9552B37178p2176
17333A65002j8475m5093k1398d0789K815B68519A30180b12178A37007g0163F1863
17321d9732A38402J54903j9889A14968E1038M10175j88078i4546k338K5220C78278
17309C4817a58832F43292i7286D59473p6716f174C02830k7770H7941L8331g8410
17297C26586n7630J98192A51440b6868C77247k701a85838A36804m8097a79954
17286C60977e3068C12245E5705J74230A05794K11883L2585e3873C4439K39639
$$ plain form
17276 274078 -84170 -83366 126515 286429 167706 76912 174649 86550 172034 46311 -57468
17264 349209 200608 28862 -248144 332940 61121 156685 42367 361232 2361 207993 404861
17253 404861 -24547 5570 216799 -140500 290244 481516 -149453 305684 10737 205236
17243 205236 394110 175435 374648 46922 44654 70803 481772 251015 81536 224680
17233 224680 139994 207172 59801 26328 169041 82698 223476 276110 -99940 48433 292954
17222 292954 437578 -43800 380013 158431 -86939 469072 -568 200421 -94904 112079 10108
17210 576311 -284462 39930 354840 457315 244793 433782 148975 185666 220882 59994
17199 209828 148599 202493 248366 81635 161191 18266 4473 92564 389705 67717 459965
$$ packed form
17276B74078h4170Q04A26515J59914j18723G6912R7737H6550Q5484D6311e7468
17264C49209j48601B8862b48144C32940F1121R5564D2367L18865B361K05632J96868
17253D04861b4547E570K11229a40500B90244J91272a49453C05684A0737J94499
17243B05236J88874A75435J99213D6922k268K6149M10969k30757H1536J43144
17233B24680q4686O7178E9801B6328J42713H2698J40778N2634i9940D8433K44521
17222B92954J44624d3800C80013A58431h6939D69072e68B00421i4904A12079A0108
17210E76311b84462C9930L14910J02475k12522J88989A48975L6691L5216E9994
17199B09828o1229N3894M5873H1635P9556A8266D473Q8091K97141F7717L92248
$$ plain form
17188 459965 55984 248749 306166 82040 255034 469398 117547 -29685 8756 346479 327673
17177 327673 -1585 252388 39984 -39251 -213910 160246 133848 424559 105845 -119356
17166 524968 525931 -239268 41963 365482 222826 367176 182833 171493 403642 130245
17155 157528 244221 604440 496150 439438 306143 72333 416967 315260 343905 281925
17145 281925 242241 407670 411881 180745 380769 -60137 285812 151792 265766 103850
17134 -5867 238331 212378 343607 416569 644616 -39993 386198 554326 225482 317726 183387
17123 183387 315939 391412 523236 554107 284259 470330 632504 276781 489001 501537
17113 501537 262925 313883 523694 283857 463218 120166 472586 525230 190113 78025
$$ packed form
17188D59965E5984J92765N7417H2040J72994K14364A17547b9685H756L37723j8806
17177C27673a585B52388C9984c9251j74659A60246k6398K90711A05845a19356
17166E24968R63b39268D1963L23519j42656J44350A82833j1340K32149A30245
17155A57528Q6693L60219j08290n6712j33295G2333L44634j01707K8645o1980
17145B81925l9684J65429M211A80745K00024f0137B85812j34020J13974A03850
17134e867B38331k5953J31229P2962K28047c9993C86198J68128B25482R2244j34339
17123A83387J32552P5473J31824L0871k69848J86071J62174B76781K12220J2536
17113E01537k38612N0958K09811k39837J79361A20166L52420N2644A90113G8025
$$ plain form
17102 636736 126328 319978 503449 536602 257419 343179 436905 503778 486604 459472 78319
17090 578471 486980 306766 234820 486734 408199 28418 256304 316444 375383 514605 519838
17079 519838 280998 478607 221073 375471 505525 286959 244278 560495 117849 569364
17069 569364 505391 56772 212397 399935 247758 568363 558128 625881 382869 204908
17059 204908 816343 342905 449222 179473 276244 298715 311517 485454 259067 693789
17049 693789 377586 499790 163114 244649 462340 537765 384116 685736 652712 319438
17038 521783 362126 601878 371741 883190 530247 508644 441216 749496 429233 461577
17028 461577 682523 596354 366891 643284 614925 432569 441390 791046 102400 637259
$$ packed form
17102F36736A26328J93650J83471L3153B57419Q5760R3726O6873j7174k7132G8319
17090E78471r1491j80214p1946K51914p8535B8418K27886O0140N8939J39222N233
17079E19838k38840J97609B21073J54398J30054k18566m2681L16217A17849M51515
17069E69364o3973E6772J55625J87538j52177L20605j0235O7753k43012j77961
17059B04908O11435C42905J06317A79473R6771K2471J2802J73937k26387M34722
17049F93789l16203J22204A63114Q1535K17691P5425j53649L01620l3024C19438
17038E21783j59657K39752k30137N11449l52943k1603o7428L08280l20263L2344
17028D61577K20946q6169k29463K76393k8359j82356Q821L49656A02400N34859
$$ plain form
17018 637259 588397 751598 793718 550098 639747 882905 517750 894393 700656 836894
17008 836894 480797 915031 783641 528963 658662 674547 517423 670322 733415 744485
16998 744485 766527 1009681 695625 799201 826773 695163 525649 743238 1036767 820633
16988 820633 489979 905999 1133905 548329 706105 733394 1124617 731775 695799 480355
16978 480355 562024 1043505 761642 1318732 891103 847125 981248 795144 958823 1325185
16968 1325185 1105838 964882 981127 681426 988305 766386 863811 656263 1069596 666498
16958 666498 1070947 1272451 1164716 1004840 1056005 966476 1283289 1306018 1156206 972311
16948 972311 748275 1186844 1127720 1218399 1224677 875206 815839 1087343 1276337 1095889
$$ packed form
17018F37259m8862J63201M2120k43620Q9649K43158l65155L76643j93737J36238
17008H36894l56097M34234j31390k54678J29699J5885j57124J52899O3093J1070
16998G44485K2042K43154l14056J03576K7572j31610j69514K17589K93529k16134
16988H20633l30654M16020K27906E48329J57776K7289L91223l92842l5976k15444
16978D80355Q1669M81481k81863N57090m27629m3978J34123j86104J63679L66362
16968A325185k19347j40956J6245k99701L06879k21919R7425k07548M13333m03098
16958F66498M04449K01504j07735j59876N1165q9529L16813K2729j49812j83895
16948I72311k24036M38569n9124R0679O278l49471n9367K71504J88994j80448
$$ plain form
16938 1095889 1412624 1551421 1168544 1157091 1367419 1118279 1014337 943861 1405296 1284039
16928 1284039 1660591 1108064 1209030 1464719 1396077 1553915 1258874 1285855 1337276 1696566
16918 1696566 1501516 1333123 1088011 1585620 1645576 1506711 1410881 1754039 1702258 1613244
16908 1613244 1332586 1348755 1642314 1459565 1747246 1711059 1603493 1946589 1572817 1768462
16898 1768462 1813945 1446360 2115232 1631238 1755616 1823050 1850784 1999209 1823738 2030160
16888 2030160 2141468 2017685 1839671 1994712 1980376 2028846 2167159 2012148 1770217 2402834
16878 2402834 2287105 2451638 2395176 2111551 2279083 2346926 2153127 2375361 2468401 2416586
16868 2416586 2444919 2585206 2457091 2853214 2672865 2565242 2465200 2616829 2769906 2829227
$$ packed form
16938A095889L16735J38797l82877j1453K10328k49140j03942p0476M61435j21257
16928A284039L76552n52527J00966K55689o8642J57838k95041K6981N1421L59290
16918A696566j95050j68393k45112M97609N9956j38865r5830L43158n1781q9014
16908A613244k80658J6169K93559j82749K87681l6187j07566L43096l73772J95645
16898A768462M5483l67585O68872m83994J24378O7434K7734J48425j75471K06422
16888B030160J11308j23783j78014J55041j4336M8470J38313j55011k41931O32617
16878B402834j15729J64533n6462k83625J67532O7843j93799K22234R3040n1815
16868B416586K8333J40287j28115L96123j80349j07623j00042J51629J53077N9321
$$ plain form
16858 2829227 2711832 2791997 3250901 2886697 3157876 2700739 3200317 3101877 3269539 3306822
16848 3306822 3318173 3307790 3199545 3574282 3258634 3457550 3336842 3713728 3663031 3486586
16838 3486586 4072736 3758928 4066887 3944213 4275046 4474257 3825962 4351783 3917698
16829 3917698 4736386 4407098 4550210 4749172 4758423 4816226 4905778 5300800 5468318 5033883
16819 5033883 4842331 5150449 5542097 5926299 5572469 6051419 5977676 6139377 6170029 6273735
16809 6273735 6494851 6793228 6562680 6760989 6907254 6966017 7068614 7586396 7919981 7925881
16799 7925881 8224103 8275562 8382604 8804150 8556977 9091061 9187028 9600732 10086822 9914817
16789 9914817 10467464 10563605 10929069 10787596 11511942 12122876 11805641 12211915 12612969 13015705
$$ packed form
16858B829227j17395Q0165M58904l64204K71179m57137M99578r8440J67662L7283
16848C306822J1351j0383j08245L74737l15648J98916j20708L76886n0697j76445
16838C486586N86150l13808L07959j22674L30833J99211o48295N25821m34085
16829C917698Q18688l29288J43112J98962R251N7803Q9552L95022J67518m34435
16819E033883j91552L08118L91648L84202l53830M78950p3743J61701L0652J03706
16809F273735K21116K98377k30548J98309J46265N8763J02597N17782L33585N900
16799G925881K98222N1459J07042M21546k47173N34084R5967M13704M86090j72005
16789I914817N52647R6141L65464j41473P24346O10934l17235M06274M01054M02736
$$ plain form
16779 13015705 13708324 14001177 14460167 15093823 15493912 15910355 16380408 16738080 17453488
16770 17453488 18174174 18947792 19269773 19765726 20945834 21537958 22256372 23300895 23944608
16761 23944608 24802097 25944078 27078633 27670591 29479273 30717868 31453511 33148411
16753 33148411 34758565 36621359 37874882 39664500 41917123 43913664 45398961 48245669
16745 48245669 50512052 53054562 55720286 58923482 62071481 65767927 69257880 73321752
16737 73321752 77390579 81788637 86267462 91172255 96341308 101896112 107596993 113599925
16729 113599925 119650755 125782513 132260624 138762512 144825607 151191633 157155926 162204541
16721 162204541 166592202 170969238 173802973 176059135 177285419 177688492 176664253 174468925
$$ packed form
16779A3015705O92619K92853M58990O33656M00089M16443M70053L57672P15408
16770A7453488P20686P73618L21981M95953J180108N92124P18414J044523O43713
16761B3944608Q57489J141981J134555N91958J808682J238595P35643J694900
16753C3148411J610154J862794J253523J789618K252623J996541J485297K846708
16745D8245669K266383K542510K665724L203196L147999L696446L489953M063872
16737G3321752M068827M398058M478825M904793N169053N554804N700881O002932
16729A13599925O050830O131758O478111O501888O063095O366026N964293N048615
16721A62204541M387661M377036K833735K256162J226284M03073j024239k195328
$$ plain form
16713 174468925 171859493 168108069 163155894 158216625 152229747 146423320 140107777 133422615
16705 133422615 127006737 120477981 114484389 108363555 102549313 96834489 91449308 86758494
16697 86758494 81844315 77189342 73417525 68861230 65387948 62103963 58930130 55838232
16689 55838232 52717040 50296060 47850198 45329093 43167084 41116818 39110397 37373317
16681 37373317 36010176 34252292 33101689 31249283 29832711 28636443 27560024 26687198
16673 26687198 25254580 24370288 23869857 22445123 21878377 21074154 20048493 19198044 18725314
16664 18725314 18117406 17436209 17193652 16481246 15790802 15546911 15007148 14153315 13825065
16655 13825065 13487105 13023376 12774600 11963111 12102310 11262184 10875441 10919754 10418099
$$ packed form
16713A74468925k609432l751424m952175m939269n986878n806427o315543o685162
16705A33422615o415878o528756n993592o120834n814242n714824n385181m690814
16697H6758494m914179m654973l771817m556295l473282l283985l173833l091898
16689E5838232l121192k420980k445862k521105k162009k050266k006421j737080
16681C7373317j363141j757884j150603j852406j416572j196268j076419q72826
16673B6687198j432618q84292n00431j424734n66746q04223j025661q50449m72730
16664A8725314o07908o81197k42557p12406o90444k43891n39763q53833l28250
16655A3825065l37960m63729k48776q11489J39199q40126l86743M4313n01655
$$ plain form
16646 10418099 10451308 10121122 9916602 9323746 9346021 9148361 9008680 8749834 8474026 8405946
16636 8405946 7899933 7538011 7732058 7722311 7168135 7143619 7189477 6604379 6902847 6332125
16626 6332125 6494110 6581385 5905511 5496288 5909336 5902044 5621090 5570453 5802934 5407541
16616 5407541 5212882 5078544 5056792 5341187 5120294 4792255 4713860 4430673 4519139 4429564
16606 4429564 4432474 4070178 4104499 3961594 4244021 3896145 3879827 3539870 3648737 3499187
16596 3499187 3487094 3567084 3281057 3148413 3494393 3072144 2805507 3376565 2994211 2928405
16586 2928405 2965890 2508266 3248949 2778871 2841201 2883884 2498685 2549237 2747271 2919242
16576 2919242 2589644 2389648 2675014 2496873 2338687 2570098 2430236 2268353 2310115 2104925
$$ packed form
16646A0418099L3209l30186k04520n92856K2275j97660j39681k58846k75808o8080
16636H405946n06013l61922J94047r747n54176k4516M5858n85098K98468n70722
16626F332125J61985Q7275o75874m09223M13048p292k80954n0637K32481l95393
16616E407541j94659j34338k1752K84395k20893l28039p8395k83187Q8466q9575
16606D429564K910l62296L4321j42905K82427l47876j6318l39957J08867j49550
16596C499187j2093P9990k86027j32644L45980m22249k66637N71058l82354o5806
16586B928405L7485m57624P40683m70078O2330M2683l85199N0552J98034J71971
16576B919242l29598j99996K85366j78141j58186K31411j39862j61883M1762k05190
$$ plain form
16566 2104925 1956291 2139637 1929112 2521031 2195125 2198993 2455814 2055575 2134737 2294913
16556 2294913 1668879 2101421 2044391 1768841 1646819 2058373 1967935 2248687 1522215 1702957
16546 1702957 1685023 1846568 1604469 1702937 1686106 1482746 1623315 1747176 1893008 1576352
16536 1576352 1372338 1342311 1245224 1551691 1232299 1593723 1935331 1121952 1154707 1315561
16526 1315561 1651519 1556083 1414594 1270330 1544269 877351 1573691 1561048 1681762 1256514
16516 1256514 1065230 1156987 1114823 1095801 1071623 1147252 1280604 598519 1387013 1162368
16506 1162368 1031944 807694 961036 1069565 1155646 1125168 974027 1028239 1025585 831625
16496 831625 1163658 946596 853134 771208 1177565 722329 1102846 722587 721711 616010
$$ packed form
16566B104925j48634J83346k10525N91919l25906L868K56821m00239P9162J60176
16556B294913o26034M32542n7030k75550j22022M11554r0438K80752p26472J80742
16546A702957j7934J61545k42099R8468j6831k03360J40569J23861J45832l16656
16536A576352k04014l0027r7087L06467l19392L61424L41608q13379L2755J60854
16526A315561L35958r5436j41489j44264K73939o66918O96340j2643J20714m25248
16516A256514j91284R1757m2164j9022k4178P5629J33352E98519P88494k24645
16506A162368j30424k24250J53342J08529Q6081l0478j51141N4212k654j93960
16496H31625L32033k17062r3462q1926M06357m55236L80517l80259q76j05701
$$ plain form
16486 616010 925563 892609 584168 983893 656156 813343 1012518 802673 1345067 1023282
16476 1023282 716375 620573 331545 621255 842211 459486 453198 1246960 771295 815508
16466 815508 529166 474959 1072202 825213 931598 629149 672784 628373 773711 914936
16456 914936 834241 623468 731724 731741 391800 695829 708669 514748 529712 619884 821402
16445 821402 775749 515687 511014 710207 847232 589279 348809 531698 825485 556318
16435 556318 782738 564396 260382 505580 541496 625040 309387 433077 753397 485190
16425 485190 421863 630995 423587 401655 333005 553920 495564 647556 818887 600824
16415 600824 433357 281615 313291 570846 681547 249261 337656 364245 544574 343568
$$ packed form
16486F16010L09553l2954l08441L99725l27737J57187J99175k09845N42394l21785
16476A023282l06907r5802k89028K89710K20956l82725o288P93762m75665M4213
16466H15508k86342n4207N97243k46989J06385l02449M3635m4411J45338J41225
16456I14936q0695k10773J08256J7l39941L04029J2840j93921J4964R0172K01518
16445H21402m5653k60062m673J99193J37025k57953k40470J82889K93787k69167
16435E56318K26420k18342B60382K45198L5916Q3544C09387J23690L20320k68207
16425D85190o3327K09132k07408k1932o8650K20915n8356J51992J71331k18063
16415F00824j67467j51742L1676K57555J10701B49261Q8395K6589J80329k01006
$$ plain form
16405 343568 451655 422617 362804 307608 214807 350618 618973 296305 401149 508979
16395 508979 4858 490758 429662 494458 515480 324227 315546 431820 596347 97361 533253
16384 533253 165336 504573 294518 445002 244704 603852 560227 -42543 473491 -14132
16373 456314 118306 268814 439421 171006 316536 239057 394349 483984 154754 311602
16363 311602 136826 359791 91532 335775 472716 184942 77497 64383 281646 -9090
16352 -138715 205028 323539 -51668 407058 143256 164981 346529 520772 676958 225535
16341 545585 118633 57356 92385 36452 -202389 299018 304275 62951 271095 312487 359947
16330 359947 367093 588237 430598 221661 99315 155818 -47339 549116 85164 123753 51205
$$ packed form
16405C43568J08087k9038n9813n5196r2801J35811K68355B96305J04844J07830
16395E08979D858M85900o1096O4796K1022j91253q681J16274J64527I7361M35892
16384E33253A65336L39237k10055J50484k00298L59148m3625d2543D73491a4132
16373D56314A18306J50508J70607A71006J45530p7479J55292Q9635A54754J56848
16363C11602A36826K22965I1532K44243J36941A84942G7497j3114K17263i090
16352a38715B05028J18511e1668D07058A43256K1725J81548J74243J56186B25535
16341E45585A18633E7356L5029C6452b02389B99018N257F2951K08144M1392M7460
16330C59947P146K21144j57639k08937I9315N6503d7339E49116H5164L8589E1205
$$ plain form
16318 426861 125528 5424 155159 157813 205726 220202 17874 165127 156753 188059 72296
16306 327943 69458 -107313 -119154 29448 3631 68776 151862 21934 633082 606112 -23676
16294 161225 59561 -183996 389128 405916 308490 300168 17730 372105 51175 120178 9819
16282 -52003 348815 377757 427050 484179 618539 -52996 152816 338757 45106 182037 -153970
16270 95467 -11697 -13453 285838 44655 7619 186540 204987 151053 142931 -60738 483885 259159
16258 259159 664549 226011 -2852 -34664 227725 239604 270347 -27087 387448 177804 158876
16247 158876 -178312 243843 2938 -86028 159311 48947 188331 120706 164872 49027 -129210
16235 -1755 376789 304464 281310 24612 278030 134477 244826 -9219 1171 -257596 217500
$$ packed form
16318D26861A25528E424J49735K654M7913J4476A7874J47253q374L1306G2296
16306C27943F9458a07313j1841B9448C631O5145Q3086B1934O11148k6970b3676
16294A61225E9561a83996C89128J6788r7426q322A7730L54375E1175O9003I819
16282e2003C48815K8942M9293N7129J34360e2996A52816J85941D5106J36931a53970
16270I5467a1697j756B85838D4655G619J78921J8447n3934q122f0738D83885k24726
16258B59159M05390B26011b852l1812B27725J1879L0743b7087C87448A77804j8928
16247A58876a78312B43843B938h6028A59311D8947J39384o7625M4166D9027a29210
16235a755C76789p2325k3154B4612K53418A34477J10349i219A171b57596B17500
$$ plain form
16223 308028 267549 219508 178193 207633 -65245 237552 -129624 88281 313185 143570 245907
16212 245907 143010 107200 2303 334571 195638 36930 245190 -289829 75013 3349 -189457
16200 323110 46765 65471 -112176 -182940 171163 207716 1797 85081 -88924 262152 -80467
16188 35586 238254 109854 31357 165777 -24162 -201121 409528 182509 195669 186330 232710
16177 232710 56520 352240 -174373 -17912 -164216 391073 217012 78580 -179246 219964
16166 99314 -188523 -209219 -284354 -28589 114026 -149469 66888 -111158 -80388 172467 -43353
16154 -182434 80762 171602 218247 -67946 -78245 38447 98069 -51655 -30569 165759 -48189
16142 244027 305564 179814 -19884 69425 -282222 -122690 236750 105032 -75292 163851
$$ packed form
16223C08028m0479m8041m1315K9440f5245B37552a29624H8281K24904A43570J02337
16212B45907j02897l5810B303L32268j38933C6930K08260b89829G5013C349a89457
16200C23110D6765J8706a12176p0764A71163L6553A797Q3284h8924B62152h0467
16188C5586K02668A09854C1357J34420b4162j76959D09528A82509J3160r339M6380
16177B32710E6520K95720a74373a7912j46304C91073j74061G8580a79246B19964
16166I9314a88523k0696p5135b8589A14026a49469F6888a11158L0770A72467d3353
16154a82434H0762R0840M6645f7946j0299C8447N9622e1655K1086A65759d8189
16142B44027O1537j25750a9884F9425b82222a22690B36750A05032g5292A63851
$$ plain form
16131 -262834 -56789 -619 116347 -147123 9367 -74658 -174360 171573 302722 1864 179103
16120 179103 156406 65801 178755 132884 -139802 170337 21439 -584204 -18712 371322
16109 66784 -59487 213987 137429 -29718 -5301 -189103 25236 -255686 229913 -71270 -115787
16098 -115787 57392 54676 332491 33717 -281908 15713 -121034 -81407 75580 60351 -70711
16086 318926 -81798 26095 206599 -264431 -397764 57325 -118838 -173114 -428684 -92746
16075 -85872 79777 -21743 -115335 -110468 66836 -3552 -212149 -76377 -14219 259064 81507 85857
16063 85857 -141357 60087 229890 191131 95395 -35670 150243 19871 158865 -156413 -748
16051 -81666 -115058 27042 124782 -43072 30642 -60728 -205312 269162 10876 236970 68620
$$ packed form
16131b62834e6789f19A16347a47123I367g4658r9702A71573J31149A864J77239
16120A79103k2697F5801J12954m5871a39802A70337B1439e84204a8712C71322
16109F6784e9487B13987p6558b9718e301j83802B5236b55686B29913g1270m4517
16098a15787E7392k716K77815C3717b81908A5713a21034L9627G5580j5229g0711
16086C18926h1798B6095J80504b64431j33333E7325a18838n4276k55570i2746
16075h5872G9777b1743r3592M867F6836c552k08597g6377a4219B59064H1507M350
16063H5857a41357F0087J69803l8759I5395c5670A50243A9871J38994a56413g48
16051h1666l3392B7042R7740d3072C0642f0728j44584B69162A0876K26094F8620
$$ plain form
16039 -223458 13279 232309 53502 -323823 186670 89801 239339 -184910 109557 263721
16029 263721 30540 -43144 156442 -170348 121511 -49041 -238229 26349 -110548 -23156
16018 -102603 -77376 -15504 268244 258561 67482 -237728 -58432 165111 240177 -64228 362764
16006 43094 -206466 120091 15597 -9202 195830 126518 20924 150773 -236463 218533 -360249
15994 -194072 97434 -122411 67033 -246738 -205171 -302073 -250951 -206883 50737 17902 357308
15983 357308 307272 278225 202012 344798 118993 295495 -21756 -24863 -105117 68933 142598
15972 142598 -22569 -147503 -33496 -61822 -81403 -106202 231215 -4790 -169643 71646 262936
15961 262936 -25309 165921 -92410 284139 -32323 -185776 151090 -226269 -102476 -63347
$$ packed form
16039b23458A3279K19030E3502c23823A86670H9801J49538a84910A09557J54164
16029B63721C0540d3144A56442a70348A21511d9041j89188B6349a10548b3156
16018a02603K5227a5504B68244r683F7482b37728e8432A65111P5066f4228C62764
16006D3094b06466A20091A5597i202A95830o9312B0924J29849b36463B18533c60249
15994a94072I7434a22411F7033b46738M1567r6902N1122M4068E0737A7902L39406
15983C57308n0036k9047p6213J42786A18993J76502b1756l107q0254F8933P3665
15972A42598b2569j24934c3496k8326j9581k4799B31215d790j64853G1646J91290
15961B62936b5309A65921i2410B84139c2323j53453A51090b26269a02476L9129
$$ plain form
15951 -63347 -83448 -60497 -70328 -96303 105006 -190425 -40518 158268 -3390 -211588 37383
15939 -173312 199892 175169 13822 -167254 -578316 -196337 209457 -114090 84200 304533
15929 304533 69291 -126761 -32611 123554 -208676 -3786 -14792 352459 -14235 -129413 -303789
15918 -303789 -66224 233029 -296999 -428457 7634 -270257 -591433 326497 -137827 -22600
15907 -102941 233357 -78120 -122354 61211 -86821 -82687 -50333 -58407 172291 14196 -257445
15895 -103906 -515476 257261 -43406 -178979 18345 -215539 -222099 290668 289477 -128116 -126039
15884 -126039 278486 -118587 -110065 218833 -116994 96163 -98115 -366206 -172580 -313484
15874 -313484 101674 -187919 -296967 -290778 -114480 -150894 -67301 215064 88264 -74357 177682
$$ packed form
15951f3347k0101K2951r831k5975A05006a90425d0518A58268c390k08198C7383
15939a73312A99892k4723A3822a67254m11062a96337B09457a14090H4200K20333
15929C04533F9291a26761c2611A23554b08676c786j1006C52459a4235j15178j74376
15918c03789f6224B33029b96999j31458G634b70257l21176C26497a37827b2600
15907a02941B33357g8120m4234F1211h6821M134L2354q074A72291A4196b57445
15895a03906m11570B57261d3406j35573A8345b15539o560B90668j191a28116K077
15884a26039B78486a18587Q522B18833a16994I6163i8115k68091a72580j40904
15874c13484A01674a87919j09048O189a14480l6414f7301B15064H8264g4357A77682
$$ plain form
15862 -256425 -194099 -121145 15132 331103 141831 184675 -131664 76270 63790 14548 -211260
15850 91884 -316129 -39549 -3733 -93591 94406 -38952 -279601 -136018 229339 -173010 -64208
15838 45327 -61187 120894 -147744 -354559 46003 39751 -283980 38976 112254 -214787 -113317
15827 -113317 -176125 95246 -161300 99891 269683 -151353 47332 -177794 189301 144911
15817 144911 70410 -295143 -47248 -138387 282970 142715 -182478 -154581 23044 83314 26377
15805 171292 359962 -77881 116963 -117827 -216228 136797 -31894 194702 -161640 301986
15794 -40234 61205 41374 250401 -86125 226747 -101018 -140683 -51065 -252676 -84008 -24956
15782 -35387 180408 93849 -97530 -33132 136296 -267413 -190928 6106 -109524 240968 -24202
$$ packed form
15862b56425O2326P2954A5132L15971A41831M2844a31664G6270j2480A4548b11260
15850I1884c16129c9549c733q9858I4406c8952k40649a36018B29339a73010f4208
15838D5327f1187A20894a47744k06815D6003o252b83980C8976P3278b14787J01470
15827a13317o2808I5246a61300I9891J69792a51353D7332a77794A89301m4390
15817A44911G0410b95143d7248r1139B82970j40255a82478K7897B3044O0270B6377
15805A71292J88670g7881A16963a17827r8401A36797c1894A94702a61640C01986
15794d0234F1205j9831K09027h6125B26747a01018l9665e1065k01611h4008b4956
15782c5387A80408q6559i7530c3132A36296b67413P6485F106a09524B40968b4202
$$ plain form
15770 251409 -217900 -19299 7780 -306733 255013 -128459 -30501 143082 171714 6758 68467
15759 68467 -631 -14554 77008 -55090 216449 -57042 38031 224007 -17185 376392 174844
15747 -59939 194520 -25473 -191753 47651 -140529 -306875 167042 -22690 -205992 -218705
15737 -218705 2441 -50591 -137376 39077 -222742 151151 -57139 236428 -60834 -114204 -112638
15726 -112638 1686 -119798 -162217 177633 158118 351493 -183226 48386 276152 -200190
15715 180450 -144462 -72562 -139694 48964 190402 -2514 116517 -112993 -199870 -198686 -29661
15703 -107042 -40957 18000 -43346 -100031 195331 -178367 157110 -199525 -62329 43679 -111286
15691 -258439 331557 -55518 -10141 -343952 36495 10821 54288 86093 -129722 177374 -158518
$$ packed form
15770B51409b17900a9299G780c06733B55013a28459c0501A43082K8632F758O1709
15759F8467f31j3923G7008e5090B16449e7042C8031J85976a7185C76392A74844
15747e9939A94520b5473j66280D7651a40529j66346A67042b2690j83302j2713
15737b18705B441e0591q6785C9077b22742A51151e7139B36428f0834n3370J566
15726a12638A686a19798m2419A77633j9515J93375a83226D8386K27766b00190
15715A80450a44462P1900o7132D8964J41438b514A16517a12993q6877J184b9661
15703a07042d0957A8000d3346n6685A95331a78367A57110a99525f2329D3679a11286
15691b58439C31557e5518a0141l33811C6495A0821M3467L1805a29722A77374a58518
$$ plain form
15679 -342856 -404613 -32552 2063 56428 -176639 -108546 -238647 95672 141351 -166643 334
15667 -3116 -47365 84967 -158845 -93778 -92076 23045 3976 -122048 92690 -29430 37740 -66010
15654 2938 -163075 -179832 -188369 28091 -30921 -223688 -97147 123008 14416 223901 -375345
15642 -6946 81917 168669 70524 -278955 -155713 -203039 448890 -82008 -75491 -134717 -128224 334266
15629 -78465 1255 225021 -357540 230907 -261920 44315 41532 101842 -211317 76338 -33265
15617 -235180 -66486 -296336 79726 -41328 174388 -296900 -112076 -317592 44023 254769
15607 254769 22623 -344207 665125 14989 210347 62858 95801 50957 -98398 -76514 -36320
15595 69615 173154 132694 -39301 -112970 59941 196950 16981 324141 47404 -32439 63396
$$ packed form
15679c42856o1757c2552B063N4365a76639O8093j30101I5672M5679a66643C34
15667c116m4249H4967a58845O5067J702B3045C976a22048I2690b9430C7740f6010
15654B938a63075j6757q537B8091c0921j92767i7147A23008A4416K09485c75345
15642f946H1917Q6752G0524b78955J23242m7326D48890h2008O517n9226O493C34266
15629g8465A255K23766c57540B30907b61920D4315k783O0310b11317G6338c3265
15617b35180f6486k29850G9726d1328A74388b96900a12076k05516D4023K10746
15607B54769B2623c44207F65125A4989J95358F2858L2943m4844i8398K1884c6320
15595F9615J03539m0460c9301p3669E9941J37009A6981L07160D7404c2439F3396
$$ plain form
15583 -56907 -55661 -31395 194443 62176 -99271 -226865 -126162 -143638 339506 -18458 -86791
15572 -86791 44336 -159053 -313656 -193202 -64794 -58704 -78956 -318005 -50134 232958 -18931
15560 51873 -497658 79695 -220276 -93430 -364228 22805 -44421 96982 145532 105842 -249576
15548 4970 -295630 17744 -219267 93289 247185 -62865 -194858 -195663 -78684 -81076 64764 -203861
15535 110634 -62809 -122433 136552 152705 -184356 -317120 69604 -215379 -154515 -391835
15525 -391835 -35805 196976 46962 251604 -172766 24337 119233 354759 298239 48498 79375
15514 79375 116994 37554 197074 -149586 -20141 -297352 -37609 -548392 -23524 72806 -224822
15502 97514 8941 -60517 22487 -71128 226402 -144872 104759 191431 -255084 113160 173641
$$ packed form
15583e6907J246K4266A94443F2176i9271j27594J00703j7476C39506a8458o8333
15572h6791D4336a59053j54603J20454f4794O090k0252k39049e0134B32958a8931
15560E1873d97658G9695b20276i3430k70798B2805d4421I6982M8550l9690b49576
15548D970b95630A7744b19267I3289J53896f2865j31993q05g8684k392F4764b03861
15535A10634f2809n9624A36552J6153a84356j32764F9604b15379O0864k37320
15525c91835c5805A96976D6962K04642a72766B4337R4896K35526n6520D8498L0877
15514G9375L7619C7554J59520a49586b0141k77211c7609n10783b3524G2806b24822
15502I7514H941f0517B2487g1128B26402a44872A04759Q6672b55084A13160O0481
$$ plain form
15491 173641 103843 -150412 490 -20206 -6501 -223016 -52524 135242 -463816 54820 19598
15479 -200344 312841 39132 115010 371937 129555 -35069 -137993 127307 -178332 -162900
15469 -162900 -229907 187288 145434 6932 -35866 162388 45833 -44223 -27873 151216 113810
15458 113810 27243 -89433 -144186 224092 222754 145695 -82485 -321594 -55492 38058 39733
15447 39733 6188 266129 17739 104475 -175834 530079 -269520 81980 272927 -191189 88299
15435 295000 -361342 -109721 81674 37255 -5780 -29197 113755 62077 -438181 -223752 86024
15423 -48891 64572 -62007 -169464 -30813 -179169 -124634 536116 200931 51620 -181903 -250323
15412 -250323 185867 -98921 389518 -113081 -146510 -9351 -46764 284700 -250705 134353
$$ packed form
15491A73641o9798a50412D90b0206f501k16515e2524A35242d63816E4820A9598
15479b00344C12841C9132P5878K56927A29555c5069j02924A27307a78332J5432
15469a62900o7007A87288m1854F932c5866A62388D5833d4223J6350A51216l7406
15458A13810B7243h9433n4753B24092j338p7059h2485k39109e5492C8058J675
15447C9733F188K59941A7739Q6736a75834E30079b69520H1980J90947a91189H8299
15435B95000c61342a09721H1674C7255e780k3417A13755n1678d38181K14429H6024
15423d8891F4572f2007j07457c0813j48356N4535E36116B00931E1620a81903o8420
15412b50323A85867i8921C89518a13081l3429i351l7413B84700b50705A34353
$$ plain form
15401 21470 -275249 -146293 75142 289078 -84273 -55082 -160036 -16641 296448 135260
15390 326535 -203920 -160604 91394 166903 280128 -42096 131704 134958 -139623 -145582 25410
15378 266463 -141067 -476950 -99690 133394 -169291 -9464 219279 251186 -47054 -28497 -303296
15367 -303296 -35113 -82496 -219371 -73743 158338 59766 -51287 -102565 -244850 -5081 -291050
15356 -291050 -88658 79887 28590 25895 77561 -57228 -12202 -153472 43625 -98123 -80088
15345 -80088 -118650 215970 69932 209523 346346 -228087 168847 134312 -78299 410347
15334 176952 -169215 50540 343614 44652 39673 100995 -78008 162822 144317 266329 139174
15323 139174 48715 125025 -224850 296306 288651 23665 -21655 -130627 -87634 76368 269339
$$ packed form
15401B1470b75249J28956G5142K13936h4273K9191j04954a6641B96448A35260
15390C26535b03920M3316I1394P5509J13225d2096A31704L254a39623n959B5410
15378B66463a41067l35883i9690A33394a69291i464B19279L1907d7054J8557k74799
15367c03296c5113m7383j36875g3743A58338E9766e1287n1278j42285e081k85969
15356b91050h8658G9887B8590k695N1666e7228a2202j41270D3625i8123J8035
15345h0088l8562B15970F9932J39591J36823b28087A68847l4535g8299D10347
15334A76952a69215E0540K93074D4652m979O1322g8008A62822j8505J22012j27155
15323A39174D8715P6310b24850B96306p655B3665b1655j08972M2993G6368J92971
$$ plain form
15312 269339 -12168 308797 -21816 -147158 37464 -175887 84133 20690 -264279 111624
15301 -7774 126663 -170067 126063 -116813 154635 -99469 -26551 243858 -228915 83060
15290 274306 314271 -127302 -160098 38087 8781 -53452 79135 302020 89719 66487 109389
15279 109389 -92045 -154600 496552 -309188 195932 221433 215360 -320838 245206 171254 180893
15268 180893 -47800 27555 -245728 41723 146426 135236 65862 117153 -61026 -406733 119810
15256 -204225 331312 -186160 51409 485088 66169 396324 597719 576577 1666734 1006651
15246 1006651 1098019 1398382 408579 395872 -24279 -28441 115230 262422 83060 14024 12062
15235 12062 22239 -163442 142169 -214616 -8715 72340 173366 -107946 -131639 142487 143866
$$ packed form
15312B69339a2168C08797b1816j25342C7464a75887H4133B0690b64279A11624
15301g774A26663a70067A26063a16813A54635i9469b6551B43858b28915H3060
15290B74306L9965a27302l2796C8087H781e3452G9135K22885H9719k3232M2902
15279A09389i2045o2555D96552c09188A95932K5501o073c20838B45206p3952R639
15268A80893d7800B7555b45728D1723J04703j1190F5862N1291f1026l45707A19810
15256b04225C31312a86160E1409M33679F6169L30155K01395k1142J090157o60083
15246A006651R1368L00363D08579j2707b4279m162A15230J47192H3060A4024j962
15235A2062J0177a63442A42169b14616h715G2340J01026a07946k3693A42487J379
$$ plain form
15224 143866 -40509 -122173 -82661 184445 130846 -12914 -211761 70413 -117842 66116 197776
15213 197776 482563 -181423 -23710 316437 179967 261979 35045 276890 43337 -7344 -36419
15202 -36419 -53594 97459 54909 133146 38511 -155494 -123027 47061 -116227 73764 -55507
15190 177183 -122199 -55425 -311133 59634 -177705 268318 -278521 134295 -113329 195136
15179 -245423 -164206 -46226 -116698 -265492 -8569 -372583 138657 157126 446248 248261 60532
15167 -127611 104559 10951 -57636 328546 283204 2419 54856 -139280 46764 -46233 -32223
15156 -32223 -19524 -150039 -32931 168925 268342 82080 -41588 -274735 424065 187055 224433
15145 224433 39727 160094 190455 280134 22352 295465 122287 167964 -232623 -197704 116209
$$ packed form
15224A43866d0509q1664L9512A84445n3599a2914j98847G0413a17842F6116J31660
15213A97776K84787a81423b3710C16437j36470Q2012C5045K41845D3337g344k9075
15202c6419j7175I7459m2550P8237C8511a55494L2467D7061a16227G3764e5507
15190A77183a22199e5425k55708E9634a77705B68318b78521A34295a13329A95136
15179b45423Q1217d6226p0472j48794h569l64014A38657J8469K89122j97987F0532
15167a27611A04559A0951e7636C28546m5342B419N2437a39280D6764d6233J4010
15156c2223J2699j30515c2931A68925R9417H2080d1588k33147D24065A87055L7378
15145B24433C9727J20367L0361Q9679B2352K73113A22287M5677b32623L4919A16209
$$ plain form
15133 -59429 201780 106569 202636 -14925 58430 127712 167291 -295570 339577 168094 -17998
15121 -44812 -36720 13275 381402 -268011 -228146 -207671 129749 -2725 316983 94958 28627
15109 -167423 206013 -90294 95711 -79812 -122142 14129 40427 346127 -9051 383501 298465
15098 298465 134316 -140747 93223 224897 172255 407375 467143 113350 157017 124286
15088 124286 -43105 435293 212653 -40251 477038 303575 111694 -54686 661945 49022
15077 223972 224694 -61599 42016 117362 -165330 396773 140077 273130 153829 84001 19131
15065 32492 -62140 165318 414824 396049 173609 243539 -49771 18246 295506 309384 34787
15053 79720 356583 286291 131520 87186 188299 317315 27071 15720 130711 -129354
$$ packed form
15133e9429B01780r5211R6067a4925E8430O9282L9579b95570C39577A68094a7998
15121d4812Q092A3275L68127b68011L9865K0475A29749b725C16983I4958B8627
15109a67423B06013i0294I5711g9812m2330A4129K6298L05700i051C83501q5036
15098B98465A34316a40747I3223J31674n2642K35120N9768A13350M3667l2731
15088A24286d3105D35293B12653d0251D77038j73463A11694e4686F61945D9022
15077B23972P22f1599D2016P5346a65330C96773A40077J33053j19301o9828A9131
15065C2492f2140A65318K49506j8775A73609O9930d9771A8246K77260J3878C4787
15053G9720K76863p0292A31520m4334J01113J29016B7071j1351J14991a29354
$$ plain form
15042 440643 218091 197179 84438 122065 90731 392747 270078 -72887 26958 -111246 -34956
15030 235389 10958 223449 -63712 227947 263474 129073 208489 -45154 211038 238920 86143
15018 639346 257693 278746 524987 -13261 361264 196031 280212 331880 43586 114030 -213708
15006 -20243 264693 -62207 391928 414030 356172 368690 21747 240862 774647 250409 315770
14995 315770 133155 -228185 95758 315789 -2338 219517 192389 218668 108088 77768 223486
14984 223486 -103960 -48356 -23560 423160 101463 -113525 88649 246469 -395252 143611
14973 341268 180968 424354 282355 290292 99875 322899 95067 260547 206462 -65994 208047
14961 339522 98374 246558 304303 261476 -91857 472332 14466 -135278 -100684 417231 279330
$$ packed form
15042D40643B18091k0912H4438L7627l1334L02016j22669g2887B6958a11246c4956
15030B35389A0958K12491f3712B27947L5527A29073P9416d5154B11038K7882H6143
15018F39346B57693K1053K46241a3261C61264j65233Q4181N1668D3586P0444b13708
15006b0243B64693f2207C91928K2102n7858J2518B1747K19115N33785B50409O5361
14995C15770A33155b28185I5758K20031b338B19517k7128K6279A08088l0320J45718
14984B23486a03960d8356b3560D23160A01463a13525H8649J57820c95252A43611
14973C41268j60300K43386j41999P937I9875K23024I5067J65480n4085f5994B08047
14961C39522I8374J48184N7745m2827i1857D72332A4466a35278L4594D17231j37901
$$ plain form
14950 279330 -273953 213070 305845 436250 612777 263472 296170 385455 376491 40090 390505
14939 390505 100583 416461 344 253485 396440 -22105 67536 420409 220032 285007 124521
14927 286296 456236 279688 279126 75990 4179 125208 567456 280734 251864 148659 93027
14916 93027 141118 13529 224005 33020 99333 124630 316516 17517 49822 24624 291750
14905 291750 326277 190235 134796 73272 418454 372091 193924 2498 362742 244782 424821
14894 424821 258012 266216 441868 164584 304466 423367 633806 22314 158394 488964
14884 488964 268565 553907 207528 327435 410621 289396 360335 214009 332457 394770
14874 394770 429981 432895 281280 -143419 238889 743500 474655 252688 366650 403709
$$ packed form
14950B79330b73953B13070R2775J30405J76527B63472L2698Q9285q964D0090L50415
14939C90505A00583L15878C44K53141J42955b2105F7536L52873k00377O4975A24521
14927B86296J69940j76548n62G5990D179J21029M42248B80734k8870j03205n5632
14916I3027M8091A3529K10476C3020O6313K5297J91886A7517L2305B4624K67126
14905B91750L4527j36042n5439o1524L45182m6363j78167B498L60244j17960J80039
14894D24821j66809Q204J75652A64584J39882J18901K10439B2314J36080L30570
14884D88964k20399K85342B07528J19907Q3186j21225P0939j46326J18448O2313
14874C94770L5211K914j51615a43419B38889N04611k68845k21967J13962L7059
$$ plain form
14864 403709 386920 238130 714528 182967 367109 314983 204528 274756 278870 112571
14853 351731 561409 51891 431417 52937 319139 394630 380086 333278 83744 205971 273833
14842 273833 362318 475796 60307 631943 467869 421963 32613 166184 866052 439775
14832 439775 439355 35855 669841 581541 325494 292914 861155 294951 496371 399706 400424
14821 400424 578596 91744 427909 173981 378011 465173 260255 78401 494054 603148
14811 603148 424341 158684 438179 80085 342296 253038 143397 408804 359856 612803
14801 612803 445482 460872 451344 233489 195524 -7859 737025 514485 562684 431779 448752
14790 448752 269037 510715 489086 645572 394124 378064 263781 506920 538779 322001
$$ packed form
14864D03709j6789j48790M76398A82967J84142n2126j10455P0228M114A12571
14853C51731K09678E1891L79526E2937K66202P5491j4544m6808H3744J22227O7862
14842B73833Q8485J13478F0307N71636j64074m5906C2613J33571O99868m26277
14832D39775m20C5855O33986q8300k56047l2580N68241B94951K01420r6665P18
14821D00424J78172I1744L36165A73981K04030Q7162k04918G8401M15653J09094
14811F03148j78807A58684K79495H0085K62211q9258j09641K65407m8948K52947
14801F12803j67321J5390r528k17855l7965g859G37025k22540M8199j30905J6973
14790D48752j79715K41678k1629J56486k51448j6060j14283K43139L1859k16778
$$ plain form
14780 322001 705121 414615 802792 378953 885268 648199 664829 500584 796364 774880
14770 774880 892545 369629 527089 287554 354443 523904 251999 608473 330941 370933
14760 370933 344582 698420 630402 679633 636736 564172 860370 495318 866211 626054
14750 626054 332226 973247 695547 719308 534301 291190 519453 675251 731353 451095
14740 451095 478010 324968 665758 359418 494539 639907 693826 893597 639148 791608
14730 791608 786463 626930 419285 749208 720886 765529 513873 974610 595271 514412
14720 514412 654640 418749 260639 846874 894234 963795 658138 815083 476332 619037
14710 619037 1151584 559677 649523 1045030 1097730 737007 691010 551654 835301 503245
$$ packed form
14780C22001L83120k90506L88177C78953N06315k37069J6630j64245K95780k1484
14770G74880J17665C69629J57460k39535O6889J69461B51999L56474k77532L9992
14760C70933k6351L53838o8018M9231m2897p2564K96198l65052L70893k40157
14750F26054k93828O41021k77700K3761j85007k43111K28263J55798N6102k80258
14740D51095K6915j53042L40790l06340J35121J45368N3919J99771k54449J52460
14730G91608n145j59533k07645L29923k8322M4643k51656M60737l79339q0859
14720E14412J40228k35891j58110N86235M7360O9561l05657J56945l38751J42705
14710F19037N32547E59677Q9846L95507N2700l60723m5997j39356K83647l32056
$$ plain form
14700 503245 720061 772492 736521 754401 361715 524890 1180739 1001341 694865 796181
14690 796181 959925 814237 960680 1106966 829672 614940 1003818 838058 800600 695570
14680 695570 718842 599433 765555 710140 903228 835643 854263 1088195 1229612 991548
14670 991548 993878 795605 941955 828226 1186061 989560 1227640 1028740 783174 789528
14660 789528 866399 1353210 1014896 825932 829080 1165771 895495 608977 1083363 689634
14650 689634 1249393 922960 1050397 840126 890703 1318728 966123 879218 1053886 819524
14640 819524 1031979 1247202 1181630 1117766 1080128 666731 1112912 1057790 1156583 1218544 1141405
14629 1141405 1147052 1153280 1067167 1358783 953195 1028073 948698 1515707 892463 1033784 1178669
$$ packed form
14700E03245K16816N2431l5971J7880C61715J63175O55849j79398l06476J01316
14690G96181J63744j45688J46443J46286k77294k14732L88878j65760l7458j05030
14680F95570K3272j19409J66122n5415J93088o7585J8620K33932J41417k38064
14670I91548K330j98273J46350j13729L57835j96501K38080j98900k45566O354
14660G89528P6871M86811l38314j88964L148L36691k70276k86518M74386l93729
14650F89634N59759l26433J27437k10271N0577M28025l52605q6905J74668k34362
14640H19524K12455K15223o5572o3864l7638m13397M46181n5122R8793O1961p7139
14629A141405N647O228q6113K91616m05588P4878p9375N67009o23244J41321J44885
$$ plain form
14618 1178669 1369269 1245349 1194780 1116285 1045466 1121651 1306786 1255670 1196332 1412936
14608 1412936 1328147 957635 1415428 1490090 1165660 1630643 1925833 1346282 1335775 1646941
14598 1646941 1432380 1427158 1313712 1671184 1700494 1727417 1271092 1374560 1461517 1497006
14588 1497006 1593787 1367315 1929832 1617581 1639103 1779362 1538167 1569892 1583354 1696608
14578 1696608 1607818 1659344 1987080 1988812 1911823 2087803 1561755 1810615 2022107 1696263
14568 1696263 1879896 2314234 2037852 2063136 2162124 2289070 2301712 2346009 2067628 2524931
14558 2524931 2570145 2758936 2553950 2912155 3202120 3149531 3274981 4017652 4877419 6271693
14548 6271693 9414586 16176167 35939941 51449980 24529621 8576368 3973450 2757660
$$ packed form
14618A178669J90600j23920n0569p8495p0819P6185J85135n1116n9338K16604
14608A412936q4789l70512M57793P4662l24430M64983K95190n79551j0507L11166
14598A646941k14561n222j13446L57472K9310K6923m56325J03468Q6957L5489
14588A497006R6781k26472N62517l12251K1522J40259k41195L1725J3462J13254
14578A696608q8790N1526L27736J732p6989J75980n26048K48860K11492l25844
14568A696263J83633M34338k76382K5284R8988J26946J2642M4297k78381M57303
14558B524931M5214J88791k04986L58205K89965n2589J25450P42671Q59767J394274
14548F271693L142893O761581J9763774J5510039B4529621H576368C973450j215790
$$ plain form
14540 2757660 2126538 2092688 1626498 1666765 1945081 1725744 1949089 1597528 1782879 1641418
14530 1641418 1945212 1545414 1930941 2028900 2028441 2052916 2028606 2323240 2129156 2363252
14520 2363252 2056509 2286962 2040086 2026818 2228594 2510887 2159515 2118030 2424250 2610150
14510 2610150 2438948 2605898 2375155 2466097 2261752 2644172 2497716 2681719 2746482 2780437
14500 2780437 3013638 2972746 2693181 3043142 2724865 2797076 2953560 3006960 2837611 3148212
14490 3148212 3290292 2804268 3641785 3301724 3311382 3512442 3087939 3206195 3110610 3287255
14480 3287255 3234572 3722403 3529238 3469229 3516897 3661500 3647842 3478984 3643566 3905141
14470 3905141 4130946 3954319 3780278 3893178 4229123 4177374 4200781 4260182 3819598 4081067
$$ packed form
14540B757660o31122l3850m66190M0267K78316k19337K23345l51561J85351j41461
14530A641418L03794l99798L85527R7959m59K4475k4310K94634j94084K34096
14520B363252l06743K30453k46876j3268K01776K82293l51372m1485L06220J85900
14510B610150j71202J66950k30743R0942k04345L82420j46456J84003O4763L3955
14500B780437K33201m0892k79565L49961l18277P2211J56484N3400j69349L10601
14490C148212J42080m86024Q37517l40061R658K01060m24503J18256r5585J76645
14480C287255n2683M87831j93165o0009M7668J44603j3658j68858J64582K61575
14470C905141K25805j76627j74041J12900L35945n1749K3407N9401m40584K61469
$$ plain form
14460 4081067 4291546 4360442 4171563 4208111 4582587 4473042 4799152 4445002 4575916 4980560
14450 4980560 4732668 5021887 4890553 4976841 4816693 4873161 5153949 5035745 5529359 5620747
14440 5620747 5421785 5476031 5673466 5385681 5636512 5963466 5843104 5970415 5841213 6212009
14430 6212009 5884729 5963880 5817567 6274838 6382483 6666437 6499597 6600921 6809671 6647534
14420 6647534 7017617 7070617 7280989 7178588 7256259 7758546 7774214 7609175 7792181 7952604
14410 7952604 7918766 8424294 8176998 8638670 8565646 8692202 8718718 8921910 9315665 9230244
14400 9230244 9336675 9516905 9215299 9859713 10020393 10284555 10319746 10318913 10376645 10872453
14390 10872453 11040674 11272052 11092077 11642021 11614272 12057982 12044666 12161231 12279198 12735229
$$ packed form
14460D081067K10479O8896j88879L6548L74476j09545L26110l54150J30914M04644
14450D980560k47892K89219j31334Q6288j60148N6468K80788j18204M93614R1388
14440E620747j98962N4246J97435k87785K50831L26954j20362J27311j29202L70796
14430F212009l27280P9151j46313M57271J07645K83954j66840J01324K08750j62137
14420F647534L70083N3000K10372j02401P7671N02287J5668j65039J83006J60423
14410G952604l3838N05528k47296M61672p3024J26556K6516K03192L93755q5421
14400I230244J06431J80230l01606O44414J60680K64162L5191q33N7732M95808
14390A0872453J68221K31378j79975N49944k7749M43710j3316J16565J17967M56031
$$ plain form
14380 12735229 13117734 13107022 13245180 13496855 13904330 14154302 14554045 14572544 15099292 15427222
14370 15427222 15689588 15811170 16271038 16477144 16760396 17122579 17631799 17835169 17989189
14361 17989189 18875135 18947862 19598545 19985064 20374631 21210442 21106116 22000026 22541332
14352 22541332 22902333 23514830 23984872 24656799 25681300 25962777 26646018 27463550 28391983
14343 28391983 28873935 29522060 30184195 31105655 31919168 33095123 33875570 34852699 35532395
14334 35532395 37034487 38235747 39114514 40077776 41478250 42838967 44317067 45921014
14326 45921014 47130309 48583037 49949027 51757667 53827381 55522510 57496444 60028460
14318 60028460 61858719 63996510 66590380 69199027 71803544 75188547 77761509 81009313
$$ packed form
14380A2735229L82505j0712J38158K51675M07475K49972L99743J8499N26748L27930
14370A5427222K62366J21582M59868K06106K83252L62183N09220K03370J54020
14361A7989189Q85946P2727O50683L86519L89567Q35811j04326Q93910N41306
14352B2541332L61001O12497M70042O71927J024501K81477O83241Q17532R28433
14343B8391983M81952O48125O62135R21460Q13513J175955P80447R77129O79696
14334C5532395J502092J201260Q78767R63262J400474J360717J478100J603947
14326D5921014J209295J452728J365990J808640K069714J695129J973934K532016
14318F0028460J830259K137791K593870K608647K604517L385003K572962L247804
$$ plain form
14310 81009313 84424907 88042780 91856741 95705485 100150607 104259469 109599459 114450052
14302 114450052 119970773 125731506 132001726 139121898 145627516 152878310 161402022 169400234
14294 169400234 178474507 187890653 198468549 208941447 220604974 232702274 245493376
14287 245493376 259035241 273511806 288069404 303840100 319542004 336066501 353051101
14280 353051101 369702968 386988340 403198568 419055291 433905167 447678357 459474603
14273 459474603 469079771 473965552 477130204 478778681 478756704 474869399 472806969 467675697
14265 467675697 458337746 446649161 433302461 418508982 402520842 385891777 368885220
14258 368885220 351471565 334272271 317506663 302481268 286856516 271872592 257723807
$$ packed form
14310H1009313L415594L617873L813961L848744M445122M108862N339990M850593
14302A14450052N520721N760733O270220P120172O505618P250794Q523712P998212
14294A69400234R074273R416146J0577896J0472898J1663527J2097300J2791102
14287B45493376J3541865J4476565J4557598J5770696J5701904J6524497J6984600
14280C53051101J6651867J7285372J6210228J5856723J4849876J3773190J1796246
14273D59474603R605168M885781L164652J648477k1977l887305k062430n131272
14265D67675697r337951j1688585j3346700j4793479j5988140j6629065j7006557
14258C68885220j7413655j7199294j6765608j5025395j5624752j4983924j4148785
$$ plain form
14251 257723807 243917822 230987187 218899888 207552314 196594451 186716845 177312701
14244 177312701 168595644 160353722 152295899 144617108 138060406 131277235 125589486 119935552
14236 119935552 114226097 109082987 104477929 99723042 95647610 92588808 88424868 84380694
14228 84380694 81589104 78296505 74888787 72401573 69507362 67113607 64465406 61860474
14220 61860474 60238126 58071710 56180866 53823649 51897605 50030020 49071692 48128004
14212 48128004 46374775 44347558 43067721 41742970 40553839 39949328 38894443 38025145
14204 38025145 36276001 35273622 34237441 33041781 33223802 31890229 30936917 29956891
14196 29956891 29284437 28397238 28341042 27454008 26490369 25995161 25364477 24416636 23602997
$$ packed form
14251B57723807j3805985j2930635j2087299j1347574j0957863r877606r404144
14244A77312701q717057q241922q057823p678791o556702o783171n687749n653934
14236A19935552n709455n143110m605058m754887m075432l058802m163940m044174
14228H4380694k791590l292599l407718k487214k894211k393755k648201k604932
14220F1860474j622348k166416j890844k357217j926044j867585r58328r43688
14212D8128004j753229k027217j279837j324751j189131o04511j054885q69298
14204C8025145j749144j002379j036181j195660J82021j333573r53312r80026
14196B9956891o72454q87199n6196q87034r63639m95208o30684r47841q13639
$$ plain form
14187 23602997 23436290 22750914 22511801 22024888 21574252 20672648 20755960 20039356 19485327
14178 19485327 19261230 18604863 18782271 18118759 17945161 17596446 16872918 16982427 16281042
14169 16281042 16320933 15703208 15422462 15241946 14946989 14723816 14554211 13742201 13513769
14160 13513769 13408644 13260020 13263748 12436932 12700493 12105889 12354941 11723042 11622264 11313927
14150 11313927 11317090 11346683 11088100 10765688 10463279 10343978 10202659 10252654 10011933 9751622
14140 9751622 9679763 9754017 9449651 9492283 9534028 9128314 9227732 8816405 8715473 8373720
14130 8373720 8528082 8256039 8261670 8081924 7782865 7768626 7774318 7624578 7696737 7496494
14120 7496494 7468960 7302859 6896817 7171144 6648039 6631111 6697268 6289179 6460717 6421517
$$ packed form
14187B3602997j66707o85376k39113m86913m50636r01604Q3312p16604n54029
14178A9485327k24097o56367J77408o63512j73598l48715p23528J09509p01385
14169A6281042L9891o17725k80746j80516k94957k23173j69605q12010k28432
14160A3513769j05125j48624L728q26816K63561n94604K49052o31899j00778l08337
14150A1313927L163K9593k58583l22412l02409j19301j41319M9995k40721k60311
14140I751622p1859P4254l04366M2632M1745m05714R9418m11327j00932l41753
14130H373720J54362k72043N631j79746k99059j4239N692j49740P2159k00243
14120G496494k7534j66101m06042K74327n23105j6928O6157m08089J71538l9200
$$ plain form
14110 6421517 6734824 6406007 6221007 6106579 5886615 6021754 5835866 5825087 5662022 5419864
14100 5419864 5662301 5622454 5298099 5563020 5524968 5434586 5087215 5442504 5097083 5110616
14090 5110616 5180319 4823286 4987288 4805433 4655427 5076193 4820197 4709752 4451862 4231737
14080 4231737 4642851 4597916 4208930 4350198 4073814 4390300 3999769 4042688 4489250 3996848
14070 3996848 4115239 4166241 4040963 3642419 3836586 3857075 3816915 3893776 3903965 3899815 4080874
14059 4080874 3664534 4017396 3400173 3977515 3871847 3653350 3806104 3298067 3410479
14050 3410479 3317959 3331917 3311676 3341115 3043490 3022872 2902844 3212133 2815936 2811024 3125697
14039 3125697 2871458 2851216 3362974 3029463 2955415 2645528 2881016 3071914 2811826 3034146
$$ packed form
14110F421517L13307l28817j85000j14428k19964J35139j85888j0779j63065k42158
14100E419864K42437l9847l24355K64921l8052r0382l47371L55289l45421J3533
14090E110616O9703l57033J64002j81855j50006M20766k55996j10445k57890k20125
14080D231737M11114m4935l88986J41268k76384L16486l90531M2919M46562m92402
14070C996848J18391N1002j25278l98544J94167K0489m0160P6861J0189m150J81059
14059D080874m16340L52862o17223N77342j05668k18497J52754n08037J12412
14050C410479r2520J3958k0241K9439k97625k0618j20028L09289l96197m912L14673
14039C125697k54239k0242N11758l33511p4048l09887K35488J90898k60088K22320
$$ plain form
14029 3034146 2544194 2392286 2470011 2832582 2809731 2834778 2630673 2488399 2308356 2370987
14019 2370987 2289271 2540105 2229226 2514137 1939002 2845655 2315116 1937818 2229637 2377280
14009 2377280 2136952 2128224 2093861 2032675 1866260 1976137 2167063 2287252 1947412 2190872
13999 2190872 1875184 1876582 1991656 1501184 2069092 1648862 1950740 1971129 2068217 2343815
13989 2343815 2772477 4811986 9366643 27058775 51414404 29861359 14022001 7942350
13981 7942350 5666801 4384632 3802523 3292778 3441324 3200892 2742714 2510305 2271029
13972 2271029 2385024 2562181 2317147 2226963 2354307 2144619 2309210 2240344 1943511 2002643
13962 2002643 1799026 1952479 1789132 2359483 1917439 2080478 1647435 1762197 2100300
$$ packed form
14029C034146m89952j51908P7725L62571k2851K5047k04105j42274j80043O2631
14019B370987q1716K50834l10879K84911n75135R06653n30539l77298K91819J47643
14009B377280k40328q728l4363o1186j66415J09877J90926J20189l39840K43460
13999B190872l15688J398J15074m90472N67908m20230L01878K0389R7088K75598
13989B343815M28662K039509M554657J7692132K4355629k1553045A4022001o079651
13981G942350k275549j282169n82109n09745J48546k40432m58178k32409k39276
13972B271029J13995J77157k45034r0184J27344k09688J64591o8866k96833N9132
13962B002643k03617J53453j63347N70351m42044J63039m33043J14762L38103
$$ plain form
13953 2100300 1974350 1856787 1522630 2340050 1870672 2024856 1348151 1948162 1958235 1561824
13943 1561824 1645399 2157108 1736890 1794316 1266491 1533594 1399370 1899207 1726018 1533470
13933 1533470 1400821 1506852 1454430 1632420 1413184 1455603 1469536 1542913 1676249 1226525
13923 1226525 1710365 1225523 1376128 1503939 1593584 1431462 1381184 1357975 1430068 1391257
13913 1391257 1423869 1309526 1343592 1399213 1310236 897641 1384217 1471660 1360322 1515093
13903 1515093 1495469 1455989 1504013 1208078 1407440 951638 1205276 924079 1002232 1362776
13893 1362776 1093385 1288402 1559591 1007847 1220057 1343941 901030 1388327 959212
13884 959212 1029033 1343042 1111573 1140954 1190682 947342 1419804 1307602 1177047 1391767
$$ packed form
13953B100300j25950j17563l34157Q17420m69378J54184o76705O00011J0073l96411
13943A561824Q3575N11709m20218N7426n27825K67103j34224M99837j73189j92548
13933A533470j32649J06031n2422J77990k19236M2419J3933P3377J33336m49724
13923A226525M83840m84842J50605J27811Q9645j62122n0278k3209P2093l8811
13913A391257L2612j14343L4066N5621q8977m12595M86576Q7443j11338J54771
13903A515093j9624l9480M8024k95935J99362m55802K53638k81197P8153L60544
13893A362776k69391J95017K71189n51744K12210J23884m42911M87297m29115
13884I59212O9821L14009k31469K9381M9728k43340M72462j12202j30555K14720
$$ plain form
13874 1391767 1119028 1343310 1212455 1154770 1096003 1290964 1515688 922497 1273911 1017791
13864 1017791 1041547 937309 904928 985106 899974 1327024 952479 1122233 995604 977952
13854 977952 616812 1254948 1100519 802014 1239877 1091167 949467 1037280 1062520 702211
13844 702211 1050800 708362 980671 975026 696404 1020052 947760 1058993 830393 886943
13834 886943 1134635 972003 872145 765455 535076 915183 1034681 825605 997947 688620
13824 688620 767986 713699 960225 778619 962996 762290 920493 531409 896655 922982
13814 922982 837650 724396 963537 698136 840884 936624 589834 609761 765429 870278
13804 870278 588508 757969 445488 456624 831287 337251 807101 859070 884369 647127
$$ packed form
13874A391767k72739K24282j30855n7685n8767J94961K24724n93191L51414k56120
13864A017791K3756j04238l2381Q0178q5132M27050l74545J69754j26629j7652
13854I77952l61140O38136j54429k98505M37863j48710j41700Q7813K5240l60309
13844G02211L48589l42438K72309n645k78622L23648p2292J11233k28600N6550
13834H86943K47692j62632r9858j06690k30379L80107J19498k09076J72342l09327
13824F88620P9366n4287K46526j81606J84377k00706J58203l89084L65246K6327
13814I22982q5332j13254K39141k65401J42748R5740l46790J9927J55668J04849
13804H70278k81770J69461l12481J1136L74663C37251M69850N1969K5299k37242
$$ plain form
13794 647127 883534 918555 615345 465197 650912 844330 739696 679283 523988 448071
13784 448071 345680 846508 676451 597901 698507 527735 417605 570787 651435 622311
13774 622311 660662 509524 544543 628395 664066 376665 880071 432591 719380 743639
13764 743639 677742 995235 669006 180293 584111 805513 549902 350451 775316 831222
13754 831222 656219 896938 478717 805119 491839 638490 680369 359894 394044 565724
13744 565724 755173 645585 627865 630588 201905 698853 540354 525247 585196 432841
13734 432841 777071 568305 609153 419170 581439 652052 723272 478316 136748 463220
13724 463220 646730 777100 535115 503692 480603 540887 573482 678599 657644 715309 376209
$$ packed form
13794F47127K36407L5021l03210j50148J85715J93418j04634o0413j55295p5917
13784D48071j02391N00828j70057p8550J00606j70772j10130J53182Q0648k9124
13774F22311L8351j51138L5019Q3852L5671k87401N03406D32591K86789K4259
13764G43639o5897L17493l26229A80293M03818K21402k55611j99451M24865N5906
13754H31222j75003K40719m18221L26402l13280J46651M1879l20475L4150J71680
13744E65724J89449j09588j7720K723B01905M96948j58499j5107N9949j52355
13734D32841L44230k08766M0848j89983J62269P0613P1220k44956A36748L26472
13724D63220J83510J30370k41985l1423k3089O0284L2595J05117k0955N7665l39100
$$ plain form
13713 376209 420892 646322 180268 647058 55777 461496 512258 618541 639309 642425 649950
13702 649950 678071 784650 522486 428279 386547 533098 599072 387317 531937 689218
13692 689218 680178 277099 533086 677841 388695 430822 245129 533670 369602 516468
13682 516468 336286 444208 372952 711754 383768 603661 474142 489713 885677 423954
13671 232824 727245 253253 750722 437518 772218 672550 166777 915216 509938 58436
13660 447978 465546 541915 329224 733432 347913 290300 257790 139167 388003 354474
13650 354474 613760 387431 612195 471700 427605 221502 562319 395064 454717 247062
13640 247062 499291 291742 301788 442566 399291 698389 275518 410047 179319 474399
$$ packed form
13713C76209M4683K25430A80268M66790E5777M05719N0762J06283K0768L116P525
13702F49950K8121J06579k62164r4207m1732J46551O5974k11755J44620J57281
13692F89218r040B77099K55987J44755k89146M2127j85693K88541j64068J46866
13682E16468j80182J07922p1256L38802l27986K19893j29519J5571L95964D23954
13671B32824M94421B53253M97469l13204L34700r9668A66777P48439m05278E8436
13660D47978J7568P6369k12691M04208C47913n7613l2510j18623K48836l3529
13650C54474K59286k26329K24764j40495m4095k06103L40817j67255N9653k07655
13640B47062K52229k07549J0046J40778m3275K99098B75518J34529A79319K95080
$$ plain form
13630 474399 179561 427890 522041 641640 376597 553897 218366 -11994 648793 289932
13619 478251 425859 405601 132728 306360 694379 555532 500210 417999 -25579 411670
13608 175999 242255 479125 328680 654082 500261 360269 236146 -10058 198221 90286
13597 659477 319878 717373 467731 423057 383985 314889 418482 779415 283201 328959
13587 328959 147167 346400 291476 370955 50322 217945 -163961 135668 75142 339360
13577 339360 198974 429903 476617 271833 153201 -29751 950315 462426 393370 299835
13567 299835 339756 67991 380370 258447 380812 487888 18569 334798 465026 458717
13557 458717 171824 263614 429335 411302 339219 332431 6452 619923 75726 598260 254102
$$ packed form
13630D74399A79561K48329R4151J19599k65043J77300B18366a1994F48793B89932
13619D78251n2392k0258A32728J73632L88019j38847n5322q2211b5579D11670
13608A75999O6256K36870j50445L25402j53821j39992j24123a0058A98221I0286
13597F59477C19878L97495k49642m4674l9072o9096J03593L60933B83201M5758
13587C28959A47167J99233n4924P9479E0322J67623a63961A35668o0526K64218
13577C39360j40386K30929M6714k04784j18632b9751I50315D62426o9056r3535
13567B99835L9921F7991L12379j21923J22365J07076A8569L16229J30228o309
13557D58717A71824R1790J65721j8033p2083o788F452O13471G5726N22534B54102
$$ plain form
13545 260172 337253 191784 422662 72938 238267 -1546 586419 437570 339676 694607
13535 694607 629269 677325 112320 125708 311181 186572 382125 97651 320128 272770
13525 272770 215037 -56378 68308 186902 279522 357042 215718 406748 85047 237621 381052
13514 381052 338396 170341 504521 204783 134730 190342 400271 223116 63121 228933
13504 228933 511380 452191 309081 249132 177034 199637 128384 126251 368536 384494 108605
13492 153415 205987 15330 56143 254712 98119 235150 379181 430012 329445 411963 272275
13481 272275 142451 364670 413954 125306 239079 331312 243534 464044 640965 93237
13470 105988 189619 269218 526133 14594 197600 94829 161051 74907 -128384 -125334 146894
$$ packed form
13545B60172P7081j45469K30878G2938J65329a546E86419j48849r7894L54931
13535F94607o5338M8056A12320J3388J85473j24609J95553I7651K22477m7358
13525B72770n7733e6378F8308J18594R2620P7520j41324J91030H5047J52574J43431
13514C81052m2656j68055L34180B04783p0053N5612K09929j77155F3121J65812
13504B28933K82447n9189j43110n9949p2098K2603p1253k133K42285J5958A08605
13492A53415N2572A5330M0813J98569I8119J37031J44031N0831j00567Q2518j39688
13481B72275j29824K22219M9284A25306J13773R2233q7778K20510J76921I3237
13470A05988Q3631P9599K56915A4594J83006I4829O6222G4907a28384L050A46894
$$ plain form
13458 402750 51439 235093 -175649 703808 23401 279783 168303 9606 93171 397619
13448 397619 63632 58038 229150 417835 173240 84251 152834 78167 372444 307605 271654
13437 271654 263693 116674 -82761 464796 -180929 161175 383413 532526 585188 -36094
13426 347281 156614 327974 258120 505836 -91622 162568 -122473 130274 246267 182075
13416 182075 -84023 -57849 178053 399825 7487 411866 125277 410410 143669 361416
13406 361416 303490 159414 102965 61963 172926 143834 425970 -48827 -123915 -970 68065
13394 -14396 125370 176224 49300 228028 -91527 413874 72620 41951 175768 26268 -80933
13382 -45956 -168641 -74298 -85552 184023 -30371 356144 511787 275406 401145 277505
$$ packed form
13458D02750E1439J83654a75649G03808B3401K56382j11480I606Q3565L04448
13448C97619F3632n594J71112J88685A73240H4251O8583p4667K94277o4839l5951
13437B71654p961A16674h2761D64796a80929A61175K22238J49113N2662c6094
13426C47281A56614J71360o9854K47716i1622A62568a22473A30274J15993o4192
13416A82075h4023K6174A78053K21772G487M04379A25277K85133A43669K17747
13406C61416n7926j44076n6449m1002J10963k9092K82136d8827p5088i70F8065
13394a4396A25370N0854D9300J78728i1527D13874G2620l0669J33817B6268h0933
13382d5956j22685g4298j1254A84023c0371C56144J55643k36381J25739j23640
$$ plain form
13372 277505 364334 136435 -71005 150751 268412 370043 132758 770787 123070 264976
13362 264976 267842 12821 357254 140207 375837 280808 277019 106751 274489 134734 264721
13351 264721 323286 99488 481836 178132 196668 198089 200897 -90855 428184 -160545 446444
13339 430990 130148 144242 256367 203297 18589 413759 33105 279018 105217 350738
13329 350738 336511 233018 77403 -50950 59346 -112699 471399 804861 332829 71887
13318 288624 193544 188474 160592 -26919 133291 227074 439473 346837 95384 494163 312903
13307 312903 217346 55170 367608 103896 93193 -82021 250156 247057 -24398 159168 -95306
13295 1848 189211 240694 333976 -88677 35818 293730 250448 221327 303405 -234547 -93871
$$ packed form
13372B77505Q6829A36435g1005A50751J17661J01631A32758O38029A23070J41906
13362B64976K866A2821L44433A40207K35630r5029l789A06751J67738A34734J29987
13351B64721N8565I9488L82348A78132J8536J421K808i0855D28184a60545D46444
13339D30990A30148J4094J12125n3070A8589L95170C3105K45913A05217K45521
13329C50738j4227j03493G7403e0950E9346a12699D71399L33462C32829G1887
13318B88624r5080n070k7882b6919A33291R3783K12399r2636I5384L98779j81260
13307C12903r5557E5170L12438A03896j0703h2021B50156l099b4398A59168i5306
13295A848J87363N1483R3282h8677C5818K57912m3282k9121Q2078b34547i3871
$$ plain form
13283 101567 122609 326633 104508 -62707 -146162 193098 120106 -162256 136023 169721
13273 169721 -82032 224239 -226116 95521 42172 120566 185343 132052 164387 -15235 -106675
13262 -106675 387242 -84159 158154 184379 84564 151985 49862 -121277 -47801 254551 -68665
13250 -15197 132314 24675 -89597 16311 123089 182170 -40217 -7757 140836 -35615 -131708
13239 -131708 65769 90143 12134 181978 111911 198745 270824 -139499 -36680 5193 -144550
13227 329830 -56909 84788 -303225 -135744 204899 169959 16337 2936 301909 -39841 222027
13215 356724 -69962 -18172 -22742 536097 396692 411417 405626 -101383 -33139 305432 109413
13203 -165527 221142 -123535 89143 49796 153706 -19178 46823 -77497 71789 150078 460580
$$ packed form
13283A01567K1042K04024A04508f2707q3455A93098p2992a62256A36023L3698
13273A69721h2032B24239b26116I5521D2172P8394O4777n3291L2335a5235r1440
13262a06675C87242h4159A58154K6225H4564O7421D9862a21277d7801B54551f8665
13250a5197A32314B4675h9597A6311J06778N9081d0217g757A40836c5615r6093
13239a31708F5769K4374A2134J69844p0067Q6834P2079a39499c6680E193a44550
13227C29830e6909H4788c03225a35744B04899l4940A6337B936K98973c9841B22027
13215C56724f9962a8172m570E36097j39405J4725n791a01383c3139C05432A09413
13203a65527B21142a23535H9143l9347J03910a9178D6823g7497G1789P8289L10502
$$ plain form
13192 460580 -140902 -191041 156948 -843 367727 -365619 205428 161425 57743 306036 8580
13180 351059 -78839 7310 39525 155191 241914 -122342 125438 -5792 34711 222391 75894
13168 -537 408901 -31543 356346 -221139 290348 -132475 -132075 305622 51778 -114582 257239
13156 346942 154046 104562 -27388 62711 -181106 -87677 72965 -115695 153413 164108 56304
13144 73612 -9940 132900 275706 203884 507839 -75744 -103782 53607 -203907 -135330 -331041
13133 -331041 -104664 282374 -118532 -126685 165008 -48887 -31606 209001 -127449 162750
13122 202588 12546 71224 230400 321557 182199 271059 88494 27897 97609 129293 64532
13110 -19506 -143971 252518 -89665 122435 -265886 129417 307525 -312880 59809 -327906
$$ packed form
13192D60580a40902n0139A56948h43C67727c65619B05428m4003E7743K48293H580
13180C51059g8839G310L2215J15666Q6723a22342A25438e792C4711J87680G5894
13168e37D08901c1543C56346b21139B90348a32475M00C05622E1778a14582B57239
13156C46942A54046m9484b7388F2711a81106h7677G2965a15695A53413J0695E6304
13144G3612i940A32900J42806p1822L03955g5744k8038E3607b03907O8577j95711
13133c31041a04664B82374a18532q153A65008d8887J7281B09001a27449A62750
13122B02588A2546N8678J59176R1157j39358Q8860H8494B7897O9712L1684F4532
13110a9506j24465B52518h9665A22435b65886A29417J78108c12880E9809c27906
$$ plain form
13099 -423409 103645 450083 245341 232480 -61749 -170584 191591 18686 -55392 74758
13088 46602 46096 -243166 -8616 -73413 -229594 -147401 244543 -152233 -45593 229193 244290
13077 244290 -231852 -237691 454425 -69604 -146415 52022 122522 -227698 178893 47514 -240748
13065 100954 53029 204368 284519 369745 230185 279831 35491 51159 -40130 -131615 -341539
13054 -341539 127271 65664 24419 214733 240336 -169498 71462 100198 98744 10252 148127
13043 148127 -249196 8259 138335 357286 -18996 202520 260032 334157 49075 52841 420563
13032 420563 -226663 -72305 224877 250650 70447 -314398 160900 292827 -44182 223525
13021 125819 218655 -40671 117200 -72073 121051 206686 449947 310029 83077 117192 90741
$$ packed form
13099d23409A03645L46438k04742j2861f1749j08835A91591A8686e5392G4758
13088D6602n06b43166h616o4797j56181Q2193B44543a52233d5593B29193J5097
13077B44290b31852n839D54425f9604p6811E2022P0500b27698A78893D7514b40748
13065A00954m7925J51339Q0151Q5226j39560M9646C5491J5668d0130r1485k09924
13054c41539A27271o1607B4419J90314K5603a69498G1462K8736j454A0252J37875
13043A48127b49196H259J30076K18951a8996B02520N7512P4125D9075L766L67722
13032D20563b26663g2305B24877K5773G0447c14398A60900J31927d4182B23525
13021A25819R2836d0671A17200g2073A21051Q5635K43261j39918H3077L4115k6451
$$ plain form
13010 90741 41862 122964 7582 174665 322319 -43553 93928 469487 228211 -127657 -109253
12999 -109253 554486 195887 119118 285731 115500 242715 -84988 78576 18589 -207822
12988 381671 227175 46435 52075 172515 389934 -169041 143602 -185385 51923 159959
12978 159959 -115933 -94935 210507 -79151 225859 131912 487652 162767 -28292 385498
12967 205424 -72753 78591 -38797 -83369 127205 313667 -27485 58622 381004 239787 -19260
12955 -14507 315390 -291595 -194451 265357 110622 155885 112043 36945 -221711 271233
12944 99238 242796 273827 -81050 -63172 220047 61292 71585 -132719 -34409 -126603 -2406
12932 329117 286021 13997 -14264 152654 -54644 -24766 -160153 123577 192164 239736 156069
$$ packed form
13010I0741D1862Q1102G582J67083J47654d3553I3928L75559B28211a27657J8404
12999a09253E54486A95887p6769J66613A15500J27215h4988G8576A8589b07822
12988C81671j54496D6435N640J20440K17419a69041A43602a85385E1923J08036
12978A59959a15933K0998B10507g9151B25859r3947L55740A62767b8292C85498
12967B05424g2753G8591c8797m4572A27205J86462b7485E8622L22382j41217a9260
12955a4507C15390b91595R7144B65357A10622M5263m3842C6945b21711B71233
12944I9238J43558L1031h1050J7878B20047F1292J0293a32719c4409r2194b406
12932C29117m3096A3997a4264A52654e4644b4766j35387A23577O8587M7572q3667
$$ plain form
12921 156069 177580 149820 -146568 11433 265314 111089 -36124 -240158 290442 79869
12910 -186034 -160349 191853 -72201 -315 32744 302180 -128310 -90463 32733 -110285 -45736
12898 -158024 17976 337881 138243 167591 -172368 456177 34139 98408 9850 -304859 148451
12886 378429 -32866 45141 -60729 25976 -51908 165227 -197980 93761 -180890 181366 -45605
12874 68439 30540 162786 -156853 341461 -73217 -84039 -82640 161683 -148699 185454 156665
12863 156665 194250 -112902 -264543 284613 -73580 -150163 -128709 -69251 192688 220014 112813
12852 112813 6394 -270710 -454249 -231492 268468 67897 197617 158055 254575 79835 -82894
12840 -159156 -76271 -44589 67763 -69573 -16210 -62501 229702 21150 21993 293642 140931
$$ packed form
12921A56069K1511k7760a46568A1433K53881A11089c6124k04034B90442G9869
12910a86034K5685A91853g2201c15C2744K69436a28310L7847C2733a10285d5736
12898a58024A7976L19905A38243K9348a72368D56177C4139O4269I850c04859A48451
12886C78429c2866D5141f0729B5976e1908A65227a97980I3761a80890A81366d5605
12874F8439C0540J32246a56853C41461g3217j0822J399A61683a48699A85454k8789
12863A56665L7585a12902j51641B84613g3580p6583K1454N9458A92688K7326j07201
12852A12813F394b70710j83539K22757B68468F7897J29720l9562R6520G9835h2894
12840a59156g6271L1682F7763f9573a6210m6291B29702B1150Q43K71649A40931
$$ plain form
12828 482290 -101079 -59773 -11191 -133440 -215018 -168993 95974 -2063 -90867 102508 10048
12816 127068 -165061 25386 12154 -54582 54080 120300 499431 -185747 135483 142686 -95438
12804 -265273 -172669 246937 53215 93353 -196931 243628 36285 -119830 -597892 -270859
12793 -57314 151629 -116151 -78093 -367844 399845 -33252 9812 -142297 47008 -36128 353334
12781 77626 315314 314168 -144385 191644 354978 -65182 153889 305989 10290 -76970 91995
12769 -235542 99678 -264553 -52784 54115 -49358 -281473 1871 429665 116791 335591 -89297
12757 -13811 -42326 202263 173161 -97924 -119144 -59734 115934 17335 -60023 24136 -100534
12745 302361 -212519 -176878 102288 261083 -71372 165716 151783 -173925 -160029 14744
$$ packed form
12828D82290a01079M1306a1191j22249q1578M6025I5974b063q8804A02508A0048
12816A27068a65061B5386A2154e4582E4080O6220L79131a85747A35483P203i5438
12804b65273R2604B46937E3215M0138a96931B43628C6285a19830m78062b70859
12793e7314A51629a16151L8058k89751C99845c3252I812a42297D7008c6128C53334
12781G7626K37688j146a44385A91644J63334f5182A53889J52100A0290g6970I1995
12769b35542I9678b64553e2784E4115d9358k32115A871M27794A16791K18800h9297
12757a3811k8515B02263k9102i7924k1220N9410A15934A7335f0023B4136a00534
12745C02361b12519L5641A02288J58795g1372A65716j3933a73925J3896A4744
$$ plain form
12734 152058 65350 -78001 94474 -19454 170574 -68849 -52605 -21408 400328 279447 40363
12722 154384 -45175 -125121 199152 2078 252535 -378711 90068 -89876 61787 -100874 175343
12710 151433 -273796 247302 -44329 533115 98130 369727 17075 517155 -184864 233591
12699 195977 -8811 -76826 26622 -73157 242993 58708 268514 -90508 94930 26686 -272176
12687 67758 -73511 -35174 -99496 -72667 238266 -82522 -14645 178819 301740 153281 51562
12675 70781 37711 494134 187967 359268 -11941 6510 -329246 -279 340414 226426 5720
12663 -16474 149568 -87697 177404 234538 5376 -198641 95444 229848 222229 -224615 -65345
12651 120994 185529 141235 109794 33780 309611 -104712 99772 -130955 -132296 -349127 -74698
$$ packed form
12734A52058F5350g8001I4474a9454A70574f8849J6244b1408D00328j20881D0363
12722A54384d5175p9946A99152B078K50457c78711I0068h9876F1787a00874A75343
12710A51433b73796B47302d4329E33115I8130K71597A7075N00080a84864B33591
12699A95977h811o8015B6622g3157B42993E8708K09806i0508I4930B6686b72176
12687F7758g3511c5174o4322K6829B38266h2522a4645A78819J22921j48459E1562
12675G0781l3070M56423A87967J71301a1941F510c29246b79C40414j13988E720
12663a6474A49568h7697A77404N7134E376a98641I5444J34404p619b24615f5345
12651A20994O4535m4294l1441C3780K75831a04712I9772a30955j341k16831g4698
$$ plain form
12639 324127 55715 182587 151006 149237 -185720 53133 62263 196560 335977 90819 417522
12628 417522 222561 319296 156016 252170 -163206 54735 155722 7708 390698 66107 20153
12616 160690 -198931 29485 263806 119457 154860 206300 160113 24556 168174 -18772 2622
12604 149146 -3139 -40920 -216341 118744 -76606 385076 337972 87208 -137446 -173539 -217430
12593 -217430 128243 178618 -401526 28509 231814 245238 -119698 79150 -201712 -72467
12582 -147168 21071 156886 -319100 22986 -67944 120342 -118569 -129137 41975 -96575 -269359
12571 -269359 -42694 28093 119599 131409 16018 -60111 257317 -48157 -240033 149113 -149989
12559 -28479 149049 248560 -213716 -120074 116510 249738 -141807 -149896 -24080 89106 343658
$$ packed form
12639C24127E5715J26872l1581j769a85720E3133R130J34297J39417I0819L26703
12628D17522j94961R6735A56016R6154a63206E4735J00987G708L82990F6107B0153
12616A60690a98931B9485K34321A19457L5403N1440m6187B4556J43618a8772B622
12604A49146c139l7781j75421A18744g6606C85076m7104H7208a37446l6093m3891
12593b17430A28243N0375d01526B8509K03305J3424a19698G9150b01712g2467
12582a47168B1071J35815c19100B2986f7944A20342a18569j0568D1975i6575j72784
12571b69359d2694B8093R1506J1810A6018f0111B57317d8157j91876A49113a49989
12559b8479A49049R9511b13716R3642A16510J33228a41807q089b4080H9106K54552
$$ plain form
12548 343658 220300 101551 221826 -236811 135972 46730 33526 187925 151240 -286173
12537 119847 114245 -42083 -81521 -2517 18893 -60209 -25307 -47394 10160 -97870 -162424 -68523
12524 -143115 -312436 -200668 -117820 -25846 -101406 -121807 277346 68654 248737 -39244 40272
12512 22833 -322119 27431 401035 -93231 49017 235195 480234 76914 -19181 72683 -141703
12500 -121666 163815 95816 -51118 27631 112403 22185 134172 161498 -106949 -113213 -684
12488 129294 -18921 -214562 -101721 152070 -104977 15536 117483 -258028 -290177 -15196
12477 21993 -199147 200862 243133 -111708 -171124 -17062 -93004 264922 95412 335084 -18538
12465 -99078 -123486 -148218 -193759 -126227 474689 -169567 -77836 95271 65668 304161 -72297
$$ packed form
12548C43658j23358A01551J20275b36811A35972D6730j3204J54399l6685b86173
12537A19847n602d2083l9438b517A8893f0209b5307k2087A0160i7870o4554f8523
12524a43115j69321J11768Q2848b5846p5560k0401B77346F8654J80083c9244D0272
12512B2833c22119B7431L73604i3231D9017J86178K45039G6914a9181G2683a41703
12500a21666A63815o7999e1118B7631Q4772B2185J11987K7326a06949o264f84
12488A29294a8921j95641a01721A52070a04977A5536J01947b58028l2149a5196
12477B1993a99147B00862M2271a11708n9416a7062p5942B64922I5412K39672a8538
12465i9078k4408k4732m5541O7532D74689a69567g7836I5271k9603K38493g2297
$$ plain form
12453 25817 158190 90074 49298 20918 -15655 -42488 -41668 -38177 6171 238845 72131 -400113
12440 268742 106586 -71984 107207 74822 -90032 -226850 -327193 -6177 -40385 109513 10253
12428 -114032 42704 -34188 -59097 -23160 -134995 -277755 -969 -148218 181349 141625 128140
12417 128140 -233244 -194126 9060 -324007 -60051 -33451 145259 -332084 -192991 41344 -209152
12405 135183 213541 -96292 85493 -54969 32988 -28124 -58579 28558 -121861 167552 -86451
12393 -227217 -16961 -28025 -48478 44717 55135 -138240 205907 -8471 155954 32617 -49861
12381 108518 261781 74864 -85733 -18109 -81246 141030 105602 -196087 143592 13711 58715
12370 58715 -186607 36979 -170173 7368 -167372 -53672 -45879 -331564 123478 -15973 203560
$$ packed form
12453B5817J32373o8116m0776B0918a5655k6833Q20L491F171K32674G2131d00113
12440B68742A06586g1984A07207l2385i0032j36818j00343f177l4208A09513A0253
12428a14032D2704c4188k4909b3160j11835j42760i69j47249A81349l9724j3485
12417A28140b33244L9118I060c24007f0051K6600A45259c32084J39093D1344b09152
12405A35183P8358i6292H5493e4969C2988b8124l0455B8558a21861A67552h6451
12393b27217a6961j1064k0453D4717J0418a38240B05907h471A55954C2617d9861
12381A08518J53263G4864h5733a8109o3137A41030l5428a96087A43592A3711M5004
12370E8715a86607C6979a70173G368a67372e3672P793k85685A23478a5973B03560
$$ plain form
12358 226035 -149298 -123103 -16058 171557 -54849 74206 -72721 90428 123160 324856 -532149
12346 -94994 8060 276859 -166634 106863 98559 -314680 43564 22162 -7735 339884 -140197
12334 109383 104832 98912 114713 142680 -131270 122284 -36613 -77393 -483813 247832 246343
12323 246343 -149549 -144646 107052 205186 114843 247635 45434 -232382 157889 115515 12940
12311 -103034 15043 40836 189805 -44315 304930 338044 217190 46492 -48918 171091 256305
12300 256305 149775 -156055 -75622 -81252 113658 -71245 351540 -164750 71118 -83402 33499
12288 -93300 144094 252351 52656 28632 382354 157702 -160689 -122536 -10122 23087 -30524
12276 56597 -144098 -31494 326939 250 359999 176287 670437 14240 -297837 29099 101710
$$ packed form
12358B26035a49298K6195a6058A71557e4849G4206g2721I0428L2732K01696e32149
12346i4994H060K68799a66634A06863q304c14680D3564k1402g735C39884a40197
12334A09383m551n920J5801K7967a31270A22284c6613m0780m06420B47832j489
12323B46343a49549M903A07052R8134r0343J32792D5434b32382A57889m2374A2940
12311a03034A5043K5793J48969d4315C04930L3114j20854D6492d8918A71091Q5214
12300B56305j06530a56055g5622n630A13658g1245C51540a64750G1118h3402C3499
12288i3300A44094J08257E2656k4024L53722A57702a60689L8153a0122B3087c0524
12276E6597a44098c1494C26939B50L59749A76287M94150A4240b97837B9099P2611
$$ plain form
12265 101710 265813 13908 -24813 69637 435577 394889 19141 16286 472954 444283 210562
12253 121699 -108558 335467 136034 -297511 43044 228748 -84433 -64728 147656 105035
12243 105035 277952 224532 210924 320090 146444 283490 -47653 -406666 69745 183320
12233 183320 264518 139913 23577 142862 -292278 289198 196202 444543 -26091 293307
12222 75179 -238033 181184 -49239 -102242 294743 249137 -34701 -13682 119172 -83319 14326
12210 107253 -263351 136462 -184787 266696 -95909 111753 -64744 173896 337085 74194
12199 426842 46594 89247 19192 -26971 55315 383831 39683 266870 140684 426381 1788
12187 133022 66753 75248 177656 55267 282114 381173 392196 -78422 382511 267845 280760
$$ packed form
12265A01710J64103A3908b4813F9637L65940m0688A9141k855M56668k8671B10562
12253A21699a08558C35467A36034b97511D3044J85704h4433J9705A47656m2621
12243A05035J72917n3420j3608J09166A46444J37046d7653l59013F9745J13575
12233A83320Q1198j24605B3577J19285b92278B89198r2996K48341b6091B93307
12222G5179b38033A81184d9239n3003B94743m5606c4701a3682A19172h3319A4326
12210A07253b63351A36462a84787B66696i5909A11753f4744A73896J63189G4194
12199D26842D6594M2653A9192b6971E5315L28516C9683K27187j26186K85697A788
12187A33022o6269Q495J02408E5267K26847R9059J1023g8422C82511j14666J2915
$$ plain form
12176 280760 294124 -67594 341440 -18674 128930 163967 -142729 -132131 68134 -86123 215383
12164 183745 -117203 -60372 8079 63439 -13660 -42428 45346 104795 145181 40416 54621
12153 54621 74748 -11282 -48954 -123343 28416 75427 16678 68287 -49984 492000 -144078
12141 207202 -116566 35485 -109547 -183938 97514 -349434 108418 241647 -429870 50722
12130 -398060 21605 -22040 -137448 -150773 283427 125018 274714 -195360 302820 -260 -206784
12119 -206784 161666 236091 86871 297972 451794 -108311 257637 11335 60953 -107574
12108 230535 211 83346 -696 -142179 125873 6364 -171969 38788 68486 5745 -68967 -310815
12096 -310815 136635 -62190 -214112 -66869 -279629 -347291 148704 -198131 87538 142509
$$ packed form
12176B80760J3364f7594C41440a8674A28930L5037a42729J0598F8134h6123B15383
12164A83745a17203N6831H079N5360a3660k8768D5346N9449M0386D0416J4205
12153E4621K0127a1282l7672p4389B8416M7011A6678N1609d9984D92000a44078
12141B07202a16566C5485a09547p4391I7514c49434A08418J33229d29870E0722
12130c98060B1605b2040j15408j3325B83427A25018J49696a95360C02820b60k06524
12119b06784A61666P4425H6871K11101J53822a08311B57637A1335M9618a07574
12108B30535B11Q3135f96j41483A25873F364a71969C8788K9698E745f8967k41848
12096c10815A36635f2190j51922f6869k12760o7662A48704a98131H7538N4971
$$ plain form
12086 142509 11839 -78872 41289 213220 19598 39716 -338029 -160043 250107 143026
12076 143026 474484 1885940 1270089 432781 -179654 -35178 375269 -76188 149285 -213500
12065 50837 -85194 -51520 -162854 338725 -336642 278542 -6367 -211552 -20838 259791 -175305
12053 93768 62220 122885 -54400 -129932 30422 -355952 47838 269880 81321 -96378 -668140
12042 -668140 232986 -62616 -260348 5138 -41673 -271676 295542 6635 -337771 -401079 45655
12030 441804 26510 -207297 136416 10136 262608 -334362 26932 256997 157491 -73620
12019 -11773 229121 261164 59928 -117574 126162 -156463 -140129 -12235 -39086 10800 -125084
12007 175794 91257 -129463 242727 354997 108012 51293 -189382 -133877 -205791 -45225
$$ packed form
12086A42509A1839g8872D1289J71931A9598K0118c38029a60043B50107j07081
12076A43026L31458J411456o15851D32781a79654c5178C75269g6188A49285b13500
12065E0837h5194L3674j11334C38725c36642B78542f367k05185b0838B59791a75305
12053I3768l1548O0665e4400p5532C0422c55952D7838K22042H1321i6378n71762
12042f68140B32986f2616j97732E138d1673k30003B95542F635c37771o3308D5655
12030D41804B6510b07297A36416A0136K52472c34362B6932K30065r9506g3620
12019a1773B29121L2043E9928a17574A26162a56463J6334a2235k6851A0800a25084
12007A75794q4537a29463B42727J12270A08012E1293a89382N5505p1914d5225
$$ plain form
11996 84085 -201693 -2656 -76066 -257088 186420 -135433 -84659 -75571 202663 -27350 -303565
11985 -303565 -144633 -311643 342485 -15881 -71729 -192328 -126253 -111722 -129809 -226064 5620
11973 -30157 511 -67449 127266 -4540 46152 -107075 -151795 134327 63477 228552 -268861
11961 238325 217233 -186962 85826 53799 -86246 -125082 -44918 -88792 574626 26877 -249016
11949 71059 -56815 45475 146027 112022 -86517 -38609 64675 -30388 84038 16181 -77869
11937 201689 33863 271652 -54428 -122518 77914 -20165 -63281 225374 76864 264066 165378
11926 165378 20093 -103581 -112736 -38673 -77282 -174094 25599 -202602 7907 134135 -123284
11914 162847 191413 -106924 -130632 38279 -140919 -23579 -288403 90420 -13483 -63462 -103065
$$ packed form
11996H4085b01693b656p3410j81022A86420a35433N0774R088B02663b7350k76215
11985c03565a44633j67010C42485a5881n5848j20599O6075J4531j8087r6255E620
11973c0157E11f7449A27266d540D6152a07075m4720A34327F3477J65075b68861
11961B38325k1092a86962H5826l2027h6246l8836d4918m3874E74626B6877b49016
11949G1059e6815D5475J00552l4005h6517c8609F4675c0388H4038A6181g7869
11937B01689C3863K37789e4428o8090G7914b0165m3116B25374G6864J87202r8688
11926A65378B0093a03581r155c8673l8609r6812B5599b02602G907J26228a23284
11914A62847K8566a06924k3708C8279a40919b3579k64824I0420a3483m9979l9603
$$ plain form
11903 -103065 133653 229666 -119330 -48621 -54138 32553 -12934 65563 28038 84279 75232
11892 75232 -40853 201572 -95838 -80268 -113023 228971 18974 196755 164179 79439 6549
11880 163529 28748 299288 273462 54885 -223710 30173 42647 -631807 -291079 -74497 -338430
11869 -338430 62852 178878 -229021 -124874 -38134 -178841 -21192 89768 -262196 -38414
11858 -225738 -233876 -92712 -228734 54894 -224591 98196 221336 -202290 -1017 60000 -77654
11846 -51634 93788 -40559 310512 -125451 -326263 -190274 290708 7640 220453 -13236 -178083
11835 -178083 68560 197869 -164012 -305622 -102095 241069 82836 -307069 112602 -149571
11824 -272969 6624 25112 414617 -2473 -399406 60415 157219 -181966 59862 -43326 18613
$$ packed form
11903a03065A33653R6013a19330d8621n517C2553a2934F5563B8038N6241r047
11892G5232d0853B01572i5838J5570l2755B28971A8974J77781l2576G9439F549
11880A63529B8748K70540k5826E4885b23710C0173J2474f31807b91079g4497k63933
11869c38430F2852J16026b29021J04147c8134j40707b1192H9768b62196c8414
11858b25738q138i2712j36022E4894b24591I8196J23140b02290a017F0000g7654
11846e1634I3788d0559C10512a25451k00812J35989B90708G640K12813a3236j64847
11835a78083F8560J29309a64012j41610a02095B41069H2836c07069A12602a49571
11824b72969F624J8488L89505b473l96933F0415R6804a81966E9862d3326A8613
$$ plain form
11812 133299 217495 -131165 -10704 -319622 71324 5812 -111910 308443 -4117 67573 430
11800 -581918 -271495 184984 30152 214303 317737 -115074 129707 -293997 -112340 -140852
11790 -140852 -77227 -34442 -98882 80243 142536 109309 88406 -21887 247946 27699 -136271
11778 -231254 17907 163289 94811 -122567 36545 150228 108270 -522947 226035 -169361
11767 -54316 112674 -82260 -26494 -186334 -217886 -260366 -188773 326019 -81991 -93148 188986
11755 -305651 301863 -127389 -4044 -292148 250177 110641 514 -158815 -92171 -73781 -192067
11744 -192067 -104112 -316210 -190727 -96516 -71589 -177858 -257814 -230594 -145841 140870 -196478
11732 -120871 27167 60219 363386 459863 14027 -332591 170767 -162598 -69371 78353 285422
$$ packed form
11812A33299Q4196a31165a0704l08918G1324E812a11910C08443d117F7573D30
11800e81918b71495A84984C0152J84151J03434a15074A29707b93997a12340k8512
11790a40852O3625c4442o4440H0243O2293l3227k0903b1887B47946B7699a36271
11778b31254A7907J45382o8478a22567C6545J13683m1958e22947B26035a69361
11767e4316A12674h2260b6494j59840l1552m2480P1593C26019h1991j1157A88986
11755c05651C01863a27389d044k88104B50177A10641E14a58815O6644J8390j18286
11744a92067Q7955k12098J25483R4211K4927j06269p9956K7220Q4753A40870a96478
11732a20871B7167L3052L03167R6477A4027c32591A70767a62598f9371G8353K07069
$$ plain form
11721 285422 -104221 187499 63186 67250 -229469 267735 191801 -15609 397866 -80735 294895
11709 77725 -60368 -51069 -273841 -331700 -23993 -96734 -89557 185305 170917 417836 254258
11698 254258 -116485 -23025 4671 295303 -125839 -161839 98914 84169 -115475 273595 172295
11687 172295 113238 181959 347256 2577 -246750 139048 129255 -153894 -7310 -46049 197873
11675 167485 63113 -51704 355438 -17938 -5064 -111578 6330 165753 175241 -104075 -2064
11663 329423 354991 217955 154094 433476 662 -5952 -139308 34799 59472 152378 180396
11652 180396 55796 -159973 82012 -57960 -257109 -58271 -136246 491557 350423 147902
11641 55793 362128 -326956 39110 -159186 -37175 -251023 128115 81708 -96577 -177072 202206
$$ packed form
11721B85422a04221A87499F3186M064b29469B67735p5934a5609C97866h0735B94895
11709G7725f0368R299k22772n7859b3993p2741P177A85305j4388K46919j63578
11698B54258a16485b3025D671K90632a25839l6000I8914j4745a15475B73595j01300
11687A72295n9057O8721J65297B577b46750A39048r793a53894g310l8739A97873
11675A67485F3113e1704C55438a7938e064j06514F330J59423R488a04075b064
11663C29423K5568j37036o3861K79382F62e952j33356C4799K4673R2906K8018
11652A80396E5796a59973H2012e7960j99149e8271p7975D91557j41134A47902
11641E5793L06335c26956C9110a59186c7175k13848A28115m6407i6577q0495B02206
$$ plain form
11629 38225 -90953 169678 -109601 -311540 275973 142370 523949 372811 194833 131790
11619 131790 66031 -164679 -77775 -22022 26702 69454 -163937 279172 110422 278935
11609 278935 43856 461719 -105245 96776 239341 133257 -75174 65215 -85344 228684
11598 -214925 -159807 34004 127487 -67975 -203646 -185273 -45041 -53378 428716 -312748 -12775
11586 356672 274115 -672 232105 158767 110961 -34851 141041 335555 277204 33627 227681
11575 227681 -140295 511853 160602 150292 350107 253978 -266991 -131753 152163 -18574
11564 151244 -155293 210968 232009 118521 348443 128633 225481 112489 -91933 338544
11553 263415 239327 57311 -180322 36721 48783 20208 19208 -395590 157093 -132963 100553
$$ packed form
11629C8225i0953A69678a09601k01939B75973j33603L81579j51138j77978o3043
11619A31790o5759a64679g7775b2022B6702M2752a63937B79172A10422J68513
11609B78935D3856M17863a05245I6776J42565j06084g5174F5215h5344B28684
11598b14925N5118C4004R3483f7975j35671J8373d5041q337D28716c12748a2775
11586C56672q2557f72B32105p3338m7806c4851A41041J94514n8351C3627J94054
11575B27681a40295E11853A60602j0310J99815r6129b66991a31753A52163a8574
11564A51244a55293B10968K1041j13488K29922A28633R6848A12489i1933C38544
11553B63415k4088E7311a80322C6721J2062B0208j000c95590A57093a32963A00553
$$ plain form
11541 121972 101453 136132 -109514 210103 -36094 -3733 112440 305224 187726 128061 316816
11530 316816 -125772 80102 163045 169838 -67054 -349856 -94622 54335 -98913 -313786 -27286
11518 344972 213391 -17882 33294 -11015 6924 -128433 100114 -182743 387655 112070
11507 163147 96 -176748 129831 -24151 227591 35918 29169 -49918 397598 55891 -165233
11495 554653 172772 -57223 608901 380858 31214 129361 336196 428781 546915 137620
11484 12445 -179530 -145167 -48899 233915 -40021 -26076 485076 159984 205486 450210 -15692
11472 142294 187148 230870 188484 42234 243597 338451 247943 106753 167933 -120439 -27614
11460 138440 188274 228342 181441 -75104 -271702 281685 187461 -45640 -37003 21357 38052
$$ packed form
11541A21972k0519L4679a09514B10103c6094c733A12440J92784j17498n9665J88755
11530C16816a25772H0102Q2943O793f7054k82802i4622E4335i8913k14873b7286
11518C44972j31581a7882C3294a1015F924a28433A00114a82743C87655A12070
11507A63147I6a76748A29831b4151B27591C5918o749d9918C97598E5891a65233
11495E54653A72772e7223F08901k28043C1214R8147K06835R2585J18134A37620
11484A2445a79530L4363d8899B33915d0021J3945D85076A59984M5502K44724a5692
11472A42294M4854M3722m2386D2234K01363R4854r0508A06753O1180a20439b7614
11460A38440M9834M0068m6901g5104j96598B81685r4224d5640Q637B1357J6695
$$ plain form
11449 38052 345790 75948 135885 205580 326679 169705 569226 179771 271500 243613 113938
11437 -421463 187760 111518 166066 446448 13672 -241770 88612 151092 -316248 -168057
11427 -168057 -218594 -173655 -23390 -165998 -20938 108036 208483 176074 -74207 28872 204970
11416 204970 194798 -52673 115637 106046 89818 -286897 11459 359408 170473 227234 156842
11405 156842 -48011 -165635 367412 -35861 -106268 -150444 -214454 68153 -236029 38099 177255
11394 177255 104260 168456 138439 -7458 -51699 10439 -113484 192882 94095 167416 -58094
11382 120691 -108958 -4906 124 -77142 356177 3917 50339 7581 55055 -72391 -61011 99947
11369 541652 -223782 -16285 274696 33627 -217624 -128620 139370 135836 48082 175501 -39698
$$ packed form
11449C8052L07738G5948N9937O9695J21099j56974L99521A79771R1729k7887A13938
11437d21463A87760p6242N4548K80382A3672b41770H8612O2480c16248J48191
11427a68057n0537M4939b3390j42608b0938A08036J00447l2409g4207B8872J76098
11416B04970j0172e2673A15637r591j6228b86897A1459L47949A70473N6761p0392
11405A56842d8011j17624C67412c5861p0407m4176o4010F8153b36029C8099J39156
11394A77255p2995O4196l0017g458m4241A0439a13484A92882I4095P3321e8094
11382A20691a08958d906A24g7142C56177C917M6422G581M7474g2391J1380I9947
11369E41652b23782a6285B74696C3627b17624Q9004A39370l534D8082J27419c9698
$$ plain form
11357 62924 -248060 -112838 134073 -12256 -116089 141299 -6944 -129689 -62625 52799 258520
11346 258520 64947 82393 -50507 291542 -319379 -30162 452778 -223136 47475 410329
11336 410329 -250331 -256514 -47007 180979 238148 -107150 -249726 49305 -139746 -82 304178
11324 -84306 -153960 -70203 -158282 -171333 -291279 10590 84626 -117866 -45636 38530 -92328
11312 2451 57215 -37559 -136387 -42242 391286 -181367 235622 -81450 -86537 177042 -6051
11300 -79958 -129894 37228 -174601 291446 308594 243994 -188286 251887 -466163 -45344 -169783
11289 -169783 240736 -121822 169733 -8140 133179 -381798 -82554 -174986 -202355 -289370 275994
11277 54677 93454 -233437 170538 -337983 83601 -67588 -221586 -112508 67277 -119326
$$ packed form
11357F2924b48060a12838A34073a2256j03833A41299f944j22745f2625E2799K05721
11346B58520F4947J7446e0507B91542c19379c0162D52778b23136D7475L62854
11336D10329b50331o183d7007A80979N7169a07150j42576D9305a39746h2C04178
11324h4306o9654g0203q8079j3051j19946A0590P4036a17866d5636C8530i2328
11312B451N4764c7559r8828d2242C91286a81367B35622h1450n087A77042f051
11300g9958m9936C7228a74601B91446J7148o4600a88286B51887d66163d5344j24439
11289a69783B40736a21822A69733h140A33179c81798h2554r2432k7369q7015B75994
11277E4677L8777b33437A70538c37983H3601f7588j53998J09078F7277a19326
$$ plain form
11266 -255101 -97251 -181914 -24577 131661 -55538 89287 165021 251409 214718 48936 -42536
11254 -61418 82468 35864 -37303 -14201 -369431 278991 -37023 -26486 -415747 -80033 -68914
11243 -68914 -59572 -180549 -118303 5084 80732 201940 -84735 -144936 76616 -156429 -196480
11232 -196480 25606 -353427 156621 -127774 97525 -349896 -4651 179447 105804 -221634
11221 -170008 -134731 144576 -177718 -296115 -59345 -47154 154019 -49725 211258 29846
11210 -135554 88243 112399 -83538 -46318 -206135 73202 -28467 47345 83427 -78237 12042
11198 118398 -246654 -245663 -229924 236851 149556 -46984 97177 -133205 -49819 -43842 420854
11186 90120 -3768 -400361 -72939 -208113 197892 6229 -122744 233493 244193 19565 -144519
$$ packed form
11266b55101i7251q4663b4577A31661e5538H9287P5734Q6388l6691D8936d2536
11254f1418H2468C5864c7303a4201l55230B78991c7023J0537l89261h0033J1119
11243f8914R342j20977O2246E084P5648J21208h4735o0201G6616a56429m0051
11232a96480B5606c53427A56621a27774I7525c49896d651A79447p3643b21634
11221a70008L5277A44576a77718j18397e9345J2191A54019d9725B11258B9846
11210a35554H8243K4156h3538L7220j59817G3202b8467D7345L6082g8237A2042
11198A18398b46654R91J5739B36851q7295d6984I7177a33205d9819N977D20854
11186I0120c768l96593g2939j35174A97892F229a22744B33493J0700A9565a44519
$$ plain form
11174 -287557 -19220 -237677 -47549 -75362 -70189 -203024 -326544 150363 -328830 16123 -305764
11162 -182315 -9498 -132272 85870 -5526 -136030 24182 126876 -73526 4599 -215962 77117
11150 98052 55299 127418 -145890 136025 -91523 -188158 211931 -239921 16757 107180 -166110
11138 67607 -164029 90770 -122552 -125188 94861 232430 121060 278326 182971 -59961 50289
11126 382051 219043 151081 -34929 85571 -104066 63707 190200 127806 22555 345558 -92298
11114 -78194 -41859 -19038 136005 226601 22189 328190 -18126 361780 41940 246485 146461
11103 146461 261350 30289 268094 155276 52259 23930 425741 269164 -225325 529143
11092 176303 37904 580728 170076 222776 187210 185513 303623 346935 -283992 -3934 -21261
$$ packed form
11174b87557a9220k18457d7549k7813N173j32835j23520A50363c28830A6123c05764
11162a82315i498j22774H5870e526j30504B4182J02694g3526D599b15962G7117
11150I8052m2753P2119a45890A36025i1523r6635B11931b39921A6757R0423a66110
11138F7607a64029I0770a22552k636I4861J37569j11370J57266r5355e9961E0289
11126C82051j63008o7962c4929H5571a04066F3707J26493o2394B2555L23003i2298
11114g8194L6335a9038A36005R0596B2189L06001a8126C61780D1940K04545j00024
11103A46461J14889C0289K37805j12818E2259B3930M01811j56577b25325E29143
11092A76303C7904N42824A70076N2700l5566j697J18110M3312b83992c934j7327
$$ plain form
11081 -21261 163489 -73136 518770 363637 92244 762386 430210 271894 -169463 142393
11070 297298 -15392 296320 277798 413215 165403 315981 312507 189704 52431 364456
11060 364456 195286 442908 510051 395487 930793 429632 741084 603014 661559 262705
11049 580294 661938 495566 843109 585307 603308 593833 415751 331653 798575 682124
11039 682124 569199 551574 803686 574870 496776 991673 588054 546052 249999 428663
11029 428663 533352 501494 707162 605763 938863 883637 361436 688615 898191 665009
11019 665009 622958 524349 701386 930511 250222 703293 751147 577075 658918 495440
11009 495440 388206 555380 628312 477806 517039 806845 365056 414628 469117 500258
$$ packed form
11081b1261A63489g3136E18770j55133I2244O70142l32176j58316a69463A42393
11070B97298a5392B96320j8522J35417A65403J50578l474j22803E2431L12025
11060C64456j69170K47622O7143j14564N35306D29632L11452j38070N8545B62705
11049E80294Q1644j66372L47543k57802J8001r475j78082q4098M66922j16451
11039F82124j12925j7625K52112k28816p8094M94897m03619m2002B49999J78664
11029D28663J04689l1858K05668j01399L33100n5226C61436L27179K09576k33182
11019F65009m2051r8609J77037K29125B50222M53071M7854j74072Q1843j63478
11009D95440j07234J67174P2932j50506L9233K89806C65056M9572N4489L1141
$$ plain form
10999 500258 642205 692490 747838 347483 669180 795581 612902 574286 721199 801764
10989 801764 983412 500132 722583 935955 793159 960752 1103460 1248281 914736 1346174
10979 1346174 1460000 1120045 1624121 1848973 1641906 1909623 2559685 2355178 2320897 2592274
10969 2592274 2420060 2874573 2049018 1909089 1904784 1718980 1835332 1411667 1566989 1650813
10959 1650813 1514144 1637385 1627644 1765132 1641874 1557912 1406614 1313993 1074359 501003
10948 1074272 540828 477358 210277 462673 288123 355703 192322 274451 -2547 230138
10937 473942 132285 -145828 276549 100350 -142271 -58445 317577 45540 156813 8054
10926 283557 -53632 169741 162608 400658 127231 68822 59231 184658 33495 -7192 317427
$$ packed form
10999E00258J41947N0285N5348C47483L21697J26401j82679l8616J46913Q0565
10989H01764J81648m83280K22451K13372j42796J67593J42708J44821l33545M31438
10979A346174J13826l39955N04076K24852k07067K67717O50062k04507l4281K71377
10969B592274j72214M54513q25555j39929m305j85804J16352m23665J55322Q3824
10959A650813j36669J23241r741J37488j23258q3962j51298r2621k39634E01003
10948A074272n33444o3470B10277K52396j74550O7580j63381Q2129b547B30138
10937D73942A32285a45828B76549A00350a42271e8445C17577D5540J11273H054
10926B83557e3632A69741p133K38050A27231n8409r591J25427C3495g192C17427
$$ plain form
10914 -246665 93864 -110956 327481 -187163 -398576 -39 83260 21751 173872 323413 28399
10902 -93466 71330 -66989 135657 -38280 49200 239406 -57812 -373906 -34484 -488967 -177301
10890 -121230 -173653 -40940 -83201 -273767 237121 193558 -39939 -94427 248861 -15822 -63785
10879 -63785 123439 -216468 237065 165733 -42194 165720 -216503 -182448 -220283 -151731 -326584
10868 -326584 162799 -166148 -13114 101405 -208431 -13705 161514 -66906 -108100 159014
10857 30570 224748 121486 127507 167965 10521 -80384 -128984 -250115 -184563 -93315 -133383
10846 -133383 117033 110522 190223 45878 19061 -214040 21849 114737 -200 -44976 158505
10834 -188054 201040 164029 6183 -206202 -230639 -245438 50903 -204241 -311665 -60496 -16654
$$ packed form
10914b46665I3864a10956C27481a87163k11413c9H3260B1751J52121J49541B8399
10902i3466G1330f6989A35657c8280D9200J90206e7812l16094c4484m54483a77301
10890a21230n2423d0940m2261j90566B37121m3563c9939n4488B48861a5822m7963
10879f3785A23439b16468B37065p1332d2194A65720b16503L4055l7835O8552j74853
10868c26584A62799a66148a3114A01405b08431a3705A61514f6906m1194A59014
10857C0570J94178j03262O021M0458A0521h0384m8600j21131O5552R1248m0068
10846a33383A17033o511P9701D5878A9061b14040B1849R2888b00m4776A58505
10834a88054B01040l7011F183b06202k4437j4799E0903b04241j07424f0496a6654
$$ plain form
10822 16929 15108 -111359 -189826 -65792 -57867 -147631 -47472 302389 -1049 189878 -234426
10810 -85041 81155 195630 193270 262885 73432 15567 -328745 -11585 -272446 11039 -45995
10798 -145040 -118558 -240736 -105086 -34443 -25145 -86969 -377481 -11843 -120132 -53867 -92159
10787 -92159 -463526 88058 3077 -271219 -312235 -112140 266111 23316 -118743 -51224 -279404
10776 -279404 -136771 -101150 125507 112242 50654 -101556 -16975 -151467 -111302 176545
10765 27215 -219433 -63379 126368 -11717 -83911 25388 52224 158075 -436276 51570 -139502
10753 150061 -181185 -108721 378903 437289 184504 83305 117372 -74913 -73227 -139614 -77814
10742 -77814 8929 124876 -132818 -286812 -175594 -82457 161954 -227322 81771 -131429
$$ packed form
10822A6929j821a11359p8467f5792P925q9764d7472C02389a049A89878b34426
10810h5041H1155J14475k360O9615G3432A5567c28745a1585k60861A1039d5995
10798a45040K6482j22178a05086c4443R298o1824k90512a1843j08289e3867l8292
10787i2159l71367H8058C077b71219m1016a12140B66111B3316a18743e1224k28180
10776b79404a36771L5621A25507j3265E0654a01556a6975j34492M0165A76545
10765B7215b19433f3379A26368a1717p2194B5388K6836J05851d36276E1570a39502
10753A50061a81185P2464C78903N8386A84504H3305L4067g4913J686o6387O1800
10742g7814H929J15947a32818j53994J11218h2457A61954b27322H1771a31429
$$ plain form
10731 97576 -410725 153188 -218638 70066 183703 -17675 1357 -138469 6150 -330705 254078
10719 -117906 20943 113891 -253570 -158890 44149 -398095 46077 393476 -34328 -264076 -1114
10707 21269 247844 -64322 -322353 -125752 -218035 19509 347956 92548 -136363 -351929
10697 -351929 161114 -183920 -98557 272701 -279980 -94660 -155636 -191573 162448 6627 -227019
10685 92135 -295802 129857 -78306 300612 -189958 -223235 1110 -5348 143675 20010 -268054
10673 -156997 26599 -51055 -12444 -30235 96466 135712 -195845 128622 -16720 -108785 -113711
10662 -113711 -25178 50912 -334657 10449 87819 -168344 -57928 292866 -114113 -179262 -125877
10651 -125877 -4083 -164948 -14745 -24016 -105930 62732 344994 -116814 -77664 -98619 221927
$$ packed form
10731I7576d10725A53188b18638G0066J13637a7675A357a38469F150c30705B54078
10719a17906B0943R2948b53570R4680D4149c98095D6077L47399c4328k29748a114
10707B1269K26575f4322k58031a25752r2283A9509L28447I2548a36363k15566
10697c51929A61114a83920Q5363B72701b79980i4660o0976l5937A62448F627b27019
10685I2135b95802A29857g8306C00612a89958l3277A110e348A43675B0010b68054
10673a56997B6599e1055a2444j7791I6466L9246a95845A28622a6720r2065m926
10662a13711b5178E0912c34657A0449P7370a68344e7928B92866a14113o5149N3385
10651a25877d083j60865a4745r271q1914F2732K82262a16814L9150k0955B21927
$$ plain form
10639 -75316 -21993 -345793 -22584 106814 46960 -48998 -85847 -61377 241398 -405606 19606
10627 41074 -24414 77710 65103 -131206 -368098 -226619 -75484 -41925 79308 -345944 -159407
10615 -264412 -240730 -135177 -94399 -59913 -160249 -11498 133438 -219849 54154 -118151
10604 382577 112636 -136608 -40407 -99776 131889 -140214 168688 -202259 -353798 127687
10593 -173998 36828 -12837 -58565 167771 106225 176251 82660 3276 -165368 172661 -287802
10581 15315 163975 66636 -41492 -126881 145025 194501 -241445 -104388 300514 144832
10570 124156 -110142 -189165 -38119 -439820 45826 -38256 -53 36782 131433 119123 -215293
10558 122548 18719 -209550 85616 -332226 179658 -121850 -11856 -34999 -117819 -52246 56167
$$ packed form
10639g5316b1993l23800b2584A06814D6960d8998l6849K4470B41398d05606A9606
10627D1074b4414G7710j2607a31206k36892J41479g5484L3559G9308c45944a59407
10615b64412K3682J05553M0778L4486j00336a1498A33438b19849E4154a18151
10604C82577A12636a36608d0407n9369A31889a40214A68688b02259j51539A27687
10593a73998C6828a2837m5728A67771o1546P0026H2660C276a65368A72661b87802
10581A5315J48660F6636d1492q5389A45025M9476b41445a04388C00514A44832
10570A24156a10142p9023c8119m01701D5826c8256e3C6782R4651j2310b15293
10558A22548A8719b09550H5616c32226A79658a21850a1856k3143q2820e2246E6167
$$ plain form
10546 -310503 -165790 -116140 -325513 250126 44723 -105775 -206217 -161165 -240142 149362
10535 131783 -62074 -37989 -89110 -237778 -107520 -15362 -77207 -249036 -31764 134939 109472
10524 109472 -114287 -36845 -244008 66091 98542 -312167 58171 84388 -141759 -19345 40631
10512 -81504 -77636 -40850 -441449 181179 -367361 49731 36986 -185940 -59119 -257425 -179046
10501 -179046 233944 -35328 109154 57601 -28767 29583 -202588 -92337 -75858 42820 -4412
10489 180758 -67277 -15066 172116 -40534 498582 392230 44686 669739 473140 412880
10479 412880 463143 91811 247022 179470 76494 -62051 -94886 340421 -143631 -48586 93933
10467 141883 -141811 -160492 -44067 -167811 -139496 -131773 -162935 -149107 -341863 216369 -241036
$$ packed form
10546c10503J44713M9650k09373B50126D4723a05775j00442M5052p8977A49362
10535A31783f2074K4085n1121j48668a07520a5362o1845j71829c1764A34939k5467
10524A09472a14287c6845k07163F6091L2451c12167E8171K6217a41759a9345D0631
10512h1504L868L6786m00599A81179c67361D9731j2745a85940e9119j98306P8379
10501a79046B33944c5328A09154n1553b8767B9583b02588i2337J6479D2820d412
10489A80758f7277a5066A72116d0534D98582j06352D4686O25053j96599o0260
10479D12880N0263I1811J55211o7552G6494f2051l2835C40421a43631d8586I3933
10467A41883a41811j8681d4067j23744K8315P723l1162J3828j92756B16369b41036
$$ plain form
10455 95597 -86561 -70672 -45538 -169945 93929 4988 -74979 -2722 -410631 -26315 94314 -325370
10442 155796 -127426 -121200 27451 38562 -136059 78703 77556 124626 107667 84183 220443
10431 220443 305702 -159940 14920 -111321 130454 189299 52393 -77628 214646 234319 -203961
10419 -49709 -188859 46261 134465 -54750 70900 300598 3157 55460 90481 -483101 257171
10407 177565 84092 274517 31523 -89850 171586 -64862 433975 -194267 183094 70835
10396 126999 47786 -17638 273700 311329 110049 296711 181524 217019 120410 389044
10386 389044 101227 -36192 -233779 92673 319344 289467 370088 172146 -59790 348017
10375 -161160 498922 197209 -6345 -198077 391242 239531 128307 225562 440113 446195
$$ packed form
10455I5597h6561J5889K5134j24407I3929D988g4979b722m07909b6315I4314c25370
10442A55796a27426O226B7451J1111a36059G8703j147M7070j6959k3484J36260
10431B20443Q5259a59940A4920a11321A30454N8845E2393g7628B14646J9673b03961
10419d9709j39150D6261Q8204e4750G0900K29698C157N2303L5021d83101B57171
10407A77565H4092J90425C1523h9850A71586f4862D33975a94267A83094G0835
10396A26999D7786a7638B73700L7629A10049J86662j15187L5495r6609K68634
10386C89044A01227c6192j97587I2673K26671k9877Q0621A72146e9790C48017
10375a61160D98922A97209f345j91732C91242j51711j11224R7255K14551O082
$$ plain form
10365 446195 84332 94563 321003 290765 290056 202225 290168 316082 -69410 308239 75556
10353 303020 12598 48442 442945 407983 559781 322108 419473 119327 363476 -17459
10342 569599 393160 622448 399728 226437 577662 121591 -12755 195755 436671 229065
10332 229065 60354 242373 156437 -7661 -81490 -24275 95737 -106715 17711 106688 156566
10321 156566 70799 50988 38016 -104097 -30152 -19615 -166227 262051 98983 118749 -217597
10309 230836 85281 -26570 -63441 -302966 -239777 254179 -72083 185433 -52665 -120746 -72021
10298 -72021 -18962 -203494 -139256 107796 234904 -8631 205385 -125401 19927 -195375 -124327
10287 -124327 -1565 -99876 -5430 -151793 -85652 21956 -12514 -198057 142600 -272779 219411
$$ packed form
10365D46195H4332J0231K26440l0238p09q7831Q7943K5914f9410C08239G5556
10353C03020A2598L5844L94503l4962J51798k37673R7365A19327K44149a7459
10342E69599j76439K29288k22720j73291L51225A21591a2755A95755K40916k07606
10332B29065F0354J82019q5936g661p3829b4275I5737a06715A7711Q8977M9878
10321A56566G0799j9811j2972a04097c0152J0537j46612B62051I8983J9766b17597
10309B30836H5281b6570l6871k39525O3189B54179g2083A85433e2665o8081M8725
10298g2021a8962j84532O4238A07796J27108h631B05385a25401A9927a95375P1048
10287a24327a565r8311e430j46363O6141B1956a2514j85543A42600b72779B19411
$$ plain form
10275 -222705 -75476 78068 -43968 156780 -29742 -114991 -209475 72900 6522 232418 -154088
10263 111072 -171501 165707 -12149 158590 429230 321712 120368 134171 254114 108147
10252 -172271 266940 -27637 -34303 -121854 100696 -33103 -163492 -148867 -27848 -160027 -68876
10240 -95946 229631 349346 -221093 -188732 -406540 -308205 -70808 -6140 145687 -220257 62689
10228 -26929 -360760 -57576 21374 -98256 134303 -141496 -287230 76400 -52123 100061 -179141
10216 -426890 144623 -6931 -91362 87382 57317 53446 -156484 102982 193027 145601 -573095
10204 -514 260846 -88082 398797 183629 -322420 -8956 175683 -94463 88984 -163405 -194358
10193 -194358 -164980 131875 -222301 117714 104699 -162569 95174 -210662 -15659 89783
$$ packed form
10275b22705g5476G8068d3968A56780b9742q5249r4484G2900F522K25896a54088
10263A11072a71501A65707a2149A58590K70640j07518A20368J3803J19943A08147
10252a72271B66940b7637o666q7551A00696c3103j30389J4625b7848j32179f8876
10240i5946B29631J19715b21093L2361k17808R8335g0808f140A45687b20257F2689
10228b6929l33831e7576B1374i8256A34303a41496j45734G6400e2123A00061a79141
10216d26890A44623f931q4431H7382l0065l871a56484A02982R0045m7426e73095
10204e14B60846h8082C98797A83629c22420h956A75683i4463H8984a63405l0953
10193a94358K9378A31875b22301A17714j3015a62569I5174b10662a5659H9783
$$ plain form
10182 218499 -79206 106710 286560 -133434 -174174 -125343 -181402 70229 -110239 -243743
10172 -243743 -219450 73591 -119717 -357838 -250334 -483025 -110230 120157 -158610 -64443
10161 41715 117739 34524 -114107 -342792 -6000 -207453 353257 -26075 234989 189006 -153170
10149 -80037 295708 -103481 -212830 -297630 -110322 177410 -84957 -182045 213820 -267344
10138 -65491 -54143 -142853 146839 -137794 138192 -182874 -176348 59774 -192501 -320716 -82990
10126 -236764 -86434 -76764 -187538 72720 48543 -93008 16463 68668 103907 32316 -341412
10114 377627 -26951 -167521 118785 -98427 -323421 -73227 273229 28418 -188585 -154456
10104 -154456 64607 -114679 -200602 193742 -48473 -73936 -111216 61314 -373234 186385 -53921
$$ packed form
10182B18499g9206A06710J79850a33434m0740M8831n6059G0229a10239j33504
10172b43743K4293G3591a19717k38121J07504k32691a10230A20157a58610f4443
10161D1715P6024C4524a14107k28685f000k01453C53257b6075B34989m5983a53170
10149h0037B95708a03481j09349q4800a10322A77410h4957r7088B13820b67344
10138f5491J1348q8710A46839a37794A38192a82874O526E9774a92501j28215h2990
10126b36764h6434R670j10774G2720k4177i3008A6463N2205L5239C2316c41412
10114C77627b6951j40570A18785i8427k24994g3227B73229B8418a88585L4129
10104a54456F4607a14679q5923A93742d8473k5463l7280F1314c73234A86385e3921
$$ plain form
10092 -10156 -57329 -156038 -155003 18635 171165 -172581 -3265 -185269 -27029 58793 295544
10081 295544 51819 -322648 141327 115987 -216257 -245929 134082 -258537 -210746 -94948
10070 59456 49822 -80034 -270948 266636 13081 65942 35801 -288842 -177201 -102693 26193
10058 100571 110367 123396 7756 -156360 172157 144368 -149375 90537 6766 -205837 -192267
10047 -192267 31714 -556 -409439 -126192 46370 23886 155595 -43407 -228927 -265159 -60450
10035 -50133 52820 -376233 101542 9376 -10689 99005 51609 -101973 129265 -98940 -137313
10024 -137313 -476274 -459945 -150299 -88498 -249243 -66090 -66869 -78378 -13981 52716 17427
10012 140509 107973 281644 -80835 -56777 -32307 184390 87345 342280 131676 91432 -4287
$$ packed form
10092a0156m7173r8709J035A8635J52530a72581c265j82004b7029E8793K36751
10081B95544E1819c22648A41327k5340b16257k9672A34082b58537M7791i4948
10070E9456r634h0034j90914B66636A3081N2861l0141b88842J11641P4508B6193
10058A00571R796J3029G756a56360A72157k7789a49375I0537F766b05837J3570
10047a92267C1714e56m08883a26192D6370k2484J31709d3407j85520l6232f0450
10035e0133E2820c76233A01542I376a0689I9005m7396a01973A29265i8940l8373
10024a37313l38961J6329a50299O1801j60745f6090p79j1509a3981E2716A7427
10012A40509l2536J73671h0835K4058K4470A84390H7345K54935A31676m0244d287
$$ plain form
10000 119290 -141804 -73463 -64791 -254593 -48609 63876 -168540 69050 -67677 113417 -66436
9988 -319610 -212115 -424627 -252803 -123894 -573711 -83015 -334626 -462126 -292084 -10092
9977 34759 1787 96942 130264 80789 -181606 -663315 -11802 -444458 -343876 -238227 197651
9965 201869 92333 -197915 -121972 169016 -166159 9620 -47056 8042 81302 -43143 2232 -272175
9952 85657 -272461 196293 -206352 -434147 -186926 -53156 2932 -274360 247041 -2256 404367
9940 -79917 -274087 -271978 -28119 36530 60404 -160044 -159344 251065 -256341 35368 -92060 -227604
9928 -227604 -78904 12497 168586 -350670 -259150 -122145 198338 73045 -204067 -206711 197801
9916 -209973 -178597 -310512 164368 -85322 -87355 -166964 -168184 -52020 168437 74664 -227752
$$ packed form
10000A19290a41804O8341Q672j89802d8609F3876a68540F9050f7677A13417f6436
9988c19610J07495k12512J71824a23894m49817h3015k51611j27500J70042a0092
9977C4759A787R5155L3322m9475a81606m81709a1802m32656J00582J05649A97651
9965B01869I2333a97915P5943A69016a66159I620d7056H042P3260d3143B232b72175
9952H5657b72461A96293b06352k27795a86926e3156B932b74360B47041b256D04367
9940g9917j94170K109b8119C6530K3874a60044P00B51065b56341C5368i2060j35544
9928b27604g8904A2497J56089c50670R1520a22145A98338G3045b04067k644A97801
9916b09973L1376j31915A64368h5322k033p9609j220e2020A68437G4664b27752
$$ plain form
9904 -233609 -306394 156921 168451 168121 123400 -85113 -118717 -178028 117650 59706 -129507
9892 278129 82941 -274185 116253 7835 173297 -210114 -2783 -192889 -213729 116996 43218
9880 12697 -221149 -339703 -315367 50833 -56769 3774 60560 170998 -221590 -112884 -338829
9869 -338829 -80129 -15797 -68890 3776 146889 -195401 -29176 50676 -39253 -69388 -21084
9857 -78541 -228442 297423 -139695 -38730 -183070 -124396 62027 46217 -118350 -87000 -273532
9846 -273532 -97582 -11975 -89416 24625 -116271 -73952 61936 -312816 -327279 -132737 -52040
9834 5614 -175243 50472 -255212 -113938 17149 -67115 -346919 -31973 -163639 -40729 -100474
9823 -100474 22734 -12060 -252985 -182479 -33929 190286 -291701 189109 20315 -197755 -242775
$$ packed form
9904b33609p2785A56921J1530l30m4721h5113l3604n9311A17650n7944a29507
9892B78129H2941b74185A16253G835J65462b10114b783j90106k0840A16996D3218
9880A2697b21149j18554K4336E0833e6769C774N6786J10438b21590J08706k25945
9869c38829h0129a5797n3093C776J43113a95401b9176E0676c9253l0135b1084
9857g8541j49901B97423a39695c8730j44340N8674F2027j5810a18350L1350j86532
9846b73532i7582a1975p7441B4625a16271M2319F1936c12816j4463a32737e2040
9834E614a75243E0472b55212a13938A7149f7115k79804c1973j31666d0729n9745
9823a00474B2734a2060k40925P0506c3929A90286b91701A89109B0315a97755m5020
$$ plain form
9812 -242775 525386 159064 -360201 232122 47730 160830 257838 106402 40345 -169349
9801 -130162 46608 -48434 -120026 -265457 -139204 -123741 168252 22229 -293666 55223 -134107
9789 -260970 -115935 -114923 -62325 169234 10952 -91769 -167402 -184130 43583 214304 4612
9777 45748 -324293 171927 -106615 -144448 -234548 212727 190154 -334539 49933 266376 -306890
9765 -182793 117872 -105035 -2957 -155223 115983 9196 -95695 -6619 -4861 46781 -64227 240289
9752 59976 38357 -198469 -45845 -319156 -3041 -140409 79762 -149804 -134305 -62064 41939
9740 222569 -265500 -141540 128386 -69846 -275092 138391 173336 64506 -247313 79518
9729 54232 -221844 -119443 221465 15974 -174924 -72205 -354638 -119995 -68867 -184494
$$ packed form
9812b42775E25386A59064c60201B32122D7730J13100R7008A06402D0345a69349
9801a30162D6608d8434p1592j45431J26253J5463A68252B2229b93666E5223a34107
9789b60970a15935J012N2598A69234A0952i1769p5633j6728D3583J70721D612
9777D5748c24293A71927a06615l7833r0100B12727k2573c34539D9933K16443c06890
9765a82793A17872a05035b957j52266A15983I196i5695f619J758D6781f4227B40289
9752E9976k1619a98469d5845k73311c041j37368G9762a49804J5499f2064D1939
9740B22569b65500J23960A28386f9846k05246A38391L4945F4506b47313G9518
9729E4232b21844J02401B21465A5974a74924g2205k82433a19995N1128j15627
$$ plain form
9719 -184494 221574 149311 -259196 128848 -23327 -113515 81294 354950 -145060 -92271 91365
9707 80289 6496 -280601 87106 -17569 -90486 -420280 -140155 -316320 -219003 100192 -261800
9695 88925 -141942 113625 -28934 -263637 54291 -159171 -355019 -33462 79083 -37898 -482595
9684 -482595 -21236 -431716 185879 -217193 -511207 -551753 113096 -271195 -437122 -220588
9674 -220588 -44079 120640 -67375 199130 -218812 -6133 -138279 445111 1581 90021 112731
9663 112731 -2803 12808 -550669 142038 -141076 -42777 52746 -221535 -98073 -117412 -104208
9652 -104208 -64008 -76376 133828 -156407 380546 -347343 -94041 -190622 -397924 -231411
9642 -231411 6748 49555 -136721 -306899 356858 81061 258760 -264074 -195692 -352504 -194162
$$ packed form
9719a84494B21574p2263b59196A28848b3327r0188H1294K73656a45060N2789I1365
9707H0289F496b80601H7106a7569p2917l29794a40155j76165R7317A00192b61800
9695H8925a41942A13625b8934k34703E4291a59171j95848c3462G9083c7898m44697
9684d82595b1236m10480A85879b17193k94014m0546A13096b71195j65927K16534
9674b20588d4079A20640f7375A99130b18812f133j32146D45111A581Q8440K2710
9663A12731b803A2808e50669A42038a41076d2777E2746b21535i8073j9339J3204
9652a04208M0200j2368A33828a56407C80546c47343i4041r6581k07302J66513
9642b31411F748M2807a36721j70178C56858H1061J77699b64074O8382j56812J58342
$$ plain form
9631 -194162 106786 74520 31405 -14382 -304971 86080 94066 -61099 -10074 -96848 -13997
9619 21879 -45690 -200327 -10669 -413313 -275987 318629 -85194 -272709 -230181 -28384 -90376
9608 -90376 33456 -390949 10438 -54581 -68236 -40587 -165205 -196878 -278477 104253 -85800
9596 -244056 -146239 -109937 -253000 -209125 -252180 -73990 -11489 43229 -48119 -135386 -296526
9585 -296526 55524 81287 217580 -9306 -509562 -183483 -95302 -150137 -241617 -383780 -2938
9573 152882 77432 673630 11090 -79474 143404 87719 -316810 22976 -280343 -42932 -275133
9562 -275133 -13540 148443 -31419 317181 -236755 -51480 226053 -183081 -38086 -38324 104162
9550 -345546 57842 -243080 -58292 7536 142338 -100090 168275 84141 -465091 -76369 64032
$$ packed form
9631a94162A06786l2266C1405a4382k90589H6080P986f1099a0074q6774a3997
9619B1879d5690j54637a0669m02644J37326C18629h5194j87515M2528b8384o1992
9608i0376C3456c90949A0438e4581j3655K7649j24618l1673q1599A04253h5800
9596b44056R7817L6302j43063M3875m3055g3990a1489D3229d8119q7267j61140
9585b96526E5524K5763J36293i306n00256a83483Q8181n4835r1480j42163b938
9573A52882p5450N96198A1090g9474A43404n5685c16810B2976b80343d2932k32201
9562b75133a3540A48443c1419C17181b36755e1480B26053a83081c8086k38A04162
9550c45546E7842b43080e8292G536J34802a00090A68275q4134d65091g6369F4032
$$ plain form
9538 -177869 -257874 -194886 -234274 -425402 -50810 -66320 77249 215021 141110 -247137 -414252
9527 -414252 -5157 206521 -21108 -110521 117450 75591 13590 270298 -65793 99470 156907
9516 156907 -53580 273934 -258980 -209465 74475 -110299 53234 -253740 40647 89309 -208287
9504 140833 104073 -337573 -25982 362668 -323191 -365583 283814 -65635 11253 19706 -394522
9492 19831 -213914 249881 71853 -62277 37768 -50088 68495 11387 -21532 -150782 -426114
9481 -426114 -127938 -130068 -224912 -22263 239186 -230079 -96057 -50712 -86647 -45667 -234132
9470 -234132 40371 -168090 -265013 295398 111554 -204534 -301334 145727 57138 -5144 -78877
9459 -78877 188877 -94184 -242875 -441050 -144014 -181296 93160 144023 -270253 -41329 -161981
$$ packed form
9538a77869q0005O2988l9388j91128e0810j5510G7249J37772p3911b47137j67115
9527d14252e157B06521b1108q9413A17450m1859A3590K56708f5793I9470N7437
9516A56907e3580B73934b58980M9515G4475a10299E3234b53740D0647M8662b08287
9504A40833l6760c37573b5982C62668c23191m2392B83814f5635A1253Q453c94522
9492A9831b13914B49881G1853f2277C7768e0088F8495A1387b1532j29250k75332
9481d26114a27938k130r4844b2263B39186b30079i6057M5345l5935M0980j88465
9470b34132D0371a68090r6923B95398A11554b04534r6800A45727E7138e144p3733
9459g8877A88877i4184j48691j98175a44014l7282I3160N0863b70253d1329j20652
$$ plain form
9448 -161981 25980 170518 -53116 -359395 -98542 -119636 -147361 3972 -166680 63875 415161
9437 415161 -170775 -111515 396349 261950 37363 109250 -10443 -186341 -375986 331928
9426 -278979 -210271 -203342 130293 -125650 -453557 -190650 82084 -143151 81125 -302445 -167502
9415 -167502 -221277 34485 -83344 -87374 -137330 187224 -407957 54543 -162782 -304094 -72857
9403 -190358 -26826 -93497 -70045 -107983 201238 -333649 -175963 184933 112967 164496 -16395
9391 13182 -54441 -161694 46624 -85753 -1441 6121 -296350 137493 236846 -263461 145017
9379 73426 462929 337610 -358208 122201 -133909 -98704 95119 -87503 -45416 -311106 -61358
9367 249383 -284950 -82705 -60474 -495561 -176387 -250156 -170143 -79016 -16207 -221456 -14585
$$ packed form
9448a61981B5980J44538e3116l06279i8542k1094k7725C972a66680F3875L51286
9437D15161a70775N9260C96349j34399C7363P1887a0443j75898j89645C31928
9426b78979O8708O929A30293a25650l27907a90650H2084a43151H1125c02445J34943
9415a67502n3775C4485h3344m030m9956A87224d07957E4543a62782j41312g2857
9403a90358b6826o6671K3452l7938B01238c33649J57686A84933p1966N1529a6395
9391A3182e4441j07253D6624h5753a441F121b96350A37493R9353b63461A45017
9379G3426L89503j25319c58208A22201a33909L5205I5119h7503M2087k65690f1358
9367B49383b84950h2705K2231m35087a76387p3769Q0013g9016a6207k05249a4585
$$ plain form
9355 -47347 -104166 99517 -136899 124067 56909 -116562 -110121 -58659 163625 -56210 -170430
9344 -170430 -108930 160886 135086 36676 -22851 -41729 -75581 317693 370765 -66514 8064
9332 -219740 44696 -69955 -112615 -49927 -122643 228432 -60978 -138024 -67054 -11725 -99856
9321 -99856 -262443 -184522 -432453 98873 -137734 -55368 -9320 -144151 -170878 -187666 -288920
9310 -288920 -53786 -51864 -75091 -421007 -61659 82633 -70221 -498624 21916 -230845 -37594
9298 194899 308686 -114950 -146498 -241869 -102550 -223780 -148924 347828 49697 -239887
9287 152553 269158 -125997 -286766 -133699 133971 -176223 -179600 180391 -29638 -211233
9277 -211233 -229143 -173991 216033 239732 38022 50836 -220127 -61336 184334 209386 -149763
$$ packed form
9355d7347n6819I9517a36899A24067E6909a16562O441N1462A63625e6210j14220
9344a70430O1500A60886k5800C6676b2851j8878l3852C17693N3072f6514H064
9332b19740D4696f9955m2660d9927p2716B28432f0978p7046f7054a1725q8131
9321i9856j62587P7921k47931I8873a37734e5368i320j34831k6727j6788j01254
9310b88920e3786J922k3227l45916f1659H2633g0221m28403B1916b30845c7594
9298A94899J13787a14950l1548r5371a02550j21230P4856C47828D9697b39887
9287A52553J16605a25997j60769a33699A33971a76223l377A80391b9638j81595
9277b11233j7910N5152B16033K3699C8022J2814b20127f1336A84334K5052a49763
$$ plain form
9265 -200515 191079 -35529 71793 198934 -62496 -96990 -230774 177551 -395791 -135712
9254 33836 309364 -12090 -114136 19756 18431 -201135 -86932 -105055 -28167 -143486 76673
9242 -108201 15036 -279620 163832 75335 -16548 103421 -324362 -40466 297437 142436
9231 -273526 8202 327050 -73220 -245339 -278301 -64855 -14720 -87691 -67818 247472 -134209
9219 -6943 68227 -94265 -64644 256940 -178931 -213169 -1755 -111865 118896 -146181 -205101
9208 -205101 198038 310029 4377 -287726 73476 189289 -88566 -318449 21951 -160324 -311258
9197 -311258 -217246 -120603 -113677 -137582 389531 155073 40582 145844 89357 347264 -25050
9185 289027 420743 -85745 -171182 -274494 358080 -223263 -331225 179012 -48396 -264109
$$ packed form
9265b00515A91079c5529G1793J27141f2496l4494j33784A77551c95791a35712
9254C3836K75528a2090j02046A9756j325b01135h6932j8123b8167j15319G6673
9242a08201A5036b79620A63832G5335a6548A03421c24362d0466B97437A42436
9231b73526H202L18848g3220j72119l2962f4855a4720p2971J9873B47472a34209
9219f943F8227i4265K9621B56940a78931l4238a755j10110A18896a46181n8920
9208b05101A98038J11991D377b87726G3476J15813h8566k29883B1951a60324j50934
9197c11258R4012R6643O926k3905C89531A55073D0582J05262n6487K57907b5050
9185B89027J31716h5745q5437j03312C58080b23263j07962A79012d8396k15713
$$ plain form
9175 -264109 -139209 -160628 -67579 5549 -153338 21048 -169207 -552836 -78926 -273783 -6471
9163 -11533 53488 -118194 -40827 114989 12650 308902 79254 -4931 143943 -230580 51911
9151 386497 -226013 -233730 -177815 -349798 175625 -140269 -109250 14752 74917 -108457 -104505
9140 -104505 -82539 -323706 -19044 -355467 -177843 132819 -1275 -205401 157335 23496 18701
9129 18701 -120093 114923 -81031 143184 -211219 102704 -128523 89643 -13882 -251010
9119 -251010 -313304 35094 205475 47027 -338546 -263864 6255 93314 -235117 -84264 106677
9107 103085 -194492 -332268 -3326 -375573 -45039 -25277 205771 352373 -7218 -14348 -86773
9096 -86773 -88934 -210259 -114821 -86172 -83447 116695 289498 -83126 -166506 84644 -121373
$$ packed form
9175b64109J24900k1419f7579E549a53338B1048a69207l83629g8926j94857f471
9163a1533E3488a18194d0827A14989A2650K96252G9254d931A43943b30580E1911
9151C86497b26013p717N5915j71983A75625a40269L1019A4752O0165a08457L952
9140a04505K1966k41167a9044l36423J77624A32819a275k04126A57335B3496m795
9129A8701a20093A14923h1031A43184b11219A02704a28523H9643a3882k37128
9119b51010o2294C5094J70381D7027c38546P4682F255Q7059b35117h4264A06677
9107A03085a94492j37776c326l72247d5039J9762B05771J46602g218p130p2425
9096h6773k161j21325R5438K8649K725A16695J72803h3126q3380H4644a21373
$$ plain form
9084 -41803 71849 -146014 -156511 138250 9530 -135039 -168232 57702 -167004 357445 -230301
9072 -72299 34489 55978 -222794 117434 -99413 69702 -69258 40419 39166 -192921 201096
9060 -325788 -121885 -168052 229040 256013 160329 -300065 301053 -454 -331503 -152287 -246747
9049 -246747 -22299 -58700 -84998 -330939 -99920 -31676 -61772 -296153 -20323 -126 172107
9037 -194229 -128160 53442 214286 -184234 190189 98589 -297603 -63597 -10574 -115998 57341
9025 -166239 -335429 -303232 -70179 -97499 123313 -255158 -54945 -243473 58306 -194139 52227
9013 52765 -151065 152923 27021 39441 238551 -142891 -118863 38535 92188 63164 -16771
9001 -124072 -27136 191781 22010 222111 106971 -78252 379496 -203135 -173759 -123729 81282
$$ packed form
9084d1803G1849a46014j0497A38250I530a35039l3193E7702a67004C57445b30301
9072g2299C4489K1489b22794A17434i9413F9702f9258D0419j253a92921B01096
9060c25788a21885m6167B29040K6973r5684c00065C01053d54l31049a52287r4460
9049b46747b2299l6401k6298k45941i9920c1676l0096k34381b0323a26A72107
9037a94229O6069E3442J60844a84234A90189r1600b97603f3597a0574j05424E7341
9025a66239j69190L2197g0179k7320A23313b55158e4945j88528E8306a94139E2227
9013E2765a51065A52923B7021J2420J99110a42891K4028C8535N3653k9024a6771
9001a24072b7136A91781B2010K00101A06971g8252C79496b03135K9376N0030H1282
$$ plain form
8989 -177749 -479208 -127576 -117724 299678 -24040 96238 149879 -334769 -501700 165059 -55816
8977 147435 215482 -6875 -37301 -125795 51139 -203130 97459 259891 -266639 -54449 -216982
8966 -216982 -44691 351620 -321466 -18082 -214937 -558082 -109941 -359997 17228 26222 76547
8955 76547 -95758 -301918 194883 66479 -146160 207009 15944 -98615 -144662 -7788 -60295
8944 -60295 93471 -263903 -442380 -307150 -16338 -410354 114978 2525 -20707 422627 488832
8933 488832 -87718 337073 -101541 64822 -41672 -148284 261733 308879 636214 760981
8923 760981 2358798 10188732 20692031 5321017 1599357 805975 308609 467241 401862
8914 401862 39269 -53207 -108313 295619 -127306 83054 606751 157256 -185784 153581
$$ packed form
8989a77749l01459a27576R852B99678b4040I6238N3641c34769j66931A65059e5816
8977A47435O8047f875l0426q8494E1139b03130I7459J62432b66639e4449j62533
8966b16982d4691C51620c21466a8082j96855l43145a09941k50056A7228Q994N0325
8955G6547i5758k06160A94883F6479a46160B07009A5944i8615m6047g788n2507
8944f0295I3471b63903j78477J35230a6338l94016A14978B525b0707D22627O6205
8933D88832h7718C37073a01541F4822d1672j06612B61733M7146L27335J24767
8923G60981J597817P829934J0503299E321017A599357p93382C08609J58632o5379
8914D01862C9269e3207n5106B95619a27306H3054N23697A57256a85784A53581
$$ plain form
8903 -175630 -303705 -70681 -94373 -340583 33048 -200683 244373 -342000 10189 -320799
8892 131926 -54245 255219 67633 -83454 -213078 94033 -357819 13715 -309780 -287861 -168006
8881 -168006 -314831 -25074 -150139 -404323 -53218 -259892 147240 -9272 33638 -3213 -261418
8870 -261418 60781 120370 317932 -53990 -149279 -104489 -280673 -741 -206286 -235676 171603
8858 -268230 -115538 -169044 54173 -141715 102706 31665 -285322 366393 -114501 110542
8847 -87725 -16648 -46829 157687 -456307 127708 54445 94546 -289036 -52756 -110760 -135733
$$ packed form
8903a75630j28075g0681k3692k46210C3048b00683B44373c42000A0189c20799
8892A31926e4245B55219F7633h3454j29624I4033c57819A3715c09780K1919J19855
8881a68006j46825b5074j25065k54184e3218k06674A47240i272C3638c213k58205
8870b61418F0781N9589J97562e3990r5289M4790j76184g41k05545k9390A71603
8858b68230a15538n3506E4173a41715A02706C1665b85322C66393a14501A10542
8847h7725a6648l0181A57687d56307A27708E4445M0101b89036e2756n8004k4973
$$ [...]
##END NTUPLES=NMR SPECTRUM
##END=
