
##TITLE=UV1214_M5_1296-1170_5_7229414_toPqwDcDj9
##JCAMPDX= 6.0         $$ Bruker NMR JCAMP-DX V2.0
##DATA TYPE= NMR SPECTRUM
##DATA CLASS= NTUPLES
##ORIGIN= BRUKER
##OWNER= Administrator
$$ 1.72 TOPSPIN		Version 2.1
$$ 2013-01-23 21:42:35.209 -0500  Administrator@X
$$ Compression mode = diff/dup
##.OBSERVE FREQUENCY= 400.02188249412
##.OBSERVE NUCLEUS= ^1H
##.ACQUISITION MODE= SIMULTANEOUS (DQD)
##.ACQUISITION SCHEME= undefined
##.AVERAGES= 64
##.DIGITISER RES= 22
##SPECTROMETER/DATA SYSTEM= spect
##.PULSE SEQUENCE= noesygpps1d.comp
##.SOLVENT NAME= COFFEE_meoh
##.SHIFT REFERENCE= INTERNAL, COFFEE_meoh, 1, 14.96103
##AUDIT TRAIL= $$ (NUMBER, WHEN, WHO, WHERE, PROCESS, VERSION, WHAT)
$$ ##TITLE= Audit trail, TOPSPIN		Version 2.1
$$ ##JCAMPDX= 5.01
$$ ##ORIGIN= Bruker BioSpin GmbH
$$ ##OWNER= Administrator
$$ $$ E:\/data/COFFEE/nmr/UV1214_M5_1296-1170_5_7229414_toPqwDcDj9/32/pdata/1/auditp.txt
$$ ##AUDIT TRAIL=  $$ (NUMBER, WHEN, WHO, WHERE, PROCESS, VERSION, WHAT)
(   1,<2013-01-23 21:42:29.427 -0500>,<Administrator>,<X>,<go>,<TOPSPIN 2.1>,
      <created by zg
	started at 2013-01-23 21:30:59.099 -0500,
	POWCHK enabled, PULCHK disabled,
       configuration hash MD5:
       86 BA 57 50 F2 9D 5C 9B 26 00 A9 28 5F 66 2E 89
       data hash MD5: 64K
       B1 0B 71 B1 04 EE 62 D2 36 AF 36 74 12 28 5B 43>)
(   2,<2013-01-23 21:42:32.490 -0500>,<Administrator>,<X>,<proc1d>,<TOPSPIN 2.1>,
      <Start of raw data processing
       efp LB = 0.3 FT_mod = 6 PKNL = 1 PHC0 = 0 PHC1 = 0 SI = 128K 
       data hash MD5: 128K
       90 9E 71 64 FF 8F 29 91 D4 95 24 43 0F C2 76 6D>)
(   3,<2013-01-23 21:42:33.521 -0500>,<Administrator>,<X>,<proc1d>,<TOPSPIN 2.1>,
      <pk PHC0 = -76.23413 PHC1 = 0 
       data hash MD5: 128K
       E1 FD 14 60 3B 7E 45 16 92 50 37 05 46 10 55 5E>)
(   4,<2013-01-23 21:42:34.209 -0500>,<Administrator>,<X>,<proc1d>,<TOPSPIN 2.1>,
      <abs ABSG = 1 
       data hash MD5: 128K
       3C FF A0 DB 5C D0 3A 2D 15 6D B9 FD 77 FF D3 D6>)
(   5,<2013-01-23 21:42:34.381 -0500>,<Administrator>,<X>,<proc1d>,<TOPSPIN 2.1>,
      <abs ABSG = 2 
       data hash MD5: 128K
       4D 81 EF 3F 3A AC 0E BD A1 27 8C 68 4A D3 F4 43>)
(   6,<2013-01-23 21:42:34.568 -0500>,<Administrator>,<X>,<proc1d>,<TOPSPIN 2.1>,
      <abs ABSG = 3 
       data hash MD5: 128K
       D6 C8 BE BF 75 46 E1 66 3A 13 20 00 E9 3E 29 A4>)
(   7,<2013-01-23 21:42:34.740 -0500>,<Administrator>,<X>,<proc1d>,<TOPSPIN 2.1>,
      <abs ABSG = 4 
       data hash MD5: 128K
       E5 7D D2 0E 16 2E E3 5E 78 FB C1 29 BD 4A 96 6B>)
(   8,<2013-01-23 21:42:34.927 -0500>,<Administrator>,<X>,<proc1d>,<TOPSPIN 2.1>,
      <abs ABSG = 5 
       data hash MD5: 128K
       5F 27 C8 63 A4 C6 B1 26 E7 9F C0 62 89 DD 55 DF>)
$$ ##END=
$$ 
$$ $$ hash MD5
$$ $$ 26 3D DD CE F4 0C B4 D0 D0 97 C5 B0 80 57 CE 1F
##$RELAX= 
##$RELAX= 
##$RELAX= 
##$RELAX= 
##$RELAX= 
##$RELAX= 
##$RELAX= 
##$RELAX= 
$$ Bruker specific parameters
$$ --------------------------
##$DU= <E:\>
##$EXPNO= 32
$$ [...]
150 150 150 150 150 150 150 150
##$TP07= 0
##$TPNAME0= <>
##$TPNAME1= <>
##$TPNAME2= <>
##$TPNAME3= <>
##$TPNAME4= <>
##$TPNAME5= <>
##$TPNAME6= <>
##$TPNAME7= <>
##$TPOAL= (0..7)
0.5 0.5 0.5 0.5 0.5 0.5 0.5 0.5
##$TPOFFS= (0..7)
0 0 0 0 0 0 0 0
##$TUNHIN= 0
##$TUNHOUT= 0
##$TUNXOUT= 0
##$USERA1= <user>
##$USERA2= <user>
##$USERA3= <user>
##$USERA4= <user>
##$USERA5= <user>
##$V9= 5
##$VALIST= <valist>
##$VCLIST= <CCCCCCCCCCCCCCC>
##$VD= 0
##$VDLIST= <DDDDDDDDDDDDDDD>
##$VPLIST= <PPPPPPPPPPPPPPP>
##$VTLIST= <TTTTTTTTTTTTTTT>
##$WBST= 1024
##$WBSW= 4
##$XGAIN= (0..3)
0 0 0 0
##$XL= 0
##$YL= 0
##$YMAX_a= 6149856
##$YMIN_a= -12568262
##$ZGOPTNS= <>
##$ZL1= 120
##$ZL2= 120
##$ZL3= 120
##$ZL4= 120
##$ABSF1= 14.96103
##$ABSF2= -5.597152
##$ABSG= 5
##$ABSL= 3
##$ALPHA= 0
##$AQORDER= 0
##$ASSFAC= 0
##$ASSFACI= 0
##$ASSFACX= 0
##$ASSWID= 0
##$AUNMP= <proc_prof1d_extract.lims>
##$AXLEFT= 0
##$AXNAME= <>
##$AXNUC= <1H>
##$AXRIGHT= 0
##$AXTYPE= 0
##$AXUNIT= <>
##$AZFE= 0.1
##$AZFW= 0.1
##$BCFW= 0
##$BC_mod= 0
##$BYTORDP= 0
##$COROFFS= 0
##$CY= 15
##$DATMOD= 1
##$DC= 0
##$DFILT= <>
##$DTYPP= 0
##$F1P= 0
##$F2P= 0
##$FCOR= 0.5
##$FTSIZE= 131072
##$FT_mod= 6
##$GAMMA= 0
##$GB= 0
##$INTBC= 1
##$INTSCL= 1
##$ISEN= 128
##$LB= 0.3
##$LEV0= 0
##$LPBIN= 0
##$MAXI= 10000
##$MC2= 0
##$MEAN= 0
##$ME_mod= 0
##$MI= 0
##$NCOEF= 0
##$NC_proc= -2
##$NLEV= 6
##$NOISF1= 0
##$NOISF2= 0
##$NSP= 0
##$NTH_PI= 0
##$NZP= 0
##$OFFSET= 14.96103
##$PC= 1
##$PHC0= -76.23413
##$PHC1= 0
##$PH_mod= 1
##$PKNL= yes
##$PPARMOD= 0
##$PPDIAG= 0
##$PPIPTYP= 0
##$PPMPNUM= 2147483647
##$PPRESOL= 1
##$PSCAL= 4
##$PSIGN= 0
##$PYNMP= <proc.py>
##$REVERSE= no
##$SF= 400.02000962644
##$SI= 131072
##$SIGF1= 0
##$SIGF2= 0
##$SINO= 400
##$SIOLD= 131072
##$SPECTYP= <>
##$SREGLST= <1H.CDCl3>
##$SSB= 0
##$STSI= 131072
##$STSR= 0
##$SW_p= 8223.68421052631
##$SYMM= 0
##$S_DEV= 0
##$TDeff= 65536
##$TDoff= 0
##$TI= <>
##$TILT= no
##$TM1= 0
##$TM2= 0
##$TOPLEV= 0
##$USERP1= <user>
##$USERP2= <user>
##$USERP3= <user>
##$USERP4= <user>
##$USERP5= <user>
##$WDW= 1
##$XDIM= 131072
##$YMAX_p= 469933545
##$YMIN_p= -16085
##$CURPLOT= <Network HP LaserJet P1505>
##$CURPRIN= <$Network HP LaserJet P1505>
##$DFORMAT= <normdp>
##$LAYOUT= <+/1D_H.xwp>
##$LFORMAT= <normlp>
##$PFORMAT= <normpl>
##$SURQMSG= 1
$$ End of Bruker specific parameters
$$ ---------------------------------
##NTUPLES= NMR SPECTRUM
##VAR_NAME=  FREQUENCY,     SPECTRUM/REAL,   SPECTRUM/IMAG
##SYMBOL=    X,             R,               I
##VAR_TYPE=  INDEPENDENT,   DEPENDENT,       DEPENDENT
##VAR_FORM=  AFFN,          ASDF,            ASDF
##VAR_DIM=   131072,        131072,          131072
##UNITS=     HZ,            ARBITRARY UNITS, ARBITRARY UNITS
##FACTOR=    0.0627417313425164, 1,          1
##FIRST=     8223.62146879497, 1120,         -60118
##LAST=      0,             2641,            -61108
##MIN=       0,             -16085,          0
##MAX=       8223.62146879497, 469933545,    0
$$ Real data points
##PAGE= N=1
##DATA TABLE= (X++(R..R)), XYDATA
$$ [...]
63923D913765j05424j40990j73220k00061k20475k34247k41315k42247k38856
$$ 4913765 4808341 4667351 4494131 4294070 4073595 3839348 3598033 3355786 3116930
63914C116930k33105k25422k15107k02113j87302j71224j54024j36694j20986
$$ 3116930 2883825 2658403 2443296 2241183 2053881 1882657 1728633 1591939 1470953
63905A470953j07503r5082q2690p0920o0973n2988m6218m0224l5111l0910k7429
$$ 1470953 1363450 1268368 1185678 1114758 1053785 1000797 954579 914355 879244 848334 820905
63894H20905k4536k2173k0238j8715j7691j7053j6384j5412j4268j3204j2221
$$ 820905 796369 774196 753958 735243 717552 700499 684115 668703 654435 641231 629010
63883F29010j1132r716p833n511k926j01L072O359R074J1004J2930J5602J8477
$$ 629010 617878 608162 600329 594818 591892 591791 594863 601222 610296 621300 634230 649832 668309
63870F68309K0395K1310K2463K4750K7781L0631L2721L3768L3649L2646L1299
$$ 668309 688704 710014 732477 757227 785008 815639 848360 882128 915777 948423 979722
63859I79722K9756K7715K5087K2152J9017J5397J1085O249J232l546p700j1251
$$ 979722 1009478 1037193 1062280 1084432 1103449 1118846 1129931 1136180 1137412 1133866 1126166 1114915
63847A114915j4736j8522k2306k5696k8760l1450l3212l3998l4932l6772l8396
$$ 1114915 1100179 1081657 1059351 1033655 1004895 973445 940233 906235 871303 834531 796135
63836G96135l8183l6392l4642l3440l1998l0227k8912k7845k5832k2931k0723
$$ 796135 757952 721560 686918 653478 621480 591253 562341 534496 508664 485733 465010
63825D65010j9711j8489j6260j4235j3369j2636j1021r514r391r780q965p153
$$ 465010 445299 426810 410550 396315 382946 370310 359289 349775 340384 330604 321639 314486
63813C14486o024n998n847m874l787l262k994k577k248k338k640k689k329j848
$$ 314486 308462 302464 296617 291743 287956 284694 281700 279123 276875 274537 271897 269208 266879 265031
63799B65031j734k203k873l121k889k675k627k335j757j550k030k536k420j966
$$ 265031 263297 261094 258221 255100 252211 249536 246909 244574 242817 241267 239237 236701 234281 232315
63785B32315j709j527j109o89o28p74r10j261j859j992j155l3K82k82q78r09m29
$$ 232315 230606 229079 227970 227281 226653 225879 224969 223708 221849 219857 218702 218669 218951 218669 217791 216882 216453
63768B16453K32N82J39q41j234l59R44J331O40k53q40j324j805j980j716j241
$$ 216453 216685 217267 217406 216565 215331 214972 215916 217247 217887 217634 216794 215470 213665 211685 209969 208728
63752B08728p50l15l8J05M21R94J394J307J140J462K169K691K738K402J876J448
$$ 208728 207978 207663 207625 207730 208151 209145 210539 211846 212986 214448 216617 219308 222046 224448 226324 227772
63736B27772J401J534J342J042J593L127M269L862K629K049K380K888L472M574
$$ 227772 229173 230707 232049 233091 234684 237811 242080 245942 248571 250620 253000 255888 259360 263934
63722B63934N760N867M696L407K979L163L180K615J488Q1j138j952k650l394l703
$$ 263934 269694 275561 280257 283664 286643 289806 292986 295601 297089 297170 296032 294080 291430 288036 284333
63707B84333l284k907l383m048l512j788l64j8N6N84J088J056J040J634K294K227
$$ 284333 281049 278142 274759 270711 267199 265411 265047 265029 265085 265669 266757 267813 268853 270487 272781 275008
63691B75008J854K300L673M834M882M084L146K279J314L86r3k1J67M7k39l13k05
$$ 275008 276862 279162 282835 287669 292551 296635 299781 302060 303374 303760 303667 303646 303813 303860 303621 303308 303103
63674C03103k75m22JJ207K389K613J944J211R22R75J171J298Q53n65k440l660
$$ 303103 302828 302406 302407 303614 306003 308616 310560 311771 312693 313668 314839 316137 316990 316425 313985 310325
63658C10325l783l514l614l912l854l489l356l518l404k754k209k546l518m008
$$ 310325 306542 303028 299414 295502 291648 288159 284803 281285 277881 275127 272918 270372 266854 262846
63644B62846l379k147j084j75R69K061K383J964J706K158K916L497M023M656N081
$$ 262846 259467 257320 256236 256061 257030 259091 261474 263438 265144 267302 270218 273715 277738 282394 287475
63629B87475N088N112N618O414P081P619Q168Q563Q799R452J0922J2621J3700
$$ 287475 292563 297675 303293 309707 316788 324407 332575 341138 349937 359389 370311 382932 396632
63616C96632J4312J5438J7503J9895K1882K3435K5040K7083K9503L1738L2975
$$ 396632 410944 426382 443885 463780 485662 509097 534137 561220 590723 622461 655436
63605F55436L2600L0401K6363K0642J3802O724J32n355q847r724q812p960p935
$$ 655436 688036 718437 744800 765442 779244 785968 786100 780745 771898 762174 753362 745402 737467
63592G37467p734o727o384q608j3019j7343k0194k2076k3670k4555k4041k2304
$$ 737467 729733 723006 716622 708014 694995 677652 657458 635382 611712 587157 563116 540812
63580E40812k0167j8336j7087j6183j4935j2779r904p005m491k352n89Q52K344
$$ 540812 520645 502309 485222 469039 454104 441325 431421 424416 419925 417573 416984 417836 420180
63567D20180M154N843O811P229P729Q262Q176P467P115P871R400J0919J2127J3238
$$ 420180 424334 430177 436988 444217 451946 460208 468384 475851 482966 490837 500237 511156 523283 536521
63553E36521J4621J6642J9475K2824K6318L0272L5455M1672M6869M8117M3560
$$ 536521 551142 567784 587259 610083 636401 666673 702128 743800 790669 838786 882346
63542H82346L3518K0144O267n745j4578j9896k1963k1329j8711j4943j0915p494
$$ 882346 915864 936008 942275 936530 921952 902056 880093 858764 840053 825110 814195 806701
63530H06701n258m423n120p634j1889j6860k1124k4140k6414k8393k9842l0481
$$ 806701 801443 797020 791900 784266 772377 755517 734393 710253 683839 655446 625604 595123
63518E95123l0382k9478k7513k4838k2364k0292j7843j4819j2389j1437j1190
$$ 595123 564741 535263 507750 482912 460548 440256 422413 407594 395205 383768 372578
63507C72578j0417r138p994o843n283l884l444l501l062k379k423k890k451j037
$$ 372578 362161 353023 345029 338186 332903 329019 325575 322074 319012 316633 314210 311320 308869 307832
63493C07832j57o21j393j305o34k39k49k76k15r2L43J294K580L822M728N045M733
$$ 307832 307675 307054 305661 304356 303722 303483 303234 302958 302743 302651 302994 304288 306868 310690 315418 320463 325196
63476C25196M227M044M133M048L621K926J810K04j348k298l040m322n785o175
$$ 325196 329423 333467 337600 341648 345269 348195 350005 350209 348861 346563 343523 339201 333416 327241
63462C27241n088l575k745k629k612k257j465m83J80L50O18J532K609L035L086
$$ 327241 322153 318578 315833 313204 310592 308335 306870 306387 306567 306917 307535 309067 311676 314711 317797
63447C17797L739N086O331P310Q616J0123J0905J1030J2018J4860J8894K3282
$$ 317797 321536 326622 332953 340263 348879 359002 369907 380937 392955 407815 426709 449991
63435D49991K8238L3732L7979L8555L4615K7245J8247R387K303j953l411k737
$$ 449991 478229 511961 549940 588495 623110 650355 668602 677989 680292 678339 674928 672191
63423F72191m05L347Q170J3527J8881K3733K7852L1499L4927L7443L7526L4131
$$ 672191 671786 675133 683303 696830 715711 739444 767296 798795 833722 871165 908691 942822
63411I42822K7550J8922R540P64o179j0730j3007j3221j1702r582q500r237j1187
$$ 942822 970372 989294 998834 999598 993419 982689 969682 956461 944759 935177 926677 917440 906253
63398I06253j3518j6237j9727k3889k8105l1626l3701l3943l2801l1213k9544
$$ 906253 892735 876498 856771 832882 804777 773151 739450 705507 672706 641493 611949
63387F11949k7431k4795k2225k0084j7943j5343j2508r934p824o144m804l443
$$ 611949 584518 559723 537498 517414 499471 484128 471620 461686 453862 447718 442914 439471
63375D39471j616O66K952N011O835Q164Q811R445J1018J3282J4977J5776J6868
$$ 439471 437855 438521 441473 446484 453319 461483 470294 479739 490757 504039 519016 534792 551660
63362E51660J9163K2077K4719K7264L0236L3348L5855L7426L7937L6977L4272
$$ 551660 570823 592900 617619 644883 675119 708467 744322 781748 819685 856662 890934
63351H90934L0002K4208J6579P622p76o780j0201j2016j2855j2774j1987j1016
$$ 890934 920936 945144 961723 969345 968569 961789 951588 939572 926717 913943 901956 890940
63339H90940j0340j0428j1829j4608j8094k1632k5205k8774l1536l2493l1468
$$ 890940 880600 870172 858343 843735 825641 804009 778804 750030 718494 686001 654533
63328F54533k9072k5992k2727j9620j6548j2808p784j758L963P357O408O01p938
$$ 654533 625461 599469 576742 557122 540574 527766 519982 518224 522187 529544 535952 536553 528615
63315E28615j5552j9887k1173k0680j9082j6782j4634j3186j1904j0080q017o492
$$ 528615 513063 493176 472003 451323 432241 415459 400825 387639 375735 365655 357638 351146
63303C51146n533m581l542k829k627k726k901k989k830k532k431k499k280j718
$$ 351146 345613 341032 337490 334661 332034 329308 326407 323418 320588 318056 315625 313126 310846 309128
63289C09128j371j455j443j049q04j073j345j188j031j260j337p79j46j10k56
$$ 309128 307757 306302 304859 303810 303006 301933 300588 299400 298369 297109 295772 294993 294847 294737 294481
63274B94481P5M59J48m59m00J76K89p2J46J304K429K614K066J474J189J334J973
$$ 294481 294556 295015 295163 294704 294304 294480 294769 294697 294843 296147 298576 301190 303256 304730 305919 307253 309226
63257C09226K792L168K920K623K932L802M561M652M287M272N057O087O591O836
$$ 309226 312018 315186 318106 320729 323661 327463 332024 336676 340963 345235 350292 356379 362970 369806
63243C69806P768R380J0499J0593J0690J1799J3476J4920J6498J8939K1703K3550
$$ 369806 377574 386954 397453 408046 418736 430535 444011 458931 475429 494368 516071 539621
63231E39621K4396K5223K6351K7001K6608K5550K4413K3450K2779K2445K2143
$$ 539621 564017 589240 615591 642592 669200 694750 719163 742613 765392 787837 809980
63220H09980K1568K0945K0742K1053K1740K2844K4088K4430K2978K0049J6498
$$ 809980 831548 852493 873235 894288 916028 938872 962960 987390 1010368 1030417 1046915
63209A046915J2345O987N12o248j2807j9144k4805k8975l1538l3111l3952l3696
$$ 1046915 1059260 1066247 1066759 1060511 1047704 1028560 1003755 974780 943242 910131 876179 842483
63197H42483l2266l0113k7448k4091k0235j6582j3487j0658p784m749j274K774
$$ 842483 810217 780104 752656 728565 708330 691748 678261 667603 659819 655070 653796 656570
63185F56570O647R318J1028J3249J6704K0238K2254K2534K2076K1707K1513K1312
$$ 656570 663217 672535 683563 696812 713516 733754 756008 778542 800618 822325 843838 865150
63173H65150K1005K0523J9794J8853J7862J7007J6343J5605J4223J1661P731K573
$$ 865150 886155 906678 926472 945325 963187 980194 996537 1012142 1026365 1038026 1045757 1048330
63161A048330l368r291j4423j8802k3222k7962l2094l4640l5881l6646l6742l5204
$$ 1048330 1044962 1035671 1021248 1002446 979224 951262 919168 884528 848647 812001 775259 740055
63149G40055l2044k8680k6317k4694k2816k0294j7509j4924j2708j0885r501q573
$$ 740055 708011 679331 653014 628320 605504 585210 567701 552777 540069 529184 519683 511110
63137E11110p906p112n966m794m114l865l477k851k558k693k308p59J095J933
$$ 511110 503204 496092 490126 485332 481218 477353 473876 471025 468467 465774 463466 462707 463802 465735
63123D65735J730J499J660J768J720K092L063L972M264M165M131M146L931L450
$$ 465735 467465 468964 470624 472392 474112 476204 479267 483239 487503 491668 495799 499945 503876 507326
63109E07326K971K827L069L282K933K131J669J924K148J436K3r69r04j45N67O91
$$ 507326 510297 513124 516193 519475 522408 524539 526208 528132 530280 531716 531739 530770 529866 529721 530288 530979
63093E30979J04p42j088p42l25l02l51j92k51p10o77O89K724M075M439M404M091
$$ 530979 531083 530341 529253 528511 528186 527884 527533 527341 527090 526380 525703 526392 529116 533191 537630 542034 546125
63076E46125L302K719L469N425P140P649P286O747O432O767Q073R985J1832J3576
$$ 546125 549427 552146 555615 561040 568180 575829 583115 589862 596294 603061 611134 621119 632951 646527
63062F46527J5484J7196J8281J9493K2064K5740K8996L1322L3840L7326M1095
$$ 646527 662011 679207 697488 716981 739045 764785 793781 825103 858943 896269 937364
63051I37364M4392M7464N0611N3378N5465N7376N9377O0774O0922O0196N9265
$$ 937364 981756 1029220 1079831 1133209 1188674 1246050 1305427 1366201 1427123 1487319 1546584
63040A546584N8143N6597N4843N3244N1967N1295N1604N2582N3208N2788N1232
$$ 1546584 1604727 1661324 1716167 1769411 1821378 1872673 1924277 1976859 2030067 2082855 2134087
63029B134087M8050M2196L3478K3113J2136J60j3473k8133m2313n4922o5309p2747
$$ 2134087 2182137 2224333 2257811 2280924 2293060 2293220 2279747 2251614 2209301 2154379 2089070 2016323
63017B016323p6901p8507p8663p7611p4843p0130o3831n6412m8322m0148l2287
$$ 2016323 1939422 1860915 1782252 1704641 1629798 1559668 1495837 1439425 1391103 1350955 1318668
63006A318668k4566j6616q564r72N792J1834J7462K2817K7712L1715L4565L6446
$$ 1318668 1294102 1277486 1268922 1267950 1273742 1285576 1303038 1325855 1353567 1385282 1419847 1456293
62994A456293L7625L8006L7461L6494L5923L5981L6254L6415L6293L5278L2579
$$ 1456293 1493918 1531924 1569385 1605879 1641802 1677783 1714037 1750452 1786745 1822023 1854602
62983A854602K8281K3233J7659J0737J975p872j7753k7416l7013m6224n4434o1267
$$ 1854602 1882883 1906116 1923775 1934512 1936487 1928615 1910862 1883446 1846433 1800209 1745775 1684508
62971A684508o6482o9681p0658o9741o7497o4352o0684n6811n2702m8156m3429
$$ 1684508 1618026 1548345 1477687 1407946 1340449 1276097 1215413 1158602 1105900 1057744 1014315
62960A014315l9174l5660l2624k9950k7849k6207k4512k2690k1254k0386j9568
$$ 1014315 975141 939481 906857 876907 849058 822851 798339 775649 754395 734009 714441
62949G14441j8442j7305j6415j5545j4651j4134j4068j3829j2956j1729j0548
$$ 714441 695999 678694 662279 646734 632083 617949 603881 590052 577096 565367 554819
62938E54819r445q544q191q172p643o374n268n014n055m581l784l303l053k500
$$ 554819 545374 536830 528639 520467 512824 506450 501182 496168 491113 486532 482748 479445 476392 473892
62924D73892j655r38m02J30M13L8q18j483j567j257r83j117j778k659l265l502
$$ 473892 472237 471299 470897 471027 471440 471478 470660 469177 467610 466353 465370 464253 462475 459816 456551 453049
62908D53049l699l923l797l184k516k172j966j580r96l35K96O39N35L98P36J182
$$ 453049 449350 445427 441630 438446 435930 433758 431792 430212 429216 428881 429177 429816 430351 430749 431485 432667
62892D32667Q53j96q39n04J39M08N33P74P49K61j71k96o20j241j237j13J105J246
$$ 432667 433520 433324 432485 431981 432120 432528 433061 433835 434584 434845 434674 434378 433758 432517 431280 431167 432272 433518
62874D33518N83K4m73j398k310k304j528j021j186j448j285p14Q0Q36J094O84
$$ 433518 434101 434125 433652 432254 429944 427640 426112 425091 423905 422457 421172 420458 420538 421374 422468 423152
62858D23152J57J12M19O32P84J083J282J115Q83Q97Q13K80k34j48J96J58j7L63
$$ 423152 423309 423421 423840 424472 425256 426339 427621 428736 429619 430516 431329 431609 431375 431227 431423 431581 431564 431927
62840D31927J082J200M88l58q01r59j016j023j159j464j434o49L72P27M35K71
$$ 431927 433009 434209 434697 434339 433538 432579 431563 430540 429381 427917 426483 425834 426206 426933 427368 427639
62824D27639N33Q41J097J619K223K247J718J632K632M110N023N113M892M810M806
$$ 427639 428172 429013 430110 431729 433952 436199 437917 439549 442181 446291 451314 456427 461319 466129 470935
62809D70935M573M038L633L946N031O207O824O984P252P885Q717R523J0088J0232
$$ 470935 475508 479546 483179 487125 492156 498363 505187 512171 519423 527308 536025 545548 555636 565868
62795E65868J0145J0547J1948J3996J5918J7537J9430K2229K6098L0700L5406
$$ 565868 576013 586560 598508 612504 628422 645959 665389 687618 713716 744416 779822
62784G79822L9762M3991M8822N4588O0837O6986P2897P8577Q3855Q8709R3337
$$ 779822 819584 863575 912397 966985 1027822 1094808 1167705 1246282 1330137 1418846 1512183
62773A512183R7436R9957R9951R7192R1697Q3373P2477N9598M4752K7480Q473
$$ 1512183 1609619 1709576 1809527 1906719 1998416 2081789 2154266 2213864 2258616 2286096 2294569
62762B294569j0015k6341m1035n5084o7693p7215q3661q8493r2283r4128r3454
$$ 2294569 2284554 2258213 2217178 2162094 2094401 2017186 1933525 1845032 1752749 1658621 1565167
62751A565167r0913q7206q2402p6749p1178o6389o2064n7426n2117m6433m1071
$$ 1565167 1474254 1387048 1304646 1227897 1156719 1090330 1028266 970840 918723 872290 831219
62740H31219l6631l3011k9520k5936k2934k0937j9143j6587j3651j1465j0158
$$ 831219 794588 761577 732057 706121 683187 662250 643107 626520 612869 601404 591246
62729E91246q821p014n205l832k929k623k911l050k163m90R30J827K911M547O257
$$ 591246 582425 575411 570206 566374 563445 560822 557911 554861 552698 552208 553138 554965 557876 562423 568680
62714E68680P681R020J0378J1602J2949J4919J7333J9500K1515K4377K8513L3149
$$ 568680 576361 585381 595759 607361 620310 635229 652562 672062 693577 717954 746467 779616
62702G79616L7405M1197M4786M8358N2383N7493O3555O9574P4822P9284Q2727
$$ 779616 817021 858218 903004 951362 1003745 1061238 1124793 1194367 1269189 1348473 1431200
62691A431200Q4291Q3451Q0590P6028O9204N9428M6954L2724J7492J678j4239
$$ 1431200 1515491 1598942 1679532 1755560 1824764 1884192 1931146 1963870 1981362 1983040 1968801
62680A968801k9683m4065n6691o6904p4519p9797q2898q3745q2564q0004p6586
$$ 1968801 1939118 1895053 1838362 1771458 1696939 1617142 1534244 1450499 1367935 1287931 1211345
62669A211345p2410o7568o2355n6952n1422m6143m1767l8418l5444l2133k8373
$$ 1211345 1138935 1071367 1009012 952060 900638 854495 812728 774310 738866 706733 678360
62658F78360k4544k1145j8683j7354j6617j5514j3645j1649j0538j0716j1609
$$ 678360 653816 632671 613988 596634 580017 564503 550858 539209 528671 517955 506346
62647E06346j2045j1164r211p343o341n806m928l650k438j412m40J35j70j031
$$ 506346 494301 483137 473926 466583 460242 454436 449508 445858 443420 442008 441568 441703 441533 440502
62633D40502j566j512j382j474j534j479j556j680j400p60m33p25j079q29O1J204
$$ 440502 438936 437424 436042 434568 433034 431555 429999 428319 426919 426159 425726 425001 423922 423093 423154 424358
62617D24358K189K703K679K492K589K959L402M035N029O035O591O881P378Q011
$$ 424358 426547 429250 431929 434421 437010 439969 443371 447406 452435 458470 465061 471942 479320 487331
62603D87331Q509R308J1111J3730J6310J8618K1111K3950K7022L0685L5203L9626
$$ 487331 495840 505148 516259 529989 546299 564917 586028 609978 637000 667685 702888 742514
62591G42514M2750M5055M7943N0900N1436M8518M4004L9656L4547K6970J7376
$$ 742514 785264 830319 878262 929162 980598 1029116 1073120 1112776 1147323 1174293 1191669
62580A191669P578j823j1329k0512k8020l3521l7995m1943m4656m5513m4943m3719
$$ 1191669 1199247 1197424 1186095 1165583 1137563 1104042 1066047 1024104 979448 933935 888992 845273
62568H45273m2158m0252l7967l5185l1930k8704k6036k3668k0869j7719j5307
$$ 845273 803115 762863 724896 689711 657781 629077 603041 579373 558504 540785 525478
62557E25478j4268j3696j2148r439o850n571n479n610n383m895m282l419k365
$$ 525478 511210 497514 485366 475927 469077 463506 458027 452417 447034 442139 437857 434438 432073
62544D32073j563j283j256j206j262j444j263m40M05M98Q0j7K81L11N5M65K101
$$ 432073 430510 429227 427971 426765 425503 424059 422796 422356 422761 423259 423339 423322 423603 423914 423969 424434 426535
62527D26535M313O172P523Q715R893J0999J2066J3162J4382J6098J8793K2397
$$ 426535 430848 437020 444543 453258 463151 474150 486216 499378 513760 529858 548651 571048
62515E71048K6208K9715L3030L6344L9388M1816M3753M5553M7141M7802M6672
$$ 571048 597256 626971 660001 696345 735733 777549 821302 866855 913996 961798 1008470
62504A008470M3347L8174L1862K4806J6949Q391k53q366j5786k2400k7709l1310
$$ 1008470 1051817 1089991 1121853 1146659 1163608 1171999 1171746 1163380 1147594 1125194 1097485 1066175
62492A066175l3292l3707l2232k8961k4941k1025j6861j1889o768k569R19M768
$$ 1066175 1032883 999176 966944 937983 913042 892017 875156 863267 856499 853930 854849 859617
62480H59617R044J2761J5402J7006J6904J4028Q844L479m97l292n822q754j2857
$$ 859617 868661 881422 896824 913830 930734 944762 953606 957085 956588 953296 947474 938720 925863
62467I25863j8662k5159l0126l2438l3024l3156l3039l2535l1865l0783k8402
$$ 925863 907201 882042 851916 819478 786454 753298 720259 687724 655859 625076 596674
62456E96674k4669k0984j8534j6940j5210j3035j0519p710n170l886l814l465
$$ 596674 572005 551021 532487 515547 500337 487302 476783 469073 463903 460017 456203 452738
62444D52738j778N65K397L592M497M975N029N346O202O691O047M801L626K010
$$ 452738 450960 451525 453922 457514 462011 466986 472015 477361 483563 490254 496301 501102 504728 506738
62430E06738p08l758n775o614p192p966q713r292r628r358q473p805p882p870
$$ 506738 506030 502272 496497 489883 482691 474725 466012 456720 447092 437734 429261 421456 413574 405704
62416D05704o720m868l651l366l133k472j914j991k455k680k231j224l48l06q53
$$ 405704 398984 394116 390465 387099 383966 381494 379580 377589 375134 372454 370223 368999 368651 368345 367492
62401C67492r59k97K68J44J19J104K653L615L632L040K012Q06J88N77J296J674
$$ 367492 366533 366236 366504 366648 366767 367871 370524 374139 377771 380811 382823 383629 383817 384394 385690 387364
62385C87364K204L549N110N876O037O415O753O218N260N390O981Q739R602R846
$$ 387364 389568 393117 398227 404103 410140 416555 423308 429526 434786 440176 447157 455896 465498 475344
62371D75344J0062J0186J0038R954J0394J1445J2931J4575J6109J7722K0258K4262
$$ 475344 485406 495592 505630 515584 525978 537423 550354 564929 581038 598760 619018 643280
62359F43280K9039L3383L7127M1222M6306N1813N6454N8999N8726N5697N0513
$$ 643280 672319 705702 742829 784051 830357 882170 938624 997623 1056349 1112046 1162559
62348A162559M3545L4765K4735J5051O971K47n908j1431j6049k0589k6127l2105
$$ 1162559 1206104 1240869 1265604 1280655 1287626 1287873 1281965 1270534 1254485 1233896 1207769 1175664
62336A175664l6672l8927l9569l9379l8298l6206l3433l0279k6896k3740k1251
$$ 1175664 1138992 1100065 1060496 1021117 982819 946613 913180 882901 856005 832265 811014
62325H11014j9073j6681j4697j4386j5629j6775j6828j6596j7153j8253j8994
$$ 811014 791941 775260 760563 746177 730548 713773 696945 680349 663196 644943 625949
62314F25949j9150j8986j8404j7116j5295j3457j1923j0705r693q587p078n333
$$ 625949 606799 587813 569409 552293 536998 523541 511618 500913 491220 482633 475555 470222
62302D70222l981l402l292l221l119l023k638j552J59J826K682K543K051K138
$$ 470222 466241 462839 459547 456326 453207 450184 447546 445994 446153 447979 450661 453204 455255 457393
62288D57393L074M197M734M625M357M265M405M759N132N080M442L750L710M367
$$ 457393 460467 464664 469398 474023 478380 482645 487050 491809 496941 502021 506463 510213 513923 518290
62274E18290N264O164P227Q570J0063J1465J2575J3501J4981J7867K1905K5596
$$ 518290 523554 529718 536945 545515 555578 567043 579618 593119 608100 625967 647872 673468
62262F73468K7884K9432L1654L4962L8744M2618M6682N0738N4184N6670N8186
$$ 673468 701352 730784 762438 797400 836144 878762 925444 976182 1030366 1087036 1145222
62251A145222N8487N6954N3028M6391L7118K6117J5054N220l302j0979j7921k4254
$$ 1145222 1203709 1260663 1313691 1360082 1397200 1423317 1438371 1443591 1440289 1429310 1411389 1387135
62239A387135l0678l7627m4350m9709n3526n6243n7698n7308n5175n1996m8080
$$ 1387135 1356457 1318830 1274480 1224771 1171245 1115002 1057304 999996 944821 892825 844745
62228H44745m3481l8847l5015l1855k8546k4952k1665j8817j5949j3083j0855
$$ 844745 801264 762417 727402 695547 667001 642049 620384 601567 585618 572535 561680
62217E61680r479q515p722p202o747o033n460n651o140n655l947k228j442j208
$$ 561680 552201 543686 535964 528762 522015 515982 510522 504871 498731 493076 489129 486901 485459 484251
62203D84251q30l52n6K87J016K010K939L712M402N106O029P262Q447R086R204
$$ 484251 483421 483069 483013 483300 484316 486326 489265 492977 497379 502485 508514 515776 524223 533309 542513
62188E42513R259R491R824J0234J0647J0753J0437J0093R858R057P248N330M493
$$ 542513 551772 561263 571087 581321 591968 602721 613158 623251 633109 642166 649414 654744 659237
62175F59237M457L960K832K346L588O551J0799J5760K0481K4336K8055L2738L7869
$$ 659237 663694 667654 670486 672832 676420 682971 693770 709530 730011 754347 782402 815140 853009
62162H53009M1661M3426M3972M3468M0620L4687K6876J8961J1655N082m09m798
$$ 853009 894670 938096 982068 1025536 1066156 1100843 1127719 1146680 1158335 1163417 1163008 1158210
62150A158210q808j2984j7073k0911k4876k8826l1649l2720l2896l3116l2812
$$ 1158210 1149402 1136418 1119345 1098434 1073558 1044732 1013083 980363 947467 914351 881539
62139H81539l0723k6751k2064j7751j4179j1301q831o393m047k441j974k181k294
$$ 881539 850816 824065 802001 784250 770071 758770 749939 743546 739499 737058 735084 732903 730609
62126G30609k035j498o92L18J337K521M486P446J0588J2848J3905J3924J2664
$$ 730609 728574 727076 726384 726702 728039 730560 735046 742492 753080 765928 779833 793757 806421
62113H06421R604M993K46k988m094l819l350l303l766n108p926j1859j5193j6373
$$ 806421 816025 821018 821264 818276 814182 810363 807013 803710 799944 794836 786910 775051 759858 743485
62099G43485j5467j3566j1281q694o141l909j551J326L884M989N072N680P160
$$ 743485 728018 714452 703171 694477 688336 684427 682876 684202 688086 693075 698147 703827 710987
62086G10987Q228Q074P394P021O864O790P277Q489R715J0453J1230J2768J4994
$$ 710987 719215 727289 734683 741704 748568 755358 762635 771124 780839 791292 802522 815290 830284
62073H30284J7361J9466K0969K1596K1527K1271K1086K1080K1781K3600K5861
$$ 830284 847645 867111 888080 909676 931203 952474 973560 994640 1016421 1040021 1065882
62062A065882K7457K8325K9046K9047K6814K2084J6319J0670N148J33l183m744
$$ 1065882 1093339 1121664 1150710 1179757 1206571 1228655 1244974 1255644 1260792 1260925 1257742 1252998
62050A252998o344r329j3070j6666k0607k5396k9924l2776l4236l5522l6839l7462
$$ 1252998 1246654 1237325 1224255 1207589 1186982 1161586 1131662 1098886 1064650 1029128 992289 954827
62038I54827l7168l6330l5117l3602l2110l0593k8393k5516k3274k2466k1867
$$ 954827 917659 881329 846212 812610 780500 749907 721514 695998 672724 650258 628391
62027F28391j9810j6628j4061j2739j1697j0226q791p971p686p689q034q756r606
$$ 628391 608581 591953 577892 565153 553456 543230 534439 526468 518782 511093 503059 494303 484697
62014D84697j0212j0140q996o867m543k829j892j436j150o68M63K314M385O144
$$ 484697 474485 464345 455349 448482 443939 441110 439218 437782 436632 435964 436427 438741 443126 449270
62000D49270P403Q060Q033P554O924N883M027J890O24M01J63p54j884k877m148
$$ 449270 456673 464733 472766 480320 487244 493127 497154 499044 499668 500069 500232 499478 497594 494717 490569
61985D90569n740o803p033p357q366r232r054q150p134n898m502l843m217m384
$$ 490569 484829 478026 470993 463636 455270 446038 436984 428834 421700 415802 411300 407457 403240 398856
61971C98856l318j863j262j188p10k41p67j818j980j074j79K06N55J026J238J277
$$ 398856 395538 393675 392413 391225 390515 390274 389507 387689 385709 384635 384456 384662 385217 386243 387481 388758
61955C88758J676K424K997L272L505L646L600L862M870O152P000P675Q922J0726
$$ 388758 390434 392858 395855 399127 402632 406278 409878 413740 418610 424762 431762 439437 448359 459085
61941D59085J2540J4278J6057J7424J7984J8290J8991J9575J9205J8247J7650
$$ 459085 471625 485903 501960 519384 537368 555658 574649 594224 613429 631676 649326
61930F49326J7250J6163J4485J3075J1903J0110P634N183K713n21m219o981q256
$$ 649326 666576 682739 697224 710299 722202 732312 739946 745129 747842 747321 743102 736121 727865
61917G27865q943r600r472p845n130k071J173M583P828J0806J3822J6763J8754
$$ 727865 718922 709322 699850 692005 686875 684804 685977 690560 698388 709194 723016 739779 758533
61904G58533J9106J8015J5981J3147R500N291Q91l419p394j0853j3777j6069j7455
$$ 758533 777639 795654 811635 824782 834282 839573 840464 837045 829651 818798 805021 788952 771497
61891G71497j7981j8254j8638j8608j7590j6050j4895j4135j3163j2071j1611
$$ 771497 753516 735262 716624 698016 680426 664376 649481 635346 622183 610112 598501
61880E98501j1823j1852j1302j0788j0787j0798j0021q351o375m777l895l497
$$ 598501 586678 574826 563524 552736 541949 531151 521130 512779 506404 501627 497732 494235
61868D94235k982k040r80j57N81J529K664L997N864Q245J0381J1769J2999J4785
$$ 494235 491253 489213 488233 488076 488657 490186 492850 496847 502711 510956 521337 533106 546105 560890
61854E60890J6824J8557K0478K3457K7131L0177L2019L3220L4219L4771L4537
$$ 560890 577714 596271 616749 640206 667337 697514 729533 762753 796972 831743 866280
61843H66280L3359L0979K7313K2815J7801J1809M583k760q593j2499j5046j6239
$$ 866280 899639 930618 957931 980746 998547 1010356 1014939 1012179 1003586 991087 976041 959802
61831I59802j5563j3339j0616p686l929P76N637R981J3559J5842J6159J4671J2185
$$ 959802 944239 930900 920284 912598 908669 909445 915082 925063 938622 954464 970623 985294 997479
61818I97479Q916M484r51o680j2543j8803k4844k9302l1681l2770l3268l3039
$$ 997479 1006395 1010879 1009928 1003248 990705 971902 947058 917756 886075 853305 820037 786998
61806G86998l1915l0116k7713k4651k1476j9000j7126j5054j2667j0712r572q859
$$ 786998 755083 724967 697254 672603 651127 632127 615001 599947 587280 576568 566996 558137
61794E58137q286p850p233o196n419n615n959m951k795j277j119j228r15r71j896
$$ 558137 549851 542001 534768 528572 523153 517538 511579 506628 503833 502556 501437 500209 499294 498323 496427
61779D96427k734k619k060j840j851j851k119k551k350j390p43r85j227o84n2
$$ 496427 493693 491074 489014 487174 485323 483472 481353 478802 476452 475062 474319 473334 472107 471423 471371
61764D71371j89n85k46P11J488J936K395K785K779K441K016J518J094J059J159
$$ 471371 471182 470597 470351 471062 472550 474486 476881 479666 482445 484886 486902 488420 489514 490573 491732
61749D91732N52q92k108k278j880j696j712j728k046k705k979k501k011k082k053
$$ 491732 492284 491392 489284 487006 485126 483430 481718 479990 477944 475239 472260 469759 467748 465666 463613
61734D63613j268l77k24k58N45J837K394K041J656J574J354J094J498K479K958
$$ 463613 462345 461968 461744 461486 462031 463868 466262 468303 469959 471533 472887 473981 475479 477958 480916
61719D80916K422J705J775K510L117L169K808K282J693J047L10n05j299k013k701
$$ 480916 483338 485043 486818 489328 492445 495614 498422 500704 502397 503444 503754 503249 501950 499937 497236
61704D97236l314l642l605l474l521l670l703l667l861m452n248n769n517m477
$$ 497236 493922 490280 486675 483201 479680 476010 472307 468640 464779 460327 455079 449310 443793 439316
61690D39316l228k378j953j792k213l587n245n775m701l138k342k303k259j991
$$ 439316 436088 433710 431757 429965 427752 424165 418920 413145 408444 405306 402964 400661 398402 396411
61676C96411j898k150k411k276j611n84K88M38k23j203j995k386k210j285R5J098
$$ 396411 394513 392363 389952 387676 386065 385481 385769 386207 385984 384781 382786 380400 378190 376905 377000 378098
61660C78098J222Q68P07Q03P02K20k67k74K28P83R84J024J483K449L269L490L573
$$ 378098 379320 380188 380895 381698 382400 382620 382353 382079 382307 383090 384074 385098 386581 389030 392299 395789 399362
61643C99362M079M664M547L699K670J581K02j156j887k167k743l612m034l856
$$ 399362 403441 408105 412652 416351 419021 420602 420804 419648 417761 415594 412851 409239 405205 401349
61629D01349l790m115m265l947l599l394k881j978j272r01k25Q91J566J226M25
$$ 401349 397559 393444 389179 385232 381633 378239 375358 373380 372108 371207 370982 371873 373439 374665 375090
61614C75090k63j108k239k880k445j630j532k305l416m465n092m820l863l309
$$ 375090 374827 373719 371480 368600 366155 364525 362993 360688 357272 352807 347715 342895 339032 335723
61600C35723l688m054l428k463k485l418l903l307k496k512l329m114m069k935
$$ 335723 332035 327981 324553 322090 319605 316187 312284 308977 306481 303969 300640 296526 292457 289522
61586B89522j175K56O51K27j70qM71O43K39l52m56N3N39L39m08j104j466j549
$$ 289522 288347 288603 289254 289481 289311 289303 289774 290417 290656 290304 289848 289901 290440 290779 290371 289267 287801 286252
61568B86252j218l75N07Q16O77O47P70P44Q32J501K278K172J317R11J312J503
$$ 286252 285034 284659 285166 285982 286659 287306 288076 288820 289652 291153 293431 295603 296920 297831 299143 300646
61552C00646P92j38m64l93m22m55k06K08O42J091J270P87J3j48M40J077J557K405
$$ 300646 301438 301300 300836 300443 300021 299566 299360 299568 300210 301301 302571 303358 303371 303223 303663 304740 306297 308702
61534C08702L488L799L006J987J372Q11J57q1L7l49j288j660j180j108k126l008
$$ 308702 312190 315989 318995 320982 322354 323165 323322 323241 323278 322929 321641 319981 318801 317693 315567 312559
61518C12559k542j316m43J33Q28J283J237J326J756J512J57r25n86J91j0p13p04
$$ 312559 310017 308701 308258 308391 309219 310502 311739 313065 314821 316333 316490 315565 314979 315170 315160 314447 313743
61501C13743k86m32p26k32L70l17j792k136r28K69L75l6j85j33r5J4J17O2J73
$$ 313743 313457 313025 312299 312067 312437 312120 310328 308192 307264 307533 307908 307872 307687 307554 307459 307473 307590 307652 307825
61482C07825Q25J642K032K181K497K553J726M87j99m21q78j298p87L63P91J50
$$ 307825 308650 310292 312324 314505 317002 319555 321281 321768 321569 321148 320270 318972 318185 318548 319339 319489
61466C19489l05L71J456J636O87l66m15N64J404J025o7l15P23J700J625J353J933
$$ 319489 319184 319555 321011 322647 323334 322968 322553 323117 324521 325546 325479 325164 325887 327587 329212 330565 332498
61449C32498K689K361J176K98o6m33n87J6R18J284J416K040K654K270J457J753
$$ 332498 335187 337548 338724 339022 338956 338523 337936 337952 338870 340154 341570 343610 346264 348534 349991 351744
61433C51744L149M013L548K685K283K060J575R77M60Q1J46P21R68K14o34j94J152
$$ 351744 354893 358906 362454 365139 367422 369482 371057 372034 372494 372575 372721 373442 374410 374624 373990 373796 374948
61416C74948J746J273J028J533J730R40j35q61j607k560l034k633j943j490j081
$$ 374948 376694 377967 378995 380528 382258 383198 383063 382202 380595 378035 375001 372368 370425 368935 367854
61401C67854o74p52j418k086k469k825l015k461j361p25p91o51J19O62K80l82
$$ 367854 367180 366428 365010 362924 360455 357630 354615 352154 350793 350068 349277 348626 348745 349407 349687 349305
61385C49305l42M71J518K393K818K612K088J760J503Q29J14M18J820L063L265
$$ 349305 348963 349434 350952 353345 356163 358775 360863 362623 364126 364955 365069 365487 367307 370370 373635
61370C73635K929K772K655K216J664J303J059R21J104J443J410J097J256K059
$$ 373635 376564 379336 381991 384207 385871 387174 388233 389154 390258 391701 393111 394208 395464 397523
61356C97523K778L072L584M733N923O583P082P951Q984R757J0290J0485R705P643
$$ 397523 400301 403373 406957 411690 417613 424196 431278 439229 448213 457970 468260 478745 488450 496093
61342D96093N121L290K494K389K681L133L304K925K290J784J245J93j454l178
$$ 496093 501214 504504 506998 509387 512068 515201 518505 521430 523720 525504 526749 526942 525488 522310
61328E22310m295m507m197m099m427m476l569k122j230j229j408j106m02L54J051
$$ 522310 518015 513508 509311 505212 500785 496309 492740 490618 489388 488159 486751 485645 485243 485597 486648
61313D86648J686K232K721L186L542L937M947O861R087J0824J2043J3047J3438
$$ 486648 488334 490566 493287 496473 500015 503952 508899 515760 524847 535671 547714 560761 574199
61300E74199J2460J0136P259M398J764k66j510k618m344o249p233p162o944p047
$$ 574199 586659 596795 604054 608452 610216 609950 608440 605822 601478 595229 587996 580834 573890 566843
61286E66843p088o867o697o639o391n954n470m569k902j133j77L91J730L612M506
$$ 566843 559755 552888 546191 539552 533161 527207 521737 517168 514266 513133 512956 513347 515077 518689 523195
61271E23195L971L375L765M422M214L191K217J911K503L903N549O899Q181R795
$$ 523195 527166 530541 534306 538728 542942 546133 548350 550261 552764 556667 562216 569115 577296 587091
61257E87091J1079J0873R366Q039P441O522M553K410J161N58l08j743l439n004
$$ 587091 598170 609043 618409 626448 633889 640411 644964 647374 648535 649093 648785 647042 643603 638599
61243F38599n975o038n567n300n298m994m312l777l477l002k511k701l454l770
$$ 638599 632624 626586 621019 615719 610421 605427 601115 597338 593861 590859 588348 585647 582193 578423
61229E78423l239k478j826q02P85K356L509M345M692M244L635L987N125N649N138
$$ 578423 575184 572706 570880 570078 570863 573219 576728 581073 585765 590009 593644 597631 602756 608405 613543
61214F13543M767N317O081O294O144N710M437K414Q21K30j34p23o29Q64L024M961
$$ 613543 618310 623627 629708 636002 642146 647856 652293 654707 655528 655758 655624 654901 654272 655136 658160 663121
61198F63121O951R425J1803J3435J4765J6533J8551K0104K0736J9995J7429J3594
$$ 663121 670072 679497 691300 704735 719500 736033 754584 774688 795424 815419 832848 846442
61186H46442J0086P789O047M163K568J661O93j073l071m324m833n239n806o585
$$ 846442 856528 864317 870364 874527 877095 878756 879449 878376 875305 870981 866148 860909 855103 848518
61172H48518p754r099r920j0118j0556j1672j2721j3098j3361j4142j5006j5229
$$ 848518 840764 831665 821745 811627 801071 789399 776678 763580 750219 736077 721071 705842
61160G05842j4877j4311j3506j2605j2211j2348j1970j0300p814n265k665RK149
$$ 705842 690965 676654 663148 650543 638332 625984 614014 603714 595900 590635 587970 587979 590128
61147E90128L354L994M190L156M21l109o171q384r798j0053q934p060n265l846
$$ 590128 593482 597476 601666 604822 605243 602134 595963 587579 577781 567728 558794 551734 546469 542623
61133E42623k767j877o39J454L864N454O163P106Q739J0297J1436J2892J4934
$$ 542623 539856 537979 537340 538794 542658 548112 554275 561381 570120 580417 591853 604745 619679
61120F19679J6718J7831J9027K0694K2073K2744K3400K4452K5344K5847K6423
$$ 619679 636397 654228 673255 693949 716022 738766 762166 786618 811962 837809 864232
61109H64232K6619K5017K1721J8947J8040J7709J6337J4175J1936R151N424J572
$$ 864232 890851 915868 937589 956536 974576 992285 1008622 1022797 1034733 1043884 1049308 1050880
61097A050880k010o377j1886j6794j9664k1410k3282k4622k4559k4167k4703k5216
$$ 1050880 1048870 1042493 1030607 1013813 994149 972739 949457 924835 900276 876109 851406 826190
61085H26190k4156k2098k0601j9575j7975j6071j4802j3774j2065j0167r034q072
$$ 826190 802034 779936 759335 739760 721785 705714 690912 677138 665073 654906 645872 637800
61073F37800o138l750k246j537p04lj37k74R72L112M408M596M959O012O998P493
$$ 637800 631662 627912 625666 624129 623425 623422 623285 623011 623983 627095 631503 636099 641058 647070 654068 661561
61057F61561P837Q244Q907J0522J3271J5879J7082J7413J8149J9379K0550K1945
$$ 661561 669398 677642 686549 697071 710342 726221 743303 760716 778865 798244 818794 840739
61045H40739K3966K5885K6872K7461K8472K9522L0112L0964L2683L4346L5093
$$ 840739 864705 890590 917462 944923 973395 1002917 1033029 1063993 1096676 1131022 1166115
61034A166115L5718L6981L7990L8226L9333M2638M6516M8623M9039M8832M7574
$$ 1166115 1201833 1238814 1276804 1315030 1354363 1397001 1443517 1492140 1541179 1590011 1637585
61023A637585M5134M4028M6687N2020N7913O5200P5529Q7180R7082J05519J14782
$$ 1637585 1682719 1726747 1773434 1825454 1883367 1948567 2024096 2111276 2208358 2313877 2428659
61012B428659J25032J36192J52235J78186K14029K57078L08885L73599M51250
$$ 2428659 2553691 2689883 2842118 3020304 3234333 3491411 3800296 4173895 4625145
61003D625145N41085O51319P96931R88730J235763J553630J938669K308679K488118
$$ 4625145 5166230 5817549 6614480 7603210 8838973 10392603 12331272 14639951 17128069
60994A7128069K303169J727485R33426J85774l19029n18885m36206j24117L11267
$$ 17128069 19431238 21158723 22092149 22277923 21958894 21440009 21003803 20879686 21190953
60985B1190953O73943P36441L84488k90225j050731j670365k040518k166395k106107
$$ 21190953 21864896 22601337 22985825 22695600 21644869 19974504 17933986 15767591 13661484
60976A3661484j927223j692103j448304j220650j016501q38612o89392n66949
$$ 13661484 11734261 10042158 8593854 7373204 6356703 5518091 4828699 4261750
60968D261750m65428l80693l11910k57922k16011j84045j60612j43125j28589
$$ 4261750 3796322 3415629 3103719 2845797 2629786 2445741 2285129 2142004 2013415
60959B013415j15946j05359r5737q5455p4767o5152n6792m8906m1919l7111l4536
$$ 2013415 1897469 1792110 1696373 1610918 1536151 1470999 1414207 1365301 1323382 1286271 1251735
60948A251735l3290l3175l4102l4686l3581l1615l0528l0174k9055k7094k5670
$$ 1251735 1218445 1185270 1151168 1116482 1082901 1051286 1020758 990584 961529 934435 908765
60937I08765k5181k4698k3906k3397k3088k2163k0620j9291j8282j6924j5212
$$ 908765 883584 858886 834980 811583 788495 766332 745712 726421 708139 691215 676003
60926F76003j3884j3044j2030j0683r493q562p500o262n140m076k938k132k026
$$ 676003 662119 649075 637045 626362 616869 608307 600807 594545 589405 585329 582391 580259 578233
60913E78233k090j498k47J132K392L347L537L074K980L666L963K803J012N1j32
$$ 578233 576143 574645 574398 575530 577922 581269 584806 587880 590860 594526 598489 601292 602304 602355 602223
60898F02223n49j198j310j070j367k192k767l053l638m349m440m046m052m625
$$ 602223 601674 600476 599166 598096 596729 594537 591770 588717 585079 580730 576290 572244 568192 563567
60884E63567n164n653o686q129r070r145q862q588q244p992q049p848o562m562
$$ 563567 558403 552750 546064 537935 528865 519720 510858 502270 494026 486034 477985 470137 463575 459013
60870D59013l280l404m148m495m262l745l094k319j335O4J808L190L504K923K192
$$ 459013 455733 452329 448181 443686 439424 435679 432585 430266 428931 428995 430803 433993 437497 440420 442612
60855D42612J674J287J158J576K388L085L388L304K823K112J712J930K321K308
$$ 442612 444286 445573 446731 448307 450695 453780 457168 460472 463295 465407 467119 469049 471370 473678
60841D73678K002J789J478O11o96j938k972l861m290l865k863k036j702j589j369
$$ 473678 475680 477469 478947 479558 478862 476924 473952 470091 465801 461936 459073 457037 455335 453746 452377
60826D52377q93j90L20J5j076k020k121j835j936k262k127j619j586k400l490
$$ 452377 451484 451294 451614 451629 450553 448533 446412 444577 442641 440379 438252 436633 435047 432647 429157
60811D29157m054l852l310l147l767m730n139m681l893l283k822k458k421k661
$$ 429157 425103 421251 417941 414794 411027 406297 401158 396477 392584 389301 386479 384021 381600 378939
60797C78939k748k658k903l522l813l479l088k891k260r67O1P4l67m37k44j19
$$ 378939 376191 373533 370630 367108 363295 359816 356728 353837 351577 350610 350671 350745 350378 349941 349697 349578
60781C49578K86J121J581J165Q16J517K597K786K226K065K545K939L016L168L395
$$ 349578 349864 350985 352566 353731 354547 356064 358661 361447 363673 365738 368283 371222 374238 377406 380801
60766C80801L362L275L553L867L591K913K474K170J443M75p1k64p32j444j818
$$ 380801 384163 387438 390991 394858 398449 401362 403836 406006 407449 407924 407853 407589 406857 405413 403595
60751D03595j850k033k285k011j227o00l39n1L15K78l51j286k351l567m684n372
$$ 403595 401745 399712 397427 395416 394189 393589 393250 393199 393514 393792 393441 392155 389804 386237 381553 376181
60735C76181n772o128o106n300m180l679l927m221m150l902l523k781j766r19
$$ 376181 370409 364281 358175 352875 348695 345016 341089 336868 332718 328816 325293 322512 320746 319827
60721C19827l82L4L18K96J93M85J167J700J664J141N08J76L24O15N28J57K20R76
$$ 319827 319445 319479 319797 320093 320286 320771 321938 323638 325302 326443 326951 327127 327451 328066 328594 328751 328971 329947
60703C29947J844K397K940L526L436K352J277J333K269L106L579L967M111L685
$$ 329947 331791 334188 337128 340654 344090 346442 347719 349052 351321 354427 358006 361973 366084 369769
60689C69769L042K766K807K829K917L076K658J293j21m33K42R61J389J769J915
$$ 369769 372811 375577 378384 381213 384130 387206 389864 391157 391036 390603 390845 391806 393195 394964 396879
60674C96879J397M13m04p91p41j98L46k91k466m729n467m844m062l472k764k262
$$ 396879 398276 398689 398285 397494 396753 396555 396901 396610 394144 389415 383948 379104 375042 371570 368806 366544
60658C66544k434k662k033j016p45j043p35L02J046J193J550K462L294L570L352
$$ 366544 364110 361448 359415 358399 357654 356611 355876 356178 357224 358417 359967 362429 365723 369293 372645
60643C72645K485P23j303k540k934l335l952m142l643k859j994j031m60p36j168
$$ 372645 375130 375853 374550 372010 369076 365741 361789 357647 354004 351145 349151 348120 347660 346924 345756
60628C45756o24O61J403J311J404K096K489J864O91k55p82r54q39p15q03p67k71
$$ 345756 345132 345793 347196 348507 349911 352007 354496 356360 357051 356796 356014 355060 354221 353506 352703 351936 351665
60611C51665K68M02O31J503K218J638L59M7Q75J316O78oJ01N04O64Q56J178J078
$$ 351665 351933 352335 352966 354469 356687 358325 358684 358731 359606 360922 361600 361594 361695 362199 362863 363719 364897 365975
60593C65975M97K42O64J131J257J529K102K200J354K31l89o02q18j009r38n36
$$ 365975 366472 366714 367378 368509 369766 371295 373397 375597 376951 377182 376793 376191 375373 374364 373426 372890
60577C72890K47J265J890J696J385K021L494M759N578O677Q276R828J1276J3101
$$ 372890 373137 374402 376292 377988 379373 381394 384888 389647 395225 401902 410178 420006 431282 444383
60563D44383J4909J5452J4440J2816J0950Q044L919j90l304n760p901r010q450
$$ 444383 459292 474744 489184 502000 512950 520994 524913 524723 521419 515659 507758 498748 490298
60550D90298o722m590k253m5J171J238J358K576M429N867O777P879R744J2578
$$ 490298 483576 478986 476733 476688 477859 479097 480455 483031 487460 493327 500104 507983 517727 530305
60536E30305J6249J9998K2714K3839K3466K1435J7397J2006O868K748j083n192
$$ 530305 546554 566552 589266 613105 636571 658006 675403 687409 694277 697025 695942 690750
60524F90750q779j0771j1170j0546r198p539o430o261o341n867m889l788k535
$$ 690750 681971 671200 660030 649484 640286 632747 626317 620056 613715 607848 602959 599171 596636
60511E96636j040L80J452K287K904L078L041L628N382Q141J1754J6318K1510K6561
$$ 596636 595596 595976 597428 599715 602619 605697 608738 612366 617748 625889 637643 653961 675471 702032
60497G02032L1267L6105M1133M5716M9602N3099N5868N6744N5224N1879M6714
$$ 702032 733299 769404 810537 856253 905855 958954 1014822 1071566 1126790 1178669 1225383
60486A225383L8483K6490J2016k920j7265l0575m2022n0785n6797o0276o1133
$$ 1225383 1263866 1290356 1302372 1299452 1282187 1251612 1209590 1158805 1102008 1041732 980599
60475I80599n9562n6510n2826m8532m3555l8462l3817k9524k5405k1848j9203
$$ 980599 921037 864527 811701 763169 719614 681152 647335 617811 592406 570558 551355
60464E51355j7169j5280j3477j1772j0051q489p465o762n759m599m121m304m075
$$ 551355 534186 518906 505429 493657 483606 475117 467652 460890 455131 450532 446411 442107 438032
60451D38032l150k673l347m173m097l571l502l616l139k200j454r78n35l29m64
$$ 438032 434882 432209 428862 424689 420592 417021 413519 409903 406764 404564 403110 402132 401597 401268 400804
60436D00804m31OR7p82j913k199j675j183j110j331j710j845j013O76J815J435
$$ 400804 400373 400379 400476 399694 397781 395582 393907 392724 391614 390283 388573 386728 385715 386391 388206 389641
60420C89641M65L29Q72R54M73K89M92L83O1M78J648K203J295q3m01N31J592J826
$$ 389641 390106 390435 391307 392261 392734 393023 393515 393898 393959 394437 396085 398288 399583 399500 399099 399630 401222 403048
60402D03048J281N99K36K09L31M99O77Q45J129J829L013M177M704M531L979L181
$$ 403048 404329 404928 405164 405373 405704 406203 406880 407725 408854 410683 413696 417873 422577 427108 431087 434268
60386D34268K234J651J843K306K186J655J741K717L667L886L656L419L146K833
$$ 434268 436502 438153 439996 442302 444488 446143 447884 450601 454268 458154 461810 465229 468375 471208
60372D71208K677K452J694Q13Q53J770K221J546P14O15P28M20L32J309K823L710
$$ 471208 473885 476337 478031 478844 479697 481467 483688 485234 485948 486563 487291 487711 488043 489352 492175 495885
60356D95885L913M380N645P401R150J0573J1521J2169J2808J3122J2218R752O386
$$ 495885 499798 504178 509823 517224 526374 536947 548468 560637 573445 586567 598785 608537 614923
60343F14923K838p59m216o867q405r305r976j0196r822r170q312o977n482m691
$$ 614923 617761 617002 612786 605919 597514 588209 578233 568037 558215 549045 540733 533756 528274 523583
60329E23583m570m068k999k666l747m987n037m387m186m182l338j718l32M60J200
$$ 523583 519013 514945 511946 509280 505533 500546 495509 491122 486936 482754 479416 477698 477366 477826 479026
60314D79026K241L465M868O633Q783J1195J3655J5579J6355J6279J6397J7038
$$ 479026 481267 484732 489600 496233 505016 516211 529866 545445 561800 578079 594476 611514
60302F11514J7400J6829J5436J3152R575N178J216k280o805j2748j8132k1048
$$ 611514 628914 645743 661179 674331 683906 689084 690300 688020 681215 668467 650335 629287
60290F29287k1790k1314j9319j5611j1863r945r378q314o384m766m044l710l477
$$ 629287 607497 586183 566864 551253 539390 529445 520067 511753 505369 500603 496559 492849 489372
60277D89372l535l743l773l764l834l533k758k367k818l054k052o11k54j148k319
$$ 489372 485837 482094 478321 474557 470723 467190 464432 462065 459247 456193 454141 453530 453276 452128 449809
60262D49809l113l194k135m19K68o96j501m85J191J482Q06R91J875J735O40N11
$$ 449809 446696 443502 441367 440948 441216 440520 439019 438534 439725 441207 442013 443004 444879 446614 447254 447765
60246D47765J787K725K336J654J508J304N79j16o04j423k224j670L08J823J567
$$ 447765 449552 452277 454613 456267 457775 459079 459658 459542 458938 457515 455291 453621 453929 455752 457319
60231D57319M70j6J10J88L88J255K528L410L511K906J790O15R3O02J857L281M372
$$ 457319 457789 457773 457883 458071 458459 459714 462242 465652 469163 472069 473859 474474 474567 475169 477026 480307 484679
60214D84679M835M921N409O607P590P293O095N332N460N745N657N427N191M645
$$ 484679 489514 494435 499844 506451 514041 521334 527429 532761 538221 543966 549623 555050 560241 564886
60200E64886L815L191K966K811K532K255J999J721J606J638J167k80k108l366
$$ 564886 568701 571892 574858 577669 580201 582456 584455 586176 587782 589420 590587 590307 588199 584833
60186E84833l971m311m200l341k398k261k630k581k195k242k514k068r97m12n13
$$ 584833 580862 576551 572351 569010 566612 564351 561721 559140 556945 554703 552189 550121 549124 548712 548199
60171E48199k81O33J179N25q15j935k580k775k470j924j678j766j658j085l04
$$ 548199 547918 548551 549730 550255 549440 547505 544925 542150 539680 537756 536078 534312 532654 531569 531265
60156E31265N07J345J925J896J457J033N99N4q7O40J637J926J565J315J347J372
$$ 531265 531772 533117 535042 536938 538395 539428 540027 540081 539994 540634 542271 544197 545762 547077 548424 549796
60140E49796J625K469L411L813M189N285O434O426N681N691O482O554N411M105
$$ 549796 551421 553890 557301 561114 565303 570588 577022 583448 589129 594820 601302 607856 613267 617372
60126F17372L092J602l59j365p55K72N93O31J077J551J546J438J590J586J180
$$ 617372 620464 622066 621707 620342 619587 619859 620452 621083 622160 623711 625257 626695 628285 629871 631051
60111F31051R84J300J268J14j623k944l715m277m461l886k892k352k726l693m554
$$ 631051 632035 633335 634603 634717 633094 630150 626435 622158 617697 613811 610919 608567 605841 602148 597594
60096E97594m752m254l509k819j950o94N63J440K255L300L893L214J804J030J252
$$ 597594 592842 588588 585079 582260 580310 579616 580179 581619 583874 587174 591067 594281 596085 597115 598367
60081E98367J618J575J393J279J104R49R17M84q34k446l522m464o123p915q433
$$ 598367 599985 601560 602953 604232 605336 606285 607202 607686 606852 604406 600884 596420 590297 582382 573949
60066E73949p762p371p690p667o955o543o740o421n064l863l821m271m102l308
$$ 573949 566187 558816 551126 543459 536504 529961 523221 516800 511736 507873 504052 499781 495679 492371
60052D92371k357j215J40J191J666K034K643L145L201K957K605K277K500L644
$$ 492371 490014 488799 488939 490130 491796 493830 496473 499618 502819 505776 508381 510658 513158 516802
60038E16802M822M579K825R62p2n95r72j088j224j927k698k377j219r68k381m230
$$ 516802 521624 526203 529028 529990 529918 529323 528351 527263 526039 524112 521414 519037 517818 516850 514469 510239
60022E10239n338n923o405o456o067n969o206n801m598l897m341m757m118l156
$$ 510239 504901 498978 492573 486117 480050 474081 467875 462074 457476 453579 449238 444481 440363 437207
60008D37207k860k829k333j813j944k218j790r06l58j63J24M71O44P52Q38N96
$$ 437207 434347 431518 429185 427372 425428 423210 421420 420514 420156 419993 420117 420588 421232 421984 422822 423418
59992D23418J51L12J373K471K804K678K722K879K869K826K811K433J459K53q74
$$ 423418 423569 423881 425254 427725 430529 433207 435929 438808 441677 444503 447314 449747 451206 451459 450585
59977D50585j941k767k952k669k503k451k011j311r10n94L22J460J803J612K067
$$ 450585 448644 445877 442925 440256 437753 435302 433291 431980 431070 430476 430798 432258 434061 435673 437740
59962D37740K945K787J727J738L287M216L165J801K019K978K750J346J56l71o99
$$ 437740 440685 443472 445199 446937 450224 454440 457605 459406 461425 464403 467153 468499 468655 468284 467585
59947D67585q78q06j025j848k514k368k052k431l240l800m104m220l711k560j674
$$ 467585 466707 465901 464876 463028 460514 458146 456094 453663 450423 446623 442519 438299 434588 432028 430354
59932D30354j514j395q42l41L8J162L054M299M376M756O352P711P397O333N901
$$ 430354 428840 427445 426603 426262 426300 427462 430516 434815 439191 443947 450299 458010 465407 471740 477641
59917D77641N389L531J170R1J99J16k54Q6J108J888K378L216M225M755N020N467
$$ 477641 483030 486561 487731 487822 488021 488137 487883 487969 489077 490965 493343 496559 500784 505539 510559 516026
59901E16026N459M231K563J791J725J237M18K67O83O07L5J07J299K871M170N091
$$ 516026 521485 525716 528279 530070 531795 533032 533450 533717 534400 535007 535042 535149 536448 539319 543489 548580
59885E48580N391M836L980L707M140M855N699O464O392N186L907L638L820L127
$$ 548580 553971 558807 562787 566494 570634 575489 581188 587652 594044 599230 603137 606775 610595 613722
59871F13722J451k89j691k965l924m197m114m207m265l887l400l196k890k230
$$ 613722 615173 614884 613193 610228 606304 602107 597993 593786 589521 585634 582234 579038 576148 573918
59857E73918j940k461k731j664N7J101J637K757M542O354Q292J0590J2037J0970
$$ 573918 571978 569517 566786 565122 565179 566280 567917 570674 575216 581570 589862 600452 612489 623459
59843F23459P590L754P19j448k548k148o60P86J573J645P15j323l671n477o892
$$ 623459 631049 634803 635522 634074 631526 629378 628718 629504 631077 632722 633437 632114 628443 622966 616074
59828F16074q162q462p095n085m024l979m034m143m790n473n397n059n367n761
$$ 616074 607912 599450 592355 587270 583246 579267 575233 571090 566300 560827 555430 550371 545004 539243
59814E39243n111l975l925m929n428m825l976l333k537j755j523j383m74O47O44
$$ 539243 534132 530157 526232 521303 515875 511050 507074 503741 501204 499449 497926 496543 496069 496716 497360
59799D97360k71n93r8k9p18j072o86m52o08k38P90J246N93j29j57j87r46j902
$$ 497360 497089 496496 496398 496369 495651 494579 493893 493441 492833 492595 493385 494631 495224 495095 494938 494751 493805 491903
59781D91903k292k215k071j821j353p51M1J015J558J150M72O80J629K113J800
$$ 491903 489611 487396 485325 483504 482151 481400 481441 482456 484014 485164 485636 486316 487945 490058 491858
59766D91858J545J776K008K058K369K909L129L134L601M394M654M387M585N565
$$ 491858 493403 495179 497187 499245 501614 504523 507652 510786 514387 518781 523435 527822 532407 537972
59752E37972O596P284P938Q345P758O430N799O566P863Q650Q825Q572P836O787
$$ 537972 544568 551852 559790 568135 575893 582323 588122 594688 602551 611201 620026 628598 636434 643221
59738F43221N843M926L600K009P17k63j216j729j318p96j459k933l508k734j990
$$ 643221 649064 653990 657590 659599 660316 660053 658837 657108 655790 654994 653535 650602 647094 644360 642370
59723F42370k140k375k014j817k640l983m732m519l741k937k542k651k808k638
$$ 642370 640230 637855 635841 634024 631384 627401 622669 618150 614409 611472 608930 606279 603471 600833
59709F00833k448k494k111p26P21Q08j38m54L23R20M51m95j139j417j342p96j71
$$ 600833 598385 595891 593780 593054 593775 594583 594445 593991 594314 595234 595685 595190 594051 592634 591292 590496 590325
59692E90325l7j07K34N20j75j362j515m86K53o1n82o38o93j122j508j723k248
$$ 590325 590288 590181 590415 590935 590760 589398 587883 587397 587650 587589 587007 586369 585676 584554 583046 581323 579075
59675E79075l076l606l956m912o301o924o430n731n284m494l231k365k302k401
$$ 579075 575999 572393 568437 563525 557224 550300 543870 538139 532855 528361 525130 522765 520463 518062
59661E18062k221j957j375J7J537J782R22P72K067L452L807L734L927L806K778
$$ 518062 515841 513884 512509 512526 514063 515845 516767 517539 519606 523058 526865 530599 534526 538332 541110
59646E41110J396K99p10j760k404k728l607n084n847n099l738k912k599k341k115
$$ 541110 542506 542805 542095 540335 537931 535203 531596 526512 520665 515566 511828 508916 506317 503976 501861
59631E01861j828j095j38J38m21r66j189j820l095m050l966l241k404j537j053
$$ 501861 500033 498938 498800 498938 498517 497551 496362 494542 491447 487397 483431 480190 477786 476249 475196
59616D75196j609k783l358l199l304l647k842o15J328J816J718K049K343J993
$$ 475196 473587 470804 467446 464247 460943 457296 454454 453839 455167 456983 458701 460750 463093 465086
59602D65086J588J659J576Q62L47Q11J694K194K446K654K319J337O60Q86J306
$$ 465086 466674 468333 469909 470771 471118 471929 473623 475817 478263 480917 483236 484573 485233 486119 487425
59587D87425J201R04P57L12n67j064q29p89j621k593k812k447j901r96J31N74
$$ 487425 488626 489530 490287 490599 490032 488968 488139 487350 485729 483136 480324 477877 475976 474980 475111 475685
59571D75685k5q27j206j539j963j771p67J39M71Q21J295R67k51r35l67K96M1n00
$$ 475685 475660 474833 473627 472088 470125 468354 467587 467726 468197 469018 470313 471280 471029 470094 469727 470023 470064 469564
59553D69564o85j109j885j613L35K220K360J724K223L779M981N577O382P669R504
$$ 469564 468879 467770 465885 464272 464607 466827 469187 470911 473134 476913 481894 487471 493853 501522 511026
59538E11026J2909J8678K5174K8824K6941J9515Q980j036p631j0443j1137j0779
$$ 511026 523935 542613 567787 596611 623552 643067 652047 651011 643380 632937 621800 611021
59526F11021q858n317j772L96J663K853L454K767J430L01r50k781m499n456o373
$$ 611021 602163 596846 595074 595470 597133 599986 603440 606207 607637 607938 606988 604207 599708 594252 587879
59511E87879p984r509r867r394q928q300p229o566o987p418o441m550l414l538
$$ 587879 579895 570386 560519 551125 542197 533897 526668 520102 513115 505697 499256 494706 491292 487754
59497D87754m055m167l590k211n40K40k50q43n40O4J13K9M85J022J118J401K411
$$ 487754 483699 479532 475942 473731 473191 473431 473181 472338 471798 471862 471975 472004 472489 473511 474629 476030 478441
59480D78441L197K717J673J441K120L003L975N005N307M468L506L341L302K553
$$ 478441 481638 484355 486028 487469 489589 492592 496567 501572 506879 511347 514853 518194 521496 524049
59466E24049J798J994K531K382J969K104K247J661J318K588M883O556P370Q205
$$ 524049 525847 527841 530372 532754 534723 536827 539074 540735 542053 544641 549524 556080 563450 571655
59452E71655Q959Q798P943P309O861O011N068M542L631J284j840m290o138q376
$$ 571655 580614 589412 597355 604664 611525 617536 622604 627146 630777 632061 630221 625931 619793 611417
59438F11417j0483j0794r145p189o020n183m078k776j297M48J912K413K309K610
$$ 611417 600934 590140 580995 573806 567786 562603 558525 555749 554452 554900 556812 559225 561534 564144
59424E64144L656N215P432J0407J3246J4956J5938J7256J8783J9586K0057K2162
$$ 564144 567800 573015 580447 590854 604100 619056 634994 652250 671033 690619 710676 732838
59412G32838K7100L3219L6399L2501K0527M171j0487j9589k3421k3878k1746j7081
$$ 732838 759938 793157 829556 862057 882584 886755 876268 856679 833258 809380 787634 770553
59400G70553j0253j398R201J8617K1305J4140M32j3039k1953k5973k6206k3883
$$ 770553 760300 758902 768103 786720 808025 822165 822597 809558 787605 761632 735426 711543
59388G11543k0597j7351j3660r381o283n779o226n026k510j165j602j986j216
$$ 711543 690946 673595 659935 650554 644271 638492 632266 627240 624730 623565 621963 619977 618761
59375F18761j48M16O90P81M53R3K65N38K79O2O73J421J308J110K218M079N008
$$ 618761 618613 619029 619719 620500 620953 621046 621311 621849 622128 622190 622863 624284 625592 626702 628920 632999 638007
59358F38007M946N239O169O992P903R674J1651J2532J2752J3822J5586J6544J6628
$$ 638007 642953 648192 654361 661353 669256 678930 690581 703113 715865 729687 745273 761817 778445
59345G78445J7133J8052J7949J6530J4922J3393J1146Q412O315M481J296l217
$$ 778445 795578 813630 831579 848109 863031 876424 887570 895982 902297 906778 908074 904857
59333I04857p163r709j1953j4500j6478j7372j7717j7576j6452j5034j4807j5545
$$ 904857 897694 887985 876032 861532 845054 827682 809965 792389 775937 760903 746096 730551
59321G30551j5342j3611j1856j0941r869q055o645o611p262p623p703p616o841
$$ 730551 715209 701598 689742 678801 668932 660877 654232 647621 640359 632736 625033 617417 610576
59308F10576n176l232j544j09J047K087L971P522J1939J5520J7413J7190J3538
$$ 610576 605400 602168 600624 600515 601562 603649 607620 615142 627081 642601 660014 677204 690742
59295F90742N754l860j1404j5338j7058j7703j6904j4706j2264j0084p626n015
$$ 690742 696496 692636 681232 665894 648836 631133 614229 599523 587259 577175 569549 564534
59283E64534l188k102p86O83J343J510K632M806O736Q181J0095J2222J3164J3075
$$ 564534 561346 559244 558458 559141 560484 561994 564626 569432 576168 584349 594444 606666 619830 632905
59269F32905J3697J5200J5686J4368J2670J1510J0034P863N968M386J676k223
$$ 632905 646602 661802 677488 691856 704526 716036 726070 733933 739901 744287 745963 743740
59257G43740n086n608n267n800o952p868q585q895p827n577m041m109m262l077
$$ 743740 738654 733046 727779 721979 715027 707159 698574 689679 681852 676275 672234 668125 663863 660786
59243F60786j289r2Q21K232L862N178O368P491Q006P855P666P283N782L417J653
$$ 660786 659497 659405 660226 662458 666320 671498 677866 685357 693363 701218 708884 716167 721949 725366 727019
59228G27019O60j186m429p335q556q937r569j0028r852r858j0593j1067j0409
$$ 727019 727679 726493 722064 714729 706173 697236 687667 677639 667787 657929 647336 636269 625860
59215F25860r279q511p786o778o176o403o654o157n205m154k811j487j153j790
$$ 625860 616581 608070 600284 593506 587330 580927 574273 568116 562911 558757 555946 554459 553306 551516
59201E51516k100j480q11p02n72n0M21Q93K080L739M631M550M473M457L596K384
$$ 551516 549416 547936 547125 546423 545851 545801 546222 547115 549195 552934 557565 562115 566588 571045 574641 577025
59185E77025K590M201N103M582M380N349N898N070M307M608M603L238J907K030
$$ 577025 579615 583816 588919 593501 597881 603230 609128 614198 618505 623113 627716 630954 632861 634891
59171F34891K789L104L656N046O073N790N277N461N179L381J318N00K14r01k541
$$ 634891 637680 640784 644440 649486 655559 661349 666626 672087 677266 680647 681965 682465 682679 681778 679237
59156F79237l963n765q377j0451j0840j0672j1329j1944j1047r337q492q387p733
$$ 679237 675274 669509 661132 650681 639841 629169 617840 605896 594849 585512 577020 568633 560900
59143E60900o560n968o047n926n355m705m022l327l095l350l246k422j646j318
$$ 560900 554340 548372 542325 536399 531044 526339 522317 518990 515895 512545 509299 506877 505231 503913
59129E03913p65Q6J75n23k33J888M195N162N587O606P505P433P404Q580J0120
$$ 503913 503148 503234 503409 502886 502653 504541 508736 513898 519485 526091 533596 541029 548433 557013 567133
59114E67133J0756J0967J1618J1956J0949R301Q296P895P671Q067Q938Q551O008
$$ 567133 577889 588856 600474 612430 623379 632680 640976 648871 656542 664609 673547 682098 688106
59101F88106L132J894J547M64r09j330j480k735m357m520l391k697k880k846k072
$$ 688106 691238 693132 694679 695143 694234 692904 691424 688689 684332 679812 676421 673724 670844 667998 665926
59086F65926r65L19J545J563m17l211m975n485n744o129o419o743p101o862n985
$$ 665926 664961 665280 666825 668388 667971 664760 659785 654300 648556 642427 636008 629265 622164 615302 609317
59071F09317n623o242o512n449m154l929m222m093m019m472m359k906j478j470
$$ 609317 603694 597452 590940 585491 581337 577408 573186 569093 565074 560602 556243 553337 551859 550389
59057E50389j991j724j436k267l128k412r62o73j308j256m75r7o7M24R42O53K79
$$ 550389 548398 546674 545238 542971 539843 537431 536469 535796 534488 533232 532757 532660 532593 533017 533959 534612 534891
59040E34891Q07J291L67r46o28R02J421M50l99k99J01O47K021M090N876P121Q337
$$ 534891 535698 536989 537356 536410 535782 536684 538105 538555 538156 537857 537958 538605 540626 544716 550592 557713 566050
59023E66050R587J0788J2504J4905J6665J6519J5052J3335J0963P247L165O5k465
$$ 566050 575637 586425 598929 613834 630499 647018 662070 675405 686368 693615 696780 696845 694380
59010F94380n314p636q189p763p857p895o236l189n63J068K401L419L733M156
$$ 694380 689066 681430 673241 665478 657621 649726 643490 640301 639738 640806 643207 646626 650359 654515
58996F54515N605P019O646M836L394K846K416J927J555N92j413l159l453l452
$$ 654515 660120 667139 673785 678621 682015 684861 687277 689204 690759 691351 689938 686779 683326 679874
58982F79874m698o086n503l352j654n46J365L814N177N512O412Q055R135R498
$$ 679874 675176 669090 663587 660235 658581 658035 659400 663214 668391 673903 680315 688370 697505 707003
58968G07003J0183J1094J1171J0672J0836J1492J1429J0782J0651J0752R842Q040
$$ 707003 717186 728280 739451 750123 760959 772451 783880 794662 805313 816065 825907 833947
58956H33947O298M204P82l092n815q013j1526j5830j8440j8668j8167j7802j6737
$$ 833947 840245 844449 845231 842139 836324 828311 816785 800955 782515 763847 745680 727878 711141
58943G11141j4755j2855j1350r689q112p310o685n165l365k678k716k048q35k75
$$ 711141 696386 683531 672181 662492 654380 647070 640385 635220 631855 629177 626461 624413 623578 623303
58929F23303j04O95J411O52p86j018m04p46j808j836j109j530k949l255k108j338
$$ 623303 623199 623894 625305 625957 625171 624153 623749 623003 621195 619359 618250 616720 613771 610516 608408 607070
58913F07070j576j634j202j064o98J177L672M596M176M675O414P573P989R504
$$ 607070 605494 603860 602658 601594 600896 602073 605745 610341 614517 619192 625606 633179 641168 650672
58899F50672J2227J4032J4207J4228J4443J3530J1766J1343J2780J4321J5468
$$ 650672 662899 676931 691138 705366 719809 733339 745105 756448 769228 783549 799017
58888G99017J7648K0760K2664K2866K3132K3602K1907J7387J2547R069N732J632
$$ 799017 816665 837425 860089 882955 906087 929689 951596 968983 981530 990599 996331 997963
58876I97963j971m562p782j2207j5691j6727j6740j7231j7310j5716j3027j0293
$$ 997963 995992 991430 983648 971441 955750 939023 922283 905052 887742 872026 858999 848706
58864H48706p704n808n698o848p130o087n749p145q674r096r456j0641j1582j1381
$$ 848706 841002 835194 829496 822648 815518 809431 803682 796537 787863 778767 769311 758670 747088 735707
58850G35707j0854j0578r675p830o309n738n143m271m589o657q785r581r685r915
$$ 735707 724853 714275 704600 696770 690461 684723 679580 675309 670720 664063 655278 645697 636012 626097
58836F26097r766q915q156p780o975n637m768m426l455j822r13r38n76L94O63
$$ 626097 616331 607416 599260 591480 584505 578868 574100 569674 566219 564397 563484 562546 561970 562364 563027
58821E63027K56R11K953M546M896N290O159O076M661L588L596L352K339J898K332
$$ 563027 563283 564194 567147 571693 576589 581879 588038 594114 598775 602363 605959 609311 611650 613548 615880
58806F15880J917Q1j422j688k060l109l277k008j244k218l567m127m845o338p292
$$ 615880 617797 617878 616456 614768 612708 609599 606322 604314 603070 600852 597285 593158 588313 581975 574683
58791E74683o881o198n904n003l272k193k155j521L32J866K462L549N399O002
$$ 574683 567802 561604 555700 550697 547425 545232 543077 541556 541888 543754 546216 549765 555164 561166
58777E61166M702L772M635N618N099L857K614L81k884n103n428n752p082p611
$$ 561166 565868 569640 574275 579893 584992 588849 591463 591844 588960 583857 578429 572677 565595 557984
58763E57984o289n051n330n466l905j964j066j25J962L973M707N019N441M643
$$ 557984 551695 546644 541314 535848 531943 529979 528913 528788 530750 534723 539430 544449 549890 554533
58749E54533K347Q22J275J684N00n74J32J249J277J573L660O214P377P565P636
$$ 554533 556880 557702 558977 560661 561161 560587 560719 561968 563245 564818 568478 574692 582069 589634 597270
58734E97270O922N458N313P260Q869Q367P456P823Q036O689N458N898O181M387
$$ 597270 604192 609650 614963 622223 631092 639459 646915 654738 662774 669463 674921 680819 687000 691387
58720F91387K302K488M122N040N570O990Q364Q346P998Q677R028P280M564K816
$$ 691387 693689 696177 700299 705339 710909 717899 726263 734609 742607 751284 760312 767592 772156 774972
58706G74972J321j570n077p404q881j0899j3274j5247j7382k0089k1980k1995
$$ 774972 776293 774723 769646 762242 753361 742462 729188 713941 696559 676470 654490 632495
58694F32495k1182k0337j8270j4569j1416j0206r156o846n103n584o499n847m966
$$ 632495 611313 590976 572706 558137 546721 536515 527359 520513 515410 509826 503327 497480 492514
58681D92514n528n947m294k121j712k078j273j83l18l09J583L818M277M296O119
$$ 492514 486986 481039 476745 474624 472912 470834 469561 469378 469060 468751 470334 474152 478429 482725 488844
58666D88844Q686R849J0666J3228J6250J6959J5597J3984J1459O493P07k940m689
$$ 488844 497530 507379 518045 531273 547523 564482 580079 594063 605522 612015 612722 609782 605093
58653F05093o722q767q979p965p875q552q262p220o847o587n046l095k459k361
$$ 605093 598371 589604 580625 572660 564785 556233 547971 540751 533904 527317 522271 519176 516717 514356
58639E14356r83J020J777J648K200L090L189L237M148M423K549K38j06O74M48
$$ 514356 513373 514393 516170 517818 520018 523108 526297 529534 533682 538105 540654 540892 540786 541460 541908
58624E41908l07j22O1j056j780q1K358K805K245L269N155N482M823N308O086M834
$$ 541908 541601 541479 541540 540484 538704 538623 540981 543786 546031 549300 554455 559937 564760 570068 576154 580988
58608E80988K411J443J468L7k483l662l461l680m000k930j547j972l179k655j104
$$ 580988 583399 584842 586310 586347 583864 580202 576741 573061 569061 566131 564584 562612 559433 556778 555674
58593E55674j130k325k075l06R31J627L295N296N988O480Q855J1812J2444J1282
$$ 555674 554544 552219 550144 549838 550769 552396 555691 560987 566975 573455 582310 594122 606566 617848
58579F17848J1041J1515J0417Q264P556P920O863M692M047N121N925O630R075
$$ 617848 628889 640404 650821 659085 666641 674561 681424 686116 690163 695284 701209 707839 716914
58566G16914J2602J4885J6290J9014K2644K4935K6060K7620K8493K6394K2495
$$ 716914 729516 744401 760691 779705 802349 827284 853344 880964 909457 935851 958346
58555I58346J9645J7024J1657M355j038l662n778p665p644o601p195q917q979
$$ 958346 977991 995015 1006672 1011027 1009989 1006327 1000549 992884 985240 978639 971444 962527 953548
58542I53548p778q367j1019j3323j5141j8183k1323k1717k0148j9773k0092j7820
$$ 953548 945770 937403 926384 913061 897920 879737 858414 836697 816549 796776 776684 758864
58530G58864j3362j0544r919q210m592j831q40L37J770J347m52q22nr22l361l970
$$ 758864 745502 734958 725039 716829 712237 710406 709566 709903 711673 713020 712568 711746 711741 710819 707458 703488
58514G03488k321j504k307k377j441j891l654m007k921l196m886n020l224k169
$$ 703488 701167 699663 697356 694979 693538 691647 687993 683986 681065 677869 672983 667963 664739 662570
58500F62570k243j336qj084l852m560k947k323l007j922Q94J902Q26J272L794
$$ 662570 660327 658991 658983 657899 654047 649487 646540 644217 641210 639288 640182 642084 642910 644182 647976
58485F47976M864L797M196P208R694J0460J2033J4834J5866J4705J4579J5919
$$ 647976 652840 656637 660833 668041 677735 688195 700228 715062 730928 745633 760212 776131
58473G76131J4985J0525N799K454j533o338q877q635q908j0564j0547q052o182
$$ 776131 791116 801641 807440 809894 808361 802023 793146 784511 775603 765039 754492 746440 740258
58460G40258n796l888K58L366M302N897Q998J0741J0325J0475J1581J0435O403
$$ 740258 734462 730574 730832 734198 738500 744397 753395 764136 774461 784936 796517 806952 813355
58447H13355K766O56k283n974p230o094o219p748o814l273j614k700k180J115
$$ 813355 816121 816777 814494 808520 801290 795196 788977 781229 774415 771142 769528 766828 764648 765763
58433G65763K887J566J067L087M230L281L759O679Q320P663Q403J1079J1088P234
$$ 765763 768650 770216 771283 774370 778600 781881 785640 792319 800639 808302 816705 827784 838872 846106
58419H46106M233L877J879l332o988o683o531q940j0276q602p694r351r655o920
$$ 846106 850339 854216 856095 852763 845775 839092 832561 823621 813345 804743 797049 787698 778043 771123
58405G71123n462p210p602m164j237j659j626J440L766K774K119M376O206N484
$$ 771123 765661 758451 750849 746685 745448 743789 742163 743603 747369 750143 752262 756638 762844 768328
58391G68328N602Q040Q425M870K382M003N442L456J715L104M255L074L592P828
$$ 768328 773930 781970 790395 795265 797647 801650 807092 810548 812263 815367 819622 822696 826288 834116
58377H34116J0789R228P426Q675R114N877L158M150N046L080K341N404P478N354
$$ 834116 844905 854133 861559 870234 879348 885225 888383 892533 897579 900659 903000 908404 915882 921236
58363I21236L865O780R633Q454P290R958J2421J0695Q376R049R112N474K442L578
$$ 921236 925101 931881 941514 949968 957258 967216 979637 990332 998708 1007757 1016869 1022343 1024785 1028363
58349A028363M605J829m76J544L673K010P59L899P241O697O248R743J3020J2286
$$ 1028363 1032968 1034797 1034321 1035865 1039538 1041548 1042307 1046206 1053447 1060144 1066392 1076135 1089155 1101441
58335A101441J1945J5856J9257J7771J5882J7925J9335J5664J1571J1782J1845
$$ 1101441 1113386 1129242 1148499 1166270 1182152 1200077 1219412 1235076 1246647 1258429 1270274
58324A270274P185K586L156M600K016l76J975M418K215K35L494P055N645M147
$$ 1270274 1277459 1280045 1283201 1287801 1289817 1289441 1291416 1295834 1298049 1298284 1301778 1308833 1314478 1318625
58310A318625P987J2330J1529J0036J3089J6017J3911J2183J6070J9587J6705
$$ 1318625 1326612 1338942 1350471 1360507 1373596 1389613 1403524 1415707 1431777 1451364 1468069
58299A468069J3462J6682K0871J8965J5881J8312K1313J8561J5584J9017K3050
$$ 1468069 1481531 1498213 1519084 1538049 1553930 1572242 1593555 1612116 1627700 1646717 1669767
58288A669767K0744J8188K2696K7725K4898K0422K3440K8626K6869K2954K5683
$$ 1669767 1690511 1708699 1731395 1759120 1784018 1804440 1827880 1856506 1883375 1906329 1932012
58277A932012L0439K8917K6260L0918L7274L6232L3193L7468M3759M2732L9857
$$ 1932012 1962451 1991368 2017628 2048546 2085820 2122052 2155245 2192713 2236472 2279204 2319061
58266B319061M4753N1938N1577M9109N4249O0971N9085N5040N9976O7601O5924
$$ 2319061 2363814 2415752 2467329 2516438 2570687 2631658 2690743 2745783 2805759 2873360 2939284
58255B939284O0419O3088O9132O7630O4555P1244Q0734Q0224P6301Q2568R3206
$$ 2939284 2999703 3062791 3131923 3199553 3264108 3335352 3416086 3496310 3572611 3655179 3748385
58244C748385R4845R3388J02039J14130J15846J14442J24848J39940J44113J44360
$$ 3748385 3843230 3936618 4038657 4152787 4268633 4383075 4507923 4647863 4791976 4936336
58234D936336J56628J73633J78852J80084J95107K16524K26271K32097K52652
$$ 4936336 5092964 5266597 5445449 5625533 5820640 6037164 6263435 6495532 6748184
58225F748184K79639K93580L03581L30761L66288L88647M07898M47498M97464
$$ 6748184 7027823 7321403 7624984 7955745 8322033 8710680 9118578 9566076 10063540
58216A0063540N33830N68764O29821P05756P68076Q29802R23814J040384J149921
$$ 10063540 10597370 11166134 11795955 12501711 13269787 14099589 15023403 16063787 17213708
58207A7213708J269735J438899J645124J851737K078709K376376K741065L148907
$$ 17213708 18483443 19922342 21567466 23419203 25497912 27874288 30615353 33764260
58199C3764260L651286M334060N204411O232264P477605R046916J0962728J3247551
$$ 33764260 37415546 41749606 46954017 53186281 60663886 69710802 80673530 93921081
58191I3921081J6110439J9856694K4656603L0636466L7999909M6323233N3341722
$$ 93921081 110031520 129888214 154544817 185181283 223181192 269504425 322846147
58184C22846147N5058222M8090974L2386639J1551563r437948k6762496l8615900
$$ 322846147 377904369 425995343 458381982 469933545 460495597 433733101 395117201
58177C95117201m4761812m5993321m3750617l9578621l4610970k9505042k4684868
$$ 395117201 350355389 304362068 260611451 221032830 186421860 156916818 132231950
58170A32231950k0436824j6839762j3820744j1320229r316656p731190o438683
$$ 132231950 111795126 94955364 81134620 69814391 60497735 52766545 46327862
58163D6327862n372131m523425l853307l290274k809465k429318k134833j877410
$$ 46327862 40955731 36432306 32578999 29288725 26479260 24049942 21915109 20037699
58155B0037699j644710j460973j321585j190958j062094r58392q78413p94660
$$ 20037699 18392989 16932016 15610431 14419473 13357379 12398987 11520574 10725914
58147A0725914p05470o35624n86168n32703m72450m26410l95624l59967l20061
$$ 10725914 10020444 9384820 8798652 8265949 7793499 7367089 6971465 6611498 6291437
58138F291437k97317k91890k81194k60779k47707k42894k28336k03370j87090
$$ 6291437 5994120 5702230 5421036 5160257 4912550 4669656 4441320 4237950 4050860
58129D050860j82357j71960j52843j40815j38522j30895j15582j07178j07928
$$ 4050860 3868503 3696543 3543700 3402885 3264363 3133468 3017886 2910708 2802780
58120B802780j03525r1373q4780q5817q1389o9583o3425o5050o1830n1712m7399
$$ 2802780 2699255 2607882 2523102 2437285 2355896 2286313 2222888 2157838 2096008 2044296 1996897
58109A996897n1695n2694m7229m5720n0094m9689m2884m0610m4634m3969l6595
$$ 1996897 1945202 1892508 1845279 1799559 1749465 1699776 1656892 1616282 1571648 1527679 1491084
58098A491084l3528l7337l7485l1152k8349l1935l2359k6830k4484k7754k7283
$$ 1491084 1457556 1420219 1382734 1351582 1323233 1291298 1258939 1232109 1207625 1179871 1152588
58087A152588k0243j5810j7555j7740j3800j3494j8837k1498j8860j8691k3291
$$ 1152588 1132345 1116535 1098980 1081240 1067440 1053946 1035109 1013611 994751 976060 952769
58076I52769k4770k0568j8282k0610k0624j6327j4901j8124j8326j3279j0607
$$ 952769 927999 907431 889149 868539 847915 831588 816687 798563 780237 766958 756351
58065G56351j2955j3198q792o678r306r745n390k962n189n982l393l964r455j2489
$$ 756351 743396 730198 721406 714728 705422 695677 690287 687325 682136 676154 672761 668797 659342 646853
58051F46853j0292r649j3256j4297r864o871q933r883o195l748o142p917n611
$$ 646853 636561 626912 613656 599359 589495 582624 573691 563808 557613 553865 547723 539806 534195
58038E34195m333p179q873o097l838n493o620m355l221n971q110p019p028j0193
$$ 534195 529862 522683 513810 507713 503875 498382 491762 487407 484186 478215 470105 463086 456058 445865
58024D45865j1453q312n951p415p983m633j870k751l168n25Q70j469k893n41J095
$$ 445865 434412 426100 420149 412734 404751 400118 398248 395497 392329 391804 392674 391205 388312 387771 388866
58009C88866r66k335Q4K001Q9j693J7J681K18r32J022K469N53j034Q50K792J459
$$ 388866 387900 385565 385649 387650 387739 386046 386063 387744 387962 387030 388052 390521 391074 390040 390890 393682 395141
57992C95141m63k48l55k598l783k219j794m543o063l532j339l291o059n854n064
$$ 395141 394678 394430 394075 391477 387694 385475 383681 379138 373075 369543 368204 364913 358854 353000 347936
57977C47936o450p215m687k050k512l509k107o26j536k319o80O88l61p32J820
$$ 347936 341486 334271 329584 327534 325022 321513 319406 318780 317244 314925 314245 314933 314572 313840 315660
57962C15660L654J646q37J11K365K510J938K745K603o32l923m103l403m777o275
$$ 315660 319314 320960 320123 320234 322599 325109 327047 329792 332395 331763 327840 323737 320334 315557 309282
57947C09282n182l345l281l306j489n8j004j610Q23M055N343O393R294J1924J2167
$$ 309282 304100 300755 297474 294168 292679 292621 291617 290007 290830 294885 300228 306621 315915 327839 340006
57932C40006J2155J3692J3991J0751O947N623M481O51l594n111n553p618r688
$$ 340006 352161 365853 379844 390595 397542 403165 407646 408297 404703 399592 394039 386421 376733
57919C76733r470q905j0317j1573j0149q140q164q190n652k767k489k889r10J919
$$ 376733 367263 358358 348041 336468 326319 318179 310015 301825 296173 293406 290917 288028 287118 289037
57905B89037K783K994M758O089M421K018K275L781L362K014K442L652L228K245
$$ 289037 291820 294814 299572 305661 310082 312100 314375 318156 321518 323532 325974 329626 332854 335099
57891C35099K772L296J727Q1J063K809K153L46L28J044k08k369k806k542m033
$$ 335099 337871 341167 342894 342975 344038 346847 349000 349346 349674 350718 350510 348141 345335 342793 338760
57876C38760o079o088n173n891p137o334m623m721n712m957l237l028l541k334
$$ 338760 332681 326593 321420 315529 308392 302058 297435 292714 287002 282045 278808 275780 272239 269905
57862B69905o4J095J835L878N834N566M664N790P665P477O207O565P689O972N271
$$ 269905 269841 270936 272771 276649 282483 288049 292713 298503 306168 313645 319852 326417 334106 341078 346349
57847C46349N138N619L956R51m16k41p26j515r26k90j990m624n062l895l917m737
$$ 346349 351487 357106 361062 362013 361597 361356 360630 359115 358189 357899 355909 351285 346223 342328 338411 333674
57831C33674m048k782l590n432n040k869k244l405l618k507k083k068m51J771
$$ 333674 329626 326844 323254 317822 312782 309913 307669 304264 300646 298139 296056 293988 293537 295308
57817B95308J589n09j076L32O60j211l339n006p415r941j0270q591p472p350o324
$$ 295308 296897 296388 295312 295644 296304 295093 291754 286748 279333 269392 259122 250531 243059 235709 229385
57802B29385m397l708m374m257l004k373k502j757l32p2p40l05J102J418O54Q35
$$ 229385 224988 221280 216906 212649 209645 207272 204770 203013 202681 202609 201869 201564 202666 204084 204738 205573
57786B05573K015K311J784K342L858M343L953M850P050Q323Q302Q840J0158J0400
$$ 205573 207588 209899 211683 214025 217883 222226 226179 231029 238079 246402 254704 263544 273702 284102
57772B84102R157P857O701M792K945K642K619M38k936m321l682l872n269n466
$$ 284102 293259 301116 307817 312609 315554 318196 320815 321253 318317 313996 310314 306442 301173 295707
57758B95707m409m998p856j0080j0071r332q629o630l451j408j113o31N39M88
$$ 295707 291298 286300 278444 268364 258293 248961 240332 233702 230251 228843 227730 227099 227638 228126
57744B28126j081j811q04q5p56j309q53n07m61Q04L159M204L200K302K744L139
$$ 228126 227045 225234 224430 224345 223589 222280 221427 220920 220459 221263 224422 228626 231826 234128 236872 240011
57728B40011K764L025M307M669L201J668J382J351Q00O52J300J660J574K314L681
$$ 240011 242775 245800 250107 254776 257977 259645 261027 262378 263178 263830 265130 266790 268364 270678 274359
57713B74359L490J121j278k195k590l338l696l486l956n268n838n228n069o005
$$ 274359 277849 278970 277692 275497 272907 269569 265873 262387 258431 253163 247325 242097 237028 231023
57699B31023o464n441m002k966j826p78j169k866l907l639l486l833l137j107
$$ 231023 224559 219118 215116 212150 210324 209546 208377 205511 201604 197965 194479 190646 187509 186402
57685A86402K67K4k84L97R85Q71J290K797M127M927O935J0973J5422J9123K3328
$$ 186402 186669 186693 186409 186806 187791 188662 189952 192749 196876 201803 208738 219711 235133 254256 277584
57670B77584K9402L7132M6637N9253P4298Q6731Q9651P8441N2766J7273j9029
$$ 277584 306986 344118 390755 450008 524306 611037 700688 779129 831895 849168 830139
57659H30139m7124o3610p0795p1516o6670n7902m8744m1329l4738k8071k2469
$$ 830139 783015 719405 648610 577094 510424 452522 403778 362449 327711 299640 277171
57648B77171j8767j5850j2816j0386q815o925m526l228l541l675k543j430j366
$$ 277171 258404 242554 229738 219352 210537 203612 199086 195858 192317 188642 186099 184669 183303
57635A83303j340n36J45J84O07J742K173J318N79O60K46j322k600k632k496k857
$$ 183303 181963 181427 181572 181756 182363 184105 186278 187596 188175 188835 189081 187759 185159 182527 180031 177174
57619A77174k658j636j437k628l244k038o10n62r90o25j02j94j73L62K00j170
$$ 177174 174516 172880 171443 168815 165571 163533 162923 162361 161371 160746 160644 160450 160277 160639 160839 159669
57603A59669k207j908j545k168k677k055j332j554j937j736j774k612l248l084
$$ 159669 157462 155554 154009 151841 149164 147109 145777 144223 142286 140550 138776 136164 132916 129832
57589A29832l029l349k870j537j098j943k162j216j245l001l841k089m9o8p45
$$ 129832 126803 123454 120584 119047 117949 116006 113844 112628 111383 108382 104541 102452 102403 102335 101590
57574A01590nJ000L29r67q75j58o81j841j833r68p60j068r22p91j427j891j181
$$ 101590 101585 102585 102914 101947 101072 100914 100233 98392 96559 95591 94831 93763 92841 92050 90623 88732 87551
57557H7551l86p16j099j72R55O37j84L99J914K498K048J737J508O63j49J02Q71
$$ 87551 87165 86449 85350 85178 86133 86770 86586 86985 88899 91397 93445 95182 96690 97353 97204 97306 98177
57540I8177J252J883L429M607L998K519J700J033n19j934j780j074j656k930k997
$$ 98177 99429 101312 104741 109348 113346 115865 117565 118598 118079 116145 114365 113291 111635 108705 105708
57525A05708k023j592j639q72M07O77j05o36n65m64j81N88R06k0r04j38J416J677
$$ 105708 103685 102093 100454 99582 99989 100666 100561 99925 99360 98896 98715 99303 100209 100189 99285 99147 100563 102240
57507A02240N84l06n95j017j327o99L23M84m2k43l58j267k490k850k511k401k374
$$ 102240 102824 102518 101923 100906 99579 98880 99203 99687 99645 99402 99044 97777 95287 92437 89926 87525 85151
57490H5151j815j231j341j504r79o16j327k129j812j171j333j292K89K179K315
$$ 85151 83336 82105 80764 79260 78281 77665 76338 74209 72397 71226 69893 68601 68890 71069 73384
57475G3384J179O42M54r10k817l121j762o63l92J87J157J316O08J75O8n86j377
$$ 73384 74563 75205 75659 74749 71932 68811 67049 66386 65994 66181 67338 68654 69262 69437 69505 68919 67542
57458F7542j053J7K85l41o08l75n20q14l27L68r6j240j322k87L35J62Q9Q0n72
$$ 67542 66489 66506 66791 66450 65842 65467 64947 64133 63806 64174 64078 62838 61516 61229 61564 61726 61815 61895 61323
57439F1323j118j59J576J955Q20mR8n2q27j297j340j697j928q72Q38J343N97K78
$$ 61323 60205 60046 61622 63577 64397 64393 64491 64439 63612 62315 60975 59278 57350 56478 57316 58659 59256 59534
57421E9534P66Q67N22Q93J655J100p06j684j076l50l72k88K31L12j06J6N96L68
$$ 59534 60300 61167 61689 62582 64237 65337 64631 62947 61871 61521 61149 60861 61092 61404 61298 61314 61910 62278
57403F2278n56o64O4j42j693k855k689k267k264j897r95o29q55k88J309K346K088
$$ 62278 61722 61058 61122 60980 59287 56432 53743 51476 49212 47315 46320 45691 44836 44548 45857 48203 50291
57386E0291J663J682J234J01m24J70O67M13L19Q09R82O67J017K228K777J904P44
$$ 50291 51954 53636 54870 54971 54547 54717 55384 55797 56116 56925 57907 58574 59591 61819 64596 66500 67244
57369F7244J59l91j024p81L08P18k5n33j17M3o35q41K05J207R69J87j04m1J33
$$ 67244 67403 67012 65988 65207 65515 66233 66208 65675 65558 65601 64966 64125 64330 65537 66506 66693 66589 66548 66681
57350F6681P44J328N80j331k320j338K08Q83J000J003L59p76r39K82J261R57M86
$$ 66681 67425 68753 69333 68002 65682 64344 64552 65435 66435 67438 67797 67021 66082 66364 67625 68582 69068
57333F9068Q31J068L51m42n39p70j694k134j224j75l31j073j239j006q39k15J042
$$ 69068 69899 70967 71318 70876 70337 69567 67873 65739 64515 64340 64009 62936 61697 60691 59852 59637 60679
57316F0679J681Q96j51j87J89p3n84n72m39o93o75J59Q78N53j10l2M53M73J53
$$ 60679 62360 63256 63105 62918 63107 63034 62450 61878 61439 60746 60071 60230 61108 61661 61551 61519 61972 62445 62598
57297F2598j8k72p32o75J48O12j34j187j231l00Q44J898K584K320J326Q23J193
$$ 62598 62580 62308 61576 60901 61049 61661 61527 60340 59109 58809 59653 61551 64135 66455 67781 68604 69797
57280F9797J320O36J94O92J192R64Q83J615K149J643J130J808L056L682L748L709
$$ 69797 71117 71753 71947 72639 73831 74795 75678 77293 79442 81085 82215 84023 87079 90761 94509 98218
57264I8218L260K492K614L935M689L600K070J979K752K675J780J349J519J481
$$ 98218 101478 103970 106584 110519 115208 118808 120878 122857 125609 128284 130064 131413 132932 134413
57250A34413J209J146R47K06l41M6O52N68M27J194K197K131J260Q77J274J812
$$ 134413 135622 136768 137715 137921 137580 137626 138278 138846 139273 140467 142664 144795 146055 146932 148206 150018
57234A50018K326K885K892K038J401K108L576M435M525M510M406L982L818M408
$$ 150018 152344 155229 158121 160159 161560 163668 167244 171679 176204 180714 185120 189102 192920 197328
57220A97328N013M903M839N790O994P032O141N688N988O328O707P745R141R828
$$ 197328 202341 207244 212083 217873 224867 231899 238040 243728 249716 256044 262751 270496 279637 289465
57206B89465R540R048Q961R286R842J0241J0025R574J0070J1745J3192J3383J3179
$$ 289465 299005 308053 317014 326300 336142 346383 356408 365982 376052 387797 400989 414372 427551
57193D27551J3627J4084J3542J2661J2800J3811J4476J4351J3800J2925J1877
$$ 427551 441178 455262 468804 481465 494265 508076 522552 536903 550703 563628 575505
57182E75505J1469J2021J2473J1948J1310J1676J2464J2519J2156J2383J2891
$$ 575505 586974 598995 611468 623416 634726 646402 658866 671385 683541 695924 708815
57171G08815J2700J2040J1882J2141J2075J1899J2350J3143J3454J3467J3891
$$ 708815 721515 733555 745437 757578 769653 781552 793902 807045 820499 833966 847857
57160H47857J4492J4550J4322J4582J5211J5629J6029J6764J7180J6529J5471
$$ 847857 862349 876899 891221 905803 921014 936643 952672 969436 986616 1003145 1018616
57149A018616J5201J5664J5951J5878J5800J5520J4739J4037J4033J4258J4076
$$ 1018616 1033817 1049481 1065432 1081310 1097110 1112630 1127369 1141406 1155439 1169697 1183773
57138A183773J3971J4628J5589J6111J6540J7478J8467J8907J9325K0399K1714
$$ 1183773 1197744 1212372 1227961 1244072 1260612 1278090 1296557 1315464 1334789 1355188 1376902
57127A376902K2883K4743K7873L1050L2832L3683L4867L6327L7385L8503M0575
$$ 1376902 1399785 1424528 1452401 1483451 1516283 1549966 1584833 1621160 1658545 1697048 1737623
57116A737623M3411M6666N1290N8245O6767P5705Q5566R7513J11342J26311J42967
$$ 1737623 1781034 1827700 1878990 1937235 2004002 2079707 2165273 2262786 2374128 2500439 2643406
57105B643406J62315J84184K08481K37186K73379L19103L75739M45468N30912
$$ 2643406 2805721 2989905 3198386 3435572 3708951 4028054 4403793 4849261 5380173
57096E380173O34607P60267R12852J095560J307788J546999J810048K091052K380175
$$ 5380173 6014780 6775047 7687899 8783459 10091247 11638246 13448294 15539346 17919521
57087A7919521K666105K936822L176493L365469L485449L519926L447363L242341
$$ 17919521 20585626 23522448 26698941 30064410 33549859 37069785 40517148 43759489
57079D3759489K892342K410013J821605J148014M08272l60113j098713j753463
$$ 43759489 46651831 49061844 50883449 52031463 52439735 52079622 50980909 49227446
57071D9227446k297454k727306l046153l256112l360564l365043l276816l108200
$$ 49227446 46929992 44202686 41156533 37900421 34539857 31174814 27897998 24789798
57063B4789798k879124k612792k329440k045420j774809j527764j308421j116974
$$ 24789798 21910674 19297882 16968442 14923022 13148213 11620449 10312028 9195054
57055I195054r52924q14795o98881o01020n18781m50432l93382l45308l05340
$$ 9195054 8242130 7427335 6728454 6127434 5608653 5158221 4764839 4419531 4114191
57046D114191k72475k44323k18959j96523j77523j60941j45405j30852j17667
$$ 4114191 3841716 3597393 3378434 3181911 3004388 2843447 2698042 2567190 2449523
57037B449523j05355r3459q2516p2954o3988n4577m4549l3980k2149p456J1674
$$ 2449523 2344168 2250709 2168193 2095239 2031251 1976674 1932125 1898145 1875996 1868540 1880214
57026A880214L4207N2961N5706L4414n558m8420q0793r9393j07001j06168r9025
$$ 1880214 1914421 1967382 2023088 2057502 2051944 2003524 1922731 1823338 1716337 1610169 1511144
57015A511144q8919p8593o8437n8517n0206m4071l8533l2577k7645k4939k3136
$$ 1511144 1422225 1343632 1275195 1216678 1166472 1122401 1083868 1051291 1023646 998707 975571
57004I75571k0707j8379j7259j6570j5363j4483j4724j4889j3799j2443j2052
$$ 975571 954864 936485 919226 902656 887293 872810 858086 843197 829398 816955 804903
56993H04903j1748j0288q465p610p187n975m227k567j36L982Q647J1798J2590
$$ 804903 793155 782867 774402 766792 759605 753630 749403 746836 746700 750682 759329 771127 783717
56980G83717J0833N833k237j1072j8271k3520k7256k8734k7310k4305k1521j9041
$$ 783717 794550 800383 798146 787074 768803 745283 718027 689293 661983 637678 616157 597116
56968E97116j6194j3401j1241r049o228l712k186k90L478Q431J3286J8505K4580
$$ 597116 580922 567521 556280 547231 541003 537291 535105 534815 538293 546724 560010 578515 603095
56955F03095K9098K8301K1193J0121k093j3592k2740k8295l0379k9916k7393k3331
$$ 603095 632193 660494 681687 691808 689715 676123 653383 625088 594709 564793 537400 514069
56943E14069j9102j5734j2632q862m945j959K86K804N920R595J4316K0418K7295
$$ 514069 494967 479233 466601 457739 452794 450835 451121 453925 459845 469440 483756 504174 531469
56930E31469L4121L9881M1780L5819K1134K357j4373k6556l4902l9736m0586l8245
$$ 531469 565590 605471 647251 683070 704204 706561 692188 665632 630730 590994 550408 512163
56918E12163l4417k9716k4098j8692j5034j2974j1334j0074r820r837q574o005
$$ 512163 477746 448030 423932 405240 390206 377232 365898 355824 346004 336167 327593 321588
56906C21588l569k060j172p28o50j73J389L388M773N703O884Q142R075J0329J2584
$$ 321588 318019 315959 314787 314059 313409 313236 314625 318013 322786 328489 335373 343515 352590 362919 375503
56891C75503J5061J6683J7892J9855K2705K6072L0039L3695L3986K8356J7897
$$ 375503 390564 407247 425139 444994 467699 493771 523810 557505 591491 619847 637744
56880F37744N867n946j7137k6050l0309k9945k7495k4812k1706j7745j3288q458
$$ 637744 643611 637665 620528 594478 564169 534224 506729 481917 460211 442466 429178 420720
56868D20720l034K433P016J1113J6321K3334L1397L9975M9690O0955P1998P8146
$$ 420720 417686 420119 427135 438248 454569 477903 509300 549275 598965 659920 731918 810064
56856H10064P3452N4827K5891m508k8809m5047n4452n7532n4647m8201m1077l3687
$$ 810064 883516 938343 964234 959726 930917 885870 831418 773886 719239 671038 629961 596274
56844E96274k5006j5651p341j3P963J7088K6633L6793M8781O3195Q0255J00316
$$ 596274 571268 555617 548276 548263 556226 573314 599947 636740 685521 748716 828971 929287
56832I29287J20923J33761J28335J00309N5093L543m3940q0031j01343j08838
$$ 929287 1050210 1183971 1312306 1412615 1467708 1471251 1427311 1347280 1245937 1137099
56822A137099j06259r7336q4851p1396n8835m7045l5025k3275j3358n238L022
$$ 1137099 1030840 933504 848653 777257 718422 671377 636352 613077 599719 594481 597503
56811E97503J2847K4153L6752N1083O7053Q2876R4471R5474P9902M7641O762l1689
$$ 597503 610350 634503 671255 722338 789391 872267 966738 1062212 1142114 1189755 1196517 1164828
56799A164828o0927p9536q7858q6894p9868p0949o1761n1636m1125l2271k5344
$$ 1164828 1103901 1024365 936507 849613 769745 698796 637035 585399 544274 512003 486659
56788D86659j8395j0634l468K408Q316J5258K2806L0940M0154M8509N1019M3786
$$ 486659 468264 457630 454162 456570 464886 480144 502950 533890 574044 622553 673572 717358
56776G17358K7557O499j4875l2952m5305n1372n2235m9313m4017l8258l3601k9760
$$ 717358 744915 751414 736539 703587 658282 606910 554675 505362 461345 423087 389486 359726
56764C59726k5501k0968j7486j5231j3018j0427q242o682n136l767l415l863m057
$$ 359726 334225 313257 295771 280540 267522 257095 248853 242171 237035 233268 229853 225990 221933
56751B21933m061m773n717n345l621k170j660j247p11q48j463j263j46N58L82
$$ 221933 217872 213099 207382 202037 198416 196246 194586 193339 192628 191780 190317 189054 188908 189466 189848
56736A89848Q2m06j914l691l723j896l61j67j24L87K22r61j563p53P6j95n62J04
$$ 189848 189930 189524 187610 183919 180196 178300 177939 177772 177648 178035 178257 177296 175733 174980 175056 174861 174299 174403
56718A74403J130J443J162P28L6o09k84R66J894K034K196K503J911L62n93j56
$$ 174403 175533 176976 178138 178866 178902 178293 178009 178975 180869 182903 185099 187602 189513 189875 189282 189126
56702A89126O19R02J261J982K111J197J57l84j003j896k210j630j003p02j44N88
$$ 189126 189745 190647 191908 193890 196001 197198 197355 196971 195968 194072 191862 190232 189229 188527 188383 188971
56686A88971N65j43l94j71o30j579j359Q8O55n38j625j047L53J366K212L024K856
$$ 188971 189536 189393 188999 188828 188198 186619 185260 185348 186003 185465 183840 182793 183146 184512 186724 189748 192604
56669A92604J629R74J702K436J979J087O00j07j396k082j347j73L90P22J202J224
$$ 192604 194233 195207 196909 199345 201324 202411 203011 202904 201508 199426 198079 197906 198296 199018 200220 201444
56653B01444P91J170K667L635K946J671J090Q69M42K85N99N28j17k29M81O41l53
$$ 201444 202235 203405 206072 209707 212653 214324 215414 216283 216725 217010 217609 218137 218020 217791 218272 218913 218560
56636B18560j182r98q35j364j446l34P42P09M00P26J013O00K03L65L62j19k38
$$ 218560 217378 216380 215545 214181 212735 212401 213143 213852 214252 214978 215991 216591 216794 217159 217521 217402 217164
56619B17164K9o79k487l458k685j787j946j994j020k80o82r06L1P56J15n75K8
$$ 217164 217193 216514 214027 210569 207884 206097 204151 202157 201137 200857 200175 199269 199300 200056 200171 199596 199624
56602A99624Q30M13m99p53q24j156p02Q31J505K13j108n87N21L55l17p5K20o80
$$ 199624 200454 200867 200368 199615 198791 197635 196933 197764 199269 199482 198374 197787 198308 198663 198346 198271 198491 197811
56584A97811j540o64Q91J123N12P64J584J540R02Q46J012M44j65L08J113J003
$$ 197811 196271 195607 196498 197621 198133 198897 200481 202021 202923 203769 204781 205225 205060 205368 206481 207484
56568B07484O70J343K258K018J309J683K801L368L686M781O025O139N507N151
$$ 207484 208154 209497 211755 213773 215082 216765 219566 222934 226620 231401 237426 243565 249072 254223
56554B54223M516K665O11J0N06P03P12J332J819R78m43p67oO67J098J636J594
$$ 254223 258739 261404 262015 262025 262531 263234 263946 265278 267097 268075 267632 266865 266859 267526 268624 270260 271854
56537B71854L27j148j692j910k588k784j704p86j473k491k052j128j675l009l040
$$ 271854 272181 271033 269341 267431 264843 262059 260355 259569 258096 255605 253553 252425 250750 247741 244701
56522B44701j985j700k263k178j389j187j682j946k080k747l305k755j750j432
$$ 244701 242716 241016 238753 236575 235186 233999 232317 230371 228291 225544 222239 219484 217734 216302
56508B16302j268k82P10M83j61J89R34Q13M73J112J854J255J67K36Q52M46m03
$$ 216302 215034 214752 215462 215945 215784 215973 216907 217720 218193 219305 221159 222414 222581 222817 223669 224115 223712
56491B23712j74N52L10k28L70J175M63p55l22J009P91o76q35O65J668J337Q75
$$ 223712 223538 224090 224400 224172 224542 225717 226180 225425 225103 226112 226903 226227 225392 226057 227725 229062 229937
56474B29937O34q5p00P7J446J453L45p9R6o63j943j851o17l37j227j410m17L11
$$ 229937 230571 230486 229786 229863 231309 232762 233107 233028 233124 232461 230518 228667 228050 227713 226486 225076 224659 224970
56456B24970L87Q32J464J032o7j55O96Q24K5l96l46p93j241l70J176J563R76J017
$$ 224970 225357 226189 227653 228685 228618 228463 229159 229983 230008 229612 229266 228473 227232 226862 228038 229601 230577 231594
56438B31594J525J040m8j13N05K20m77Q1J087K50j918k567j141K20O81J390K216
$$ 231594 233119 234159 234111 233998 234503 234723 234246 234327 235414 235664 233746 231179 230038 230258 230939 232329 234545
56421B34545J637P3m26J08l00j629j841p96m37r17m03J037J240j7o10LK15j30
$$ 234545 236182 236255 235829 235937 235637 234008 232167 231371 230934 230017 229614 230651 231891 231874 231264 231267 231482 231352
56403B31352N33J825J625K49L78K170K713J080j18P07K062K854L996N416N294
$$ 231352 231885 233710 235335 235584 235962 238132 240845 241925 241807 242514 244576 247430 251426 256842 262136
56388B62136L508K275K242J562k13j018j05O72N07R50K436L149K458J964K086
$$ 262136 265644 267919 270161 271723 271510 270492 270387 271059 271566 272516 274952 278101 280559 282523 284609
56373B84609J195q27j874j462j571k605k365l00J108N56k60k54o17j550j175P23
$$ 284609 285804 284977 283103 281641 280070 277465 275100 274800 275908 276464 276204 275950 275333 273783 272608 273331
56357B73331J681Q04L74J630K660K076J187Q72o1j690j843O6J533J061L91R35
$$ 273331 275012 275816 276190 277820 280480 282556 283743 284615 284554 282864 281021 281087 282620 283681 284072 285007
56341B85007J457R83P57J542K118J949K184K826K251O41L28J581J968R56J026
$$ 285007 286464 287447 288204 289746 291864 293813 295997 298823 301074 301715 302043 303624 305592 306548 307574
56326C07574K797L421J590j20J61Q35O09R22K369K812J291K7L80O36j37l8J693
$$ 307574 310371 313792 315382 315262 315423 316258 316867 317789 320158 322970 324261 324288 324668 325304 325167 325129 326822
56309C26822K729J954J641K994L636K119Q41J748L031K924K933M300N036L525
$$ 326822 329551 331505 333146 336140 339776 341895 342736 344484 347515 350439 353372 357672 362708 366233
56295C66233J709J761K743L245M038N522N924M563L671M550N332M772M588N783
$$ 366233 367942 369703 372446 375691 379729 385251 391175 395738 399409 403959 409291 414063 418651 424434
56281D24434O424N542N343P005Q240P652P470R257J0940J0946J1174J2894J3821
$$ 424434 430858 436400 441743 448748 456988 464640 472110 481367 492307 503253 514427 527321 541142
56268E41142J2405J1052J1914J3467J4278J6032J9641K2507K3162K4409K8420
$$ 541142 553547 564599 576513 589980 604258 620290 639931 662438 685600 710009 738429
56257G38429L2857L5483L8410M3886M9986N4621N9954O8597P8877Q8014R6613
$$ 738429 771286 806769 845179 889065 939051 993672 1053626 1122223 1201100 1289114 1385727
56246A385727J06119J15099J21895J27616J32985J35720J34463J31508J28016
$$ 1385727 1491846 1606945 1728840 1856456 1989441 2125161 2259624 2391132 2519148
56237B519148J20563J06340Q7783O8117M6436K1492l711k5724m5418o4507q1014
$$ 2519148 2639711 2746051 2833834 2901951 2948387 2969879 2966168 2940444 2895026 2830519 2749505
56226B749505r2654j01188j08955j14543j16181j15761j15204j12575j06249r9122
$$ 2749505 2656851 2555663 2446708 2332165 2215984 2100223 1985019 1872444 1766195 1667073
56216A667073r4106q9304q2260p5033p0248o6058o0034n4190n1009m8304m3310
$$ 1667073 1572967 1483663 1401403 1326370 1256122 1190064 1130030 1075840 1024831 976527 933217
56205I33217l8127l5701l4051k9978k5048k2377k0805j7792j4707j3810j3290
$$ 933217 895090 859389 825338 795360 770312 747935 727130 709338 694631 680821 667531
56194F67531j0784q411q832r745p894n110m646n047l522j821k733m157k896j004
$$ 667531 656747 648336 639504 629759 621865 616755 612109 607062 603540 601719 598986 594829 591933 590929
56180E90929k025m122l438j203j009j905p82J174Q90l71M80K233J991J142K478
$$ 590929 588904 584782 581344 580141 579132 577227 576445 577619 578509 578138 578618 580851 582842 583984 586462
56165E86462M290L667K710M863Q028Q057O253O599Q363Q349P761R698J2438J2309
$$ 586462 590752 594419 597129 601992 610020 618077 624330 630929 639292 647641 655402 665100 677538 689847
56151F89847J0904J2373J5925J7929J9078K2573K7502L0994L4523M1269M9859
$$ 689847 700751 713124 729049 746978 766056 788629 816131 847125 881648 922917 972776
56140I72776N7501O6437Q0133R5713J07275J13666J15979J11195R6624P7647O2660
$$ 972776 1030277 1096714 1176847 1272560 1379835 1493501 1609480 1720675 1817299 1894946 1957606
56129A957606N2898M4965L9846M0247M1919L7261K5964J3624K117r923j9500k1912
$$ 1957606 2010504 2055469 2095315 2135562 2177481 2214742 2240706 2254330 2256447 2246524 2227024 2205112
56117B205112j9693k0190k5602l3529m4928o2245q1456r5099j01973j05468j04720
$$ 2205112 2185419 2165229 2139627 2106098 2061170 1998925 1917469 1822370 1720397 1614929 1510209
56106A510209r6559q4005p3378o4701n4039m2996l6219l1890k4740j6408j2588
$$ 1510209 1413650 1329645 1256267 1191566 1137527 1094531 1058312 1026422 1001682 985274 972686
56095I72686j2048q981m224l268m930l111J649L442K477M043P341O799L434L518
$$ 972686 960638 951657 947433 944165 939235 936124 937773 941215 943692 947735 955076 961875 965309 968827
56081I68827O771P353N583P040J0865J0883P669P599J0539J0537Q063R227J3344
$$ 968827 975598 982951 988534 995574 1006439 1017322 1024991 1032590 1043129 1053666 1061729 1070956 1084300
56068A084300J3805J1003J1693J5833J6811J4627J5757J9955K0313J6602J5412
$$ 1084300 1098105 1109108 1120801 1136634 1153445 1168072 1183829 1203784 1224097 1240699 1256111
56057A256111J7033J5495J1603J2169J6224J6006J1765J1324J4885J4944J1563
$$ 1256111 1273144 1288639 1300242 1312411 1328635 1344641 1356406 1367730 1382615 1397559 1409122
56046A409122J2502J7711J9041J6140J7038K2071K3191K0200K1404K6937K8055
$$ 1409122 1421624 1439335 1458376 1474516 1491554 1513625 1536816 1557016 1578420 1605357 1633412
56035A633412K4361K4810L0136L1546K8516L0129L6748L8562L4618L4843M0728
$$ 1633412 1657773 1682583 1712719 1744265 1772781 1802910 1839658 1878220 1912838 1947681 1988409
56024A988409M2649L9085L9403M4762M5773M1953M3542N1069N3637N0682N3998
$$ 1988409 2031058 2070143 2109546 2154308 2200081 2242034 2285576 2336645 2390282 2440964 2494962
56013B494962O4640O9955O7483O9247P7801Q1360P7675P9057Q8171R2890R0780
$$ 2494962 2559602 2629557 2697040 2766287 2844088 2925448 3003123 3082180 3170351 3263241 3354021
56002C354021R4211J05346J11353J10288J15553J28709J35199J33405J39297J55336
$$ 3354021 3448232 3553578 3664931 3775219 3890772 4019481 4154680 4288085 4427382 4582718
55992D582718J64729J64171J71105J90016K03875K08354K20907K45787K64842
$$ 4582718 4747447 4911618 5082723 5272739 5476614 5684968 5905875 6151662 6416504
55983F416504K73928K92284L24358L50157L65712L93274M38223M77785N06728
$$ 6416504 6690432 6982716 7307074 7657231 8022943 8416217 8854440 9332225 9838953
55974I838953N49852O13861O74021P25333P96781Q96702R97756J096056J227364
$$ 9838953 10388805 11002666 11676687 12402020 13198801 14095503 15093259 16189315 17416679
55965A7416679J402883J591858J792140K049938K383706K765546L209196L791575
$$ 17416679 18819562 20411420 22203560 24253498 26637204 29402750 32611946 36403521
55957C6403521M551567N462192O542748P890175R559528J1555805J4010125J7206091
$$ 36403521 40955088 46417280 52960028 60850203 70409731 81965536 95975661 113181752
55949A13181752K1363063K6593758L3075602M0667446M7748748N0739708M5843404
$$ 113181752 134544815 161138573 194214175 234881621 282630369 333370077 379213481
55942C79213481L2041006J2376610p892691k4399459l5258333m0600501m1495167
$$ 379213481 411254487 423631097 415738406 391338947 356080614 315480113 273984946
55935B73984946l9328421l5478336l0988391k6444269k2161103j8361461j5146422
$$ 273984946 234656525 199178189 168189798 141745529 119584426 101222965 86076543
55928H6076543j2466748j0239056q431182p001033n849922m895220m120826l513980
$$ 86076543 73609795 63370739 54939557 47938524 42088602 37193382 33072556 29558576
55920B9558576l018542k589927k234925j958776j726769j511829j328950j189689
$$ 29558576 26540034 23950107 21715182 19756406 18029637 16517808 15188858 13999169
55912A3999169j068934r46994q40920p64766o98959o26613n62575n19900m82623
$$ 13999169 12930235 11983241 11142321 10377555 9678596 9051983 8489408 7969508 7486885
55903G486885m36893l96292l72196l49865l16906k86355k69733k54793k30826
$$ 7486885 7049992 6653700 6281504 5931639 5614733 5328378 5058645 4803852 4573026
55894D573026k09511k00576j92010j73729j56795j50512j43845j27605j12485
$$ 4573026 4363515 4162939 3970929 3797200 3640405 3489893 3346048 3218443 3105958
55885C105958j07400j01774q6993p4478p4943p9329p7114p4642p8865q1192p3946
$$ 3105958 2998558 2896784 2809791 2735313 2660370 2581041 2503927 2429285 2350420 2269228 2195282
55874B195282o5830o5485o5992o0378n6202o0113o3682n9044n3424n4212n4542
$$ 2195282 2129452 2063967 1997975 1937597 1881395 1821282 1757600 1698556 1645132 1590920 1536378
55863A536378m7548m0347m0197m0691l5163l0101l2013l4227k9922k5417k7469
$$ 1536378 1488830 1448483 1408286 1367595 1332432 1302331 1270318 1236091 1206169 1180752 1153283
55852A153283k9923k5820k0768k1591k3462k0739j9016k3818k8522k6004k1703
$$ 1153283 1123360 1097540 1076772 1055181 1031719 1010980 991964 968146 939624 913620 891917
55841H91917k2856k5135k2125j8052j8920k0493j6998j2706j3254j4442j0934
$$ 891917 869061 843926 821801 803749 784829 764336 747338 734632 721378 706936 696002
55830F96002p372r516j2760j0613o434o004o490l539j337m753r127q487o486q804
$$ 696002 688630 679114 666354 655741 649307 643303 636813 633274 631937 627184 618057 609570 603084 594280
55816E94280j2096j0965q687j0432j2719j0107n859n634o813m261n89o42j694
$$ 594280 582184 571219 562532 552100 539381 529274 523415 517781 510968 506707 506118 505476 503782
55803E03782J053M933N349N150Q842J3052J2364R215Q494P722K294m611p092o911
$$ 503782 504835 509768 515117 520267 529109 542161 554525 563740 572234 579956 582250 577639 570547 563636
55789E63636r302j2814j2628r875q704q077n349l834p882j4099j6144j4723j4483
$$ 563636 554334 541520 528892 519017 510313 502236 496887 493053 485171 471072 454928 440205 425722
55776D25722j4721j1743p095m870l702M60O305R325R216Q150N106j079o508p277
$$ 425722 411001 399258 392163 387293 383591 384051 390356 399681 408897 417047 422153 421074 414566 407289
55762D07289o256p974j0576j0044q264r217j0901r005n239m277n461n160m240
$$ 407289 401033 393059 382483 372439 364175 354958 344057 335052 329813 325536 320075 314915 310675
55749C10675n619p478o450m587n653p490n675j866q37j935j217N63j48k281k281
$$ 310675 305056 297578 291128 286541 280888 273398 267723 265857 265020 263085 261868 262431 262283 260002 257721
55734B57721j340k872n072l728l56K12j557j430K23n63l342m053k734k980m589
$$ 257721 256381 253509 248437 244709 244353 244565 243008 241578 241801 241238 237896 233843 231109 228129 223540
55719B23540m144k125k156l804l170l30P58m01k28K201M017M088L961L552J495
$$ 223540 219396 217271 215115 211311 208141 207811 208569 208168 207940 210141 214158 218246 222207 225759 227254
55704B27254o65j57J704J288j164k526k816m526o922o988n246m874n693m804k427
$$ 227254 226589 226432 228136 229424 228260 225734 222918 218392 211470 204482 199236 194362 188669 183865 181438
55689A81438j425j631m17J771K096R60J293K885L054K284L469O036O642N238M729
$$ 181438 180013 178382 177965 179736 181832 182792 184085 186970 190024 192308 195777 201813 208455 213693 218422
55674B18422N022L323N7j374p27j080k821l196j926j663k622k221l80K18n35J08
$$ 218422 223444 226767 226824 225450 224723 223643 220822 217626 215700 214037 211415 209194 208814 209032 208497 208605
55658B08605K306L189K193J736K238J710O12J768M829O046M289K303J287o25l597
$$ 208605 210911 214100 216293 218029 220267 221977 222589 224357 229186 235232 239521 241824 243111 242486 238889
55643B38889m941m020l603n009o253o234o536p845q494p775p020o585n237l138
$$ 238889 233948 229928 226325 221316 215063 208829 202293 194448 185954 178179 171159 164574 159337 156199
55629A56199j955j655o91N45J76j233j226J22L19r94j703j491k166l581l584k280
$$ 156199 154244 152589 151898 152443 152619 151386 150160 150282 150601 149607 147904 146413 144247 140666 137082 134802
55613A34802k013k853k430o68j99j527k153j226p48j425j511n72l82j210j200
$$ 134802 132789 129936 127506 126838 126639 125112 122959 121733 120985 119560 118049 117477 117095 115885 114685
55598A14685j63p7j175j432n45m63j423j433k95q9j004q79M98P69n21j083k76
$$ 114685 114522 114445 113270 111838 111293 110830 109407 107974 107679 107590 106586 105707 106205 106974 106453 105370 105094
55581A05094j79j266j276N14J929J947K107K812K329O32K01J656K602K105K212
$$ 105094 104915 103649 102373 102887 104816 106763 108870 111682 114011 114643 114844 116500 119102 121207 123419
55566A23419L605L834J708l93n80k86j106k152k361k408k627j972n95m69j977
$$ 123419 127024 130858 132566 132173 131593 131307 130201 128049 125688 123280 120653 118681 118086 117617 115640
55551A15640k834j788m81k59r8Q92J744J786J868K252J894Q05M68J102J220N87
$$ 115640 112806 111018 110537 110278 110180 111072 112816 114602 116470 118722 120616 121421 121889 122991 124211 124798
55535A24798O58J590J848J357J652K385J377j154k237j012j31j074k002j687j759
$$ 124798 125456 127046 128894 130251 131903 134288 135665 134511 132274 131262 131131 130057 128055 126368 124609
55520A24609l206m246l691l171m080n286n592n595n563m430k420j576k225k007
$$ 124609 121403 117157 113466 110295 106215 100929 95337 89742 84179 79749 77329 75753 73528 71521
55506G1521M9J700J369O06R45J329O25j97k28k21m71J73J692K194J293J113K444
$$ 71521 71570 73270 74639 75245 76190 77519 78144 77947 77719 77498 77027 77200 78892 81086 82379 83492 85936
55489H5936L088J779M28N73Q41k6o86k0N79l1m63M13J159N28j19N40J229M99o35
$$ 85936 89024 90803 91231 91804 92645 92619 91933 91913 92492 92461 91998 92411 93570 94098 93979 94519 95748 96247 95612
55470I5612p73o13j133j518r83n85j160j505n64O04Q84R81J527J491K41r51j157
$$ 95612 94839 94226 93093 91575 90592 90007 88847 87342 86778 87382 88266 89247 90774 92265 92506 91555 90398
55453I0398j277j749j233O52J861J076j16o9L76J24kO56Q26j88o55O08J804J003
$$ 90398 89121 87372 86139 86791 88652 89728 89612 89543 89919 90043 90041 90697 91523 91335 90680 91288 93092 94095
55435I4095p79j641j775k037j759l34R23Q74O13J273J719O90p35j000o16o68o71
$$ 94095 93316 91675 89900 87863 86104 85770 86693 87567 88180 89453 91172 91862 91127 90127 89511 88843 88172
55418H8172l8K07o10j024K06J684J533K64n40p07o86j29Q57Q72m45j218l36N31
$$ 88172 88134 88341 87731 86707 86913 88597 90130 90394 89854 89147 88461 88332 89189 90061 89616 88398 88062 88593
55400H8593j08r83o62l04j242k108j215K66L45l55j14O57N65J43P12J639J538
$$ 88593 88485 87502 86840 86536 85294 83186 81971 82237 82582 82227 82113 82770 83335 83478 84190 85829 87367
55383H7367R27J058J324M75p22o97J28K59j61NN27M90L34R46J614J185K40MM8
$$ 87367 88294 89352 90676 91151 90429 89732 89860 90119 89958 89963 90490 90980 91314 92260 93874 95059 95299 95303 95351
55364I5351p48j882k049j356q34o28m77q33j718j836n86N02J69l80K38R76L32
$$ 95351 94603 92721 90672 89316 88482 87854 87377 86544 84826 82990 82404 82906 83075 82695 82933 83909 84241
55347H4241p93q07l51q14j401n96O97M81q40j133n3Q88J103J322J617J410R64
$$ 84241 83448 82641 82290 81476 80075 79479 80176 80657 79817 78684 78631 79519 80622 81944 83561 84971 85935
55330H5935Q77P05l8n04K6M74k23r83m68L52k3p56k47P13L15q41p20N52J140Q77
$$ 85935 86812 87517 87479 86975 87001 87475 87252 86269 85801 86153 86130 85374 85127 85840 86155 85314 84594 85146 86286 87163
55310H7163J195K107K154J159L32j70j181k299k247j290q55r11j36J433K243J708
$$ 87163 88358 90465 92619 93778 94110 93940 92759 90460 88213 86923 86068 85157 85021 86454 88697 90405
55294I0405P11j65r14r41K36J493J338K32k97k75p93j526j207j80Qo72q06j39
$$ 90405 91116 90951 90037 89096 89332 90825 92163 92395 92098 91823 91030 89504 88297 88117 88125 87453 86647 86508
55276H6508J84o9L2N71O70L54N40J181J340R56Q01Q85O73M19N40L15q95j903j291
$$ 86508 86692 86623 86655 87226 87896 88250 88790 89971 91311 92267 93068 93953 94626 95045 95585 95900 95005 93102 91811
55257I1811P3L47k33j17N61M81J7O81J926J563n11j914j447n51n16p23l53K17
$$ 91811 91884 92231 91998 91881 92442 92923 92940 93621 95547 97110 96599 94685 93238 92687 92171 91448 91095 91312
55239I1312M56M44J94l47n75M3P49N78R3L76Q80L81o96j032q61j245j618o76P73
$$ 91312 91768 92212 92406 92059 91484 91527 92276 92854 92947 93323 94203 94584 93888 92856 91995 90750 89132 88456 89229
55220H9229P01p14j455j147j198j575o35J494K548J775R88J273J478Q27L32N56
$$ 89229 89930 89216 87761 86614 85416 83841 83206 84700 87248 89023 90011 91284 92762 93589 93921 94477
55204I4477M71l40o55J66J011J061R41R99M83p05j371j042p04q26n56L18O04k12
$$ 94477 94948 94608 93953 94119 95130 96191 97132 98131 98614 97909 96538 95496 94792 93966 93410 93728 94332 94120
55186I4120r72q07l56k18M4O05P85N11O48J181Q78n01j443r65mK94J40P9mj44
$$ 94120 93148 92341 91985 91767 91811 92416 93201 93712 94360 95541 96419 95918 94475 93510 93506 93800 93940 94019 94015 93871
55166I3871P5M83L13l51m95O9M55M62Q59J557J412L41k83O9K50m07r54p00l89
$$ 93871 93946 94429 94742 94391 93896 93965 94420 94882 95741 97298 98710 99051 98768 98837 99087 98680 97726 97026 96637
55147I6637o16p41k82J09q0l90n05q25j288j070o9P34Q30P24O18J35l74k0Q36
$$ 96637 96021 95280 94998 95107 95027 94637 94132 93307 92019 90949 90880 91614 92444 93168 93786 93921 93547 93527 94363
55128I4363Q11o4k40O36J045L08l08o2m0q65j313n55K33%k79N00J382Q40p19j597
$$ 94363 95174 95110 94870 95506 96551 96859 96551 96489 96449 95584 94271 93716 93949 93949 93670 94170 95552 96392 95673 94076
55108I4076j080J72J294J706J201L71K57R54J442J174P31N16J53l14j31P12J098
$$ 94076 92996 93168 94462 96168 97369 97740 97997 98951 100393 101567 102298 102814 102967 102653 102522 103234 104332
55091A04332N01k68n98q62j189r49j09M46N59J147K228K387J025m98r00n99l76
$$ 104332 104833 104565 103967 103105 101916 100967 100858 101304 101863 103010 105238 107625 108650 108152 107252 106653 106277
55074A06277j00L34L39p2J33J164J705J035K74M36Q05M79J5K37O40L07n86j346
$$ 106277 106177 106511 106850 106778 106911 108075 109780 110815 111089 111525 112330 112809 112824 113061 113701 114008 113422 112076
55056A12076j847k118j888j316j172j557j574q46j34J25M17Q47P60K55L70J078
$$ 112076 110229 108111 106223 104907 103735 102178 100604 99758 99624 99749 100166 101013 101773 102028 102398 103476
55040A03476R71k78j093n52J41j30p11q67j176j809j445M95K282K295J362J065
$$ 103476 104447 104169 103076 102524 102665 102535 101824 100957 99781 97972 96527 97022 99304 101599 102961 104026
55024A04026J204Q13K00J30J71l57q38m63J38j5m91l39K44N78R15J680K225J789
$$ 104026 105230 106043 106243 106373 106544 106187 105349 104886 105024 105009 104518 104179 104423 105001 105916 107596 109821 111610
55006A11610P67j58j191k405k797j722k46L76M94R99J559J496J263J534J724J004
$$ 111610 112377 112219 111028 108623 105826 104104 103858 104234 104728 105727 107286 108782 110045 111579 113303 114307
54990A14307j11o14o01o42n17P3M69J17k79lL41N8k44J11M79K46L05J410K319
$$ 114307 114196 113582 112981 112339 111822 111895 112364 112481 112202 112199 112540 112598 112354 112465 112944 113190 113495 114905 117224
54971A17224J484l77j329j018n36k96R0M42L19J54M74O94K11j19O95J865J969
$$ 117224 118708 118331 117002 115984 115448 115152 115242 115684 116003 116157 116631 117325 117536 117417 118112 119977 121946
54954A21946J240Q59P52M1r46j146p25o71q92o03j58n26j306j264n53m34r48q78
$$ 121946 123186 124045 124797 124838 123892 122746 122021 121350 120458 119855 119697 119171 117865 116601 116048 115614 114666 113788
54936A13788l4M24R6LP84J777K206K050J555J048J221K458M013M923N466O526
$$ 113788 113754 114178 114274 114277 115061 116838 119044 121094 122649 123697 124918 127376 131389 136312 141778 148304
54920A48304P848Q356P853P118O381N092L068P49j550l610m927n420n947o952
$$ 148304 156152 164508 172361 179479 185860 190952 194020 194769 193219 189609 184682 179262 173315 166363
54906A66363p359o182m455l919m360m154k962k035j983k061j694j064k46Q10J488
$$ 166363 159004 152822 148367 144448 140088 135934 132972 130937 128954 126893 125199 124135 123889 124699 126187
54891A26187J159M37L99Q27P37K71L89J032J360J580K622M143M830M635M831N751
$$ 126187 127346 127783 128182 129009 129746 130017 130406 131438 132798 134378 137000 141143 145973 150608 155439 161190
54875A61190O413O518O789P033N925L229L66j814l940o195p418p036o243o205
$$ 161190 167603 174121 180910 187943 193868 197097 197463 195649 191709 185514 178096 171060 164817 158612
54861A58612o465o108n252m408l472k372j701j838k162j999j600j520j698j744
$$ 158612 152147 146039 140787 136379 132907 130535 128834 126996 124834 122835 121235 119715 118017 116273
54847A16273j605j392j025m40K56R44J401J158J41p94p69j70m7m45n13j13J6k93
$$ 116273 114668 113276 112251 111811 112067 113011 114412 115570 115711 114917 114148 113978 113931 113486 112973 112860 112876 112583
54829A12583l72r8j09l55J07J403K275J889J035P78R22O40j93j040j527j570j179
$$ 112583 112211 112113 112004 111649 111756 113159 115434 117323 118358 119136 120058 120698 120505 119465 117938 116368 115189
54812A15189n52l4K96N71O83M61K33M97J041J176Q73P19P75M83j67m24n1J97k59
$$ 115189 114637 114603 114899 115470 116153 116614 116847 117344 118385 119561 120434 121153 121928 122411 122244 121820 121769 121966 121707
54793A21707r70j204q12o0P05J038O50k5j79L61J021J350J348J019M51K28Q76
$$ 121707 120737 119533 118721 118661 119366 120404 121054 121029 120850 121211 122232 123582 124930 125949 126400 126628 127504
54776A27504J863K095J517J197J754K617L082L189L302L637M416N671O799P012
$$ 127504 129367 131462 132979 134176 135930 138547 141629 144818 148120 151757 156173 161844 168643 175655
54762A75655O417N825N486M800L333J241j335m247o702p677p242o475n960n313
$$ 175655 182072 187897 193383 198183 201516 202757 201422 197175 190473 182796 175554 169079 163119 157806
54748A57806m324l497l083k624j892j397j493j778j782j535j126l96N92J319J430
$$ 157806 153482 149985 146902 144278 142386 140989 139496 137718 135936 134401 133275 132879 133471 134790 136220
54733A36220J048M04l02o04n1J127K210K896L467M154M975O048P344Q236Q046
$$ 136220 137268 137672 137370 136766 136715 137842 140052 142948 146415 150569 155544 161592 168936 177172 185218
54718A85218O880N216L047K66k444m217n200o110o848o777o083n553n177m327
$$ 185218 192098 197314 200361 200627 198183 193966 188766 182656 175808 169031 162948 157395 152218 147891
54704A47891l240k768k727k066p73pj44k75m1k39j084j528j001m07n02p04m11
$$ 147891 144651 141883 139156 137090 136317 136310 136166 135891 135850 135611 134527 132999 131998 131591 131089 130385 129974
54687A29974k04o55j063n14N20P31l11j733k340j566M6J093O58m95q20j07L91
$$ 129974 129770 129115 128052 127538 128058 128789 128478 126745 124405 122839 122885 123978 124636 124141 123321 123214 123605
54670A23605L8l58k03j71q63j604j497o87K29J166K056K263J415K21m23n98q88
$$ 123605 123643 123285 123082 122911 122048 120444 118947 118260 118489 119655 121711 123974 125389 125610 125187 124589 123701
54653A23701j291j339r95o78o03n63k84K52O80N15j54m42K66J304J587J160R29
$$ 123701 122410 121071 120076 119398 118795 118232 117948 118200 118880 119395 119241 118799 119065 120369 121956 123116 124045
54636A24045J032P38m8n30m39m37q09j000p91o48n89k0Q63R47L0n77p3N36J13
$$ 124045 125077 125815 125767 125237 124798 124361 123552 122552 121761 121113 120524 120504 121367 122314 122344 121767 121694 122230 122343
54617A22343q36j129o99l64m86p70q62m81M93J529J733J067N07N69O37J98k07
$$ 122343 121507 120378 119679 119315 118829 118059 117197 116716 117209 118738 120471 121538 122045 122614 123251 123449 123242
54600A23242L5N98Q51P13L13l69j014r62k13M45O86J002J436J176O7p69n66k8
$$ 123242 123277 123875 124726 125439 125752 125383 124369 123407 123194 123639 124325 125327 126763 127939 128006 127237 126671 126643
54582A26643M3J4M10P45M60N9J63L19j74r18j032n09jK27K69J17p9J71Q38J055
$$ 126643 126686 126700 127110 127855 128315 128374 128537 128856 128682 127764 126732 126223 126222 126449 126718 126835 126756 126927 127765 128820
54562A28820L82l38j69N57Q61M78j34n77o17j64L43K29l13l43K17K70n09p99L35
$$ 128820 129202 128864 128695 129252 130113 130591 130457 129880 129263 129099 129442 129671 129358 129015 129232 129502 128993 128194 128529
54543A28529J839K259J838J727K023K010J586J108M45n99j440j426r31o76o33
$$ 128529 130368 132627 134465 136192 138215 140225 141811 142919 143364 142765 141325 139899 138968 138292 137659
54528A37659n48q36j768k475j970o53L44P56R64Q64J83n57o28l02l18n39l48Q5
$$ 137659 137111 136275 134507 132032 130062 129409 129753 130509 131473 132337 132520 131963 131335 131033 130715 130176 129828 129913
54510A29913J28n8K24Q53J040N65o3n41q92r50o15l15l46j65P37J725J833J187
$$ 129913 130041 129983 130207 131060 132100 132665 132602 132061 131169 130219 129604 129289 128943 128778 129515 131240 133073 134260
54492A34260N85J66l56o03j6Q89J048M43j9l4j15l88m33k21q6J57Q79J543J198
$$ 134260 134845 135011 134655 134052 134036 134925 135973 136416 136397 136363 136248 135860 135427 135206 135120 135277 136156 137699 138897
54473A38897R3m88j00L48K00j9K24N04K08m60q02n17J68Q32J075P30K7o55j149
$$ 138897 138990 138502 138402 138750 138950 138931 139155 139659 139867 139407 138605 138088 138256 139088 140163 140893 140920 140265 139116
54454A39116j368j105l57L49N30M10N14P61N78j43p43n01N94J748J963R80l28
$$ 139116 137748 136643 136286 136635 137165 137575 138089 138850 139428 139285 138542 138041 138635 140383 142346 143326 142998
54437A42998q88p48p49r33l62J076J984J320p7p51n19j34J17L59L92Q5l4L86O89
$$ 142998 142110 141362 140613 139680 139318 140394 142378 143698 143621 142870 142351 142217 142334 142693 143085 143170 143136 143522 144211
54418A44211K01n47o26j25K83N63J005J256Q53J70j98m14o88l85Q47J770R57r42
$$ 144211 144412 143865 143239 143114 143397 143960 144965 146221 147074 147244 147046 146632 145944 145559 146406 148176 149133 148191
54400A48191j921j241J68J463K430K551J329l48q50K8Q71P96L56J34j09n08o28
$$ 148191 146270 145029 145197 146660 149090 151641 152970 152622 151772 151800 152671 153467 153823 153957 153848 153340 152712
54383A52712l33q2rK41N55K85n33r56m05O35J460J847J746J105K28l62n29l86
$$ 152712 152379 152297 152288 152529 153084 153369 152836 151880 151475 152110 153570 155417 157163 158268 158496 158134 157605 157219
54365A57219K68J580K904L398L199L098L240L084K563K165J913J242pj364k432
$$ 157219 157487 159067 161971 165369 168568 171666 174906 177990 180553 182718 184631 185873 185866 184502 182070
54350A82070l063l048k462k030k209k363j822j194j384j894j596p44n62j086j233
$$ 182070 179007 175959 173497 171467 169258 166895 165073 163879 162495 160601 159005 158261 157699 156613 155380
54335A55380p98o82j052j154r55j229j728j259Q6O80k9n64J53J188J382J089J070
$$ 155380 154582 153900 152848 151694 150739 149510 147782 146523 146609 147289 147260 146696 146849 148037 149419 150508 151578
54318A51578J045N42jq0j19n48q21l39M22N99J61l78p76r86q68n42m02l80M6Q10
$$ 151578 152623 153165 153164 153084 152965 152417 151596 151257 151679 152278 152439 152061 151285 150299 149431 148889 148487 148107 148153 148963
54298A48963J041L40o71j414j943k148j522k92M18J89j1M92R49N83jR7N57N23
$$ 148963 150004 150344 149673 148259 146316 144168 142646 142354 142772 142961 142950 143442 144391 144974 144973 145070 145627 146150
54280A46150R2k0K61N27P89J277J658J398O40N1j13j36k79n36p08m42M88J645
$$ 146150 146242 146222 146483 147010 147799 149076 150734 152132 152772 152823 152710 152574 152295 151759 151051 150609 151097 152742
54262A52742K128J615P40K06Q7J56K87K54j27m37K0J072J734J682J706K206K267
$$ 152742 154870 156485 157225 157431 157518 157674 157961 158215 158088 157651 157671 158743 160477 162159 163865 166071 168338
54245A68338J068p37j831j847j396r76o66m74l25M0O37R95P10o4r22j562j683
$$ 168338 169406 168669 166838 164991 163595 162619 161953 161479 161154 161194 161831 162826 163536 163472 162550 160988 159305
54228A59305j058J0Q36J117J046P12J00l10M5P42P05j13n87k67o5n85j075q60
$$ 159305 158247 158257 159093 160210 161256 161968 162068 161758 161803 162545 163250 163137 162550 162283 162218 161633 160558 159698
54210A59698o51j324k303k344j324k57J40M5pL49J036J439J001R2l43k36n04j419
$$ 159698 159047 157723 155420 153076 151752 151495 151635 151680 151673 152022 153058 154497 155498 155590 155247 155011 154507 153088
54192A53088j915j180J20R24J136J132Q42J94k81j72J15J30J18K85J90l27n19
$$ 153088 151173 149993 150113 151037 152173 153305 154147 154341 154060 153888 154003 154133 154251 154536 154726 154399 153880
54175A53880Q1O89N30J54L53N89r6j225j433n92M1k51p85p08l4P20J194J300J187
$$ 153880 153961 154650 155180 155334 155687 156276 156180 154955 153522 152930 152971 152720 151935 151227 151193 151913 153107 154407 155594
54156A55594J182J334J234N93k43p48q43n98J18J192J917J757J085O20N44N98
$$ 155594 156776 158110 159344 159937 159694 158946 158103 157505 157623 158815 160732 162489 163574 164194 164738 165336
54140A65336O08L94k73j127j445j109r01j167j083q2R19Q19J00R3R62J659J570
$$ 165336 165944 166338 166065 164938 163493 162384 161483 160316 159233 159151 160070 160889 160989 161082 162044 163703 165273
54123A65273J059N01j32p61j183j440j522r55N16K069K534J809Q11K17kJ6J93
$$ 165273 166332 166833 166701 165940 164757 163317 161795 160840 161356 163425 165959 167768 168579 168796 168794 168810 169003
54106A69003K84J82K90R31J627J693J270R88R52Q73R30J545K543L423M361N961
$$ 169003 169287 169469 169759 170690 172317 174010 175280 176268 177220 178093 179023 180568 183111 186534 190895 196856
54090A96856Q007R294Q851O718L577K78k357m047n330o720p737p459n876l973
$$ 196856 204863 214157 223008 229726 233303 233581 231224 227177 221847 215127 207390 199931 194055 190082
54076A90082k496j427o74m68q50j414j713j621j135k96P13J662K441K932K939
$$ 190082 187586 186159 185485 185017 184167 182753 181040 179419 178284 177988 178701 180363 182804 185736 188675
54061A88675K520K133K140K517L258M512N901O302N056K874R70l08j323k131k452
$$ 188675 191195 193328 195468 197985 201243 205755 211656 217958 223014 225888 226858 226550 225227 223096 220644
54046B20644k323j981j317k24Q57J396J559J881K471L159M007M966N463N151M642
$$ 220644 218321 216340 215023 214799 215656 217052 218611 220492 222963 226122 230129 235095 240558 245709 250351
54031B50351M625M682L974K760K151K410K626K072J035J82j19J96Q74J299J029
$$ 250351 254976 259658 263632 266392 268543 270953 273579 275651 276686 276868 276749 276945 277819 279118 280147
54016B80147L35l36j161k530m110n087n223m962m665m338l987l602l025k397k390
$$ 280147 280482 280146 278985 276455 272345 267258 262035 257073 252408 248070 244083 240481 237456 235059 232669
54001B32669l283m269m447m030l707l324k284r13k01l41o32p54j006j344j275
$$ 232669 229386 225117 220670 216640 212933 209609 207325 206412 206211 205870 205238 204484 203478 202134 200859
53986B00859q17n32n34m13k08m71j208j632j206k27O92J062N94m46j104p52L8
$$ 200859 200042 199510 198976 198563 198355 197884 196676 195044 193838 193611 194303 195365 195959 195513 194409 193657 193695
53969A93695M38P38J581K356J823K99m69J66R31P81L97Q28J948L100M208N404
$$ 193695 194133 194871 196452 198808 200631 200930 200461 200627 201558 202339 202736 203564 205512 208612 212820 218224
53953B18224O408P134Q269J0443J3270J5824J7437J7531J5368J0717M534j604
$$ 218224 224632 231766 240035 250478 263748 279572 297009 314540 329908 340625 345159 343555
53941C43555o451r321r954q768o891n351m312l361k208r12K85J059J124N37k08
$$ 343555 337104 327783 317829 309061 302170 296819 292507 289146 286938 286026 286311 287370 288494 289031 288823
53926B88823n42j50Q68K089L063L728M365M932M863L941K928K837L876N537P296
$$ 288823 288281 288131 288999 291088 294151 297879 302244 307176 312039 315980 318908 321745 325621 331158 338454
53911C38454Q588Q698P509N957M880L791J900j74j018o79q01k255l901m281l492
$$ 338454 347042 355740 363249 369206 374086 377877 379777 379603 378585 377906 377105 374850 370949 366668 363176
53896C63176k747k743l174l457l506l888n192p048q139p657o415n838o193o658
$$ 363176 360429 357686 354512 351055 347549 343661 338469 331421 323282 315625 309210 303372 297179 290521
53882B90521o704o451n908m972m090l871m059l891l305k855k630k348k290k853
$$ 290521 283817 277366 271458 266486 262396 258525 254466 250575 247270 244415 241785 239437 237147 234294
53868B34294l340k721j493j275k325l097k630j817j720k084k193j946j345j22
$$ 234294 230954 228233 226740 225465 223140 220043 217413 215596 213876 211792 209599 207653 206308 206186
53854B06186J364J929J014n21j627k151k247j774r17m01m31l38J61L73j41p43
$$ 206186 207550 209479 210493 209972 208345 206194 203947 202173 201256 200855 200424 200086 200247 200620 200479 199736
53838A99736p28k71K43Q23J257R92K09qO70J090L29r08j449j200p16j96J98Mo24
$$ 199736 199008 198737 198980 199803 201060 202052 202261 202253 202923 204013 204342 203434 201985 200785 200069 199873 200071 200075 199451
53819A99451n38Q53K478L000K519K007J784J648J738K165K393K001J562J785K387
$$ 199451 198913 199766 202244 205244 207763 209770 211554 213202 214940 217105 219498 221499 223061 224846 227233
53804B27233K727L015L797M792N215M976M646M476M303M085L852L456K914K683
$$ 227233 229960 232975 236772 241564 246779 251755 256401 260877 265180 269265 273117 276573 279487 282170
53790B82170K998L372L279K752J925P13o15j352j456j846k946l950m234m399m981
$$ 282170 285168 288540 291819 294571 296496 297209 296594 295242 293786 291940 288994 285044 280810 276411 271430
53775B71430n288m679l902l854l967l284k331k224k691k607k114k358l360l815
$$ 271430 266142 261463 257561 253707 249740 246456 244125 241901 239210 236603 234489 232131 228771 224956
53761B24956l106k035j355r54o71p47j173j539j738j915j811j092k83k73q55q71
$$ 224956 221850 219815 218460 217506 216835 216088 214915 213376 211638 209723 207912 206820 206537 206264 205409 204538
53745B04538P8J038J078L24n74j164j124l08Q50J535J407Q00J79j65K9P13J298
$$ 204538 204616 205654 206732 207056 206482 205318 204194 203886 204736 206271 207678 208478 208657 208492 208521 209234 210532
53728B10532J298J005R81J065P45J79JL29Q24J468K353K906K425J322P31R08J038
$$ 210532 211830 212835 213816 214881 215626 215805 215806 216135 216959 218427 220780 223686 226111 227433 228164 229072 230110
53711B30110P19M92P46J167J565K283L371M193M262L781L114K407J928K052K569
$$ 230110 230829 231321 232067 233234 234799 237082 240453 244646 248908 252689 255803 258210 260138 262190 264759
53696B64759K825K741K975L729M179L596K357J325P57L54l7l30n31p25q06n52
$$ 264759 267584 270325 273300 277029 281208 284804 287161 288486 289243 289597 289560 289230 288699 287974 287168 286616
53680B86616J3M79L25n84j671k068j592r62q33r50o83o5K98N9o19j383j798j456
$$ 286616 286629 287108 287433 286849 285178 283110 281518 280556 279723 278773 278090 278025 278323 278382 277763 276380 274582 273126
53662B73126n74o3l17m56M23J687J929J020J68R7L43M85Q06J338J378N51m31o61
$$ 273126 272552 272489 272172 271716 272139 273826 275755 276775 276943 277040 277383 277868 278674 280012 281390 281941 281510 280849
53644B80849j12N78R05P62L82K46O28J133J175R15J065J727K097J642R13Q27J595
$$ 280849 280737 281315 282220 282982 283364 283610 284238 285371 286546 287461 288526 290253 292350 293992 294905 295732 297327
53627B97327K622L148K874K240K096K792L729M215M411M877N526N858N949O313
$$ 297327 299949 303097 305971 308211 310307 313099 316828 321043 325454 330331 335857 341715 347664 353977
53613C53977O822O728N777M438L102J923J337J676K298K174J465J306J976K484
$$ 353977 360799 367527 373304 377742 380844 382767 384104 385780 388078 390252 391717 393023 394999 397483
53599C97483K265J932J912J600N49o74j437j805j733p03J060K108J531K34m91
$$ 397483 399748 401680 403592 405192 405741 405067 403630 401825 400092 399389 400449 402557 404088 404322 403831
53584D03831p37j230j774j781j650k151k860k619j405m08k40l09j82l37j144j997
$$ 403831 403094 401864 400090 398309 396659 394508 391648 389029 387624 387216 386976 386667 386485 386148 385004 383007
53568C83007k121j681j471j861k411k489j959j235p20l27K57Q94J041O04K83O25
$$ 383007 380886 379205 377734 375873 373462 370973 369014 367779 367059 366732 366989 367883 368924 369528 369811 370436
53552C70436J186J162O03L24P35J386J727J756J715J571J111M38J36P59K179L506
$$ 370436 371622 372784 373387 373711 374446 375832 377559 379315 381030 382601 383712 384150 384286 385045 387224 390730
53536C90730L909L496L122L304L771M155M617N375O102O349O358O871Q197R883
$$ 390730 394639 398135 401257 404561 408332 412487 417104 422479 428581 434930 441288 448159 456356 466239
53522D66239J1267J2023J2175J1999J1949J2322J2901J3211J3238J3641J5011
$$ 466239 477506 489529 501704 513703 525652 537974 550875 564086 577324 590965 605976
53511F05976J7047J8765J9568J9883K0578K1845K2982K3294K2889K2371K2035
$$ 605976 623023 641788 661356 681239 701817 723662 746644 769938 792827 815198 837233
53500H37233K1667K0961J9842J8513J7482J7326J8027J8751J8779J8370J8244
$$ 837233 858900 879861 899703 918216 935698 953024 971051 989802 1008581 1026951 1045195
53489A045195J8360J8059J7310J6906J7190J7451J7052J6421J6314J6622J6607
$$ 1045195 1063555 1081614 1098924 1115830 1133020 1150471 1167523 1183944 1200258 1216880 1233487
53478A233487J6082J5592J5519J5486J4812J3309J1386R497P597N329K698K53
$$ 1233487 1249569 1265161 1280680 1296166 1310978 1324287 1335673 1345170 1352767 1358096 1360794 1361047
53466A361047j703l668o194q932j1036j2358j3392j4056j3631j2136j0844j0872
$$ 1361047 1359344 1355676 1349482 1340550 1329514 1317156 1303764 1289708 1276077 1263941 1253097 1242225
53454A242225j2025j3567j5327j7289j8800j9150j8674j8323j8286j7908j6982
$$ 1242225 1230200 1216633 1201306 1184017 1165217 1146067 1127393 1109070 1090784 1072876 1055894
53443A055894j6268j6377j6782j6374j4776j2636j0650q708o321l704j900j518
$$ 1055894 1039626 1023249 1006467 990093 975317 962681 952031 943323 937002 933298 931398 929880
53431I29880j822j645r10m26l00M28K202M064M964N366O589Q951J1405J2930J3606
$$ 929880 928058 926413 925503 925077 924777 925205 927407 931471 936435 941801 948390 957341 968746 981676 995282
53416I95282J4206J5254J6661J7946J8699J8961J9257K0149K1785K3865K5847
$$ 995282 1009488 1024742 1041403 1059349 1078048 1097009 1116266 1136415 1158200 1182065 1207912
53405A207912K7250K7956K8425K9380L1139L3476L6054L8667M1072M2985M4497
$$ 1207912 1235162 1263118 1291543 1320923 1352062 1385538 1421592 1460259 1501331 1544316 1588813
53394A588813M6045M7750M9179M9957N0266N0498N0771N1000N1080N0758M9678
$$ 1588813 1634858 1682608 1731787 1781744 1832010 1882508 1933279 1984279 2035359 2086117 2135795
53383B135795M7869M5877M4238M3089M2312M1571M0093L7049L2564K7806K3723
$$ 2135795 2183664 2229541 2273779 2316868 2359180 2400751 2440844 2477893 2510457 2538263 2561986
53372B561986K0151J6486J2606Q635M321p52o587j2904j9574k6458l3082l8852
$$ 2561986 2582137 2598623 2611229 2619864 2624185 2623433 2616846 2603942 2584368 2557910 2524828 2485976
53360B485976m3383m6421m7885m8259m8416m8663m8468m7504m6323m5382m4090
$$ 2485976 2442593 2396172 2348287 2300028 2251612 2202949 2154481 2106977 2060654 2015272 1971182
53349A971182m1673l8547l5999l4734l4491l4876l5725l6633l6966l6444l5316
$$ 1971182 1929509 1890962 1854963 1820229 1785738 1750862 1715137 1678504 1641538 1605094 1569778
53338A569778l3929l2457l0952k9318k7317k4931k2472k0117j7701j5289j3358
$$ 1569778 1535849 1503392 1472440 1443122 1415805 1390874 1368402 1348285 1330584 1315295 1301937
53327A301937j2030j0752r407q999j0303j2396j3663j3881j4109j4665j4611j3434
$$ 1301937 1289907 1279155 1269748 1260749 1250446 1238050 1224387 1210506 1196397 1181732 1167121 1153687
53315A153687j1991j1241j0939j0192q711o996n593m536l300j354R77K448K315
$$ 1153687 1141696 1130455 1119516 1109324 1100613 1093617 1088024 1083488 1080188 1078834 1079811 1082259 1084574
53302A084574J604K116M182O414P812R067J1254J4112J6473J7794J8558J9431
$$ 1084574 1086178 1088294 1092476 1098890 1106702 1115769 1127023 1141135 1157608 1175402 1193960 1213391
53290A213391K0660K2144K3613K4740K5329K5329K4627K3120K1074J9044J7169
$$ 1213391 1234051 1256195 1279808 1304548 1329877 1355206 1379833 1402953 1424027 1443071 1460240
53279A460240J5052J2570J0328Q826P549N436K208j210l681n056o319q661j2311
$$ 1460240 1475292 1487862 1498190 1507016 1514565 1520001 1522209 1520999 1517318 1512262 1505943 1497282 1484971
53266A484971j6212j8952k0115k0604k1607k3374k5174k6245k6578k6757k7191
$$ 1484971 1468759 1449807 1429692 1409088 1387481 1364107 1338933 1312688 1286110 1259353 1232162
53255A232162k7646k7603k7007k6321k5764k4864k3174k1175j9972k0036k0743
$$ 1232162 1204516 1176913 1149906 1123585 1097821 1072957 1049783 1028608 1008636 988600 967857
53244I67857k1199k1153k0960k0914k0918k0684k0076j9274j8573j7984j7245
$$ 967857 946658 925505 904545 883631 862713 842029 821953 802679 784106 766122 748877
53233G48877j6230j5136j4073j2798j1156r435p957o583n219m447n019o795q797
$$ 748877 732647 717511 703438 690640 679484 670049 662092 655509 650290 645843 640824 634029 625232
53220F25232j0293j1236j1776j2042j2464j3482j4789j5494j5276j4656j3996
$$ 625232 614939 603703 591927 579885 567421 553939 539150 523656 508380 493724 479728
53209D79728j2950j1297r585q455p885p547p389p326o919n969n091m995n537o008
$$ 479728 466778 455481 445896 437441 429556 422009 414620 407294 400375 394406 389315 384320 378783 372775
53195C72775o144o295o704p160p298o878n909m856m519n180o027n890m564k937
$$ 372775 366631 360336 353632 346472 339174 332296 326387 321531 317012 311832 305805 299915 295351 292414
53181B92414j927j694j876k112k277k506l013l640l771l067k077j597j585j326
$$ 292414 290487 288793 286917 284805 282528 280022 277009 273369 269598 266531 264454 262857 261272 259946
53167B59946o18m7O5J05K96J11q00j753j825j144o11n80o50o47r69j688k158j865
$$ 259946 259328 259281 259346 259451 259747 259858 259058 257305 255480 254336 253725 253145 252495 251848 250879 249191 247033 245168
53149B45168j167p22o39o23n94o14m98n9M07M42K05L41R86J406R38n8n47nJ007
$$ 245168 244001 243279 242640 242017 241423 240809 240311 240252 240659 241101 241306 241647 242633 244039 244977 244919 244372 244367 245374
53130B45374J510J183O68O92J071R16p7j031r52N3J145J963K699L139K710J580
$$ 245374 246884 248067 248735 249427 250498 251414 251337 250306 249354 249407 250552 252515 255214 258353 261063 262643
53114B62643Q61J114J468P90p50j990k253j937j756k032k588k970k800k195j758
$$ 262643 263504 264618 266086 266876 266126 264136 261883 259946 258190 256158 253570 250600 247800 245605 243847
53099B43847j876k282k444k134j364k42Q31J220Q19L21K88M00J28k85k52J74M50
$$ 243847 241971 239689 237245 235111 233747 233505 234336 235556 236375 236696 236984 237384 237512 237227 236975 237149 237599
53082B37599M81N82P06M86qk91k20mL93J077J499Q67o00j664j597r55o16o95q54
$$ 237599 238080 238662 239368 239854 239846 239555 239335 239331 239724 240801 242300 243167 242567 240903 239306 238351 237735 237040 236186
53063B36186r89j134j171r66n05K57J210J764J294J13p19p62o42q65r72m21M51
$$ 236186 235197 234063 232892 231926 231421 231678 232888 234652 235946 236059 235340 234578 233936 233071 232099 231678 232129
53046B32129R36R42P67M13k22p66o91l4P05J144J181Q41L91K64M10J72o88j313
$$ 232129 233065 234007 234774 235187 234965 234199 233508 233474 234179 235323 236504 237345 237736 238000 238410 238582 237894 236581
53028B36581q94k2Jr31j508q66L10Q57O08K62K80N09O44O63P63J112J603J846
$$ 236581 235687 235665 235666 234735 233227 232361 232671 233528 234136 234398 234678 235187 235831 236494 237257 238369 239972 241818
53010B41818J586J155J216J846K215J503Mj116j144n15o8j3N2K43J36n04j147
$$ 241818 243404 244559 245775 247621 249836 251339 251343 250227 249083 248568 248500 248487 248539 248782 248918 248414 247267
52993B47267j081l74J71qo30r98p56q8N98J007J139J229J432J576J379Q86M28
$$ 247267 246186 245812 245983 245975 245345 244347 243591 243503 244101 245108 246247 247476 248908 250484 251863 252749 253177
52976B53177K04J68K96O09Q42N81o9l42K95J369J910J561Q84O23R96J623J860
$$ 253177 253381 253549 253845 254454 255296 255877 255808 255466 255761 257130 259040 260601 261485 262108 263104 264727 266587
52959B66587J233j94j705k433k119j338r24j145j526j475j021o93p05o21n1O10
$$ 266587 267820 267626 265921 263488 261369 260031 259107 257962 256436 254961 253940 253247 252542 251921 251870 252480
52943B52480N63l42j409j949j904j599j292j153j249j335r65j4J106J872K066
$$ 252480 253043 252701 251292 249343 247439 245840 244548 243395 242146 240811 239846 239832 240938 242810 244876
52928B44876J703R01ln85p58p54o51l19L7j13q04j288r60j11O08J038J238R33
$$ 244876 246579 247480 247477 246892 246134 245380 244729 244410 244447 244334 243530 242242 241282 241171 241779 242817 244055 244988
52910B44988m1j062j287q25n19o41n58N3N39K40l86l27N74J353J155K59l39j25
$$ 244988 244947 243885 242598 241773 241254 240613 240055 240108 240647 240887 240501 240174 240748 242101 243256 243515 243176 243051
52892B43051M75P54N63L38N28J182J986K403J856K24j769l029l072k361j597j070
$$ 243051 243526 244280 244843 245181 245709 246891 248877 251280 253136 253360 251591 248562 245490 243129 241532 240462
52876B40462p82p49q26o06J33J076J746K061K259K539L008L658M083L628K205
$$ 240462 239680 238931 238105 237499 237632 238708 240454 242515 244774 247313 250321 253979 258062 261690 263895
52861B63895P03K8k4l67j276k083k242k076k232k785l156k833k048j691k349l404
$$ 263895 264598 264626 264602 264235 262959 260876 258634 256558 254326 251541 248385 245552 243504 241813 239464 236060
52845B36060l481k128n73k58r94j399q89k92l06m26N8P74P49j80j146j337p60
$$ 236060 232579 230451 229878 229620 228626 227227 226338 226046 225740 225314 225372 226146 226895 226715 225569 224232 223472
52828B23472P9P57J122J190J110R94P56J70p61j603j811j226k38N82R42R32Q57
$$ 223472 223551 224308 225430 226620 227730 228724 229480 229650 228889 227286 225475 224249 224011 224593 225535 226467 227324
52811B27324J086J913L195M126L830K347P08k25o45j215j990k446k378k065j685
$$ 227324 228410 230323 233518 237644 241474 243821 244529 244304 243659 242444 240454 238008 235630 233565 231880
52796B31880j177p58r24j667k226j910q57K67R81J168R01M77L05M86O98P42Q52
$$ 231880 230703 229945 229021 227354 225128 223218 222361 222628 223609 224777 225678 226155 226460 226946 227644 228386 229238
52779B29238J154J227P12K9j56n6n32j665k333j644k49M73J57l09j80J87R2m85
$$ 229238 230392 231619 232331 232360 232204 232148 231616 229951 227618 225974 225725 226198 226355 226046 225866 226053 226145 225660
52761B25660r51r76p68o33n96n14k50K70R45J446J542J427J468J639J549J085
$$ 225660 224709 223733 222965 222332 221736 221222 220972 221242 222187 223633 225175 226602 228070 229709 231258 232343
52745B32343O32N43P61J156J771K472K710K128J139M21N3l18o31l40O28J490J496
$$ 232343 232975 233518 234279 235435 237206 239678 242388 244516 245655 246076 246129 245811 245180 244840 245468 246958 248454
52728B48454Q76N13Q46J399J373M46r72k140k517k081j260o53o33j114j585j580
$$ 248454 249330 249843 250689 252088 253461 253907 252935 250795 248278 246197 244937 244284 243651 242537 240952 239372
52712B39372j067l48L00P20O79Q4o03o60n4L58J7m86k43O57J332J401J277J248
$$ 239372 238305 237957 238257 238977 239656 239740 239137 238477 238423 238781 238798 238312 238069 238726 240058 241459 242736 243984
52694B43984J088P01M50M69K96l97j137j153k88Q97J696J726J119M56K41K26l06
$$ 243984 245072 245773 246223 246692 246988 246591 245454 244301 244013 244910 246606 248332 249451 249907 250148 250374 250068
52677B50068j425k222j976j110m81j88J95N44K88m54p64k18M45M26RL1N69Q59
$$ 250068 248643 246421 244445 243335 242854 242666 242861 243405 243693 243239 242475 242257 242702 243128 243137 243168 243737 244596
52659B44596N23J80O37J807K802L011K691K434K325J957J200M87J46j56q75j741
$$ 244596 245119 245299 245936 247743 250545 253556 256247 258681 261006 262963 264163 264650 264796 264640 263765 262024
52643B62024j983j450q85r43j311j249o29k8K2m59r88r09J80J879L088L148K750
$$ 262024 260041 258591 257706 256763 255452 254203 253574 253546 253568 253109 252121 251212 251392 253271 256359 259507 262257
52626B62257L072M004M053K247n50k708l543l476k971k189j452j150j185j080
$$ 262257 265329 269333 273386 275633 275083 272375 268832 265356 262385 260196 258744 257594 256409 255329
52612B55329p22m14k23R9M24K25n66j287j460j357j215n90Q11K150K228J085O0
$$ 255329 254607 254193 253970 254069 254493 254718 254152 252865 251405 250048 248833 248243 249054 251204 253432 254517 254577
52595B54577J44R42J498J516J369J299J111O42J27k5L05Q50J305J594J693J337
$$ 254577 254721 255663 257161 258677 260046 261345 262456 263098 263225 263200 263505 264355 265660 267254 268947 270284
52579B70284L24r38j596j300o16k17m2L33P65O71L0m54l19kj58p53j198j205j054
$$ 270284 270608 269670 268074 266774 266158 265941 265899 266232 266997 267668 267698 267244 266925 266923 266765 266012 264814 263609 262555
52560B62555j013q82l17N46J051P54k0n12m36k51m54q85j038q26o49p67r85j047
$$ 262555 261542 260660 260343 260889 261940 262694 262674 262162 261726 261475 261021 260136 259098 258272 257623 256856 255871 254824
52542B54824r88r38q00l60L48R77J168R32O77Q22J275J462J001K48j7N29J350
$$ 254824 253836 252898 252098 251738 252086 253063 254231 255163 255840 256662 257937 259399 260400 260648 260631 261160 262510
52525B62510J620J061J99j89J03M72K22n02q22k58O00Q91O66P14J359K052K268
$$ 262510 264130 265191 265390 265201 265304 265776 265998 265496 264674 264416 265016 265907 266573 267287 268646 270698 272966
52508B72966K198K210K158J597N46m88j148j531j870k209k463k555k423k061j623
$$ 272966 275164 277374 279532 281129 281675 281187 280039 278508 276638 274429 271966 269411 266988 264927 263304
52493B63304j288r61l30N89J235J207R33J150J711J587L77q87j005k57O3m42q25
$$ 263304 262016 261055 260725 261314 262549 263756 264689 265839 267550 269137 269514 268627 267622 267365 267428 266986 266161
52476B66161l02O91J337J517J550J465J198R51P81K34q27j530q75Q72K457L157
$$ 266161 265859 266550 267887 269404 270954 272419 273617 274568 275349 275583 274756 273226 272351 273223 275680 278837
52460B78837L253L111K639J783Q01j61j183k101k498k351k179k301k480k444k211
$$ 278837 282090 285201 287840 289623 290424 290263 289080 286979 284481 282130 279951 277650 275170 272726 270515
52445B70515j798j165o41p42j213j048J45J328J283J54r13j323j451j667j736
$$ 270515 268717 267552 266911 266169 264956 263908 264053 265381 266664 266818 265905 264582 263131 261464 259728
52430B59728j359o74kN37R51J111Q62K48m38q10o24L0Q07J415J835K157K327K315
$$ 259728 258369 257695 257693 258230 259181 260292 261154 261402 260964 260154 259530 259560 260367 261782 263617 265774 268101 270416
52412B70416K355K800L651M507N124N847P295R580J1987J3443J3247J1307P884
$$ 270416 272771 275571 279222 283729 288853 294700 301995 311575 323562 337005 350252 361559 369443
52399C69443L402j471n823q819j0104r902q900p915p394p017o060m349k635j781
$$ 369443 372845 371374 365551 356732 346628 336726 327826 319911 312517 305500 299440 295091 292456 290675
52385B90675j796j903j400j87J356K637L149K801J988J187O86P43J563K796L584
$$ 290675 288879 286976 285576 285389 286745 289382 292531 295332 297320 298507 299193 299936 301499 304295 307879
52370C07879L577L441L788M127L640K578J835J465P86o4l3J082J970J535L08n09
$$ 307879 311456 314897 318685 322812 326452 329030 330865 332330 333116 333052 333019 334101 336071 337606 337914 337405
52354C37405n75k99R0N54Q23P41O57R07J255J433J713K370K947K826K237K008
$$ 337405 336830 336531 336621 337175 337998 338739 339396 340303 341558 342991 344704 347074 350021 352847 355084 357092
52338C57092K529L519M637N648O288O551P005Q173R727J0838J1279J1537J2013
$$ 357092 359621 363140 367777 373425 379713 386264 393269 401442 411169 422007 433286 444823 456836
52325D56836J2667J3502J4694J6144J7408J8216J8693J8950J8870J8383J7679
$$ 456836 469503 483005 497699 513843 531251 549467 568160 587110 605980 624363 642042
52314F42042J7024J6662J6800J7442J8263J8889J9237J9396J9302J8827J8100
$$ 642042 659066 675728 692528 709970 728233 747122 766359 785755 805057 823884 841984
52303H41984J7356J6656J5973J5398J4902J4155J2917J1428R986Q421O388L910
$$ 841984 859340 875996 891969 907367 922269 936424 949341 960769 970755 979176 985564 989474
52291I89474J182j801m808o977p686p565p724q149p929p000o420o505o047m120
$$ 989474 990656 988855 984047 977070 969384 961819 954095 945946 938017 931017 924597 918092 912045 907925
52277I07925j657k38K1L19J331K663L997N701P905R831J0577J0235R733R767J0250
$$ 907925 906268 906030 906051 906370 907701 910364 914361 920062 927967 937798 948375 958610 968343 978110 988360
52262I88360J0807J1415J2363J3647J4737J5089J4772J4328J4102J3970J3707
$$ 988360 999167 1010582 1022945 1036592 1051329 1066418 1081190 1095518 1109620 1123590 1137297
52251A137297J3271J2575J1306R290O830M426K192j40k702n194p210q659r759
$$ 1137297 1150568 1163143 1174449 1183739 1190569 1194995 1197187 1197047 1194345 1189151 1181941 1173282 1163523
52238A163523j0702j1500j2103j2532j2747j2547j1783j0701r843r473r307q938
$$ 1163523 1152821 1141321 1129218 1116686 1103939 1091392 1079609 1068908 1059065 1049592 1040285 1031347
52226A031347q361p920p784p706p232o024m129k081n98L3K40O33J371K270L249
$$ 1031347 1022986 1015066 1007282 999576 992344 986320 982191 980110 979512 979545 979785 980418 981789 984059 987308
52211I87308M330N270N667N437M870M218L552K990K697K646K728L094L969N094
$$ 987308 991638 996908 1002575 1008012 1012882 1017100 1020652 1023642 1026339 1028985 1031713 1034807 1038776 1043870
52197A043870N815N919N865O051O273O169N749N149M270L140K268K028J884Q24
$$ 1043870 1049685 1055604 1061469 1067520 1073793 1079962 1085711 1090860 1095130 1098270 1100538 1102566 1104450 1105274
52183A105274j449m241o769q777j0154j0537r793q523p573p132o708n972n199
$$ 1105274 1103825 1099584 1092815 1084038 1073884 1063347 1053554 1045031 1037458 1030326 1023618 1017646 1012447
52170A012447m774m586m192l404k400j392m43M28J228K079L080M014M480M363
$$ 1012447 1007673 1003087 998895 995491 993091 991699 991256 991684 992912 994991 998071 1002085 1006565 1010928
52156A010928L881L117J879L03q00p15K06Q56P01L74P87J954L015L250K710J863
$$ 1010928 1014809 1017926 1019805 1020108 1019308 1018593 1018799 1019655 1020356 1020730 1021517 1023471 1026486 1029736 1032446 1034309
52140A034309R07k95j664k623k674k093j654j546r56R37L825O523Q331R785J1945
$$ 1034309 1035216 1034921 1033257 1030634 1027960 1025867 1024213 1022667 1021711 1022648 1026473 1032996 1041327 1051112 1063057
52125A063057J5159J8647K1308K2813K3887K5391K7222K8393K8239K7251K6402
$$ 1063057 1078216 1096863 1118171 1140984 1164871 1190262 1217484 1245877 1274116 1301367 1327769
52114A327769K6001K5521K4461K2940K1455K0250J9066J7400J5151J2960J1684
$$ 1327769 1353770 1379291 1403752 1426692 1448147 1468397 1487463 1504863 1520014 1532974 1544658
52103A544658J1372J1137J0240Q955P934P054N509K867n01m031p471j0687j3503
$$ 1544658 1556030 1567167 1577407 1586362 1594296 1601350 1606859 1609726 1609225 1605194 1597723 1587036 1573533
52090A573533j5914j8055j9847k0850k0742j9706j8283j6872j5421j3581j1225
$$ 1573533 1557619 1539564 1519717 1498867 1478125 1458419 1440136 1423264 1407843 1394262 1383037
52079A383037q828p042n859m567k723o74J236L328N899Q411J0181J1467J2976
$$ 1383037 1374209 1367167 1361308 1356741 1354018 1353344 1354580 1357908 1363807 1372218 1382399 1393866 1406842
52066A406842J4550J5372J5395J5421J5700J5562J4835J4485J5223J6295J6391
$$ 1406842 1421392 1436764 1452159 1467580 1483280 1498842 1513677 1528162 1543385 1559680 1576071
52055A576071J5236J3600J2073J0425Q005M467K40l639o462q636j0993j3404j4933
$$ 1576071 1591307 1604907 1616980 1627405 1635410 1639877 1640117 1636478 1630016 1621380 1610387 1596983 1582050
52042A582050j5499j6316j8153k0078k0744k0172j9401j8900j8315j7482j6767
$$ 1582050 1566551 1550235 1532082 1512004 1491260 1471088 1451687 1432787 1414472 1396990 1380223
52031A380223j6423j6300j6228j6183j6202j6448j7143j8009j8195j7240j5775
$$ 1380223 1363800 1347500 1331272 1315089 1298887 1282439 1265296 1247287 1229092 1211852 1196077
$$ [...]
##END NTUPLES=NMR SPECTRUM
##END=
