
##TITLE=UV1215_M5_1296-1170_10_7229370_8bzgtBLeyR
##JCAMPDX= 6.0         $$ Bruker NMR JCAMP-DX V2.0
##DATA TYPE= NMR SPECTRUM
##DATA CLASS= NTUPLES
##ORIGIN= BRUKER
##OWNER= Administrator
$$ 1.72 TOPSPIN		Version 2.1
$$ 2013-01-17 21:38:23.496 -0500  Administrator@X
$$ Compression mode = diff/dup
##.OBSERVE FREQUENCY= 400.02188249412
##.OBSERVE NUCLEUS= ^1H
##.ACQUISITION MODE= SIMULTANEOUS (DQD)
##.ACQUISITION SCHEME= undefined
##.AVERAGES= 8
##.DIGITISER RES= 22
##SPECTROMETER/DATA SYSTEM= spect
##.PULSE SEQUENCE= zg30
##.SOLVENT NAME= COFFEE_meoh
##.SHIFT REFERENCE= INTERNAL, COFFEE_meoh, 1, 14.98509
##AUDIT TRAIL= $$ (NUMBER, WHEN, WHO, WHERE, PROCESS, VERSION, WHAT)
$$ ##TITLE= Audit trail, TOPSPIN		Version 2.1
$$ ##JCAMPDX= 5.01
$$ ##ORIGIN= Bruker BioSpin GmbH
$$ ##OWNER= Administrator
$$ $$ E:\/data/COFFEE/nmr/UV1215_M5_1296-1170_10_7229370_8bzgtBLeyR/20/pdata/1/auditp.txt
$$ ##AUDIT TRAIL=  $$ (NUMBER, WHEN, WHO, WHERE, PROCESS, VERSION, WHAT)
(   1,<2013-01-17 21:38:15.621 -0500>,<Administrator>,<X>,<go>,<TOPSPIN 2.1>,
      <created by zg
	started at 2013-01-17 21:37:09.432 -0500,
	POWCHK enabled, PULCHK disabled,
       configuration hash MD5:
       86 BA 57 50 F2 9D 5C 9B 26 00 A9 28 5F 66 2E 89
       data hash MD5: 64K
       0B DC 2E 13 59 7A 9E 20 3C 02 78 34 8F 28 79 67>)
(   2,<2013-01-17 21:38:18.652 -0500>,<Administrator>,<X>,<proc1d>,<TOPSPIN 2.1>,
      <Start of raw data processing
       efp LB = 0 FT_mod = 6 PKNL = 1 PHC0 = 0 PHC1 = 0 SI = 32K 
       data hash MD5: 32K
       EC 79 69 83 21 48 74 A0 E9 99 64 2B 1C 68 7D D6>)
(   3,<2013-01-17 21:38:19.105 -0500>,<Administrator>,<X>,<proc1d>,<TOPSPIN 2.1>,
      <pk PHC0 = 95.83374 PHC1 = 0 
       data hash MD5: 32K
       79 C7 86 8D 5B 80 CB 0C C7 F0 5E 4E E9 75 59 7D>)
(   4,<2013-01-17 21:38:19.340 -0500>,<Administrator>,<X>,<proc1d>,<TOPSPIN 2.1>,
      <abs ABSG = 1 
       data hash MD5: 32K
       79 4F 20 FF 2D B7 77 55 4A 4D BA B2 8C D8 02 A7>)
(   5,<2013-01-17 21:38:19.465 -0500>,<Administrator>,<X>,<proc1d>,<TOPSPIN 2.1>,
      <abs ABSG = 2 
       data hash MD5: 32K
       94 B7 EA C0 1F A1 5C F8 37 95 F9 71 79 2C E5 00>)
(   6,<2013-01-17 21:38:19.605 -0500>,<Administrator>,<X>,<proc1d>,<TOPSPIN 2.1>,
      <abs ABSG = 3 
       data hash MD5: 32K
       8A F1 53 90 CE 79 E0 3B 4F A4 AB 53 67 79 03 C4>)
(   7,<2013-01-17 21:38:19.762 -0500>,<Administrator>,<X>,<proc1d>,<TOPSPIN 2.1>,
      <abs ABSG = 4 
       data hash MD5: 32K
       F4 4C 67 34 E2 E9 F1 CD 2A 04 06 9B D2 0B B0 A3>)
(   8,<2013-01-17 21:38:19.902 -0500>,<Administrator>,<X>,<proc1d>,<TOPSPIN 2.1>,
      <abs ABSG = 5 
       data hash MD5: 32K
       21 F5 BE 79 3D 7C 38 D6 2D 20 A7 14 DB B9 05 06>)
$$ ##END=
$$ 
$$ $$ hash MD5
$$ $$ 89 50 8C 15 24 F3 AA 90 04 5F 0B EE 48 17 9F 05
##$RELAX= 
##$RELAX= 
##$RELAX= 
##$RELAX= 
##$RELAX= 
##$RELAX= 
##$RELAX= 
$$ Bruker specific parameters
$$ --------------------------
##$DU= <E:\>
##$EXPNO= 20
$$ [...]
##$TP= (0..7)
150 150 150 150 150 150 150 150
##$TP07= 0
##$TPNAME0= <>
##$TPNAME1= <>
##$TPNAME2= <>
##$TPNAME3= <>
##$TPNAME4= <>
##$TPNAME5= <>
##$TPNAME6= <>
##$TPNAME7= <>
##$TPOAL= (0..7)
0.5 0.5 0.5 0.5 0.5 0.5 0.5 0.5
##$TPOFFS= (0..7)
0 0 0 0 0 0 0 0
##$TUNHIN= 0
##$TUNHOUT= 0
##$TUNXOUT= 0
##$USERA1= <user>
##$USERA2= <user>
##$USERA3= <user>
##$USERA4= <user>
##$USERA5= <user>
##$V9= 5
##$VALIST= <valist>
##$VCLIST= <CCCCCCCCCCCCCCC>
##$VD= 0
##$VDLIST= <DDDDDDDDDDDDDDD>
##$VPLIST= <PPPPPPPPPPPPPPP>
##$VTLIST= <TTTTTTTTTTTTTTT>
##$WBST= 1024
##$WBSW= 4
##$XGAIN= (0..3)
0 0 0 0
##$XL= 0
##$YL= 0
##$YMAX_a= 684985
##$YMIN_a= -582581
##$ZGOPTNS= <>
##$ZL1= 120
##$ZL2= 120
##$ZL3= 120
##$ZL4= 120
##$ABSF1= 14.98509
##$ABSF2= -5.573092
##$ABSG= 5
##$ABSL= 3
##$ALPHA= 0
##$AQORDER= 0
##$ASSFAC= 0
##$ASSFACI= 0
##$ASSFACX= 0
##$ASSWID= 0
##$AUNMP= <proc_prof1d_extract_pilot.lims>
##$AXLEFT= 0
##$AXNAME= <>
##$AXNUC= <1H>
##$AXRIGHT= 0
##$AXTYPE= 0
##$AXUNIT= <>
##$AZFE= 0.1
##$AZFW= 0.1
##$BCFW= 0
##$BC_mod= 0
##$BYTORDP= 0
##$COROFFS= 0
##$CY= 15
##$DATMOD= 1
##$DC= 0
##$DFILT= <>
##$DTYPP= 0
##$F1P= 0
##$F2P= 0
##$FCOR= 0.5
##$FTSIZE= 32768
##$FT_mod= 6
##$GAMMA= 0
##$GB= 0
##$INTBC= 1
##$INTSCL= 1
##$ISEN= 128
##$LB= 0
##$LEV0= 0
##$LPBIN= 0
##$MAXI= 10000
##$MC2= 0
##$MEAN= 0
##$ME_mod= 0
##$MI= 0
##$NCOEF= 0
##$NC_proc= -8
##$NLEV= 6
##$NOISF1= 0
##$NOISF2= 0
##$NSP= 0
##$NTH_PI= 0
##$NZP= 0
##$OFFSET= 14.98509
##$PC= 1
##$PHC0= 95.83374
##$PHC1= 0
##$PH_mod= 1
##$PKNL= yes
##$PPARMOD= 0
##$PPDIAG= 0
##$PPIPTYP= 0
##$PPMPNUM= 2147483647
##$PPRESOL= 1
##$PSCAL= 4
##$PSIGN= 0
##$PYNMP= <proc.py>
##$REVERSE= no
##$SF= 400.02
##$SI= 32768
##$SIGF1= 0
##$SIGF2= 0
##$SINO= 400
##$SIOLD= 32768
##$SPECTYP= <>
##$SREGLST= <1H.CDCl3>
##$SSB= 0
##$STSI= 32768
##$STSR= 0
##$SW_p= 8223.68421052631
##$SYMM= 0
##$S_DEV= 0
##$TDeff= 65536
##$TDoff= 0
##$TI= <>
##$TILT= no
##$TM1= 0
##$TM2= 0
##$TOPLEV= 0
##$USERP1= <user>
##$USERP2= <user>
##$USERP3= <user>
##$USERP4= <user>
##$USERP5= <user>
##$WDW= 1
##$XDIM= 32768
##$YMAX_p= 475662737
##$YMIN_p= -726563
##$CURPLOT= <Network HP LaserJet P1505>
##$CURPRIN= <$Network HP LaserJet P1505>
##$DFORMAT= <normdp>
##$LAYOUT= <+/1D_H.xwp>
##$LFORMAT= <normlp>
##$PFORMAT= <normpl>
##$SURQMSG= 1
$$ End of Bruker specific parameters
$$ ---------------------------------
##NTUPLES= NMR SPECTRUM
##VAR_NAME=  FREQUENCY,     SPECTRUM/REAL,   SPECTRUM/IMAG
##SYMBOL=    X,             R,               I
##VAR_TYPE=  INDEPENDENT,   DEPENDENT,       DEPENDENT
##VAR_FORM=  AFFN,          ASDF,            ASDF
##VAR_DIM=   32768,         32768,           32768
##UNITS=     HZ,            ARBITRARY UNITS, ARBITRARY UNITS
##FACTOR=    0.250966925370066, 1,           1
##FIRST=     8223.43324360094, 104334,       -46211
##LAST=      0,             135344,          -28895
##MIN=       0,             -726563,         0
##MAX=       8223.43324360094, 475662737,    0
$$ Real data points
##PAGE= N=1
##DATA TABLE= (X++(R..R)), XYDATA
$$ [...]
19530a44782A12862C2569N8281k7408a15675K5447l7801a8109g202k05969Q0400
$$ -144782 112862 32569 90850 63442 -115675 -90228 -128029 -18109 -7202 -213171 -132771
19519a32771k5195I4183B5566b54685k51223I46b01796D6925O3846C1896c24636
$$ -132771 -157966 94183 25566 -254685 -505908 946 -201796 46925 110771 31896 -324636
19507d9824K2800E7522b02859B59819h3952b6747C8294d1843j06706A24411b06190
$$ -49824 -27024 57522 -202859 259819 -83952 -26747 38294 -41843 -148549 124411 -206190
19495B118J86759h3125D3570J57958a30543J9243H3274J13747b9848j39035b1647
$$ 2118 188877 -83125 43570 201528 -130543 -111300 83274 197021 -29848 -168883 -21647
19483H2071b02811D92971c06007E9637d9178j18887N0830B2864b66186m5451P8110
$$ 82071 -202811 492971 -306007 59637 -49178 -168065 -117235 22864 -266186 -311637 -233527
19472b33527A98975R4236k4756p9939d50904J45716j70762A73954n2803c6274
$$ -233527 198975 293211 268455 188516 -450904 -305188 -475950 173954 121151 -36274
19461G1060e7892R503l30727c9506O737H3460b28641f7674Q667I2806B4256J08976
$$ 71060 -57892 -48389 -379116 -39506 -32769 83460 -228641 -67674 -59007 92806 24256 133232
19449A33232a04582l34250a66581A57449A0715c55354f8732j90082d4254b0901
$$ 133232 -104582 -438832 -166581 157449 10715 -355354 -68732 -258814 -44254 -20901
19438c363A92182q4696d2721D410a58420A10973a58532A6531b22738G4776r031
$$ -3363 192182 107486 -42721 4410 -158420 110973 -158532 16531 -222738 74776 65745
19427F5745R6547b1421j69780j06368A73501e5407j27313e0775j06848p4388A27823
$$ 65745 162292 -21421 -191201 -297569 173501 -55407 -182720 -50775 -157623 -232011 127823
19415C12938a49749O0040i40A24519c3020f823m3131j58510h6447j96284J39620
$$ 312938 -149749 -89709 -940 124519 -33020 -6823 -49954 -208464 -86447 -282731 -143111
19404a43111a4372F4368c985A41536b8772j50205O046L2839k70l79465e2240l50944
$$ -143111 -14372 64368 -3985 141536 -28772 -178977 -172931 -140092 -140362 -519827 -52240 -403184
19392d03184A49327a50160e0326l2730A74435a96476P7649r574k2201A46324N1362
$$ -403184 149327 -150160 -50326 -83056 174435 -196476 -118827 -128401 -150602 146324 197686
19381A97686d29779K6013B2867J68654b1946E8142a70597f9074K6735b0776l02461
$$ 197686 -429779 -403766 22867 191521 -21946 58142 -170597 -69074 -42339 -20776 -323237
19370c23237B18259j00348c28352B28671a54237c9970B6021H520a06731A03523
$$ -323237 218259 117911 -328352 228671 -154237 -39970 26021 8520 -106731 103523
19359h1384C88773d04517J75473j6400C9022L8541a94471K3092c9601l7264A20266
$$ -81384 388773 -404517 -229044 -245444 39022 77563 -194471 -171379 -39601 -76865 120266
19347c6795F0828b47837a490C12686c74900A46245b30477A64826A4395K02617
$$ -36795 60828 -247837 -1490 312686 -374900 146245 -230477 164826 14395 217012
19337B17012k8004C228a13719f497B6535d21819B54663c36869f7952A41692a54829
$$ 217012 189008 3228 -113719 -6497 26535 -421819 254663 -336869 -67952 141692 -154829
19325b32506C35270c38456a11780j57691d9112k08128j05076a31739J4793n7526
$$ -232506 335270 -338456 -111780 -269471 -49112 -257240 -362316 -131739 -116946 -174472
19315a74472A21802o18h3890A2188b3741E944J37263b6504j06559j71497d0426
$$ -174472 121802 121184 -83890 12188 -23741 5944 143207 -26504 -133063 -304560 -40426
19303c1428F0687A3140b37882a04631b694k39460a07346G9292O6849M7511I3078
$$ -31428 60687 13140 -237882 -104631 -2694 -242154 -107346 79292 146141 193652 93078
19291g4909n713l33476f4104A11832a44989M4209A71509o3624a14335J3846E4862
$$ -74909 -80622 -414098 -64104 111832 -144989 -100780 171509 107885 -114335 -100489 54862
19279b15267I8789M4520c6151R886j87560q6561G631f3858C50451b03574A6510
$$ -215267 98789 143309 -36151 -26265 -213825 -300386 7631 -63858 350451 -203574 16510
19267a87061g1528A25323a56348l31616B7834b66176a3122l4677C65263I8141
$$ -187061 -71528 125323 -156348 -487964 27834 -266176 -13122 -47799 365263 98141
19256E8598c25734a16088D227K03679p6761K96008b39625L0941h5724j0649c6434
$$ 58598 -325734 -116088 4227 207906 131145 427153 -239625 -208684 -85724 -96373 -36434
19244c377B6663b07914a9359k54867g7915L4856A17367b66602M6879J05084k9686
$$ -3377 26663 -207914 -19359 -274226 -77915 -43059 117367 -266602 -219723 -114639 -144325
19233a44325K9068k73252f1833p8761b3606A64128b16583E8593a22003H4222k2884
$$ -144325 -115257 -388509 -61833 -140594 -23606 164128 -216583 58593 -122003 84222 61338
19222F1338b08227a1821m08818d0914C3168b25403i6363B59576b47970h9355b8950
$$ 61338 -208227 -11821 -420639 -40914 33168 -225403 -96363 259576 -247970 -89355 -28950
19210B4471e2922j69035j67305a25374A36856a2363o7028c2989B22484a39430
$$ 24471 -52922 -221957 -389262 -125374 136856 -12363 -79391 -32989 222484 -139430
19199i2472A05478P629P8194a87782A07596b92101b619j797A10597K9787a67116
$$ -92472 105478 113107 191301 -187782 107596 -292101 -2619 -4416 110597 140384 -167116
19187F9614a14621M8486j09380B53769A03181h0852N827G4096b08059n3208b5801
$$ 69614 -114621 -66135 -175515 253769 103181 -80852 -75025 74096 -208059 -261267 -25801
19175a1824j73304e0321l00594a10812E3167g8336B398Q9250o573b79129A99675
$$ -11824 -185128 -50321 -350915 -110812 53167 -78336 2398 91648 85075 -279129 199675
19163C67877l5920b33685E6834i4586B02827a05022A83520C8053a05775J0147
$$ 367877 331957 -233685 56834 -94586 202827 -105022 183520 38053 -105775 -95628
19153i5628q9057F2594K80971a03708d882F6968a20053k29373J06785a04979A48365
$$ -95628 -184685 62594 343565 -103708 -4882 66968 -120053 -349426 -242641 -104979 148365
19141a46165k36953A02181B8163J35764J33145a24508N2516m73G13L25838a45883
$$ -146165 -383118 102181 28163 163927 297072 -124508 -71992 -72465 713 326551 -145883
19129b90640i5190k20429p624A70259c18551a360B35154b61058D7983C073L16535
$$ -290640 -95190 -315619 -323243 170259 -318551 -1360 235154 -261058 47983 3073 319608
19118C19608A12346a08647J4295A47991a96182B10441i9971C39189E5558R2033
$$ 319608 112346 -108647 -94352 147991 -196182 210441 -99971 339189 55558 147591
19108A47591C2621a39415m980j08863F33614c33709b934r291E8379a77253I685
$$ 147591 32621 -139415 -144395 -253258 633614 -333709 -2934 -12225 58379 -177253 9685
19096c98979J06729i1277n8564j0112j44399a23472L0641A55324A6233a26684
$$ -398979 -292250 -91277 -149841 -159953 -304352 -123472 -92831 155324 16233 -126684
19085c55045C19610d231j93338R0620A95756a29589F28a62205G6400b04417j81055
$$ -355045 319610 -4231 -197569 -106949 195756 -129589 628 -162205 76400 -204417 -385472
19074c85472a8939p7728B1155c1292G0306b22518G4977b5789k13005D6234a58899
$$ -385472 -18939 -96667 21155 -31292 70306 -222518 74977 -25789 -238794 46234 -158899
19062a8312F6956f6719A47701a69455c2849H9707M6126c8148q1231C5761a49856
$$ -18312 66956 -66719 147701 -169455 -32849 89707 135833 -38148 -119379 35761 -149856
19050a6990A10552K737D899J43929i8942r393j5499e2826o8651m00340b47269
$$ -16990 110552 113289 4899 148828 -98942 -108335 -123834 -52826 -121477 -521817 -247269
19038A31392f475j05516B5833e9559q2345m103i568b511n6365H6977a72500C2917
$$ 131392 -6475 -111991 25833 -59559 -141904 -146007 -9568 -2511 -58876 86977 -172500 32917
19025I6027b31586C82477j74017M062J5458C5622J14772e2177q9596E3896J79373
$$ 96027 -231586 382477 208460 212522 227980 35622 150394 -52177 -141773 53896 233269
19014B33269H9707l1181b16363A50898F0208i6499d2762j05477o1125B7730K13190
$$ 233269 89707 58526 -216363 150898 60208 -96499 -42762 -148239 -209364 27730 240920
19003B40920e2968A44486b47736a06235O079M0399A26348e3456C14316b91336
$$ 240920 -52968 144486 -247736 -106235 -100156 -59757 126348 -53456 314316 -291336
18992a19709j62147g5022j97067N8087Q8791A62081M3067a52056A82724J2893
$$ -119709 -281856 -75022 -272089 -214002 -125211 162081 205148 -152056 182724 195617
18982A95617c27821e1138A72453i9790K554j2901j22653a10453A77417B4391M827
$$ 195617 -327821 -51138 172453 -99790 -97236 -110137 -232790 -110453 177417 24391 29218
18971B9218J75269a16341K8392F0399b72456k1116E1011h0683k507d0752j95203
$$ 29218 204487 -116341 -87949 60399 -272456 -293572 51011 -80683 -83190 -40752 -235955
18960b35955n4048P8658h586B39065a01650j77447I8989c17926L5245I4455a99299
$$ -235955 -290003 -211345 -8586 239065 -101650 -279097 98989 -317926 -282681 94455 -199299
18948I5283b37803R5231f5976m9603e779A52936a64593N6601d023m037c387j38092
$$ 95283 -237803 -142572 -65976 -115579 -5779 152936 -164593 -107992 -4023 -8060 -3387 -141479
18936a41479j31315f8438b2333m6105C00647a32595k89890G7918B3635K84667
$$ -141479 -272794 -68438 -22333 -68438 300647 -132595 -422485 77918 23635 308302
18926C08302d9316l38689B95620n7489H4306i8156A57104J4137b29402a11982
$$ 308302 -49316 -388005 295620 238131 84306 -98156 157104 171241 -229402 -111982
18915g5571Q501C9656a71179k8202A06543F180f2558n827A63287j2057b14172
$$ -75571 -67070 39656 -171179 -199381 106543 6180 -62558 -68385 163287 151230 -214172
18903f4503H7713l5030R8747J79320B5074J6380A2878K7683K34767C9538a70478
$$ -64503 87713 52683 151430 330750 25074 41454 12878 40561 275328 39538 -170478
18891b9848A84878b79425n3234F337J53290a66184E2340i026j47910a3398b06
$$ -29848 184878 -279425 -332659 6337 159627 -166184 52340 -9026 -156936 -13398 -206
18879a31499C12731a6422D4506L578J49264b4034n3703B3683a66072N0076d4403
$$ -131499 312731 -16422 44506 48084 197348 -24034 -77737 23683 -166072 -115996 -44403
18867F4606f0225k8934j66974F9364l4209c01281j07661a13085a1619k97971D5702
$$ 64606 -60225 -89159 -256133 69364 35155 -301281 -408942 -113085 -11619 -309590 45702
18855a45655J7607G1674b43149h5672a7039m16534A11428J97435b1970j0690A516
$$ -145655 -128048 71674 -243149 -85672 -17039 -433573 111428 308863 -21970 -32660 1516
18843B17430d653m5833l08090H3818a7539l77633a12924A74809i4550k85300C26251
$$ 217430 -4653 -50486 -358576 83818 -17539 -395172 -112924 174809 -94550 -379850 326251
18831A03944b11644A61732b52825J5906J17843A04184d2295k35916E5672g99k59939
$$ 103944 -211644 161732 -252825 -236919 -119076 104184 -42295 -278211 55672 -799 -260738
18820b60738d0812J3612I3769A2007g084j57595k802D34401A2379a08647j13419
$$ -260738 -40812 -27200 93769 12007 -7084 -164679 -167481 434401 12379 -108647 -222066
18809b22066B22613I0302d1710k13109E3318K13534a77271F4006b41756M9682
$$ -222066 222613 90302 -41710 -254819 53318 266852 -177271 64006 -241756 -192074
18799a92074I126L19366A1233b67628J05705A35921a76179C7474a56177j85223
$$ -192074 9126 328492 11233 -267628 -161923 135921 -176179 37474 -156177 -341400
18789c41400f6256A82128h7331A59449a00821b9898j13618d7156A60851b79998
$$ -341400 -66256 182128 -87331 159449 -100821 -29898 -143516 -47156 160851 -279998
18778c2743A55157f9943K6835j56953N3791B2465f14519B2877d98349A21425a83303
$$ -32743 155157 -69943 -43108 -200061 -146270 22465 -614519 22877 -498349 121425 -183303
18766A62338C8016h7779B5560m514d1294m561E3097a92995K2951E0258R2028o3530
$$ 162338 38016 -87779 25560 21046 -41294 -45855 53097 -192995 -170044 50258 142286 78756
18754G8756l2327K5174b0768n2428I2382b20422b1056B808i418B22501d389l9963
$$ 78756 46429 71603 -20768 -73196 92382 -220422 -21056 2808 -9418 222501 -4389 -44352
18742d4352b425A27601h3800A27771a07504A3946Q0g613B96411a28718c5343E2520
$$ -44352 -2425 127601 -83800 127771 -107504 13946 14026 -7613 296411 -128718 -35343 52520
18729A62853D6891i2975c8262D137K36095h5256c4513l6683A10373a46123D51533
$$ 162853 46891 -92975 -38262 4137 240232 -85256 -34513 -71196 110373 -146123 451533
18717a63025q3119i5127b6622A04668M6471o116b1841k0191F4111f2786q7307
$$ -163025 -246144 -95127 -26622 104668 151139 145023 -21841 -42032 64111 -62786 -150093
18706a50093B9951e1448A82548N5133E4066b51307R5049F9037h1241n2098B49345
$$ -150093 29951 -51448 182548 237681 54066 -251307 -156258 69037 -81241 -133339 249345
18694a87164k13866A13265e5318A18936C5477j2616f6483A06730g4055C82631
$$ -187164 -401030 113265 -55318 118936 35477 22861 -66483 106730 -74055 382631
18683b60209A7079J76642c21718H423M6338d3490K0253m18785a72993e990j86304
$$ -260209 17079 193721 -321718 8423 54761 -43490 -23237 -442022 -172993 -5990 -192294
18672a92294d60l48766O4759l5936J29538P9000N1198B64630A22183Q6255c35394
$$ -192294 -460 -349226 -284467 -320403 -190865 -111865 -60667 264630 122183 208438 -335394
18660c75416J13326H881g4783l26562J82206l38309H9542c11384d0109E9547N1774
$$ -375416 -262090 8881 -74783 -401345 -219139 -557448 89542 -311384 -40109 59547 111321
18649A11321e8078l7178G9821a50920m9856r2213J42449A04060i1638L1430A29580
$$ 111321 -58078 -95256 79821 -150920 -200776 -292989 -150540 104060 -91638 -60208 129580
18637a15465j06464m4592l03122A22136b60892a10654A38579D2165J1304a70367
$$ -115465 -221929 -266521 -569643 122136 -260892 -110654 138579 42165 53469 -170367
18626C5239J51817q7973b9499k50026B56146i8041k69303C85475b17148Q0263
$$ 35239 187056 99083 -29499 -279525 256146 -98041 -367344 385475 -217148 -136885
18616a36885d4364n9816A92788K4255A2729K27084a06695p678c9874l71709d8943
$$ -136885 -44364 -104180 192788 217043 12729 239813 -106695 -114373 -39874 -411583 -48943
18604d75106a28861N4173l9480A17826a86724j13830C28214a7475A03201J26004
$$ -475106 -128861 -74688 -114168 117826 -186724 -300554 328214 -17475 103201 229205
18594B29205a57094o3139j86857B27972b91882Q0068Q9495I8206K6368b93870
$$ 229205 -157094 -220233 -407090 227972 -291882 -211814 -122319 98206 124574 -293870
18583A51307f3481C65741d9966j89272P9141b0536r2090D1372d15937L7772A33461
$$ 151307 -63481 365741 -49966 -239238 -160097 -20536 -112626 41372 -415937 -378165 133461
18571b558j01719j16386D4524a47442d4564N409B99959b33078j76949a69804O3290
$$ -2558 -104277 -220663 44524 -147442 -44564 -39155 299959 -233078 -410027 -169804 -106514
18560a06514m8503g7140m18902A15286a5277j3116B28860m0439n6777c06817a19873
$$ -106514 -155017 -77140 -496042 115286 -15277 -28393 228860 188421 131644 -306817 -119873
18548c79292G0614g5613A32490D1620M7354b69280g8428j55190R0243A84056E882
$$ -379292 70614 -75613 132490 41620 88974 -269280 -78428 -233618 -143375 184056 5882
18536c44488h4071b2178k72730e7442C75802E9444k2698K4955a33882O5623j64012
$$ -344488 -84071 -22178 -294908 -57442 375802 59444 36746 61701 -133882 -68259 -232271
18525b32271L7625l56k0013A5826b27725c2291A40914a86392H4581k0964b19793
$$ -232271 -194646 -195002 -215015 15826 -227725 -32291 140914 -186392 84581 63617 -219793
18513a39373B3993a91496A19610R2124G588M70574f014A00577K920a86401b4319
$$ -139373 23993 -191496 119610 211734 7588 478162 -6014 100577 103497 -186401 -24319
18501c11054e696j12088j97122b8950l29002A61981a59207K6659K3707D2976b3362
$$ -311054 -5696 -117784 -314906 -28950 -357952 161981 -159207 -132548 -108841 42976 -23362
18489A3515b40404h0052j72544D7588p595B15a70947A28283a33804k19311a74673
$$ 13515 -240404 -80052 -252596 47588 39993 215 -170947 128283 -133804 -353115 -174673
18477b0821j14011B8725a68273D6222k2735b69015b1793j49550a8915l07707R2206
$$ -20821 -134832 28725 -168273 46222 23487 -269015 -21793 -171343 -18915 -326622 -234416
18466b34416a408A76824b34700a05584p8980j96621C4417b77066P8046A51777
$$ -234416 -1408 176824 -234700 -105584 -184564 -381185 34417 -277066 -199020 151777
18455d4178j35139c7695j10626A97131K5800b44963A37549b80240c295H3593J0616
$$ -44178 -179317 -37695 -148321 197131 222931 -244963 137549 -280240 -3295 83593 94209
18444I4209l6506J81d3605m4759E8411c14963A36298R7007a64682j29448d0670
$$ 94209 57703 57884 -43605 -88364 58411 -314963 136298 233305 -164682 -294130 -40670
18432A4264J20197a00312j60517C2317a83668a3592j59725Q3731q7443C4237M2904
$$ 14264 134461 -100312 -260829 32317 -183668 -13592 -173317 -89586 -177029 34237 77141
18421G7141J70502j21909B2316c5558n4569D4326J7007J0974R5481c37366F695
$$ 77141 247643 125734 22316 -35558 -90127 44326 61333 72307 167788 -337366 6695
18409b19722D4387a82410n0080P7176N5779A58877N8007a24442A04532b34945
$$ -219722 44387 -182410 -232490 -155314 -99535 158877 216884 -124442 104532 -234945
18398a26846A18012b5032B2418J69554b09794a1475A50239f6829A096J28739d1007
$$ -126846 118012 -25032 22418 191972 -209794 -11475 150239 -66829 1096 129835 -41007
18386C08496c54722A37925K23744b37276h0832B04201a6561r8367b5756G4385
$$ 308496 -354722 137925 361669 -237276 -80832 204201 -16561 -114928 -25756 74385
18375c94784C096O363K82386c4814M363C7224a29003A63580a4089I4963J11019
$$ -394784 3096 9459 291845 -34814 -30451 37224 -129003 163580 -14089 94963 205982
18364B05982b84707A35897a91182a7934C45164a19884C76557c24864g2394E3152
$$ 205982 -284707 135897 -191182 -17934 345164 -119884 376557 -324864 -72394 53152
18353a18264B2490a39158A25804A5607N1592a88956A224b7237I8243K5422c14164
$$ -118264 22490 -139158 125804 15607 67199 -188956 1224 -27237 98243 123665 -314164
18341a9696H4464P6098c67761f5462A39413O0297c33815A5255N178c5903H2132
$$ -19696 84464 160562 -367761 -65462 139413 199710 -333815 15255 20433 -35903 82132
18329b65404n4511A40838R455a51820f321j41512e2720l6122F1322o04e3877j45142
$$ -265404 -319915 140838 150293 -151820 -6321 -147833 -52720 -88842 61322 60718 -53877 -199019
18317a99019P2380e1457j73359K3712B6416K80486A35030a26185L9326A42689
$$ -199019 -126639 -51457 -224816 -201104 26416 306902 135030 -126185 -86859 142689
18306a05439L4340A04827a21154M7462L5394e715j07116J7582c7155C78220C299
$$ -105439 -71099 104827 -121154 -73692 -38298 -5715 -112831 -95249 -37155 378220 3299
18294b66282J00660O9292D2953e5575A10062M8592a41961j21438f5666j52572
$$ -266282 -165622 -96330 42953 -55575 110062 158654 -141961 -263399 -65666 -218238
18284b18238B2159K46689D0988a9196A64707K1518D5363M4722a45856A00561c61338
$$ -218238 22159 268848 40988 -19196 164707 186225 45363 90085 -145856 100561 -361338
18272a95458D6365d7145A84335i0740K2265k07348o5863H5291B0710M0589R5224
$$ -195458 46365 -47145 184335 -90740 -68475 -275823 -341686 85291 20710 61299 156523
18261A56523i195I9383Q791h3430j51080a4277k07220e0837l08894a73590A4787
$$ 156523 -9195 99383 108174 -83430 -234510 -14277 -221497 -50837 -359731 -173590 14787
18249c56059a06644H5979M543b95909J07648O0392p5958C3020a56235C2642b24308
$$ -356059 -106644 85979 90522 -295909 -188261 -127869 -203827 33020 -156235 32642 -224308
18237b50883h2974C25645a03887A08304a22336a6216A20254M7822F908K5262c9046
$$ -250883 -82974 325645 -103887 108304 -122336 -16216 120254 168076 6908 32170 -39046
18225b5477B5109J30352a88751B16598e13256b0848j89170H1727c1964l9257B70072
$$ -25477 25109 155461 -188751 216598 -513256 -20848 -210018 81727 -31964 -71221 270072
18213b82119P0985L9700e743l4727H7575a54128j8304C62604b0028k31620h2167
$$ -282119 -211134 -171434 -5743 -40470 87575 -154128 -172432 362604 -20028 -251648 -82167
18201c4024A62N2294E953K08079O8934a63972o0786Q6966H4643a52465e7998I1219
$$ -34024 162 52456 5953 214032 282966 -163972 -224758 -137792 84643 -152465 -57998 91219
18188A46731P5958E7575L2927k6490a45295G7238J79385r53j01720m0544e9857
$$ 146731 222689 57575 90502 64012 -145295 77238 256623 255670 153950 113406 -59857
18176a51384D7595O9242a36170A787a37143A80662L363G3359a45270B9190P3144
$$ -151384 47595 116837 -136170 1787 -137143 180662 184025 73359 -145270 29190 102334
18165A02334d01039h0253A75749f4403j9938B40844b52307h2636F0491a55833
$$ 102334 -401039 -80253 175749 -64403 -84341 240844 -252307 -82636 60491 -155833
18154c91108C10595j45684b51411P6763j73469C0452L45469A20628Q131c2700
$$ -391108 310595 164911 -251411 -174648 -348117 30452 375921 120628 128759 -32700
18143f5233j34482N4441K5945B8128O2514f0202r0370J7353A12292O433a47566
$$ -65233 -199715 -145274 -119329 28128 90642 -60202 -150572 -133219 112292 118725 -147566
18131b41034a4326A69038a06265B468a29296I1508a0902E93512h0693A58948b1256
$$ -241034 -14326 169038 -106265 2468 -129296 91508 -10902 593512 -80693 158948 -21256
18119A45981b17517A5399L8185b29942F1745b95801B13428l1082f2662A53180
$$ 145981 -217517 15399 53584 -229942 61745 -295801 213428 182346 -62662 153180
18108d22970J35375J40638f4149j12500h5534H2310a44827j0448I0661J46532
$$ -422970 -287595 -146957 -64149 -176649 -85534 82310 -144827 -155275 90661 237193
18098B37193a20640K9720D5750J1297b46493k11771B00585b2169j55858B74992
$$ 237193 -120640 -90920 45750 57047 -246493 -458264 200585 -22169 -178027 274992
18087b48368C9173N8112a1790l1582E1733b26897M6101A26259J54022b62867G4571
$$ -248368 39173 97285 -11790 -43372 51733 -226897 -180796 126259 280281 -262867 74571
18075c41588a10992a7202F1276f4110h786q3626i475H1147C1545b4062k32931
$$ -341588 -110992 -17202 61276 -64110 -8786 -92412 -9475 81147 31545 -24062 -256993
18064b56993a20710B90530a22612j25459n622A6471b90994a2537j30639B6289
$$ -256993 -120710 290530 -122612 -248071 -253693 16471 -290994 -12537 -143176 26289
18053c5520l0510j02864c5021D8914a67407j62003A99146A3214J63329a82997
$$ -35520 -66030 -168894 -35021 48914 -167407 -329410 199146 13214 176543 -182997
18042a70600B22263B0884J01725a76801A16786c71764b3411k0248j16692n4582
$$ -170600 222263 20884 122609 -176801 116786 -371764 -23411 -43659 -160351 -214933
18032b14933e0717A61878d8435B25154a56773M3571k79643b0973n7319j70977
$$ -214933 -50717 161878 -48435 225154 -156773 -113202 -392845 -20973 -78292 -249269
18022b49269B55974q5235o5971M48746C8610a41840B3328c3344l9700o7770C63756
$$ -249269 255974 170739 104768 553514 38610 -141840 23328 -33344 -73044 -140814 363756
18010g6749k62244A90299K17360c8808C04705b24535A75471E939b91792M043a9003
$$ -76749 -338993 190299 407659 -38808 304705 -224535 175471 5939 -291792 -287749 -19003
17998G6858J62321a60299f5502m8707A53915a06546n344C5669c5982P102A61446
$$ 76858 239179 -160299 -65502 -114209 153915 -106546 -111890 35669 -35982 -28880 161446
17986G8733A3891N6386a97267P5693j2613B13289c46562B46585a6855B54957a10981
$$ 78733 13891 70277 -197267 -121574 -134187 213289 -346562 246585 -16855 254957 -110981
17974B18203c17359B11649J08420c4033j41770P8013I5672h6413D7294J72941
$$ 218203 -317359 211649 320069 -34033 -175803 -97790 95672 -86413 47294 220235
17964B20235e8312m51920A41212h4838j59242f1011k67464g9679j3729A21378
$$ 220235 -58312 -510232 141212 -84838 -244080 -61011 -328475 -79679 -93408 121378
17953h9146D23355a73319A77692b13332I9414G677k089J10415i8658k2637E44
$$ -89146 423355 -173319 177692 -213332 99414 7677 5588 116003 -98658 -121295 544
17941b14602P7371A32409B7595a76237f3383m6217D0446b53828E4685a5853k23612
$$ -214602 -137231 132409 27595 -176237 -63383 -109600 40446 -253828 54685 -15853 -239465
17930b39465e9887G0862N49604a03017A34882Q1275a57520A17980J26663a89361
$$ -239465 -59887 70862 620466 -103017 134882 216157 -157520 117980 244643 -189361
17919A35763m1635J93373N5074B6272L50860G675K77341c1147I674J0025J88456
$$ 135763 94128 287501 342575 26272 377132 7675 285016 -31147 9674 19699 208155
17908B08155b35187H8144c73154j05510A35612L58367b7915B29380H2619P6965
$$ 208155 -235187 88144 -373154 -478664 135612 493979 -27915 229380 82619 159584
17898A59584d2201j33876A07048a58076j1637f6295C6707a98609o0074i0658B53876
$$ 159584 -42201 -176077 107048 -158076 -169713 -66295 36707 -198609 -258683 -90658 253876
17886A47588b22031j45049J08918D4164b91027A18017D5416a00072m3870K5406
$$ 147588 -222031 -367080 -258162 44164 -291027 118017 45416 -100072 -143942 -118536
17876a18536B30437f0082Q255A15183d14591e4796o6292A01778b29782f6421o3450
$$ -118536 230437 -60082 -51827 115183 -414591 -54796 -121088 101778 -229782 -66421 -129871
17865a29871l5438m0764A74022M9395h0438l2938j78518J27316J0884A73741c93876
$$ -129871 -165309 -206073 174022 223417 -80438 -113376 -291894 -164578 -153694 173741 -393876
17853d4564j9991j74389N4205A82454J0583a73112A06512P8050H8785i4648C2459
$$ -44564 -64555 -238944 -184739 182454 193037 -173112 106512 184562 88785 -94648 32459
17841C91657d4863c713E4235l467L3552g2873F3018A3110a66686b1334p1411A40368
$$ 391657 -44863 -3713 54235 50768 84320 -72873 63018 13110 -166686 -21334 -92745 140368
17828H2439a25669e467A56559Q4407A3510b02438B46014a87235l0983P2324A29650
$$ 82439 -125669 -5467 156559 240966 13510 -202438 246014 -187235 -218218 -145894 129650
17816D65673c0392B9838a1543j93923D00553c29516G12a4972A44515a98683r3667
$$ 465673 -30392 29838 -11543 -205466 400553 -329516 712 -14972 144515 -198683 -292350
17805b92350H4854a14007d5471K1805F3119e6998l15596h8907D39074h6587B89891
$$ -292350 84854 -114007 -45471 -23666 63119 -56998 -372594 -88907 439074 -86587 289891
17793a17525C15214a67733b9344k74373e4132B34674a1115k0004j45491I641b31412
$$ -117525 315214 -167733 -29344 -303717 -54132 234674 -11115 -31119 -176610 9641 -231412
17781a69970B23789F587J63577a34954A33677o1835L1285J48723H7541K26399
$$ -169970 223789 6587 170164 -134954 133677 71842 103127 251850 87541 313940
17771C13940L3935C4056K6616Q6633g2438A08737K22890a18627m2462B09160J04708
$$ 313940 347875 34056 60672 147305 -72438 108737 331627 -118627 -161089 209160 313868
17760C13868c7679A74798c17558A78062H00c04228a2123A72053L943b08730P1069
$$ 313868 -37679 174798 -317558 178062 800 -304228 -12123 172053 175996 -208730 -137661
17749a37661l8398A49681A5157b15k8595D25441h0591n2765e8724j49375E4209
$$ -137661 -176059 149681 15157 -215 -28810 425441 -80591 -133356 -58724 -208099 54209
17737G7215c61j43394A11983c3042B73663O0996d5725l23272b4825C97483a08737
$$ 77215 -361 -143755 111983 -33042 273663 334659 -45725 -368997 -24825 397483 -108737
17725I7322e5393j68913q1204D01185a82491C0831e8242A36890c8633C35066A4635
$$ 97322 -55393 -224306 -305510 401185 -182491 30831 -58242 136890 -38633 335066 14635
17713G939e6847C44743b5989l00515A83137F0889M6254e2750m6024j0432j35173
$$ 7939 -56847 344743 -25989 -326504 183137 60889 107143 -52750 -98774 -109206 -244379
17702b44379D07338D023M85184a64553I7854a05065l37935A69919a6748F1074
$$ -244379 407338 4023 489207 -164553 97854 -105065 -443000 169919 -16748 61074
17691A9011c7169A60820b64549B08084M5292A08013D454a13108B8938P7333a88416
$$ 19011 -37169 160820 -264549 208084 253376 108013 4454 -113108 28938 106271 -188416
17679A67092n7092K12033C1416c62455a61706j18781F987a92601R2616A69192
$$ 167092 110000 322033 31416 -362455 -161706 -280487 6987 -192601 -99985 169192
17668h0359A37738d2316k0167B99779A38821J88474b8375A67626O5153d3992D51437
$$ -80359 137738 -42316 -62483 299779 138821 327295 -28375 167626 232779 -43992 451437
17656c0020A92953b46131D08615A55942B3434a05123B56366I9427a3533l9926
$$ -30020 192953 -246131 408615 155942 23434 -105123 256366 99427 -13533 -53459
17646e3459k68776C7987K34925c52708B42423a33151D7252n528A7069J18636g0498
$$ -53459 -322235 37987 272912 -352708 242423 -133151 47252 41724 17069 135705 -70498
17634E1895a78333F2898J16667J50007H2127a30330D2855O4355a90154A10346
$$ 51895 -178333 62898 179565 329572 82127 -130330 42855 107210 -190154 110346
17623f0380l13608C65932j54810a23898B70932o746a7694C97268j57771E6450
$$ -60380 -373988 365932 211122 -123898 270932 264186 -17694 397268 239497 56450
17612b39683h4403H2798C1071d9967A28073O662f3679A06207a5267C00874a0956
$$ -239683 -84403 82798 31071 -49967 128073 134735 -63679 106207 -15267 300874 -10956
17600E7179j2456A4858J47347l2460f9324A51830J0142E1064B4762a51106B79909
$$ 57179 44723 14858 162205 129745 -69324 151830 161972 51064 24762 -151106 279909
17588B01831E6690i5602B47348c6555A13511K06660E2661J2311K43407K9401A49276
$$ 201831 56690 -95602 247348 -36555 113511 320171 52661 64972 308379 337780 149276
17576B38825B7706M762e464l618l46646a16703B78219b4274D30459a11970C872
$$ 238825 27706 32468 -5464 -9082 -355728 -116703 278219 -24274 430459 -111970 3872
17564D06314h6297o8821j60874b0358B87710a19628B12317b0111F2017R0130h1879
$$ 406314 -86297 -155118 -315992 -20358 287710 -119628 212317 -20111 62017 152147 -81879
17552A17189D0559a6206C2073d8319C1516J91685A04039n67j1948n514J25322
$$ 117189 40559 -16206 32073 -48319 31516 223201 104039 103472 91524 86010 211332
17541B11332b98838B4357i0686K3735j70804B50926A03318b0157m0911D02463
$$ 211332 -298838 24357 -90686 -66951 -237755 250926 103318 -20157 -61068 402463
17530A63069b31657Q7765L6614q5880B73299R7296j38439K57764C6602c604m4746
$$ 163069 -231657 -143892 -107278 -193158 273299 370595 232156 489920 36602 -3604 -48350
17519d8350j31763G51K57002b87972D38017o7747D2721A3636R0015b866B5429
$$ -48350 -180113 751 257753 -287972 438017 370270 42721 13636 103651 -2866 25429
17507a23580J9711I2316A4578L09289A05669L35788a38076f2269A36606c2947
$$ -123580 -103869 92316 14578 323867 105669 441457 -138076 -62269 136606 -32947
17496A94106H3948J10295G4507J44841K47821a56796B05203a69444I6631d429
$$ 194106 83948 194243 74507 219348 467169 -156796 205203 -169444 96631 -4429
17485b05579B48993a61020B12666m4158N76a53992c1955m9554C67851p9912a67935
$$ -205579 248993 -161020 212666 168508 169084 -153992 -31955 -81509 367851 287939 -167935
17473B65004J68170C4890J43417P5788o5173B574J85897p1526K57438a21839E24116
$$ 265004 433174 34890 178307 254095 188922 2574 188471 116945 374383 -121839 524116
17461e0213k1917A92171K99902o6542A87292E9126J60081r3387K12142J41396
$$ -50213 -72130 192171 492073 425531 187292 59126 219207 125820 337962 479358
17451D79358q5762Q9502H6593J75941J43044J9419J51564j95842p8085A44769
$$ 479358 393596 483098 86593 262534 405578 424997 576561 380719 302634 144769
17440B93616r778K10704J9123o5203k13830k9872J97256m8564A10888K18219G0453
$$ 293616 283838 494542 513665 448462 234632 204760 402016 353452 110888 329107 70453
17428A28904J97331E0407K49595j24896J49337l5193I9353j0340f4142C41287
$$ 128904 326235 50407 300002 175106 324443 289250 99353 89013 -64142 341287
17417D38421j14867q9901m5431R3981j02089b49j9933D28946j02169j59409N0712
$$ 438421 323554 233653 188222 282203 180114 -249 -20182 428946 326777 167368 218080
17406B18080M67998b55225B41594n6884l8247F5705L25280k1876j32470m5062
$$ 218080 686078 -255225 241594 184710 146463 65705 390985 369109 236639 191577
17396A91577F3254L25368A41880P9344b50820A57537e4847O689A34072M592j0315
$$ 191577 63254 388622 141880 221224 -250820 157537 -54847 -48158 134072 138664 128349
17385A28349L68074A48142P8046P2387Q4604A36750h5362H9310J454K44212f4197
$$ 128349 496423 148142 226188 298575 383179 136750 -85362 89310 90764 334976 -64197
17373B84272r3045G1742O0559n3353P6355K55372B8014c1097E050R8979K17177
$$ 284272 191227 71742 132301 78948 155303 410675 28014 -31097 5050 104029 321206
17362C21206c1749B50279C8570M17003b4537m0063D42737j92210b98369E4012
$$ 321206 -31749 250279 38570 455573 -24537 -64600 442737 250527 -298369 54012
17351D0973K39340J54976A56370I649J09369Q565O8956q5770J18888N1900I305
$$ 40973 280313 435289 156370 9649 119018 127583 196539 110769 229657 281557 9305
17339B87583A07680k692J16195J9560J31673O96L3993p071Q1053j12724J09323
$$ 287583 107680 104988 221183 240743 372416 373112 407105 400034 481087 368363 477686
17328D77686B35654g8337l3445A65419K41992A26778J72902r5187a09351A45148
$$ 477686 235654 -78337 -111782 165419 407411 126778 299680 204493 -109351 145148
17317B35085A01351j4280l1591J10665J30614q8887q8180l6397i1225A12498a31831
$$ 235085 101351 87071 55480 166145 296759 207872 119692 83295 -91225 112498 -131831
17305d6524k6675I4065B6690d071C26239j2720J01598K23955k21236A16890J71073
$$ -46524 -73199 94065 26690 -4071 326239 313519 415117 639072 417836 116890 287963
17294B87963j24953f527A95572p4486L69492c01255A76587l0999l4902D3579r375
$$ 287963 163010 -6527 195572 121086 490578 -301255 176587 145588 110686 43579 34204
17283C4204K01715M471b39B42152P5213K56938k26748r2952N1414J6933k5404
$$ 34204 235919 240390 -239 242152 317365 574303 347555 254603 306017 322950 297546
17272B97546A34789O6722n3057Q4170K21770A51744M2105J0964h68C9882d4652
$$ 297546 134789 201511 148454 232624 454394 151744 193849 204813 -868 39882 -44652
17260E27296l6797j61036m3213B9783M02702B15384O0957j35715J45720D7491
$$ 527296 490499 329463 286250 29783 432485 215384 276341 140626 286346 47491
17249E63973A78791p0286a41243B31373J6208n9664K16327A93568H363L12975
$$ 563973 178791 108505 -141243 231373 247581 187917 404244 193568 8363 321338
17239C21338A05639b9438j04666H7138K34619L6476J20329j0214j59033J63499
$$ 321338 105639 -29438 -134104 87138 321757 358233 478562 468348 309315 472814
17229D72814o2347A41896N2969J05262g9828D1762M63565j83412o3873a11502
$$ 472814 410467 141896 194865 300127 -79828 41762 505327 321915 258042 -111502
17218B55503K18050A70482K56190j61347L0756O1332l2507m0831N20286l82806
$$ 255503 473553 170482 426672 265325 296081 357413 324906 284075 804361 421555
17208D21555r890q5954j07225J37049N2470K64586C21091O5840j56761p5279J67861
$$ 421555 411665 325711 218486 355535 408005 672591 321091 386931 230170 154891 322752
17197C22752q9194M752Q7972L49368j91098A59591C3506R2297l4859K6702J14161
$$ 322752 233558 238310 326282 675650 484552 159591 33506 125803 90944 117646 231807
17186B31807K52255j43748A46644L5554J64949J68599A45497N9629Q3096j41295
$$ 231807 484062 340314 146644 182198 347147 515746 145497 205126 288222 146927
17176A46927L4937K88244p8137I0056Q4961K44666j73500N8658A40096M00043
$$ 146927 181864 470108 391971 90056 175017 419683 246183 304841 140096 540139
17166E40139c9365A83547J35294J45058j69380A15870K52839j591L97435A90152
$$ 540139 -39365 183547 318841 463899 294519 115870 368709 367118 764553 190152
17155D12740j96169R4108A47837c3773C60466F6064K20919L01481j77501j42303
$$ 412740 216571 310679 147837 -33773 360466 66064 286983 588464 410963 268660
17145B68660J04390p7530L60625A54770J61157N55967F8263P00471A87780J0733
$$ 268660 373050 295520 656145 154770 315927 871894 68263 768734 187780 198513
17135A98513J10925N4930m4748N6257K9491J20337k52953C6003K13820j0763J60674
$$ 198513 309438 364368 319620 375877 405368 525705 272752 36003 249823 239060 399734
17124C99734m3019j7016L99744C11427A02827L22202J52970B21943L1609J77267
$$ 399734 356715 339699 739443 311427 102827 425029 577999 221943 253552 430819
17114D30819j12058c9802D12344L9878j65135o9641K13052L2542n1111L63561
$$ 430819 318761 -39802 412344 452222 287087 217446 430498 463040 411929 775490
17104G75490A04363J68712K43828M0882B66383J67545L05087k80397J23662k24755
$$ 775490 104363 273075 516903 557785 266383 433928 739015 458618 582280 357525
17094C57525j46180L43215j81994M29426p2436j645M2802l80253Q8260r9792j16030
$$ 357525 211345 554560 372566 801992 729556 727911 770713 390460 478720 378928 262898
17083B62898L23072o0398K29004l56015M2253L49625l86044j05910K92626B52252
$$ 262898 585970 525572 754576 398561 440814 790439 404395 298485 591111 252252
17072C06159Q6223K19848q0619m868M95723A88327M49124k82838M67018l93768
$$ 306159 392382 612230 531611 526743 1022466 188327 637451 354613 821631 427863
17062D27863L34888o3124j41815j01779L67058k75447K18278j01956M0613r2799
$$ 427863 762751 699627 557812 456033 823091 547644 765922 663966 704579 611780
17052F11780j79601K01147k43992J73358K20645k88557o5293M04814k06038L75312
$$ 611780 432179 633326 389334 562692 783337 494780 429487 834301 628263 1003575
17042A003575m49722K816K8376B42732N56177J23111l05077K9706j32348K03688
$$ 1003575 553853 556669 585045 242732 798909 922020 616943 646649 514301 717989
17032G17989L4581M7206J1656R7030p6807j71005K81383k63560j01250l5004J09679
$$ 717989 752570 799776 811432 908462 831655 660650 942033 678473 577223 542219 651898
17021F51898k4596L47473l68182K91094q8266K15181n7992J3653j56853J66441
$$ 651898 627302 974775 606593 897687 809421 1024602 966610 980263 823410 989851
17011I89851l6053l12038J61188l3364M7580j89194K51089l20783m4858O78014
$$ 989851 953798 641760 802948 769584 817164 627970 879059 558276 513418 1191432
17001A191432k42206M2711l0449K55506j43714m24092N73239k85299n0389n2831
$$ 1191432 949226 991937 961488 1216994 1073280 649188 1222427 937128 886739 833908
16991H33908K9931l1322K61616j60740j47994m8953M20732R5022l47586j25317
$$ 833908 863839 832517 1094133 933393 785399 736446 1157178 1252200 904614 779297
16981G79297K04902K25004l66486L53369m65707L77734l29947K64441j25492J39932
$$ 779297 984199 1209203 842717 1196086 730379 1108113 778166 1042607 917115 1057047
16971A057047J86935k75921L13558k95442j32088N49735k90455j21105O5979J83243
$$ 1057047 1243982 968061 1281619 986177 854089 1403824 1113369 992264 1058243 1241486
16961A241486p6215J44612n8253M2090n244l27175R397L56216m514j82204N7748
$$ 1241486 1165271 1309883 1251630 1293720 1288476 961301 970698 1326914 1322400 1140196 1197944
16950A197944O5985J3856k08259L95178k4675J54629n05057J44631K93089J32743
$$ 1197944 1263929 1277785 1069526 1464704 1440029 1594658 1089601 1234232 1527321 1660064
16940A660064l9377k67658n4323j5233R7712J05550J01455M6881O3744r6389n06700
$$ 1660064 1620687 1353029 1298706 1283473 1381185 1486735 1588190 1635071 1698815 1602426 1095726
16929A095726L17127J71804J04581R0896j53165k23305M96225m70041J70432j88940
$$ 1095726 1412853 1584657 1689238 1780134 1626969 1403664 1899889 1429848 1600280 1411340
16919A411340N54712n12615K34899K99988l3587m77720L62302j09933j2223j05991
$$ 1411340 1966052 1453437 1688336 1988324 1954737 1477017 1839319 1729386 1717163 1611172
16909A611172K14537l19746M67452K27966n15817M11087j11576l7942J20693J09934
$$ 1611172 1825709 1505963 1973415 2201381 1685564 2096651 1985075 1947133 2067826 2177760
16899B177760L26891n39691M47909j62471j74204L10708j25297J10609q4834J20931
$$ 2177760 2504651 1964960 2412869 2250398 2076194 2386902 2261605 2372214 2287380 2408311
16889B408311P0378K11062l39300O9013j00877K41906l81813L04043L66011k80821
$$ 2408311 2478689 2689751 2350451 2419464 2318587 2560493 2178680 2482723 2848734 2567913
16879B567913J78249k9196j68375K1194K69384K35250n40593M79770Q8036k84431
$$ 2567913 2746162 2716966 2548591 2569785 2839169 3074419 2533826 3013596 3101632 2817201
16869B817201M26444o9671k09844j29129K59750l59920O14978L9747l1798N9407
$$ 2817201 3243645 3173974 2964130 2835001 3094751 2734831 3349809 3389556 3357758 3417165
16859C417165k4138O9801k5034K87111r8508n40064O87572M0243R9013M243o9597
$$ 3417165 3393027 3462828 3437794 3724905 3626397 3086333 3773905 3814148 3913161 3917404 3847807
16848C847807K49536P4056j90677L95072q3100R0903j33594j7489K99527L53810
$$ 3847807 4097343 4171399 3980722 4375794 4292694 4383597 4250003 4232514 4532041 4885851
16838D885851j17939P0371J86310q4340l542O38330n41246O1681M51947K24599
$$ 4885851 4767912 4838283 5024593 4940253 4936711 5575041 5033795 5095476 5547423 5772022
16828E772022l59093O18835J43037k22687k26269K16484L44346K50775k08979
$$ 5772022 5412929 6031764 6174801 5952114 5725845 5942329 6286675 6537450 6328471
16819F328471M0340j84183M55212O57179l04232O9002L25539N36452k84819M57504
$$ 6328471 6368811 6184628 6639840 7297019 6992787 7061789 7387328 7923780 7638961 8096465
16809H096465J53655r4925N30667R2267k40570M84934P6747N57496m31166P81289
$$ 8096465 8250120 8155195 8685862 8778129 8537559 9022493 9099240 9656736 9225570 10006859
16799A0006859L37307m225l7856L48833K45650N40596J48193O66773Q6791M70103
$$ 10006859 10344166 10339941 10302085 10650918 10896568 11437164 11585357 12252130 12338921 12809024
16789A2809024L51756K59628L99527p0008N39029K47681O59944O08957O73170
$$ 12809024 13160780 13420408 13819935 13749927 14288956 14536637 15196581 15805538 16478708
16780A6478708L32770L78441L76499O79930P64760O73614O29405L45861J263720
$$ 16478708 16811478 17189919 17566418 18246348 19011108 19684722 20314127 20659988 21923708
16771B1923708P17802L78846O33265J453334M90517J369751Q10743R54406Q56231
$$ 21923708 22641510 23020356 23653621 25106955 25597472 26967223 27777966 28732372 29588603
16762B9588603J240075J513124J144289J640933J408890J726135J328381K342788
$$ 29588603 30828678 32341802 33486091 35127024 36535914 38262049 39590430 41933218
16754D1933218J489817J941656K071126K460000K469496K635628K941259K768497
$$ 41933218 43423035 45364691 47435817 49895817 52365313 55000941 57942200 60710697
16746F0710697L073566L475374L340411L779500M178356M788158L937202N136235
$$ 60710697 63784263 67259637 70600048 74379548 78557904 83346062 87283264 92419499
16738I2419499M887730N435794N613438O215022O022516O468685O588383O445387
$$ 92419499 97307229 102743023 108356461 114571483 120593999 127062684 133651067 140096454
16730A40096454O818220O339967O894686N913177O205773M888884M582247L833437
$$ 140096454 146914674 153254641 160149327 166062504 172268277 177157161 181739408 185572845
16722A85572845K685995J821584O60886k75470j337237k214636l770535m425002
$$ 185572845 188258840 190080424 190741310 190465840 189128603 186913967 183143432 178718430
16714A78718430m827287n975132n777893o770009o551884o740621o917551o808330
$$ 178718430 173891143 167916011 162138118 155368109 148816225 142075604 135158053 128349723
16706A28349723o173685o723152o255667n509645n796481n014556n151237m578790
$$ 128349723 122176038 115452886 109197219 103687574 97891093 92876537 87725300 83146510
16698H3146510m784581m112641l657048l799706l559628k932544l223971k875901
$$ 83146510 78361929 74249288 70592240 66792534 63232906 60300362 57076391 54200490
16690E4200490k608701k449142k241905k336778j661795k242074j753040k251722
$$ 54200490 51591789 49142647 46900742 44563964 42902169 40660095 38907055 36655333
16682C6655333j315394j490402j587539j068520j240422j303579j227455o28684
$$ 36655333 35339939 33849537 32261998 31193478 29953056 28649477 27422022 26793338
16674B6793338j078920j587490o28785q26106p57020j027332n45412n87960n98739
$$ 26793338 25714418 24126928 23498143 22672037 21915017 20887685 20342273 19754313 19155574
16665A9155574n88136n40926q65600m56147m86884n72671m94898n39715j53682
$$ 19155574 18567438 18026512 17160912 16704765 16217881 15645210 15150312 14610597 14456915
16656A4456915p37212l78849m96857k72012n95256j37132j25350o34962P7650
$$ 14456915 13719703 13340854 12843997 12571985 11976729 11839597 11714247 11079285 11156935
16647A1156935j45419m49941n54641k6517j50168k36616l74397k44040j19189
$$ 11156935 11011516 10561575 10006934 9980417 9830249 9593633 9219236 8975196 8856007
16638H856007o07437L04343n59577p8388l18880J37420o09600L15947m16021l3123
$$ 8856007 8248570 8552913 7993336 7914948 7596068 7733488 7123888 7439835 7023814 6990691
16628F990691l31809q3551j61132m94731J17952k25917K98803k08184p7831m24020
$$ 6990691 6658882 6575331 6414199 5919468 6037420 5811503 6110306 5902122 5824291 5400271
16618E400271N39323l35879n43658J07897K46969n72394m4578P769k72752j1370
$$ 5400271 5939594 5603715 5060057 5167954 5414923 4842529 4797951 4805720 4532968 4521598
16608D521598J656n0456k30985r3137j46494l02835O03131l41920k65501L62490
$$ 4521598 4523254 4472798 4241813 4148676 4002182 3699347 4302478 3960558 3695057 4057547
16598D057547J4599j15892m6263m41222J24978j06374j89594Q4848J28762l51974
$$ 4057547 4072146 3956254 3909991 3468769 3593747 3487373 3297779 3382627 3511389 3159415
16588C159415J76474j17607J24167j71906n1887p0181j91687K25803l88646J8276
$$ 3159415 3335889 3218282 3342449 3170543 3118656 3048475 2856788 3082591 2693945 2712221
16578B712221K81010l44252r0390K3421j46541K43103m41719J62426L05292j15671
$$ 2712221 2993231 2648979 2558589 2582010 2435469 2678572 2236853 2399279 2704571 2588900
16568B588900l64888R7490k48533O0632K07811j91526k3320l4297R203J7388n868
$$ 2588900 2224012 2321502 2072969 2133601 2341412 2149886 2126566 2092269 2101472 2118860 2112992
16557B112992q3043k92778R2945O3331p4639J54430k67003K93847k97713J16436
$$ 2112992 2029949 1737171 1830116 1893447 1818808 1973238 1706235 2000082 1702369 1818805
16547A818805K08103l07886p9056J49570n15390M46026j3344j34701O1134m7889
$$ 1818805 2026908 1719022 1639966 1789536 1274146 1720172 1706828 1572127 1633261 1585372
16537A585372p6893N4369L65705l63877O2601m20008k7158N35471m95509r6974
$$ 1585372 1508479 1562848 1928553 1564676 1627277 1207269 1180111 1715582 1220073 1123099
16527A123099M41377l11389J17857J02174k27877n5251K05915k76208K69374k50288
$$ 1123099 1564476 1253087 1370944 1473118 1245241 1189990 1395905 1119697 1389071 1138783
16517A138783R9679m58840N36195k3791k39752K1312K73074n88370N66096n88908
$$ 1138783 1238462 779622 1315817 1292026 1052274 1073586 1346660 758290 1324386 735478
16507G35478L22688l14339N15066n48250M93438j97068K83012k45715l54074M02636
$$ 735478 1058166 743827 1258893 710643 1204081 1007013 1290025 1044310 690236 1092872
16497A092872n0495J18135l67225K88162r5306j1754K03168k65115q2086K02564
$$ 1092872 1042377 1160512 793287 1081449 986143 974389 1177557 912442 830356 1032920
16487A032920j41166K23491k65531J94831k00674L4966O1439j35413R6099K01555
$$ 1032920 891754 1115245 849714 1044545 843871 878837 940276 804863 900962 1102517
16477A102517n48385K77767k3611M39L76886m88612J42442k01654K49466j43737
$$ 1102517 554132 831899 808288 808727 1185613 697001 839443 637789 887255 743518
16467G43518q1561K70075J9331j61544C91514K42126K7036l7912L88700j98031
$$ 743518 661957 932032 951363 789819 391514 633640 660676 622764 1011464 813433
16457H13433P2124j06352o6879j57249J11458k19698L19837j70810o4295L43126
$$ 813433 885557 779205 712326 555077 666535 446837 766674 595864 531569 874695
16447H74695k31216r8462O0229k26143M01081l05271J46074m1879p8842O5538
$$ 874695 643479 545017 605246 379103 780184 474913 620987 579108 500266 565804
16437E65804j8446j56035P359K35935L886o2316J08328j46536k795j09624J60768
$$ 565804 547358 391323 398682 634617 638503 576187 684515 537979 535184 425560 586328
16426E86328k79751L78793A68395O3392J97023A63778M83072l03726L20317j94933
$$ 586328 306577 685370 168395 231787 428810 163778 646850 343124 663441 468508
16416D68508M7826J07582J41108k79256k9654L63041k50805J95037j93281B14679
$$ 468508 516334 623916 765024 485768 456114 819155 568350 763387 570106 214679
16405E18550M9549A81732M82267C23049n6118N30516A17201L34120J55984k55130
$$ 518550 568099 181732 663999 323049 266931 797447 117201 451321 607305 352175
16395C52175L21957A83045J79168O9510Q1885j91954L88417k74851J42797j33251
$$ 352175 674132 183045 362213 431723 513608 321654 710071 435220 578017 444766
16385D44766B01498J13543K81233B08283L43714I4540J91858N0022A34880J61495
$$ 444766 201498 315041 596274 208283 551997 94540 286398 336420 134880 296375
16375B96375J20512B00908O0466K46856e4772D85759j60369q3536K07287A65650
$$ 296375 416887 200908 261374 508230 -54772 485759 325390 241854 449141 165650
16364D76822k29558b4263B96223J37050n7788k6815A27797J34296l5710J39125
$$ 476822 247264 -24263 296223 433273 375485 348670 127797 262093 226383 365508
16354C65508A74837J77238O9555j68177J51901j6555r7693M0811m8618o1764L7231
$$ 365508 174837 352075 421630 253453 405354 388799 291106 331917 283299 221535 258766
16343B58766J57544A27230K43846A17651L14976q5564j59941p9419J72174J36914
$$ 258766 416310 127230 371076 117651 432627 347063 187122 107703 279877 416791
16333D16791A884K14257P6518A3159K54142J35847b4092C49881m9060e3347D33115
$$ 416791 1884 216141 292659 13159 267301 403148 -24092 349881 300821 -53347 433115
16321D23462r8078j62154J70840J05730A09029D1847i3079D15229J24867B50683
$$ 423462 325384 163230 334070 439800 109029 41847 -93079 415229 540096 250683
16310B71390d56C82376i4386D05168j06049H2165J42178j5360A04183J54914b10318
$$ 271390 -456 382376 -94386 405168 299119 82165 224343 208983 104183 259097 -210318
16298b977k03806a5640A05084C0984a26414c5391C11373G2442J77155F9041h2412
$$ -2977 -206783 -15640 105084 30984 -126414 -35391 311373 72442 249597 69041 -82412
16286A06242P3770a0611B72410E3809J83467r0773K35739A10923O1337M5626g5154
$$ 106242 180012 -10611 272410 53809 237276 146503 382242 110923 172260 217886 -75154
16274d3016F2286K51729b30024B04941b3344A75580a84799C19501d7078B70887
$$ -43016 62286 314015 -230024 204941 -23344 175580 -184799 319501 -47078 270887
16263A07871K65263q9289B3288P059J5186b7199A28917n1839R2539a9475A75227
$$ 107871 373134 283845 23288 30347 45533 -27199 128917 77078 169617 -19475 175227
16251B03931B5726J17119C3730K9247L05765a00277A42724O3497f5747J2921C34573
$$ 203931 25726 142845 33730 62977 368742 -100277 142724 206221 -65747 -52826 334573
16239A88665o2073J68888R4813C802L53571M1301A01544c5286D46299k11488D1120
$$ 188665 126592 295480 390293 3802 357373 398674 101544 -35286 446299 234811 41120
16227A70432J20475j44602f4577C35027j03322c2223A10474D4006K02326J16826
$$ 170432 290907 146305 -64577 335027 231705 -32223 110474 44006 246332 363158
16217C63158a36324j2351l517B05223i3227j07809A64108a41002D2102A7475Q6453
$$ 363158 -136324 -148675 -152192 205223 -93227 -201036 164108 -141002 42102 17475 103928
16206A03928f4728A87381D1524G429b35512e5855C45077a54451I6363O0700P9296
$$ 103928 -64728 187381 41524 7429 -235512 -55855 345077 -154451 96363 157063 236359
16195B36359J50803J31201g3205A71528K78307A89475a9907B78765a42708k4379
$$ 236359 387162 518363 -73205 171528 449835 189475 -19907 278765 -142708 -167087
16185a67087D05277C6380b64680A78886J64504D46h8671A82544m4971a68109C548
$$ -167087 405277 36380 -264680 178886 343390 446 -88671 182544 137573 -168109 3548
16173A20877b76287A38889J15496F1764a00088B77981r5892H6647P418c28234
$$ 120877 -276287 138889 254385 61764 -100088 277981 182089 86647 94065 -328234
16162a96533f0603A7873f4477A30969n0402a22167k49571i6418A7657e1754L089
$$ -196533 -60603 17873 -64477 130969 80567 -122167 -371738 -96418 17657 -51754 -48665
16151d8665m042j65362B23552c84096a0419D0992K2100r73J5569B8641b18672
$$ -48665 -52707 -218069 223552 -384096 -10419 40992 63092 62119 77688 28641 -218672
16139A60993a00992H5443K56949A0157K48071a79659L8518j65318C44778d7110
$$ 160993 -100992 85443 342392 10157 258228 -179659 -141141 -306459 344778 -47110
16128B88539i1947H5333J33831E804L74665h853F7944L02286c93849J91500H4173
$$ 288539 -91947 85333 219164 5804 380469 -8853 67944 370230 -393849 -202349 84173
16116A45029b1534A25541d1927B4418P8981J32622I2216c63371a70387B81419
$$ 145029 -21534 125541 -41927 24418 103399 236021 92216 -363371 -170387 281419
16105a19468r089B34663f1781E6430M66988I8085c1980a0115A02523J69315A18451
$$ -119468 -128557 234663 -61781 56430 523418 98085 -31980 -10115 102523 271838 118451
16093B3311b27449i3663a3606A32112J42371A25679c19181a54448g4037c5355
$$ 23311 -227449 -93663 -13606 132112 274483 125679 -319181 -154448 -74037 -35355
16082a72532I9817d40965h2911a1634B7120I179c09260c8946k33891G9258K94617
$$ -172532 99817 -440965 -82911 -11634 27120 9179 -309260 -38946 -272837 79258 373875
16071C73875B4157R8881b05949A29013A6851a18931B71039p9030K26534c21891
$$ 373875 24157 123038 -205949 129013 16851 -118931 271039 192009 418543 -321891
16060a07909N1829A2973C501a50559B15484n4590l7609B6680c56852i4216B20492
$$ -107909 -56080 12973 3501 -150559 215484 160894 123285 26680 -356852 -94216 220492
16048C29760A43467j7808d1155j66628b4204A23235a31173m8227f3623k16547
$$ 329760 143467 125659 -41155 -207783 -24204 123235 -131173 -179400 -63623 -280170
16038b80170B2048K60160g3678D212i3044E4078a93092h9095j1468J8595q6861
$$ -280170 22048 282208 -73678 4212 -93044 54078 -193092 -89095 -100563 -81968 -168829
16027a68829C0820L9695d8795H0239K4031m7429b49621H8738J51826r2219M6402
$$ -168829 30820 70515 -48795 80239 104270 56841 -249621 88738 240564 148345 194747
16016A94747l9008a34488j03122c6626p8098m9138N4662d8285p8367D2429a69418
$$ 194747 155739 -134488 -237610 -36626 -114724 -163862 -109200 -48285 -126652 42429 -169418
16004A8623O940J87167g229r3613O600j35229B01505e3109A17248a40754M2717
$$ 18623 25563 212730 -7229 -100842 -94242 -229471 201505 -53109 117248 -140754 -98037
15993i8037A71476G2311J22978a07332A1166J22329b19684a8844j47027n9414
$$ -98037 171476 72311 195289 -107332 11166 133495 -219684 -18844 -165871 -225285
15983b25285E5347K64090L93388B08638K86243e508I1418b58462A47322f4465
$$ -225285 55347 319437 712825 208638 494881 -5508 91418 -258462 147322 -64465
15972G4858e9991k10718l3617d5036m07271a17288A37060a19609G6424L06002
$$ 74858 -59991 -270709 -304326 -45036 -452307 -117288 137060 -119609 76424 382426
15962C82426B4648J38012Q1466A12637O7238b50289l2660e2637B38659a63178
$$ 382426 24648 162660 244126 112637 179875 -250289 -282949 -52637 238659 -163178
15951A45477B3692b05574M024H2729h7332J2953K716A23092a3875B5658L5703
$$ 145477 23692 -205574 -201550 82729 -87332 -74379 -71663 123092 -13875 25658 61361
15940F1361O5395J58395q005e4470k4718L8003j5454D3890A5342g2965l1345B7567
$$ 61361 126756 285151 277146 -54470 -79188 -41185 -56639 43890 15342 -72965 -104310 27567
15927I3118a67067C99692a19428j30947j87486J69828M4268E5018e2077A8423
$$ 93118 -167067 399692 -119428 -250375 -437861 -268033 -223765 55018 -52077 18423
15916a34557B47411a05647N0091j61387M0299k11847D6376a73584B99373A24544
$$ -134557 247411 -105647 -55556 -216943 -176644 -388491 46376 -173584 299373 124544
15905i603o5013K007B85292b13546E1767O7467I771P7179c86583c0070l0580C82707
$$ -9603 -74616 -72609 285292 -213546 51767 119234 9771 86950 -386583 -30070 -60650 382707
15892g7988C6887e5636A40323o629b2917l01265b8394A66037A4539b72690C3578
$$ -77988 36887 -55636 140323 133694 -22917 -324182 -28394 166037 14539 -272690 33578
15880H3785i8554A08850a51612r5951G9633d22352P6407a49814j59863B37094
$$ 83785 -98554 108850 -151612 -247563 79633 -422352 -345945 -149814 -309677 237094
15869B491b49245f4857n1658C07245c17160J11294J01839n5677j76747J15569
$$ 2491 -249245 -64857 -116515 307245 -317160 -205866 -104027 -159704 -336451 -220882
15859b20882A54414B5358N6463h860j67235f1304B4181m005b2881D3616J56205
$$ -220882 154414 25358 81821 -8860 -176095 -61304 24181 20176 -22881 43616 199821
15848A99821E1422c8412k5479A40256r388b38601J09190l37277i8867J8484L5112
$$ 199821 51422 -38412 -63891 140256 130868 -238601 -129411 -466688 -98867 -80383 -45271
15837d5271E0176a44571d6981A28495b27838d5479H4419a91173c0025b273A28311
$$ -45271 50176 -144571 -46981 128495 -227838 -45479 84419 -191173 -30025 -2273 128311
15825b6917A29398D1531a70943a8609I8870c18880M7017k55650A75282B203a63625
$$ -26917 129398 41531 -170943 -18609 98870 -318880 -271863 -527513 175282 2203 -163625
15813c69541i7796B16496a78843D467b23581h1732c961j20218L4873r0028B13033
$$ -369541 -97796 216496 -178843 4467 -223581 -81732 -3961 -124179 -89306 -179334 213033
15801h1931K1824n168l3304A57655a51864j32780Q0800B33602E5898J41501C6736
$$ -81931 -60107 -65275 -98579 157655 -151864 -284644 -203844 233602 55898 197399 36736
15789a39055C72342d77441A05609P8359A4786a09365A51734g0491A35166J90012
$$ -139055 372342 -477441 105609 183968 14786 -109365 151734 -70491 135166 325178
15779C25178H5240i8957A8450e2448H6598c7196B7114f8256n008j36934A36117
$$ 325178 85240 -98957 18450 -52448 86598 -37196 27114 -68256 -73264 -210198 136117
15767a03314n6199J5951o7622A99652E690J52530a73638A4055a3547A26867K07605
$$ -103314 -159513 -143562 -211184 199652 5690 158220 -173638 14055 -13547 126867 334472
15756C34472d0588B13655b4240l29295A7591J00527A1085Q4270c11462b8522R734
$$ 334472 -40588 213655 -24240 -353535 17591 118118 11085 95355 -311462 -28522 -18788
15745a8788r1209A84598K3264a38314B24113C7577c1603k97718A88501d8494j94859
$$ -18788 -109997 184598 207862 -138314 224113 37577 -31603 -329321 188501 -48494 -243353
15734b43353j7282C65796c01403B71019a50714A78802J26223a00771d8742k92554
$$ -243353 -260635 365796 -301403 271019 -150714 178802 305025 -100771 -48742 -341296
15724c41296a46193b6828n7060k02636A62016e2370E5937b24708c2124A4282b03807
$$ -341296 -146193 -26828 -83888 -286524 162016 -52370 55937 -224708 -32124 14282 -203807
15712a55541k1416M3309d1268l61601a36873a6201k33151J12180M8842B28620
$$ -155541 -176957 -133648 -41268 -402869 -136873 -16201 -249352 -137172 -88330 228620
15701a07578j94175J01111C63206g9779O963G2069J07200a96984B57094B1647
$$ -107578 -301753 -200642 363206 -79779 -72816 72069 179269 -196984 257094 21647
15690I6927f1267j14411G3954P0702d5337l22128A7626K61967A03606B0166b01783
$$ 96927 -61267 -175678 73954 144656 -45337 -367465 17626 279593 103606 20166 -201783
15678H7732a27817j03214A16270K77209A75815b07458I3030F753L32477a15903
$$ 87732 -127817 -231031 116270 393479 175815 -207458 93030 6753 339230 -115903
15667H9179K40924i5484A15267e8786F8320a36235C69282a03820A9317J28745
$$ 89179 330103 -95484 115267 -58786 68320 -136235 369282 -103820 19317 148062
15657A48062b23138H8742J13244J12496A04177d9552q7122H2572a19967d3981
$$ 148062 -223138 88742 201986 314482 104177 -49552 -136674 82572 -119967 -43981
15646A45731j8987g6736A63274R0979a01525m3562F1794h7718G5754b36454A76343
$$ 145731 126744 -76736 163274 254253 -101525 -145087 61794 -87718 75754 -236454 176343
15634a10786A04140O4104f5608q3687F4769g0554K05A50583a03221A68276a6063
$$ -110786 104140 168244 -65608 -149295 64769 -70554 -70349 150583 -103221 168276 -16063
15622d1037A06939b46732D1203b57174B00700a24703a1969k67564P5515f7604
$$ -41037 106939 -246732 41203 -257174 200700 -124703 -11969 -279533 -204018 -67604
15611c37015e8674d41F0192d8905j67222O0909g7206G7018a32440d5699r905j4217
$$ -337015 -58674 -441 60192 -48905 -216127 -155218 -77206 77018 -132440 -45699 -55604 -69821
15599f9821a586G1742F591a58744m1815B47430B15b24124O5566B21337a73136
$$ -69821 -1586 71742 6591 -158744 -200559 247430 215 -224124 -158558 221337 -173136
15587b14968B92235m8791b26248I8529b03755A28217D7872c40224e1387A60484
$$ -214968 292235 243444 -226248 98529 -203755 128217 47872 -340224 -51387 160484
15576a16823j85025B3899K16356a51490M2547D32041A82181A4917c5232D13319
$$ -116823 -301848 23899 240255 -151490 -108943 432041 182181 14917 -35232 413319
15565a79663B21817O3030c21887c2600k86408a16768D0102J81995a2457k93823
$$ -179663 221817 284847 -321887 -32600 -319008 -116768 40102 222097 -12457 -306280
15555c06280a4395k38562B37206a73621G1684J97759d0658q553I554d75932A50187
$$ -306280 -14395 -252957 237206 -173621 71684 269443 -40658 -49211 9554 -475932 150187
15543i393A56097M665J18080b09739A07547a25414D6917c5102m1718C46525a26428
$$ -9393 156097 160762 278842 -209739 107547 -125414 46917 -35102 -76820 346525 -126428
15531c17983a57323m5477e1987E5646L9084C0075J92310a99148B0278c33857E9963
$$ -317983 -157323 -202800 -51987 55646 94730 30075 222385 -199148 20278 -333857 59963
15519A0550a62553M6296j2967c4669A26477J01086e005B44566k824O086A9660
$$ 10550 -162553 -116257 -129224 -34669 126477 227563 -5005 244566 241742 247828 19660
15507A19570n7369J28119O2700g4175A27201h7426B69793a69653P9251A74125
$$ 119570 62201 190320 253020 -74175 127201 -87426 269793 -169653 -90402 174125
15496a61366j09317A3125a04075C42184h5277A11642K6287Q279J997l747b15096
$$ -161366 -270683 13125 -104075 342184 -85277 111642 137929 146208 148205 144458 -215096
15484B57993b18550A73854a17598B75874G0804J60865c8024E665J18611K6884
$$ 257993 -218550 173854 -117598 275874 70804 231669 -38024 5665 124276 151160
15474A51160a71431j1175G4214a18087A15992f2136A73309i5770O696A25859a84574
$$ 151160 -171431 -182606 74214 -118087 115992 -62136 173309 -95770 -89074 125859 -184574
15462c8392k95234c7166q0397C8814j2573K03246a36305C0758O3294A8243d869
$$ -38392 -333626 -37166 -117563 38814 26241 229487 -136305 30758 94052 18243 -4869
15450C36133c1201j08860j2985o473A31440G239a57655C46471d1203A36446g6516
$$ 336133 -31201 -140061 -153046 -159519 131440 7239 -157655 346471 -41203 136446 -76516
15438f0881j24207H0366i9412j48967A50835h7509M1562m75196A39264E8815N8635
$$ -60881 -185088 80366 -99412 -248379 150835 -87509 -45947 -521143 139264 58815 117450
15427A17450k8900O4161G6135c55630B51466A25515j5958l5939a67853I9522K39876
$$ 117450 88550 152711 76135 -355630 251466 125515 109557 73618 -167853 99522 339398
15416C39398b33312r291j8510h0398H0976c843A64091i537A02189a5025j69429
$$ 339398 -233312 -242603 -261113 -80398 80976 -3843 164091 -9537 102189 -15025 -184454
15405a84454A1273J86944b0930m97628B3242K46828b19590L9815r8584C89256
$$ -184454 11273 198217 -20930 -518558 23242 270070 -219590 -179775 -278359 389256
15394a39993j31180G5437a25958j34328A0862e7058I58J18071a85419A11622L8284
$$ -139993 -271173 75437 -125958 -260286 10862 -57058 958 119029 -185419 111622 149906
15383A49906a37971A08830a19999A34479L9863a58140G2795L3133h775q0686A91494
$$ 149906 -137971 108830 -119999 134479 174342 -158140 72795 105928 -8775 -89461 191494
15371H2038a66583e9175p5496o3118Q408p3519I5865d6360A45084c670l0030j28505
$$ 82038 -166583 -59175 -134671 -197789 -189381 -262900 95865 -46360 145084 -3670 -33700 -162205
15359a62205G7923K0539A2804a51776C84422A85002c27141b9886E162b4511l78104
$$ -162205 77923 98462 12804 -151776 384422 185002 -327141 -29886 5162 -24511 -402615
15348d02615A91396a05525K6800B21463a3018G314K5423g1814k64494a09052q4516
$$ -402615 191396 -105525 -78725 221463 -13018 7314 32737 -71814 -336308 -109052 -193568
15337a93568d3030l11217I9007i5550A64926O8437B7277a27280A82877m2530C5243
$$ -193568 -43030 -354247 99007 -95550 164926 233363 27277 -127280 182877 140347 35243
15325a54497C663J44175m9062K11728b04212B5785H621J49168E3402a6577C0078
$$ -154497 3663 147838 98776 310504 -204212 25785 8621 157789 53402 -16577 30078
15313d2580j33474b9443k3357A30602C9403J42199b31029B03092R6262B0119a3011
$$ -42580 -176054 -29443 -52800 130602 39403 181602 -231029 203092 299354 20119 -13011
15301E6061K5835b07562B08516a89066B01676I6596N8717J33442a4193B67849
$$ 56061 81896 -207562 208516 -189066 201676 96596 155313 288755 -14193 267849
15290A6180J32148R3049m152a02709B31267a87245A13380a11048B27693b01590
$$ 16180 148328 241377 237225 -102709 231267 -187245 113380 -111048 227693 -201590
15279a42382C55211j59789C228a43555J0890l763B38696o7156Q3406F8654b40195
$$ -142382 355211 195422 3228 -143555 -132665 -136428 238696 171540 254946 68654 -240195
15267e061I9130a21322j61042a8242B23575b9659B22691m8926q0121D6086N51883
$$ -5061 99130 -121322 -282364 -18242 223575 -29659 222691 173765 93644 46086 597969
15256E97969B51266K9439i2183A75798G7766J97869j06762J04742P47550J099266
$$ 597969 251266 280705 -92183 175798 77766 275635 168873 273615 1021165 2120431
15246B120431r58490L51993L64031F58915k05228B09054c1499E1062K92451j06958
$$ 2120431 1161941 1513934 1877965 658915 453687 209054 -31499 51062 343513 236555
15236B36555o4435N4307R5234I0602C4900A7076f7987B55930m3240p6056O0433
$$ 236555 172120 226427 321661 90602 34900 17076 -67987 255930 212690 136634 197067
15225A97067n6255a90762B39721a59550E5196J32817K2764b96332E4750e8025
$$ 197067 140812 -190762 239721 -159550 55196 188013 210777 -296332 54750 -58025
15214C24012i4087A14229J65295c4453k8340r9269A93436A9982c0902B51297J39382
$$ 324012 -94087 114229 279524 -34453 -62793 -162062 193436 19982 -30902 251297 390679
15203C90679H5155K9772M1773N2962l9309e492A59029k526f0531I9631b74961
$$ 390679 85155 114927 156700 209662 170353 -5492 159029 156503 -60531 99631 -274961
15191a1615B47065j06105d9524q9709A30360N6411q1841b15461A60243K76273
$$ -11615 247065 140960 -49524 -139233 130360 186771 104930 -215461 160243 436516
15181D36516g0287j81452J11150A33607i1966C46777B3608a00992A52317O1484
$$ 436516 -70287 -251739 -140589 133607 -91966 346777 23608 -100992 152317 213801
15171B13801I9294l6357g3150J2831I9254J24376I2634J8269R8303J25230B3506
$$ 213801 99294 62937 -73150 -60319 99254 223630 92634 110903 209206 334436 23506
15159B68630a25109k30552B35613J03160F5824a14273B17297m4629b02900c0261
$$ 268630 -125109 -355661 235613 338773 65824 -114273 217297 172668 -202900 -30261
15148C86165I7199d235A91284I0640j132Q9616b9465B31013B3058K43901a47329
$$ 386165 97199 -4235 191284 90640 89508 179124 -29465 231013 23058 266959 -147329
15136e3332p1606k6588B33580J5380b71347A64432j815J9148a76776B5166K37890
$$ -53332 -124938 -151526 233580 248960 -271347 164432 162617 181765 -176776 25166 263056
15125B63056B3897g4052G9669b48039C01787n5318j6730R0419A48844a38061C1188
$$ 263056 23897 -74052 79669 -248039 301787 246469 229739 320158 148844 -138061 31188
15113B76977l4970a27567L5869A55593L07567H0292b01532D47346a32261B15632
$$ 276977 242007 -127567 -91698 155593 463160 80292 -201532 447346 -132261 215632
15102d4643C08634j19961C5511J40399a50995A74746K96371j37212A0142Q1505
$$ -44643 308634 188673 35511 175910 -150995 174746 471117 333905 10142 91647
15092I1647h7591C0547g8489A64934m218J52110l7947e5269C58465j52044O6179
$$ 91647 -87591 30547 -78489 164934 160716 312826 274879 -55269 358465 206421 272600
15081B72600J72761j76303J14250A85476b8570A41036J18919Q4682E3400L94666
$$ 272600 445361 269058 383308 185476 -28570 141036 259955 344637 53400 448066
15071D48066A84872B272L50937h865A10869P6587n7162K40987d5940j73875C78702
$$ 448066 184872 2272 353209 -8865 110869 187456 130294 371281 -45940 -219815 378702
15059A97816n1584a30286J9164B68604j0515J88791d9269D969J88489J16318a62129
$$ 197816 146232 -130286 -111122 268604 258089 446880 -49269 4969 193458 309776 -162129
15047A03503L2611J11290r0748L87702A8736J30426M1663j9184E7536M82555j96915
$$ 103503 136114 247404 156656 544358 18736 149162 190825 171641 57536 540091 343176
15036C43176l4848M6476e4438A88282Q8091p0582J52159b9853B47110K08412a30949
$$ 343176 308328 354804 -54438 188282 276373 205791 357950 -29853 247110 455522 -130949
15024C30223r6205D772a93747C24779Q7834f0246a9354D5457J50965J76950j45235
$$ 330223 234018 4772 -193747 324779 412613 -60246 -19354 45457 196422 373372 228137
15013B28137A03543k3472N58318B10113J8373P1398K71818A01275L89073G6600
$$ 228137 103543 80071 638389 210113 228486 299884 571702 101275 490348 76600
15002G802a86513r754h0425B57138J17015G382L01002A16293J82170J73675m521
$$ 7802 -186513 -196267 -80425 257138 374153 7382 308384 116293 298463 472138 467617
14991D67617a48884A3993L10971K08698H0177R0790J72902J48995G3217K31995
$$ 467617 -148884 13993 324964 533662 80177 170967 343869 492864 73217 305212
14981C05212Q589j20623q5523K33799G3624M85464F1971L23672j05139J94519
$$ 305212 313801 193178 107655 341454 73624 559088 61971 385643 280504 475023
14971D75023k31524l9935J43109A67584J7253q6361d0519C40481j30701c2367
$$ 475023 243499 203564 346673 167584 184837 98476 -40519 340481 209780 -32367
14960A06379K43447J09701j63279k4443c6591B40387r8685L03699q3137K10571
$$ 106379 349826 459527 296248 271805 -36591 240387 141702 445401 362264 572835
14950E72835M0626H6823L18486Q8629A0056M98227k19586m2891P790Q5810q0529
$$ 572835 613461 86823 405309 493938 10056 508283 288697 245806 253596 339406 258877
14939B58877J0957J23852L1208p6882j53184J69828j42528J18J40337E3100J04078
$$ 258877 269834 393686 424894 348012 194828 364656 222128 222246 362583 53100 157178
14928A57178a7223D25169I7459L30681A99453R1088j43677K56005c0241C78960
$$ 157178 -17223 425169 97459 428140 199453 290541 146864 402869 -30241 378960
14917C07488J60821A22087R8376H3424J13717J14526j54418K98023B08936J63013
$$ 307488 468309 122087 220463 83424 197141 311667 157249 455272 208936 371949
14907C71949A49338L30621j82782J42243j28640n893K0949A18243L37749j84196
$$ 371949 149338 479959 297177 439420 310780 304887 325836 118243 455992 271796
14897B71796j23978G0827M1142m6379M15170j95932K04777j90204L6829m2115
$$ 271796 147818 70827 111969 65590 480760 284828 489605 299401 336230 294115
14887B94115K71859k59866o8822K42658p3004A76198R1767K93785k4485A8099
$$ 294115 565974 306108 237286 479944 406940 176198 267965 561750 537265 18099
14876A02869M39675B41805M09779g4176B68300K52604R5397C8363R7184L56814
$$ 102869 542544 241805 651584 -74176 268300 520904 616301 38363 135547 492361
14866D92361p8827L2657r7461k9939n5107l8564K0638M99702l1799b6405C93443
$$ 492361 413534 446191 348730 318791 263684 225120 245758 745460 713661 -26405 393443
14854E11400j2322k48887C2166N90135J00860j43532k6391K70444B40058L55626
$$ 511400 499078 250191 32166 622301 723161 579629 553238 823682 240058 595684
14844E95684K4899A08574K44226J17553k1472J32032j27498k6289m8777J51234
$$ 595684 620583 108574 352800 470353 448881 580913 453415 427126 378349 529583
14834E29583k12519K61719j09310o781j96008O16188C59881L63067k32921B38554
$$ 529583 317064 578783 469473 462692 266684 882872 359881 722948 490027 238554
14823C92949J60475M127K01962B44913K66354J9330k16631A24101N24503J56729
$$ 392949 553424 557551 759513 244913 511267 530597 313966 124101 648604 805333
14813H05333k24474k10179J29533q4576L93556l76001L4326K48096k58535m4850
$$ 805333 580859 370680 500213 415637 809193 433192 467518 715614 457079 412229
14803D12229L41781r6859B71426K81522B73815L04308J27330C26822J06505r3031
$$ 412229 754010 657151 271426 552948 273815 578123 705453 326822 433327 340296
14793C40296K07507l2551j71374L2358K69265j10598L04710R7624r2755l39881
$$ 340296 547803 515252 343878 376236 645501 534903 839613 937237 844482 504601
14783E04601k13795J24463J17864j49192L49907r8262k0681k8195J36021p2613
$$ 504601 290806 415269 533133 383941 733848 635586 614905 586710 722731 650118
14773F50118j91183J68447J9328K04163l51369J43275q9245R5271K34238j60363
$$ 650118 458935 627382 646710 850873 499504 642779 553534 648805 883043 722680
14763G22680o7491k23352N16517m01244J26414J34711j94080P3516l21733M24223
$$ 722680 655189 431837 948354 547110 673524 808235 614155 687671 365938 790161
14753G90161J76092j17082M5912j30109J04561k23110J28515k74020o6217M44106
$$ 790161 966253 849171 895083 764974 869535 646425 774940 500920 434703 878809
14743H78809J69676l43825j8419R7618j6790N8956j61238j6702Q7857K0554L23729
$$ 878809 1048485 704660 686241 783859 767069 826025 664787 648085 735942 756496 1080225
14732A080225m56685o7178N97623j49766k89490K79764q1692J27140j72203k22684
$$ 1080225 623540 556362 1153985 1004219 714729 994493 912801 1039941 867738 645054
14722F45054L01479L04440m25696o997r4860J2401O2586K9268Q6888l69233M67966
$$ 645054 946533 1250973 825277 818280 723420 735821 798407 827675 914563 545330 1013296
14711A013296K19046F15243O8583M46913j84153k68161r9658K12266J80622K5136
$$ 1013296 1232342 615243 683826 1130739 946586 678425 578767 791033 971655 996791
14701I96791o8985N2010l22081K3913K98221r8904P456k15679K16610L7849M4712
$$ 996791 927806 979816 657735 681648 979869 880965 888421 672742 889352 927201 971913
14690I71913k31324L72662l69312K60350N06514p12626M52919l89304K16448j26449
$$ 971913 740589 1113251 743939 1004289 1510803 798177 1251096 861792 1078240 951791
14680I51791J49883k65203L05137k26188J34182K00311m3775j3510j02549r2339
$$ 951791 1101674 836471 1141608 915420 1049602 1249913 1206138 1192628 1090079 997740
14670I97740J90828k21148J75509Q955j643p4495K51375P0644l40382r9983J51186
$$ 997740 1188568 967420 1142929 1151884 1150241 1075746 1327121 1397765 1057383 957400 1108586
14659A108586K52581n30194L26935J16423K44885l41135K1856K3924L0040J20362
$$ 1108586 1361167 830973 1157908 1274331 1519216 1178081 1199937 1223861 1253901 1374263
14649A374263k37385J29413k10572M21511k91258L35617q7630n63132K34730L42135
$$ 1374263 1136878 1266291 1055719 1477230 1185972 1521589 1433959 870827 1105557 1447692
14639A447692J68168j20340k49716l3588Q8541K41887j45773K33585m7122k46687
$$ 1447692 1615860 1495520 1245804 1212216 1300757 1542644 1396871 1630456 1583334 1336647
14629A336647o6801K84988M6368m3756Q3567j64896M38237m33828N1025j28086
$$ 1336647 1269846 1554834 1601202 1557446 1641013 1476117 1914354 1480526 1531551 1403465
14619A403465K76262l18896M95628n3466k85656J34759J38592p22372O79005k91251
$$ 1403465 1679727 1360831 1856459 1802993 1517337 1652096 1790688 1068316 1747321 1456070
14609A456070N2294J18766j74335N3822L00809J38857k44154N8528Q3189L4775
$$ 1456070 1508364 1627130 1452795 1506617 1807426 1946283 1702129 1760657 1843846 1878621
14599A878621m04237O25464l79285R6782J6002o2167q43P0532M0310J48655M9216
$$ 1878621 1474384 2099848 1720563 1817345 1833347 1771180 1770337 1840869 1881179 2029834 2079050
14588B079050j28061l5934N41048l85066R1209k21612L22235J0986k41139O8141
$$ 2079050 1950989 1915055 2456103 2071037 2162246 1940634 2262869 2273855 2032716 2100857
14578B100857j32249l2519l940N49015l60813K00868k6966m2179P1405P2381n7379
$$ 2100857 1968608 1936089 1932149 2481164 2120351 2321219 2294253 2252074 2323479 2395860 2338481
14567B338481J58148j17032J37334K73758K3067o3792N44461l53978k11389K26691
$$ 2338481 2496629 2379597 2516931 2790689 2813756 2749964 3294425 2940447 2729058 2955749
14557B955749K18729K72576q1131J77847O6579O61806L64554J032538K160929
$$ 2955749 3174478 3447054 3365923 3543770 3610349 4272155 4636709 5669247 7830176
14548G830176L196776P396205J9720145J9839749B6571200A1476627E297003k118351
$$ 7830176 11026952 18423157 38143302 57983051 26571200 11476627 5297003 3178652
14540C178652o48612j81103k68004m0785k04737M11771n9712L79862n18988K02897
$$ 3178652 2530040 2348937 2080933 2040148 1835411 2247182 2187470 2567332 2048344 2251241
14530B251241j1661J43433J60201k59365L03461j60567K75084k60613K09260K54339
$$ 2251241 2239580 2383013 2543214 2283849 2587310 2426743 2701827 2441214 2650474 2904813
14520B904813k99519K65379j11203J11393J56190k47266J90424l92684L90334
$$ 2904813 2605294 2870673 2759470 2870863 3027053 2779787 2970211 2577527 2967861
14511B967861L4173K8676P2770J26891k46138j33032P63401n91750L53823o6666
$$ 2967861 3002034 3030710 3103480 3230371 2984233 2851201 3614602 3022852 3376675 3310009
14501C310009K49387n6582K98009k58166j54167K48177O1147m14599M08225m8421
$$ 3310009 3559396 3502814 3800823 3542657 3388490 3636667 3697814 3283215 3691440 3643019
14491C643019K17764J91253l21319p3357J40900M16185m4992K88989o14430L19925
$$ 3643019 3860783 4052036 3730717 3657360 3798260 4214445 4169453 4458442 3844012 4163937
14481D163937j11968j71008M87461J50219l73931L10190J80109j51553K98361
$$ 4163937 4051969 3880961 4368422 4518641 4144710 4454900 4635009 4483456 4781817
14472D781817K7177L8437l4671j12563K6070j37677L45066j42358K20935P4595
$$ 4781817 4808994 4847431 4812760 4700197 4726267 4588590 4933656 4791298 5012233 5086828
14462E086828L36001k05600N85538q90648Q11552p05799K92809N1050M60529j9489
$$ 5086828 5422829 5217229 5802767 4912119 5723671 5017872 5310681 5361731 5822260 5802771
14452E802771J23842J634N33890n07644J83342K1240L89695l04161J63090P7782
$$ 5802771 5926613 5928247 6462137 5954493 6137835 6159075 6548770 6244609 6407699 6485481
14442F485481J09305J43546K39299j76983Q5960L89334k11707K37647j79424K79479
$$ 6485481 6594786 6738332 6977631 6800648 6886608 7275942 7064235 7301882 7122458 7401937
14432G401937j79397K91566P8598q9266J58341L66032k57455K72533J04640J35405
$$ 7401937 7222540 7514106 7592704 7503438 7661779 8027811 7770356 8042889 8147529 8282934
14422H282934r4324K74711L88013j88917N3772M77410o1918J82921K40935m30865
$$ 8282934 8188610 8463321 8851334 8662417 8716189 9193599 9131681 9314602 9555537 9124672
14412I124672M86544l9701J32121P04340j53491m4425M63606K38095P8884J44546
$$ 9124672 9611216 9571515 9703636 10407976 10254485 10210060 10673666 10911761 10990645 11135191
14402A1135191K88847M23320m16422M76654Q8167K7206J55767L45754J42369L47581
$$ 11135191 11424038 11847358 11430936 11907590 11995757 12022963 12178730 12524484 12666853 13014434
14392A3014434J53311L8060J79214L00962K60148J85457K15920J08906N76295
$$ 13014434 13167745 13205805 13385019 13685981 13946129 14131586 14347506 14456412 15032707
14383A5032707l0552P15582J58645K83352K80225L0440K96705P34060J42163L34432
$$ 15032707 15002155 15717737 15876382 16159734 16439959 16470399 16767104 17501164 17643327 17977759
14373A7977759R9473N93277O40394O6027L00473O23423K00376M66348O56488j66374
$$ 17977759 18077232 18670509 19310903 19376930 19677403 20300826 20501202 20967550 21624038 21457664
14363B1457664Q00191M99224M07283R80276L36389M53250N96546P17393L29261
$$ 21457664 22257855 22757079 23164362 24144638 24481027 24934277 25530823 26248216 26577477
14354B6577477O95622P30735K34045J083553O55847M43659R97946P89116R04193
$$ 26577477 27273099 28003834 28237879 29321432 29977279 30420938 31418884 32208000 33112193
14345C3112193O32849R95549R11357J058907Q09479R29895R44940J299729J150626
$$ 33112193 33745042 34740591 35651948 36710855 37520334 38450229 39395169 40694898 41845524
14336D1845524J121043J400947J574983J005511J359813J609020J236693J885496
$$ 41845524 42966567 44367514 45942497 46948008 48307821 49916841 51153534 53039030
14328E3039030J539675J333862K214377K066564J709542K281236K031259K342033
$$ 53039030 54578705 55912567 58126944 60193508 61903050 64184286 66215545 68557578
14320F8557578K361452K812462K456042K914476K964829K815811L494083L515575
$$ 68557578 70919030 73731492 76187534 79102010 82066839 84882650 88376733 91892308
14312I1892308L755051L940096L728185M224785M423525N109758N023638N238360
$$ 91892308 95647359 99587455 103315640 107540425 111963950 117073708 122097346 127335706
14304A27335706N764418O015059O122932O793818P306764P531168Q097919Q544117
$$ 127335706 133100124 139115183 145238115 152031933 159338697 166869865 174967784 183511901
14296A83511901R043230R470655R957483J0737874J1030406J1707955J2373978
$$ 183511901 192555131 202025786 211983269 222721143 233751549 245459504 257833482
14289B57833482J2906809J3143714J3815883J3965758J4772972J5083062J4869464
$$ 257833482 270740291 283884005 297699888 311665646 326438618 341521680 356391144
14282C56391144J5340532J5269702J4656221J3759060J3351820J2335188J1075415
$$ 356391144 371731676 387001378 401657599 415416659 428768479 441103667 452179082
14275D52179082R405944P717326M228971J446454O84960r53797j079456l398791
$$ 452179082 461585026 469302352 473531323 474977777 475662737 474708940 473629484 470230693
14267D70230693l625966p026180r421657j0916341j2362781j4502049j4443052
$$ 470230693 466604727 459578547 450156890 439240549 426877768 412375719 397932667
14260C97932667j5275141j5475870j5612376j5526110j5055547j5332896j3301108
$$ 397932667 382657526 367181656 351569280 336043170 320987623 305654727 292353619
14253B92353619j3553328j3244373j3104221j1810194j1746589j0992507j0378330
$$ 292353619 278800291 265555918 252451697 240641503 228894914 217902407 207524077
14246B07524077r772880r277312q464793q457871p556192p548404p568908o145679
$$ 207524077 197751197 188473885 180009092 171551221 163995029 156446625 148877717 142732038
14238A42732038n882103n757036n886385n437705m745299m654037m315630l901133
$$ 142732038 136849935 131092899 125206514 119768809 115023510 110369473 106053843 102152710
14230A02152710l660298m065360m031212l495715l047818l187637k654697k598779
$$ 102152710 98492412 94427052 90395840 86900125 83852307 80664670 78009973 75411194
14222G5411194l125671k663870k292274j511321k309355k268401k287246j545910
$$ 75411194 72285523 69621653 67329379 65818058 63508703 61240302 58953056 57407146
14214E7407146j495031j602324j889513j596832j432606j583623p36255j369474
$$ 57407146 55912115 54309791 52420278 50823446 49390840 47807217 47070962 45701488
14206D5701488r81083j557000j100409j675321j247121p07277j67491j270294
$$ 45701488 44720405 43163405 42062996 40387675 39140554 38433277 38265786 36995492
14198C6995492j256797q19519q95357j252810l31823n48034j288859m98532j120540
$$ 36995492 35738695 34919176 34023819 32771009 32439186 31891152 30602293 30103761 28983221
14189B8983221l43080r60688n90631o18975n94855j60488j092543m34402m96027
$$ 28983221 28640141 27679453 27088822 26469847 25874992 25714504 24621961 24187559 23691532
14180B3691532m43660l26412n04702m99628m87108l58957m56913l9002n33965
$$ 23691532 23247872 22921460 22416758 21917130 21430022 21071065 20614152 20575150 20041185
14171B0041185m91941o25376m40951J33287m39458m59158o20183l06111j75014
$$ 20041185 19549244 18923868 18482917 18616204 18176746 17717588 17097405 16791294 16616280
14162A6616280l16360j22800k33818m97062k43950q02m55324k62111j76267j93722
$$ 16616280 16299920 16177120 15943302 15446240 15202290 15201488 14746164 14484053 14307786 14114064
14152A4114064k94626j48555n16403k74489Q915k88018K53128n48056M334m39787
$$ 14114064 13819438 13670883 13154480 12879991 12888906 12600888 12854016 12305960 12310294 11870507
14142A1870507k7087n59683r5034Q510k02761j77367o7253j43884n5189k71668
$$ 11870507 11843420 11283737 11188703 11197213 10994452 10817085 10749832 10605948 10550759 10279091
14132A0279091j1465j65742O8387p18984J44703k8675J69794q16886q3252j30874
$$ 10279091 10267626 10101884 10170271 9451287 9595990 9567315 9737109 8920223 8836971 8706097
14122H706097L26670l40460k47605K39575m06264l41K2956O3669n25823J07523
$$ 8706097 9032767 8692307 8444702 8684277 8278013 8277672 8300628 8364297 7838474 7945997
14112G945997k34450j37876Q8810l91425j21911P5208K6354j64394L6391l09304
$$ 7945997 7711547 7573671 7662481 7271056 7149145 7224353 7250707 7086313 7122704 6813400
14102F813400k46686L30264k22426P5578n67979M25738l04727o59644Q40937o85224
$$ 6813400 6566714 6896978 6674552 6750130 6182151 6607889 6303162 5643518 6484455 5799231
14092E799231J65911o3540n45955M11874j32425L9975j97308L02693k52547K43911
$$ 5799231 5965142 5901602 5355647 5767521 5635096 5675071 5477763 5780456 5527909 5771820
14082E771820k83510j82399J21016m01400L65574n15521K65389k5903n03489J17900
$$ 5771820 5488310 5305911 5426927 5025527 5391101 4875580 5140969 5115066 4611577 4729477
14072D729477j49732M884K64080q6164l66856K32255l01055P690L03183J93837
$$ 4729477 4579745 4584629 4848709 4762545 4395689 4627944 4326889 4334579 4637762 4831599
14062D831599l83564j39626L71364K86025m61685R061k31363J93052l41314j20655
$$ 4831599 4448035 4308409 4679773 4965798 4504113 4513174 4281811 4474863 4133549 4012894
14052D012894k18096K34326j33708L12416m00155O0148j00763m64331L28342Q6060
$$ 4012894 3794798 4029124 3895416 4207832 3807677 3867825 3767062 3302731 3631073 3717133
14042C717133p2791j57705J98879l08726J55724j62829j79183N5505l24905L94363
$$ 3717133 3644342 3486637 3685516 3376790 3532514 3369685 3190502 3246007 2921102 3315465
14032C315465M09017O3792n56727J41501P8135n1728l82744K0483j3036L73567
$$ 3315465 3724482 3788274 3231547 3373048 3451183 3399455 3016711 3037194 3024158 3397725
14022C397725k33791j4520O1801J74251j66124o50921J27095M21683k75067j03628
$$ 3397725 3163934 3149414 3211215 3385466 3219342 2568421 2695516 3117199 2842132 2738504
14012B738504K05379j20568j24838p4249j40444M551R4861O2144k19227k55151
$$ 2738504 2943883 2823315 2698477 2624228 2483784 2488335 2583196 2645340 2426113 2170962
14002B170962J78568J1858o9224P8724j10314O5155j21871K13059k90943K71894
$$ 2170962 2349530 2361388 2292164 2370888 2260574 2325729 2203858 2416917 2125974 2397868
13992B397868m10644L64142K86753M52436K467895N079105J6990550K9792414
$$ 2397868 1987224 2351366 2638119 3090555 5558450 10637555 27628105 57420519
13984E7420519k3720345A5165528o437391k918034o56229n66302q85510p0166
$$ 57420519 33700174 15165528 8728137 5810103 5153874 4587572 3702062 3631896
13976C631896p3862k30636l46347J92679l66319m23825M91828l96051N23847j33467
$$ 3631896 3558034 3327398 2981051 3173730 2807411 2383586 2875414 2479363 3003210 2869743
13966B869743l69024J86379K26346m35665j47861J49708J02058J42342o92058
$$ 2869743 2500719 2687098 2913444 2477779 2329918 2479626 2581684 2724026 2031968
13957B031968K91126o6523o6472J63313j27491j0916l71739O33052n07646L07231
$$ 2031968 2323094 2256571 2190099 2353412 2225921 2215005 1843266 2476318 1968672 2275903
13947B275903l03624L52690k52463k60708L19138r7463J07495j99600J26424K74314
$$ 2275903 1972279 2324969 2072506 1811798 2130936 2033473 2140968 1941368 2067792 2342106
13937B342106n03611K26108j79530l119K64138m62464L98460m42563K69962j74583
$$ 2342106 1838495 2064603 1885073 1881954 2146092 1683628 2082088 1639525 1909487 1734904
13927A734904p3467L72526j68925m307k37855K20766l39229M28511j69161k94326
$$ 1734904 1661437 2033963 1865038 1860731 1622876 1843642 1504413 1932924 1763763 1469437
13917A469437K00101q922K53526n45171K21089O5476N8206j86750k50209J21640
$$ 1469437 1669538 1660616 1914142 1368971 1590060 1655536 1713742 1526992 1276783 1398423
13907A398423L94239k46907m6035P7570k86450M32979k32549Q3417n2917j9394
$$ 1398423 1792662 1545755 1499720 1577290 1290840 1723819 1491270 1574687 1521770 1502376
13897A502376m1194K4494j20922K90394l35200J98226j04156k75415J10686K06987
$$ 1502376 1461182 1485676 1364754 1655148 1319948 1518174 1414018 1138603 1249289 1456276
13887A456276l7513N4038j88217L15405j69392M5146P7091j9891l86405L98505
$$ 1456276 1418763 1472801 1284584 1599989 1430597 1475743 1552834 1532943 1146538 1545043
13877A545043j79590j32677J35193R8867q3265j97981L77126m04440L86441J69285
$$ 1545043 1365453 1232776 1367969 1466836 1383571 1185590 1562716 1158276 1544717 1714002
13867A714002l57253l99202M6765L58488k34517K68214K16792l66093j23028R5195
$$ 1714002 1356749 957547 1004312 1362800 1128283 1396497 1613289 1247196 1124168 1219363
13857A219363L9740J13505l51107L49874l68037J18535J0133j6964K65l23903
$$ 1219363 1259103 1372608 1021501 1371375 1003338 1121873 1132006 1115042 1115307 791404
13847G91404L63350J88172l91847n192N6931J15287J60201l56989O6412J28270
$$ 791404 1154754 1342926 951079 945887 1002818 1118105 1278306 921317 987729 1115999
13837A115999n3788J09303l47485J33093L61073k45390j25318p7527J23258J06475
$$ 1115999 1062211 1171514 824029 957122 1318195 1072805 947487 869960 993218 1099693
13827A099693l83768K79590j07420q9520P2450J2440p700L82937k35834k65322
$$ 1099693 715925 995515 888095 798575 871025 883465 875765 1258702 1022868 757546
13817G57546K68524k17762J13155P4272j60739J67513R2404j67435J04908M5415
$$ 757546 1026070 808308 921463 995735 834996 1002509 1094913 927478 1032386 1077801
13807A077801k9177l0376k53326K46950l16046J89989j21756J82374O1098K80867
$$ 1077801 1048624 1018248 764922 1011872 695826 885815 764059 946433 1007531 1288398
13797A288398o42152p437J26308k00777K99967j24319J57015J85255l94527K61265
$$ 1288398 646246 638809 765117 564340 864307 739988 897003 1082258 687731 948996
13787I48996k1228r4373J68499l23017m4186L58293l48781K98114N0388C97965
$$ 948996 927768 833395 1001894 678877 634691 992984 644203 942317 992705 397965
13776D02045K51636J04820k52328L94852j15267j30560K56305J59340K0667m59627
$$ 402045 653681 758501 506173 901025 785758 655198 911503 1070843 1091510 631883
13766F31883m5892M95721j50524O883r0810j82860L4199L158j64797M07541r2357
$$ 631883 585991 1081712 931188 938071 847261 664401 698600 701758 536961 944502 852145
13755H52145l2662j28128J10950J09593m2046j46703j15332q8967o5421J63524
$$ 852145 819483 691355 802305 911898 869852 723149 607817 518850 453429 616953
13745F16953K65825j49924k55045J26536J71882M5232n0075k16940L47165m42950
$$ 616953 882778 732854 477809 604345 776227 821459 771384 554444 901609 458659
13735D58659L95342K34785k37349N7748l01824M33042m10890k55795L59420k28892
$$ 458659 854001 1088786 851437 909185 607361 1040403 629513 373718 733138 504246
13725E04246J03748J12054K0733k59059J51201k61550L18878p4642l7785j04043
$$ 504246 607994 720048 740781 481722 632923 371373 690251 615609 577824 473781
13715D73781j5207q7737K66493n4866L9260j22757n0597K35007K64064j92938
$$ 473781 458574 370837 637330 582464 621724 498967 448370 683377 947441 754503
13705G54503M5736l15684J14808q1422M4609j35191L24061j63150k07819L36874
$$ 754503 800239 484555 599363 517941 562550 427359 751420 588270 380451 717325
13695G17325C9009L04816L04773j40278L75464C03475K60971j31893N5319j42356
$$ 717325 39009 343825 648598 508320 883784 303475 564446 432553 487872 345516
13685C45516L98458k94795K35642p7465j34935J05692J81904k67985q0818L08384
$$ 345516 743974 449179 684821 607356 472421 578113 760017 492032 411214 719598
13675G19598K9772l58064L2248J82336j6324B88108K33529B10004M10582k60660
$$ 719598 749370 391306 423554 605890 589566 288108 521637 210004 620586 359926
13665C59926J65166L2461K735o2175l4819J42367J38423B27773M3163N9070J47078
$$ 359926 525092 557553 560288 498113 463294 605661 744084 227773 270936 330006 477084
13654D77084M1021l8886L33983C09437l4958J67470J37451k11584K19815J17835
$$ 477084 518105 479219 813202 309437 274479 441949 579400 367816 587631 705466
13644G05466C22449J03256K89189l29414A83715M85423J5644q1638B35971K66276
$$ 705466 322449 425705 714894 385480 183715 669138 684782 603144 235971 502247
13634E02247r8288P6168j08534A54128N39264j87401j03241p0866J43017n8532
$$ 502247 403959 480127 371593 154128 693392 505991 402750 331884 474901 416369
13624D16369O5289A14093J94893N56088l15121K20642j62264k7482j52217q4330
$$ 416369 481658 114093 308986 865074 549953 770595 608331 580849 428632 344302
13614C44302j40276H2947K87486j30131P8038R7626j86471J85271j6918M93472
$$ 344302 204026 82947 370433 240302 318340 415966 229495 414766 397848 891320
13604H91320k07057j66010B52801C9949K23382m8240J67938j11348K91804j92291
$$ 891320 684263 518253 252801 39949 263331 215091 383029 271681 563485 371194
13594C71194L95955B22122K24202k2524N0325j43654P6298a1281B37931M58460
$$ 371194 767149 222122 446324 423800 474125 330471 406769 -11281 237931 696391
13584F96391C27205K53466k84145K35521l8443k30j51518j33336P1060j21920
$$ 696391 327205 580671 296526 532047 493604 493374 341856 208520 279580 157660
13574A57660L52631j25986j08028K59949B31493N3006K83225j88472r4993M5083
$$ 157660 510291 384305 276277 536226 231493 284499 567724 379252 284259 329342
13564C29342J3990j26135c424F03280j74613j1373P6152j50748K85159k74182
$$ 329342 343332 217197 -3424 603280 428667 417294 493446 342698 627857 353675
13554C53675O1356j46449J77277q7801K38722j68139r5079J58099J76277j7034
$$ 353675 415031 268582 445859 358058 596780 428641 333562 491661 667938 650904
13544F50904j44927R1611j81120k1031P7338M543A59239K8694K84205l1526a2333
$$ 650904 505977 597588 416468 395437 472775 477318 159239 187933 472138 440612 -12333
13532C61342A09388L72883A85920L3731K12001P0731A95342H2381K97460J07077
$$ 361342 109388 482271 185920 219651 431652 502383 195342 82381 379841 486918
13522D86918q3825P754J45254k38629K47382A42494M15005j99410A10581J91173
$$ 486918 403093 410847 556101 317472 564854 142494 557499 358089 110581 301754
13512C01754n1337K8707j15772E8039L25389K60224B79559J73481j87250O0089
$$ 301754 250417 279124 163352 58039 383428 643652 279559 453040 265790 325879
13502C25879j28575k7027M4274K07189j5062j94133J85527G4958L75150N4644
$$ 325879 197304 170277 214551 421740 406678 212545 398072 74958 450108 504752
13492E04752K8835D9957K37592j35980K465L10239k04672J82188J5882j94026
$$ 504752 533587 49957 287549 151569 154034 464273 259601 441789 457671 263645
13482B63645J39845j53393M0582A23203L4741q108J80594K57886k52760P3443
$$ 263645 403490 250097 290679 123203 157944 149836 330430 588316 335556 408999
13472D08999j94213P5682L1199n4181R4014q3931j11578a4070B45497J12282q1639
$$ 408999 214786 290468 321667 267486 361500 277569 165991 -14070 245497 357779 276140
13461B76140J31124A62226L7588J2137F2230Q0974Q3091j3133K84818B02078K1997
$$ 276140 407264 162226 199814 211951 62230 143204 226295 213162 497980 202078 224075
13450B24075j1573R118R2523l8580J63796j62533R8646b31860B85775a19576C50027
$$ 224075 212502 221620 314143 275563 439359 276826 375472 -231860 285775 -119576 350027
13438H3535K82005j68852J5180P6847c5306m6134C8435K31006n6081J88572M6211
$$ 83535 365540 196688 211868 288715 -35306 -81440 38435 269441 213360 401932 448143
13427D48143j84714K4346G9660J60914J22978A16102J51507e7925A39887J56812
$$ 448143 263429 287775 79660 240574 363552 116102 267609 -57925 139887 296699
13417B96699A47217N8710K69767c357B80849b7091A88688J63929a8287E35210
$$ 296699 147217 205927 475694 -3357 280849 -27091 188688 352617 -18287 535210
13406C60336k5152n9432E0148K37693K69122o833F1826B6742J95707a70230B09137
$$ 360336 335184 275752 50148 287841 556963 550130 61826 26742 222449 -170230 209137
13394a18568C04707l1818a293p5779D27019G5643J56345j5124n1939l4692j7238
$$ -118568 304707 272889 -1293 -77072 427019 75643 231988 216864 164925 130233 112995
13383A12995K51173A73828a34785G5877N4466B2130K50334b4886G8720L46215
$$ 112995 364168 173828 -134785 75877 130343 22130 272464 -24886 78720 424935
13373D24935k5339A78880K40500D0519L35910c2141A90550M12450a21612D57829
$$ 424935 399596 178880 419380 40519 376429 -32141 190550 603000 -121612 457829
13362B70033M5588o3987j01066L22405A10323N0485L86288B20629F4083M18546
$$ 270033 315621 251634 150568 472973 110323 160808 547096 220629 64083 482629
13352D82629k27228a80965B53746H0936L84381E0052a58152D64758A50001K00590
$$ 482629 255401 -180965 253746 80936 465317 50052 -158152 464758 150001 350591
13342C50591j30009J30887C6961M52666k29623L8265g3086G5968M9904k5596K31123
$$ 350591 220582 351469 36961 489627 260004 298269 -73086 75968 125872 100276 331399
13331C31399J17207I8588c754C13771J77581B01114J39686m3173J79393B1138
$$ 331399 448606 98588 -3754 313771 491352 201114 340800 297627 477020 21138
13320h9941o902A6484M20256q1553r6003M04310B91002n8264d0870A13103K17830
$$ -89941 -96843 16484 436740 355187 259184 663494 291002 232738 -40870 113103 330933
13309C30933j31964q3172C0409L49604E3696J84756K00837A63563i5925g280B28708
$$ 330933 198969 115797 30409 380013 53696 238452 439289 163563 -95925 -7280 228708
13297I186b46490A38433n0833K0588N3889K2918C5514K67061K74714B55224J57538
$$ 9186 -246490 138433 87600 108188 162077 184995 35514 302575 577289 255224 412762
13286D12762n2509C5332J47854o6795a7375j8765A97350J10433a4924I8930K4346
$$ 412762 360253 35332 183186 116391 -17375 -36140 197350 307783 -14924 98930 123276
13275A23276l0980C1279f3365B04414N8960N6275N2795j51265J18940B1347M15508
$$ 123276 92296 31279 -63365 204414 263374 319649 372444 221179 340119 21347 436855
13264D36855j91438J39843A66884O0580A13045B6141L48274j29226k4409J0566
$$ 436855 245417 385260 166884 227464 113045 26141 374415 245189 220780 231346
13254B31346j3311j4205C0940J06311i2636A68054j5156k6701Q7421q5944K6892
$$ 231346 218035 203830 30940 137251 -92636 168054 152898 126197 213618 127674 154566
13243A54566E4962L8956L85946A88283b9156r8812B34041J59539j82617j9636
$$ 154566 54962 93918 479864 188283 -29156 -127968 234041 393580 210963 191327
13233A91327j2318j9103A5433a55858A53270J48952D452e3042l75627a983A22197
$$ 191327 179009 159906 15433 -155858 153270 302222 4452 -53042 -428669 -1983 122197
13221A05333N6877m1077E4944e0363G3313b2713A38546a25029E05714j48597A24981
$$ 105333 162210 121133 54944 -50363 73313 -22713 138546 -125029 505714 357117 124981
13209I6508K60055H7978J91183c4865B63733A9346J25281i400A71944q2568o526
$$ 96508 356563 87978 279161 -34865 263733 19346 144627 -9400 171944 89376 82850
13198H2850P5945a20431C35242j22617l2442J38986b41469a2005D49943A37627
$$ 82850 158795 -120431 335242 212625 180183 319169 -241469 -12005 449943 137627
13187a54708B23760f8969b4710A07695J8523K29133A37415c7359C37863A68029
$$ -154708 223760 -68969 -24710 107695 126218 355351 137415 -37359 337863 168029
13176B08370K8523c391A27679D3323P2166D1922J62972c4263A28979C8277J24038
$$ 208370 236893 -3391 127679 43323 115489 41922 204894 -34263 128979 38277 162315
13165A62315b28694b7368C60974G4935f3014k04786B483J91241K00286b6372A26542
$$ 162315 -228694 -27368 360974 74935 -63014 -267800 2483 193724 394010 -26372 126542
13153a12657E5174c05530a21108C49952a17435l4503A15218a04170A04164a34767
$$ -112657 55174 -305530 -121108 349952 -117435 -151938 115218 -104170 104164 -134767
13142b28502G3315A1583A578R5345J04041N0861p1202a6747H3289J4189J90192
$$ -228502 73315 11583 1578 96923 200964 251825 180623 -16747 83289 97478 287670
13131B87670g0205n8116D8740K19101n1825j7351m4323b09544A62787D7315d0255
$$ 287670 -70205 -128321 48740 267841 216016 198665 154342 -209544 162787 47315 -40255
13119A66802p0945K32028e2435A77401q6645J51778c3266H6274g8698C3332a43048
$$ 166802 95857 327885 -52435 177401 90756 242534 -33266 86274 -78698 33332 -143048
13107b72018H5903N8617D1328J93197A7897M49739A77081o5754m2295a3070D5226
$$ -272018 85903 144520 41328 234525 17897 467636 177081 111327 69032 -13070 45226
13095F5670J27112l1438G0671b94127B71817a0286C8576J01895q978d3533B95200
$$ 65670 192782 161344 70671 -294127 271817 -10286 38576 140471 131493 -43533 295200
13083A74473c8929I1963J51937H6705A9427g8934R331H5946J7796J92940a59045
$$ 174473 -38929 91963 243900 86705 19427 -78934 -69603 85946 103742 296682 -159045
13071i6389A90326K28834a81828G9354J34491J52216A72945J21592a25588C53820
$$ -96389 190326 419160 -181828 79354 213845 366061 172945 294537 -125588 353820
13060B03133E5035J59064M3955L4560j3734j8168b9989A76760P4097r1887b3819
$$ 203133 55035 214099 258054 292614 278880 260712 -29989 176760 250857 158970 -23819
13048E8346J99977A5956M4227M1817Q0946b17209b2804a0544j36998B39560f4788
$$ 58346 258323 15956 60183 102000 182946 -217209 -22804 -10544 -147542 239560 -64788
13036D35361f3565D47769G4358k195j384a37041B92686p9573a24907q0403A55992
$$ 435361 -63565 447769 74358 72163 70779 -137041 292686 213113 -124907 -205310 155992
13024A76356h6049C22356A49651R273K55945j91715r3250e7166B53379M9353B6136
$$ 176356 -86049 322356 149651 158924 414869 223154 129904 -57166 253379 302732 26136
13012A42986p147P1073j3509e4954A19035f534C14215B9610J069c8273a8084q8910
$$ 142986 135839 206912 193403 -54954 119035 -6534 314215 29610 30679 -38273 -18084 -106994
13000a06994C69576C5469P0793a60380A55719J44146j10746a2984A87480p5998
$$ -106994 369576 35469 106262 -160380 155719 299865 189119 -12984 187480 111482
12990A11482D6398J07877b6207j4272j55455c1300A84634i6778j0907M5733D6993
$$ 111482 46398 154275 -26207 -40479 -195934 -31300 184634 -96778 -107685 -61952 46993
12978C22439E9536a58182B67330d8110F5276a91957g842B00152b80598A1546b26807
$$ 322439 59536 -158182 267330 -48110 65276 -191957 -7842 200152 -280598 11546 -226807
12966A84463d9396J1921m6029A07807C3560K92623g4967A7895K75113d8736G4277
$$ 184463 -49396 -37475 -83504 107807 33560 326183 -74967 17895 293008 -48736 74277
12954g5822L498K199o3960B32975G4971b007k7250o3960C13274h3504N814c1058
$$ -75822 -72324 -70125 -134085 232975 74971 -2007 -29257 -93217 313274 -83504 -77690 -31058
12941D09169c8137D34911b83306a7260D80639B276N4777K19874a01981C056j33
$$ 409169 -38137 434911 -283306 -17260 480639 2276 57053 276927 -101981 3056 2923
12930B923a99169d5831g598j88467N2470c1699C27569e5308A16882N1881K44727
$$ 2923 -199169 -45831 -7598 -196065 -143595 -31699 327569 -55308 116882 168763 413490
12919D13490j33566b690B55459A21370a64997A73916O3691k6956J11116M0921
$$ 413490 279924 -2690 255459 121370 -164997 173916 237607 210651 321767 362688
12909C62688A8291J49123a90279j28022G5320a59239j5547A59341c7011J3943
$$ 362688 18291 167414 -190279 -318301 75320 -159239 -174786 159341 -37011 -23068
12899b3068A59404B2526M0919a28318A70653L6142G2199J30594B6442a25266N4243
$$ -23068 159404 22526 63445 -128318 170653 206795 72199 202793 26442 -125266 -71023
12888g1023B20407d6848b0379C57741A21287h9305A44603J26622H0998c4869A09322
$$ -71023 220407 -46848 -20379 357741 121287 -89305 144603 271225 80998 -34869 109322
12876A90809j2165a43385A01618e2136G8343J70700M7297a29435a4141j06939
$$ 190809 178644 -143385 101618 -52136 78343 249043 296340 -129435 -14141 -121080
12866a21080B51201A22723a67303j39052b6823A90487R1472C3813c00839a5260
$$ -121080 251201 122723 -167303 -306355 -26823 190487 281959 33813 -300839 -15260
12855B31298B5905J32218a3119k6054F5063L12025B7210K8656b29443F9338a19941
$$ 231298 25905 158123 -13119 -39173 65063 377088 27210 55866 -229443 69338 -119941
12843A19974a74943A80222e0282J0482C2810b12050R9167B83727a70329B03641
$$ 119974 -174943 180222 -50282 -39800 32810 -212050 -112883 283727 -170329 203641
12832f7757B20091a92536k8471I8965e8864j8117p476J71D9654a53475C57603
$$ -67757 220091 -192536 -221007 98965 -58864 -76981 -84457 -84286 49654 -153475 357603
12820a85533a2535p1104j8834A72203K4950m3344O0318J14050b50444D1588K88341
$$ -185533 -12535 -83639 -102473 172203 197153 153809 214127 328177 -250444 41588 329929
12809C29929A22566a12932e5248q0483l2874j67300B47332c10323c9064F8364
$$ 329929 122566 -112932 -55248 -135731 -168605 -335905 247332 -310323 -39064 68364
12798a58254A70797a23960j36499A88305d27823a90618K7001A13808a90031j18035
$$ -158254 170797 -123960 -260459 188305 -427823 -190618 -163617 113808 -190031 -308066
12788c08066e3751j06588e2537R607A04214b56836l4237B60597c41315A24139
$$ -308066 -53751 -160339 -52537 -42930 104214 -256836 -291073 260597 -341315 124139
12777b21463A38447d0311j27472d2402F2543a18129L6794k1740j18329G7040L3229
$$ -221463 138447 -40311 -167783 -42402 62543 -118129 -81335 -103075 -221404 77040 110269
12766A10269d6396A17348c73595A04585f8042B55541A3730e5775k59963O9239
$$ 110269 -46396 117348 -373595 104585 -68042 255541 13730 -55775 -315738 -246499
12756b46499A02369d3281j45180C98029d8717C04199k1149d6788A8314J9832J01725
$$ -246499 102369 -43281 -188461 398029 -48717 304199 283050 -46788 18314 38146 139871
12745A39871R3652H977J38438a90440A48582m2591r965B734N30382f1483n616
$$ 139871 233523 8977 147415 -190440 148582 105991 96026 2734 533116 -61483 -67099
12734f7099C36920A45870r435Q4796a18808B99579a27731A99886b0790j47485
$$ -67099 336920 145870 136435 221231 -118808 299579 -127731 199886 -20790 -168275
12724a68275A3310K24245A05870b5085j78880A53891b7464r5994A15858j0391
$$ -168275 13310 237555 105870 -25085 -203965 153891 -27464 -123458 115858 105467
12714A05467P9109a22804A46675a24477c3733C21981J24465a43531O2022C46167
$$ 105467 184576 -122804 146675 -124477 -33733 321981 446446 -143531 -81509 346167
12703B61466G6143Q0722B0951J71969a29344I9833N9851J81993C5876J47122g2358
$$ 261466 76143 156865 20951 192920 -129344 99833 159684 341677 35876 182998 -72358
12691b55069C16086p7875F7506J4371a319C16759G3191a60745G4086a1138B4013
$$ -255069 316086 238211 67506 81877 -1319 316759 73191 -160745 74086 -11138 24013
12679e6085o5677B94156R4821D9763K74304m8527j9666B1090J75584D395L47687
$$ -56085 -121762 294156 388977 49763 324067 275540 255874 21090 196674 4395 352082
12668C52082C6513a82431I649K54006A29092a23907A07911m6851R147Q4494K77107
$$ 352082 36513 -182431 9649 263655 129092 -123907 107911 61060 70207 154701 431808
12657D31808f5278K2545q6173A06282Q5853a06711A63629N2798a24205A14659
$$ 431808 -65278 -42733 -128906 106282 192135 -106711 163629 216427 -124205 114659
12646E59390b70446F7626c51001A660i6440C5811A5436O4315K07818n349j10322
$$ 559390 -270446 67626 -351001 1660 -96440 35811 15436 79751 287569 282220 171898
12635A71898Q2596A03320c6499k5333D7868J80146K47987B16788R765a7925C11584
$$ 171898 254494 103320 -36499 -61832 47868 228014 476001 216788 226553 -17925 311584
12623G1975L29073j36402L3887o4449Q9463b6220H1264N2782k7261c065B51229
$$ 71975 401048 264646 298533 234084 323547 -26220 81264 134046 106785 -3065 251229
12611E3113a43973B77542b91783A09746M54250e1922A92028D7028J5691K34641
$$ 53113 -143973 277542 -291783 109746 563996 -51922 192028 47028 62719 297360
12601B97360j7921I1753m677b7375L854m2949C10891j41922L8948G9629B8358
$$ 297360 279439 91753 87076 -27375 -23521 -66470 310891 168969 207917 79629 28358
12589A52046n1675R2255b6600E17878A11184K05872a17500C35380J89272a28056
$$ 152046 100371 192626 -26600 517878 111184 317056 -117500 335380 524652 -128056
12578a52667B6868a4111B91237c1214B64980B2049b2816j9813D88755A12452f716
$$ -152667 26868 -14111 291237 -31214 264980 22049 -22816 -42629 488755 112452 -6716
12566B01688a08592j83542i981l68297I5009L0116J9583b04294A02766L16998
$$ 201688 -108592 -292134 -9981 -378278 95009 125125 144708 -204294 102766 419764
12556D19764F3725M9925b3239B46173c4976A7190K22121j1484B1915K118g3546
$$ 419764 63725 113650 -23239 246173 -34976 17190 239311 227827 21915 24033 -73546
12544H4538B1678K69486a62932A63698J1490L9396c6044j33172B45218A08356
$$ 84538 21678 291164 -162932 163698 175188 214584 -36044 -169216 245218 108356
12533B4612J33238P9666i5215A09547C3085R9395A6686a4186l13033F3123c656
$$ 24612 157850 237516 -95215 109547 33085 132480 16686 -14186 -327219 63123 -3656
12521a31981j52505f5893K2262p4789d9632o3766J3806C94329b37474A30318a32008
$$ -131981 -284486 -65893 -43631 -118420 -49632 -113398 -99592 394329 -237474 130318 -132008
12509h4850a9408k20893D92395A03590d059p3174I0442d1074B0746O8786R0394
$$ -84850 -19408 -240301 492395 103590 -4059 -77233 90442 -41074 20746 89532 179926
12498A79926k3036f2073a3716G175L52254a53213J7085J0985C2883K22654c48195
$$ 179926 156890 -62073 -13716 7175 359429 -153213 -136128 -125143 32883 255537 -348195
12486a1685A15597C0306a23134A6457l819c93479a76554A02991M941i5526E7581
$$ -11685 115597 30306 -123134 16457 12638 -393479 -176554 102991 107932 -95526 57581
12474A76061a14232a0112j11569j2673A34107m3885J5651K56060C771f7856B21288
$$ 176061 -114232 -10112 -121681 -134354 134107 90222 105873 361933 3771 -67856 221288
12462G1144A7061E261b6363e208A17362f1491A62513a49206O3093c2733B71702
$$ 71144 17061 5261 -26363 -5208 117362 -61491 162513 -149206 -86113 -32733 271702
12450H5772a68850A28310g7200G5584a26595r353j32566A21310h6736R930A51174
$$ 85772 -168850 128310 -77200 75584 -126595 -135948 -268514 121310 -86736 -76806 151174
12438C52993h3406A61344a78060j90544H2597a97870j197j13697J39872n9902
$$ 352993 -83406 161344 -178060 -368604 82597 -197870 -199067 -312764 -172892 -232794
12428b32794k9500J28134l39934C10592D5450K20841a54798A60141o9068M0427
$$ -232794 -262294 -134160 -474094 310592 45450 266291 -154798 160141 91073 131500
12418A31500b59709c5778B63637d0765p0204A3936a62253F0510K7343K51601b38463
$$ 131500 -259709 -35778 263637 -40765 -110969 13936 -162253 60510 87853 339454 -238463
12406f3194D3723a87326a0805k10705Q0999B36453J9418C5696J93053c7576B50295
$$ -63194 43723 -187326 -10805 -221510 -140511 236453 255871 35696 228749 -37576 250295
12394a69506e506j41462B68915h0788I1345R1472D932h9697j6487D4772J52214
$$ -169506 -5506 -146968 268915 -80788 91345 182817 4932 -89697 -106184 44772 196986
12383A96986a65725e5180k10229A84206e4662b2196B19595k7071m0959b605C5180
$$ 196986 -165725 -55180 -265409 184206 -54662 -22196 219595 192524 151565 -2605 35180
12371A57870i9339A307a04596m9557j76284A19190c17046J13403p4825B26807
$$ 157870 -99339 1307 -104596 -154153 -330437 119190 -317046 -203643 -278468 226807
12360f6455q1772f4667D3990a24515B91007A13515J04487j03156L39251B1159
$$ -66455 -148227 -64667 43990 -124515 291007 113515 218002 114846 454097 21159
12349B5765a95991p8758B24660b38523g9653D25352H1609d3685j44948B5498n653
$$ 25765 -195991 -274749 224660 -238523 -79653 425352 81609 -43685 -188633 25498 19845
12338A9845c47295J69454O4413A17736P8883q6061n0231a03379A10562a44319
$$ 19845 -347295 -177841 -113428 117736 196619 110558 60327 -103379 110562 -144319
12327a02968A97596L04386a67469O2822n614E8171a51543H2849l4755L73506D8216
$$ -102968 197596 501982 -167469 -104647 -110261 58171 -151543 82849 48094 421600 48216
12315C82688A46723J07751H1688J07366a93636I574O506R9209J3561b67303R594
$$ 382688 146723 254474 81688 189054 -193636 9574 16080 115289 128850 -267303 -257709
12304b57709e1557k52711A50374C7018J28170p4691J6877c09581A93747a50285
$$ -257709 -51557 -304268 150374 37018 165188 90497 107374 -309581 193747 -150285
12293f9559F7126J36687G5223Q1127l122l4649a00710b4130B72496G8414d65384
$$ -69559 67126 203813 75223 156350 153228 118579 -100710 -24130 272496 78414 -465384
12281b30889B27417J03464C3692K21528c6101I3530J19153r4002f6202C22247
$$ -230889 227417 330881 33692 255220 -36101 93530 212683 118681 -66202 322247
12270D86825B6770M20205A90732K17528b86494G25K7961a28590b2427B6035J89428
$$ 486825 26770 446975 190732 408260 -286494 725 28686 -128590 -22427 26035 215463
12259B15463b6231n7826c2223A22964B3040g927C4886O7139J71195A23267a07818
$$ 215463 -26231 -84057 -32223 122964 23040 -7927 34886 102025 273220 123267 -107818
12247C2084J73489n06F5361b305B31751r330A05174C5561L29901d1655D9846m446
$$ 32084 205573 205067 65361 -2305 231751 222421 105174 35561 365462 -41655 49846 45400
12235D5400a2989B15272a13304d1702C60896G7013a94526B20245a8379H7979J64708
$$ 45400 -12989 215272 -113304 -41702 360896 77013 -194526 220245 -18379 87979 252687
12224B52687N270q3038A6748K04686A1121J10807J36178k6910J52720j29280b7225
$$ 252687 257957 174919 16748 221434 11121 121928 258106 231196 383916 254636 -27225
12212C40538q1747A27118J22422j2074j00670k4558b3692D70126I291K66682j28405
$$ 340538 258791 127118 249540 237466 136796 112238 -23692 470126 9291 275973 147568
12201A47568J88357O1400G5857J9329K9155J60299K07258I5427P4967k6042m9224
$$ 147568 335925 397325 75857 95186 124341 284640 491898 95427 170394 144352 95128
12190I5128k9128K01344p0888K92726j50547N304i324B77603L306c6470A03431
$$ 95128 66000 267344 196456 489182 338635 343939 -9324 277603 280909 -36470 103431
12178E8140K91988j73809G7958J15509K87634G7330a42421d8098C27527m3731
$$ 58140 350128 176319 77958 193467 481101 77330 -142421 -48098 327527 283796
12168B83796I9875e9533B30987c0479G5464Q2443F0526J77112H5175A7086b23651
$$ 283796 99875 -59533 230987 -30479 75464 157907 60526 237638 85175 17086 -223651
12156E7410P6753Q4276Q0725B9234J049c8736j4988J2948E6667a60455A40106
$$ 57410 134163 218439 299164 29234 30283 -38736 -53724 -40776 56667 -160455 140106
12144i8600C23551B5754a01408p4793A27969h4844F2471d0961B48699a97500d7685
$$ -98600 323551 25754 -101408 -176201 127969 -84844 62471 -40961 248699 -197500 -47685
12132G0665Q2255E5044P8012a47430J8070h809A77675L871a9041I489K91606j35004
$$ 70665 152920 55044 133056 -147430 -129360 -8809 177675 181546 -19041 9489 301095 166091
12120A66091b8740I2185a61232B57576k2249q2772F5948A8089J95268b41548k12121
$$ 166091 -28740 92185 -161232 257576 235327 152555 65948 18089 213357 -241548 -453669
12109d53669e3736j53385j1969A36665b15613H391b60430A47071b07234a1447
$$ -453669 -53736 -207121 -219090 136665 -215613 8391 -260430 147071 -207234 -11447
12098E50486i7467L9198A79193p6231K05164e6143j13931e9857C6703K4115c68450
$$ 550486 -97467 -58269 179193 102962 308126 -56143 -170074 -59857 36703 60818 -368450
12086B25919H3199c07935f9745K4146R383m0156c6664B50787i0704r4231D11811
$$ 225919 83199 -307935 -69745 -45599 -36216 -76372 -36664 250787 -90704 -184935 411811
12074H09317J637529j169222B79788b42852B46376o5607H4214a38501h81m36692
$$ 809317 2446846 1277624 279788 -242852 246376 180769 84214 -138501 -881 -437573
12064d37573b02733A73150h1445F8112K13831C9877j1220o951d59731a69817B29644
$$ -437573 -202733 173150 -81445 68112 281943 39877 28657 21706 -459731 -169817 229644
12052A54258M4721g5422j98005A69504N5881Q242I7567h29k06505m5354A64242
$$ 154258 198979 -75422 -273427 169504 225385 233627 97567 -829 -207334 -252688 164242
12040H6935k5469d3263l5886n8314I2289J04340a05090j16300C09423c85016D4399
$$ 86935 61466 -43263 -79149 -137463 92289 196629 -105090 -221390 309423 -385016 44399
12028a479H5912I950a65299D252a36407A03454a59433D4246J6013c01659j0669
$$ -1479 85912 9950 -165299 4252 -136407 103454 -159433 44246 60259 -301659 -312328
12017c12328A63815b80816A57878k8165K63546A49371k490b6251k07709A40953
$$ -312328 163815 -280816 157878 129713 393259 149371 146881 -26251 -233960 140953
12006G8446J64177b1664G3152p932A1008a31090N8399k7530B25294F3122J457
$$ 78446 242623 -21664 73152 65220 11008 -131090 -72691 -100221 225294 63122 64579
11995F4579J7578J5659i5953A26722b1683B29671j03023l5765c0977j53800d5415
$$ 64579 82157 97816 -95953 126722 -21683 229671 126648 90883 -30977 -184777 -45415
11983A36613a32526O4454C33089j17298J35236A61832b71895A263c25408B16286
$$ 136613 -132526 -68072 333089 215791 351027 161832 -271895 1263 -325408 216286
11972D5858a49135C14698j53468a14136m7562k1863g3873o0430j1860q8541a13804
$$ 45858 -149135 314698 161230 -114136 -161698 -183561 -73873 -134303 -146163 -234704 -113804
11960b11615A24197K65143b67212C2971P8820b35556A48024r997b78030G7231
$$ -211615 124197 389340 -267212 32971 111791 -235556 148024 138027 -278030 77231
11949C31143a77461A17105L2794f6633j49390B41228a26146q398J5956A53236
$$ 331143 -177461 117105 149899 -66633 -216023 241228 -126146 -134544 -118588 153236
11938A10910A1192d1138m0727E70698c46842a16120j3126c3371k51624J31448
$$ 110910 11192 -41138 -81865 570698 -346842 -116120 -129246 -33371 -284995 -153547
11928a53547A38862D4235D645b63476B1916a84171d7666F8175j8362c5033k1806
$$ -153547 138862 44235 4645 -263476 21916 -184171 -47666 68175 49813 -35033 -56839
11917e6839m5142j65463D1507L26577j25417c77203e0261H7732p124l9631b78045
$$ -56839 -101981 -267444 41507 368084 242667 -377203 -50261 87732 80608 40977 -278045
11905a39036A64534c4142j4838o1420B35221a78176B061f8426l7550A03936j2257
$$ -139036 164534 -34142 -48980 -110400 235221 -178176 2061 -68426 -105976 103936 91679
11894I1679O6691a98534B77475A20284m5453R8520a42522O2844E2467i5132A04792
$$ 91679 158370 -198534 277475 120284 74831 173351 -142522 -79678 52467 -95132 104792
11882H7987A5069J37415G2713g5782k13188e4924j38214K6018A99382a47821I437
$$ 87987 15069 152484 72713 -75782 -288970 -54924 -193138 -167120 199382 -147821 9437
11870a52937M5301c3278B47704a80688m7720A68632O1987a07933K4897r887k77800
$$ -152937 -107636 -33278 247704 -180688 -228408 168632 230619 -107933 -83036 -92923 -370723
11859c70723B30720C1389c12182o8580A86303g584l49117J48657A33413c08520
$$ -370723 230720 31389 -312182 -380762 186303 -7584 -356701 -208044 133413 -308520
11848D0480M5478e0275k21823A23717a20452D7459a18632O577E2112f7373B60918
$$ 40480 85958 -50275 -272098 123717 -120452 47459 -118632 -112055 52112 -67373 260918
11836f6558K7940k98269d5142o050j851j76438I6233b82638a19069r499A8204
$$ -66558 -38618 -336887 -45142 -51192 -53043 -229481 96233 -282638 -119069 -128568 18204
11824B4849K3510c30564C507J41386A2670J6255a15622m40509D3232K65467b33296
$$ 24849 48359 -330564 3507 144893 12670 28925 -115622 -556131 43232 308699 -233296
11812B86428A2205K7575b08105B913a44644l38949H1142M77f0193m4957j34934
$$ 286428 12205 39780 -208105 2913 -144644 -483593 81142 81619 -60193 -105150 -240084
11801b40084D1480J29070D1298Q5113a25750B75764i4646l7996p0468C07810b11917
$$ -240084 41480 170550 41298 126411 -125750 275764 -94646 -132642 -203110 307810 -211917
11789a83819l0569e4440j83576A4907a61404K7882A03915b05110e0069j1957E18859
$$ -183819 -214388 -54440 -238016 14907 -161404 -133522 103915 -205110 -50069 -62026 518859
11777a6434A39054b24846r003a13022e1618j38109C6183J04363K7419a94222C63793
$$ -16434 139054 -224846 -233849 -113022 -51618 -189727 36183 140546 167965 -194222 363793
11765a23359J4017B4027a57466A19246h3680j0516o9917A75376M7651J84694a63317
$$ -123359 -109342 24027 -157466 119246 -83680 -94196 -164113 175376 223027 407721 -163317
11753A5127O2511b44043I8180c15562d027l3702B14372b56661a21751g069F6664
$$ 15127 77638 -244043 98180 -315562 -4027 -37729 214372 -256661 -121751 -7069 66664
11741A16930b5215A24966i577G095N1546B2824a25844e3636q2223K7633j88317
$$ 116930 -25215 124966 -9577 7095 58641 22824 -125844 -53636 -135859 -108226 -296543
11730b96543D08703o0914E7114a21674A23782L892J11338d8896k11802E22K20714
$$ -296543 408703 347789 57114 -121674 123782 127674 239012 -48896 -260698 522 221236
11719B21236A06879q798a46229G2292g2944k22605B7803J19374c7194A66270h124
$$ 221236 106879 98081 -146229 72292 -72944 -295549 27803 147177 -37194 166270 -8124
11707b18379m5886L8619A9792N5320J79198I393e6267A51967R40e2905B12544
$$ -218379 -264265 -225646 19792 75112 254310 9393 -56267 151967 152907 -52905 212544
11695b01048c3845A62429e1362j51119f9076p4202A62602J89759A53296F4510
$$ -201048 -33845 162429 -51362 -202481 -69076 -143278 162602 352361 153296 64510
11684I5398N2839J12603B5156a1797A31455b91290A55174j1394D6728N7102K53561
$$ 95398 148237 260840 25156 -11797 131455 -291290 155174 143780 46728 103830 357391
11673C57391a6738l7105B33443c0443A14327J48286a47348B03775a31575C06046
$$ 357391 -16738 -53843 233443 -30443 114327 262613 -147348 203775 -131575 306046
11662c2394F4261C099K5750O9390D5882L9425J33146J76415j33574c21177a18452
$$ -32394 64261 3099 28849 98239 45882 85307 218453 394868 261294 -321177 -118452
11650a55948A44901f2074A20014d0907D1118f8140D60607b0087C7324J18367b87739
$$ -155948 144901 -62074 120014 -40907 41118 -68140 460607 -20087 37324 155691 -287739
11638B92217b07963i6247A31808e7363j01462j26000F404e1184D5896a0946C46489
$$ 292217 -207963 -96247 131808 -57363 -158825 -284825 6404 -51184 45896 -10946 346489
11626d2338j55396B07487m8910n1198J02528J60773C1138P9126P1967B1589a97873
$$ -42338 -197734 207487 158577 107379 209907 370680 31138 110264 182231 21589 -197873
11614B24674H8816a4325G1432e761A65232a71056q2281b919j32729n9835B44273
$$ 224674 88816 -14325 71432 -5761 165232 -171056 -253337 -2919 -135648 -195483 244273
11602I6535L58868a29292C06076G6719Q2752c0859A77320F9428K95324J4976A14041
$$ 96535 455403 -129292 306076 76719 159471 -30859 177320 69428 364752 379728 114041
11590I132a29434I1349K41293Q7270I8332K00220a36611D81795e5050K1306A10130
$$ 9132 -129434 91349 332642 419912 98332 298552 -136611 481795 -55050 -33744 110130
11578a62809G550O0427d4737R112j61420B44652I8525d4675J2963H2339K13466
$$ -162809 7550 67977 -44737 -35625 -197045 244652 98525 -44675 -31712 82339 295805
11567B95805b7780j9132j4900o6538F9384P2116n0878J96034n612d46k2578A1728
$$ 295805 -27780 -46912 -61812 -128350 69384 141500 90622 286656 281044 -446 -23024 11728
11554b39702A08071B1705L5335j6150L08597A323b79495A49070N4213B5580J085
$$ -239702 108071 21705 57040 40890 349487 1323 -279495 149070 203283 25580 26665
11543B6665J10789P9573l6231J11743A3920a27289A06673d0129C21009g0242A10603
$$ 26665 137454 217027 180796 292539 13920 -127289 106673 -40129 321009 -70242 110603
11531b71813C65870m4613E2470e9483B14606G625K42226n0695A7503b11542A05975
$$ -271813 365870 321257 52470 -59483 214606 7625 249851 199156 17503 -211542 105975
11519C50331b77409B4846M5884Q9242G2832J17598G9932R2937E6149J66027a34775
$$ 350331 -277409 24846 70730 159972 72832 190430 79932 172869 56149 222176 -134775
11507c40855E3721N1564J86129A03081K48951j53597J30539a50725G2208O4444
$$ -340855 53721 105285 291414 103081 352032 198435 328974 -150725 72208 136652
11497A36652Q0967R3754J52490d6829A4895b08015A68869a31979F9082k3074K65573
$$ 136652 217619 311373 463863 -46829 14895 -208015 168869 -131979 69082 46008 311581
11486C11581D8033e402j3682i209A06699K67170A59531Q1806A02335C7934K20377
$$ 311581 48033 -5402 -19084 -9209 106699 373869 159531 241337 102335 37934 258311
11475B58311J83009A60307J30162j30838g2653C61351j27923m1829J27387G2759
$$ 258311 441320 160307 290469 159631 -72653 361351 233428 191599 318986 72759
11464d0824q4015j96820D06029E9060a63348D92821B06809a60662d0870D9949
$$ -40824 -124839 -321659 406029 59060 -163348 492821 206809 -160662 -40870 49949
11453a30075A84017G310P5242l5772J84809K65602A17698L5445R8468J3833I1496
$$ -130075 184017 7310 82552 46780 231589 497191 117698 153143 251611 265444 91496
11441B12431J46245q6425m3510r5439J20781a77276L7967F4540B119J63970o1826
$$ 212431 358676 272251 228741 133302 254083 -177276 -139309 64540 2119 166089 104263
11430A04263h5995A20494j6959a71942c4953j10926K7468E0973E002J83368J07425
$$ 104263 -85995 120494 103535 -171942 -34953 -145879 -118411 50973 5002 188370 295795
11419B95795j6778f4060C74149e1113A65942C849a32495j18222M5239A58717o7086
$$ 295795 279017 -64060 374149 -51113 165942 3849 -132495 -250717 -205478 158717 91631
11408I1631G313l523J80517D8715L82225a65D4130h7387A43632a6071r4856c7046
$$ 91631 7313 3790 184307 48715 430940 -165 44130 -87387 143632 -16071 -110927 -37046
11395b40601J09883K7377A93053o4953l093j3719A8732i6776A94234a2920n79023
$$ -240601 -130718 -103341 193053 128100 125007 111288 18732 -96776 194234 -12920 -591943
11384e91943F9983e9617k06167C6386K20677I9577b13316A75483e9309K2723B98056
$$ -591943 69983 -59617 -265784 36386 257063 99577 -213316 175483 -59309 -36586 298056
11372f4436D6845J30057C4950g7657I9040a81077B14538h3640F537J88185p7924
$$ -64436 46845 176902 34950 -77657 99040 -181077 214538 -83640 6537 194722 116798
11361A16798m5020J83291F684J83655Q622d13574a8750d374A17228a94338g2154
$$ 116798 71778 255069 6684 190339 198961 -413574 -18750 -4374 117228 -194338 -72154
11349g2874b716F2809L60500h751j99286O8699j11567i4258B972o07J57280J92468
$$ -72874 -2716 62809 423309 -8751 -208037 -139338 -250905 -94258 2972 2365 159645 352113
11337C52113p4724c980A57883a66049A59987B3888c08709g7419M870j93794B49662
$$ 352113 277389 -3980 157883 -166049 159987 23888 -308709 -77419 -72549 -266343 249662
11325a06876k61318J39154f2117l04450B23189a5774B79177q6355m4609a59487
$$ -106876 -368194 -229040 -62117 -366567 223189 -15774 279177 192822 148213 -159487
11314c14014f0435l22785a22679m2092c978p0219H8515j5951h8244H6721i2081
$$ -314014 -60435 -383220 -122679 -164771 -3978 -74197 88515 72564 -88244 86721 -92081
11302d0578A92112J62185f4549B95080A17043Q0767a24024E8367a63401B86361
$$ -40578 192112 354297 -64549 295080 117043 197810 -124024 58367 -163401 286361
11291b86564b9115n3249K3529a6729j54086b5750p0851B56222r0060f7212j44419
$$ -286564 -29115 -82364 -58835 -16729 -170815 -25750 -96601 256222 166162 -67212 -211631
11280b11631A15050b04012I1849K33679a37505J1612K5223J6857E5587a83025
$$ -211631 115050 -204012 91849 325528 -137505 -125893 -100670 -83813 55587 -183025
11269b46398h8674K5123I0069A6271a5047k71860J01603p8012m0253A8428h0478
$$ -246398 -88674 -63551 90069 16271 -15047 -286907 -185304 -263316 -303569 18428 -80478
11257a76507A36549b42014g7421E4837Q17e08094c8674A92611a0164A65354b9745
$$ -176507 136549 -242014 -77421 54837 55654 -508094 -38674 192611 -10164 165354 -29745
11245b69946A7053c11457d0256I8394D1730a06682A52942b11051B84239A3817
$$ -269946 17053 -311457 -40256 98394 41730 -106682 152942 -211051 284239 13817
11234d43493n6876J81767f4256A56669F7176a94751g1454j48931A13605a94771
$$ -443493 -500369 -318602 -64256 156669 67176 -194751 -71454 -220385 113605 -194771
11223D61239j74900A05442f074B54746a03204d7780A56117b20471f9908A03707
$$ 461239 286339 105442 -6074 254746 -103204 -47780 156117 -220471 -69908 103707
11212b68907g6164I3440a53812A38486a08399B0957J08203d07601d0994l18382
$$ -268907 -76164 93440 -153812 138486 -108399 20957 129160 -407601 -40994 -359376
11202c59376A127h9053A73573l6397b27841h5438H2380i449j51550A11702a70848
$$ -359376 1127 -89053 173573 137176 -227841 -85438 82380 -9449 -160999 111702 -170848
11190b34011f3555B47506B5257N520b03817A07506A3625J5623J90301g02214a17106
$$ -234011 -63555 247506 25257 30777 -203817 107506 13625 29248 219549 -702214 -117106
11178b09931G8449J22904C8795e7055j96107a18468d4465A86441i0003m78q4731
$$ -209931 78449 201353 38795 -57055 -253162 -118468 -44465 186441 -90003 -90481 -175212
11167a75212m3155a06088B36258a90675C2718a82818h8372F1672A5418R4185l5774
$$ -175212 -218367 -106088 236258 -190675 32718 -182818 -88372 61672 15418 109603 73829
11156G3829b04485j7875E4263L76057c09244a52171A56411F4324A6962Q6425a32206
$$ 73829 -204485 -222360 54263 430320 -309244 -152171 156411 64324 16962 103387 -132206
11144B08670c58573a70976I4625K81559j2254e3548C60722h9655k23898J50383
$$ 208670 -358573 -170976 94625 376184 363930 -53548 360722 -89655 -313553 -163170
11134a63170K068C4493a52062A91947k7343o1577f6228F5873J52709f4760j31651
$$ -163170 -161102 34493 -152062 191947 164604 103027 -66228 65873 218582 -64760 -196411
11123a96411G9834K34256d08289a80855C1373L28197a79234A80832a08537D048
$$ -196411 79834 314090 -408289 -180855 31373 359570 -179234 180832 -108537 4048
11112A63997b43205B84121b06412F18543a13779D6165i0549D54147A99428a81007
$$ 163997 -243205 284121 -206412 618543 -113779 46165 -90549 454147 199428 -181007
11101d5466k6892A22742E5143R962J728K35096p6462L2354l5595A8306I060J63298
$$ -45466 -72358 122742 55143 65105 66833 301929 225467 257821 222226 18306 9060 172358
11089A72358Q7874J40217M890A15813a94902B17414r0714O2956f2184A3405J76392
$$ 172358 260232 400449 405339 115813 -194902 217414 126700 189656 -62184 13405 189797
11078A89797J20051P7877j71126B7452J18227L57123k18829n2607J22684J34391
$$ 189797 309848 387725 216599 27452 145679 502802 283973 231366 354050 488441
11068D88441P2866k30478J9699J9235k8004M106K45381k28048Q0172L4687j89762
$$ 488441 561307 330829 350528 369763 341759 345865 591246 363198 443370 478057 288295
11057B88295L53025j86336K88821k9328k23477L39780k3101L11588k71773m6711
$$ 288295 641320 454984 743805 714477 491000 830780 807679 1119267 847494 800783
11047H00783K3122m3558p4244L4050K93083j2526k95677m2156Q3972q8747j4708
$$ 800783 823905 780347 706103 740153 1033236 1020710 725033 682877 766849 678102 663394
11036F63394O3811J10355k0424l88149L70513j15164O380N2162K8266l3713k60936
$$ 663394 727205 837560 817136 428987 799500 684336 690716 742878 771144 737431 476495
11025D76495K15988L17130j4132l69187k32382M40868k69627J48562Q6259k68951
$$ 476495 692483 1009613 995481 626294 393912 834780 565153 713715 799974 531023
11015E31023J39690q7988j36719O5468B43054K25311L81483k88155j13070O1694
$$ 531023 670713 582725 446006 511474 243054 468365 849848 561693 448623 510317
11005E10317K58406l44747M08510o7072J05998l87658L93358K3670j85243j67782
$$ 510317 768723 423976 832486 765414 871412 483754 877112 900782 715539 547757
10995E47757P9818J5068J37385j27813J00601J80896J9460D41413M29777J2711
$$ 547757 627575 642643 780028 652215 752816 933712 953172 441413 871190 883901
10985H83901N3196k45196M29918r8749J51797k03149L71465O7158j71286K22386
$$ 883901 937097 691901 1121819 1023070 1174867 971718 1343183 1410341 1239055 1461441
10975A461441M90535N26691K59379N1652K16113o2385k8078k1402K3769k62322
$$ 1461441 1951976 2478667 2738046 2789698 3005811 2943426 2915348 2893946 2917715 2655393
10965B655393n69101r2724j36166l23564N20344l03604L50867l61239k6334R220
$$ 2655393 2086292 1993568 1857402 1533838 2054182 1750578 2101445 1740206 1713872 1723092
10955A723092L5870q7289n8633k53442m38831J34000l42126J99635j61804l43726
$$ 1723092 1758962 1671673 1613040 1359598 920767 1054767 712641 912276 750472 406746
10945D06746A55301Q1841k1185K60051A83970J24935q3846i1311D78454A14357
$$ 406746 155301 237142 215957 476008 183970 308905 225059 -91311 478454 114357
10934C73706a55084a0200I3396a46180b5061A37047f9482D7564i5386c3507j20589
$$ 373706 -155084 -10200 93396 -146180 -25061 137047 -69482 47564 -95386 -33507 -154096
10923a54096b0474B88666h9496A51538c20312a19338m5412C1154K96980G4051
$$ -154096 -20474 288666 -89496 151538 -320312 -119338 -164750 31154 328134 74051
10912B68569G4690h8593d3201k8913E65Q8518a85606g3173C5942b07408A20599
$$ 268569 74690 -88593 -43201 -72114 565 89083 -185606 -73173 35942 -207408 120599
10900A27876a47940L3097c2365k43240E6762a480A3565b59554a5944r6866D6151
$$ 127876 -147940 -114843 -32365 -275605 56762 -1480 13565 -259554 -15944 -112810 46151
10888A5364a92141G3521K74097D7251a2889j1769k1250K1851q4883j68784a32875
$$ 15364 -192141 73521 347618 47251 -12889 -24658 -45908 -24057 -108940 -277724 -132875
10876g8826q722D0969e2041j98565D103P7664c9205C0167J13132J5520F3182P8272
$$ -78826 -87548 40969 -52041 -250606 4103 81767 -39205 30167 143299 158819 63182 141454
10864A41454c409D626b57292c5538C82285A31572g8763j90354B10149c31703B09780
$$ 141454 -3409 4626 -257292 -35538 382285 131572 -78763 -269117 210149 -331703 209780
10852b5026A85102c0246A95579O9388C9427a37648b2648j6810k6516o7155p1741
$$ -25026 185102 -30246 195579 264967 39427 -137648 -22648 -39458 -65974 -133129 -204870
10841b04870n9842A0945a9193B11876G7034L7510P8978g0999B65255G0069k9217
$$ -204870 -264712 10945 -19193 211876 77034 114544 193522 -70999 265255 70069 40852
10830D0852N1054M2440a66295c6173D3028d3010A30630b03146d7390j44978r970
$$ 40852 91906 134346 -166295 -36173 43028 -43010 130630 -203146 -47390 -192368 -202338
10819b02338k7819J13670n5477A86007c79065O8288e2711j6710o2050I4502J1882
$$ -202338 -230157 -116487 -171964 186007 -379065 -310777 -52711 -69421 -131471 94502 106384
10808A06384D6709M04336A93876b47809G4799d92705e7174k04455E4189b27345
$$ 106384 46709 451045 193876 -247809 74799 -492705 -57174 -261629 54189 -227345
10797A22259i4213H9096K02312h7833A24555d6421j71491a4063j35942B48393
$$ 122259 -94213 89096 291408 -87833 124555 -46421 -217912 -14063 -150005 248393
10786b48830M0918A1287b6404G7229g3157A61934p6985J12149c2483A16104J4965
$$ -248830 -207912 11287 -26404 77229 -73157 161934 84949 197098 -32483 116104 131069
10775A31069J3451b72778B82811c50938a1861m8347a3783k33233l1625C6535Q2425
$$ 131069 144520 -272778 282811 -350938 -11861 -60208 -13783 -247016 -278641 36535 118960
10764A18960c54336a66203K7892H2924g1254A6917c75715E6786c7030B13155a68948
$$ 118960 -354336 -166203 -138311 82924 -71254 16917 -375715 56786 -37030 213155 -168948
10752g932r0078j24761D9689b19949a3046j21133m8076b6051n659F9343M198a77714
$$ -7932 -98010 -222771 49689 -219949 -13046 -134179 -182255 -26051 -31710 69343 73541 -177714
10739B9512R9234a47751O7496C2201P7863d2712j8913k4268C32410B3738c25715
$$ 29512 128746 -147751 -80255 32201 110064 -42712 -61625 -85893 332410 23738 -325715
10727E0448P5754H643b94162B05550b2562o6610c7648l2497A89968c87819J28124
$$ 50448 126202 8643 -294162 205550 -22562 -89172 -37648 -70145 189968 -387819 -259695
10716b59695E911d00602F1070c52657a15354A50317b58931B1732J05961b64116
$$ -259695 5911 -400602 61070 -352657 -115354 150317 -258931 21732 127693 -264116
10705A23038g26563A01288a4353j09133A29052O0804c71345H1325k8238M3308
$$ 123038 -726563 101288 -14353 -123486 129052 189856 -371345 81325 53087 96395
10695I6395J85098E1315L636P8370P3120b73014m7140C5710L4819a0882m8838
$$ 96395 281493 51315 54951 133321 206441 -273014 -320154 35710 70529 -10882 -59720
10684e9720B26491K3667c04742j32319b05780k13279a44696k62366f8110j03186
$$ -59720 226491 250158 -304742 -437061 -205780 -419059 -144696 -407062 -68110 -171296
10674a71296g765B5400i3495A48338c3353k20773a01770b3906B93634A42241N570
$$ -171296 -7765 25400 -93495 148338 -33353 -254126 -101770 -23906 293634 142241 147811
10663A47811b68050B79863a15362A07502a35779d5051A39270A8323K31294C7475
$$ 147811 -268050 279863 -115362 107502 -135779 -45051 139270 18323 249617 37475
10652b29819E6251a99984e2146A77377a33821J9391n2640A35728A98a27940J6741
$$ -229819 56251 -199984 -52146 177377 -133821 -114430 -167070 135728 198 -127940 -111199
10641a11199D42077E0634Q3031L1844a7785A18391A1542f3207M016F0318e1632
$$ -111199 442077 50634 133665 165509 -17785 118391 11542 -63207 -59191 60318 -51632
10629A8635Q4095Q8834i2189A4878g1026K1878A42514a01475K7570j1146K9388
$$ 18635 102730 191564 -92189 14878 -71026 -49148 142514 -101475 -73905 -85051 -55663
10618e5663B7965b5074j95602j01980A68051a9341p8821A80755b40807A10063
$$ -55663 27965 -25074 -220676 -322656 168051 -19341 -98162 180755 -240807 110063
10607D9899a78402M7394A87193C6396j5557b0581a839k81587B67852b34865C4435
$$ 49899 -178402 -131008 187193 36396 20839 -20581 -1839 -283426 267852 -234865 34435
10595a29215j51459i3120k04270f4836j03050j97529g9800A26434m7434p773b11229
$$ -129215 -280674 -93120 -297390 -64836 -167886 -365415 -79800 126434 79000 71227 -211229
10583B25040A10987b62057k2780B13382A1538a24649c2080D352e02355A48160
$$ 225040 110987 -262057 -284837 213382 11538 -124649 -32080 4352 -502355 148160
10572A21644b74238B72552c54567a40063c821k61882E1783F773J34213N2076J49470
$$ 121644 -274238 272552 -354567 -140063 -3821 -265703 51783 6773 140986 193062 342532
10561C42532e4887j10727A16737L3655d87307i1413B27449A195a623j47211q7883
$$ 342532 -54887 -165614 116737 150392 -487307 -91413 227449 1195 -1623 -148834 -236717
10550b36717C28020a09517B85797r2209H9448a46593l906l5262A8122a02479a2004
$$ -236717 328020 -109517 285797 193588 89448 -146593 -150499 -185761 18122 -102479 -12004
10538c6959A91512c1241j53310j9176B08580A1709K3278b51028F0818c17402O1117
$$ -36959 191512 -31241 -184551 -203727 208580 11709 34987 -251028 60818 -317402 -256285
10527b56285e7277j4011C34510A64977G8151k5813Q3487a60785a0805A26842d94635
$$ -256285 -57277 -71288 334510 164977 78151 52338 135825 -160785 -10805 126842 -494635
10515A00850J79829A20448a16356A24344J2220b26659j16009e4426j75754n5141
$$ 100850 280679 120448 -116356 124344 136564 -226659 -342668 -54426 -230180 -285321
10505b85321J24326b4960l4578H4861a44084A1712M3059f9777j48529A12702e209
$$ -285321 -160995 -24960 -59538 84861 -144084 11712 54771 -69777 -218306 112702 -5209
10493a44357D387J37604a15051o662A72531l3185a1397B85388H0941Q5413B7774
$$ -144357 4387 141991 -115051 -121713 172531 139346 -11397 285388 80941 166354 27774
10481C65079o1078J49923r4014n2820K50668B23242k7204i1300n2090A90890A2239
$$ 365079 304001 453924 359910 307090 557758 223242 196038 -91300 -143390 190890 12239
10469a50337A72464a58568A54301N5354e50095e8079k63360B4749b75208A0554
$$ -150337 172464 -158568 154301 209655 -550095 -58079 -321439 24749 -275208 10554
10458e0319h993r6087j50741A05282N3572J29486c23572J34921A70672C5722a50763
$$ -50319 -8993 -105080 -255821 105282 158854 288340 -323572 -188651 170672 35722 -150763
10446H3732h4658B11626b96793a28542A02558g27j36714B35870g0167m0304o0495
$$ 83732 -84658 211626 -296793 -128542 102558 -727 -137441 235870 -70167 -110471 -170966
10435a70966E2126a35839G8479e7901c773A03527l3383O7260F2085h664A70492
$$ -170966 52126 -135839 78479 -57901 -3773 103527 70144 137404 62085 -8664 170492
10423a105k05371f3562B02542g8929j17318M085b9067B27954g9277B86082F848
$$ -1105 -206476 -63562 202542 -78929 -196247 -192162 -29067 227954 -79277 286082 6848
10411c07713B08020H283J23511i2869K0479j62869d2499A39667a49016j05215
$$ -307713 208020 8283 131794 -92869 -72390 -235259 -42499 139667 -149016 -254231
10401b54231a03000B3478K13942d5272I550b04335G9775a17465c6043B21814q3869
$$ -254231 -103000 23478 237420 -45272 9550 -204335 79775 -117465 -36043 221814 137945
10390A37945f9209C39856A42314n4808b9116B04460q2395K42367G8215K58054
$$ 137945 -69209 339856 142314 87506 -29116 204460 122065 364432 78215 336269
10380C36269E666J89395c03697A74037J36604J49378A02709K83122p5299j49307
$$ 336269 5666 195061 -303697 174037 310641 460019 102709 385831 310532 161225
10370A61225K47128n4578A20568O08009B73000L3946M84729k30583A94252L2147
$$ 161225 408353 353775 120568 728577 273000 306946 791675 561092 194252 226399
10360B26399D9684K99718j00062J1441L5196A46526j5427J69902R8710l679n2621
$$ 226399 49684 349402 249340 260781 295977 146526 131099 301001 399711 396032 343411
10349C43411L7821J19675o8032K75187A91913K87334j95838A34580K65633A84983
$$ 343411 381232 500907 432875 708062 191913 479247 283409 134580 400213 184983
10338a79574B61713b7188o0004l9315C13543M6617n0524A08489J8660L3967A0996
$$ -179574 261713 -27188 -87192 -126507 313543 360160 309636 108489 127149 161116 10996
10326f823G3093C310J09624J34005B2746M04460B2922K55708c8401m0869D8139
$$ -6823 73093 3310 112934 246939 22746 427206 22922 278630 -38401 -79270 48139
10314G3953A3305L73547j23200a3250F8901P8633b18662f3083H3554b07485a9444
$$ 73953 13305 386852 263652 -13250 68901 147534 -218662 -63083 83554 -207485 -19444
10302A27254b00999A1601f0536k40129A50271d11205A46748N7162G076P0925R9797
$$ 127254 -200999 11601 -60536 -300665 150271 -411205 146748 203910 7076 78001 177798
10291A77798H1406J92305c255I8948K55888a57288A5310i6090q784k9690d2273
$$ 177798 81406 273711 -3255 98948 354836 -157288 15310 -96090 -104874 -134564 -42273
10279a80809I6974h2947k5924G9416K50122a7026A58541C0190J80910c8248B64426
$$ -180809 96974 -82947 -108871 79416 329538 -17026 158541 30190 211100 -38248 264426
10267a93386A22046b79043J02566A84389p4494K73838b0346J038M995C73881j31210
$$ -193386 122046 -279043 -176477 184389 109895 383733 -20346 -19308 -14313 373881 242671
10256B42671K95557A34216b38028a7857A33060l9036J5463D1932b70560d1728
$$ 242671 538228 134216 -238028 -17857 133060 94024 109487 41932 -270560 -41728
10245E9273g9418F701a99088j33005C8230a28094b5118l5518C78205F4570j4987
$$ 59273 -79418 6701 -199088 -332093 38230 -128094 -25118 -60636 378205 64570 49583
10234D9583c27977B3512a58315P7418c6350A66727c4263o3801j7130p043m1715
$$ 49583 -327977 23512 -158315 -80897 -36350 166727 -34263 -98064 -115194 -122237 -163952
10223a63952m3304A14067c41044b4942A28150a37868j9432g2565E723e5471o7917
$$ -163952 -207256 114067 -341044 -24942 128150 -137868 -157300 -72565 5723 -55471 -123388
10212a23388o8872k22806b4919k09272o2168b7502j25646l13651a95672P6902
$$ -123388 -192260 -415066 -24919 -234191 -296359 -27502 -153148 -466799 -195672 -118770
10202a18770M3550n1055j02029i3280j61328J16498A4827c472C00728d40824h8662
$$ -118770 -75220 -126275 -228304 -93280 -254608 -138110 14827 -3472 300728 -440824 -88662
10190b84694A49413b47072L3235r9704b140A7257J95727c26054f7696j45138P0206
$$ -284694 149413 -247072 -213837 -313541 -2140 17257 212984 -326054 -67696 -212834 -142628
10179a42628c169r3250L4343j27664B5308a70305l461I9453N4370J17923r9757
$$ -142628 -3169 -96419 -62076 -189740 25308 -170305 -173766 99453 153823 271746 171989
10168A71989a23901A16908c7280k19346p0261A53442n0861e4601H6790L16920
$$ 171989 -123901 116908 -37280 -256626 -326887 153442 102581 -54601 86790 403710
10158D03710A24663b28567c8682k6903M993A93640c60091B6990a33153C2776c74837
$$ 403710 124663 -228567 -38682 -65585 -60592 193640 -360091 26990 -133153 32776 -374837
10146a50654e2893k54448a45853j71454a43153r2769l2443a25058J3438j75661
$$ -150654 -52893 -307341 -145853 -317307 -143153 -235922 -268365 -125058 -111620 -287281
10136b87281e9991C44582j17774g4806B89593d6771B95795j6692C8868M7588J60160
$$ -287281 -59991 344582 226808 -74806 289593 -46771 295795 279103 38868 86456 246616
10125B46616i6676b0733A44584e2387k52409G1243b17074I6770a4430q6412A96334
$$ 246616 -96676 -20733 144584 -52387 -304796 71243 -217074 96770 -14430 -100842 196334
10113B1837b3299A30433B096b5299E881a25483B0821f4387j94534J25968j00074
$$ 21837 -23299 130433 2096 -25299 5881 -125483 20821 -64387 -258921 -132953 -233027
10102b33027q5635a3215k39119A3896b08765B2059b6634r1879A44795K8213G0298
$$ -233027 -318662 -13215 -252334 13896 -208765 22059 -26634 -118513 144795 173008 70298
10090b28163e1223p4565l34335J93834B21039a40887e5123F0957e6359k21559
$$ -228163 -51223 -125788 -460123 -266289 221039 -140887 -55123 60957 -56359 -277918
10080b77918O1485K0490A33222A4503J85117a57680A41124a14415l3625L572q2898
$$ -277918 -216433 -195943 133222 14503 199620 -157680 141124 -114415 -148040 -144468 -227366
10069b27366A26871l7947K3149a61492b8686D1549R4850E8760B3723a19796k4797
$$ -227366 126871 88924 112073 -161492 -28686 41549 136399 58760 23723 -119796 -144593
10058a44593F5748g1693F9134a71078M6171A60885d6037H1339b11865j53221B46685
$$ -144593 65748 -71693 69134 -171078 -124907 160885 -46037 81339 -211865 -365086 246685
10046A03183a14628B8473a80266D3063e1569D14313A76596n798b17573k38424
$$ 103183 -114628 28473 -180266 43063 -51569 414313 176596 170798 -217573 -455997
10036d55997C8644b40809B0982d970k29460D91033b1592l26791A83261A0376f4167
$$ -455997 38644 -240809 20982 -4970 -234430 491033 -21592 -348383 183261 10376 -64167
10024c79986A44468d9423A06606b62031d0946j2589q1280C9397a39730e1076j58410
$$ -379986 144468 -49423 106606 -262031 -40946 -53535 -134815 39397 -139730 -51076 -209486
10013b09486k13309p0703a5132A49138d4461A02429g3998H961c39816e4381D2716
$$ -209486 -422795 -493498 -15132 149138 -44461 102429 -73998 8961 -339816 -54381 42716
10001F381i2341j39544j39206A85117a71038A42569a87181a8995D1210d4011l32948
$$ 6381 -92341 -231885 -371091 185117 -171038 142569 -187181 -18995 41210 -44011 -376959
9990c76959f766C0436c55926B8549a27369p5833B72114A4861L9893h322E2972
$$ -376959 -6766 30436 -355926 28549 -127369 -203202 272114 14861 54754 -8322 52972
9978h3760r1735L3615C7448c15129B56142A04064B897a61559e7766p7756h970
$$ -83760 -175495 -141880 37448 -315129 256142 104064 2897 -161559 -57766 -135522 -8970
9966a64484p9624F6345c0841k47673r4332a06841C39652H8677k2436a11096j07430
$$ -164484 -244108 66345 -30841 -278514 -372846 -106841 339652 88677 66241 -111096 -218526
9955b18526B9995L22337b77559J09980B53710b35658i6439k34786H8004I474a15441
$$ -218526 29995 352332 -277559 -167579 253710 -235658 -96439 -331225 88004 9474 -115441
9943H9259b802r6941j59390f0133j97459a3912j93846c2142A98654l0532C1014
$$ 89259 -2802 -99743 -259133 -60133 -257592 -13912 -207758 -32142 198654 168122 31014
9931D7327a0313I0304B8681b38104e3358l06117a56244D94344b2289e639A7472
$$ 47327 -10313 90304 28681 -238104 -53358 -359475 -156244 494344 -22289 -5639 17472
9919c1383A1659M2178a29535k78669a11850B6529J40770b67383R0623k6437r6251
$$ -31383 11659 53837 -129535 -408204 -111850 26529 167299 -267383 -176760 -203197 -299448
9908b99448j1187m9939a26646G7699R4293p9122a29406A40051b15121d6983j54055
$$ -299448 -310635 -360574 -126646 77699 171992 92870 -129406 140051 -215121 -46983 -201038
9897b01038h5374F9068b3362n7907A65470D8598L41560b333p1864k34795c0561
$$ -201038 -85374 69068 -23362 -81269 165470 48598 390158 -2333 -74197 -308992 -30561
9885a18467E5238h6051j59266A26270a74752A42464L1008C2708a50567A35991
$$ -118467 55238 -86051 -245317 126270 -174752 142464 173472 32708 -150567 135991
9874A11377c51927B61092b09595j48697A05396b48660B75115j08914d35732A15787
$$ 111377 -351927 261092 -209595 -358292 105396 -248660 275115 166201 -435732 115787
9863C0747A278b70230g0794A78097a5972A15821a62575B10146a59862f357I083
$$ 30747 1278 -270230 -70794 178097 -15972 115821 -162575 210146 -159862 -6357 9083
9851d9699k04854a5254k41686A27660c21064j0478d4536q8516A09992g3204K1197
$$ -49699 -254553 -15254 -256940 127660 -321064 -331542 -44536 -133052 109992 -73204 -52007
9840e2007k72391I4566J4041b35837b6529j6494o9718A37717h0612A23234D1458
$$ -52007 -324398 94566 108607 -235837 -26529 -43023 -112741 137717 -80612 123234 41458
9828a76300l0511Q3809k12750A12324P7J02017b11944a01812L052k2022m1979
$$ -176300 -206811 -123002 -335752 112324 112401 214418 -211944 -101812 -98760 -120782 -162761
9817a62761n0700A94693q5599b80248n4395B46571b11448J03963A96630a17331
$$ -162761 -213461 194693 109094 -280248 -334643 246571 -211448 -107485 196630 -117331
9806c5784q9160H5051L4001k3956a88386o7455g7751l03468a19137c3006j43841
$$ -35784 -124944 85051 119052 95096 -188386 -255841 -77751 -381219 -119137 -33006 -176847
9795a76847A5981b92547h7249l31503b1574p8795K7179r2615O2127J3335F2812
$$ -176847 15981 -292547 -87249 -418752 -21574 -100369 -73190 -165805 -103678 -90343 62812
9783f9424A33881d58043G6841a63140b4655A04653b16524g5301k52786a54881
$$ -69424 133881 -458043 76841 -163140 -24655 104653 -216524 -75301 -328087 -154881
9772h8333j30315K4625C176a36008m547E9167f1698j04161D1746a28735r8144
$$ -88333 -218648 -194023 3176 -136008 -140555 59167 -61698 -165859 41746 -128735 -226879
9761b26879B18150c15456a47044o3008k0258a6343k27695a4264G5335a09953D1888
$$ -226879 218150 -315456 -147044 -210052 -230310 -16343 -244038 -14264 75335 -109953 41888
9749B21741a01802k27557a51852f4751B3968M37392g6590j25736D3203a13671
$$ 221741 -101802 -329359 -151852 -64751 23968 461360 -76590 -202326 43203 -113671
9738b40338c1772A64020A4520L31850b14341c8701k58504A60819b95270e3781
$$ -240338 -31772 164020 14520 346370 -214341 -38701 -297205 160819 -295270 -53781
9727d10230A84318F9174a48041C679b92131a43718N3621k10921f6765C076b11360
$$ -410230 184318 69174 -148041 3679 -292131 -143718 -90097 -301018 -66765 3076 -211360
9715f1709j68816c2018B59138i6581j4259j0363A38415M119C4588a49803L8348
$$ -61709 -230525 -32018 259138 -96581 -110840 -121203 138415 142534 34588 -149803 -111455
9704a11455j6692k12296a46341r2931f4707m7374A62184a27980j49409B6018b20486
$$ -111455 -128147 -340443 -146341 -239272 -64707 -112081 162184 -127980 -277389 26018 -220486
9692c65906a79518A18607b91730i2277A40684C2870J20430b95031i4891A33460
$$ -365906 -179518 118607 -291730 -92277 140684 32870 153300 -295031 -94891 133460
9681b2558j06422f3730A49447a52359f8594L0820j01307K7904q8244q8544a19758
$$ -22558 -128980 -63730 149447 -152359 -68594 -37774 -139081 -111177 -199421 -287965 -119758
9669a34213A9963K23074F6348N047b5289m7112A3791K15537a47615J2326j80322
$$ -134213 19963 243037 66348 71395 -25289 -72401 13791 229328 -147615 -135289 -315611
9658c15611P3724k3295C3265O9010d56809K06203A73814L052e2435B868a55374
$$ -315611 -241887 -265182 33265 102275 -456809 -250606 173814 176866 -52435 2868 -155374
9646A92953c56422a06664G5529a38486R076k99131b10389k96594E7455a85714
$$ 192953 -356422 -106664 75529 -138486 -129410 -428541 -210389 -506983 57455 -185714
9635C98568a44562O1957n410b8817A67528A0969d0923B8424J58926g8979m9462
$$ 398568 -144562 -82605 -88015 -28817 167528 10969 -40923 28424 187350 -78979 -128441
9624a28441k0846b6308F3473J13963I478J40749P8083b7245A34599b28872a00816
$$ -128441 -149287 -26308 63473 177436 9478 150227 228310 -27245 134599 -228872 -100816
9612a10854J9679o4366E0950a4328D2563j5619R663J21732b59645k9345a35365
$$ -110854 -91175 -155541 50950 -14328 42563 26944 36607 158339 -259645 -288990 -135365
9600c5604j17251A62027a58013c6722q2946A24950b13239B05205a45458O9403
$$ -35604 -152855 162027 -158013 -36722 -119668 124950 -213239 205205 -145458 -76055
9590g6055J3306k416p5346k80361a88742B45890b59817A13101b59305J2695c8309
$$ -76055 -62749 -65165 -140511 -420872 -188742 245890 -259817 113101 -259305 -246610 -38309
9578G7095h6774k8280r1604D6728a25692d8156j54999K0801F8999k8632M7966
$$ 77095 -86774 -115054 -206658 46728 -125692 -48156 -203155 -182354 68999 40367 88333
9567H8333c67409B53146a76892e8213l68h874r4414J6150n8150L2062M4803k57556
$$ 88333 -367409 253146 -176892 -58213 -58581 -8874 -103288 -87138 -145288 -113226 -68423 -325979
9555c25979G0227J95871P0031g6711B30530b27461b4222n7314j37182F5567O7060
$$ -325979 70227 266098 336129 -76711 230530 -227461 -24222 -81536 -218718 65567 132627
9544A32627c18683A53719c30928g8515F5542r170Q7164a81274K9442f4151j17639
$$ 132627 -318683 153719 -330928 -78515 65542 56372 143536 -181274 -151832 -64151 -181790
9533a81790E3967L6362c8438A20146N6358M6383r0366d9577j68462B37657a93990
$$ -181790 53967 90329 -38438 120146 176504 222887 132521 -49577 -218039 237657 -193990
9521a37730H9723a15020b6989j59546L2899C8304a85617A73967f8915j68229k05738
$$ -137730 89723 -115020 -26989 -186535 -153636 38304 -185617 173967 -68915 -237144 -442882
9510d42882f5043K0445A12665a46173A29082a71236j06262j57929O8710a43559
$$ -442882 -65043 -44598 112665 -146173 129082 -171236 -277498 -435427 -366717 -143559
9499c0936F5127a08320j16353c0961r6703N4670A34517i7274B26030a37543j09106
$$ -30936 65127 -108320 -224673 -30961 -127664 -72994 134517 -97274 226030 -137543 -246649
9488b46649J03531r2034F5601k4292b7966B2047d7584b1267l542M976B52207d6995
$$ -246649 -143118 -235152 65601 41309 -27966 22047 -47584 -21267 -24809 -19833 252207 -46995
9475a99325e822H4802j1293a60661j38586b9495j29k2943k2228l59208J88502
$$ -199325 -5822 84802 73509 -160661 -299247 -29495 -29624 -52567 -74795 -434003 -245501
9464b45501C0192J47793C554J94805I5104g2442k20392E6965h6068D9176e1873
$$ -245501 30192 177985 3554 198359 95104 -72442 -292834 56965 -86068 49176 -51873
9452h8026r4769P4339d5338J2775l3650C48364E0790K08682a76986C2399b35601
$$ -88026 -182795 -108456 -45338 -32563 -66213 348364 50790 259472 -176986 32399 -235601
9440a5763C35161a1584j61409A59013c47775G3950b53749g8757c8191R070l108
$$ -15763 335161 -11584 -172993 159013 -347775 73950 -253749 -78757 -38191 -29121 -32229
9429c2229A0465d41565D92600h5006m7818H5492d74923a86852k9295j8833f9497
$$ -32229 10465 -441565 492600 -85006 -132824 85492 -474923 -186852 -216147 -234980 -69497
9417A29029a0982j58996j02859a22733I1550O3460h5120j28029g0094l9046k11768
$$ 129029 -10982 -169978 -272837 -122733 91550 155010 -85120 -213149 -70094 -109140 -320908
9406c20908e2570D9237k1749b02064n3022f6147j06818J6934B6537b98491E0513
$$ -320908 -52570 49237 27488 -202064 -255086 -66147 -172965 -156031 26537 -298491 50513
9394a15836j0692d5389R849A48630M6733b50879J00482k72425A76745l6873b86655
$$ -115836 -126528 -45389 -35540 148630 195363 -250879 -150397 -422822 176745 139872 -286655
9382A06082K29m9373a51780a1274a095k32730J00932p295A06264C4005K64493
$$ 106082 106311 56938 -151780 -11274 -1095 -233825 -132893 -140188 106264 34005 298498
9371B98498f4327k28032P2395c9362k4793l33496G9267b77103A3097b61569f5943
$$ 298498 -64327 -292359 -219964 -39362 -64155 -397651 79267 -277103 13097 -261569 -65943
9359a40494e0404k02139A116h0528I6883l2898h4348A91417h8373a8484k34768
$$ -140494 -50404 -252543 1116 -80528 96883 63985 -84348 191417 -88373 -18484 -253252
9348b53252D30020C2855K46534c83466A29427a0659A69987a06822r7467H9221
$$ -253252 430020 32855 279389 -383466 129427 -10659 169987 -106822 -204289 89221
9337A78299p8859c66361F4758J48509r8898c81669l5842a19715H4834M9622d8007
$$ 178299 99440 -366361 64758 213267 114369 -381669 -417511 -119715 84834 134456 -48007
9325b7624A61004b46914o8155J0730A66617c7062j03574F9022c09397O2049A91091
$$ -27624 161004 -246914 -315069 -304339 166617 -37062 -140636 69022 -309397 -247348 191091
9313A11457J01068I8623q146P1945o3689f5894J6853C4080d4145m1444D7194f1242
$$ 111457 212525 98623 90477 162422 98733 -65894 -49041 34080 -44145 -85589 47194 -61242
9300a92110d9479k55374C6709f4414C5752L6687j7950f6574k5380C3220f4700
$$ -192110 -49479 -304853 36709 -64414 35752 72439 54489 -66574 -91954 33220 -64700
9288b018j46025M8527j21902R1152A62420a88784P3713o4974C52559G2896A7295
$$ -2018 -148043 -99516 -221418 -130266 162420 -188784 -115071 -180045 352559 72896 17295
9276F2635e8342k2337B15022f4992A8370a49848l0504J4515B51844c83485A0411
$$ 62635 -58342 -80679 215022 -64992 18370 -149848 -180352 -165837 251844 -383485 10411
9264H289P5081k286d2690A34221h958l01450c5480H9523A9955h0689l358J2100
$$ 8289 83370 81084 -42690 134221 -8958 -310408 -35480 89523 19955 -80689 -84047 -71947
9252g1947l18171a58187a9453j86140L2057G5556l672b4110j29827D07479D9300
$$ -71947 -390118 -158187 -19453 -205593 -173536 75556 71884 -24110 -153937 407479 49300
9240A10945Q5816i1706K1634F6044c47700D8184P3528b33593J6452m0649A99056
$$ 110945 196761 -91706 -70072 66044 -347700 48184 121712 -233593 -217141 -257790 199056
9228E04412d10485A08247a49363j14902P1357D7441P6667A6781b01726a8275l56578
$$ 504412 -410485 108247 -149363 -264265 -192908 47441 124108 16781 -201726 -18275 -374853
9217c74853R9873h3844H6735K4627K6907n4367j0375l0018a09507j49265F7186
$$ -374853 -274980 -83844 86735 111362 138269 83902 73527 43509 -109507 -258772 67186
9205e0878A73519i853k86057a22685I1834J99781b55955o600J27894i111C97675
$$ -50878 173519 -9853 -295910 -122685 91834 291615 -255955 -262555 -134661 -9111 397675
9193c4357h67A55685J09361A28909E5350J19488p4716a12398j38949Q0441L1051
$$ -34357 -867 155685 265046 128909 55350 174838 100122 -112398 -251347 -170906 -139855
9182a39855D15855E47a44220b4209A29179c57358a0329G4820a56580B59970A23246
$$ -139855 415855 547 -144220 -24209 129179 -357358 -10329 74820 -156580 259970 123246
9170d07101a70120j34320b2921p3226M4230C06773a85498j3149D4235b10207n1209
$$ -407101 -170120 -304440 -22921 -96147 -51917 306773 -185498 -198647 44235 -210207 -261416
9159b61416c4166p6916K4321C8128f0840A22650l1129f1271E3820a19688B0415
$$ -261416 -34166 -111082 -86761 38128 -60840 122650 91521 -61271 53820 -119688 20415
9147b03277g158A2186c43900A34144J00192e00937b06309B1486a34492D9777P771
$$ -203277 -7158 12186 -343900 134144 234336 -500937 -206309 21486 -134492 49777 57548
9136E7548O1101f43369g437k21684C9901e43634B87520a53203j45412a21958d6113
$$ 57548 118649 -643369 -7437 -229121 39901 -543634 287520 -153203 -298615 -121958 -46113
9124a09107A07478l87K15403h5969k22944a1022p2014q4069E70g3582k4322l5453
$$ -109107 107478 107091 322494 -85969 -308913 -11022 -83036 -167105 570 -73582 -97904 -133357
9112a33357D2893Q9955h7753j80822n9874k8366J24240C8285a70217j45899A12115
$$ -133357 42893 132848 -87753 -268575 -328449 -356815 -232575 38285 -170217 -316116 112115
9100A6300a11804k54420J829A19686k1832c36563a54021A51614b12674A31065
$$ 16300 -111804 -366224 -364395 119686 97854 -336563 -154021 151614 -212674 131065
9089a72745m0240c0765A14637a21396j68867H7849c59621a15837B3474i8722c2348
$$ -172745 -212985 -30765 114637 -121396 -290263 87849 -359621 -115837 23474 -98722 -32348
9077b76679k6784R9078A2646P979a47840j31737a30243e3445j61930A89714b42625
$$ -276679 -303463 -204385 12646 20625 -147840 -279577 -130243 -53445 -215375 189714 -242625
9065A7366i2061b1597G0383J74238I6805K34289b20575A36408D118J42240c66287
$$ 17366 -92061 -21597 70383 244621 96805 331094 -220575 136408 4118 146358 -366287
9053A82042b47547h2677A97307a8963k72779a05254a9930m9156B8818a3197A30619
$$ 182042 -247547 -82677 197307 -18963 -291742 -105254 -19930 -69086 28818 -13197 130619
9041B06911a14766j58750n5765D25394a12674k00322I1368J3608d63980B1879
$$ 206911 -114766 -273516 -329281 425394 -112674 -312996 91368 104976 -463980 21879
9030b32929H869a65512n6140A50823M682K11344c91321F7737b98208h3789r5695
$$ -232929 8869 -165512 -221652 150823 155505 366849 -391321 67737 -298208 -83789 -179484
9019a79484c2549f321l7904A4527M7572b66127M027d5027f376j61208g3209j28550
$$ -179484 -32549 -6321 -44225 14527 62099 -266127 -262100 -45027 -6376 -167584 -73209 -201759
9007b01759e8571C7936K62697K4907a10303k17662a16525o3343f3176A93375J5128
$$ -201759 -58571 37936 300633 325540 -110303 -327965 -116525 -179868 -63176 193375 208503
8996B08503c34620A96909F6846P9610a04766A01059c1867B66926a42711d2806
$$ 208503 -334620 196909 66846 146456 -104766 101059 -31867 266926 -142711 -42806
8985a41305k30495i1832J9821I6887L6002b87905a08381C14747H9243d8885l41933
$$ -141305 -371800 -91832 -72011 96887 132889 -287905 -108381 314747 89243 -48885 -390818
8974c90818B7693a3379p1070q3536A35441b08022J9524g4572j34530a0123B7417
$$ -390818 27693 -13379 -84449 -167985 135441 -208022 -188498 -74572 -209102 -10123 27417
8962b7201H3005K08608H7945h2179k18582a48503a9j29479o7065j2444B5896A69
$$ -27201 83005 291613 87945 -82179 -300761 -148503 -19 -129498 -196563 -209007 25896 169
8949e0269r8914c4328I8146K0640b40810K6823A69958G4428R0030a450E0289i6008
$$ -50269 -149183 -34328 98146 118786 -240810 -213987 169958 74428 164458 -1450 50289 -96008
8936c6906A03632J30916M53753G8060F576a14267e6751B50705J47936j74659k3188
$$ -36906 103632 234548 688301 78060 6576 -114267 -56751 250705 398641 223982 200794
8925B00794K67069N99608R41197L994682J7750344A0092822B185164D50449P5803
$$ 200794 467863 1067471 2008668 6003350 23753694 10092822 2185164 450449 526252
8916E26252A52931D7344a09661r354M1453j03108A0910a00574c0381B04036k1361
$$ 526252 152931 47344 -109661 -119015 -77562 -180670 10910 -100574 -30381 204036 182675
8905A82675n9094M9266H3520K1703a54470H9839c82324g7573H5289a09077P790
$$ 182675 123581 172847 83520 105223 -154470 89839 -382324 -77573 85289 -109077 -101287
8894a01287N328k8112o3116e8795A97452a43757j58734J46617E537K6722a76058
$$ -101287 -95959 -124071 -187187 -58795 197452 -143757 -302491 -155874 5537 32259 -176058
$$ [...]
##END NTUPLES=NMR SPECTRUM
##END=
