
##TITLE=UV1215_M5_1296-1170_10_7229370_8bzgtBLeyR
##JCAMPDX= 6.0         $$ Bruker NMR JCAMP-DX V2.0
##DATA TYPE= NMR SPECTRUM
##DATA CLASS= NTUPLES
##ORIGIN= BRUKER
##OWNER= Administrator
$$ 1.72 TOPSPIN		Version 2.1
$$ 2013-01-17 21:51:25.168 -0500  Administrator@X
$$ Compression mode = diff/dup
##.OBSERVE FREQUENCY= 400.02188249412
##.OBSERVE NUCLEUS= ^1H
##.ACQUISITION MODE= SIMULTANEOUS (DQD)
##.ACQUISITION SCHEME= undefined
##.AVERAGES= 64
##.DIGITISER RES= 22
##SPECTROMETER/DATA SYSTEM= spect
##.PULSE SEQUENCE= noesygpps1d.comp
##.SOLVENT NAME= COFFEE_meoh
##.SHIFT REFERENCE= INTERNAL, COFFEE_meoh, 1, 14.96134
##AUDIT TRAIL= $$ (NUMBER, WHEN, WHO, WHERE, PROCESS, VERSION, WHAT)
$$ ##TITLE= Audit trail, TOPSPIN		Version 2.1
$$ ##JCAMPDX= 5.01
$$ ##ORIGIN= Bruker BioSpin GmbH
$$ ##OWNER= Administrator
$$ $$ E:\/data/COFFEE/nmr/UV1215_M5_1296-1170_10_7229370_8bzgtBLeyR/22/pdata/1/auditp.txt
$$ ##AUDIT TRAIL=  $$ (NUMBER, WHEN, WHO, WHERE, PROCESS, VERSION, WHAT)
(   1,<2013-01-17 21:51:19.480 -0500>,<Administrator>,<X>,<go>,<TOPSPIN 2.1>,
      <created by zg
	started at 2013-01-17 21:39:49.762 -0500,
	POWCHK enabled, PULCHK disabled,
       configuration hash MD5:
       86 BA 57 50 F2 9D 5C 9B 26 00 A9 28 5F 66 2E 89
       data hash MD5: 64K
       A3 8C C2 5B 01 19 15 BE DE 66 CA 3A F6 1C 14 8A>)
(   2,<2013-01-17 21:51:22.480 -0500>,<Administrator>,<X>,<proc1d>,<TOPSPIN 2.1>,
      <Start of raw data processing
       efp LB = 0.3 FT_mod = 6 PKNL = 1 PHC0 = 0 PHC1 = 0 SI = 128K 
       data hash MD5: 128K
       E5 28 35 3D 7B 66 D2 00 13 12 C4 6D C6 09 D8 8B>)
(   3,<2013-01-17 21:51:23.512 -0500>,<Administrator>,<X>,<proc1d>,<TOPSPIN 2.1>,
      <pk PHC0 = -81.41968 PHC1 = 0 
       data hash MD5: 128K
       08 3C CB 41 D3 3E 73 14 3E AF 5E CD 7C 38 3C 85>)
(   4,<2013-01-17 21:51:24.168 -0500>,<Administrator>,<X>,<proc1d>,<TOPSPIN 2.1>,
      <abs ABSG = 1 
       data hash MD5: 128K
       E5 BD 8C 0A E6 D8 37 C6 44 66 F7 66 6E C3 9F 3D>)
(   5,<2013-01-17 21:51:24.340 -0500>,<Administrator>,<X>,<proc1d>,<TOPSPIN 2.1>,
      <abs ABSG = 2 
       data hash MD5: 128K
       0E B8 A3 5B 93 53 BF 8E B1 EE 00 D5 9B 94 F2 50>)
(   6,<2013-01-17 21:51:24.512 -0500>,<Administrator>,<X>,<proc1d>,<TOPSPIN 2.1>,
      <abs ABSG = 3 
       data hash MD5: 128K
       3B FB 1B 6A A5 67 49 AD 66 4F 45 88 5D 7C 20 0E>)
(   7,<2013-01-17 21:51:24.683 -0500>,<Administrator>,<X>,<proc1d>,<TOPSPIN 2.1>,
      <abs ABSG = 4 
       data hash MD5: 128K
       17 38 7B C6 A4 C5 3C 77 00 FB 14 CB 25 04 45 63>)
(   8,<2013-01-17 21:51:24.840 -0500>,<Administrator>,<X>,<proc1d>,<TOPSPIN 2.1>,
      <abs ABSG = 5 
       data hash MD5: 128K
       12 55 31 3B 4F D7 FA 75 81 BB 3F D3 98 DA 6C 0E>)
$$ ##END=
$$ 
$$ $$ hash MD5
$$ $$ 57 21 70 5A 6F 03 39 BC 29 CD 35 EB DC 22 82 91
##$RELAX= 
##$RELAX= 
##$RELAX= 
##$RELAX= 
##$RELAX= 
##$RELAX= 
##$RELAX= 
##$RELAX= 
$$ Bruker specific parameters
$$ --------------------------
##$DU= <E:\>
##$EXPNO= 22
$$ [...]
##$TP07= 0
##$TPNAME0= <>
##$TPNAME1= <>
##$TPNAME2= <>
##$TPNAME3= <>
##$TPNAME4= <>
##$TPNAME5= <>
##$TPNAME6= <>
##$TPNAME7= <>
##$TPOAL= (0..7)
0.5 0.5 0.5 0.5 0.5 0.5 0.5 0.5
##$TPOFFS= (0..7)
0 0 0 0 0 0 0 0
##$TUNHIN= 0
##$TUNHOUT= 0
##$TUNXOUT= 0
##$USERA1= <user>
##$USERA2= <user>
##$USERA3= <user>
##$USERA4= <user>
##$USERA5= <user>
##$V9= 5
##$VALIST= <valist>
##$VCLIST= <CCCCCCCCCCCCCCC>
##$VD= 0
##$VDLIST= <DDDDDDDDDDDDDDD>
##$VPLIST= <PPPPPPPPPPPPPPP>
##$VTLIST= <TTTTTTTTTTTTTTT>
##$WBST= 1024
##$WBSW= 4
##$XGAIN= (0..3)
0 0 0 0
##$XL= 0
##$YL= 0
##$YMAX_a= 6764981
##$YMIN_a= -13591775
##$ZGOPTNS= <>
##$ZL1= 120
##$ZL2= 120
##$ZL3= 120
##$ZL4= 120
##$ABSF1= 14.96134
##$ABSF2= -5.596842
##$ABSG= 5
##$ABSL= 3
##$ALPHA= 0
##$AQORDER= 0
##$ASSFAC= 0
##$ASSFACI= 0
##$ASSFACX= 0
##$ASSWID= 0
##$AUNMP= <proc_prof1d_extract.lims>
##$AXLEFT= 0
##$AXNAME= <>
##$AXNUC= <1H>
##$AXRIGHT= 0
##$AXTYPE= 0
##$AXUNIT= <>
##$AZFE= 0.1
##$AZFW= 0.1
##$BCFW= 0
##$BC_mod= 0
##$BYTORDP= 0
##$COROFFS= 0
##$CY= 15
##$DATMOD= 1
##$DC= 0
##$DFILT= <>
##$DTYPP= 0
##$F1P= 0
##$F2P= 0
##$FCOR= 0.5
##$FTSIZE= 131072
##$FT_mod= 6
##$GAMMA= 0
##$GB= 0
##$INTBC= 1
##$INTSCL= 1
##$ISEN= 128
##$LB= 0.3
##$LEV0= 0
##$LPBIN= 0
##$MAXI= 10000
##$MC2= 0
##$MEAN= 0
##$ME_mod= 0
##$MI= 0
##$NCOEF= 0
##$NC_proc= -2
##$NLEV= 6
##$NOISF1= 0
##$NOISF2= 0
##$NSP= 0
##$NTH_PI= 0
##$NZP= 0
##$OFFSET= 14.96134
##$PC= 1
##$PHC0= -81.41968
##$PHC1= 0
##$PH_mod= 1
##$PKNL= yes
##$PPARMOD= 0
##$PPDIAG= 0
##$PPIPTYP= 0
##$PPMPNUM= 2147483647
##$PPRESOL= 1
##$PSCAL= 4
##$PSIGN= 0
##$PYNMP= <proc.py>
##$REVERSE= no
##$SF= 400.020009502918
##$SI= 131072
##$SIGF1= 0
##$SIGF2= 0
##$SINO= 400
##$SIOLD= 131072
##$SPECTYP= <>
##$SREGLST= <1H.CDCl3>
##$SSB= 0
##$STSI= 131072
##$STSR= 0
##$SW_p= 8223.68421052631
##$SYMM= 0
##$S_DEV= 0
##$TDeff= 65536
##$TDoff= 0
##$TI= <>
##$TILT= no
##$TM1= 0
##$TM2= 0
##$TOPLEV= 0
##$USERP1= <user>
##$USERP2= <user>
##$USERP3= <user>
##$USERP4= <user>
##$USERP5= <user>
##$WDW= 1
##$XDIM= 131072
##$YMAX_p= 490228757
##$YMIN_p= -12028
##$CURPLOT= <Network HP LaserJet P1505>
##$CURPRIN= <$Network HP LaserJet P1505>
##$DFORMAT= <normdp>
##$LAYOUT= <+/1D_H.xwp>
##$LFORMAT= <normlp>
##$PFORMAT= <normpl>
##$SURQMSG= 1
$$ End of Bruker specific parameters
$$ ---------------------------------
##NTUPLES= NMR SPECTRUM
##VAR_NAME=  FREQUENCY,     SPECTRUM/REAL,   SPECTRUM/IMAG
##SYMBOL=    X,             R,               I
##VAR_TYPE=  INDEPENDENT,   DEPENDENT,       DEPENDENT
##VAR_FORM=  AFFN,          ASDF,            ASDF
##VAR_DIM=   131072,        131072,          131072
##UNITS=     HZ,            ARBITRARY UNITS, ARBITRARY UNITS
##FACTOR=    0.0627417313425164, 1,          1
##FIRST=     8223.62146879497, 290,          -66665
##LAST=      0,             1990,            -67086
##MIN=       0,             -12028,          0
##MAX=       8223.62146879497, 490228757,    0
$$ Real data points
##PAGE= N=1
##DATA TABLE= (X++(R..R)), XYDATA
$$ [...]
63871F74959J4604J7454K0201K2801K5276K7830L0564L3126L4948L5850L6284
63860I73897L6819L7491L7723L6856L4655L1379K7510K3437J9294J5044J0688
63849A284793O265J579l748r658j5267j9697k3275k7136l1486l5115l7196l8706
63837A051353m0985m3574m4789m4213m3163m2445m1148l8362l4906l2270l0603
63826F14895k8870k6563k4225k2374k0833j9272j7741j6463j5469j4586j3527
63815C94972j2065j0301q750p875p581p316o626n466m134l080k586k506k432k250
63801C12004k248k551k829k803k728l019l610m001l790k982j965j313j409k026
63787B74730k526k511k131j766j684j941k180j667k25R73M76j424k769k380j218
$$ plain form
63871 674959 689563 707017 727218 750019 775295 803125 833689 866815 901763 937613 973897
63860 973897 1010716 1048207 1085930 1122786 1157441 1188820 1216330 1239767 1259061 1274105 1284793
63849 1284793 1291058 1292637 1288889 1279231 1263964 1244267 1220992 1193856 1162370 1127255 1090059 1051353
63837 1051353 1010368 966794 922005 877792 834629 792184 751036 712674 677768 645498 614895
63826 614895 586025 559462 535237 512863 492030 472758 455017 438554 423085 408499 394972
63815 394972 382907 372606 363856 355981 348400 341084 334458 328992 324858 321778 319192 316686 314254 312004
63801 312004 309756 307205 304376 301573 298845 295826 292216 288215 284425 281443 279478 278165 276756 274730
63787 274730 272204 269693 267562 265796 264112 262171 259991 258324 258099 259072 259548 258124 255355 252975 251757
63772B51757p04q18p12l54l37o41p36n95o48q91r39o83k56L73J039J091K87n21
63754B45712n40l12p66j523j454n99j5N0L35R36J080P50R09J719K107J699J620
63737B51708K529L314K847J860J737K407K710K281J736J441J286J352J738J937
63723B80883J514J233K350M707O580O691N588M673M555M768M574L563J790k98
63709C33171k095l128l227k563j715j465k131l117l492k952j953r56k2Q45J421
63694C06621J604J718K183L022L843M263M201L828L383L018K723K321J629P00
63680C45057j02m31m33o90j469k180j958p87M09Q92R36J212J752K022J859J733
63664C47822K030K474K512J953R69k92j781l272m387m982n281n499n593n481n317
$$ plain form
63772 251757 251053 250235 249523 249169 248832 248191 247455 246860 246212 245321 244382 243699 243443 243816 244855 245946 246233 245712
63754 245712 245172 244860 244094 242571 241117 240518 240503 240553 240888 241824 242904 243654 244563 246282 248389 250088 251708
63737 251708 254237 257551 260398 262258 263995 266402 269112 271393 273129 274570 275856 277208 278946 280883
63723 280883 282397 283630 285980 290687 297267 303958 309546 314219 318774 323542 328116 331679 333469 333171
63709 333171 331076 327948 324721 322158 320443 318978 316847 313730 310238 307286 305333 304377 304355 305200 306621
63694 306621 308225 309943 312126 315148 318991 323254 327455 331283 334666 337684 340407 342728 344357 345057
63680 345057 344955 344524 344091 343401 341932 339752 337794 337007 337416 338308 339244 340456 342208 344230 346089 347822
63664 347822 349852 352326 354838 356791 357760 357468 355687 352415 348028 343046 337765 332266 326673 321192 315875
63649C15875n167m677l485j944q89o16n48j45M33Q66J305J903K210J819J326J731
63633C09997K923L683L395K921L334M536N685O488P363Q527R619J0276J0624J1104
63619D00475J2013J3316J4743J6114J7535J9222K1054K2627K3877K5366K7661
63608F14003L0570L3374L5610L7264L8142L7567L4894L0116K3713J6174P959o2
63596I39324o609j0741j2521j2878j2758j2560j2223j1734j1518j2379j4908j8785
63584G89710k2817k5847k7585k8328k8149k6859k4655k2148j9596j6743j3615
63573E33368j0831q759o924m763k461m73J309L228N064O248O738O977P212P470
63559E43403Q018R107J0355J1146J1611J2505J4066J5781J7428J9568K2748K6875
$$ plain form
63649 315875 310708 306031 302546 300602 299713 299097 298549 298404 298837 299703 301008 302911 305121 306940 308266 309997
63633 309997 312920 316603 319998 322919 326253 330789 336474 342962 350325 358852 368471 378747 389371 400475
63619 400475 412488 425804 440547 456661 474196 493418 514472 537099 560976 586342 614003
63608 614003 644573 677947 713557 750821 788963 826530 861424 891540 915253 931427 939386 939324
63596 939324 932715 921974 909453 896575 883817 871257 859034 847300 835782 823403 808495 789710
63584 789710 766893 741046 713461 685133 656984 630125 605470 583322 563726 546983 533368
63573 533368 522537 513778 506854 502091 499630 499157 500466 503694 508758 515006 521744 528721 535933 543403
63559 543403 551421 560528 570883 582029 593640 606145 620211 635992 653420 672988 695736 722611
63547G22611L1684L7286M3778N0484N5683N6896N1828L9959K3541O476q046j8663
63535A093517k5051k7172k5606k1759j7148j2866r840q766r472j1048j3106j6231
63523H95452k0733k5720k9981l3126l5226l6023l5328l3757l2082l0183k7459
63512E55834k4071k0945j8580j6670j4934j3557j2657j1914j0938r676q267o876
63500C86749n735n038m721m514m191l583k526j108J35O57M25j90q73j406j512
63485C52569j160q11q32p84R8J756L240L914M134M515N026N246N058M692M274
63470C90935L630K543R46r76k758l937m564n145n846o035n077l413k219j975j924
63455C54185j243j64N36P90J210J989K626K901L344M376N618O631P727R399J1272
$$ plain form
63547 722611 754295 791581 835359 885843 941526 998422 1050250 1090209 1113750 1120226 1112180 1093517
63535 1093517 1068466 1041294 1015688 993929 976781 963915 954075 945309 935837 924789 911683 895452
63523 895452 874719 848999 819018 785892 750666 714643 679315 645558 613476 583293 555834
63512 555834 531763 510818 492238 475568 460634 447077 434420 422506 411568 401892 393625 386749
63500 386749 381014 375976 371255 366741 362550 358967 356441 355333 355468 356125 356550 356360 355487 354081 352569
63485 352569 351409 350598 349766 348982 349080 350836 354076 357990 362124 366639 371665 376911 381969 386661 390935
63470 390935 394565 397108 398054 397078 394320 390383 385819 380674 374828 368793 363716 360303 358084 356109 354185
63455 354185 352942 352778 353314 354104 355314 357303 359929 362830 366174 370550 376168 382799 390526 399925 411197
63440D11197J2519J3224J4440J6785J9755K2815K6509L1791L8347M3913M5425
63429F96720M1102L1806K0614J0781L953J56j110l11J917N003R104J4790K1863
63416H56388K9051L5234M0259M4126M5912M4340L9085L0968K1052J0190n32r593
63404A186480j5650j8306j8233j6666j4720j3120j2397j3181j5929k0396k5688
63393A002194l0908l5550l9177m1149m0987l8857l5610l2360k9889k8159k6340
63382F23208k3705k0440j7245j4244j0958p376m335k468j354j31J507L304N035
63369E30798O633Q087R575J1465J3852J6357J8640K0819K3089K5349K7538K9934
63357G42136L2729L5629L8294M0815M3245M4927M4734M1866L6129K7816J7848
$$ plain form
63440 411197 423716 436940 451380 468165 487920 510735 537244 569035 607382 651295 696720
63429 696720 737822 769628 790242 801023 804976 805132 804022 803711 805628 810631 819735 834525 856388
63416 856388 885439 920673 960932 1005058 1050970 1095310 1134395 1165363 1186415 1196605 1196073 1186480
63404 1186480 1170830 1152524 1134291 1117625 1102905 1089785 1077388 1064207 1048278 1027882 1002194
63393 1002194 971286 935736 896559 855410 814423 775566 739956 707596 677707 649548 623208
63382 623208 599503 579063 561818 547574 536616 529240 524905 522437 521083 520952 522459 525763 530798
63369 530798 537431 545518 555093 566558 580410 596767 615407 636226 659315 684664 712202 742136
63357 742136 774865 810494 848788 889603 932848 977775 1022509 1064375 1100504 1128320 1146168
63346A146168P839o46p036j1750j5252j7370j7604j6044j3926j3086j4480j7390
63334A009423k0485k3561k7461l2247l6400l8293l7803l5887l3260l0120k6612
63323F67294k2811j8453j3323p620j660M080Q046P629J439q518j7964k3820k5987
63310E48332k6001k4992k3193k0560j7286j3921j1172r375q191p117o143n520
63298C74861n067m318l253k392k035j930j761j533j390j360j412j509j589j678
63284C43634j983k609l231l317k658j510l67L17L88J42M2J45J80K26P07J479J618
63267C33203P04k68m2J266K468K891K837K675K376J963J723J809K155K744L540
63252C62044M240M580M772N090N255M844M158M001M606N508O426P589R095J0592
$$ plain form
63346 1146168 1154007 1153361 1146325 1134575 1119323 1101953 1084349 1068305 1054379 1041293 1026813 1009423
63334 1009423 988938 965377 937916 905669 869269 830976 793173 757286 724026 693906 667294
63323 667294 644483 626030 612707 605087 603427 607507 615553 623182 624621 616103 598139 574319 548332
63310 548332 522331 497339 474146 453586 436300 422379 411207 401832 393641 386524 380381 374861
63298 374861 369794 365476 362223 359831 357796 355866 354105 352572 351182 349822 348410 346901 345312 343634
63284 343634 341651 339042 335811 332494 329836 328326 327959 328276 328664 328806 328848 328993 329173 329399 330106 331585 333203
63267 333203 333907 333639 333597 334863 337331 340222 343059 345734 348110 350073 351796 353605 355760 358504 362044
63252 362044 366284 370864 375636 380726 385981 390825 394983 398984 403590 409098 415524 423113 432208 442800
63238D42800J1794J2801J3770J4735J5905J7671K0087K2638K4650K5829K6421
63227F49101K6919K7448K7420K6216K4311K3107K3198K3568K3080K2078K1683
63216I18129K2101K2764K3557K4650K5394K4717K2646K0161J7465J3580P989J482
63204A144635n000j1348j7675k3631k8833l3212l6501l8076l7692l5813l2908
63193H43946k9139k4985k1257j8048j4510j0172n769k132R76M190P340R766J1601
63180G51807J3839J7116K0837K3654K4647K4061K3024K2466K2353K2111K1529
63169I87444K0814K0044J9141J8280J7581J6509J4332J1144P561L488j835q347
63157A126156j4787k0167k4711k8908l2632l5653l8036l9467l9123l6950l4153
$$ plain form
63238 442800 454594 467395 481165 495900 511805 529476 549563 572201 596851 622680 649101
63227 649101 676020 703468 730888 757104 781415 804522 827720 851288 874368 896446 918129
63216 918129 940230 962994 986551 1011201 1036595 1061312 1083958 1104119 1121584 1135164 1143153 1144635
63204 1144635 1139635 1128287 1110612 1086981 1058148 1024936 988435 950359 912667 876854 843946
63193 843946 814807 789822 768565 750517 736007 725835 720066 717934 718910 723100 730440 740206 751807
63180 751807 765646 782762 803599 827253 851900 875961 898985 921451 943804 965915 987444
63169 987444 1008258 1028302 1047443 1065723 1083304 1099813 1114145 1125289 1132850 1136338 1134503 1126156
63157 1126156 1111369 1091202 1066491 1037583 1004951 969298 931262 891795 852672 815722 781569
63146G81569l1643k8912k5376k1921j9851j8871j7470j5083j2650j1030j0008
63135E68754r026p964o859n578m178l073k507k181j609o32M89J263J352R74Q88
63120E30113J677L072M255M713M593M353M425N043N974O438N721M026K398J702
63106E88503J838K057J894J573J546J824J924J503Q09L01K1l85j071j737k022
63091E98578j833j274n31R4L14J04k98n76l91N29K005L287L735L532L301L281
63075F13857L393L852M899O030O342N817N420N826O786P979R550J1390J2753J3234
63061G17128J3558J4756J6983J9655K2287K4737K7033K9441L2358L5780L9256
63050I92972M2659M6506N1059N5597N9085O1204O2286O2627O2361O1697O0789
$$ plain form
63146 781569 749926 721014 695638 673717 653866 634995 617525 602442 589792 578762 568754
63135 568754 559728 551764 544905 539327 535149 532076 529569 527388 525779 525147 525636 526899 528251 529225 530113
63120 530113 531790 534862 539117 543830 548423 552776 557201 562244 568218 574656 580377 584403 586801 588503
63106 588503 590341 592398 594292 595865 597411 599235 601159 602662 603471 603772 603793 603408 602337 600600 598578
63091 598578 596745 595471 594940 595034 595348 595452 595154 594578 594187 594716 596721 600008 603743 607275 610576 613857
63075 613857 617250 621102 626001 632031 638373 644190 649610 655436 662222 670201 679751 691141 703894 717128
63061 717128 730686 745442 762425 782080 804367 829104 856137 885578 917936 953716 992972
63050 992972 1035631 1082137 1133196 1188793 1247878 1309082 1371368 1433995 1496356 1558053 1618842
63039A618842N9601N8209N6944N5992N5171N4385N3919N3961N4189N4093N3247
63028B228553N1051M6840M0567L2777K3578J2301j213j5686k9466m2022n3684
63017B293596o4372p3328p9820q3408q3825q1360p7099p2069o6201n8814n0022
63006A503278m0931l2418k4324j6091p766o5O449J2059J7662K3640K9192L3143
62994A503828L5386L6873L8266L9363L9994M0545M1121M1078M0024L8544L7227
62983A932249L5631L3023K9472K5294J9949J2584L366o635j6673k6644l6409m5719
62971A959488n4654o3189p0405p4941p6306p5156p2358o8506o4278o0345n6670
62960A222680n2583m7803m2956l8973l6247l4432l2724l0438k7647k5194k3697
$$ plain form
63039 1618842 1678443 1736652 1793596 1849588 1904759 1959144 2013063 2067024 2121213 2175306 2228553
63028 2228553 2279604 2326444 2367011 2399788 2423366 2435667 2434454 2418768 2389302 2347280 2293596
63017 2293596 2229224 2155896 2076076 1992668 1908843 1827483 1750384 1678315 1612114 1553300 1503278
63006 1503278 1462347 1429929 1405605 1389514 1381748 1381683 1388132 1400191 1417853 1441493 1470685 1503828
62994 1503828 1539214 1576087 1614353 1653716 1693710 1734255 1775376 1816454 1856478 1895022 1932249
62983 1932249 1967880 2000903 2030375 2055669 2075618 2088202 2091568 2084933 2068260 2041616 2005207 1959488
62971 1959488 1904834 1841645 1771240 1696299 1619993 1544837 1472479 1403973 1339695 1279350 1222680
62960 1222680 1170097 1122294 1079338 1040365 1004118 969686 936962 906524 878877 853683 829986
62949H29986k2756k1576k0064j8826j8185j7741j6955j5705j4316j3218j2502
62938F38142j1690j0287q665p851q106q413p832o622n440m249k895k027k243k840
62924E48982k619j718j325j754k037j554r25r16j435j977k291k299j999j721j919
62909E22493k530l017l087k871k484k005j840k317k934k724j520j49O57Q91P64
62894D97327L43j24k11J20M32M09J07l81r50j223q71j28N55J156J752J818R17
62877E01048j82j92Q12J352O33n04j025j022j034j068r71r80j223j309j017p99
62861D92519r84j122p00pL58M13O03J048J554K060K571K893K890K807K934L110
62845E12947K895K102R58j41q40j017q55n81j95K17J39q44k160k627j871p09L
$$ plain form
62949 829986 807230 785654 765590 746764 728579 710838 693883 678178 663862 650644 638142
62938 638142 626452 616165 607500 599649 591543 583130 575298 568676 563236 558987 556092 554065 551822 548982
62924 548982 546363 544645 543320 541566 539529 537975 537050 536134 534699 532722 530431 528132 526133 524412 522493
62909 522493 519963 516946 513859 510988 508504 506499 504659 502342 499408 496684 495164 495015 495672 496563 497327
62894 497327 497670 497546 497335 497455 497887 498296 498403 498022 497072 495849 494978 494850 495405 496561 498313 500131 501048
62877 501048 500866 500674 501486 502838 503471 502967 501942 500920 499886 498818 497847 496867 495644 494335 493318 492519
62861 492519 491535 490413 489713 489706 490064 490477 491080 492128 493682 495742 498313 501206 504096 506903 509837 512947
62845 512947 515842 517944 518902 518761 517921 516904 516049 515468 515273 515490 515629 514785 512625 509998 508127 507418 507421
62828E07421J89N3l66o85o3J672L376L766K945K088J995K559L367M124M546M425
62812E41412L882L208K491J748J365J895L354M923N661N402M912N057N863O589
62798E97762O747O765P360Q509R611J0464J1487J2942J4590J6226J8107K0563
62786G41133K3649K7321L1553L6108M0632M5165N0146N5742O1571O7293P3083
62775A253396P9189Q5426R1270R6176R9627J01176J00670R8144R3406Q5970P5527
62764B259977O2291M6889L0153J2883m550k2200l9676n5583o8547p8646q6983
62753B056008r3852r8251r9466r8162r5513r1999q7543q2215p6272o9947o3656
62742A099132n7889n2667m7562m2574l8307l4945l1766k8126k4346k1073j8375
$$ plain form
62828 507421 507610 507663 507297 506612 506549 508221 511597 515363 518308 520396 522391 524950 528317 532441 536987 541412
62812 541412 545294 548502 550993 552741 554106 556001 559355 564278 569939 575341 580253 585310 591173 597762
62798 597762 604509 611274 618634 627143 636754 647218 658705 671647 686237 702463 720570 741133
62786 741133 764782 792103 823656 859764 900396 945561 995707 1051449 1113020 1180313 1253396
62775 1253396 1332585 1418011 1509281 1605457 1705084 1806260 1906930 2005074 2098480 2184450 2259977
62764 2259977 2322268 2369157 2399310 2412193 2407643 2385443 2345767 2290184 2221637 2142991 2056008
62753 2056008 1962156 1863905 1764439 1666277 1570764 1478765 1391222 1309007 1232735 1162788 1099132
62742 1099132 1041243 988576 941014 898440 860133 825188 793422 765296 740950 719877 701502
62731G01502j5994j3999j2528j1299r993q714p590o254m362k310q47j69J46N50
62717F08139J311K604M350O072P361Q363R465J0780J2186J3741J5658J8072K1010
62704G39112K4417K8079L1786L5647L9830M3999M7569N0781N4729N9973O5785
62693A221707P1231P6336Q1411Q5861Q8435Q8417Q5839Q0786P3155O3024N0652
62682B066854L6170J9778K241j5308l1902m6858n9587o9781p7636q3418q6930
62671A653623q7796q6170q2851p8701p4264o9759o5203o0555n5878n1227m6437
62660H94782m1375l6485l2559k9751k7347k4754k2112j9653j7161j4663j2893
62649F16029j2334j2258j1566j0243r194q814q543p793o601n315m209l434k890
$$ plain form
62731 701502 685508 671509 658981 647682 637689 628975 621385 615131 610769 608459 607612 607443 607589 608139
62717 608139 609450 612054 616404 622476 629837 638200 647665 658445 670631 684372 700030 718102 739112
62704 739112 763529 791608 823394 859041 898871 942870 990439 1041220 1095949 1155922 1221707
62693 1221707 1292938 1369274 1450685 1536546 1624981 1713398 1799237 1880023 1953178 2016202 2066854
62682 2066854 2103024 2122802 2125043 2109735 2077833 2030975 1971388 1901607 1823971 1740553 1653623
62671 1653623 1565827 1479657 1396806 1318105 1243841 1174082 1108879 1048324 992446 941219 894782
62660 894782 853407 816922 784363 754612 727265 702511 680399 660746 643585 628922 616029
62649 616029 603695 591437 579871 569628 560434 551620 543077 535284 528683 523368 519159 515725 512835
62636E12835k148r02M87J285J135K09j139k476l207k950k057j320j160j323j332
62621D95937r31k53K62K29q0J32J154K232K503K177K252L207M599N783O532O873
62605E32608O934P018P523Q581J0020J1656J3424J5296J7307J9644K2488K5798
62593F98297K9376L3040L6626L9983M3105M6086M8787N0676N1141M9781M6437
62582A173335M1270L4817K7530J9287R785n06j0455j9402k7502l4690m0229m3681
62570A129559m5638m6881m7472m7192m6160m4434m1666l7949l4318l1528k8956
62559F77365k5691k2183j9687j8319j6897j4752j2586j1259j0529r443p526n279
62547E03214l654l107l027k377j038q5l82j394j974j787j331r54o59n54p03p36
$$ plain form
62636 512835 510687 509785 510272 511557 512692 512901 511762 509286 506079 503129 501072 499752 498592 497269 495937
62621 495937 495006 494753 495015 495244 495164 495296 496450 498682 501185 503362 505614 508821 513420 519203 525735 532608
62605 532608 539542 546560 554083 562664 572684 584340 597764 613060 630367 650011 672499 698297
62593 698297 727673 760713 797339 837322 880427 926513 975300 1025976 1077117 1126898 1173335
62582 1173335 1214605 1249422 1276952 1296239 1306024 1305518 1295063 1275661 1248159 1213469 1173240 1129559
62570 1129559 1083921 1037040 989568 942376 896216 851782 810116 772167 737849 706321 677365
62559 677365 651674 629491 609804 591485 574588 559836 547250 535991 525462 516019 508493 503214
62547 503214 499560 496453 493426 491049 490011 489926 489544 488150 486176 484389 483058 482104 481445 480891 480188 479452
62531D79452l01L15O79J067K054L501M744N634O668Q163J0012J2018J3837J4941
62517E62784J5397J6478J9498K4169K8974L2997L6478L9727M2597M5131M7699
62506I11929N0134N1553N1334M9639M6800M2761L7307L0311K1706J1831J769p232
62494A299842j4624k0429k4486k6607k7159k6645k4875k1503j7166j3005r065
62483A074278m395J259O987J2116J6679K0178K1143J8749J3926Q290K723k510
62471A189423p268j1932j7509k4462l1779l7815m1730m3735m4430m4392m3950
62460H40421m2957m1048l8240l4889l1017k6482k1885j8394j6256j4367j1851
62449E43035r207p271n875m307k493r16K91J313K111K557K941L692M737N614O121
$$ plain form
62531 479452 479151 479466 480145 481212 483266 486767 491511 497145 503813 511976 521988 534006 547843 562784
62517 562784 578181 594659 614157 638326 667300 700297 736775 776502 819099 864230 911929
62506 911929 962063 1013616 1064950 1114589 1161389 1204150 1241457 1271768 1293474 1305305 1307074 1299842
62494 1299842 1285218 1264789 1240303 1213696 1186537 1159892 1135017 1113514 1096348 1083343 1074278
62483 1074278 1069883 1071142 1078129 1090245 1106924 1127102 1148245 1166994 1180920 1189210 1191933 1189423
62471 1189423 1182155 1170223 1152714 1128252 1096473 1058658 1016928 973193 928763 884371 840421
62460 840421 797464 756416 718176 683287 652270 625788 603903 585509 569253 554886 543035
62449 543035 533828 526557 520682 516375 513882 512966 513257 514570 516681 519238 522179 525871 530608 536222 542343
62434E42343O390O463O097N054L341J325n13k096l936o324q515r437r197r046
62420E21949r604j0053r470q097o778n851n282n232n707o147o007n396m632l597
62406D30096k119o04L20N37L35p9m87n06K6Q21J630K519L281L309K542J918K169
62389D45708K745K795K561K878L717M253M270M404N070N999O872P614P991P735
62375E14612P180P120P788Q603R019R159R397R876J0594J1579J2770J4067J5590
62362F47354J7618K0167K3018K6196L0093L4989M0647M6483N2001N7052O1802
62351A057420O6214O9476P0148O7177O0599N1225M0053K8272J7204P626o38p946
62339A526830j4195j9502k4860l1071l7337m2000m4712m6585m8136m8326m6261
$$ plain form
62434 542343 548733 555196 561293 566347 569688 571013 570500 568404 564468 558144 549629 540192 530995 521949
62420 521949 512345 502292 492822 484725 477947 472096 466814 461582 455875 449728 443721 438325 433693 430096
62406 430096 427977 427373 427693 428230 428565 428486 427999 427493 427519 428340 429970 432489 435770 439079 441621 443539 445708
62389 445708 448453 451248 453809 456687 460404 464657 468927 473331 478401 484400 491272 498886 506877 514612
62375 514612 521792 528912 536700 545303 554322 563481 572878 582754 593348 604927 617697 631764 647354
62362 647354 664972 685139 708157 734353 764446 799435 840082 886565 938566 995618 1057420
62351 1057420 1123634 1193110 1263258 1330435 1391034 1442259 1482312 1510584 1527788 1535414 1534776 1526830
62339 1526830 1512635 1493133 1468273 1437202 1399865 1357865 1313153 1266568 1218432 1170106 1123845
62328A123845m2696l9046l5662l2096k8514k5847k4587k4154k3571k2363k0902
62317H04407k0164k0937k2795k4155k3774k2025k0153j8620j6911j4813j2944
62306E87116j1807j1059j0107q839p385n750m170l253l177l103k106m21R20J498
62292E18357J813K258K653K929L428M225M841M988M933M794M240L323K884L386
62278E69052M082M208M345N474P170Q027P874Q152R781J1925J3476J4724J6660
62265F84950J9366K2040K4275K6422K8877L1727L5037L8869M2872M6474M9574
62254A050483N2756N6541O0717O4429O6720O6810O4126N8413M9921L9335K7455
62243A657706J5049L078p357j5722k2658k9398l6479m3492n0080n6394o2154o6065
$$ plain form
62328 1123845 1081149 1042103 1006441 974345 945831 919984 895397 871243 847672 825309 804407
62317 804407 784243 763306 740511 716356 692582 670557 650404 631784 614873 600060 587116
62306 587116 575309 564250 554143 545304 537919 532169 527999 524746 521569 518466 516360 515939 516859 518357
62292 518357 520170 522428 525081 528010 531438 535663 540504 545492 550425 555219 559459 562782 565666 569052
62278 569052 573134 577342 581687 587161 594331 602358 610232 618384 628165 640090 653566 668290 684950
62265 684950 704316 726356 750631 777053 805930 837657 872694 911563 954435 1000909 1050483
62254 1050483 1103239 1159780 1220497 1284926 1351646 1418456 1482582 1540995 1590916 1630251 1657706
62243 1657706 1672755 1675833 1668476 1652754 1630096 1600698 1564219 1520727 1470647 1414253 1352099 1286034
62231A286034o7043o5576o3017n9865n5621n0211m4527l9429l5066l1278k7970
62220G46431k4851k1577j8388j5934j4268j2745j1058r616q664p844o910o175
62208E88401n761n190m158l043k203j493r03q83j381j366j11J679K880L561M602
62193E74631O140P382P844P862P843P836P933Q396R208J0030J0755J1597J2508
62180F89965J2937J2425J1171R773Q513P101N203L226K339L419O070R046J1693
62167G92881J4451J7913K2078K6821L2389L8816M5184N0111N2799N3216N1482
62156A198141M7502M1124L2524K2564J2814M690j616o962j1933j6376k0438k5044
62144A276990l0569l5875l9471m1186m1759m1314l9258l5510l0789k5823k0987
$$ plain form
62231 1286034 1218991 1153415 1090398 1030533 974912 924701 880174 840745 805679 774401 746431
62220 746431 721580 700003 681615 665681 651413 638668 627610 617994 609330 601486 594576 588401
62208 588401 582640 577450 573292 570249 568046 566553 565650 564767 563386 562020 561909 563588 566468 570029 574631
62193 574631 580771 588153 595997 603859 611702 619538 627471 635867 645075 655105 665860 677457 689965
62180 689965 702902 715327 726498 736271 744784 751885 757088 760314 762653 766072 772142 781188 792881
62167 792881 807332 825245 847323 874144 906533 945349 990533 1040644 1093443 1146659 1198141
62156 1198141 1245643 1286767 1319291 1341855 1354669 1359359 1357743 1350781 1338848 1322472 1302034 1276990
62144 1276990 1246421 1210546 1171075 1129889 1088130 1046816 1007558 972048 941259 915436 894449
62133H94449j6705j3326j0583p946n564m112l642l327k582j683j034l80Q35K638
62119H27038M446N703O465P398R116J1348J2901J2727J0760P537L369j479o122
62106I11207r301j0393r714p950n840m425m717o765r404j1257j1785j1287j0230
62093G98139q801o892m312j150J969M217N259N606O119P128Q053Q078P306O977
62079H37696Q115J0155J1589J2028J2766J4968J8047K0463K1598K2105K2784K3763
62067A036077K4593K4701K3983K3294K3898K6038K8616L0749L2789L4975L5968
62056A345681L3995K9053K2725J6088R223K612k589o126r250j3127j7651k2287
62044A388347k7105l2234l7067m0846m3585m5757m7394m8017m7209m4939m1647
$$ plain form
62133 894449 877744 864418 853835 845889 840325 836213 832571 829244 826662 824979 823945 823565 824400 827038
62119 827038 831484 837187 843652 851050 860166 871514 884415 897142 907902 915439 918808 917329 911207
62106 911207 901906 891513 881799 873849 868009 863584 858867 852102 842698 831441 819656 808369 798139
62093 798139 789338 782446 778134 776984 778953 783170 788429 794035 800154 807282 815335 823413 830719 837696
62079 837696 845811 855966 867555 879583 892349 907317 925364 945827 967425 989530 1012314 1036077
62067 1036077 1060670 1085371 1109354 1132648 1156546 1182584 1211200 1241949 1274738 1309713 1345681
62056 1345681 1379676 1408729 1431454 1447542 1456765 1459377 1456788 1450662 1441412 1428285 1410634 1388347
62044 1388347 1361242 1329008 1291941 1251095 1207510 1161753 1114359 1066342 1019133 974194 932547
62033I32547l8254l5685l3969l2175k9532k6290k3175k0473j8103j6192j5018
62022F43681j4426j3829j2823j1578j0547r952r606r180q615q152p956p768p210
62009E12039o250n188m229l294k181p11J119K907M072M586N188O385P578P806
61995E29827P112O401O065N519M264K579R17p28k527m326n817o781p055o686o234
61980E22530o443p310q001p864p099o188n262m355l758l642l635l241k513j946
61966D51273j854k150k539k651k204j297m33jJ85O06J384K097K265J934J680J981
61950D50276K684L305L832M822O469Q062Q893R349J0423J2278J4087J5329J6456
61937E66265J7999J9709K0975K1640K1974K2097K1812K0975J9715J8344J7046
$$ plain form
62033 932547 894293 858608 824639 792464 762932 736642 713467 692994 674891 658699 643681
62022 643681 629255 615426 602603 591025 580478 570526 560920 551740 543125 534973 527017 519249 512039
62009 512039 505789 500601 496372 493078 490897 490186 491305 494212 498284 502870 508058 514443 522021 529827
61995 529827 536939 543340 549405 554924 559188 561767 562684 561956 559429 555103 549286 542505 535450 528764 522530
61980 522530 516087 508777 500776 492912 485813 479625 474363 470008 466250 462608 458973 455732 453219 451273
61966 451273 449419 447269 444730 442079 439875 438578 438145 438144 438329 438935 440319 442416 444681 446615 448295 450276
61950 450276 452960 456265 460097 464919 471388 479450 488343 497692 508115 520393 534480 549809 566265
61937 566265 584264 603973 624948 646588 668562 690659 712471 733446 753161 771505 788551
61926G88551J5630J3677J1091Q312N716L047j85l832p191r731j1309j1752j0921
61913G91103r169p098m749j627K369O627J0601J4241J7465J9837K1095K1414K0786
61900I02895J8682J4781R672M407l85m642q410j1668j4469j6905j8955k0444k1175
61887H33384k1141k0662k0189j9714j8726j7077j5574j5039j5027j4299j2562
61876F43374j0838r973r629r094q351p837p666p579p237o289m506k176rJ584K767
61861E56541L837M978O488Q571J0762J2355J3595J5596J8740K1995K4389K6274
61849G24121K8472L0915L2968L4541L5960L7067L7267L6286L4243L1197K7172
61838A090209K2401J6967J0553L188m041r750j3605j6223j7840j7825j5560j1327
$$ plain form
61926 788551 804181 817858 828949 837261 842977 846024 845839 842007 834816 825085 813776 802024 791103
61913 791103 781934 774836 770087 768460 770829 777456 788057 802298 819763 839600 860695 882109 902895
61900 902895 921577 936358 946030 950437 950052 945410 937000 925332 910863 893958 875003 854559 833384
61887 833384 812243 791581 771392 751678 732952 715875 700301 685262 670235 655936 643374
61876 643374 632536 622563 612934 603840 595489 587652 579986 572407 565170 558881 554375 552199 552190 553774 556541
61861 556541 560378 565356 571844 580415 591177 603532 617127 632723 651463 673458 697847 724121
61849 724121 752593 783508 816476 851017 886977 924044 961311 997597 1031840 1063037 1090209
61838 1090209 1112610 1129577 1140130 1143318 1139277 1129527 1115922 1099699 1081859 1064034 1048474 1037147
61826A037147o071p41M148Q554J2561J5826J7566J7326J5475J2553Q507K976l904
61813A141923j1535j9365k6759l2661l6194l7637l8037l7803l6415l3715l0604
61802H01198k8021k5812k3276k0401j7849j5902j4101j2103j0254r048q405p873
61790F08153p329p006o916o680o061n216m308l284k280j781j953k224k024j624
61776E49467j588j703j323o61p73k014l387l848l540l158k735j743j25J488K485
61761E26842K736K402J716J020P61J222K225L093L089K189J203Q45P62Nj609l195
61745E45306l945l928l620l259k931k735k540k075j500j338j644j747j231n15
61731E12298p5K34O91J133J464K085L173M028L921L187K738K738K592K021J474
$$ plain form
61826 1037147 1031076 1030335 1034483 1043037 1055598 1071424 1088990 1106316 1121791 1134344 1142851 1145827 1141923
61813 1141923 1130388 1111023 1084264 1051603 1015409 977772 939735 901932 865517 831802 801198
61802 801198 773177 747365 724089 703688 685839 669937 655836 643733 633479 624431 616026 608153
61790 608153 600824 593818 586902 580222 574161 568945 564637 561353 559073 557292 555339 553115 551091 549467
61776 549467 547879 546176 544853 544192 543419 541405 538018 534170 530630 527472 524737 522994 522869 524357 526842
61761 526842 529578 531980 533696 534716 535477 536699 538924 542017 545106 547295 548498 549343 550105 550110 548501 545306
61745 545306 541361 537433 533813 530554 527623 524888 522348 520273 518773 517435 515791 514044 512813 512298
61731 512298 512223 512457 513148 514281 515745 517830 521003 525031 528952 532139 534877 537615 540207 542228 543702
61716E43702J401J740K122K191J797J219J027J361J560R04n11k039l335m456n335
61701E43348n734n618n179m553l897l496l406l265k890k754l329m240m652m363
61687D85972l933l822l949m055m006l771l506l544l949m208l856l154k704k581
61673D34934k417k077j715j270o43j68k41n78n73l42n62j221j435p78O3M03N74
61656D21954J173J886J859R82J41J31Q15J448J524J122O51M56O86J379K491L750
61640D42448M647M736M048L108K482K229J755L16k103m439n393m751l624l190
61626D42269l544l936l824l328k887k806l033l106k538j421m79k02k76j50J11
61611D10850J2n92j393k195l040l862m435m737m949n070m871m330l757l442l440
$$ plain form
61716 543702 545103 546843 548965 551156 552953 554172 555199 556560 558120 559024 558513 556474 553139 548683 543348
61701 543348 537614 531996 526817 522264 518367 514871 511465 508200 505310 502556 499227 494987 490335 485972
61687 485972 482039 478217 474268 470213 466207 462436 458930 455386 451437 447229 443373 440219 437515 434934
61673 434934 432517 430440 428725 427455 426812 426644 426403 425825 425252 424910 424348 423127 421692 420914 420977 421380 421954
61656 421954 423127 425013 426872 427854 427995 428126 428941 430389 431913 433035 433686 434142 434828 436207 438698 442448
61640 442448 447095 451831 455879 458987 461469 463698 465453 465769 463666 459227 453834 449083 445459 442269
61626 442269 438725 434789 430965 427637 424750 421944 418911 415805 413267 411846 411367 411165 410889 410739 410850
61611 410850 410862 410270 408877 406682 403642 399780 395345 390608 385659 380589 375718 371388 367631 364189 360749
61596C60749l646l878l862l431k766k193j794j427j073q38o77m43k58m99j232
61581C32732j938j979j268l44J74Q2m04r24j205j052m70J65K69k77q56q02k56
61564C21647J52K45M15P96R72O66K38J77N39J008J239J005N01M52J370K672L177
61547C37271K608J781J276P89J65k7M52Q95P87P15J346K253K716K923L343L577
61531C62870L053K266K093K210J514K9r93r87q21j319k102k377k086j720j588
61516C60042j638j699j576j267j091j280j541j374p24J02R40J618J615P00l36
61501C52491m23K65M84l27j283j389p77k28o6l6Q8K42K94K81L97P15R34O87K53
61482C52602L73J047J215K28r55j054l02J04rK77J119J505R48K75K56N42O00O47
$$ plain form
61596 360749 357103 353225 349363 345932 343166 340973 339179 337752 336679 335841 335164 334721 334463 333964 332732
61581 332732 330794 328815 327547 327203 327377 327459 327055 326131 324926 323874 323404 323569 323838 323561 322705 321903 321647
61564 321647 321799 322044 322459 323255 324227 324893 325131 325308 325847 326855 328094 329099 329600 330052 331422 334094 337271
61547 337271 339879 341660 342936 343725 343890 343863 344315 345210 345997 346712 348058 350311 353027 355950 359293 362870
61531 362870 365923 368189 370282 372492 374006 374035 373042 372055 371234 369915 367813 365436 363350 361630 360042
61516 360042 358404 356705 355129 353862 352771 351491 349950 348576 347852 347954 348894 350512 352127 352827 352491
61501 352491 352068 352333 352817 352490 351207 349818 349041 348813 348747 348711 348799 349041 349335 349616 350013 350728 351662 352349 352602
61482 352602 352975 354022 355237 355465 354510 353456 353154 353258 353249 353526 354645 356150 357098 357373 357629 358171 358771 359418
61464C59418J087J710K112K194J850R02j96m85J09L53m91j316n75J470K998K913
61448C74053J906J274J459J946K063J593Q76M12M09P23J290K116K865K947K382
61433C98314K072K728L846M269L534K176Q70j13o68o84l18j5n7k26q9N45J548
61416D17732K670L619M028L542K104J31j682k772k971k503j842j454j415j407
61402D17780j281j408k081k707k336j072j25j83n32l66o5l48q60p42j55Nk92j30
61384D03102P48J387J090L37j59m41p43o91K17J699K836L020K388J570J213J620
61368D19193K514L232L234K431J200K82L57J325K193K227J946K404L692M936N679
61353D56845O363P349Q300Q869R260R766J0302J0671J0789J0374R022O917M953
$$ plain form
61464 359418 360505 362215 364327 366521 368371 369273 369077 368592 368701 369054 368563 367247 366672 368142 371140 374053
61448 374053 375959 377233 378692 380638 382701 384294 385170 385582 385991 386714 388004 390120 392985 395932 398314
61433 398314 400386 403114 406960 411229 414763 416939 417809 417696 417028 416344 416026 416011 415954 415728 415639 416184 417732
61416 417732 420402 424021 428049 431591 433695 433826 432144 429372 426401 423898 422056 420602 419187 417780
61402 417780 416499 415091 413010 410303 407967 406895 406770 406587 406055 405689 405624 405276 404416 403674 403519 403524 403232 403102
61384 403102 403850 405237 406327 406664 406505 406064 405321 404630 404847 406546 409382 412402 414790 416360 417573 419193
61368 419193 421707 424939 428173 430604 431804 432086 432443 433768 435961 438188 440134 442538 446230 451166 456845
61353 456845 463208 470557 478857 487726 496986 506752 517054 527725 538514 548888 557910 564827 569780
61340E69780L873L646L857M203M356L922K847J502J67j201k538l589m366n199
61326E81260o113o680o661o257n530m305k847j919j708j354p9J679K856L165L285
61311E48792L879M882N741O084O184O773Q305J0358J2122J3340J4212J4450J3165
61298F68287J0111O363L220Q59j427l894n869o649o450o275o871p923q465q065
61284F26952p271o724o288n526m593l952l485k632j297J26J528L050M259M364
61270E98511L445K639K734L284L484L166K651K284K517L853O223Q831J0926J2424
61256F66972J3459J3887J3423J1962R562O477L336Q61p31j724k456l264m584o421
61242G20759p964q482q364q365q177o966n127m080m166m292l933l873m339m029
$$ plain form
61340 569780 573653 577299 581156 585359 589715 593637 596484 597986 598153 596952 594414 590825 586459 581260
61326 581260 575147 568467 561806 555549 550019 545714 542867 540948 539240 537886 537807 539486 542342 545507 548792
61311 548792 552671 557553 563294 569378 575562 582335 590640 600998 613120 626460 640672 655122 668287
61298 668287 678398 684761 687981 688840 687413 683519 677650 671001 664551 658276 651405 643482 635017 626952
61284 626952 619681 612957 606669 601143 596550 592598 589113 586481 585184 585310 586838 589888 594147 598511
61270 598511 601956 604595 607329 610613 614097 617263 619914 622198 624715 628568 634791 643622 654548 666972
61256 666972 680431 694318 707741 719703 729265 735742 739078 739939 739208 737484 735028 731764 727180 720759
61242 720759 712795 704313 695949 687584 679407 672441 667314 663234 659068 654776 650843 646970 642631 638602
61228F38602k039N49K127K557K619K543K316K546L683M892N049M396M029M222
61214F78091M402M519N143O232O920O704N863M712L250J755R38J160J979K734
61200G34402L245L876N200P595J0853J4246J7199J9785K2324K4586K5722K5009
61188I14042K2438J8660J4441J0253O384L399K014K117K341J296r03l029m490
61175I88963n764p170q362r266j0477j2226j3805j4543j4602j4438j4247j4378
61163H49685j5364j7022j8267j8425j7965j7498j6842j5632j4027j2158r770p037
61151F69678m821l354j661Q63L191M039L647K981J874o55m527q354j0974j2129
61137F39798j1753r784o909m500l332k794j672N46L246N357O479P318Q875J1228
$$ plain form
61228 638602 636563 637112 639239 641796 644415 646958 649274 651820 655503 660395 665444 669840 673869 678091
61214 678091 682493 687012 692155 698387 705307 712011 717874 722586 725836 727591 728529 729689 731668 734402
61200 734402 737647 741523 746723 754318 765171 779417 796616 816401 838725 863311 889033 914042
61188 914042 936480 955140 969581 979834 986218 989617 991631 993748 996089 997385 996482 993453 988963
61175 988963 983199 976029 967667 958401 947924 935698 921893 907350 892748 878310 864063 849685
61163 849685 834321 817299 799032 780607 762642 745144 728302 712670 698643 686485 676715 669678
61151 669678 664857 661503 659842 660705 663896 667935 671582 674563 676437 675782 671255 662901 651927 639798
61137 639798 628045 618261 611352 606852 603520 600726 599054 599600 602846 608203 614682 622000 630875 642103
61123F42103J3540J5261J6698J8309K0143K2158K4350K6277K7340K7832K8765
61112H82776L0242L0931K9866K7796K6052K4884K3750K2423K0928J9040J6631
61101A155319J3962J0964O968J801l549q257j2719j7433k1687k4436k5869k6984
61089A048080k8109k8865k9076k8771k7761k6185k4888k4357k3778k2175j9866
61078G64249j7770j5811j3278j0365q041o617n549m546l770l035j817j11J539
61065F75078K839L876M616M966N208N719O384O888P401Q347R774J1444J3293J5237
61051G81070J6868J7832J8335J8944K0145K2244K5091K7792K9392L0094L0951
61040A038758L2238L3160L3432L3840L4738L5335L5145L4875L5142L5547L5823
$$ plain form
61123 642103 655643 670904 687602 705911 726054 748212 772562 798839 826179 854011 882776
61112 882776 913018 943949 973815 1001611 1027663 1052547 1076297 1098720 1119648 1138688 1155319
61101 1155319 1169281 1180245 1187213 1189014 1185465 1177208 1164489 1147056 1125369 1100933 1075064 1048080
61089 1048080 1019971 991106 962030 933259 905498 879313 854425 830068 806290 784115 764249
61078 764249 746479 730668 717390 707025 698984 692367 686818 682272 678502 675467 673650 673539 675078
61065 675078 677917 681793 686409 691375 696583 702302 708686 715574 722975 731322 741096 752540 765833 781070
61051 781070 797938 815770 834105 853049 873194 895438 920529 948321 977713 1007807 1038758
61040 1038758 1070996 1104156 1137588 1171428 1206166 1241501 1276646 1311521 1346663 1382210 1418033
61029A418033L6575L8057L9564M0893M2970M6027M8638M9692M9920N0479N1492
61018A912340N3176N6739O2958P1393Q1933R5141J09938J23457J34803J46747
61008B848625J62286J82360K08674K45061K93158L50205M14671M90785N84422
60999E780247O99512Q44011J034330J285427J598239J959746K339384K659802
60991A8200698K775211K526475J870447R66948J12158m40277o06935m52976r5021
60982B4856728L38305O74820P07271L05383m62744j344398k060248k462259k562586
60973A7990272k452741k222599j937567j645604j376916j141363r38222p67714
60965E507546o29797n18604m26171l49787k90449k46214k11930j84256j62577
$$ plain form
61029 1418033 1454608 1492665 1532229 1573122 1616092 1662119 1710757 1760449 1810369 1860848 1912340
61018 1912340 1965516 2022255 2085213 2156606 2238539 2333680 2443618 2567075 2701878 2848625
61008 2848625 3010911 3193271 3401945 3647006 3940164 4290369 4705040 5195825 5780247
60999 5780247 6479759 7323770 8358100 9643527 11241766 13201512 15540896 18200698
60991 18200698 20975909 23502384 25372831 26339779 26451937 26011660 25404725 24951749 24856728
60982 24856728 25195033 25869853 26577124 26882507 26419763 25075365 23015117 20552858 17990272
60973 17990272 15537531 13314932 11377365 9731761 8354845 7213482 6275260 5507546
60965 5507546 4877749 4359145 3932974 3583187 3292738 3046524 2834594 2650338 2487761
60956B487761j45743j31522j18754j07292r6291q4960p4123o4902n6798m9166
60946A558210m3488m1778m3425m5675m6707m6490m5379m3630m1816m0281l8676
60935A080865l6965l5817l5092l3329k9986k6675k4739k3218k0757j7982j6150
60924G80155j4878j3127j1189r829q652p110n913n629n233l853k596k576k538
60911F87032q99J252J770J044J218K463K916K053J411J801K245J920J089j56k091
60896G05068m058m779m348m288n318o550p128p240p221o961o506o186n959n616
60882F22910n522o241p534q617r201r343q822p725p094p709q688q626p635o862
60868E13291o445n531m079k994k570k173j545r91l55R07K547L687M172M685N447
$$ plain form
60956 2487761 2342018 2210496 2091742 1984450 1888159 1803199 1729076 1664174 1607376 1558210
60946 1558210 1514722 1472944 1429519 1383844 1337137 1290647 1245268 1201638 1159822 1119541 1080865
60935 1080865 1043900 1008083 972991 939662 909676 883001 858262 835044 814287 796305 780155
60924 780155 765277 752150 740961 731132 722480 715370 709457 703828 698595 694742 692146 689570 687032
60911 687032 686133 687385 689155 690199 691417 693880 696796 698849 700260 702061 704306 706226 707315 707159 705068
60896 705068 701010 696231 691883 687595 682277 675727 668599 661359 654138 647177 640671 634485 628526 622910
60882 622910 617388 611147 603613 594996 585795 576452 567630 559905 552811 545102 536414 527788 520153 513291
60868 513291 506846 501315 497236 494242 491672 489499 487954 486963 486608 487515 490062 493749 497921 502606 508053
60853E08053N864N459M267K495P37J23J195K971M107M596N149N564N026L620K075
60838E61301L92j738l555l956l424l603m869n975o062n470m399k553m68L92m29
60823E15584j611j841j310q72p80q18r47j254j771k612l794m843n153m776m335
60808D78867m239m514n079n599n457m577l891m117m625m419l675l263l184k761
60794D19467j993j480j328j277j591k538l359l061j967j144p20q9N44M99K30Q27
60778D01020J955K129J143M89J017J819K040K157K809L653M119M251M253M074
60764D36928L877M059M481M483L821K785J434k47j538j629j026j032j789k212
60750D52395j968j972k599k959k452j651j061l86L78L82p76k314l498m556n677
$$ plain form
60853 508053 513917 519376 523643 526138 526875 526998 528193 531164 535271 539867 545016 550580 555606 559226 561301
60838 561301 561693 559955 556400 552444 549020 545417 540548 534573 528511 523041 518642 516089 515621 516013 515584
60823 515584 513973 512132 510822 509950 509170 508352 507405 506151 504380 501768 497974 493131 487978 483202 478867
60808 478867 474628 470114 465035 459436 453979 449402 445511 441394 436769 432350 428675 425412 422228 419467
60794 419467 417474 415994 414666 413389 411798 409260 405901 402840 400873 399729 399009 398920 399464 399963 400193 401020
60778 401020 402975 405104 406247 406736 407753 409572 411612 413769 416578 420231 424350 428601 432854 436928
60764 436928 440805 444864 449345 453828 457649 460434 461868 461621 460083 458454 457428 456396 454607 452395
60750 452395 450427 448455 445856 442897 440445 438794 437733 437347 437725 438107 437331 435017 431519 426963 421286
60735D21286o234n794m979m584m566m555m584m633m252l269k302j956k050k028
60721C65500j676j062l09L54Q27J413K264K685J931N58r3J91L31k09o64l96K20
60704C71865P35J338K052K396K335K562L323M016M365M902N665N650M324K613
60690D18141J650J460J611K157L008L324K540J363Q38J003J193J148J054J009
60676D41499J082J382J590J062j12q98p68n16r08j440j379j281k237m019n239
60661D27818n224m670m311l963l164k042j053k84N09J311J718J519J172J359K063
60646D12758K570K480K240K269K133J127p04k741m555n795n813m406k611j692
60632C97260j456p73M37J001M55j59J99J231K039K214J811J050M01K79L61k4p49
$$ plain form
60735 421286 415052 409258 404279 399695 395129 390574 385990 381357 377105 373836 371534 369578 367528 365500
60721 365500 363824 362762 362453 362807 363634 365047 367311 369996 371927 372485 372392 372583 372914 372705 372041 371645 371865
60704 371865 372600 373938 375990 378386 380721 383283 386606 390622 394987 399889 405554 411204 415528 418141
60690 418141 419791 421251 422862 425019 428027 431351 433891 435254 436092 437095 438288 439436 440490 441499
60676 441499 442581 443963 445553 446615 446503 445605 444837 444321 443413 441973 440594 439313 437076 433057 427818
60661 427818 422594 417924 413613 409650 406486 404444 403391 403107 403616 404927 406645 408164 409336 410695 412758
60646 412758 415328 417808 420048 422317 424450 425577 424873 422132 417577 411782 405969 401563 398952 397260
60632 397260 395804 395031 395468 396469 396924 396765 396964 398195 400234 402448 404259 405309 405710 405989 406350 406326 405577
60615D05577j004o79m87o18m08K54M67p9l59L44J113P00o22j531j446q29j60M88
60597D00721R93J048N65j03l86J18J289K491L233L667M047M055L368K574K546
60582D30226K940K460P52r84j600j220n28K21J009J677K165K642L091L448M122
60567D50421N684P899R910J1386J2670J3813J4523J4996J5627J5832J4483J1645
60555E98889Q521N494J709k898o803q782r284r134q222o351m176k354p19Q87K043
60540E58820K750L953O179Q674J0731J2853J5681J8797K1586K4248K6881K8353
60528G39506K7275K3529J7992J1394M346k160p214j0583j2283j2327j1442j1051
60516G56982j1657j2065j1138r466q313p594o113l400l25J877K548J974J331J869
$$ plain form
60615 405577 404573 403894 403407 402789 402381 402635 403102 403023 402664 403008 404121 404821 404199 402668 401222 400393 400233 400721
60597 400721 401714 402762 403327 403224 402838 402956 404245 406736 409969 413636 417683 421738 425106 427680 430226
60582 430226 433166 435626 436378 435394 433794 432574 432046 432267 433276 434953 437118 439760 442851 446299 450421
60567 450421 456105 464004 473914 485300 497970 511783 526306 541302 556929 572761 587244 598889
60555 598889 607410 612904 614613 611715 604912 596130 586846 577712 569490 563139 558963 556609 555890 556777 558820
60540 558820 561570 565523 571702 580376 591107 603960 619641 638438 660024 684272 711153 739506
60528 739506 766781 790310 808302 819696 824042 821882 814668 804085 791802 779475 768033 756982
60516 756982 745325 733260 722122 712656 704343 696749 690636 687236 686911 688788 691336 693310 694641 696510
60502F96510L766O255R038J2637J7053K1402K5472L0371L6766M3654M9834N5441
60490A008199O0836O5058O6728O5713O2647N7473M9736L9584K7363J2954l271
60479A513020j9480l3710m5676n5998o4217o9051p0305o9193o6805o3349n8866
60468H96370n3651m7978m2085l6412l1250k6523k2430j9654j8254j7012j4876
60457E66245j2383j0655r553q115o348n270n183n179m499l447k759k685k919k984
60443D84266k705k432k624l022k852k018j379j452j703j621j547j747j651q48
60429D56665qJ47j2K15O59Q38Q77R27M88o19j398r41Q8M93L31M95J069J367J199
60410D62880Q90N02P5J52R64J658J450R44J127J711J824J682K033K409J656L1
$$ plain form
60502 696510 700276 706531 715569 728206 745259 766661 792133 822504 859270 902924 952758 1008199
60490 1008199 1069035 1134093 1200821 1266534 1329181 1386654 1436390 1475974 1503337 1516291 1513020
60479 1513020 1493540 1459830 1414154 1358156 1293939 1224888 1154583 1085390 1018585 955236 896370
60468 896370 842719 794741 752656 716244 684994 658471 636041 616387 598133 581121 566245
60457 566245 553862 543207 533654 525539 519191 513921 508738 503559 499060 495613 492854 490169 487250 484266
60443 484266 481561 479129 476505 473483 470631 468613 467234 465782 464079 462458 460911 459164 457513 456665
60429 456665 456657 456804 456792 457007 457666 458504 459381 460308 460796 460177 458779 457838 457926 458419 458750 459245 460314 461681 462880
60410 462880 463770 464272 464347 464499 465463 467121 468571 469515 470642 472353 474177 475859 477892 480301 481957 481988
60394D81988q72l07Q53J652K103K583L210L934M409L978K677J849K665M372N159
60379E20253M491L380K664K269K059K079K000J543J287J945K929K988K114J562
60365E53563J916K473K629K615K649K501K202K193K564L002L563M588N852O739
60351E99049P300Q233R852J1885J4096J6132J6975J5722J2896R837O870L189j411
60338G30625n940r464j1857j3170j3333j2715j1950j1023r458p505o140n687n462
60325F06921m965m523m490m681m849n005n020m599l765k808j817p45K22J057K311
60310E63244M391O760Q780J0913J3974J7516K0193K1512K2071K2197K1700K0868
60298G54119K0270J9353J6545J1200M455k157p990j3074j7539k1527k4808k6416
$$ plain form
60394 481988 481116 480809 481662 483314 485417 488000 491210 495144 499553 503531 506208 508057 510722 515094 520253
60379 520253 524744 528124 530788 533057 535116 537195 539195 540738 542025 543970 546899 549887 552001 553563
60365 553563 555479 557952 560581 563196 565845 568346 570548 572741 575305 578307 581870 586458 592310 599049
60351 599049 606349 614582 624434 636319 650415 666547 683522 699244 712140 721977 728847 732036 730625
60338 730625 724685 715221 703364 690194 676861 664146 652196 641173 631715 624210 618070 612383 606921
60325 606921 601956 597433 592943 588262 583413 578408 573388 568789 565024 562216 560399 559654 559876 560933 563244
60310 563244 567635 574395 583175 594088 608062 625578 645771 667283 689354 711551 733251 754119
60298 754119 774389 793742 810287 821487 825942 823785 815795 802721 785182 763655 738847 712431
60286G12431k5520k2711j9580j6961j4504j1955r790q373p431o612n873n224m688
60273E53209m498m671m624l948l153k872k724k007j018n93p10q04r88j590j944
60258E17065j136K50P54K52p6J21K3m91m40M38J090R12N67O41Q29R15J198J474
60240E24386R47l54j293j258q58o12j70O85J442J761J911J956J573R85R32J477
60224E33510J985K356L021L584L067J807J493K788M412N168N366N613N724N608
60210E85502N871O688P300P347P431P704P279N915M879N116N764N508M386L192
60196F69882K159J220O96P32P13J21p64j602k604l728m203l652k882k808l312
60181F49968l756l885l670l111k633k825l356l179k188j530j734j888j288o21
$$ plain form
60286 712431 686911 664200 644620 627659 613155 601200 591410 583037 575606 568994 563121 557897 553209
60273 553209 548711 544040 539416 535468 532315 529443 526719 524712 523694 523101 522391 521587 520599 519009 517065
60258 517065 515929 516179 516933 517185 517109 517230 517253 516762 516322 516760 517850 518762 519329 519970 520799 521714 522912 524386
60240 524386 525333 524979 523686 522428 521570 520958 520788 521473 522915 524676 526587 528543 530116 531101 532033 533510
60224 533510 535495 537851 540872 544456 547523 549330 550823 553611 558023 563191 568557 574170 579894 585502
60210 585502 591373 598061 605361 612708 620139 627843 635122 641037 645916 651032 656796 662304 666690 669882
60196 669882 672041 673261 673957 674689 675402 675523 674759 673157 670553 666825 662622 658970 656088 653280 649968
60181 649968 646212 642327 638657 635546 632913 630088 626732 623553 621365 619835 618101 616213 614925 614304
60167F14304n67n30K51J300J680J270M16p43j794j878r15l1Q6K27J133K022J838
60150F18069R67M92N07M05K64O07J271J608J560J626K043K754L797N044N923O099
60134F53036N997O225O870P803Q951R836R584P950N678L403J031j302k703k712
60120G19647k093j721j469q97j90L39R02J629K122K211K292K297J388n66k260
60105G23631k642k368k640l539m493n403o226o317n395m407m202m112l006j136
60091F67745K80Q63J233J796K418L011L536L659L234K776K812L054K925K333J469
60076G03144L82o95j390k062l719o371q533r189r193r724j0411j0222r296q519
60062F14202p955p069n957n109m438l691l315l754m294l818k393j046l20j2O0
$$ plain form
60167 614304 613737 613207 613458 614758 616438 617708 618124 617381 615587 613709 612794 612763 612849 613076 614209 616231 618069
60150 618069 619036 619528 620035 620440 620704 621311 622582 624190 625750 627376 629419 632173 635970 641014 646937 653036
60134 653036 659033 665258 672128 679931 688882 698718 708302 716252 721930 725333 726364 725062 722359 719647
60120 719647 717554 715833 714364 713467 713277 713616 714518 716147 718269 720480 722772 725069 726457 725891 723631
60105 723631 720989 718621 715981 712442 707949 702546 696320 690003 684608 680201 675999 671887 668881 667745
60091 667745 668025 668888 670121 671917 674335 677346 680882 684541 687775 690551 693363 696417 699342 701675 703144
60076 703144 703526 702831 701441 699379 695660 689289 680756 671567 662374 652650 642239 632017 622721 614202
60062 614202 606247 599178 593221 588112 583674 579983 576668 572914 568620 564802 562409 561363 561043 561031 561091
60047E61091Q8O03J824L008L403L374L662M102M077L725L603L570L115K322J542
60032F03109N45q90k052k162j771k092l238m278m832n328n825n765n050m447m735
60017E51189o004p694q775q333o588m911m231l973l282k510k444k749k420j411
60003D85864n71k18M0L09K42j55n15p56r17o47L47J533K146K207K262K430K532
59986D96133K714L091L163K531J708J310Q99k47j693k357k145j925k085k266k359
59971D96472k591k655j876l77R21J509J710J868J951K054K499L317M118M612M794
59956E18326M695M278L472K139L20j300j832j385j097j588k201k274k199k481
59942E16873k752k590k442k826l343l457l373l263k566j109K8k6m48QJ059J551
$$ plain form
60047 561091 561179 561782 563606 566614 570017 573391 577053 581155 585232 588957 592560 596130 599245 601567 603109
60032 603109 603654 602764 600712 598550 596779 594687 591449 587171 582339 577011 571186 565421 560371 555924 551189
60017 551189 545185 537491 528716 520383 513795 508884 504653 500680 497398 494888 492444 489695 487275 485864
60003 485864 485293 485075 485115 485424 485666 485511 484996 484240 483323 482676 483023 484556 486702 488909 491171 493601 496133
59986 496133 498847 501938 505101 507632 509340 510650 511549 511302 509609 507252 505107 503182 501097 498831 496472
59971 496472 493881 491226 489350 488973 489894 491403 493113 494981 496932 498986 501485 504802 508920 513532 518326
59956 518326 523021 527299 530771 532910 533230 531930 530098 528713 527616 526028 523827 521553 519354 516873
59942 516873 514121 511531 509089 506263 502920 499463 496090 492827 490261 489152 489180 489154 488706 488714 489773 491324
59926D91324J402J572K609M374O586Q554R152Q221P116O723O005L981J886J447
59912E60952K076J939J087J173K450L400L350L267L770M271M421M575M579L707
59898F05017K120Q97L82k6l69L7J118J915K112K322K723K921L205M320N841O406
59882F40941N838N385N548N366M426L794M199M743M362L336K471J769P35p37k416
59867F89760m035n115n222m661m202l951l313k223j439j441j914k564l481m399
59853F41800m523l465j654L56K398M390O210P946R701J1211J2162J2545J2110
59840G11187J0101O420K480k12j706k726k843j115J824M060M516L374P15l399
59826G32676p644j0111j0564j0491j0735j0692r979r177q567p689o619o108o139
$$ plain form
59926 491324 492726 494298 496907 501281 507867 516421 525573 533794 540910 547633 553638 557619 559505 560952
59912 560952 563028 564967 566054 567227 569677 573077 576427 579694 583464 587735 592156 596731 601310 605017
59898 605017 607137 608034 608416 608390 608021 608058 609176 611091 613203 615525 618248 621169 624374 628694 634535 640941
59882 640941 646779 652164 657712 663078 667504 671298 675497 680240 684602 687938 690409 692178 692913 692176 689760
59867 689760 685725 680610 675388 670727 666525 662574 659261 657038 655599 654158 652244 649680 646199 641800
59853 641800 637277 633812 632158 632514 634912 639302 645512 653458 663159 674370 686532 699077 711187
59840 711187 721288 727708 730188 729976 728270 725544 722701 721586 723410 727470 731986 735360 736075 732676
59826 732676 725032 714921 704357 693866 683131 672439 662460 653283 644716 637027 630408 624300 618161
59813F18161n763m795m203m409m654m492m413m523m079k952k108j975j711p84
59799E67300Lj62q47j184r71l75M92J145Q78j70r79j072j021j253j393j147q90
59782E58354r00r77j047j281j459j166p17p92j119p78J42N88L29L16R53J523J663
59765E53632J909K366K389K062K524M109N514N654N076M866N228N891O821P824
59751F15865Q303Q111P843P908Q117Q419R067R843J0111R893R747R507Q293O027
59737G37054L721K069R11J30j99o62j965l501l953l412l288l918m162l614l290
59722G11921l615l645l035k825l456l824l295k914l522m191l740k495j521j213
59708F68630j449k030k287j445J8P28M96N13J135J238M79J29P94J243O49J42Q28
$$ plain form
59813 618161 612398 607603 603400 598991 594337 589845 585432 580909 576830 573878 571770 569795 568084 567300
59799 567300 567303 567141 566294 565110 564139 563764 564256 565401 566279 566109 565130 564058 563037 561784 560391 559244 558354
59782 558354 557454 556477 555430 554149 552690 551524 550807 550015 548896 548118 548260 548848 549177 549493 550446 551969 553632
59765 553632 555541 557907 560296 562358 564882 568991 574505 580159 585235 590101 595329 601220 608041 615865
59751 615865 624168 632279 640122 648030 656147 664566 673633 683476 693587 703480 713227 722734 731027 737054
59737 737054 740775 742844 743755 743885 743686 743024 741059 737558 733605 730193 726905 722987 718825 715211 711921
59722 711921 708306 704661 701626 698801 695345 691521 688226 685312 681790 677599 673859 671364 669843 668630
59708 668630 667181 665151 662864 661419 661437 662165 662661 663174 664309 665547 666026 666155 666949 668192 668841 668983 669811
59691F69811J929K250J990J682Q51q52k425k824k423k060j667j026o48r65j704
59676F61919k796m624o642p349o582o045o630p054o291n360n286n224m255l234
59662E84547l004k562r57O03O43K7M65J669K201K114K498L257L493L463M025M731
59646F07213M404L115J798M17j625l795m966n262n661o125n834m905m137l413
59632E71224j940lJ209J276P29k55j856l499m167l846l432l356l290l048k622
59617E43124j792o65k09j074k351k673k127j817j917j572m40Q47J756K255K291
59602E33636J795J125P18N40M58P44J461J978J828J515J653J978K016K019K349
59587E55813K594K204J389N26n20j694k235j785j203j370j973k361k607k842k567
$$ plain form
59691 669811 671740 673990 675980 677662 678513 677661 675236 672412 669989 667929 666262 665236 664588 663623 661919
59676 661919 659123 654499 647857 640508 633926 627881 621251 614197 607906 602546 597260 592036 587781 584547
59662 584547 581543 578981 578024 578627 579270 579297 579762 581431 583632 585746 588244 591501 594994 598457 602482 607213
59646 607213 611617 614732 616530 616947 615322 611527 606561 601299 595638 589513 583679 578774 574637 571224
59632 571224 569284 569281 570490 571766 572495 572240 570384 566885 562718 558872 555440 552084 548794 545746 543124
59617 543124 541332 540667 540458 539384 537033 534360 532233 530416 528499 526927 526487 527334 529090 531345 533636
59602 533636 535431 536556 537274 537814 538272 539016 540477 542455 544283 545798 547451 549429 551445 553464 555813
59587 555813 558407 560611 562000 562526 562006 560312 558077 556292 555089 553719 551746 549385 546778 543936 541369
59572E41369j650r25q32o36k8q2j365k442j912n54J31L09Q47J165J76j381j758
59555E30432q47p0n4k13l06n98o61K70J817K753K750K570K754L312M367N966P621
59538E61863R073J1037J4334J8801K3762K8298L0151K6071J5425K431p208j1316
59526G22722j1455r512o321k943o77L59R49J197O90k19r41k009m207o777q246
59511F72610q691r453j0890j2086j2487j2266j1364r711q019o941n953m494l398
59498E56857l557l992l240j853j385j555q39O01J032J49m51P9P90R08Q31R07R33
59481E46215J077J775K659L025L253M174N384N864N900O493P223O786N430M687
59467F09945M695M000K155M59j82j99M2P95J847K665L654N579P768Q767Q700Q961
$$ plain form
59572 541369 539719 538794 537962 537326 537298 537216 535851 533409 531497 530943 531074 531383 532230 533395 533571 532190 530432
59555 530432 529585 529515 529461 529248 528942 528344 527683 527953 529770 532523 535273 537843 540597 543909 548276 554242 561863
59538 561863 570936 581973 596307 615108 638870 667168 697319 723390 738815 741246 734038 722722
59526 722722 711267 701755 695434 692491 691814 692173 693122 694319 695009 694790 693849 691840 687633 680856 672610
59511 672610 663919 654466 643576 631490 619003 606737 595373 585662 577643 570702 564749 560255 556857
59498 556857 553300 549308 546068 544215 542830 541275 540436 541037 542069 542218 541767 541846 542636 543544 544375 545282 546215
59481 546215 547292 549067 551726 554751 558004 562178 567562 573426 579326 585819 593042 599828 605258 609945
59467 609945 614640 618640 620795 621254 621072 620873 620915 621710 623557 626222 629876 635455 643223 651990 660690 669651
59451F69651R621R353Q023P065O902O306M788L507K993J968o53m198p382r662
59437G08282j0862j0871j0087r032p392m754k093q59p24q3J274K006J791J976
59423F58572L348N277P383J0130J3367J6079J7929J9448K0543K0665K0448K1292
59411H34481K3365K5883K8826L1677L0752K1464M390j3629k5679k9926k8163k2448
59399H80993j4659o674J141R674J7711K0714J5063K370j1812k2553k7872k8343
59387H35753k6045k3109k0141j6577j2716r918q447o919m583k428j283n92J1k19
59373G02787j423k242j757p94k95Q6P26J043Q06R29J875K781L139L790N186O321
59357G22958O560O919Q251R729J0520J1469J3651J6457J8569J9743K0395K0464
$$ plain form
59451 669651 679272 688625 696648 703713 710615 716921 721709 725216 728209 730177 729524 725326 717944 708282
59437 708282 697420 686549 676462 667430 660038 655284 653191 652332 651608 651525 652799 654805 656596 658572
59423 658572 661920 667197 674580 684710 698077 714156 732085 751533 772076 792741 813189 834481
59411 834481 857846 883729 912555 944232 974984 996448 1000838 987209 961530 931604 903441 880993
59399 880993 866334 859660 860801 870475 888186 908900 923963 926333 914521 891968 864096 835753
59387 835753 809708 786599 766458 749881 737165 727247 718800 711881 707298 704870 703587 702995 703006 702787
59373 702787 701364 699122 697365 696571 696276 696362 697088 698131 698937 699866 701741 704522 707661 711451 716637 722958
59357 722958 729518 736437 744688 754417 764937 776406 790057 806514 825083 844826 865221 885685
59345H85685J9876J9238J8883J8227J6902J5489J4252J2333R088N069R07l553
59333A032396q127j1783j4192j6471j9314k1684k2422k1910k1147k0342j9428
59322H35576j8693j7907j6172j3554j1602j1211j1342j0813j0000r631r334q607
59310F86710p894p482o617m893l243k353j403L57K142L109M001N822Q060R824
59296F86140J1694J4748J8284J9945J7787J1432K058p790j5204j8926j9857j9168
59284G01143j6915j3216r304o284l907j542O80K589M670P050R000J0352J2164
59271F96480J4883J7224J7990J7778J7526J6772J4779J2246J0328Q812O712L992
59259H55522J281j418m471p542r848j1049j1193j0416r303q717q632q026o447
$$ plain form
59345 885685 905561 924799 943682 961909 978811 994300 1008552 1020885 1029973 1035042 1035949 1032396
59333 1032396 1024269 1012486 998294 981823 962509 940825 918403 896493 875346 855004 835576
59322 835576 816883 798976 782804 769250 757648 746437 735095 724282 714282 704651 695317 686710
59310 686710 678816 671334 664717 659824 656581 654228 652825 653182 655324 658433 662434 668256 676316 686140
59296 686140 697834 712582 730866 750811 768598 780030 782088 774298 759094 740168 720311 701143
59284 701143 684228 671012 661708 655424 651517 649975 650655 653244 657914 664964 673964 684316 696480
59271 696480 711363 728587 746577 764355 781881 798653 813432 825678 836006 844818 851530 855522
59259 855522 856803 855385 850914 843372 833524 822475 811282 800866 791563 782846 774214 766188 759741
59246G59741m639l148j611J5J028J451K374M082N473O153P222Q976R788Q668P035
59231H12608O305N506L163J2k211l495n096p322r572j1749j3894j5184j4898j3698
59217G30475j2606j1562j0256r371r485r690q803p165n844m933m028l445l524
59204F29763l538k746j728j337j187n23K66M62N06J244K384L042L152L172L054
59189F35986K670K497K848L205L269L658M640N340N220N127N705O106N522M653
59175F96446M301L876K782J983K526L708M290M513N285O418P147P434P356O291
59161G64356M150K177J107k18k883n939p998r354j0774j1627j1211j0653j1293
59148F89840j2295j1954j0434r129q286p332o682p025p518o867n591n209n652
$$ plain form
59246 759741 755102 751954 750343 750358 751386 752837 755211 759293 764766 770919 778141 787117 796905 805573 812608
59231 812608 818913 824419 827582 827594 825383 821888 816792 809470 799898 788149 774255 759071 744173 730475
59217 730475 717869 706307 696051 686680 677195 667505 658702 651537 645693 640760 636732 633287 629763
59204 629763 626225 623479 621751 620414 619227 618704 618970 619432 619938 621182 623566 626608 629760 632932 635986
59189 635986 638656 641153 644001 647206 650475 654133 658773 664113 669333 674460 680165 686271 691793 696446
59175 696446 700747 704623 707405 709388 711914 715622 719912 724425 729710 736128 743275 750709 758065 764356
59161 764356 768506 770683 771790 771572 768689 762750 754752 745398 734624 722997 711786 701133 689840
59148 689840 677545 665591 655157 646028 637742 630410 623728 616703 609185 602318 596727 591518 585866
59135E85866n512m364l030j921r15l39m52m41M71J548J759J709K689M493N894
59120E87455O668P470Q339R041J0149J2158J4148J4894J4676J4500J4277J3358
59108G27133J2057J1038R995Q451P050O519O209N157L640K327R47p28j956k502
59094G95337l539n493o659n856m612m532m407k495N9R16K48j89m90k001m306n865
59078G46116o863q494j0134j0174r095q656q628p331n079l958m352m591m012l569
59064F51180l459k917k373l109m640n082m182l471l373k763j533j034j609k056
59050F09579j835j721j955j799j057k97L57J008J044K39r0R36J640J68k037k065
59034F02115l6J437J591K000L027L349L114M072O297P984Q900J0759J3713J5733
$$ plain form
59135 585866 580354 575990 572960 571039 570124 569785 569333 568892 569363 570911 572670 574379 577068 581561 587455
59120 587455 594123 601593 609932 618973 629122 641280 655428 670322 684998 699498 713775 727133
59108 727133 739190 750228 760223 768674 775724 782243 788452 793609 797249 799576 800523 799795 797839 795337
59094 795337 791798 786305 779646 773790 769178 764646 760239 757744 757803 758719 758967 758778 758288 756287 751981 746116
59078 746116 739253 730759 720625 710451 701356 692700 684072 676741 671662 667704 663352 658761 654749 651180
59064 651180 647721 644804 642431 639322 634682 629600 625418 621947 618574 615811 614278 613244 611635 609579
59050 609579 607744 606023 604068 602269 601212 600915 601272 602280 603324 603563 603473 604409 606049 606217 604180 602115
59034 602115 602079 603516 605107 607107 610134 613483 616597 620669 626966 634950 643850 654609 668322 684055
59020F84055J6142J6561J7491J7154J4701J1634Q902N418P41l458n981p701r290
59007G66369r657q054n686l876k352m89J357K747L892M768M984M945N548O428
58993G70924O215M824L597L015K205Q83l02j485l460n612o265n407m769m880m344
58978G55139k529o30M88J408K654M021N737Q233J0597J1471J1468J2411J4176
58965H34644J4932J4541J4851J6222J6715J5364J3424J1652R094N423J845j190
58953I67517m697q791j2151j4488j7024j9816k1194k0669j9768j9202j7903j5643
58941G76171j3869j2951j1259q088m960l055j850j127j609k656k187o1J180K16
58927G13895j190j432j394k094k691k434k237k723k946k446k274k780k648j413
$$ plain form
59020 684055 700197 716758 734249 751403 766104 777738 786640 792058 792799 789341 783360 775659 766369
59007 766369 756712 748658 742972 739096 736744 736255 737612 740359 744251 749019 754003 758948 764496 770924
58993 770924 777139 781963 785560 788575 790780 791663 791361 789876 786416 780804 774539 769132 764363 759483 755139
58978 755139 752610 751980 752468 753876 756530 760551 766288 774521 785118 796589 808057 820468 834644
58965 834644 849576 864117 878968 895190 911905 927269 940693 952345 961439 966862 968707 967517
58953 967517 962820 954029 941878 927390 910366 890550 869356 848687 828919 809717 791814 776171
58941 776171 762302 749351 738092 730004 725044 721989 720139 719012 717403 714747 712560 712499 713679 713895
58927 713895 712705 711273 709879 707785 705094 702660 700423 697700 694754 692308 690034 687254 684606 683193
58913F83193n08o06l66Q65J627J059O11J555L169M709O769R345J1033J1619J2915
58898G46989J5611J7834J8381J8639J9628J9872J8236J6359J6123J6995J7870
58887I42537J9315K1865K4149K4805K4420K3656K1442J6963J1594O930K603k200
58875A138079o810j0426j3678j7118j9815k0966k1209k0943j9210j5683j1932
58864I60289r282p314n684n307o394p489p865q667j0395j1544j1247j0746j0794
58851H47561j0199q566p677q284q351o639n262o269q275r100r327j0425j1577
58838G37610j1252j0242j0262j0971j0910j0001q988p696n945m711m495m034k420
58825F35683p93j92L09J565K546K540K884M433N546M877L966M556N451M782L426
$$ plain form
58913 683193 682685 682079 681713 682578 684205 685264 685875 687430 690599 695308 702077 711422 722455 734074 746989
58898 746989 762600 780434 798815 817454 837082 856954 875190 891549 907672 924667 942537
58887 942537 961852 983717 1007866 1032671 1057091 1080747 1102189 1119152 1130746 1137676 1140279 1138079
58875 1138079 1131269 1120843 1107165 1090047 1070232 1049266 1028057 1007114 987904 972221 960289
58864 960289 951007 943693 938009 932702 926308 918819 910954 902287 891892 880348 869101 858355 847561
58851 847561 837362 828796 821119 812835 804484 797845 792583 786314 778039 768939 759612 749187 737610
58838 737610 726358 716116 705854 694883 683973 673972 664984 657288 651343 646632 642137 638103 635683
58825 635683 634890 634698 635007 636572 639118 641658 644542 648975 654521 659398 663364 667920 673371 678153 681579
58810F81579L326M096M072L243K517J495m39k157k371j977k500l567m066m333
58796F78918m999n232m436m046n293o749o534n387n016n007l941k214j093j82
58782F18789J541L337L856L614L988M789N014M948N283N292M017K133O25j073
58768F66153l633n893o516o248o433o657n961m964m553l949k197k34P10J331K641
58753F13597L713L288K233K028K156J276j73p36k02Q14K289L988M767M412M602
58738F48052O245P752P738P322P744P950O883O005O978Q739R394R126Q870Q112
58724G56910O528N613O164O280M572L012L783N639O440O989Q910J0924J0805R241
58710H51810Q243P378N070K094K26j240m185q161j1347j3769j6463j8895k0209
$$ plain form
58810 681579 684905 689001 693073 696316 698833 700328 699889 697732 695361 693384 690884 687317 683251 678918
58796 678918 673919 668687 664251 660205 654912 648163 641629 636242 631226 626219 622278 620064 618971 618789
58782 618789 620330 623667 627523 631137 635125 639914 644928 649876 655159 660451 664468 666601 667226 666153
58768 666153 662520 656627 650111 643863 637430 630773 624812 619848 615295 611346 609149 608915 609625 610956 613597
58753 613597 617310 620598 622831 624859 627015 628291 628118 627382 627180 627994 630283 634271 639038 643450 648052
58738 648052 654297 662049 669787 677109 684853 692803 699686 705691 712669 721408 730802 739928 748798 756910
58724 756910 763438 769051 775215 781495 786067 789079 792862 798501 804941 811930 820840 831764 842569 851810
58710 851810 860053 867431 872501 874595 874821 873581 869396 861235 849888 836119 819656 800761 780552
58697G80552k1469k3616k4863k3358k0614j9006j7727j4789j1227r429q818p174
58685E78462m902m098m511m277l713m484n967o051m762l673k656o98J186J430
58671E31286J219K786N436O844P205Q506J0695J2312J3858J6730J9668J9944J7363
58658F73852J3628Q838K342m029p491q467r529j1036j1365j0630j0428j0551r596
58645F05538q032p301o785n098l242k961l177j776L82J127J239K965N531O299
58631E84709N362M777M332K395j15r68r06k314m625n391m910n215n463l218N86
58616E69036K828L704O034R549J0974R647Q163P432N854L430K084J740N07j279
58602F39703j478m49n55j736j955j614k864m925m903l005k095k353j282J188K643
$$ plain form
58697 780552 759083 735467 710604 687246 666632 647626 629899 615110 603883 594454 585636 578462
58685 578462 573560 569462 564951 560674 556961 552477 546510 540459 535697 532024 529368 528670 529856 531286
58671 531286 532505 535291 540727 547571 554776 563282 573977 586289 600147 616877 636545 656489 673852
58658 673852 687480 696318 698660 694631 687140 678673 669144 658108 646743 636113 625685 615134 605538
58645 605538 597506 590205 583420 578322 575080 572119 568942 567166 567548 568675 569914 572879 578410 584709
58631 584709 590071 594848 599180 601575 601460 600492 599586 597272 592647 587256 582346 577131 571668 568450 569036
58616 569036 571864 575568 581602 591151 602125 611772 619935 627367 633221 636651 638735 640475 640982 639703
58602 639703 638225 637776 637221 635485 633530 631916 629052 624127 619224 616219 614124 611771 610489 611677 614320
58587F14320L150N167Q482J0331J0673J2216J5014J6124J4987J4048J3717J1841
58575G50070Q552O582O255N218L600M277P432R992J1053J2900J6136J8842K1095
58562H82004K5089L0149L2832L2585L2111L1640K8282K1835J5695J0988N216k142
58550A146284q009j0878j2468j3314j1913r173q355r622r945r232j0882j5272
58538A017221j8592j9418k0626k3249k4316k2608k0879k0377j8576j4360j0250
58527H03970p607m729j365R0n31k69J421J623k10r01L89M68j748l174k444k242
58511G82741l760m513l672l908n899o622n191m629n755n200j851O02M6q54k87
58496G31248m25k290l176j846r08j490j071J120K173J323J855M821O821O562P504
$$ plain form
58587 614320 617470 622637 631119 641450 652123 664339 679353 695477 710464 724512 738229 750070
58575 750070 758622 765204 771459 776677 780277 784554 791986 801978 813031 825931 842067 860909 882004
58562 882004 907093 937242 970074 1002659 1034770 1066410 1094692 1116527 1132222 1143210 1148426 1146284
58550 1146284 1138275 1127397 1114929 1101615 1089702 1080529 1072174 1062552 1052607 1043375 1032493 1017221
58538 1017221 998629 979211 958585 935336 911020 888412 867533 847156 828580 814220 803970
58527 803970 796363 791634 790269 790359 789828 789559 790980 792603 792393 791492 791881 792349 790601 787427 784983 782741
58511 782741 778981 774468 770796 766888 760989 754367 749176 744547 738792 733592 731741 732343 732389 731535 731248
58496 731248 730823 728533 725357 723511 722603 721113 720042 721162 723335 724658 726513 731334 738155 744717 752221
58481G52221J1184J4111J4293J4752J7403J9368J8529J6947J5679J2126N745M03
58469I12761k075m862r574j2900j2914j2504j3221j2098q012m801m352l001J417
58456H13864N332O288P475J1214J4232J3869J2795J3079J1629O182P3l470o153
58443I06409r570j1191r619q038q253p189l379n89r01o63K316M290K853J824L937
58428H62237N591M166L625P163J0921J0958R987J1207J1747Q488M360K578N48
58415I53576m315q534q593p411q689j0375r729r138j0821j1486q413n185n281
58402H45606n775l519j522k798l858r95K710L291L030N044O637M818K786M077
58388H59532N801M397K415K934L179M72j486P03L253K061L77K345N027M407L246
$$ plain form
58481 752221 763405 777516 791809 806561 823964 843332 861861 878808 894487 906613 912358 912761
58469 912761 910686 905824 896250 883350 870436 857932 844711 832613 824601 819800 815448 812447 813864
58456 813864 819196 825484 832959 844173 858405 872274 885069 898148 909777 915959 916032 912562 906409
58443 906409 896839 885648 876029 867991 859738 852549 849170 848581 847680 847017 849333 853623 856476 858300 862237
58428 862237 867828 871994 875619 882782 893703 904661 914648 925855 937602 946090 950450 953028 953576
58415 953576 949261 940727 932134 924723 916034 905659 895930 886792 875971 864485 856072 850887 845606
58402 845606 839831 836312 834790 831992 828134 827139 829849 833140 836170 841214 847851 852669 855455 859532
58388 859532 865333 869730 872145 875079 878258 878730 877244 877947 881200 883261 883638 885983 891010 895417 898663
58373H98663N298P702O864N879Q298J0563Q617N994P275R568Q718P802J0879J4361
58359A016481J3424J1118J2335J4373J2410Q730P721P273L913P88J731L199R12
58346A114408j464Q10M200L643K312N241R421R901R490J2644J6067J5306J4230
58333A216209J7700K1380J9391J5529J6076J7905J4982J0224R482R964O219J525
58321A376586J619L268Q18k126L80M479L600J318M489R826J0249Q470J1038J4990
58307A449004J3843J0907J2979J6737J5213J1877J4164J8844J8194J4901J6326
58296A612989J9742J8070J4559J6710K1248K0336J6989J8986K3238K1956J8484
58285A823307K0964K6105K5616K2821K6143L2023L1527K8037L0809L6806L6767
$$ plain form
58373 898663 903961 911663 918527 924406 932704 943267 951884 957878 965153 974721 983439 991241 1002120 1016481
58359 1016481 1029905 1041023 1053358 1067731 1080141 1088871 1096592 1103865 1107778 1108566 1110297 1113496 1114408
58346 1114408 1112944 1113754 1117954 1121597 1123909 1129150 1138571 1148472 1157962 1170606 1186673 1201979 1216209
58333 1216209 1233909 1255289 1274680 1290209 1306285 1324190 1339172 1349396 1358878 1368842 1375061 1376586
58321 1376586 1378205 1381473 1382291 1380165 1380545 1385024 1388624 1389942 1394431 1404257 1414506 1422976 1434014 1449004
58307 1449004 1462847 1473754 1486733 1503470 1518683 1530560 1544724 1563568 1581762 1596663 1612989
58296 1612989 1632731 1650801 1665360 1682070 1703318 1723654 1740643 1759629 1782867 1804823 1823307
58285 1823307 1844271 1870376 1895992 1918813 1944956 1976979 2008506 2036543 2067352 2104158 2140925
58274B140925L3503L6055M1487M0993L8004M1403M6933M4832L9658M2583N0221
58263B596597N1605M9767N5280O4642O6799O4728O8543P3891P0092O2862O5178
58252C289984P2455P1310O5902O9994P9910Q2064Q0411Q8686J02152J05704J03611
58241D212183J11596J25833J30337J28795J37356J52140J56806J56140J67899
58232E479085J87389J95706J97132K11469K35082K48134K54716K75649L06994
58223G591356L27579L42099L72942M14897M44166M66703N09036N66546O12365
58214A1647689O52232P16056Q00039Q75214R48832J055818J193730J331779J480197
58205B0701586J680815J933679K209068K527580K945860L468553M065248M767495
$$ plain form
58274 2140925 2174428 2210483 2251970 2292963 2330967 2372370 2419303 2464135 2503793 2546376 2596597
58263 2596597 2648202 2697969 2753249 2817891 2884690 2949418 3017961 3091852 3161944 3224806 3289984
58252 3289984 3362439 3433749 3499651 3569645 3649555 3731619 3812030 3900716 4002868 4108572 4212183
58241 4212183 4323779 4449612 4579949 4708744 4846100 4998240 5155046 5311186 5479085
58232 5479085 5666474 5862180 6059312 6270781 6505863 6753997 7008713 7284362 7591356
58223 7591356 7918935 8261034 8633976 9048873 9493039 9959742 10468778 11035324 11647689
58214 11647689 12299921 13015977 13816016 14691230 15640062 16695880 17889610 19221389 20701586
58205 20701586 22382401 24316080 26525148 29052728 31998588 35467141 39532389 44299884
58197D4299884N646278O701796P897243R303847J1088544J3372416J6257928J9975425
58189A34543361K4790475L0749324L7690604M5295976N2435377N6208330N2513000
58182D34226447L8862419J7139891o797947k6649146l9064726m4271501m4446791
58175C28998646m1953945l8482466l4847203l1163918k7332678k3464030j9846741
58168A11907665j6652454j3867908j1470949r490079p893757o576146n475408
58161D0480964m596328l910099l337131k839571k437922k126091j854055j603935
58153A7775832j404421j258382j127121r96852q94393q25767p60314o86539o26712
58144I195331n85627n38291m78800m31264m02196l69184l26060k94037k78902
$$ plain form
58197 44299884 49946162 56647958 64545201 73849048 84937592 98310008 114567936 134543361
58189 134543361 159333836 190083160 227773764 273069740 325505117 381713447 434226447
58182 434226447 473088866 490228757 483430810 456781664 417716938 373445437 328998646
58175 328998646 287044701 248562235 213715032 182551114 155218436 131754406 111907665
58168 111907665 95255211 81387303 69916354 60426275 52532518 45956372 40480964
58161 40480964 35884636 31974537 28637406 25797835 23359913 21233822 19379767 17775832
58153 17775832 16371411 15113029 13985908 12989056 12094663 11268896 10508582 9822043 9195331
58144 9195331 8609704 8071413 7592613 7161349 6759153 6389969 6063909 5769872 5490970
58135E490970k60367k33193k17428k18246k15027j99689j88441j86508j77607
58126C594464j57729j44405j42866j36191j18462j05726j04685j01226q9329q1845
58116B412000q3292q0321o8440o0951o2516o0197m9481m3448m7307m8745m2258
58105A765044l8970m3612m5237l9451l7201m2845m5449m0366l7961m2427m2963
58094A308562l4715k8283k9567k9679k3488j9309k1535k1730j5606j1396j3405
58083A059849j4087j0168r816j6190k0392j8246j7794k2848k5217k0832j7720
58072H66539k0327k1391j6946j4289j7283j8497j3726j0039j1757j2433q268n792
58060F95791q625r974n849k861n428p885o463o578j1036j3347j0044p599j0058
$$ plain form
58135 5490970 5230603 4997410 4779982 4561736 4346709 4147020 3958579 3772071 3594464
58126 3594464 3436735 3292330 3149464 3013273 2894811 2789085 2684400 2583174 2493845 2412000
58116 2412000 2328708 2248387 2179947 2118996 2056480 1996283 1946802 1903354 1856047 1807302 1765044
58105 1765044 1726074 1682462 1637225 1597774 1560573 1517728 1472279 1431913 1393952 1351525 1308562
58094 1308562 1273847 1245564 1215997 1186318 1162830 1143521 1121986 1100256 1084650 1073254 1059849
58083 1059849 1045762 1035594 1025778 1009588 989196 970950 953156 930308 905091 884259 866539
58072 866539 846212 824821 807875 793586 776303 757806 744080 734041 722284 709851 701583 695791
58060 695791 687166 677192 671343 668482 663054 655169 648706 642128 631092 617745 607701 600102 590044
58047E90044j1531q016m917n895n791j661M95k929o123m938m160p121q943o694
58033E11820n505p973q412m254k249o325j0185r025p971j1360j4100j1551q134
58020D04776q305q345m805j995l451m745k199r9k020l525q00J872M44j318L34
58005C65819J877J60q60J929M003J578j028M81K563J261j59J842L775K035K7J309
57989C86612K541L24j847m49J017j099l358k017m90k841o025n826m565n846p339
57974C48792n807l684m005m201j556P57m58k101o86R97m13k163q59R32J10n69
57958C25086J901M259K817M45R30J721q75m298m530l353m042m584k151L85n25
57943C13186k141m15K454K401J211K710N343N636N341P955J1635J2488J1701J2656
$$ plain form
58047 590044 578513 570497 565580 559685 553894 552233 552728 549799 543676 538738 534578 527457 518514 511820
58033 511820 506315 498342 489930 485676 483427 477102 466917 457892 449921 438561 424461 412910 404776
58020 404776 396471 388126 383321 381326 377875 373130 370931 370832 368812 365287 364487 366359 366803 365485 365819
58005 365819 367696 367856 366996 368925 372928 374506 373478 373959 376522 377783 377624 379466 383241 385276 385303 386612
57989 386612 389153 389477 387630 387181 388198 387099 383741 381724 381234 378393 372368 366542 361977 356131 348792
57974 348792 342985 339301 335296 331095 329539 330296 329838 327737 327051 328048 327635 325472 324613 325545 325655 325086
57958 325086 326987 331246 334063 334508 335438 337159 336284 331986 327456 324103 320061 315477 313326 313711 313186
57943 313186 311045 310630 313084 315485 316696 319406 324749 330385 335726 343681 355316 367804 379505 392161
57929C92161J4031J2401Q839O496M517N08l824n538o136q418j0711j0127q562
57916C85637r434j1328j0808q744q020p732n529k935k592k794n43K679L691L424
57902C24972M369N122L269R10J391L167K705R95J270K705K308Q83J277K780K826
57887C60949K227L139M040K273m63p67M03k12k063k325j610k637m841n717n743
57872C46653o892q020o864m843m766n647m852l250l175l377j379J300J686J000
57858B97574K330M730N286M994O744R340R495Q134Q684J0513J0136P755O522O341
57844C98578M442J316J60Q57L05j774k865l037m665p158p452n688n052o017n967
57829C55983m454l764m143l470j860j816l473m275l520k965k883j845l11k16j117
$$ plain form
57929 392161 406192 418593 427432 433928 438445 438953 435129 429591 423455 415037 404326 394199 385637
57916 385637 376203 364875 354067 345323 337303 329571 324042 321107 318515 315721 315178 317857 321548 324972
57902 324972 329341 334463 337732 338642 340033 343200 345905 346900 348170 350875 353183 354066 355343 358123 360949
57887 360949 363176 366315 370355 372628 372165 371398 371801 371589 369526 367201 365591 362954 358113 352396 346653
57872 346653 339761 331741 324877 320034 315268 309621 304769 301519 298344 294967 293588 294888 296574 297574
57858 297574 299904 304634 309920 314914 321658 330998 340493 348627 357311 367824 377960 385715 392237 398578
57844 398578 403020 404336 404496 405353 405658 403884 401019 397982 393317 386159 378707 373019 367967 361950 355983
57829 355983 351529 347765 343622 340152 338292 336476 333003 328728 325208 322243 319360 317515 317204 316988 315871
57814C15871q59K21n3j338j462r85k552n899q104q570r343j0568j0170q189p010
57799B40990p066o353m436k954k099n21J314J539N60N22J378J301O20J312K910
57784B29017L136K307K985N277O698O636O958Q154Q859R137J0340J1760J1367
57771C22631R708R188R668Q739O215M306L456K007q5j205j625l111n174n658m795
57756C54265m642m846l306o69K34o20o17M53Q8k074l711m396o076q545r148p590
57740B98800o565o870o323m309k956k821j810O02K264K509L323N178N777M260
57726B91059K777K692K777K338K515L376L248K018J697K766L319K635K159K286
57712C27662J663L02k05k10j900n042o694o034n512o272o437n071l978m181m235
$$ plain form
57814 315871 315012 315233 315180 313842 312380 311395 308843 302944 294840 286270 276927 266359 256189 248000 240990
57799 240990 233924 227571 223135 220181 218082 217561 218875 220414 220974 221496 222874 224175 224795 226107 229017
57784 229017 232153 234460 237445 242722 249420 256056 263014 271168 280027 289164 299504 311264 322631
57771 322631 332339 341527 351195 359934 366149 370455 373911 375918 375833 374628 373003 369892 364718 359060 354265
57756 354265 349623 344777 341471 340802 341036 340416 339799 340252 340340 338266 334555 330159 324083 315538 306390 298800
57740 298800 292235 285365 279042 274733 271777 268956 267146 267748 270012 272521 275844 281022 286799 291059
57726 291059 293836 296528 299305 301643 304158 307534 310782 312800 314497 317263 320582 323217 325376 327662
57712 327662 329325 329627 329422 329212 327312 322270 315576 309542 304030 297758 291321 286250 282272 278091 273856
57697B73856l323k601k325j148P29J138l03j546j996l360n732o762n793m986n189
57682B30659m580k611j241q95P20M213O963P739Q922J2222J5988J8867K2641K9128
57668C48735L7535M6880N8051P1272Q3943R2205R1998P8418M8754Q218l1188n9938
57656H74883p6575q3527q2148p4271o4130n5048m6710l8116l0488k5030k0701
57645B78139j6500j3295j1401r224o210m240m160l994k612j877l003m037l328
57632A94258k362k614k712j357j01m56j030k79N28j26j051o87n1n71j274q08r3
57615A79214l80p87k77L2r60j966j528n90m84m69L11O08p21k270k324j590j365
57598A64454j061L0N77n69j942j826j199j806l014l209k674k604k718k252j783
$$ plain form
57697 273856 270533 267932 265607 264459 265188 266326 266023 264477 262481 259121 253389 246627 240834 235848 230659
57682 230659 226079 223468 222227 221332 222052 226265 233228 240967 249889 262111 278099 296966 319607 348735
57668 348735 386270 433150 491201 562473 646416 738621 830619 909037 957791 966009 934821 874883
57656 874883 798308 714781 632633 558362 494232 439184 392474 354358 323870 298840 278139
57645 278139 261639 248344 236943 227719 221509 217269 213109 209115 206503 204626 201623 197586 194258
57632 194258 191896 189282 186570 185213 185112 184656 183626 183347 183875 183749 182698 182011 181960 181389 180115 179307 179214
57615 179214 178834 178047 177770 177802 176842 174876 173348 172758 172274 171805 172116 172724 172003 169733 167409 165819 164454
57598 164454 163393 163423 164000 163431 161489 159663 158464 156658 153644 150435 147761 145157 142439 140187 138404
57583A38404j909j676m58L27m89j604j545j271k119l036k461j323j496k600k878
57568A13866k092j333j005r84j544k382k187q28j98j183j881q15M08k6q97k79
57552I6640R47Q82J28M99J619J809J148R02R23L20k59L87J651K186K366L287M299
57535A19734L955K625J851J799J491Q14L00k85j321k123k026j608j363m88J335
57520A24690K519J772L16n0N11J068J923L279L687K185M05K66J060J109O24N73
57504A45937L90o53j417q26j75r37j953j592r95k074l839l978k736k004j756p52
57488A20640K30n46k289k604j452r22j495j690j154j067j591j686j363j427j420
57473A00164m34N00l42k221k895k326k381l160k807j084M6k80p30m29j25k37j55
$$ plain form
57583 138404 136495 134819 134361 134688 134199 132595 131050 129779 127660 124624 122163 120840 119344 116744 113866
57568 113866 111774 110441 109436 108452 106908 104526 102339 101511 101313 100130 98249 97434 97842 97816 96919 96640
57552 96640 97587 98469 98597 99096 100715 102524 103672 104574 105497 105817 105558 105945 107596 109782 112148 115435 119734
57535 119734 123689 126314 128165 129964 131455 132269 132569 132284 130963 128840 126814 125206 123843 123355 124690
57520 124690 127209 128981 129297 129247 129758 130826 132749 136028 139715 141900 142305 142571 143631 144740 145364 145937
57504 145937 146327 145674 144257 143431 143256 142319 140366 138774 137779 135705 131866 127888 125152 123148 121392 120640
57488 120640 120870 120324 118035 115431 113979 113057 111562 109872 108718 107651 106060 104374 103011 101584 100164
57473 100164 99730 100230 99888 97667 94772 92446 90065 86905 84098 83014 83060 82780 82050 81621 81496 81259 81104
57456H1104O5l90j198j085j76L4o69p95K72J317J337P17O6m23l47N83J536J477
57438H3425Q92J017J660J574O43j33n04r85j339r28j95m9j75K58P85M81r4K19
57420H6552J003J064O35O95Q15P4o84k6J295J332J51n72n49p25p67L64J691J234
57402I3582m84j047j83p9j404k308j810j162j170j049n61n96q97M3K073K979J920
57385H7847O97P42J242J246J237J556J353L01n48n10k33j62J70P34P14K12L56
57368I6954J175J239R3q92p12jM75Q75J233J053N16N27J146J446J155Q67N86j65
57350A07570q00k11J087J378L38p33j230j665j843r79K94L86o00j048p27r12j547
57333I8758j067N38J355Q19N19J114J195J38o84n48o05j387j660q74k95n70o41
$$ plain form
57456 81104 81169 80779 79581 78496 78320 78354 77685 76890 77162 78479 79816 80533 80599 80176 79829 80412 81948 83425
57438 83425 84317 85334 86994 88568 89211 89078 88574 87589 86250 85322 85127 85078 84903 85161 85946 86427 86333 86552
57420 86552 87555 88619 89254 89949 90764 90838 90154 90128 91423 92755 92906 92334 91785 91060 90293 90657 92348 93582
57402 93582 93098 92051 91868 91789 90385 88077 86267 85105 83935 82886 82325 81729 80832 80875 82948 85927 87847
57385 87847 88544 89286 90528 91774 93011 94567 95920 96221 95673 95163 94930 94768 94938 95672 96386 96598 96954
57368 96954 98129 99368 99461 98569 97857 97856 98331 99206 100439 101492 102008 102535 103681 105127 106282 107149 107735 107570
57350 107570 106770 106559 107646 109024 109362 108629 107399 105734 103891 102912 103206 103592 102992 101944 101217 100305 98758
57333 98758 97691 98229 99584 100403 100922 102036 103231 103369 102685 102137 101532 100145 98485 97611 97316 96746 96105
57316I6105n2O1o06o26M59J096N67L55J321K031J366M54M43O78N44Q59J919K377
57298A09351J575Q73J208J589J365J530K308K064L76m87Q05K088J161o84j128
57283A23994o07q07j270n25Q22R48j63j218k145l675n110n052l873l339m028m918
57267H9034n205m943m235l192k271j598o24O62J177M88r1O81K170L116L450L634
57251H2253L402K576J994K317K934L184L418L780L477K475K256L460M413L574
57237A25513J919J137J071P69N49J071J632J467J426K407L376K961J899J771K378
57222A51346K482K149K277K668K595K544L306M214M175L647L754M206M107L863
57208A97333M273M621L799K574K534L529M278M794N905P065P054O434O985Q817
$$ plain form
57316 96105 96053 96114 95508 94882 95341 96437 97004 97359 98680 100711 102077 102531 102974 103652 104196 105055 106974 109351
57298 109351 110926 111799 113007 114596 115961 117491 119799 121863 122239 121752 122557 124645 125806 125122 123994
57283 123994 123387 122580 121310 120785 121607 122555 122392 121174 119029 115354 110244 105192 101319 97980 93952 89034
57267 89034 83829 78886 74651 71459 69188 67590 66966 67628 68805 69293 69202 69883 72053 75169 78619 82253
57251 82253 85655 88231 90225 92542 95476 98660 102078 105858 109335 111810 114066 117526 121939 125513
57237 125513 127432 128569 129640 130409 130958 132029 133661 135128 136554 138961 142337 145298 147197 148968 151346
57222 151346 153828 155977 158254 160922 163517 166061 169367 173581 177756 181403 185157 189363 193470 197333
57208 197333 201606 206227 210026 212600 215134 218663 222941 227735 233640 240705 247759 254193 261178 269995
57194B69995J0360J0976J1482J2151J2333J2071J2129J2399J2170J1804J2313
57183D00183J3373J3702J3356J3634J4748J5529J5648J6092J7215J8104J8321
57172E69905J8607J9508K0738K2126K3814K5342K5958K5985K6498K7630K8484
57161H34595K8723K8854K8991K8798K8607K9141L0126L0588L0536L0866L1677
57150A161502L2168L2221L2594L3452L4157L4502L4846L5072L4814L4588L5191
57139A535107L6118L6220L5751L6065L7310L8293L8635L9246M0481M1642M2688
57128A957556M4620M7709N1053N4245N7871O1954O5622O8731P2182P6275Q0485
57117B638303Q5233R1872J00316J08586J15550J22235J29717J37806J46844J58672
$$ plain form
57194 269995 280355 291331 302813 314964 327297 339368 351497 363896 376066 387870 400183
57183 400183 413556 427258 440614 454248 468996 484525 500173 516265 533480 551584 569905
57172 569905 588512 608020 628758 650884 674698 700040 725998 751983 778481 806111 834595
57161 834595 863318 892172 921163 949961 978568 1007709 1037835 1068423 1098959 1129825 1161502
57150 1161502 1193670 1225891 1258485 1291937 1326094 1360596 1395442 1430514 1465328 1499916 1535107
57139 1535107 1571225 1607445 1643196 1679261 1716571 1754864 1793499 1832745 1873226 1914868 1957556
57128 1957556 2002176 2049885 2100938 2155183 2213054 2275008 2340630 2409361 2481543 2557818 2638303
57117 2638303 2723536 2815408 2915724 3024310 3139860 3262095 3391812 3529618 3676462 3835134
57107C835134J74198J91954K10851K32995K62088L00377L49028M10120M86345
57098F453090N79767O93044Q31001R98603J197496J426003J681783J962463K264340
57089A8087590K582067K907903L227747L518671L754758L916407L991949L973968
57081D5961060L864688L687840L480834L256387K969318K534966J892534J053242
57073F8700869R0404r06443j863472k724645l445780l996947m366057m555745
57065D6932184m579303m460649m232492l928983l579601l209485k840726k489669
57057A7611276k164827j870049j608257j380534j184299j015447q71288p49528
57049F767047o46298n57792m82555m19926l67481l22227k83111k50098k21905
$$ plain form
57107 3835134 4009332 4201286 4412137 4645132 4907220 5207597 5556625 5966745 6453090
57098 6453090 7032857 7725901 8556902 9555505 10753001 12179004 13860787 15823250 18087590
57089 18087590 20669657 23577560 26805307 30323978 34078736 37995143 41987092 45961060
57081 45961060 49825748 53513588 56994422 60250809 63220127 65755093 67647627 68700869
57073 68700869 68791273 67884830 66021358 63296713 59850933 55853986 51487929 46932184
57065 46932184 42352881 37892232 33659740 29730757 26151156 22941671 20100945 17611276
57057 17611276 15446449 13576400 11968143 10587609 9403310 8387863 7516575 6767047
57049 6767047 6120749 5562957 5080402 4660476 4292995 3970768 3687657 3437559 3215654
57040C215654j96946j75386j57899j43234j29309j15980j04486r4785q5585p6329
57030A935715o7156n7525m6830l5597k4128j0770O551K7769N0764P1719Q3084
57019A933596P4265L9835j2620o6155j06646j29556j36814j32162j20436j06837
57009A236470r4114q2004p0201n9852n1577m4510l8188l3275k9748k6472k3158
56998F83371k0696j8996j6755j3872j1799j0861r538p134m828l245j275J703M702
56985E70777P264J0634J5481K0291K3103K3074J9526J1611L23j0929j9109k3699
56973F48347k5464k4874k2743k0501j8572j5968j2458r450p675n863k846P39M038
56960D86710P595J2058J6890K1657K6849L1816L3429K8575J7327K511j2616k5198
$$ plain form
57040 3215654 3018708 2843322 2685423 2542189 2412880 2296900 2192414 2097629 2012044 1935715
57030 1935715 1868559 1811034 1764204 1728607 1704479 1693709 1700260 1728029 1778793 1850512 1933596
57019 1933596 2007861 2047696 2035076 1968921 1862275 1732719 1595905 1463743 1343307 1236470
57009 1236470 1142356 1060352 990151 930299 878722 834212 796024 762749 733001 706529 683371
56998 683371 662675 643679 626924 613052 601253 590392 580854 573720 568892 565647 564372 566075 570777
56985 570777 578041 588675 604156 624447 647550 670624 690150 701761 702084 691155 672046 648347
56973 648347 622883 598009 575266 554765 536193 520225 507767 498317 490642 484779 481933 482672 486710
56960 486710 494305 506363 523253 544910 571759 603575 637004 665579 682906 685417 672801 647603
56948F47603l2921l5259l3972l1153k7430k2827j8165j4333j1060p595l896k27
56936D08765L612P833J2198J6775K2325K9304L6980M3718M7029M3594L1309J2121
56924G15563q557k6017l8586m5961m7727m4701l9574l4569k9751k4640j9909j6213
56912C39358j3074j0207q468q115p725o241m579l828l383k359j394j311j410p72
56898B66492m5k12p47n90J07P76J810L598N325O454Q248J2039J7033K1454K4746
56883C66488K6751K5789J9929R846j392j1072j7991k1654k2130k0409j7473j3343
56871C23339q114l100N68L640P471J1805J5535J9123K4405L2151M1489N1595O2306
56858E82213P2655P9605P8601O5649M0352P998k2473m4210n6094o0526n9384n3502
$$ plain form
56948 647603 614682 579423 545451 514298 486868 464041 445876 431543 420483 412888 408992 408765
56936 408765 412377 420210 432408 449183 471508 500812 537792 581510 628539 672133 703442 715563
56924 715563 707006 680989 642403 596442 548715 504014 464440 429871 400120 375480 355571 339358
56912 339358 326284 316077 307609 299494 291769 285528 280949 277121 273738 271379 269985 268674 267264 266492
56898 266492 266447 266235 265488 264898 265005 265781 267591 271189 276514 282968 291216 303255 320288 341742 366488
56883 366488 393239 419028 438957 448803 447411 436339 418348 396694 374564 354155 336682 323339
56871 323339 315225 312125 312693 316333 323804 335609 351144 370267 394672 426823 468312 519907 582213
56858 582213 654868 734473 813074 878723 919075 927073 904600 860390 804296 743770 684386 630884
56846F30884m4477l4567k5050j6202q298j217O224J5060K4871L5027M6354O0150
56834F88759P6419R4317J12650J27470J30367J12812P3641K1218l1757p4684j01994
56823A229218j13268j11980j02869q9494p4176n9233m6542l6125k6625j7245q044
56812E43617J328J1736K3331L5541M8398O2616P7770R0697R5654Q6474O0373K1328
56800A158863k0824n6048p9229r0219r0960q4233p3613o2208n1282m1123l2446
56789D76678k5590j9360j2422n208J165P051J3691K1165K8731L6385M3919M8734
56777F14939M6652L5400J6371o456k8055m3846n1894n3749n2046m7846m1505l4710
56765C53255k9437k5554k1608j7534j4482j2467j0371q093o581n865m976l772
$$ plain form
56846 630884 586407 551840 526790 510588 502290 501073 507297 522357 547228 582255 628609 688759
56834 688759 765178 859495 972145 1099615 1229982 1342794 1416435 1437653 1405896 1331212 1229218
56823 1229218 1115950 1003970 901101 811607 737431 678198 631656 595531 568906 551661 543617
56812 543617 544945 556681 580012 615553 663951 726567 804337 895034 990688 1077162 1137535 1158863
56800 1158863 1138039 1081991 1002762 912543 821583 737350 663737 601529 550247 509124 476678
56789 476678 451088 431728 419306 414098 415263 422314 436005 457170 485901 522286 566205 614939
56777 614939 661591 696991 713362 706906 678851 635005 583111 529362 477316 429470 387965 353255
56765 353255 323818 298264 276656 259122 244640 232173 221802 213709 207128 201263 196287 192515
56753A92515l040k950l063l453m172m170k704j089r96j688j303k09l23j540j779
56738A60036n82K32j66n51k43j53n20k51P56J009M6n98J5P92O90K61K39L57M54
56719A61823J038J927K106J526J384K020K327J817J429J641J678J281J340J982
56705A85319J956Q02j40Q7O18M52RM0L24L83K09l25j421k314j770j12Q89N82J51
56686A85739L47M04j49m93r9M54R30J859K853K477O62o98n13J01J25K95J238J922
56668A97454J442P00Q26J408J606J641J795J336j53j502j404j97Q56J164Q11n8
56652B07725r70j311j322j885k840k955k105j799k792l776l392k072q81j6O23
56637A80232O96K24m6K01M79P37J503K440K430J567J191J438R40m23q53K72R98
$$ plain form
56753 192515 189475 186525 183462 180009 175837 171667 168963 167874 166878 165190 163887 163678 163355 161815 160036
56738 160036 159454 159686 159520 158969 158726 158573 158053 157802 158558 159567 159613 159015 159030 159822 160512 160773 161012 161369 161823
56719 161823 162861 164788 166894 168420 169804 171824 174151 175968 177397 179038 180716 181997 183337 185319
56705 185319 187275 188077 187937 188024 188642 189094 189103 189143 189467 189850 190059 189734 188313 185999 184229 184117 185006 185588 185739
56686 185739 186086 186490 186341 185848 185749 186203 187133 188992 191845 194322 194984 194286 193773 193874 193999 194294 195532 197454
56668 197454 198896 199596 200422 201830 203436 205077 206872 208208 208055 206553 205149 204952 205808 206972 207783 207725
56652 207725 206755 205444 204122 202237 199397 196442 194337 192538 189746 185970 182578 180506 179625 179609 180232
56637 180232 180928 181152 181106 181307 181786 182523 184026 186466 188896 190463 191654 193092 194032 193609 192756 193028 194026
56620A94026j23j758k099j440q32j44Q81J330O49n4K08P42Q03J059J876J889J70
56603A97183j820k248j519j057q87k70M06K89k76l94o4K93P73J208P62n01j004
56586A90874J41J628K022J777J846J819J132N81R45J408R95L62N52J266J790K307
56570B11445K872K595J353P42J662K652K333J753K379L451L549L292M173N930
56556B50181P241P892Q120P132M489J857J095J561J461Q30R42J646J677R49M10
56541B97483J53m13j107j414j688k302k465j593q27j442k745l282l086k973k780
56526B69519k158j929k769l606l268k436k150j768n13M61j38j255j273q73j597
56511B44247k769k615j410p83q26n45l06j076k047j749q27r55j746j518m40j12
$$ plain form
56620 194026 193903 192145 190046 188606 187774 187630 188511 189841 190490 190436 190644 191386 192189 193248 195124 197013 197183
56603 197183 195363 193115 191596 190539 189652 189382 189788 190077 189801 189407 189343 189636 190409 191617 192379 191878 190874
56586 190874 191015 192643 194665 196442 198288 200107 201239 201820 202765 204173 205168 205530 206082 207348 209138 211445
56570 211445 214317 216912 218265 219007 220669 223321 225654 227407 229786 233237 236786 240078 244251 250181
56556 250181 257422 265314 273434 280566 285055 286912 288007 289568 291029 291859 292801 294447 296124 297073 297483
56541 297483 297636 297223 296116 294702 293014 290712 288247 286654 285827 284385 281640 278358 275272 272299 269519
56526 269519 267361 265432 262663 259057 255789 253353 251203 249435 248922 249383 249245 247990 246717 245844 244247
56511 244247 241478 238863 237453 236670 235844 235299 234993 233917 231870 230121 229294 228339 226593 225075 224635 224523
56495B24523n39l72L60M85K22O49J168L36j133j135L05J164Q96Q61J326J014k12
56478B29918r54q68j001j341o41R82J766J087K70K74O49J048J659J994J232j50
56462B35924r15j070j425j637q56K30L14j2Q06K263K439J348Q92J513J770J226
56446B42810R80J120M67q34j128q8P15N26K29J75m71j725k375j982j296n07Q10
56429B37426K077K159J441J319J793J735J205J098R53k88j715j471p4K74n67o82
56413B46683K25M24l55m20N19O90l42p60K83J406J660J710J689O91q79j227j64
56396B51833M80R1K30J647L034L506L769M048L364J654J94o50j767l010l033j862
56380B63528j055j029o82J30M22N55J875L813M273L202K672L178L096K074J555
$$ plain form
56495 224523 223984 223612 223972 224457 224679 225328 226496 226832 225699 224564 224869 226033 226929 227790 229116 230130 229918
56478 229918 228964 228096 227095 225754 225113 226095 227861 228948 229218 229492 230141 231189 232848 234842 236074 235924
56462 235924 235009 233939 232514 230877 230021 230251 230565 230553 231359 233622 236061 237409 238301 239814 241584 242810
56446 242810 243790 244910 245377 244543 243415 243327 244042 244568 244797 244972 244501 242776 240401 238419 237123 236616 237426
56429 237426 239503 241662 243103 244422 246215 247950 249155 250253 251206 250918 249203 247732 247658 247932 247365 246683
56413 246683 246908 247332 246977 246557 247076 247766 247424 246664 246947 248353 250013 251723 253412 254103 253224 251997 251833
56396 251833 252313 252404 252634 254281 257315 260821 264590 268638 272002 273656 273850 273200 271433 268423 265390 263528
56380 263528 262473 261444 260762 260892 261314 261869 263744 267557 271830 275032 277704 280882 283978 286052 287607
56365B87607J584N97j062j067P27J679P33j59R1J37m93j82J372K159J469J119
56349B96311J810J867Q42O82J861K047K82j114n78K66L9K6J211K189K033K054
56333C11828K905L022J813J230K302L188K590J940K375K643J880J442K048K253
56319C43459J479J402K562K893J485M05Q73J142K17R2J913L467K996K145K570
56304C69100K937J956J229K261L645L817L840M835N528M866M211M536M345K817
56290D19923J941L054M255L880L496M789O447O852O914P643P802O626N953P017
56276D96592Q057P732P812R747J1702J1772J1224J1725J2330J2067J2429J4478
56264F27667J6395J6713J7079J9080K1432K3032K5477K9830L4132L7119M0964
$$ plain form
56365 287607 289191 289788 288726 287659 288386 290065 290798 290639 290730 290867 290374 290192 291564 293723 295192 296311
56349 296311 298121 299988 300830 301512 303373 305420 305702 304588 304010 304276 304315 304341 305552 307741 309774 311828
56333 311828 314733 317755 319568 320798 323100 326288 328878 330818 333193 335836 337716 339158 341206 343459
56319 343459 344938 346340 348902 351795 353280 353685 354558 355700 355917 356009 357922 361389 364385 366530 369100
56304 369100 372037 373993 375222 377483 381128 384945 388785 393620 399148 404014 408225 412761 417106 419923
56290 419923 421864 424918 429173 433053 436549 441338 447785 454637 461551 469194 476996 483622 489575 496592
56276 496592 504649 512381 520193 529940 541642 553414 564638 576363 588693 600760 613189 627667
56264 627667 644062 660775 677854 696934 718366 741398 766875 796705 830837 867956 908920
56253I08920M7419N4621O0821O7728P6896Q6386R4392J02623J12620J22273J29554
56242A864253J35974J42750J47191J46882J43762J39855J32577J18759J00023
56233C072026P9643N7285L1495M522k0093m2273o3461q2404r7063j08278j17637
56222B713762j24204j27013j27890j28151j25684j19121j11406j05326r9175r1053
56212A554739q3515p9183p5554o9314o2269n7662n4135m8796m3056l9776l7525
56201I03954l3392k8677k6191k4616k1193j7329j5893j5475j3045r823q824q998
56189F80498p498n382n374o254n156l158l022l699k708j490k630m271l163p73
56175F25920m50j051M87K744K304L69N65K337K703K351L737N416M588L072M325
$$ plain form
56253 908920 956339 1010960 1071781 1139509 1216405 1302791 1397183 1499806 1612426 1734699 1864253
56242 1864253 2000227 2142977 2290168 2437050 2580812 2720667 2853244 2972003 3072026
56233 3072026 3151669 3208954 3240449 3244971 3224878 3182605 3119144 3036740 2939677 2831399 2713762
56222 2713762 2589558 2462545 2334655 2206504 2080820 1961699 1850293 1744967 1645792 1554739
56212 1554739 1471224 1392041 1316487 1247173 1184904 1127242 1073107 1024311 981255 941479 903954
56201 903954 870562 841885 815694 791078 769885 752556 736663 721188 708143 698320 689496 680498
56189 680498 673000 667618 662244 655990 650834 647676 644654 640955 638247 636757 634127 629856 626693 625920
56175 625920 625470 624419 624906 627650 629954 630323 630888 633225 635928 638279 642016 647432 652020 655092 659417
56160F59417O857P057O104P409R689R511Q415J0314J3970J5223J4692J6100J8927
56147H03685K0012K0447K3590K8236L1147L4219M1581N1709O0274O8682Q1577
56136A265159R7691J11456J21884J31273J36691J31860J17050R8942Q1539O5163
56126B358708N2942M9176N1425N2251M8457M1380L0066J2802n851j8579k5181
56115B647596l0959l7134m1725m8026o2048q2162j00592j14289j25134j30993
56105A874534j27083j15697j04210r3722p9722o3365n1283m4236l6664k7819k2594
56094A108139k0865j6869j0005n815n318l703l28L69j352l42L315M346K837M093
56080A058502P788Q354O312P755J2212J2909R678R404J2890J3701J1073J1249
$$ plain form
56160 659417 666274 673331 679435 686844 696533 706044 714459 724773 738743 753966 768658 784758 803685
56147 803685 823697 844144 867734 895970 927117 961336 1002917 1054626 1114900 1183582 1265159
56136 1265159 1362850 1474306 1596190 1727463 1864154 1996014 2113064 2212006 2293545 2358708
56126 2358708 2411650 2460826 2512251 2564502 2612959 2654339 2684405 2697207 2691356 2672777 2647596
56115 2647596 2616637 2579503 2537778 2489752 2427704 2345542 2244950 2130661 2005527 1874534
56105 1874534 1747451 1631754 1527544 1433822 1354100 1290735 1239452 1195216 1158552 1130733 1108139
56094 1108139 1087274 1070405 1060400 1054585 1049267 1045564 1045236 1045605 1044253 1043911 1047226 1051572 1054409 1058502
56080 1058502 1066290 1074644 1080956 1088711 1100923 1113832 1123510 1132914 1145804 1159505 1170578 1181827
56068A181827J4702J4950J1657J1855J6305J7737J4752J4230J7723J8725J5865
56057A350328J5324J7819J6749J1794J0479J3650J3635R464R284J4603J7066J4374
56045A514569J4294J9143K1560J9704K1243K7846L1167K8747K8437L2590L3636
56034A792936L0023L0321L6515L9493L6239L5054L8685L9223L4994L5055M1382
56023B189920M4345M1458M2454M9885N3625N0766N1683N9646O4235O1958O3168
56012B773143P1207P5475P2783P4320Q3470Q8649Q6396Q8917R9964J06722J04910
56001C725956J07713J19870J27983J27067J30998J45308J56087J57614J63696
55992D962292J79270J89229J88607J94372K13365K29071K34804K48019K76042
$$ plain form
56068 1181827 1196529 1211479 1223136 1234991 1251296 1269033 1283785 1298015 1315738 1334463 1350328
56057 1350328 1365652 1383471 1400220 1412014 1422493 1436143 1449778 1459242 1468526 1483129 1500195 1514569
56045 1514569 1528863 1548006 1569566 1589270 1610513 1638359 1669526 1698273 1726710 1759300 1792936
56034 1792936 1822959 1853280 1889795 1929288 1965527 2000581 2039266 2078489 2113483 2148538 2189920
56023 2189920 2234265 2275723 2318177 2368062 2421687 2472453 2524136 2583782 2648017 2709975 2773143
56012 2773143 2844350 2919825 2992608 3066928 3150398 3239047 3325443 3414360 3514324 3621046 3725956
56001 3725956 3833669 3953539 4081522 4208589 4339587 4484895 4640982 4798596 4962292
55992 4962292 5141562 5330791 5519398 5713770 5927135 6156206 6391010 6639029 6915071
55983F915071L01035L15666L38774L77858M12659M35183M67620N19955N70159
55974A0653980O08597O59493P34432Q09778Q76380R64036J088336J223784J360223
55965A8979039J532009J758698K015633K299842K661971L133896L694490M349087
55957D0424665N162633O165390P318944Q639894J0265110J2338664J4957889J8300824
55949A23574013K2642475K8128020L4669816M2039678M9481225N4703296N3747021
55942D08985544M3164126K3207383j289641k3683705l9393795m7457435m9310640
55935C14221837m6965189m2195634l6441863l0699667k5448769k0855304j7004161
55928I4611250j3898196j1407505r378287p743038o460743n436678m580456l875489
$$ plain form
55983 6915071 7216106 7531772 7870546 8248404 8661063 9096246 9563866 10083821 10653980
55974 10653980 11262577 11922070 12656502 13466280 14342660 15306696 16395032 17618816 18979039
55965 18979039 20511048 22269746 24285379 26585221 29247192 32381088 36075578 40424665
55957 40424665 45587298 51752688 59071632 67711526 77976636 90315300 105273189 123574013
55949 123574013 146216488 174344508 209014324 251054002 300535227 355238523 408985544
55942 408985544 452149670 475357053 474067412 450383707 410989912 363532477 314221837
55935 314221837 267256648 225061014 188619151 157919484 132470715 111615411 94611250
55928 94611250 80713054 69305549 59927262 52184224 45723481 40286803 35706347 31830858
55920C1830858l322283k871709k473285k133404j868922j651445j447780j269716
55912A4792314j135746j024604r10806q07920p35027o75562o08177n45184n03667
55903G845621m69549m25173l83093l59330l40798l10927k81228k66902k56288
55894D752333k34062k10873k01264j94709j76459j55874j47208j42274j28149
55885C161461j12864j08253j05502r2241p6650p0956o7695n5619m3267m3783n0866
55874B333765n1776n0238n5355o1446n9670n6780o2255o8996o6197n9415n9066
55863A682571o0736n5555m8654m8895n1024m6004l8878l8852m1509l7872l1587
55852A183005l0569l0919k5471j9150j9926k3285k1270j8077k1227k6038k4339
$$ plain form
55920 31830858 28508575 25636866 23163581 21030177 19161255 17509810 16062030 14792314
55912 14792314 13656568 12631964 11721158 10913238 10178211 9502649 8894472 8349288 7845621
55903 7845621 7376072 6950899 6567806 6208476 5867678 5556751 5275523 5008621 4752333
55894 4752333 4518271 4307398 4106134 3911425 3734966 3579092 3431884 3289610 3161461
55885 3161461 3048597 2940344 2834842 2742601 2665951 2594995 2527300 2471681 2428414 2384631 2333765
55874 2333765 2281989 2231751 2176396 2114950 2055280 1998500 1936245 1867249 1801052 1741637 1682571
55863 1682571 1621835 1566280 1517626 1468731 1417707 1371703 1332825 1293973 1252464 1214592 1183005
55852 1183005 1152436 1121517 1096046 1076896 1056970 1033685 1012415 994338 973111 947073 922734
55841I22734k0295k2051k5811k3509j8625j9103k1770j8882j3419j3022j5122
55830G11125j2598q135q775j1836j0104n678n299p231n766l454o055j0502j0385
55817F05307q273j0264j3581j1936q037q291j0181p297k156j540l472j200L890
55804E22969N438M399O434J0479J1332J0248J1903J4232J2002P073M566K538l899
55791F19714j1907j5049j4599j6169j8596j6816j2428j0742j0429o676j681j610
55779D83012n686q385r596j2708j5561j3470q515o002m501P96P882J1183J1826
55766D30275J4249J5609R589j455q975j1254j3456j6383j5926j2642j1469j2277
55754C65885j0413o189m515n650n401l848m910p931q508p031p708r874r062n877
$$ plain form
55841 922734 902439 880388 854577 831068 812443 793340 771570 752688 739269 726247 711125
55830 711125 698527 690392 681617 669781 659677 653999 648700 641469 635703 632249 626194 615692 605307
55817 605307 597034 586770 573189 561253 553216 544925 534744 527447 525291 523751 520279 519079 522969
55804 522969 528407 532806 539240 549719 561051 571299 583202 597434 609436 616509 621075 623613 619714
55791 619714 607807 592758 578159 561990 543394 526578 514150 503408 492979 486303 484622 483012
55779 483012 477326 468941 459345 446637 431076 417606 409091 403089 398588 399384 407266 418449 430275
55766 430275 444524 460133 469722 468267 459292 448038 434582 418199 402273 389631 378162 365885
55754 365885 355472 349283 344768 339118 333717 329869 324959 317028 308520 301489 293781 283907 274845 268968
55740B68968n127o712o018k879j516k163j218P73j84l233l454p25M17o92n83N05
55724B36159j115m662n524l747l719n515m806j511k85j893k130Q5J315R59K362
55709B05973N790P543O794O395O540M568J292M40J532L60l279n424n514o810r115
55694B17085q648n589m305n439n022k257q17j576j144J260K427J661J936L677
55680A93249L934K641L038N213N750M339M058M678K749j149k484q35n89k696l238
55665B18658j328q62k777l035k99J566Q19O36K452L302K130K099M191M980L260
55650B35792K490M152M790K334n57k003l856o676p574n791m853o489p802o971
55636A96986o305p140p118n218m187n228n442l228j282j517j867q04k26j219j614
$$ plain form
55740 268968 263841 257129 251111 248232 246716 244553 243335 244108 243924 240691 237237 236512 236929 236237 235654 236159
55724 236159 235044 230382 224858 221111 217392 211877 207071 205560 205275 203382 201252 201337 202652 203611 205973
55709 205973 211763 219306 226100 232495 239035 243603 244895 245335 246867 247227 243948 238524 233010 226200 217085
55694 217085 208437 202848 198543 193104 188082 185825 185008 183432 182288 183548 185975 187636 189572 193249
55680 193249 197183 199824 202862 208075 213825 218164 222222 226900 229649 228500 226016 225181 224592 221896 218658
55665 218658 217330 216468 213691 210656 210357 211923 212742 213378 215830 219132 221262 223361 227552 232532 235792
55650 235792 238282 242434 247224 249558 249001 246998 243142 236466 228892 223101 218248 211759 203957 196986
55636 196986 190681 183541 176423 171205 167018 161790 156348 153120 151838 150321 148454 147650 147424 146205 144591
55621A44591l58J70j236k138j031l8p13j411j035j120k092j834l1N25j063j953
55605A29233p99q6j222j906p89j45j409k482j868j342k078k318j174n74j273j101
55589A08667O75J505K37o03N61J708J398J277K264K489J335J224L040M073K853
55574A32703J742K448L233K976L679O329Q571Q959R376J0717J0520P517M274K591
55560B15635N79k954n563n553n144o203o898n684m574n211n636m242l122m092
55546A51338n018l578j303m97l72N10J060J06q69m75Qm83m02J153K057Q56l60
55529A43731L42J324O29m76k70J25p41j670j295q13j409j716n39O72O73Q70K359
55512A41796L480K960K485L424L943K155p59l127n536q407r911r059p864p800
$$ plain form
55621 144591 144233 144403 143167 141029 139998 139960 139247 137836 136801 135681 133589 131755 131724 132249 131186 129233
55605 129233 128434 128348 127126 125220 124431 124286 122877 120395 118527 117185 115107 112789 111615 111041 109768 108667
55589 108667 109342 110847 111084 110481 111042 112750 114148 115425 117689 120178 121513 122737 125777 129850 132703
55574 132703 134445 136893 140126 143102 146781 153110 161681 170640 180016 190733 201253 208770 213044 215635
55560 215635 216214 213260 207697 202144 197000 190797 183899 178215 173641 168430 162794 158552 155430 151338
55546 151338 146320 142742 141439 140942 140570 141080 142140 142246 141377 140902 140910 140427 140025 141178 143235 144091 143731
55529 143731 144073 145397 146026 145550 145280 145405 144664 142994 141699 140886 139477 137761 137222 137894 138567 139437 141796
55512 141796 145276 148236 150721 154145 158088 160243 159484 156357 150821 142414 132503 123444 115580 107780
55498A07780p166m684k403k102k017k22J764J912J282J572J873R44M1M54Q70K1
55482I9919p55l28j96j382j953n35Q18K54n77J07P77j86j082j32R63K38p65p5
55464I5110Q37m2j313r16m1n14r59M90K224J857N08M82J042M22l06O16J797J032
55446A02326o18r83q74k033l086j804N00R73qj18M78O1q10l95N64K08p17k32J027
55427I4459J007M6q6L65J29j8J213K483J816M11P57K272K538J678J701K593K751
55410A16115K434L102M152L709J928L62r27k605l624k784j498j744k710k632k364
55395A10914l470m451k921j81N04q07j220m1P60N85P35J251R05R2L55J345J446
55378A05801Q51Q45Q48n19k190j972m24M4p18q24j28j90r87j086o77j105j903
$$ plain form
55498 107780 100614 95930 93527 91425 89408 89186 90950 92862 94144 95716 97589 98533 98574 99028 99898 99919
55482 99919 99164 98836 98640 97258 95305 94770 95588 95842 95265 95372 96149 95963 94881 94749 95712 95950 95185 95110
55464 95110 95947 95905 94592 93676 93635 93121 92162 92652 94876 96733 97241 97723 98765 99187 98881 99497 101294 102326
55446 102326 101708 100725 99851 97818 94732 92928 93428 94401 94393 94275 94753 94814 94004 93609 94173 94381 93664 93432 94459
55427 94459 95466 95512 95426 95791 95920 95902 97115 99598 101414 101825 102582 104854 107392 109070 110771 113364 116115
55410 116115 118549 121651 125803 129512 131440 131802 130875 128270 124646 121862 120364 118620 115910 113278 110914
55395 110914 107444 102993 100072 99891 100395 99588 98368 98327 99087 99672 100407 101658 102563 102655 103010 104355 105801
55378 105801 106652 107497 108345 107826 105636 103664 103240 103284 102566 101742 101614 101424 100437 99351 98674 97569 95666
55361I5666j598r09j649l064k755p83N54N99N44L13j072k495j768M92J557R28
55345H4560N28Q79O67n7J53R84O68n04m90P77J332P76N35O59p4r87j35J829K159
55326I4259N97k80L62N36n15j020l19k20j522k519k084j341j085l87J136K148
55310H7746J809Q98Q0p95j257m61Q42R71J65K42J266J287k59j607j611j049n06
55293H7761N11J858K467K212J923J478J61j197j012K14M62m62q25j78J76k0L46
55276I5875J147R49k33q93q27j200j763j111K11N3j558k197j029J15J75K16O68
55259H8598M13n82p24K60P18J65J65J251J854J153K98o4p58j717j469P5J019N64
55241I1219J47O04Q97M52K55O80P28K28K86Q49N16n90n63Q25J423M33k00O79J433
$$ plain form
55361 95666 94068 93159 91510 88446 85691 84908 85462 86061 86605 86918 85846 83351 81583 82075 83632 84560
55345 84560 85088 85967 86634 86577 86730 87714 88382 87878 87388 88165 89497 90273 90808 91467 91393 90406 90271 92100 94259
55326 94259 94856 94576 94938 95474 94959 93939 93620 93400 91878 89359 87275 85934 84849 84462 85598 87746
55310 87746 89555 90453 90533 89738 88481 88020 88862 89833 89998 90240 91506 92793 92534 90927 89316 88267 87761
55293 87761 88272 90130 92597 94809 96732 98210 98371 97174 96162 96376 96838 96376 95551 95373 95549 95529 95875
55276 95875 97022 97971 97738 96845 96018 94818 93055 91944 92155 92208 90650 88453 87424 87539 87714 87930 88598
55259 88598 89011 88429 87705 87965 88683 88848 89013 90264 92118 93271 93569 93505 92747 91030 89561 89636 90655 91219
55241 91219 91366 91970 92867 93319 93574 94254 94982 95210 95496 96345 96861 96271 95708 96533 97956 98389 98189 98868 100301
55222A00301O99k69m7N33J24r34j643j838j508l75R26J074K18nQ11J288R09Q72
55204A01136J522J443K1j345j571j252r67l75K59o2r92r87q5n5j155j477l09O44
55186I4393L53R7P71J284Q35L37L52N6o58n33N18Q11o0k96P98J358K90o96j06
55167I9904Q20N01l87n27j68K6M41J209J328M39k24R7N33N01P04J232R15l22q50
55148A06172k08j05j297k029j120k4q5k43O40J494J096L60N68J138J007N57M62
55131A08383K71l39n65j47j72r60j113k7P21Mr61q49l20k42K0Q56J059K5o71J78
55111A05151J270R65j45o92p68r38p13J92P28L15J08Q86J452Q03N3M29J133R84
55093A11213N21O99J033P91N19P62P88J26k69K07N77K30J86R97J345L81n75l47
$$ plain form
55222 100301 101000 100731 100684 101217 101341 100407 98764 96926 95418 95043 95969 97043 97261 97256 98067 99355 100264 101136
55204 101136 102658 104101 104122 102777 101206 99954 98987 98612 98871 98809 97817 96830 96745 96690 95535 94058 93749 94393
55186 94393 94746 94843 95614 96898 97733 98070 98422 98478 97820 97287 97805 98616 98556 98260 99058 100416 100706 100010 99904
55167 99904 100724 101225 100838 100311 100143 100169 100610 101819 103147 103586 103362 103459 103992 104493 105197 106429 107344 107022 106172
55148 106172 105964 105859 104562 102533 101413 101389 101304 101061 101701 103195 104291 104651 105219 106357 107364 107921 108383
55131 108383 108654 108315 107750 107603 107431 106471 105358 105331 106052 106056 105095 104246 103926 103684 103704 104560 105619 105644 104973 105151
55111 105151 106421 107386 107241 106549 105781 104843 104130 104322 105050 105365 105473 106359 107811 108614 108667 109096 110229 111213
55093 111213 111734 112433 113466 114257 114776 115538 116326 116452 116183 116390 116967 117197 117383 118380 119725 120106 119531 119184
55075A19184J03k73n96J2N45L8n15j53J38n30j003k56M34k74j311j186o40r66
55057A12751j437q14J30P1l76k7M80j5q44p29j06l9q8N53J129O35j63j36J26k84
55037A10817n96J17P89J02r93q24J87N14K09K91N32J20m86m52k70o73r26j87O82
55018A08953O20L31P84J205N95j33K62J071J109R53J540K023J421P82J297J830
55002A24643Q90n00o09j11n20j103m13M77l85k096k209r03l89q15k93J323K072
54985A19059J415R23J245J177K19n00k29M72J020J227O50o82j404n15P52Q10M00
54968A26039J096K095J424m03r82K4N79j08n77N0Q21J014J054J085O81J86M00
54951A34478R03O29p6n7L47j95j383j546m73L50L02K13L47Q7l66j18M63J32q74
$$ plain form
55075 119184 119287 119014 118418 118430 118975 119013 118498 118345 118483 117953 116950 116694 117128 116854 115543 114357 113717 112751
55057 112751 111314 110500 110630 110701 110325 110298 110778 110763 109919 109190 109084 109045 108957 109510 110639 111274 111111 110975 111101 110817
55037 110817 110221 110338 111127 111229 110236 109412 109599 110113 110322 110613 111145 111265 110779 110327 110057 109384 108458 108271 108953
55018 108953 109573 109904 110688 111893 112488 112355 112617 113688 114797 115750 117290 119313 120734 121516 122813 124643
55002 124643 125533 125033 124424 124313 123793 122690 122277 122754 122369 120273 118064 117161 116772 115957 115664 116987 119059
54985 119059 120474 121397 122642 123819 124038 123538 123309 123781 124801 126028 126678 125996 124592 124077 124829 125639 126039
54968 126039 127135 129230 130654 130251 129269 129293 129872 129764 129187 129237 130058 131072 132126 133211 133892 134078 134478
54951 134478 135381 136010 135934 135877 136224 136029 134646 133100 132627 132977 133279 133492 133839 133926 133560 133442 133905 134037 133163
54932A33163r81O6Q93R62J287K364L398L862M077M072L640L518M724O709P941
54917A79695Q201Q445Q564P297M412J098j832m373o211o989p434q353q805p379
54903A66336m814l246l046k723j794j365j820k202k102k089k129j551o28k18L
54888A36612R82K188K283J632J808K754K957K376K625M037N181N580O395P955
54874A85365Q969Q776Q033O781M156N40k286l798n221o848p244o012m972n505
54860A80734o633o763n733m217k648j598j739k716l310l074k586k003r58L3j52
54845A36637j371k268k354k312k211j383j47K62k66o24n61q90j542j473p07l53
54829A18437n01j39O58P03Q2K00J190J603J058P68R61L41j244k082j345l15J1
$$ plain form
54932 133163 132182 132248 133141 134103 135390 137754 141152 145014 149091 153163 156803 160321 165045 171754 179695
54917 179695 187896 196341 204905 212202 216614 217712 215880 211507 205296 198307 190873 182520 173715 166336
54903 166336 161522 158276 155230 152507 150713 149348 147528 145326 143224 141135 139006 137455 136827 136609 136612
54888 136612 137594 139782 142065 143697 145505 148259 151216 153592 156217 160254 165435 171015 177410 185365
54874 185365 194334 203110 211143 217924 222080 222620 220334 216536 211315 204467 197223 191211 186239 180734
54860 180734 174101 167338 161605 157388 154740 153142 151403 148687 145377 142303 139717 137714 136756 136789 136637
54845 136637 135266 132998 130644 128332 126121 124738 124591 124853 124587 123963 123402 122512 120970 119497 118790 118437
54829 118437 117936 117797 118455 119158 119240 119440 120630 122233 123291 124059 125020 125361 124117 122035 120690 120375 120386
54812A20386K24O22K99q90j576j039k39J78Q22J788K029J397J152J623J485L28
54796A28589l31L57J130R90Q51J535K094J594P69N85O77M78L09L32o7q25p54M56
54778A38769J461J413J213J680K203K209K307K904L390L620M495O156P377P684
54764A86881Q192R268R410P720N520M119K784M95k033l684m847o354p795q338
54750B01338q101p523o512n285m770n064m843l386j813j226j058m37K58M17M69
54735A52464Q31Q87J71n88p80r56j493j455L1K359M447O084P305P640P009O269
54719A90225O033N913N576N247M561K425j142m458o278p055p446p188o281n609
54705A74523n456m917l620k476j976j457q19j046k186k760k202j834k310k311
$$ plain form
54812 120386 120610 121232 121531 120641 119065 118026 117787 117965 118787 120575 122604 124001 125153 126776 128261 128589
54796 128589 128258 128615 129745 130735 131586 133121 135215 136809 137578 138163 138840 139318 139627 139959 139892 139067 138313 138769
54778 138769 140230 141643 142856 144536 146739 148948 151255 154159 157549 161169 165664 171820 179197 186881
54764 186881 195073 204341 213751 221471 226991 231110 233894 234389 232356 228672 223825 217471 209676 201338
54750 201338 193237 185714 179202 173917 169147 164083 159240 155854 154041 152815 151757 151320 151578 151995 152464
54735 152464 153295 154182 154353 153765 152985 152029 150536 149081 149112 151471 155918 162002 169307 176947 183956 190225
54719 190225 196258 202171 207747 212994 217555 219980 218838 214380 208102 201047 193601 186413 180132 174523
54705 174523 169067 164150 160530 158054 156078 154621 153802 152756 150570 147810 145608 143774 141464 139153
54691A39153j045P7j45o29p4P92P95M19N39O17m9p21n63j81l53n91m19n57j344
54672A35721j637p90p3m90r70m54O9m88j094n02L27o3r28p41O6J61p1N98J674
54653A30315J713R14O10P71K34r72j650j455j128r22m92MJ59K04M35L91j27j68
54635A28836Q69J855J567O95N45Q26M91j48p8M20L39j65k19ol08q84r25n91n56
54616A32563o09k26J60n0l18L0M33K48K82J360K382J817L03l43k7j14q24j124
54598A35943q92r79j283q08K63N61j93p04j87O01P57L57q6k51K1O00R40Q07P13
54579A36180R82J028L86k90l01r2k56k47N60J446J352O51M58Q54J082R12N47j00
54561A45152q41q16J39P06m8j081j054m16k22j44M93Q98N7j110r80J91R67J206
$$ plain form
54691 139153 138108 138185 138040 137411 137337 138129 138924 139343 139882 140499 140450 139729 139166 138985 138632 138041 137622 137065 135721
54672 135721 134084 133294 133221 132731 131761 131307 131376 130888 129794 129292 129619 129556 128628 127887 127953 128114 128043 128641 130315
54653 130315 132028 132942 133552 134323 134557 133585 131935 130480 129352 128430 127938 127942 128101 128305 128740 129131 129004 128836
54635 128836 129705 131560 133127 133822 134367 135193 135684 135536 135458 135878 136217 136052 135833 135827 135519 134635 133710 133119 132563
54616 132563 131954 131728 131888 131838 131520 131550 131983 132231 132513 133873 136255 138072 138375 138032 138005 137891 137067 135943
54598 135943 135051 134072 132789 131981 132244 132805 132612 131908 131721 132322 133079 133436 133350 133099 133120 133720 134660 135467 136180
54579 136180 137162 138190 138576 138286 137985 137893 137637 137390 137950 139396 140748 141399 141857 142711 143793 144705 145252 145152
54561 145152 144311 143495 143634 144340 144292 143211 142157 141741 141519 141375 141868 142766 142823 141713 140733 140924 141891 143097
54543A43097J717K185J716Q77R57J652J635J023R96J304N32j255k338j952j031
54528A51115k90M73J052P00m25j321j687j955j909r79K58N69M5j10L88O61L69
54511A46954j0l87r89j283o84l5n59j650j568j43J124J560J875K248J897P79j33
54494A48996m91q32j121p54jK38J54O85J507J306J48m69j22J5m74m40O16J385
54476A50346P44n92j209o68N60J757K146J423M12K08P17R96Q88J025J347J133
54460A61233L92j16k55n14q04n90j56j92l46K44J125J003n4o41k94ql23o34o57
54441A58413r38j541j725j242o79l89k75n66j384j828r51M78R32N56Q00J815K225
54424A53701J543Q55Q26R29R33J329J945J884J092M77J90m94j530k017j868j802
$$ plain form
54543 143097 144814 146999 148715 149592 150549 152201 153836 154859 155855 157159 157691 156436 154098 152146 151115
54528 151115 150825 151298 152350 153050 152625 151304 149617 147662 145753 144774 145032 145601 145646 145536 145924 146585 146954
54511 146954 146944 146557 145568 144285 143601 143566 143007 141357 139789 139646 140770 142330 144205 146453 148350 149129 148996
54494 148996 148505 147673 146552 145798 145797 146035 146189 146874 148381 149687 149835 149366 149244 149259 148785 148345 148961 150346
54476 150346 151090 150498 149289 148621 149181 150938 153084 154507 154919 155127 155844 156840 157728 158753 160100 161233
54460 161233 161625 161509 161254 160740 159936 159346 159190 158998 158652 158896 160021 161024 160970 160329 160035 160027 159704 159070 158413
54441 158413 157475 155934 154209 152967 152288 151899 151624 151058 149674 147846 146895 147373 148305 148861 149661 151476 153701
54424 153701 155244 156099 156925 157854 158787 160116 162061 163945 165037 165514 165704 165210 163680 161663 159795 157993
54408A57993j654o19Q16J175M23J6L58L77j00J80J453K260J927J602J972J990
54392A70169Q93l08n03m5K63M27N73L48l00q33j054j223j145m63J91p4o36j42
54374A66138J021J182L11O4P35P71j30j55J410K736K451J761K110K886K972K706
54358A88969K736K586J882J529K203L003K853J999J045j78j750k947l397l706
54344A96827m134m029l294k940l329l447k677j748j179m85K66L9j136j568m76
54329A66690O67N69L5K38P52P84O72Q25O74n5n08l22m57j247j397k53P85N54L9
54310A69045L46O56k4p83m86k8p48j932j993j100n70n43k81N2j73m45J41J101
54292A62235J188L82k51k44N9M72R14Q96K88n4N00J253J271Q25N79L22l62r41
$$ plain form
54408 157993 156339 155720 156536 157711 158134 158150 158508 158885 158785 158965 160418 162678 164605 166207 168179 170169
54392 170169 171062 170754 170251 170206 170469 170896 171469 171817 171517 170684 169630 168407 167262 166799 166990 166916 166280 166138
54374 166138 167159 168341 168652 168716 169451 170222 170092 169937 171347 174083 176534 178295 180405 183291 186263 188969
54358 188969 191705 194291 196173 197702 199905 202908 205761 207760 208805 208627 206877 203930 200533 196827
54344 196827 192693 188664 185370 182430 179101 175654 172977 171229 170050 169565 169831 169870 168734 167166 166690
54329 166690 167357 167926 167961 168199 168951 169735 170407 171232 171906 171851 171343 171021 170564 169317 167920 167667 168452 169006 169045
54310 169045 169391 170047 170023 169240 168754 168726 167978 166046 164053 162953 162383 161840 161559 161611 161438 160993 161134 162235
54292 162235 163423 163805 163554 163310 163369 163841 164755 165651 165939 165885 166385 167638 168909 169734 170313 170635 170273 169332
54274A69332q12m13l63k82L39J016J157J153J416J366N83j8N00J535K023K036
54258A80568K028J564L03p34m74M07N64O3j88k31o90j253j160p11p63j142r81
54241A77170k42L33M63L46l6o00p45k63P6k26m23M6L07m81j425j228k74J88J47
54222A73133M07Q12N79j01l83k73k80j30O61J441J189J97m80q11j496k308k313
54205A69844j504p56l36J52O04N13P3o0J48K95M84R15J071M33m42p07o00p80r27
54186A68420l78L89L77k42l90K34R91J396J236J62j542k385j332M89J186O52K41
54169A69504M44O03N08N20L66m59j241p18Q66J971J986J684J432P10m04q83l88
54152A76501J63P8k37k50j19j09r9o7k25m98m69l5M66P85Q65N91m2o80j025j152
$$ plain form
54274 169332 168520 168107 167744 167462 167801 168817 169974 171127 172543 173909 174492 174474 174974 176509 178532 180568
54258 180568 182596 184160 184463 183729 183255 183662 184226 184289 184101 183870 183180 181927 180767 180056 179293 178151 177170
54241 177170 176928 177261 177724 178070 178034 177434 176689 176426 176502 176276 175853 175899 176206 175725 174300 173072 172798 172986 173133
54222 173133 173540 174352 174931 174830 174447 174174 173894 173764 174425 175866 177055 177252 176772 175961 174465 172157 169844
54205 169844 168340 167584 167248 167400 168004 168517 168590 168530 168678 168973 169457 170372 171443 171876 171434 170727 170127 169347 168420
54186 168420 168042 168431 168808 168566 168176 168410 169401 170797 172033 172195 170653 168268 166936 167425 168611 169263 169504
54169 169504 169948 170551 171059 171579 171945 171486 170245 169527 170393 172364 174350 176034 177466 178176 177772 176889 176501
54152 176501 176664 176742 176505 176255 176136 176027 175928 175861 175636 175138 174669 174634 175100 175885 176750 177341 177299 176619 175594 174442
54132A74442r91k04Q74J036j64j445j458n91l7J28N57J147J340J381J827K295
54116A80137K017J245P78O12L44L28R77J511R46j37l81J63L49K6J34Q53J285J037
54098A92224O46M41L25N91J584K730L283L750N227P547R552J0812J1415J0442
54084B60569O717J168l493n875p054q287r252r098p839o003l971k161j011m53
54070B03957j49j39n16p13k25L55J78k85R1J177J866K050K681L880M703M869N095
54053B28875N474N125L823K509J806J334Q27N38K71o67k145l086k959k256j260
54038B38209L04K137L269L497L746M565N426N828O008O169O047N583N102M625
54024C00515L908L197K935K808K190J393J171J127J45j517k297j726j161j660
$$ plain form
54132 174442 173451 173247 174121 175157 174993 173548 172090 171499 171462 171590 172147 173294 174634 176015 177842 180137
54116 180137 182154 183399 184177 184789 185133 185461 186438 187949 188895 188758 188377 188540 188889 188915 189049 189902 191187 192224
54098 192224 192870 193311 193636 194227 195811 198541 201824 205574 210801 218348 227900 238712 250127 260569
54084 260569 267286 268454 264961 259086 252032 243745 234493 225395 217556 211553 207582 205421 204410 203957
54070 203957 203808 203669 203153 202440 202215 202570 202748 202463 202554 203731 205597 207647 210328 214208 218911 223780 228875
54053 228875 234349 239474 243297 245806 247612 248946 249773 250311 250582 249915 247770 244684 241725 239469 238209
54038 238209 238513 240650 243919 247416 251162 255727 261153 266981 272989 279158 285205 290788 295890 300515
54024 300515 304423 307620 310555 313363 315553 316946 318117 319244 319389 317872 315575 313849 312688 311028
54010C11028k619l142l335l590l807m062m857o074o655o049n028m488m281l782
53996B49259k918k071j581j630k091k400k145j758j907k384k461k042j525q32
53982B21514K42R67L90r96j662j153m64k62j53J26J83p4k07j59k77l42J55Q07
53964B18635P08R2J17R17J425J230J137J620K265K931L924M781M541L560L415
53949B51298M711O518Q317J0744J3911J6799J8816K0150J9949J6225Q796N71n326
53936C91479q432r964j0459r766q226o410m367k206o93l66p03q87p99o34k75L67
53920C27659J043J712K649L758M528M957N679O824P714P906P670P276O737O360
53906D02472O419O308N123L150J448J73j220k350k227j373j521k906l911l836
$$ plain form
54010 311028 308409 305267 301932 298342 294535 290473 285616 279542 272887 266838 261810 257322 253041 249259
53996 249259 246341 244270 242689 241059 238968 236568 234423 232665 230758 228374 225913 223871 222346 221514
53982 221514 221756 222723 223113 222117 220455 219302 218838 218576 218423 218549 218732 218658 218451 218292 218015 217673 217828 218635
53964 218635 219343 219435 219552 220469 221894 223124 224261 225881 228146 231077 235001 239782 244323 247883 251298
53949 251298 256009 262527 270844 281588 295499 312298 331114 351264 371213 387438 396234 396805 391479
53936 391479 383047 373083 362624 352858 344632 338222 333855 331649 330956 330590 329887 329000 328201 327567 327292 327659
53920 327659 328702 330414 333063 336821 341349 346306 351985 358809 366523 374429 382099 389375 396112 402472
53906 402472 408891 415199 420322 423472 424920 425093 423873 421523 419296 417923 416402 413496 409585 405749
53892D05749l899m801n460n214n179o174p133o980o488o781p466p630p432p397
53878C17715p219o550n882n564n039m044l447l788m211l901l366l292l321l081
53864B55010l132l727l887k942j763j271r62k70n7j217k808l190k280j216o01
53849B25687l55n95j312j720j173j78M65Q03J075Q07l10j413j471o70J30N30L81
53832B20681n65j845k142j017K10M06K50P72J419J052q9q61r15n66K53J521K391
53815B20955K250J860K146K622K352J699J630J991J972J749K152L063L560L401
53801B53402L146L141L433M252N508O311O082N523N490N562M961M110L884M003
53787C18808L600K872K635K632J836K37j090j641j957k502l191l993m962n753
$$ plain form
53892 405749 401850 397049 391589 386375 381196 375022 367889 360909 354421 347640 340174 332544 325112 317715
53878 317715 310496 303946 298064 292500 287461 283417 279970 276182 271971 268070 264704 261412 258091 255010
53864 255010 251878 248151 244264 241322 239559 238288 237326 237056 236999 235782 232974 229784 227504 226288 225687
53849 225687 225332 224737 223425 221705 220532 220354 220819 221622 222697 223504 223194 221781 220310 219640 219770 220300 220681
53832 220681 220116 218271 216129 215112 215322 215728 215978 216750 218169 219221 219132 218271 217356 216790 217043 218564 220955
53815 220955 223205 225065 227211 229833 232185 233884 235514 237505 239477 241226 243378 246441 250001 253402
53801 253402 256548 259689 263122 267374 272882 279193 285275 290798 296288 301850 306811 310921 314805 318808
53787 318808 322408 325280 327915 330547 332383 332620 331530 329889 327932 325430 322239 318246 313284 307531
53773C07531n959n780n580n148m228l348l151l372l343l126l135l162k702j936
53759B53561j451j366j582k259l227l595k882j910j575j503j008m97o36r47o49
53744B28474k35o32j310r02N56J608J521R33M55k0n27p81q11q50o37J54R79R75
53726B28950L60J87P95J546J986K266K437K271J852J532J361J230J304J660J868
53711B51605J682J618K119K629K460J978J951K275K405K490K910L216K807K264
53697B84409K669L924M905N159N114M845L896K324Q72ol88l31L9J75l22r22q62
53680C15500k43K71M87M89O2p05q94N7J211J322O21J30j65r66j976k160j498r54
53662C10589p80l50L47M98r3o54o31k48K13O40P12K60j38R5M57J39m24j21Q98
$$ plain form
53773 307531 301572 295792 290212 285064 280836 277488 274337 270965 267622 264496 261361 258199 255497 253561
53759 253561 252110 250744 249162 246903 243676 240081 237199 235289 233714 232211 231203 230706 230070 229123 228474
53744 228474 228239 227607 226297 225395 225951 227559 229080 230013 230468 230448 229921 229140 228329 227479 226842 226996 227975 228950
53726 228950 229310 229497 230292 231838 233824 236090 238527 240798 242650 244182 245543 246773 248077 249737 251605
53711 251605 253287 254905 257024 259653 262113 264091 266042 268317 270722 273212 276122 279338 282145 284409
53697 284409 287078 291002 295907 301066 306180 311025 314921 317245 318117 318111 317723 317392 317431 317606 317284 316362 315500
53680 315500 315257 315528 316015 316504 316566 315861 314967 315024 316235 317557 318178 318308 318143 317177 315201 313041 311543 310589
53662 310589 309809 309459 309806 310304 310211 309557 308926 308678 308891 309531 310243 310503 310365 310460 310917 311056 310632 310511 311409
53643C11409J206J28j458k386k224j038P43K151K403J901J724K104K277J764R86
53628C21690O84J315K760M023L876K478J564K209L367L664L538M089M894M882
53614C65033M529N209O769P776P884P941P958P056N461M470M245L548K026Q50
53600D40755P08Q54O60N09O47O12L53N00J103J406J183J016R92N26k54m50l0q3
53582D51007r70j705j616j211r54n96k64p62k096k986k595j653j194j277j519
53567D29609j864k196k096j601j312j415j393j019o96n82l69j60m85j200j480
53552D11741j140r03j019q15N8J052J723K268K658K388J466P21O49Q87J073J366
53536D24173J886K520L348M385N015M732M341N083O676P656P735Q153R476J0728
$$ plain form
53643 311409 312615 312743 311285 308899 306675 305637 306380 308531 310934 312835 314559 316663 318940 320704 321690
53628 321690 322374 323689 326449 330472 334348 336826 338390 340599 343966 347630 351168 355257 360151 365033
53614 365033 369562 374771 381540 389316 397200 405141 413099 420155 425616 430086 434331 437879 439905 440755
53600 440755 441463 442317 442977 443486 444133 444745 445098 445598 446701 448107 449290 450306 451298 451824 451570 451120 451090 451007
53582 451007 450037 448332 446716 445505 444551 443955 443691 442929 440833 437847 435252 433599 432405 431128 429609
53567 429609 427745 425549 423453 421852 420540 419125 417732 416713 416017 415435 415066 414906 414421 413221 411741
53552 411741 410601 409698 408679 407864 407922 408974 410697 412965 415623 418011 419477 420198 420847 421734 422807 424173
53536 424173 426059 428579 431927 436312 441327 446059 450400 455483 462159 469815 477550 485703 495179 505907
53522E05907J1217J1587J2410J3134J3271J3394J4116J5066J5565J5562J5450
53511F56679J5664J6728J8798K1089K2671K3800K5299K6810K7179K6529K6229
53500I07475K6597K6404K5111K3815K3334K2996K2131K1239K0925K0895K0775
53489A161697K0667K0392J9510J8578J8898K0436K1508K1214K0529K0325J9948
53478A383702J8816J7766J7651J7920J7760J7382J7106J6333J4560J2318J0057
53467A561371P198L412k76k817m642o765r216j1425j3336j5103j6339j6621j6181
53454A459260j5512j4970j5118j6528j8711k0360k1121k1925k3029k3218k1817
53443A246951k0074j9528k0085k0684k0749k0036j8186j5461j2875j0757q273
$$ plain form
53522 505907 517124 528711 541121 554255 567526 580920 595036 610102 625667 641229 656679
53511 656679 672343 689071 707869 728958 751629 775429 800728 827538 854717 881246 907475
53500 907475 934072 960476 985587 1009402 1032736 1055732 1077863 1099102 1120027 1140922 1161697
53489 1161697 1182364 1202756 1222266 1240844 1259742 1280178 1301686 1322900 1343429 1363754 1383702
53478 1383702 1402518 1420284 1437935 1455855 1473615 1490997 1508103 1524436 1538996 1551314 1561371
53467 1561371 1568569 1571981 1571705 1568888 1564246 1557481 1548265 1536840 1523504 1508401 1492062 1475441 1459260
53454 1459260 1443748 1428778 1413660 1397132 1378421 1358061 1336940 1315015 1291986 1268768 1246951
53443 1246951 1226877 1207349 1187264 1166580 1145831 1125795 1107609 1092148 1079273 1068516 1060243
53432A060243n248l014k453k512j886q27LJ144L181N111N611N195N480O910Q699
53417A085637J0512J2762J5445J7941J9821K1019K1542K1834K2766K4526K6074
53406A299879K6617K6837K7790K9426L1135L3026L5401L7710L9275M0578M2737
53395A670411M5969M9531N2767N5371N7032N7733N8116N8833N9857O0847O1634
53384B288101O1943O1310N9763N7858N5683N2827M9629M7178M5511M3199L9528
53373B862530L5568L2179K8495K3631J8436J4013R816M813o13n762j1559j9439
53361B992108k8822l7505m4224m9289n3101n5624n7123n8012n8138n7409n6681
53350B436180n6775n6951n5701n2780m9295m6093m3311m1255m0405m0647m1492
$$ plain form
53432 1060243 1054995 1051981 1049528 1047016 1045130 1044303 1044306 1045450 1048631 1053742 1059353 1064548 1070028 1076938 1085637
53417 1085637 1096149 1108911 1124356 1142297 1162118 1183137 1204679 1226513 1249279 1273805 1299879
53406 1299879 1326496 1353333 1381123 1410549 1441684 1474710 1510111 1547821 1587096 1627674 1670411
53395 1670411 1716380 1765911 1818678 1874049 1931081 1988814 2046930 2105763 2165620 2226467 2288101
53384 2288101 2350044 2411354 2471117 2528975 2584658 2637485 2687114 2734292 2779803 2823002 2862530
53373 2862530 2898098 2930277 2958772 2982403 3000839 3014852 3024668 3029481 3028868 3023106 3011547 2992108
53361 2992108 2963286 2925781 2881557 2832268 2779167 2723543 2666420 2608408 2550270 2492861 2436180
53350 2436180 2379405 2322454 2266753 2213973 2164678 2118585 2075274 2034019 1993614 1952967 1911475
53339A911475m2809m4316m4787m3009l9449l5872l3317l1353k9207k6671k3982
53328A516703k1545j9730j8341j6580j4111j1754j0547j0668j1713j3361j5098
53317A353255j5989j5613j4596j3574j2418j1107j0364j0452j0259q663o014l327
53305A220879r77Q77J660J476J830L833O484Q175R010J0207J1921J3391J4661
53292A303427J6481J8859K1174K3402K5845K7975K8978K9062K8981K8608K7300
53281A580092K5315K3513K2016K0410J8862J7721J6359J3790J0102O109K030k197
53269A754122n860q233r982j2290j4980j6992j8376k0179k2605k4903k6922k9175
53257A543625l1316l2186l1575l0640l0342l0576l0921l1192l1166l0725l0172
$$ plain form
53339 1911475 1868666 1824350 1779563 1736554 1697105 1661233 1627916 1596563 1567356 1540685 1516703
53328 1516703 1495158 1475428 1457087 1440507 1426396 1414642 1404095 1393427 1381714 1368353 1353255
53317 1353255 1337266 1321653 1307057 1293483 1281065 1269958 1259594 1249142 1238883 1230220 1224206 1220879
53305 1220879 1219902 1220779 1222439 1223915 1225745 1229578 1236062 1244237 1253247 1263454 1275375 1288766 1303427
53292 1303427 1319908 1338767 1359941 1383343 1409188 1437163 1466141 1495203 1524184 1552792 1580092
53281 1580092 1605407 1628920 1650936 1671346 1690208 1707929 1724288 1738078 1748180 1754289 1756319 1754122
53269 1754122 1748262 1740029 1730047 1717757 1702777 1685785 1667409 1647230 1624625 1599722 1572800 1543625
53257 1543625 1512309 1480123 1448548 1417908 1387566 1356990 1326069 1294877 1263711 1232986 1202814
53246A202814k9644k8572k6665k4872k4264k4424k4268k3830k3866k4151k3792
53235I24466k2937k2559k2667k2216k0803j9071j7443j5733j3977j2487j1149
53224G23424r680q361p566o980o373o437p625q956r454r981j1862j4387j5690
53211F00072j5589j5476j5729j5454j4593j4078j3739j2287r670p445o395n704
53199D53913m917m797n734o965p912q754r298q855p652o849o781o634o152o064
53185C56549o451o383n564m836m613m313l771l606l803l470k462j775j815j803
53171C01884j303q81q89j000j271k108k944k665j663j564k492k641j215J94J96
53156B79638l64j29O11Q06L52k90j003j597j465n82J04rn02r90j617k112j766
$$ plain form
53246 1202814 1173170 1144598 1117933 1093061 1068797 1044373 1020105 996275 972409 948258 924466
53235 924466 901529 878970 856303 834087 813284 794213 776770 761037 747060 734573 723424
53224 723424 713744 705383 697817 690837 684464 678027 670402 661446 651992 642011 630149 615762 600072
53211 600072 584483 569007 553278 537824 523231 509153 495414 483127 473457 466012 459617 453913
53199 453913 448996 444199 438465 431500 423588 414834 405536 396681 389029 382180 375399 368765 362613 356549
53185 356549 350098 343715 338151 333315 328702 324389 320618 317012 313209 309739 307277 305502 303687 301884
53171 301884 300581 299700 298811 297811 296540 294432 291488 288823 287160 285596 283104 280463 279248 279442 279638
53156 279638 279274 279145 279756 280562 280914 280624 279621 278024 276559 275977 276081 276072 275570 274580 272963 270851 269085
53139B69085q73o26j039p07O44J304L18p40j68J301J886J440J137J452J962K428
53123B78804K791K703K072J393Q34j04j271j418o4J372J429N56Oj08l62n32j23
53106B87978L12k02j469k413k608k489k310j925j415j131j137j219j197r17k71
53091B67587M72Q53R18J064J123N26m60q37n15n31j164j234m7J299J524Q60J71
53074B71609m55j103j180l53M71K90n99j310j682j888j603o69J08l7o70r48r30
53057B59051j098j238q75k48R5K18M13M67J64n9K42P43R56R84J011P66K32N0M63
53038B62337O58N6o36n96j95j33j42K91P11M35j68l06q8m5PM64Q11L35n18o54
53018B62624J02J053J818K378K351J427K79j13J68L15J93L16N77K52o94j361j119
$$ plain form
53139 269085 268212 267586 266547 265840 266484 267788 268106 267366 267198 268499 270385 271825 272962 274414 276376 278804
53123 278804 281595 284298 286370 287763 288597 288493 287222 285804 285740 287112 288541 289097 289103 288995 288633 288101 287978
53106 287978 288290 288088 286619 284206 281598 279109 276799 274874 273459 272328 271191 269972 268775 267858 267587
53091 267587 268059 268912 269830 270894 272017 272543 272083 271246 270731 270200 269036 267802 267755 269054 270578 271438 271609
53074 271609 271154 270051 268871 268518 268989 269279 268680 267370 265688 263800 262197 261528 261636 261599 260929 259981 259051
53057 259051 257953 256715 255840 255592 255687 255905 256318 256785 256949 256890 257132 257875 258831 259815 260826 261592 261824 261874 262337
53038 262337 262995 263051 262415 261819 261624 261491 261349 261640 262351 262786 262618 262312 262224 262179 262186 262650 263461 263796 263278 262624
53018 262624 262726 263779 265597 267975 270326 271753 272032 271919 272087 272402 272595 272911 273488 273740 273046 271685 270566
53001B70566l65R8j03p79j352j332q46m91l99l7P16J066M80l37m04K09P65R94
52983B68449J041Q91O06O52J221J763J833J760J791J415L64n36n19q0OM6O52J312
52965B82667J162N62N31R98J081P50P94J241J236M64m58j113j678k134k155j864
52949B82084j756j826j587j025o02m02q6L06L27l1k61r3K84O88R33O04m50j496
52931B75611j617r04k73k56p06j346j836j533k06J204J450N47l88p96j108j592
52915B66251j772j280m70J23L72L84K89L90R22J540J455L51j137j977j630m53
52899B63358N77P33K31j48j02m9j87p4M89Q81N51l5j0P93J769K232J750L82j037
52880B72104j456q63k95k42K5R42J628J194J51m50m75k32M85J729K566K229J532
$$ plain form
53001 270566 270201 270299 270196 269417 268065 266733 265887 265396 264997 264960 265676 266742 267222 266885 266481 266690 267455 268449
52983 268449 269490 270381 270987 271639 272860 274623 276456 278216 280007 281422 281786 281250 280731 280651 280657 280703 281355 282667
52965 282667 283829 284391 284922 285920 287001 287751 288545 289786 291022 291486 291028 289915 288237 286103 283948 282084
52949 282084 280328 278502 276915 275890 275288 274886 274800 275106 275433 275402 275141 275048 275332 276020 276953 277557 277107 275611
52931 275611 273994 273090 272817 272561 271855 270509 268673 267140 266934 268138 269588 270135 269747 268951 267843 266251
52915 266251 264479 263199 262729 262852 263224 263608 263897 264287 265209 266749 268204 268555 267418 265441 263811 263358
52899 263358 263935 264668 264899 264751 264649 264600 264413 264339 264828 265709 266260 266225 266215 267008 268777 271009 272759 273141 272104
52880 272104 270648 269785 269490 269248 269273 270215 271843 273037 273188 272738 272263 272031 272516 274245 276811 279040 280572
52863B80572J823K959L572K944J482k23j652k112j441o76q82j726k292k628l270
52848B76450l777l368k554k540l218l345k601j950j896j928j736j524j080J7J148
52833B46098J151K20j89L95Q67O06M87J103J507P08o95j401j123n20j00P9M0n8
52815B49175J23O89J356J922K418K709K601K441K830L512L307J613p33k498l374
52800B68091l811m076m046l630k910k002j065l54n1n8n1K41P30R37N88J44K92
52783B48969Q75R89M28J21O34J147P66L0R7R58J563J360O59j69r30j277j068q03
52765B54349q68p74j16L36l15j422j570p08q4j99k87P3L47K49K35M67M86J99J23
52746B50521L16J98j67K72J991L883M413L267J460L03M75J607K525K341J345M76
$$ plain form
52863 280572 282395 285354 288926 291870 293352 293129 291477 289365 287924 287248 286366 284640 282348 279720 276450
52848 276450 272673 269305 266751 264211 260993 257648 255047 253097 251201 249273 247537 246013 244933 244950 246098
52833 246098 247249 247469 247280 247675 248542 249148 249635 250738 252245 252953 252258 250857 249734 249214 249114 249193 249233 249175
52815 249175 249298 249987 251343 253265 255683 258392 260993 263434 266264 269776 273083 274696 273963 271465 268091
52800 268091 264280 260204 256158 252528 249618 247616 246551 246197 246146 246088 246037 246278 247008 247945 248533 248677 248969
52783 248969 249844 250833 251261 251382 252016 253163 253929 253959 254056 255014 256577 257937 258596 258427 257497 256220 255152 254349
52765 254349 253481 252707 252591 252927 252612 251190 249620 248912 248828 248629 248342 248415 248762 249011 249246 249713 250199 250398 250521
52746 250521 250837 251035 250868 251140 253131 257014 261427 264694 266154 266457 266932 268539 271064 273405 274750 275226
52730B75226K10M45J072J902K426K399K284K296J592m63k795l705l142k494k401
52715B74852k269j800j430j165n90o6m62j454j663q11j41k98l95K31Q22O11J24
52698B64096J98P16J107J216J043M67k75o19n59n85n84J07J266J684J009L03K57
52681B70847J67n19j008n28K76L98Rj74k27o18j091r89l56J92L90L74K25L7J18
52662B67523N78J041J222J344J634J852J764J586J585J703J887K269K700K611
52648B91299J729M45p51j695k250k209j738j325j058n94L8L46K09J02K46K64n5
52631B83003l66l40N1R13K338L865M758M840M213K461o10l637m657l605k443k400
52615B88384k672k351j915j884j587n05M19J20q71j225o34K35R09J237J052N99
$$ plain form
52730 275226 275436 275881 276953 278855 281281 283680 285964 288260 289852 289389 286594 282889 279747 277253 274852
52715 274852 272583 270783 269353 268188 267598 267532 267070 265616 263953 263142 263001 262703 262308 262539 263361 263972 264096
52698 264096 264294 265010 266117 267333 268376 268843 268568 267949 267390 266805 266221 266328 267594 269278 270287 270590 270847
52681 270847 271014 270495 269487 268959 269235 269633 269642 269468 269241 268623 267532 266543 266187 266379 266769 267143 267368 267405 267523
52662 267523 268101 269142 270364 271708 273342 275194 276958 278544 280129 281832 283719 285988 288688 291299
52648 291299 293028 293473 292722 291027 288777 286568 284830 283505 282447 281853 281891 282237 282446 282548 282794 283058 283003
52631 283003 282637 282297 282348 283261 285599 289464 294222 299062 303275 305736 305126 301489 296832 293227 290784 288384
52615 288384 285712 283361 281446 279562 277975 277470 277889 278009 277138 275913 275279 275514 276423 277660 278712 279311
52599B79311O70J453J883J085k50q93p82o88p59n11J19P25J244J815K102J659
52583B88183Q30M72P86J091Q52L11kj6j67p90j552j660q37J98O25N24M53L76o7
52564B89610n25l18K63K26m88r30q11q42j163r52j25J14q01j708j449n05J20M02
52546B80118P08P02J4q46j268j463j644j204K38J806K381K010J370O45m6K2J232
52529B84775K547K629J545M56K0K7J59K03lj54M20J590K122J384M10L36O81L60
52511B99507l51l09O06J487J906K224K557K559K125J385K60j115j977j886j657
52496C07321k261l253l406k597j830j556j221n05J51L76L89M43M55L54K12M2j22
52479B92992q6J88M11M64O41R41P92M2m68j20M30L37L6N04J524K020J793J712
$$ plain form
52599 279311 279981 281434 283317 284402 284152 283259 282477 281789 281030 280519 280638 281363 282607 284422 286524 288183
52583 288183 289013 289485 290271 291362 292214 292525 292523 292507 292340 291550 289998 288338 287501 287699 288324 288848 289301 289677 289610
52564 289610 289085 288767 289030 289256 288768 287838 287027 286185 285022 284070 283945 284059 283258 281550 280101 279596 279716 280118
52546 280118 280826 281528 281542 280696 279428 277965 276321 275117 275355 277161 279542 281552 282922 283567 283521 283543 284775
52529 284775 287322 289951 291496 291952 291972 291999 292158 292361 292358 292204 292624 294214 296336 297720 298130 298466 299147 299507
52511 299507 299156 298847 299453 300940 302846 305070 307627 310186 312311 313696 313956 312841 310864 308978 307321
52496 307321 305060 301807 298401 295804 293974 292418 291197 290692 290843 291219 291608 292051 292506 292860 293072 293114 292992
52479 292992 292906 293094 293505 293969 294610 295551 296343 296385 295917 295797 296227 296564 296600 297104 298628 300648 302441 304153
52461C04153K237K919L368L708L890L483K321P01j078k769l834l826l177k873
52447C09223l307l893l930l301k354j541j162j127j018o00j16J12P7j70o87j304
52431B84902j549j230o38lO76J074O58k30l65P59K169K777K577J963Q83m19q86
52414B93118P5J593K517K853L130L299L303L865N420P143Q233R387J1549J3938
52400C69423J4766J3386J0349N962L98n136r057j1088j2003j1991j0681q536o639
52387C39153n199l658k179j536j552j165j93M18L25L87J122J899K032J714J414
52372C32982J290J480K168L076L709M163M836N359M755K909R31j11j79P7Mo82
52356C66767j516j460j97J134J335Q17P90J272J304Q49Q41J355J362O67M97J588
$$ plain form
52461 304153 306390 309309 312677 316385 320275 323758 326079 326780 325702 322933 319099 315273 312096 309223
52447 309223 305916 302023 298093 294792 292438 290897 289735 288608 287590 286990 286874 286986 287063 286893 286206 284902
52431 284902 283353 282123 281485 281482 282158 283232 283890 283660 283295 284054 286223 289000 291577 293540 294423 294004 293118
52414 293118 293193 294786 297303 300156 303286 306585 309888 313753 319173 326316 334549 343936 355485 369423
52400 369423 384189 397575 407924 413886 414284 409148 400091 389003 377000 365009 354328 345792 339153
52387 339153 333954 330296 328117 326581 325029 323864 323671 324089 324414 324801 325923 327822 329854 331568 332982
52372 332982 334272 335752 337920 340996 344705 348868 353704 359063 363818 366727 367658 367547 367368 367445 367449 366767
52356 366767 365251 363791 363594 364728 366063 366880 367670 368942 370246 371095 371936 373291 374653 375320 375817 377405
52340C77405L000L606L599L731L986L913L609L640M245N192O161O961P641Q433
52326D45122R376J0181J0804J1859J3769J5837J6992J7212J7278J7322J6752J5692
52314F18196J5212J5830J6743J7105J7176J7697J8729J9673K0093K0052J9891
52303H16397J9908K0131K0397K0612K0772K0582J9563J7795J5951J4311J2418
52292A018837J0205Q511P673O544M003O75k037l942n698p073p223o426n934o114
52278A012001o144n622n061m648l805k312p58L84J225J977K863M352O481Q181
52264A009114Q412P760P685Q451R145R575J0507J1981J3070J3548J4378J6053
52252A139679J7751J8518J8217J7060J5305J3579J2330J0895Q333N146K767J352
$$ plain form
52340 377405 380405 384011 387610 391341 395327 399240 402849 406489 410734 415926 422087 429048 436689 445122
52326 445122 454498 464679 475483 487342 501111 516948 533940 551152 568430 585752 602504 618196
52314 618196 633408 649238 665981 683086 700262 717959 736688 756361 776454 796506 816397
52303 816397 836305 856436 876833 897445 918217 938799 958362 976157 992108 1006419 1018837
52292 1018837 1029042 1037553 1045226 1051770 1055773 1056448 1054411 1050469 1044771 1037698 1030475 1024049 1018115 1012001
52278 1012001 1005857 1000235 995174 990526 986721 984409 983651 984035 985260 987237 990100 994452 1000933 1009114
52264 1009114 1017526 1025286 1032971 1041422 1050567 1060142 1070649 1082630 1095700 1109248 1123626 1139679
52252 1139679 1157430 1175948 1194165 1211225 1226530 1240109 1252439 1263334 1271667 1276813 1279580 1280932
52240A280932k69k396l935m469n049o286p358p671p962q880r845j0293j0678j1353
52226A184488j1626j0946r926r289q792q110p762q134q511q050o921n654m155
52213A076612k289p15j00mN65J822L224M388N316N906N866N068L812K829K904
52198A115204M094N439O047O173O552P087P196P137P644Q308P849O170M577L684
52184A203161K487J47k665m856o274p289q006q454q702q507p664o877p048p674
52170A121779p343o001n134n306n220l932k306j353o87L46J382J920K276K609
52156A093030K274J106J90K20M01j0k05P81K278K986K922L028L457L590L250K756
52140A122054K153J277K18r09k184l305l542k797j947j444n58J317L537N233O632
$$ plain form
52240 1280932 1280663 1278267 1274332 1269863 1264814 1258528 1251170 1243499 1235537 1226657 1216812 1206519 1195841 1184488
52226 1184488 1172862 1161916 1151990 1142701 1133909 1125799 1118037 1109903 1101392 1093342 1086421 1080767 1076612
52213 1076612 1074323 1073608 1073508 1073504 1074069 1075891 1079115 1083503 1088819 1094725 1100591 1105659 1109471 1112300 1115204
52198 1115204 1119298 1124737 1130784 1136957 1143509 1150596 1157792 1164929 1172573 1180881 1188730 1194900 1199477 1203161
52184 1203161 1205648 1205795 1203130 1198274 1192000 1184711 1176705 1168251 1159549 1151042 1143378 1136501 1129453 1121779
52170 1121779 1114436 1108435 1103301 1097995 1092775 1088843 1086537 1085184 1084497 1084843 1086225 1088145 1090421 1093030
52156 1093030 1095304 1096410 1096600 1096820 1097221 1097211 1097006 1097787 1100065 1103051 1105973 1109001 1112458 1116048 1119298 1122054
52140 1122054 1124207 1125484 1125702 1124793 1122609 1119304 1115762 1112965 1111018 1109574 1109016 1110333 1113870 1119103 1125735
52125A125735Q492J1003J3952J7140K0016K1765K2513K3446K5083K6428K6591
52114A342164K6029K5381K4362K2791K1528K1173K0902J9823J8499J7924J7915
52103A578491J7755J7485J7347J6844J5619J4464J4041J3424J1227P621L903O16
52091A728837k687o295j0009j3523j6265j7518j7471j7333j7585j7277j5897j4632
52079A562345j4431j4201j2537j0126q569p737o301m186k496j387M6J977L665
$$ plain form
52125 1125735 1134227 1145230 1159182 1176322 1196338 1218103 1240616 1264062 1289145 1315573 1342164
52114 1342164 1368193 1393574 1417936 1440727 1462255 1483428 1504330 1524153 1542652 1560576 1578491
52103 1578491 1596246 1613731 1631078 1647922 1663541 1678005 1692046 1705470 1716697 1724318 1728221 1728837
52091 1728837 1726150 1719855 1709846 1696323 1680058 1662540 1645069 1627736 1610151 1592874 1576977 1562345
52079 1562345 1547914 1533713 1521176 1511050 1502481 1494744 1488443 1484257 1481761 1480374 1480420 1482397 1486062
$$ [...]
##END NTUPLES=NMR SPECTRUM
##END=
